{
  "location": {
    "front": -10.125,
    "left": -10.125
  },
  "absoluteEncoderOffset": 112.5,
  "drive": {
    "type": "sparkmax",
    "id": 19,
    "canbus": null
  },
  "inverted": {
    "drive": false,
    "angle": false
  },
  "angle": {
    "type": "sparkmax",
    "id": 18,
    "canbus": null
  },
  "encoder": {
    "type": "sparkmax_analog",
    "id": 18,
    "canbus": null
  },
  "absoluteEncoderInverted": false
}