{
  "file_generated_by": "FlutterFire CLI",
  "purpose": "FirebaseAppID & ProjectID for this Firebase app in this directory",
  "GOOGLE_APP_ID": "1:187732465645:ios:f7de71fcb753bced8b79e4",
  "FIREBASE_PROJECT_ID": "tp-flutter-firebase-post-a58dd",
  "GCM_SENDER_ID": "187732465645"
}