{
  "actionMatch": "all",
  "actions": [
    {
      "id": "sentry.integrations.slack.notify_action.SlackNotifyServiceAction",
      "workspace": "1",
      "channel": "#sentry-critical"
    }
  ],
  "conditions": [
    {
      "id": "sentry.rules.conditions.event_frequency.EventFrequencyCondition",
      "interval": "1d",
      "value": "100"
    }
  ],
  "name": "prod-critical",
  "frequency": "1440",
  "environment": "production"
}