[{"id":1,"name":"Namfix","flag":"flag{Veribet}","points":340},
{"id":2,"name":"Andalax","flag":"flag{Lotlux}","points":50},
{"id":3,"name":"Namfix","flag":"flag{Sonair}","points":410},
{"id":4,"name":"Ronstring","flag":"flag{Andalax}","points":320},
{"id":5,"name":"Fintone","flag":"flag{Wrapsafe}","points":380},
{"id":6,"name":"Vagram","flag":"flag{Viva}","points":290},
{"id":7,"name":"Span","flag":"flag{Overhold}","points":270},
{"id":8,"name":"Bigtax","flag":"flag{Transcof}","points":10},
{"id":9,"name":"Solarbreeze","flag":"flag{Bamity}","points":80},
{"id":10,"name":"Quo Lux","flag":"flag{Cookley}","points":430},
{"id":11,"name":"Zoolab","flag":"flag{Bamity}","points":450},
{"id":12,"name":"Redhold","flag":"flag{Mat Lam Tam}","points":110},
{"id":13,"name":"Tempsoft","flag":"flag{Voyatouch}","points":430},
{"id":14,"name":"Job","flag":"flag{Rank}","points":130},
{"id":15,"name":"Bytecard","flag":"flag{Veribet}","points":390},
{"id":16,"name":"Fintone","flag":"flag{Zathin}","points":390},
{"id":17,"name":"Rank","flag":"flag{Zaam-Dox}","points":160},
{"id":18,"name":"Stronghold","flag":"flag{Zoolab}","points":220},
{"id":19,"name":"Zontrax","flag":"flag{Subin}","points":280},
{"id":20,"name":"Zaam-Dox","flag":"flag{Tin}","points":60},
{"id":21,"name":"Zathin","flag":"flag{Kanlam}","points":270},
{"id":22,"name":"Solarbreeze","flag":"flag{Home Ing}","points":230},
{"id":23,"name":"Subin","flag":"flag{Tampflex}","points":420},
{"id":24,"name":"Mat Lam Tam","flag":"flag{Alpha}","points":150},
{"id":25,"name":"Trippledex","flag":"flag{Home Ing}","points":70},
{"id":26,"name":"Ronstring","flag":"flag{Otcom}","points":350},
{"id":27,"name":"Alpha","flag":"flag{Fixflex}","points":310},
{"id":28,"name":"Tin","flag":"flag{Zoolab}","points":360},
{"id":29,"name":"Fintone","flag":"flag{Tempsoft}","points":40},
{"id":30,"name":"Tres-Zap","flag":"flag{Tampflex}","points":350},
{"id":31,"name":"Bamity","flag":"flag{Opela}","points":230},
{"id":32,"name":"Cardguard","flag":"flag{Daltfresh}","points":50},
{"id":33,"name":"Duobam","flag":"flag{Mat Lam Tam}","points":170},
{"id":34,"name":"Domainer","flag":"flag{Ventosanzap}","points":460},
{"id":35,"name":"Transcof","flag":"flag{Rank}","points":120},
{"id":36,"name":"Holdlamis","flag":"flag{Hatity}","points":280},
{"id":37,"name":"Overhold","flag":"flag{Job}","points":10},
{"id":38,"name":"Lotlux","flag":"flag{Cardguard}","points":190},
{"id":39,"name":"Domainer","flag":"flag{Subin}","points":440},
{"id":40,"name":"Sub-Ex","flag":"flag{Fintone}","points":290},
{"id":41,"name":"Temp","flag":"flag{Flowdesk}","points":160},
{"id":42,"name":"Asoka","flag":"flag{Bitwolf}","points":240},
{"id":43,"name":"Tresom","flag":"flag{Sonsing}","points":30},
{"id":44,"name":"Treeflex","flag":"flag{Vagram}","points":160},
{"id":45,"name":"Biodex","flag":"flag{Tampflex}","points":500},
{"id":46,"name":"Kanlam","flag":"flag{Tres-Zap}","points":380},
{"id":47,"name":"Latlux","flag":"flag{Asoka}","points":190},
{"id":48,"name":"Matsoft","flag":"flag{Mat Lam Tam}","points":160},
{"id":49,"name":"Cookley","flag":"flag{Latlux}","points":80},
{"id":50,"name":"Alphazap","flag":"flag{Tin}","points":170},
{"id":51,"name":"Sonsing","flag":"flag{Lotstring}","points":310},
{"id":52,"name":"Gembucket","flag":"flag{Cookley}","points":250},
{"id":53,"name":"Stringtough","flag":"flag{Aerified}","points":90},
{"id":54,"name":"Tres-Zap","flag":"flag{Cookley}","points":400},
{"id":55,"name":"Stronghold","flag":"flag{Flowdesk}","points":500},
{"id":56,"name":"Redhold","flag":"flag{Pannier}","points":170},
{"id":57,"name":"Greenlam","flag":"flag{Namfix}","points":140},
{"id":58,"name":"Vagram","flag":"flag{Sonair}","points":120},
{"id":59,"name":"Cardify","flag":"flag{Andalax}","points":140},
{"id":60,"name":"Bamity","flag":"flag{Bamity}","points":220},
{"id":61,"name":"Namfix","flag":"flag{Sonair}","points":60},
{"id":62,"name":"Zoolab","flag":"flag{Trippledex}","points":400},
{"id":63,"name":"Temp","flag":"flag{Mat Lam Tam}","points":60},
{"id":64,"name":"Regrant","flag":"flag{Zaam-Dox}","points":90},
{"id":65,"name":"Transcof","flag":"flag{Sub-Ex}","points":310},
{"id":66,"name":"Flowdesk","flag":"flag{Tresom}","points":170},
{"id":67,"name":"Ventosanzap","flag":"flag{Prodder}","points":260},
{"id":68,"name":"Kanlam","flag":"flag{Stronghold}","points":450},
{"id":69,"name":"Alphazap","flag":"flag{Ventosanzap}","points":360},
{"id":70,"name":"Opela","flag":"flag{Voltsillam}","points":400},
{"id":71,"name":"Trippledex","flag":"flag{Zoolab}","points":290},
{"id":72,"name":"Daltfresh","flag":"flag{Sub-Ex}","points":150},
{"id":73,"name":"Temp","flag":"flag{Span}","points":160},
{"id":74,"name":"Zontrax","flag":"flag{Greenlam}","points":260},
{"id":75,"name":"Hatity","flag":"flag{Bamity}","points":110},
{"id":76,"name":"Span","flag":"flag{Sub-Ex}","points":320},
{"id":77,"name":"Daltfresh","flag":"flag{Wrapsafe}","points":400},
{"id":78,"name":"It","flag":"flag{Fix San}","points":370},
{"id":79,"name":"Cardguard","flag":"flag{Zaam-Dox}","points":110},
{"id":80,"name":"Asoka","flag":"flag{It}","points":340},
{"id":81,"name":"Zontrax","flag":"flag{Keylex}","points":320},
{"id":82,"name":"Zathin","flag":"flag{Flowdesk}","points":330},
{"id":83,"name":"Alpha","flag":"flag{Zaam-Dox}","points":270},
{"id":84,"name":"Daltfresh","flag":"flag{Home Ing}","points":360},
{"id":85,"name":"Sub-Ex","flag":"flag{Hatity}","points":240},
{"id":86,"name":"Zathin","flag":"flag{Flowdesk}","points":50},
{"id":87,"name":"Y-find","flag":"flag{Matsoft}","points":410},
{"id":88,"name":"Duobam","flag":"flag{Biodex}","points":410},
{"id":89,"name":"Tresom","flag":"flag{Tresom}","points":50},
{"id":90,"name":"Opela","flag":"flag{Prodder}","points":320},
{"id":91,"name":"Gembucket","flag":"flag{Veribet}","points":330},
{"id":92,"name":"Zaam-Dox","flag":"flag{Temp}","points":430},
{"id":93,"name":"Trippledex","flag":"flag{Otcom}","points":170},
{"id":94,"name":"Ventosanzap","flag":"flag{Viva}","points":80},
{"id":95,"name":"Ventosanzap","flag":"flag{Stringtough}","points":270},
{"id":96,"name":"Rank","flag":"flag{Tresom}","points":230},
{"id":97,"name":"Stronghold","flag":"flag{Domainer}","points":110},
{"id":98,"name":"Bigtax","flag":"flag{Sub-Ex}","points":130},
{"id":99,"name":"Keylex","flag":"flag{Prodder}","points":180},
{"id":100,"name":"Latlux","flag":"flag{Domainer}","points":120},
{"id":101,"name":"Fixflex","flag":"flag{Viva}","points":10},
{"id":102,"name":"Job","flag":"flag{Stim}","points":70},
{"id":103,"name":"Veribet","flag":"flag{Toughjoyfax}","points":350},
{"id":104,"name":"Quo Lux","flag":"flag{Voltsillam}","points":310},
{"id":105,"name":"Sonsing","flag":"flag{Tempsoft}","points":400},
{"id":106,"name":"Bitchip","flag":"flag{Trippledex}","points":160},
{"id":107,"name":"Matsoft","flag":"flag{Cardguard}","points":10},
{"id":108,"name":"Sonsing","flag":"flag{Tempsoft}","points":120},
{"id":109,"name":"Keylex","flag":"flag{Bigtax}","points":380},
{"id":110,"name":"Tres-Zap","flag":"flag{Otcom}","points":30},
{"id":111,"name":"Sub-Ex","flag":"flag{Fix San}","points":470},
{"id":112,"name":"Keylex","flag":"flag{Voltsillam}","points":120},
{"id":113,"name":"Ronstring","flag":"flag{Fix San}","points":490},
{"id":114,"name":"Bigtax","flag":"flag{Span}","points":240},
{"id":115,"name":"Cardguard","flag":"flag{Namfix}","points":400},
{"id":116,"name":"Span","flag":"flag{Tin}","points":20},
{"id":117,"name":"Tin","flag":"flag{Fintone}","points":50},
{"id":118,"name":"Ventosanzap","flag":"flag{Fixflex}","points":280},
{"id":119,"name":"Hatity","flag":"flag{Job}","points":350},
{"id":120,"name":"Opela","flag":"flag{Stim}","points":50},
{"id":121,"name":"Gembucket","flag":"flag{Transcof}","points":490},
{"id":122,"name":"Fixflex","flag":"flag{Lotlux}","points":230},
{"id":123,"name":"Wrapsafe","flag":"flag{Flexidy}","points":440},
{"id":124,"name":"Quo Lux","flag":"flag{Fixflex}","points":120},
{"id":125,"name":"Toughjoyfax","flag":"flag{Lotstring}","points":410},
{"id":126,"name":"Pannier","flag":"flag{Veribet}","points":370},
{"id":127,"name":"Konklux","flag":"flag{Tin}","points":120},
{"id":128,"name":"Y-Solowarm","flag":"flag{Fixflex}","points":320},
{"id":129,"name":"Alpha","flag":"flag{Lotstring}","points":330},
{"id":130,"name":"Namfix","flag":"flag{Temp}","points":220},
{"id":131,"name":"Voltsillam","flag":"flag{Zoolab}","points":490},
{"id":132,"name":"Tempsoft","flag":"flag{Regrant}","points":280},
{"id":133,"name":"Bitwolf","flag":"flag{Ronstring}","points":90},
{"id":134,"name":"Span","flag":"flag{Y-Solowarm}","points":500},
{"id":135,"name":"Subin","flag":"flag{Veribet}","points":100},
{"id":136,"name":"Solarbreeze","flag":"flag{Stringtough}","points":230},
{"id":137,"name":"Bitchip","flag":"flag{Kanlam}","points":390},
{"id":138,"name":"Vagram","flag":"flag{Ventosanzap}","points":480},
{"id":139,"name":"Cardify","flag":"flag{Viva}","points":170},
{"id":140,"name":"Hatity","flag":"flag{Toughjoyfax}","points":450},
{"id":141,"name":"Bitwolf","flag":"flag{Greenlam}","points":190},
{"id":142,"name":"Bytecard","flag":"flag{Lotstring}","points":440},
{"id":143,"name":"Voyatouch","flag":"flag{Daltfresh}","points":340},
{"id":144,"name":"Sub-Ex","flag":"flag{Trippledex}","points":10},
{"id":145,"name":"Konklab","flag":"flag{Prodder}","points":290},
{"id":146,"name":"It","flag":"flag{Gembucket}","points":90},
{"id":147,"name":"Greenlam","flag":"flag{Bytecard}","points":70},
{"id":148,"name":"Hatity","flag":"flag{Bitchip}","points":130},
{"id":149,"name":"Tempsoft","flag":"flag{Duobam}","points":80},
{"id":150,"name":"Sonair","flag":"flag{It}","points":130},
{"id":151,"name":"Stringtough","flag":"flag{Zamit}","points":110},
{"id":152,"name":"Vagram","flag":"flag{Ventosanzap}","points":420},
{"id":153,"name":"Cardify","flag":"flag{Alphazap}","points":80},
{"id":154,"name":"Latlux","flag":"flag{Regrant}","points":40},
{"id":155,"name":"Y-find","flag":"flag{It}","points":320},
{"id":156,"name":"Span","flag":"flag{Overhold}","points":470},
{"id":157,"name":"Ventosanzap","flag":"flag{Bitwolf}","points":320},
{"id":158,"name":"Voyatouch","flag":"flag{Rank}","points":120},
{"id":159,"name":"Bamity","flag":"flag{Duobam}","points":480},
{"id":160,"name":"Fix San","flag":"flag{Vagram}","points":300},
{"id":161,"name":"Bigtax","flag":"flag{Bigtax}","points":440},
{"id":162,"name":"Asoka","flag":"flag{Y-find}","points":320},
{"id":163,"name":"Tempsoft","flag":"flag{Hatity}","points":80},
{"id":164,"name":"Zamit","flag":"flag{Tresom}","points":380},
{"id":165,"name":"Wrapsafe","flag":"flag{Cookley}","points":490},
{"id":166,"name":"Stronghold","flag":"flag{Y-find}","points":360},
{"id":167,"name":"Wrapsafe","flag":"flag{Treeflex}","points":80},
{"id":168,"name":"Overhold","flag":"flag{Tampflex}","points":50},
{"id":169,"name":"Wrapsafe","flag":"flag{Flexidy}","points":190},
{"id":170,"name":"Cookley","flag":"flag{Trippledex}","points":340},
{"id":171,"name":"Y-find","flag":"flag{Stronghold}","points":400},
{"id":172,"name":"Fixflex","flag":"flag{Flexidy}","points":200},
{"id":173,"name":"Wrapsafe","flag":"flag{Greenlam}","points":390},
{"id":174,"name":"Wrapsafe","flag":"flag{Stronghold}","points":210},
{"id":175,"name":"Tempsoft","flag":"flag{Sonsing}","points":70},
{"id":176,"name":"Fixflex","flag":"flag{Quo Lux}","points":70},
{"id":177,"name":"Treeflex","flag":"flag{Opela}","points":340},
{"id":178,"name":"Fintone","flag":"flag{Overhold}","points":60},
{"id":179,"name":"Voltsillam","flag":"flag{Cookley}","points":480},
{"id":180,"name":"Bitwolf","flag":"flag{Wrapsafe}","points":270},
{"id":181,"name":"Flexidy","flag":"flag{Bytecard}","points":10},
{"id":182,"name":"Trippledex","flag":"flag{Fixflex}","points":80},
{"id":183,"name":"Toughjoyfax","flag":"flag{Gembucket}","points":10},
{"id":184,"name":"Solarbreeze","flag":"flag{Cardguard}","points":90},
{"id":185,"name":"Transcof","flag":"flag{Zontrax}","points":320},
{"id":186,"name":"Fintone","flag":"flag{Latlux}","points":400},
{"id":187,"name":"Biodex","flag":"flag{Domainer}","points":440},
{"id":188,"name":"Fintone","flag":"flag{Asoka}","points":230},
{"id":189,"name":"Daltfresh","flag":"flag{Zontrax}","points":20},
{"id":190,"name":"Fix San","flag":"flag{Asoka}","points":400},
{"id":191,"name":"Kanlam","flag":"flag{Zamit}","points":440},
{"id":192,"name":"Span","flag":"flag{Trippledex}","points":460},
{"id":193,"name":"Sub-Ex","flag":"flag{Temp}","points":120},
{"id":194,"name":"Solarbreeze","flag":"flag{Trippledex}","points":70},
{"id":195,"name":"Zaam-Dox","flag":"flag{Span}","points":470},
{"id":196,"name":"Zathin","flag":"flag{Konklux}","points":100},
{"id":197,"name":"Stronghold","flag":"flag{Matsoft}","points":260},
{"id":198,"name":"Konklux","flag":"flag{Bamity}","points":290},
{"id":199,"name":"Bytecard","flag":"flag{Temp}","points":10},
{"id":200,"name":"Zamit","flag":"flag{Prodder}","points":270},
{"id":201,"name":"Viva","flag":"flag{Tampflex}","points":320},
{"id":202,"name":"Konklux","flag":"flag{Hatity}","points":450},
{"id":203,"name":"Bitchip","flag":"flag{Zoolab}","points":90},
{"id":204,"name":"Cardify","flag":"flag{Viva}","points":440},
{"id":205,"name":"Hatity","flag":"flag{Treeflex}","points":250},
{"id":206,"name":"Tresom","flag":"flag{Andalax}","points":90},
{"id":207,"name":"Konklux","flag":"flag{Prodder}","points":440},
{"id":208,"name":"Redhold","flag":"flag{Biodex}","points":240},
{"id":209,"name":"Veribet","flag":"flag{Veribet}","points":210},
{"id":210,"name":"Lotlux","flag":"flag{Treeflex}","points":20},
{"id":211,"name":"Tempsoft","flag":"flag{Matsoft}","points":180},
{"id":212,"name":"Fintone","flag":"flag{Bitwolf}","points":200},
{"id":213,"name":"Sub-Ex","flag":"flag{Lotstring}","points":340},
{"id":214,"name":"Y-Solowarm","flag":"flag{Regrant}","points":400},
{"id":215,"name":"Bitwolf","flag":"flag{Quo Lux}","points":360},
{"id":216,"name":"Span","flag":"flag{Duobam}","points":60},
{"id":217,"name":"Gembucket","flag":"flag{Holdlamis}","points":120},
{"id":218,"name":"Zamit","flag":"flag{Cookley}","points":500},
{"id":219,"name":"Regrant","flag":"flag{Bitwolf}","points":80},
{"id":220,"name":"Quo Lux","flag":"flag{Overhold}","points":310},
{"id":221,"name":"Span","flag":"flag{Kanlam}","points":450},
{"id":222,"name":"Lotlux","flag":"flag{Holdlamis}","points":330},
{"id":223,"name":"Keylex","flag":"flag{Konklab}","points":190},
{"id":224,"name":"Gembucket","flag":"flag{Tempsoft}","points":440},
{"id":225,"name":"Zoolab","flag":"flag{Cookley}","points":480},
{"id":226,"name":"Hatity","flag":"flag{Sub-Ex}","points":320},
{"id":227,"name":"Stim","flag":"flag{Daltfresh}","points":330},
{"id":228,"name":"Y-find","flag":"flag{Kanlam}","points":480},
{"id":229,"name":"Flexidy","flag":"flag{Duobam}","points":290},
{"id":230,"name":"Sonair","flag":"flag{Holdlamis}","points":100},
{"id":231,"name":"Overhold","flag":"flag{Fintone}","points":390},
{"id":232,"name":"Sonair","flag":"flag{Zaam-Dox}","points":160},
{"id":233,"name":"Job","flag":"flag{Viva}","points":70},
{"id":234,"name":"Bamity","flag":"flag{Sonair}","points":140},
{"id":235,"name":"Matsoft","flag":"flag{Greenlam}","points":470},
{"id":236,"name":"Voyatouch","flag":"flag{Wrapsafe}","points":20},
{"id":237,"name":"Konklab","flag":"flag{Voltsillam}","points":100},
{"id":238,"name":"Tempsoft","flag":"flag{Duobam}","points":20},
{"id":239,"name":"Zoolab","flag":"flag{Flexidy}","points":10},
{"id":240,"name":"Bamity","flag":"flag{Latlux}","points":120},
{"id":241,"name":"Subin","flag":"flag{Alphazap}","points":250},
{"id":242,"name":"Andalax","flag":"flag{Konklab}","points":180},
{"id":243,"name":"Sonsing","flag":"flag{Mat Lam Tam}","points":310},
{"id":244,"name":"Voyatouch","flag":"flag{Prodder}","points":100},
{"id":245,"name":"Sonsing","flag":"flag{Stringtough}","points":440},
{"id":246,"name":"Zamit","flag":"flag{Fixflex}","points":300},
{"id":247,"name":"Rank","flag":"flag{Keylex}","points":70},
{"id":248,"name":"Zamit","flag":"flag{It}","points":220},
{"id":249,"name":"Matsoft","flag":"flag{Zamit}","points":340},
{"id":250,"name":"Stim","flag":"flag{Sub-Ex}","points":450}]
