<svg width="64" height="66" viewBox="0 0 64 66" fill="none" xmlns="http://www.w3.org/2000/svg">
<defs>
<filter id="filter0_d_2748_69579" x="1" y="4" width="62" height="62" filterUnits="userSpaceOnUse" color-interpolation-filters="sRGB">
<feFlood flood-opacity="0" result="BackgroundImageFix"/>
<feColorMatrix in="SourceAlpha" type="matrix" values="0 0 0 0 0 0 0 0 0 0 0 0 0 0 0 0 0 0 127 0" result="hardAlpha"/>
<feOffset dy="3"/>
<feGaussianBlur stdDeviation="3"/>
<feColorMatrix type="matrix" values="0 0 0 0 0.00392157 0 0 0 0 0.0196078 0 0 0 0 0.2 0 0 0 0.08 0"/>
<feBlend mode="normal" in2="BackgroundImageFix" result="effect1_dropShadow_2748_69579"/>
<feBlend mode="normal" in="SourceGraphic" in2="effect1_dropShadow_2748_69579" result="shape"/>
</filter>
<radialGradient id="paint0_radial_2748_69579" cx="0" cy="0" r="1" gradientUnits="userSpaceOnUse" gradientTransform="translate(31.989 31.9889) scale(21.9893 21.9893)">
<stop stop-color="white" stop-opacity="0"/>
<stop offset="1" stop-color="#571600"/>
</radialGradient>
</defs>
<path d="M29.4055 2.21099C30.9006 0.936934 33.0994 0.936936 34.5945 2.21099L40.8112 7.50882C41.4518 8.05478 42.2484 8.38473 43.0874 8.45169L51.2294 9.10142C53.1875 9.25768 54.7423 10.8125 54.8986 12.7706L55.5483 20.9126C55.6153 21.7516 55.9452 22.5482 56.4912 23.1888L61.789 29.4055C63.0631 30.9006 63.0631 33.0994 61.789 34.5945L56.4912 40.8112C55.9452 41.4518 55.6153 42.2484 55.5483 43.0874L54.8986 51.2294C54.7423 53.1875 53.1875 54.7423 51.2294 54.8986L43.0874 55.5483C42.2484 55.6153 41.4518 55.9452 40.8112 56.4912L34.5945 61.789C33.0994 63.0631 30.9006 63.0631 29.4055 61.789L23.1888 56.4912C22.5482 55.9452 21.7516 55.6153 20.9126 55.5483L12.7706 54.8986C10.8125 54.7423 9.25768 53.1875 9.10142 51.2294L8.45169 43.0874C8.38473 42.2484 8.05478 41.4518 7.50882 40.8112L2.21099 34.5945C0.936934 33.0994 0.936936 30.9006 2.21099 29.4055L7.50882 23.1888C8.05478 22.5482 8.38473 21.7516 8.45169 20.9126L9.10142 12.7706C9.25768 10.8125 10.8125 9.25768 12.7706 9.10142L20.9126 8.45169C21.7516 8.38473 22.5482 8.05478 23.1888 7.50882L29.4055 2.21099Z" fill="#CDCDCD"/>
<g filter="url(#filter0_d_2748_69579)">
<path d="M32 57C45.8072 57 57.0001 45.8071 57.0001 32C57.0001 18.1929 45.8072 7 32 7C18.1929 7 7 18.1929 7 32C7 45.8071 18.1929 57 32 57Z" fill="#CDCDCD"/>
<path opacity="0.18" d="M32 54C44.1503 54 54.0001 44.1503 54.0001 32C54.0001 19.8497 44.1503 10 32 10C19.8498 10 10 19.8497 10 32C10 44.1503 19.8498 54 32 54Z" fill="url(#paint0_radial_2748_69579)" fill-opacity="0.5"/>
</g>
<path d="M53 31.9261C53 32.7868 52.9508 33.6474 52.8523 34.4835C52.7538 35.4179 52.5569 36.3523 52.3353 37.2376C52.2368 37.631 52.1383 37.9999 52.0152 38.3933C51.7937 39.0818 51.5475 39.7704 51.2521 40.4343C50.612 41.8851 49.8242 43.2376 48.8886 44.4916C48.1008 45.549 47.2146 46.5326 46.2298 47.4424C42.5124 50.885 37.5393 52.9752 32.074 52.9998C26.6086 53.0244 21.6109 50.9588 17.8689 47.5408C16.9087 46.6556 16.0224 45.6966 15.2346 44.6638C13.7575 42.7212 12.625 40.5081 11.9111 38.1474C11.5664 37.0409 11.3202 35.8851 11.1725 34.7048C11.0741 33.8442 11.0002 32.9835 11.0002 32.1229C10.951 20.4672 20.3061 11.0492 31.9262 11C43.5217 10.9755 52.9508 20.3197 53 31.9261Z" fill="#FCFCFC"/>
<path d="M26.1373 31.2127C26.0585 31.1339 21.2641 30.0783 21.2641 30.0783C21.2641 30.0783 20.9848 30.5264 21.0654 30.7908C21.1104 30.9389 22.1566 32.1558 23.2329 33.2752C24.0823 34.1602 25.0479 35.0602 25.1885 35.5739C25.4041 36.3652 25.4266 37.6345 25.4266 37.6345L22.301 39.5433C22.301 39.5433 22.6835 41.4895 25.1623 41.4127C27.4779 41.3414 27.5979 38.8889 28.3329 38.8758C28.4566 38.8739 28.6273 38.8308 28.9329 39.1589C29.6904 39.9727 31.1079 41.5439 31.5823 42.0202C32.216 42.6539 32.666 43.2877 32.9041 43.2614C33.1423 43.2352 35.1504 41.4389 35.7316 40.8839C36.3129 40.3289 36.8416 39.6689 36.8416 39.1139C36.8416 38.5589 36.0223 38.137 36.0223 38.137L31.5035 38.6658L26.1373 31.2127ZM39.4273 24.0539C39.506 24.0539 41.5141 23.0508 41.5141 23.0508C41.5141 23.0508 42.5454 25.1377 41.2235 26.3264C39.9016 27.5152 39.611 26.842 38.9773 27.5414C38.4935 28.0758 38.7391 29.1802 38.7391 29.1802L42.6673 32.9564C42.6673 32.9564 42.8866 33.3558 42.7291 33.6464C42.6166 33.8527 41.2948 35.332 40.271 36.3952C39.8098 36.8733 39.1666 37.0345 38.8179 36.9502C37.946 36.7383 37.8148 36.052 37.6554 34.837C37.496 33.622 36.4498 33.6408 36.0691 33.7008C35.2666 33.8283 34.7435 34.297 34.7435 34.297C34.7435 34.297 30.0185 28.6027 30.071 28.4433C30.1235 28.2839 30.3091 27.0952 29.7541 26.5945C29.1991 26.092 28.091 25.837 27.6673 25.5464C27.2454 25.2558 27.1891 24.7027 27.266 24.1664C27.3429 23.6302 30.7591 23.6358 30.7591 23.6358C30.7591 23.6358 36.6504 26.8852 36.6785 26.7539C36.7048 26.6152 39.4273 24.0539 39.4273 24.0539Z" fill="#B0B0AF"/>
<path d="M36.5206 24.6853C36.6631 24.1641 36.4999 22.8834 37.4956 22.0359C38.4912 21.1884 40.0399 21.2934 40.9718 22.1841C41.9037 23.0747 42.0537 24.7491 40.9512 25.8516C39.8487 26.9541 39.3406 26.3391 38.7256 26.9334C38.1106 27.5278 38.2174 28.0153 38.5981 28.3753C38.9806 28.7353 42.7756 32.7009 42.6687 32.9541C42.5618 33.2072 39.9762 36.1341 39.5524 36.3459C39.1287 36.5578 38.3862 36.5372 38.2381 35.8378C38.0899 35.1384 38.3449 33.7397 37.2837 33.3778C36.2243 33.0178 35.7574 33.3141 34.7187 34.4166C33.6799 35.5191 33.2131 36.7266 34.0606 37.3416C34.9081 37.9566 35.9693 37.7016 36.3931 38.4234C36.8168 39.1453 36.1812 39.8016 35.0581 40.8403C33.9349 41.8791 33.0649 42.7266 32.9168 42.6216C32.7687 42.5147 29.5456 39.1022 29.2287 38.7422C28.9099 38.3822 28.2949 38.0634 27.7024 38.6147C27.1081 39.1659 27.0031 40.9678 24.5018 40.9678C22.0006 40.9678 21.7006 38.2547 22.5912 37.1316C23.4818 36.0084 25.4524 35.9016 25.4956 35.1384C25.5143 34.7878 24.4324 33.8428 23.4612 32.8284C22.3193 31.6341 21.2581 30.3684 21.2131 30.2203C21.1287 29.9447 23.5868 27.5278 24.0537 27.1884C24.5206 26.8491 25.0493 27.0609 25.3043 27.3366C25.5593 27.6122 25.6231 28.4597 25.8349 28.9472C26.0468 29.4347 27.0424 31.5553 29.4387 29.1384C31.8124 26.7422 29.5662 25.7034 28.8031 25.4916C28.0399 25.2797 27.4906 25.2103 27.2768 24.4322C27.1081 23.8172 28.0399 23.0972 29.0149 22.1634C29.9899 21.2297 30.5618 20.7422 30.8168 20.7422C31.0718 20.7422 34.4843 24.4097 34.9306 24.8334C35.3768 25.2572 35.6506 25.3641 35.9693 25.2778C36.2862 25.1953 36.4568 24.9197 36.5206 24.6853Z" fill="#CDCDCD"/>
</svg>
