<svg width="64" height="66" viewBox="0 0 64 66" fill="none" xmlns="http://www.w3.org/2000/svg">
<path d="M29.4055 2.21099C30.9006 0.936934 33.0994 0.936936 34.5945 2.21099L40.8112 7.50882C41.4518 8.05478 42.2484 8.38473 43.0874 8.45169L51.2294 9.10142C53.1875 9.25768 54.7423 10.8125 54.8986 12.7706L55.5483 20.9126C55.6153 21.7516 55.9452 22.5482 56.4912 23.1888L61.789 29.4055C63.0631 30.9006 63.0631 33.0994 61.789 34.5945L56.4912 40.8112C55.9452 41.4518 55.6153 42.2484 55.5483 43.0874L54.8986 51.2294C54.7423 53.1875 53.1875 54.7423 51.2294 54.8986L43.0874 55.5483C42.2484 55.6153 41.4518 55.9452 40.8112 56.4912L34.5945 61.789C33.0994 63.0631 30.9006 63.0631 29.4055 61.789L23.1888 56.4912C22.5482 55.9452 21.7516 55.6153 20.9126 55.5483L12.7706 54.8986C10.8125 54.7423 9.25768 53.1875 9.10142 51.2294L8.45169 43.0874C8.38473 42.2484 8.05478 41.4518 7.50882 40.8112L2.21099 34.5945C0.936934 33.0994 0.936936 30.9006 2.21099 29.4055L7.50882 23.1888C8.05478 22.5482 8.38473 21.7516 8.45169 20.9126L9.10142 12.7706C9.25768 10.8125 10.8125 9.25768 12.7706 9.10142L20.9126 8.45169C21.7516 8.38473 22.5482 8.05478 23.1888 7.50882L29.4055 2.21099Z" fill="#CDCDCD"/>
<g filter="url(#filter0_d_689_57069)">
<path d="M32 57C45.8072 57 57.0001 45.8071 57.0001 32C57.0001 18.1929 45.8072 7 32 7C18.1929 7 7 18.1929 7 32C7 45.8071 18.1929 57 32 57Z" fill="#CDCDCD"/>
<path opacity="0.18" d="M32 54C44.1503 54 54.0001 44.1503 54.0001 32C54.0001 19.8497 44.1503 10 32 10C19.8498 10 10 19.8497 10 32C10 44.1503 19.8498 54 32 54Z" fill="url(#paint0_radial_689_57069)" fill-opacity="0.5"/>
</g>
<path d="M53 31.9261C53 32.7868 52.9508 33.6474 52.8523 34.4835C52.7538 35.4179 52.5569 36.3523 52.3353 37.2376C52.2368 37.631 52.1383 37.9999 52.0152 38.3933C51.7937 39.0818 51.5475 39.7704 51.2521 40.4343C50.612 41.8851 49.8242 43.2375 48.8886 44.4916C48.1008 45.549 47.2146 46.5326 46.2298 47.4424C42.5124 50.885 37.5393 52.9752 32.074 52.9998C26.6086 53.0244 21.6109 50.9588 17.8689 47.5408C16.9087 46.6556 16.0224 45.6966 15.2346 44.6638C13.7575 42.7212 12.625 40.5081 11.9111 38.1474C11.5664 37.0409 11.3202 35.8851 11.1725 34.7048C11.0741 33.8442 11.0002 32.9835 11.0002 32.1229C10.951 20.4672 20.3061 11.0492 31.9262 11C43.5217 10.9755 52.9508 20.3197 53 31.9261Z" fill="#FCFCFC"/>
<path d="M41.1748 36.2732C42.0635 36.037 42.3504 34.6682 42.311 33.9951C42.266 33.2526 41.7898 32.0582 41.0923 31.9495C41.3473 31.7151 41.6454 31.0457 41.471 29.9957C41.291 28.9063 40.4454 28.0401 39.5491 28.1732C39.4366 28.1901 37.5523 28.3907 36.2023 28.6045C34.8523 28.8182 34.7866 28.6513 34.7866 28.6513C35.8891 26.2645 36.6954 20.5813 32.786 20.7538C31.8148 20.9526 33.2379 23.9751 31.2654 26.6263C30.7273 27.3501 29.9341 28.0476 28.7716 28.6513C28.1548 29.0432 27.5698 29.6001 27.2304 30.0632C26.8104 30.6351 26.6679 31.0963 26.0998 31.3326C24.6691 31.9251 23.336 31.7732 22.7135 31.6438C22.496 31.5988 22.286 31.7301 22.2241 31.9438C21.1029 35.7895 22.0179 38.9695 22.3704 39.9632C22.436 40.1507 22.6273 40.2632 22.8241 40.237C23.7766 40.1076 24.5266 40.1038 25.6854 40.2145C26.7991 40.3195 27.4198 41.1501 28.256 41.7013C30.1441 43.0888 32.8985 42.9876 35.4823 42.922C36.0391 42.9088 36.5791 42.9895 37.1023 43.057C37.3666 43.1245 37.6479 43.1788 37.9535 43.2201C39.1254 43.3795 39.6841 42.9407 39.9804 42.187C40.2391 41.527 40.1323 40.8238 39.5529 40.1882C39.6766 40.2163 39.791 40.2407 39.8885 40.2576C41.0229 40.4638 41.6829 39.4832 41.8423 38.4576C41.9754 37.6007 41.7035 36.6032 41.1748 36.2732Z" fill="#D3D3D3"/>
<path d="M36.9091 35.8833C36.9091 35.8833 36.2847 35.5233 36.1816 35.0339C36.0784 34.5445 36.0616 34.3008 36.0466 33.9314C36.0241 33.3183 36.5941 32.9264 36.5941 32.9264L36.6334 32.2008C36.6334 32.2008 36.0578 31.8352 35.9153 31.7208C35.6941 31.5427 35.5628 30.8789 35.5947 30.5395C35.6172 30.3014 35.8966 29.8477 35.8966 29.8477C34.5466 29.9283 34.4847 31.5014 34.4978 32.0264C34.5166 32.647 34.2447 33.4889 33.8547 34.1452C33.3522 34.9889 31.5822 36.112 31.4922 36.1608C32.5234 36.5845 33.1441 37.8127 33.3841 38.737C33.5022 39.1908 34.0103 41.3058 34.3478 41.632C34.4359 41.7577 35.2797 42.3127 35.8534 42.4045C35.8534 42.4045 35.3022 41.8008 35.5928 40.8183C35.8234 40.0383 36.5584 39.8564 36.5584 39.8564L36.8847 39.2995C36.8847 39.2995 36.4178 38.8664 36.3147 38.452C36.2266 38.0977 36.1553 37.2877 36.4384 36.9239C36.5659 36.7589 36.9466 36.5583 36.9466 36.5583L36.9091 35.8833Z" fill="#B0B0B0"/>
<path d="M29.3955 28.3924C29.0898 28.8106 28.0155 30.0349 27.7792 30.3274C27.543 30.6199 26.628 31.9249 26.328 32.3449L26.2511 32.3393C26.268 31.8912 26.4892 30.8712 27.183 29.8493C27.903 28.8987 28.9473 28.4768 29.3655 28.3212L29.3955 28.3924ZM40.2161 35.9993C37.6661 35.9337 35.5323 35.8024 35.5323 35.8024C35.5323 35.8024 34.7748 35.7762 34.6998 34.4506C34.6417 33.4193 35.3692 33.1324 35.7517 33.0518C36.5486 32.9824 39.1005 32.5962 39.9123 32.4706C40.7655 32.3374 41.0955 31.9531 41.0955 31.9531C41.0955 31.9531 40.7092 31.7506 40.0248 31.8462C39.3386 31.9418 37.3398 32.1274 36.0442 32.2568C35.8417 32.2774 35.3805 32.1162 35.1836 31.4206C34.998 30.7699 35.3055 30.2674 35.4817 30.1137C35.7873 29.8493 37.4336 29.1293 38.7011 28.7974C40.2067 28.4018 41.1142 29.0693 41.1142 29.0693C40.8217 28.1524 39.813 28.0118 38.8811 28.0793C38.1873 28.1281 35.4892 28.6099 35.1498 28.5462C35.0336 28.5424 34.9511 28.4956 34.9905 28.3962C35.2848 27.4249 35.6167 25.8724 35.6242 25.5031C35.628 25.2987 35.4742 25.4712 35.4123 25.6399C34.9773 26.8118 33.8523 28.3549 33.9405 29.9562C33.9742 30.5749 34.1486 31.9962 33.753 33.0837C33.0048 35.1331 31.4336 35.8587 31.3942 35.9374C31.3548 36.0162 31.3755 36.1324 31.458 36.1624C31.7223 36.1793 31.9905 36.0724 32.2361 35.9806C32.8117 35.6656 33.3705 35.3093 33.9067 34.9249C33.9873 35.6918 34.3286 36.1418 34.728 36.3612C34.1861 37.0418 34.2798 38.9337 34.9305 39.3987C34.5273 39.6312 34.323 40.0343 34.2161 40.4599C34.0023 41.3149 34.2555 41.6974 34.5948 42.0931C34.5948 42.0931 32.6561 42.4737 30.2598 42.0143C28.0417 41.5906 28.0323 39.7887 25.5948 39.7887C23.1573 39.7887 21.9067 40.3174 23.1142 40.1956C24.4923 40.0549 25.413 40.2631 26.0823 40.3231C27.228 40.4243 27.5355 41.8493 30.0873 42.5974C31.8948 43.1262 35.6842 42.8937 35.6842 42.8937C35.6842 42.8937 37.443 43.2499 37.7186 43.1749C37.7186 43.1749 35.6223 42.4268 35.1536 41.8756C35.0636 41.7706 34.638 41.2812 35.1498 40.2499C35.2867 39.9743 35.8661 39.7887 36.2636 39.8149C36.4042 39.8243 37.2817 40.0249 38.8567 40.3381C39.9217 40.5518 40.1111 41.4574 40.1111 41.4574C40.1111 41.4574 40.2761 40.0699 39.1492 39.8074C38.0786 39.5581 36.5392 39.2149 36.1155 39.1062C35.6917 38.9974 35.1986 38.5831 35.2155 37.6662C35.2286 36.8693 35.7011 36.5937 35.9767 36.5768C36.2523 36.5599 38.508 36.6349 40.1336 36.6612C40.8255 36.6612 41.1986 36.2843 41.1986 36.2843C41.1986 36.2843 40.923 36.0181 40.2161 35.9993Z" fill="#B0B0B0"/>
<defs>
<filter id="filter0_d_689_57069" x="1" y="4" width="62" height="62" filterUnits="userSpaceOnUse" color-interpolation-filters="sRGB">
<feFlood flood-opacity="0" result="BackgroundImageFix"/>
<feColorMatrix in="SourceAlpha" type="matrix" values="0 0 0 0 0 0 0 0 0 0 0 0 0 0 0 0 0 0 127 0" result="hardAlpha"/>
<feOffset dy="3"/>
<feGaussianBlur stdDeviation="3"/>
<feColorMatrix type="matrix" values="0 0 0 0 0.00392157 0 0 0 0 0.0196078 0 0 0 0 0.2 0 0 0 0.08 0"/>
<feBlend mode="normal" in2="BackgroundImageFix" result="effect1_dropShadow_689_57069"/>
<feBlend mode="normal" in="SourceGraphic" in2="effect1_dropShadow_689_57069" result="shape"/>
</filter>
<radialGradient id="paint0_radial_689_57069" cx="0" cy="0" r="1" gradientUnits="userSpaceOnUse" gradientTransform="translate(31.989 31.9889) scale(21.9893 21.9893)">
<stop stop-color="white" stop-opacity="0"/>
<stop offset="1" stop-color="#571600"/>
</radialGradient>
</defs>
</svg>
