Course code 	: SODV1101
Term/Year 	: fall2017
Assignment code	: PA3
Author 		: Nico Beekhuijs
BVC Username 	: n.beekhuijs948
Date created 	: 2017-10-17
Description 	: PyLint report


C:\Users\Nico\Documents\sodv1101\pa3>pylint reciept.py
No config file found, using default configuration

-------------------------------------------------------------------
Your code has been rated at 10.00/10 (previous run: 9.27/10, +0.73)
