module main.go

go 1.17

replace local.com/ninja => ./corona

require (
	github.com/bwmarrin/discordgo v0.23.3-0.20211228023845-29269347e820
	local.com/ninja v0.0.0-00010101000000-000000000000
)

require (
	github.com/gorilla/websocket v1.4.2 // indirect
	golang.org/x/crypto v0.0.0-20210421170649-83a5a9bb288b // indirect
	golang.org/x/sys v0.0.0-20201119102817-f84b799fce68 // indirect
)
