{
	"name": "dependabot-dev",
	"workspaceFolder": "/home/dependabot/app",
	"service": "dependabot",
	"shutdownAction": "stopCompose",
	"dockerComposeFile": "docker-compose.yml",
	"extensions": [
		"rebornix.ruby",
		"castwide.solargraph",
		"groksrc.ruby",
		"k--kato.intellij-idea-keybindings"
  ],
	"settings": {
		"terminal.integrated.profiles.linux": {
			"bash": {
				"path": "bash",
				"icon": "terminal-bash"
			}
		},
		"terminal.integrated.defaultProfile.linux": "bash",
		"solargraph.useBundler": true,
		"solargraph.externalServer": {
			"host": "localhost",
			"port": 7658
		},
    "ruby.intellisense": false,
		"ruby.useLanguageServer": false,
		"ruby.codeCompletion": false
  }
}
