{
	"codeContract":"NDA",
	"campos":[{
	"pag":4,
	"nombre":"gid",
	"valor":"14000079466BAEC2E41E9D787C000000007946",
	"isImg":false,
	"x":223,
	"y":618,	
	"fontStyle":"TIMES_ROMAN",
	"fontSize":7,
	"alignment":1	
},{
	"pag":4,
	"nombre":"nombre",
	"valor":"",
	"isImg":false,
	"x":268,
	"y":464,	
	"fontStyle":"TIMES_ROMAN",
	"fontSize":9,
	"alignment":0
},{
	"pag":4,
	"nombre":"huella",
	"valor":"",
	"isImg":true,
	"x":270,
	"y":495,	
	"fontStyle":"TIMES_ROMAN",
	"fontSize":9,
	"alignment":0	
}]
}