{
    "_type": "export",
    "__export_format": 4,
    "__export_date": "2021-03-04T01:18:21.303Z",
    "__export_source": "insomnia.desktop.app:v2020.5.2",
    "resources": [
        {
            "_id": "req_fe035ee9b0424214b62eb1f55ad01071",
            "parentId": "fld_490b83632e05452cbd6e5291836af725",
            "modified": 1614390974346,
            "created": 1614390643416,
            "url": "{{ _.baseURL }}/nps/e1eacc27-b974-4b30-a362-da2d427c0131",
            "name": "Calculate",
            "description": "",
            "method": "GET",
            "body": {},
            "parameters": [],
            "headers": [],
            "authentication": {},
            "metaSortKey": -1614390643524,
            "isPrivate": false,
            "settingStoreCookies": true,
            "settingSendCookies": true,
            "settingDisableRenderRequestBody": false,
            "settingEncodeUrl": true,
            "settingRebuildPath": true,
            "settingFollowRedirects": "global",
            "_type": "request"
        },
        {
            "_id": "fld_490b83632e05452cbd6e5291836af725",
            "parentId": "wrk_b501b614c04f4b45ab1766afbba7c490",
            "modified": 1614390630082,
            "created": 1614390630082,
            "name": "Nps",
            "description": "",
            "environment": {},
            "environmentPropertyOrder": null,
            "metaSortKey": -1614390630082,
            "_type": "request_group"
        },
        {
            "_id": "wrk_b501b614c04f4b45ab1766afbba7c490",
            "parentId": null,
            "modified": 1614126706156,
            "created": 1614126706156,
            "name": "NLW4",
            "description": "",
            "scope": null,
            "_type": "workspace"
        },
        {
            "_id": "req_0f523c09741341ec82052324e11c42e6",
            "parentId": "fld_ce884a2a3f5e4da2a961265d0b05f314",
            "modified": 1614386389855,
            "created": 1614386303081,
            "url": "{{ _.baseURL }}/answers/5?u=04ae5cbb-fad8-4dad-99b8-0950491e8732",
            "name": "Answer",
            "description": "",
            "method": "GET",
            "body": {},
            "parameters": [],
            "headers": [],
            "authentication": {},
            "metaSortKey": -1614386303081,
            "isPrivate": false,
            "settingStoreCookies": true,
            "settingSendCookies": true,
            "settingDisableRenderRequestBody": false,
            "settingEncodeUrl": true,
            "settingRebuildPath": true,
            "settingFollowRedirects": "global",
            "_type": "request"
        },
        {
            "_id": "fld_ce884a2a3f5e4da2a961265d0b05f314",
            "parentId": "wrk_b501b614c04f4b45ab1766afbba7c490",
            "modified": 1614386279553,
            "created": 1614386279553,
            "name": "Answer",
            "description": "",
            "environment": {},
            "environmentPropertyOrder": null,
            "metaSortKey": -1614386279553,
            "_type": "request_group"
        },
        {
            "_id": "req_fac935ac451b489da13bd3d88af30312",
            "parentId": "fld_c2a1115dd0894a62953e7dc93c4befde",
            "modified": 1614386008161,
            "created": 1614385992031,
            "url": "{{ _.baseURL }}/show",
            "name": "Show",
            "description": "",
            "method": "GET",
            "body": {},
            "parameters": [],
            "headers": [],
            "authentication": {},
            "metaSortKey": -1614385992031,
            "isPrivate": false,
            "settingStoreCookies": true,
            "settingSendCookies": true,
            "settingDisableRenderRequestBody": false,
            "settingEncodeUrl": true,
            "settingRebuildPath": true,
            "settingFollowRedirects": "global",
            "_type": "request"
        },
        {
            "_id": "fld_c2a1115dd0894a62953e7dc93c4befde",
            "parentId": "wrk_b501b614c04f4b45ab1766afbba7c490",
            "modified": 1614300663338,
            "created": 1614300663338,
            "name": "Send",
            "description": "",
            "environment": {},
            "environmentPropertyOrder": null,
            "metaSortKey": -1614300663338,
            "_type": "request_group"
        },
        {
            "_id": "req_bae7a4c722e34fc0858fb2f0ff87f71b",
            "parentId": "fld_c2a1115dd0894a62953e7dc93c4befde",
            "modified": 1614820338512,
            "created": 1614300684075,
            "url": "{{ _.baseURL }}/sendMail",
            "name": "Mail",
            "description": "",
            "method": "POST",
            "body": {
                "mimeType": "application/json",
                "text": "{\n\t\"email\": \"name.user.test@server.com\",\n\t\"surveys_id\": \"e1eacc27-b974-4b30-a362-da2d427c0131\"\n}"
            },
            "parameters": [],
            "headers": [
                {
                    "name": "Content-Type",
                    "value": "application/json",
                    "id": "pair_3fc2d5fcc40e40ec97ebf487c4e525d6"
                }
            ],
            "authentication": {},
            "metaSortKey": -1614126844994.5,
            "isPrivate": false,
            "settingStoreCookies": true,
            "settingSendCookies": true,
            "settingDisableRenderRequestBody": false,
            "settingEncodeUrl": true,
            "settingRebuildPath": true,
            "settingFollowRedirects": "global",
            "_type": "request"
        },
        {
            "_id": "req_ddfabc5389bb4b42bccdab8060d158a5",
            "parentId": "fld_32fc2894c0174c1b87a51d78def671fa",
            "modified": 1614820156081,
            "created": 1614210127328,
            "url": "{{ _.baseURL }}/surveys",
            "name": "Create",
            "description": "",
            "method": "POST",
            "body": {
                "mimeType": "application/json",
                "text": "{\n\t\"title\": \"What is your preference for choosing Node as your development language?\",\n\t\"description\": \"Knowing that Node has acquired many developers in such a short time, this programming language only tends to grow more and more.\"\n}"
            },
            "parameters": [],
            "headers": [
                {
                    "name": "Content-Type",
                    "value": "application/json",
                    "id": "pair_3fc2d5fcc40e40ec97ebf487c4e525d6"
                }
            ],
            "authentication": {},
            "metaSortKey": -1614126845007,
            "isPrivate": false,
            "settingStoreCookies": true,
            "settingSendCookies": true,
            "settingDisableRenderRequestBody": false,
            "settingEncodeUrl": true,
            "settingRebuildPath": true,
            "settingFollowRedirects": "global",
            "_type": "request"
        },
        {
            "_id": "fld_32fc2894c0174c1b87a51d78def671fa",
            "parentId": "wrk_b501b614c04f4b45ab1766afbba7c490",
            "modified": 1614210111669,
            "created": 1614210111669,
            "name": "Surveys",
            "description": "",
            "environment": {},
            "environmentPropertyOrder": null,
            "metaSortKey": -1614210111669,
            "_type": "request_group"
        },
        {
            "_id": "req_e8cacbb1eb4347bbb6a55a94e693395e",
            "parentId": "fld_32fc2894c0174c1b87a51d78def671fa",
            "modified": 1614210887342,
            "created": 1614210877185,
            "url": "{{ _.baseURL }}/surveys",
            "name": "Show",
            "description": "",
            "method": "GET",
            "body": {},
            "parameters": [],
            "headers": [],
            "authentication": {},
            "metaSortKey": -1614126844957,
            "isPrivate": false,
            "settingStoreCookies": true,
            "settingSendCookies": true,
            "settingDisableRenderRequestBody": false,
            "settingEncodeUrl": true,
            "settingRebuildPath": true,
            "settingFollowRedirects": "global",
            "_type": "request"
        },
        {
            "_id": "req_15b356d055d8463d87f115a28412b04f",
            "parentId": "fld_d52c8ae7496448fabbf79d2961db3fc2",
            "modified": 1614819317921,
            "created": 1614126845032,
            "url": "{{ _.baseURL }}/users",
            "name": "Create",
            "description": "",
            "method": "POST",
            "body": {
                "mimeType": "application/json",
                "text": "{\n\t\"name\": \"Name User Test\",\n\t\"email\": \"name.user.test@server.com\"\n}"
            },
            "parameters": [],
            "headers": [
                {
                    "name": "Content-Type",
                    "value": "application/json",
                    "id": "pair_3fc2d5fcc40e40ec97ebf487c4e525d6"
                }
            ],
            "authentication": {},
            "metaSortKey": -1614126845032,
            "isPrivate": false,
            "settingStoreCookies": true,
            "settingSendCookies": true,
            "settingDisableRenderRequestBody": false,
            "settingEncodeUrl": true,
            "settingRebuildPath": true,
            "settingFollowRedirects": "global",
            "_type": "request"
        },
        {
            "_id": "fld_d52c8ae7496448fabbf79d2961db3fc2",
            "parentId": "wrk_b501b614c04f4b45ab1766afbba7c490",
            "modified": 1614132624719,
            "created": 1614132624719,
            "name": "Users",
            "description": "",
            "environment": {},
            "environmentPropertyOrder": null,
            "metaSortKey": -1614132624719,
            "_type": "request_group"
        },
        {
            "_id": "req_f05c3fd71fe34cfea9504520eab4438c",
            "parentId": "fld_d52c8ae7496448fabbf79d2961db3fc2",
            "modified": 1614210866716,
            "created": 1614126792916,
            "url": "{{ _.baseURL }}/users",
            "name": "Show",
            "description": "",
            "method": "GET",
            "body": {},
            "parameters": [],
            "headers": [],
            "authentication": {},
            "metaSortKey": -1614126844982,
            "isPrivate": false,
            "settingStoreCookies": true,
            "settingSendCookies": true,
            "settingDisableRenderRequestBody": false,
            "settingEncodeUrl": true,
            "settingRebuildPath": true,
            "settingFollowRedirects": "global",
            "_type": "request"
        },
        {
            "_id": "env_314a1176e90dcd9fbe8479af36e86901f9b5ae86",
            "parentId": "wrk_b501b614c04f4b45ab1766afbba7c490",
            "modified": 1614126773540,
            "created": 1614126706302,
            "name": "Base Environment",
            "data": { "baseURL": "http://localhost:3333" },
            "dataPropertyOrder": { "&": ["baseURL"] },
            "color": null,
            "isPrivate": false,
            "metaSortKey": 1614126706302,
            "_type": "environment"
        },
        {
            "_id": "jar_314a1176e90dcd9fbe8479af36e86901f9b5ae86",
            "parentId": "wrk_b501b614c04f4b45ab1766afbba7c490",
            "modified": 1614126706303,
            "created": 1614126706303,
            "name": "Default Jar",
            "cookies": [],
            "_type": "cookie_jar"
        },
        {
            "_id": "spc_1a223e197a884e9b83be2a5a2c719386",
            "parentId": "wrk_b501b614c04f4b45ab1766afbba7c490",
            "modified": 1614126706181,
            "created": 1614126706181,
            "fileName": "NLW4",
            "contents": "",
            "contentType": "yaml",
            "_type": "api_spec"
        }
    ]
}
