<svg xmlns="http://www.w3.org/2000/svg" width="24" height="24" viewBox="0 0 24 24" fill="none">
  <g>
    <path fill-rule="evenodd" clip-rule="evenodd" d="M21.6329 8.69951C21.8254 8.79088 21.9678 8.96299 22.0221 9.16972C22.071 9.35575 22.5002 11.0174 22.5 12.0159C22.5 14.5122 21.5268 16.8116 19.7597 18.4907C18.3318 19.8473 16.4523 20.7385 14.2387 21.1237L13.7481 22.5503H14.5156C14.9142 22.5503 15.2375 22.875 15.2375 23.2752C15.2375 23.6755 14.9142 24 14.5156 24H10.9551C10.5566 24 10.2335 23.6755 10.2335 23.2752C10.2335 22.875 10.5566 22.5503 10.9551 22.5503H12.2211L12.6478 21.3096C12.309 21.331 11.9646 21.3424 11.6137 21.3424C6.84835 21.3424 2.97167 17.4488 2.97167 12.6632C2.97167 11.7792 3.48983 10.1924 3.77479 9.38652C3.13532 8.95867 2.29794 8.995 2.26827 8.99629L2.26755 8.99632C2.0154 9.01353 1.77456 8.89689 1.62943 8.68889C1.48448 8.48106 1.46005 8.21208 1.56233 7.9799C2.17402 6.5905 3.09802 5.95897 3.72484 5.67772C3.30003 5.23626 3.03785 4.63622 3.03785 3.97539C3.03785 2.81945 3.8386 1.84771 4.91229 1.59045C5.26143 0.652953 6.161 0 7.19822 0C8.23544 0 9.13501 0.652953 9.48433 1.59045C10.558 1.84771 11.3588 2.81945 11.3588 3.97539C11.3588 4.67559 11.0643 5.30767 10.5939 5.75481C10.7287 6.13512 10.8027 6.54418 10.8027 6.97044C10.8027 7.69572 10.5857 8.39866 10.1908 8.99193C10.9764 9.39402 12.2747 9.7844 13.8866 9.91899C15.6141 10.0631 18.2549 9.96787 21.0241 8.69548C21.2177 8.60667 21.4405 8.60795 21.6329 8.69951ZM4.5595 14.1062C5.22716 17.4034 8.13644 19.8925 11.6137 19.8925C18.1369 19.8925 21.0568 15.9366 21.0568 12.0159C21.0568 11.5902 20.9375 10.9162 20.8183 10.3564C18.0652 11.4333 15.4984 11.5082 13.767 11.3637C12.877 11.2893 12.0273 11.141 11.2672 10.9352C11.1493 11.6795 10.8282 12.2431 10.3053 12.6154C9.5022 13.187 8.46097 13.1125 7.73278 12.9512C7.55921 13.4461 7.23122 13.8636 6.78107 14.1401C6.43959 14.3496 6.06401 14.4549 5.68988 14.4549C5.3453 14.4549 5.00199 14.3657 4.68822 14.1864C4.64719 14.1632 4.60398 14.1363 4.5595 14.1062ZM5.47074 2.97344C4.9245 2.97784 4.48128 3.42553 4.48128 3.97539C4.48128 4.15868 4.53142 4.33007 4.61748 4.4782C5.16535 3.85491 5.99764 3.33434 7.18218 3.33434C8.20736 3.33434 9.13355 3.76519 9.793 4.45513C9.87067 4.31267 9.91516 4.14916 9.91516 3.97539C9.91516 3.42553 9.47194 2.97784 8.92552 2.97344C8.91878 2.97363 8.91203 2.97381 8.90529 2.97381C8.53955 2.97381 8.23106 2.69879 8.18858 2.33313C8.12988 1.8294 7.70416 1.44964 7.19822 1.44964C6.69228 1.44964 6.26656 1.8294 6.20786 2.33313C6.16501 2.70153 5.85142 2.97656 5.48277 2.97363C5.47876 2.97363 5.47475 2.97363 5.47074 2.97344ZM5.20491 6.34935C5.13745 6.64873 4.91429 6.85985 4.61109 6.89574C4.53926 6.91002 3.96951 7.04021 3.42492 7.68236C3.99139 7.82518 4.64719 8.11265 5.1597 8.68614C5.34038 8.88847 5.39325 9.17503 5.2968 9.42881C5.13326 9.85948 4.92359 10.4687 4.74984 11.0594C4.75513 12.0005 4.99597 12.6947 5.40145 12.9261C5.67712 13.0834 5.93164 12.9626 6.02809 12.903C6.29537 12.739 6.44524 12.4191 6.42919 12.0474C6.41844 11.7995 6.53476 11.5633 6.73731 11.4214C6.94006 11.2795 7.20096 11.2513 7.42886 11.3472C7.78274 11.4937 8.92206 11.8255 9.47212 11.4316C9.74633 11.2353 9.84606 10.8398 9.8694 10.446C9.36528 10.2202 8.94303 9.96348 8.63089 9.68425C8.4772 9.54673 8.38932 9.3499 8.38932 9.14335C8.38914 8.93663 8.47702 8.73979 8.63053 8.60228C9.09362 8.18718 9.35926 7.59245 9.35926 6.97044C9.35926 5.7647 8.38257 4.78399 7.18218 4.78399C6.52455 4.78399 6.01679 5.02477 5.6299 5.51989C5.32688 5.9077 5.21403 6.31493 5.20491 6.34935ZM6.42847 6.78564C6.41096 6.39416 6.77269 6.06091 7.15009 6.06091C7.55484 6.06091 7.85439 6.39288 7.8719 6.78564C7.88922 7.17712 7.52767 7.51056 7.15009 7.51056C6.74552 7.51056 6.44597 7.1784 6.42847 6.78564Z" fill="currentColor"/>
  </g>
</svg>