<svg width="14" height="14" viewBox="0 0 14 14" fill="none" xmlns="http://www.w3.org/2000/svg">
<path d="M12.9997 7C12.8229 7 12.6533 7.07024 12.5283 7.19526C12.4032 7.32029 12.333 7.48986 12.333 7.66667V11.6667C12.333 11.8435 12.2628 12.013 12.1377 12.1381C12.0127 12.2631 11.8432 12.3333 11.6663 12.3333H2.33301C2.1562 12.3333 1.98663 12.2631 1.8616 12.1381C1.73658 12.013 1.66634 11.8435 1.66634 11.6667V2.33333C1.66634 2.15652 1.73658 1.98695 1.8616 1.86193C1.98663 1.7369 2.1562 1.66667 2.33301 1.66667H6.33301C6.50982 1.66667 6.67939 1.59643 6.80441 1.4714C6.92944 1.34638 6.99967 1.17681 6.99967 1C6.99967 0.823189 6.92944 0.65362 6.80441 0.528595C6.67939 0.403571 6.50982 0.333333 6.33301 0.333333H2.33301C1.80257 0.333333 1.29387 0.544047 0.918794 0.91912C0.543722 1.29419 0.333008 1.8029 0.333008 2.33333V11.6667C0.333008 12.1971 0.543722 12.7058 0.918794 13.0809C1.29387 13.456 1.80257 13.6667 2.33301 13.6667H11.6663C12.1968 13.6667 12.7055 13.456 13.0806 13.0809C13.4556 12.7058 13.6663 12.1971 13.6663 11.6667V7.66667C13.6663 7.48986 13.5961 7.32029 13.4711 7.19526C13.3461 7.07024 13.1765 7 12.9997 7ZM2.99967 7.50667V10.3333C2.99967 10.5101 3.06991 10.6797 3.19494 10.8047C3.31996 10.9298 3.48953 11 3.66634 11H6.49301C6.58075 11.0005 6.66772 10.9837 6.74895 10.9505C6.83017 10.9173 6.90405 10.8685 6.96634 10.8067L11.5797 6.18667L13.473 4.33333C13.5355 4.27136 13.5851 4.19762 13.6189 4.11638C13.6528 4.03515 13.6702 3.94801 13.6702 3.86C13.6702 3.77199 13.6528 3.68485 13.6189 3.60362C13.5851 3.52238 13.5355 3.44864 13.473 3.38667L10.6463 0.526667C10.5844 0.464181 10.5106 0.414585 10.4294 0.380739C10.3482 0.346893 10.261 0.329468 10.173 0.329468C10.085 0.329468 9.99786 0.346893 9.91662 0.380739C9.83538 0.414585 9.76165 0.464181 9.69967 0.526667L7.81967 2.41333L3.19301 7.03333C3.13122 7.09563 3.08234 7.1695 3.04916 7.25073C3.01598 7.33195 2.99917 7.41893 2.99967 7.50667ZM10.173 1.94L12.0597 3.82667L11.113 4.77333L9.22634 2.88667L10.173 1.94ZM4.33301 7.78L8.28634 3.82667L10.173 5.71333L6.21967 9.66667H4.33301V7.78Z" fill="white"/>
</svg>
