<svg width="14" height="14" viewBox="0 0 14 14" fill="none" xmlns="http://www.w3.org/2000/svg">
<path d="M8.8135 4.85998L5.9535 7.72665L4.8535 6.62665C4.79373 6.55686 4.72019 6.50018 4.63748 6.46016C4.55477 6.42015 4.46468 6.39766 4.37287 6.39411C4.28106 6.39057 4.1895 6.40604 4.10395 6.43956C4.0184 6.47307 3.9407 6.52391 3.87573 6.58888C3.81076 6.65385 3.75992 6.73155 3.72641 6.8171C3.69289 6.90265 3.67742 6.9942 3.68097 7.08602C3.68451 7.17783 3.707 7.26792 3.74702 7.35063C3.78703 7.43334 3.84371 7.50688 3.9135 7.56665L5.48017 9.13998C5.54246 9.20177 5.61634 9.25065 5.69756 9.28383C5.77879 9.317 5.86576 9.33382 5.9535 9.33331C6.12839 9.33258 6.29599 9.26314 6.42017 9.13998L9.7535 5.80665C9.81598 5.74467 9.86558 5.67094 9.89943 5.5897C9.93327 5.50846 9.9507 5.42132 9.9507 5.33331C9.9507 5.24531 9.93327 5.15817 9.89943 5.07693C9.86558 4.99569 9.81598 4.92196 9.7535 4.85998C9.62859 4.73581 9.45962 4.66612 9.2835 4.66612C9.10738 4.66612 8.93841 4.73581 8.8135 4.85998ZM7.00017 0.333313C5.68162 0.333313 4.39269 0.724306 3.29636 1.45685C2.20004 2.18939 1.34555 3.23058 0.840969 4.44876C0.336385 5.66693 0.204362 7.00738 0.461597 8.30058C0.718832 9.59379 1.35377 10.7817 2.28612 11.714C3.21847 12.6464 4.40636 13.2813 5.69956 13.5385C6.99277 13.7958 8.33322 13.6638 9.55139 13.1592C10.7696 12.6546 11.8108 11.8001 12.5433 10.7038C13.2758 9.60745 13.6668 8.31852 13.6668 6.99998C13.6668 6.1245 13.4944 5.25759 13.1594 4.44876C12.8243 3.63992 12.3333 2.90499 11.7142 2.28593C11.0952 1.66688 10.3602 1.17581 9.55139 0.840783C8.74255 0.505751 7.87565 0.333313 7.00017 0.333313ZM7.00017 12.3333C5.94533 12.3333 4.91419 12.0205 4.03712 11.4345C3.16006 10.8484 2.47648 10.0155 2.07281 9.04096C1.66914 8.06642 1.56352 6.99406 1.76931 5.9595C1.9751 4.92493 2.48305 3.97462 3.22893 3.22874C3.97481 2.48286 4.92512 1.97491 5.95968 1.76912C6.99425 1.56334 8.06661 1.66895 9.04114 2.07262C10.0157 2.47629 10.8486 3.15988 11.4347 4.03694C12.0207 4.914 12.3335 5.94515 12.3335 6.99998C12.3335 8.41447 11.7716 9.77102 10.7714 10.7712C9.77121 11.7714 8.41465 12.3333 7.00017 12.3333Z" fill="white"/>
</svg>
