<svg width="375" height="169" viewBox="0 0 375 169" fill="none" xmlns="http://www.w3.org/2000/svg">
<g style="mix-blend-mode:color-burn">
<path d="M329.075 152.57L302.411 167.973L275.748 152.57V121.764L287.313 115.09L302.411 106.361L329.075 121.764V152.57ZM261.87 113.228L248.506 105.527V74.7209L261.87 67.0194L275.234 59.3179L301.897 74.7209V105.527L288.534 113.228L275.17 120.93L261.87 113.228ZM330.039 152.057V121.187L302.861 105.527V74.2074L275.684 58.5477V27.2283L248.057 11.3119L220.429 27.2283V58.5477L193.252 74.2074V105.527L166.074 121.187V152.185H-18V153.084H166.203L193.766 169L220.943 153.34L248.121 169L275.298 153.34L302.476 169L330.103 153.084V153.019H370.516V152.121H330.039V152.057ZM221.393 27.806L248.057 12.403L274.72 27.806V58.6119L266.56 63.3612L248.057 74.0149L228.075 62.4627L221.393 58.6119V27.806ZM220.429 152.57L193.766 167.973L167.102 152.57V121.764L193.766 106.361L208.864 115.09L220.429 121.764V152.57ZM207.579 113.228L194.216 105.527V74.7209L220.879 59.3179L236.042 68.1104L247.543 74.7209V105.527L236.106 112.201L220.943 120.994L207.579 113.228ZM274.784 152.57L248.121 167.973L221.457 152.57V121.764L228.139 117.913L248.121 106.361L266.625 117.015L274.784 121.764V152.57Z" fill="white"/>
<path d="M329.203 152.378L302.54 167.781L275.876 152.378V121.572L287.441 114.897L302.54 106.169L329.203 121.572V152.378ZM262.063 113.1L248.699 105.399V74.5925L262.063 66.8911L275.427 59.1896L302.09 74.5925V105.399L288.726 113.1L275.362 120.801L262.063 113.1ZM330.167 151.928V121.058L302.99 105.399V74.0791L275.812 58.4194V27.1L248.185 11.1836L220.558 27.1V58.4194L193.38 74.0791V105.399L166.203 121.058V152.057H-17.8715V152.955H166.396L193.959 168.872L221.136 153.212L248.313 168.872L275.491 153.212L302.668 168.872L330.296 152.955V152.891H370.708V151.993H330.167V151.928ZM221.521 27.6776L248.185 12.2746L274.848 27.6776V58.4836L266.689 63.2328L248.185 73.8866L228.203 62.3343L221.521 58.4836V27.6776ZM220.622 152.378L193.959 167.781L167.295 152.378V121.572L193.959 106.169L209.057 114.897L220.622 121.572V152.378ZM207.708 113.1L194.344 105.399V74.5925L221.008 59.1896L236.17 67.9821L247.671 74.5925V105.399L236.17 112.009L221.008 120.801L207.708 113.1ZM274.913 152.378L248.249 167.781L221.586 152.378V121.572L228.268 117.721L248.249 106.169L266.753 116.822L274.913 121.572V152.378Z" fill="#FEFEFE"/>
<path d="M329.332 152.249L302.668 167.652L276.005 152.249V121.443L287.57 114.769L302.668 106.04L329.332 121.443V152.249ZM262.191 112.972L248.827 105.27V74.4642L262.191 66.7627L275.555 59.0612L302.219 74.4642V105.27L288.855 112.972L275.491 120.673L262.191 112.972ZM330.296 151.8V120.93L303.118 105.27V73.9507L276.005 58.291V26.9716L248.378 11.0552L220.75 26.9716V58.291L193.573 73.9507V105.27L166.396 120.93V151.928H-17.743V152.827H166.46L194.023 168.743L221.2 153.084L248.378 168.743L275.555 153.084L302.733 168.743L330.36 152.827V152.763H370.708V151.864H330.296V151.8ZM221.65 27.5492L248.313 12.1463L274.977 27.5492V58.3552L266.817 63.1045L248.378 73.694L228.396 62.1418L221.714 58.291V27.5492H221.65ZM220.75 152.249L194.087 167.652L167.424 152.249V121.443L194.087 106.04L209.186 114.769L220.75 121.443V152.249ZM207.836 112.972L194.472 105.27V74.4642L221.136 59.0612L236.299 67.8537L247.799 74.4642V105.27L236.427 111.881L221.264 120.673L207.836 112.972ZM275.041 152.249L248.378 167.652L221.714 152.249V121.443L228.396 117.593L248.378 106.04L266.881 116.694L275.041 121.443V152.249Z" fill="#FDFDFD"/>
<path d="M329.525 152.121L302.861 167.524L276.198 152.121V121.315L287.763 114.64L302.861 105.912L329.525 121.315V152.121ZM262.32 112.843L248.956 105.142V74.3358L262.32 66.6343L275.684 58.9328L302.347 74.3358V105.142L288.983 112.843L275.619 120.545L262.32 112.843ZM330.424 151.672V120.801L303.311 105.142V73.8224L276.133 58.1627V26.8433L248.506 10.9269L220.879 26.8433V58.1627L193.702 73.8224V105.142L166.524 120.801V151.8H-17.5503V152.699H166.653L194.215 168.615L221.393 152.955L248.57 168.615L275.748 152.955L302.925 168.615L330.553 152.699V152.634H370.965V151.736H330.424V151.672ZM221.843 27.3567L248.506 11.9537L275.17 27.3567V58.1627L267.01 62.9119L248.506 73.5657L228.525 62.0134L221.843 58.1627V27.3567ZM220.879 152.121L194.215 167.524L167.552 152.121V121.315L194.215 105.912L209.314 114.64L220.879 121.315V152.121ZM208.029 112.843L194.665 105.142V74.3358L221.329 58.9328L236.492 67.7254L247.992 74.3358V105.142L236.492 111.752L221.329 120.545L208.029 112.843ZM275.17 152.121L248.506 167.524L221.843 152.121V121.315L228.525 117.464L248.506 105.912L267.01 116.566L275.17 121.315V152.121Z" fill="#FCFCFC"/>
<path d="M329.653 151.993L302.99 167.396L276.262 151.993V121.187L287.827 114.512L302.925 105.784L329.589 121.187V151.993H329.653ZM262.448 112.715L249.084 105.013V74.2075L262.448 66.506L275.812 58.8045L302.476 74.2075V105.013L289.112 112.715L275.748 120.416L262.448 112.715ZM330.553 151.543V120.673L303.375 105.013V73.694L276.262 58.0343V26.7149L248.635 10.7985L221.008 26.7149V58.0343L193.894 73.694V105.013L166.717 120.673V151.672H-17.4218V152.57H166.781L194.344 168.487L221.521 152.827L248.699 168.487L275.876 152.827L303.054 168.487L330.681 152.57V152.506H371.094V151.607H330.553V151.543ZM221.971 27.2284L248.635 11.8254L275.298 27.2284V58.0343L267.139 62.7836L248.635 73.4373L228.653 61.8851L221.971 58.0343V27.2284ZM221.008 151.993L194.344 167.396L167.681 151.993V121.187L194.344 105.784L209.443 114.512L221.008 121.187V151.993ZM208.158 112.715L194.794 105.013V74.2075L221.457 58.8045L236.62 67.597L248.121 74.2075V105.013L236.62 111.624L221.457 120.416L208.158 112.715ZM275.298 151.993L248.635 167.396L221.971 151.993V121.187L228.653 117.336L248.635 105.784L267.139 116.437L275.298 121.187V151.993Z" fill="#FBFBFB"/>
<path d="M329.782 151.864L303.118 167.267L276.455 151.864V121.058L288.02 114.384L303.118 105.655L329.782 121.058V151.864ZM262.577 112.522L249.213 104.821V74.0149L262.577 66.3134L275.941 58.6119L302.604 74.0149V104.821L289.24 112.522L275.876 120.224L262.577 112.522ZM330.745 151.415V120.545L303.568 104.885V73.5657L276.39 57.906V26.5866L248.763 10.6701L221.136 26.5866V57.906L194.023 73.5657V104.885L166.845 120.545V151.543H-17.2933V152.442H166.91L194.473 168.358L221.65 152.634L248.827 168.294L276.005 152.634L303.182 168.294L330.81 152.378V152.313H371.222V151.415H330.745ZM222.1 27.1L248.763 11.697L275.427 27.1V57.906L267.267 62.6552L248.763 73.3089L228.782 61.7567L222.1 57.906V27.1ZM221.136 151.864L194.473 167.267L167.809 151.864V121.058L194.473 105.655L209.571 114.384L221.136 121.058V151.864ZM208.286 112.522L194.922 104.821V74.0149L221.586 58.6119L236.749 67.4045L248.249 74.0149V104.821L236.749 111.431L221.65 120.224L208.286 112.522ZM275.491 151.864L248.827 167.267L222.164 151.864V121.058L228.846 117.207L248.827 105.655L267.331 116.309L275.491 121.058V151.864Z" fill="#FAFAFA"/>
<path d="M329.91 151.672L303.247 167.075L276.583 151.672V120.866L288.148 114.191L303.247 105.463L329.91 120.866V151.672ZM262.77 112.394L249.406 104.693V73.8866L262.77 66.1851L276.133 58.4836L302.797 73.8866V104.693L289.433 112.394L276.069 120.096L262.77 112.394ZM330.874 151.222V120.352L303.696 104.693V73.3731L276.519 57.7134V26.394L248.892 10.4776L221.265 26.394V57.7134L194.087 73.3731V104.693L166.91 120.352V151.351H-17.1647V152.249H167.038L194.601 168.166L221.779 152.506L248.956 168.166L276.133 152.506L303.311 168.166L330.938 152.249V152.185H371.351V151.287H330.874V151.222ZM222.228 26.9716L248.892 11.5687L275.555 26.9716V57.7776L267.396 62.5269L248.892 73.1806L228.91 61.6284L222.228 57.7776V26.9716ZM221.329 151.672L194.665 167.075L168.002 151.672V120.866L194.665 105.463L209.764 114.191L221.329 120.866V151.672ZM208.415 112.394L195.051 104.693V73.8866L221.714 58.4836L236.877 67.2761L248.378 73.8866V104.693L236.877 111.303L221.714 120.096L208.415 112.394ZM275.619 151.672L248.956 167.075L222.293 151.672V120.866L228.974 117.015L248.956 105.463L267.46 116.116L275.619 120.866V151.672Z" fill="#F9F9F9"/>
<path d="M330.039 151.543L303.375 166.946L276.712 151.543V120.737L288.277 114.063L303.375 105.334L330.039 120.737V151.543ZM262.898 112.266L249.534 104.564V73.7582L262.898 66.0567L276.262 58.3552L302.925 73.7582V104.564L289.561 112.266L276.198 119.967L262.898 112.266ZM331.002 151.094V120.224L303.825 104.564V73.2448L276.647 57.5851V26.2657L249.02 10.3492L221.393 26.2657V57.5851L194.215 73.2448V104.564L167.038 120.224V151.222H-17.0363V152.121H167.167L194.729 168.037L221.907 152.378L249.084 168.037L276.262 152.378L303.439 168.037L331.067 152.121V151.993H371.479V151.094H331.002ZM222.357 26.8433L249.02 11.4403L275.684 26.8433V57.6492L267.524 62.3985L249.02 73.0522L229.039 61.5L222.357 57.6492V26.8433ZM221.457 151.543L194.794 166.946L168.13 151.543V120.737L194.794 105.334L209.892 114.063L221.457 120.737V151.543ZM208.543 112.266L195.179 104.564V73.7582L221.843 58.3552L237.006 67.1477L248.506 73.7582V104.564L237.07 111.175L221.907 119.967L208.543 112.266ZM275.748 151.543L249.084 166.946L222.421 151.543V120.737L229.103 116.887L249.084 105.334L267.588 115.988L275.748 120.737V151.543Z" fill="#F8F8F8"/>
<path d="M330.167 151.415L303.504 166.818L276.84 151.415V120.609L288.405 113.934L303.504 105.206L330.167 120.609V151.415ZM263.027 112.137L249.663 104.436V73.6298L263.027 65.9283L276.39 58.2268L303.054 73.6298V104.436L289.69 112.137L276.326 119.839L263.027 112.137ZM331.131 150.966V120.095L303.953 104.436V73.1164L276.776 57.4567V26.1373L249.149 10.2209L221.521 26.1373V57.4567L194.344 73.1164V104.436L167.167 120.095V151.094H-16.9078V151.992H167.295L194.858 167.909L222.035 152.249L249.213 167.909L276.39 152.249L303.568 167.909L331.195 151.992V151.928H371.608V151.03H331.131V150.966ZM222.549 26.6507L249.213 11.2478L275.876 26.6507V57.4567L267.717 62.206L249.213 72.8597L229.231 61.3074L222.549 57.4567V26.6507ZM221.586 151.415L194.922 166.818L168.259 151.415V120.609L194.922 105.206L210.021 113.934L221.586 120.609V151.415ZM208.736 112.137L195.372 104.436V73.6298L222.035 58.2268L237.198 67.0194L248.699 73.6298V104.436L237.198 111.046L222.035 119.839L208.736 112.137ZM275.876 151.415L249.213 166.818L222.549 151.415V120.609L229.231 116.758L249.213 105.206L267.717 115.86L275.876 120.609V151.415Z" fill="#F7F7F7"/>
<path d="M330.36 151.287L303.696 166.69L277.033 151.287V120.481L288.598 113.806L303.696 105.078L330.36 120.481V151.287ZM263.155 112.009L249.791 104.307V73.5015L263.155 65.8L276.519 58.0985L303.182 73.5015V104.307L289.819 112.009L276.455 119.71L263.155 112.009ZM331.259 150.837V119.967L304.082 104.307V72.988L276.904 57.3283V26.0089L249.277 10.0925L221.65 26.0089V57.3283L194.473 72.988V104.307L167.295 119.967V150.966H-16.715V151.864H167.488L195.051 167.781L222.228 152.121L249.406 167.781L276.583 152.121L303.761 167.781L331.388 151.864V151.8H371.801V150.901H331.259V150.837ZM222.678 26.5224L249.341 11.1194L276.005 26.5224V57.3283L267.845 62.0776L249.341 72.7313L229.36 61.1791L222.678 57.3283V26.5224ZM221.714 151.287L195.051 166.69L168.387 151.287V120.481L195.051 105.078L210.149 113.806L221.714 120.481V151.287ZM208.864 112.009L195.501 104.307V73.5015L222.164 58.0985L237.327 66.891L248.827 73.5015V104.307L237.391 110.918L222.228 119.71L208.864 112.009ZM276.005 151.287L249.341 166.69L222.678 151.287V120.481L229.36 116.63L249.341 105.078L267.845 115.731L276.005 120.481V151.287Z" fill="#F6F6F6"/>
<path d="M330.488 151.158L303.825 166.561L277.161 151.158V120.352L288.726 113.678L303.825 104.949L330.488 120.352V151.158ZM263.284 111.881L249.92 104.179V73.3731L263.284 65.6717L276.647 57.9702L303.311 73.3731V104.179L289.947 111.881L276.583 119.582L263.284 111.881ZM331.452 150.709V119.839L304.275 104.179V72.8597L277.097 57.2V25.8806L249.47 9.96419L221.843 25.8806V57.2L194.665 72.8597V104.179L167.488 119.839V150.837H-16.5865V151.736H167.616L195.179 167.652L222.357 151.993L249.534 167.652L276.712 151.993L303.889 167.652L331.516 151.736V151.672H371.929V150.709H331.452ZM222.806 26.394L249.47 10.9911L276.133 26.394V57.2L267.974 61.9493L249.47 72.603L229.488 61.0508L222.806 57.2V26.394ZM221.843 151.158L195.179 166.561L168.516 151.158V120.352L195.179 104.949L210.278 113.678L221.843 120.352V151.158ZM208.993 111.881L195.629 104.179V73.3731L222.292 57.9702L237.455 66.7627L248.956 73.3731V104.179L237.455 110.79L222.292 119.582L208.993 111.881ZM276.198 151.158L249.534 166.561L222.871 151.158V120.352L229.553 116.502L249.534 104.949L268.038 115.603L276.198 120.352V151.158Z" fill="#F5F5F5"/>
<path d="M330.617 151.03L303.953 166.433L277.29 151.03V120.224L288.855 113.549L303.953 104.821L330.617 120.224V151.03ZM263.412 111.688L250.048 103.987V73.1806L263.412 65.4791L276.776 57.7776L303.439 73.1806V103.987L290.076 111.688L276.712 119.39L263.412 111.688ZM331.581 150.516V119.646L304.403 103.987V72.6672L277.226 57.0075V25.6881L249.598 9.77164L221.971 25.6881V57.0075L194.794 72.6672V103.987L167.681 119.71V150.709H-16.458V151.607H167.745L195.308 167.524L222.485 151.864L249.663 167.524L276.84 151.864L304.018 167.524L331.645 151.607V151.543H372.058V150.645H331.581V150.516ZM222.935 26.2657L249.598 10.8627L276.262 26.2657V57.0716L268.102 61.8209L249.598 72.4104L229.617 60.8582L222.935 57.0075V26.2657ZM221.971 151.03L195.308 166.433L168.644 151.03V120.224L195.308 104.821L210.406 113.549L221.971 120.224V151.03ZM209.121 111.688L195.758 103.987V73.1806L222.421 57.7776L237.584 66.5701L249.084 73.1806V103.987L237.584 110.597L222.421 119.39L209.121 111.688ZM276.326 151.03L249.663 166.433L222.999 151.03V120.224L229.681 116.373L249.663 104.821L268.167 115.475L276.326 120.224V151.03Z" fill="#F4F4F4"/>
<path d="M330.745 150.837L304.082 166.24L277.418 150.837V120.031L288.983 113.357L304.082 104.628L330.745 120.031V150.837ZM263.605 111.56L250.241 103.858V73.0522L263.605 65.3507L276.969 57.6492L303.632 73.0522V103.858L290.268 111.56L276.904 119.261L263.605 111.56ZM331.709 150.388V119.518L304.532 103.858V72.5388L277.354 56.8791V25.5597L249.727 9.64326L222.1 25.5597V56.8791L194.922 72.5388V103.858L167.745 119.518V150.516H-16.3295V151.415H167.873L195.436 167.331L222.614 151.672L249.791 167.331L276.969 151.672L304.146 167.331L331.773 151.415V151.351H372.186V150.452H331.709V150.388ZM223.063 26.1373L249.727 10.7343L276.39 26.1373V56.9433L268.231 61.6925L249.727 72.3462L229.745 60.794L223.063 56.9433V26.1373ZM222.164 150.837L195.501 166.24L168.837 150.837V120.031L195.501 104.628L210.599 113.357L222.164 120.031V150.837ZM209.25 111.56L195.95 103.858V73.0522L222.614 57.6492L237.777 66.4418L249.277 73.0522V103.858L237.777 110.469L222.614 119.261L209.25 111.56ZM276.455 150.837L249.791 166.24L223.128 150.837V120.031L229.81 116.181L249.791 104.628L268.295 115.282L276.455 120.031V150.837Z" fill="#F3F3F3"/>
<path d="M330.874 150.709L304.21 166.112L277.547 150.709V119.903L289.112 113.228L304.21 104.5L330.874 119.903V150.709ZM263.733 111.431L250.37 103.73V72.9239L263.733 65.2224L277.097 57.5209L303.761 72.9239V103.73L290.397 111.431L277.033 119.133L263.733 111.431ZM331.838 150.26V119.39L304.66 103.73V72.4105L277.547 56.7508V25.4314L249.92 9.51494L222.293 25.4314V56.7508L195.115 72.4105V103.73L167.938 119.39V150.388H-16.201V151.287H168.002L195.565 167.203L222.742 151.543L249.92 167.203L277.097 151.543L304.275 167.203L331.902 151.287V151.222H372.315V150.324H331.838V150.26ZM223.256 26.009L249.92 10.606L276.583 26.009V56.8149L268.424 61.5642L249.92 72.1538L229.938 60.6015L223.256 56.7508V26.009ZM222.293 150.709L195.629 166.112L168.966 150.709V119.903L195.629 104.5L210.728 113.228L222.293 119.903V150.709ZM209.443 111.431L196.079 103.73V72.9239L222.742 57.5209L237.905 66.3134L249.406 72.9239V103.73L237.905 110.34L222.742 119.133L209.443 111.431ZM276.583 150.709L249.92 166.112L223.256 150.709V119.903L229.938 116.052L249.92 104.5L268.424 115.154L276.583 119.903V150.709Z" fill="#F2F2F2"/>
<path d="M331.067 150.581L304.403 165.984L277.74 150.581V119.775L289.305 113.1L304.403 104.372L331.067 119.775V150.581ZM263.862 111.303L250.498 103.601V72.7955L263.862 65.094L277.226 57.3925L303.889 72.7955V103.601L290.525 111.303L277.161 119.004L263.862 111.303ZM331.966 150.131V119.261L304.789 103.601V72.2821L277.611 56.6224V25.303L249.984 9.38657L222.357 25.303V56.6224L195.179 72.2821V103.601L168.13 119.261V150.26H-16.0083V151.158H168.195L195.757 167.075L222.935 151.415L250.112 167.075L277.29 151.415L304.467 167.075L332.095 151.158V151.094H372.507V150.196H331.966V150.131ZM223.385 25.8164L250.048 10.4134L276.712 25.8164V56.6224L268.552 61.3716L250.048 72.0254L230.067 60.4731L223.385 56.6224V25.8164ZM222.421 150.581L195.757 165.984L169.094 150.581V119.775L195.757 104.372L210.856 113.1L222.421 119.775V150.581ZM209.571 111.303L196.207 103.601V72.7955L222.871 57.3925L238.034 66.1851L249.534 72.7955V103.601L238.034 110.212L222.871 119.004L209.571 111.303ZM276.712 150.581L250.048 165.984L223.385 150.581V119.775L230.067 115.924L250.048 104.372L268.552 115.025L276.712 119.775V150.581Z" fill="#F1F1F1"/>
<path d="M331.195 150.452L304.532 165.855L277.868 150.452V119.646L289.433 112.972L304.532 104.243L331.195 119.646V150.452ZM263.99 111.175L250.626 103.473V72.6671L263.99 64.9657L277.354 57.2642L304.018 72.6671V103.473L290.654 111.175L277.29 118.876L263.99 111.175ZM332.095 150.003V119.133L304.917 103.473V72.1537L277.74 56.494V25.1746L250.112 9.25821L222.485 25.1746V56.494L195.308 72.1537V103.473L168.13 119.133V150.131H-15.8798V151.03H168.323L195.886 166.946L223.064 151.287L250.241 166.946L277.418 151.287L304.596 166.946L332.223 151.03V150.966H372.636V150.067H332.095V150.003ZM223.513 25.6881L250.177 10.2851L276.84 25.6881V56.494L268.681 61.2433L250.177 71.897L230.195 60.3448L223.513 56.494V25.6881ZM222.55 150.452L195.886 165.855L169.223 150.452V119.646L195.886 104.243L210.985 112.972L222.55 119.646V150.452ZM209.7 111.175L196.336 103.473V72.6671L222.999 57.2642L238.162 66.0567L249.663 72.6671V103.473L238.162 110.084L222.999 118.876L209.7 111.175ZM276.84 150.452L250.177 165.855L223.513 150.452V119.646L230.195 115.796L250.177 104.243L268.681 114.897L276.84 119.646V150.452Z" fill="#F0F0F0"/>
<path d="M331.324 150.324L304.66 165.727L277.997 150.324V119.518L289.562 112.843L304.66 104.115L331.324 119.518V150.324ZM264.119 110.982L250.755 103.281V72.4746L264.119 64.7731L277.483 57.0716L304.146 72.4746V103.281L290.782 110.982L277.418 118.684L264.119 110.982ZM332.287 149.81V118.94L305.11 103.281V71.9612L277.932 56.3657V25.0463L250.305 9.12985L222.678 25.0463V56.3657L195.501 72.0254V103.345L168.323 119.004V150.003H-15.7513V150.901H168.452L196.015 166.818L223.192 151.158L250.369 166.818L277.547 151.158L304.724 166.818L332.352 150.901V150.837H372.636V149.939H332.287V149.81ZM223.642 25.5597L250.305 10.1567L276.969 25.5597V56.3657L268.809 61.1149L250.305 71.7687L230.324 60.2164L223.642 56.3657V25.5597ZM222.678 150.324L196.015 165.727L169.351 150.324V119.518L196.015 104.115L211.113 112.843L222.678 119.518V150.324ZM209.828 110.982L196.464 103.281V72.4746L223.128 57.0716L238.291 65.8642L249.791 72.4746V103.281L238.355 109.955L223.192 118.748L209.828 110.982ZM277.033 150.324L250.369 165.727L223.706 150.324V119.518L230.388 115.667L250.369 104.115L268.873 114.769L277.033 119.518V150.324Z" fill="#EFEFEF"/>
<path d="M331.452 150.131L304.789 165.534L278.125 150.131V119.325L289.69 112.651L304.789 103.922L331.452 119.325V150.131ZM264.312 110.854L250.948 103.152V72.3463L264.312 64.6448L277.675 56.9433L304.339 72.3463V103.152L290.975 110.854L277.611 118.555L264.312 110.854ZM332.416 149.682V118.812L305.238 103.152V71.8328L278.061 56.1731V24.8537L250.434 8.93732L222.806 24.8537V56.1731L195.629 71.8328V103.152L168.452 118.812V149.81H-15.6228V150.709H168.58L196.143 166.625L223.32 150.966L250.498 166.625L277.675 150.966L304.853 166.625L332.48 150.709V150.645H372.893V149.746H332.416V149.682ZM223.77 25.4313L250.434 10.0284L277.097 25.4313V56.2373L268.938 60.9866L250.434 71.6403L230.452 60.0881L223.77 56.2373V25.4313ZM222.871 150.131L196.207 165.534L169.544 150.131V119.325L196.207 103.922L211.306 112.651L222.871 119.325V150.131ZM209.957 110.854L196.593 103.152V72.3463L223.256 56.9433L238.419 65.7358L249.92 72.3463V103.152L238.419 109.763L223.256 118.555L209.957 110.854ZM277.161 150.131L250.498 165.534L223.834 150.131V119.325L230.516 115.475L250.498 103.922L269.002 114.576L277.161 119.325V150.131Z" fill="#EEEEEE"/>
<path d="M331.581 150.003L304.917 165.406L278.254 150.003V119.197L289.819 112.522L304.917 103.794L331.581 119.197V150.003ZM264.44 110.725L251.076 103.024V72.2179L264.44 64.5164L277.804 56.8149L304.467 72.2179V103.024L291.104 110.725L277.74 118.427L264.44 110.725ZM332.544 149.554V118.684L305.367 103.024V71.7045L278.189 56.0448V24.7254L250.562 8.80896L222.935 24.7254V56.0448L195.758 71.7045V103.024L168.58 118.684V149.682H-15.4943V150.581H168.709L196.272 166.497L223.449 150.837L250.626 166.497L277.804 150.837L304.981 166.497L332.609 150.581V150.516H373.021V149.618H332.544V149.554ZM223.899 25.303L250.562 9.9L277.226 25.303V56.109L269.066 60.8582L250.562 71.5119L230.581 59.9597L223.899 56.109V25.303ZM222.999 150.003L196.336 165.406L169.672 150.003V119.197L196.336 103.794L211.434 112.522L222.999 119.197V150.003ZM210.085 110.725L196.721 103.024V72.2179L223.385 56.8149L238.548 65.6075L250.048 72.2179V103.024L238.676 109.634L223.513 118.427L210.085 110.725ZM277.29 150.003L250.626 165.406L223.963 150.003V119.197L230.645 115.346L250.626 103.794L269.13 114.448L277.29 119.197V150.003Z" fill="#EDEDED"/>
<path d="M331.709 149.875L305.046 165.278L278.382 149.875V119.069L289.947 112.394L305.046 103.666L331.709 119.069V149.875ZM264.569 110.597L251.205 102.896V72.0895L264.569 64.388L277.932 56.6866L304.596 72.0895V102.896L291.232 110.597L277.868 118.298L264.569 110.597ZM332.673 149.425V118.555L305.495 102.896V71.5761L278.318 55.9164V24.597L250.691 8.68059L223.063 24.597V55.9164L195.95 71.5761V102.896L168.773 118.555V149.554H-15.3658V150.452H168.837L196.4 166.369L223.577 150.709L250.755 166.369L277.932 150.709L305.11 166.369L332.737 150.452V150.388H373.15V149.425H332.673ZM224.091 25.1104L250.755 9.70745L277.418 25.1104V55.9164L269.259 60.6657L250.755 71.3194L230.773 59.7672L224.091 55.9164V25.1104ZM223.128 149.875L196.464 165.278L169.801 149.875V119.069L196.464 103.666L211.563 112.394L223.128 119.069V149.875ZM210.278 110.597L196.914 102.896V72.0895L223.577 56.6866L238.74 65.4791L250.241 72.0895V102.896L238.74 109.506L223.577 118.298L210.278 110.597ZM277.418 149.875L250.755 165.278L224.091 149.875V119.069L230.773 115.218L250.755 103.666L269.259 114.319L277.418 119.069V149.875Z" fill="#ECECEC"/>
<path d="M331.902 149.746L305.238 165.149L278.575 149.746V118.94L290.14 112.266L305.238 103.537L331.902 118.94V149.746ZM264.697 110.469L251.333 102.767V71.9612L264.697 64.2597L278.061 56.5582L304.724 71.9612V102.767L291.361 110.469L277.997 118.17L264.697 110.469ZM332.801 149.297V118.427L305.624 102.767V71.4477L278.446 55.788V24.4686L250.819 8.55223L223.192 24.4686V55.788L196.015 71.4477V102.767L168.966 118.427V149.425H-15.173V150.324H169.03L196.593 166.24L223.77 150.581L250.948 166.24L278.125 150.581L305.303 166.24L332.93 150.324V150.26H373.343V149.361H332.801V149.297ZM224.22 24.9821L250.883 9.5791L277.547 24.9821V55.788L269.387 60.5373L250.883 71.191L230.902 59.6388L224.22 55.788V24.9821ZM223.256 149.746L196.593 165.149L169.929 149.746V118.94L196.593 103.537L211.691 112.266L223.256 118.94V149.746ZM210.406 110.469L197.042 102.767V71.9612L223.706 56.5582L238.869 65.3507L250.369 71.9612V102.767L238.869 109.378L223.706 118.17L210.406 110.469ZM277.547 149.746L250.883 165.149L224.22 149.746V118.94L230.902 115.09L250.883 103.537L269.387 114.191L277.547 118.94V149.746Z" fill="#EBEBEB"/>
<path d="M332.03 149.618L305.367 165.021L278.703 149.618V118.812L290.268 112.137L305.367 103.409L332.03 118.812V149.618ZM264.826 110.34L251.462 102.639V71.8328L264.826 64.1313L278.189 56.4298L304.853 71.8328V102.639L291.489 110.34L278.189 117.978L264.826 110.34ZM332.994 149.169V118.299L305.817 102.639V71.3194L278.639 55.6597V24.3403L251.012 8.42387L223.385 24.3403V55.6597L196.207 71.3194V102.639L169.03 118.299V149.297H-15.0446V150.196H169.158L196.721 166.112L223.899 150.452L251.076 166.112L278.254 150.452L305.431 166.112L333.058 150.196V150.067H373.471V149.169H332.994ZM224.348 24.8537L251.012 9.45074L277.675 24.8537V55.6597L269.516 60.4089L251.012 71.0627L231.03 59.5104L224.348 55.6597V24.8537ZM223.385 149.618L196.721 165.021L170.058 149.618V118.812L196.721 103.409L211.82 112.137L223.385 118.812V149.618ZM210.535 110.34L197.171 102.639V71.8328L223.834 56.4298L238.997 65.2224L250.498 71.8328V102.639L238.997 109.249L223.899 117.978L210.535 110.34ZM277.74 149.618L251.076 165.021L224.413 149.618V118.812L231.095 114.961L251.076 103.409L269.58 114.063L277.74 118.812V149.618Z" fill="#EAEAEA"/>
<path d="M332.159 149.49L305.495 164.893L278.832 149.49V118.684L290.397 112.009L305.495 103.281L332.159 118.684V149.49ZM264.954 110.148L251.59 102.446V71.6403L264.954 63.9388L278.318 56.2373L304.981 71.6403V102.446L291.618 110.148L278.254 117.849L264.954 110.148ZM333.123 148.976V118.106L305.945 102.446V71.1269L278.768 55.4672V24.1478L251.14 8.23134L223.513 24.1478V55.4672L196.4 71.1269V102.446L169.223 118.106V149.104H-14.916V150.003H169.287L196.85 165.919L224.027 150.26L251.205 165.919L278.382 150.26L305.56 165.919L333.187 150.003V149.939H373.6V149.04H333.123V148.976ZM224.477 24.7254L251.14 9.32238L277.804 24.7254V55.5313L269.644 60.2806L251.14 70.9343L231.159 59.3821L224.477 55.5313V24.7254ZM223.513 149.49L196.85 164.893L170.186 149.49V118.684L196.85 103.281L211.948 112.009L223.513 118.684V149.49ZM210.663 110.148L197.3 102.446V71.6403L223.963 56.2373L239.126 65.0298L250.626 71.6403V102.446L239.126 109.057L223.963 117.849L210.663 110.148ZM277.868 149.49L251.205 164.893L224.541 149.49V118.684L231.223 114.833L251.205 103.281L269.708 113.934L277.868 118.684V149.49Z" fill="#E9E9E9"/>
<path d="M332.287 149.297L305.624 164.7L278.96 149.297V118.491L290.525 111.816L305.624 103.088L332.287 118.491V149.297ZM265.147 110.019L251.783 102.318V71.5119L265.147 63.8104L278.511 56.109L305.174 71.5119V102.318L291.81 110.019L278.446 117.721L265.147 110.019ZM333.251 148.848V117.978L306.074 102.318V70.9985L278.896 55.3388V24.0194L251.269 8.10298L223.642 24.0194V55.3388L196.464 70.9985V102.318L169.351 117.978V148.976H-14.7875V149.875H169.415L196.978 165.791L224.156 150.131L251.333 165.791L278.511 150.131L305.688 165.791L333.315 149.875V149.81H373.728V148.912H333.251V148.848ZM224.605 24.597L251.269 9.19403L277.932 24.597V55.403L269.773 60.1522L251.269 70.806L231.287 59.2537L224.605 55.403V24.597ZM223.706 149.297L197.043 164.7L170.379 149.297V118.491L197.043 103.088L212.141 111.816L223.706 118.491V149.297ZM210.792 110.019L197.428 102.318V71.5119L224.091 56.109L239.254 64.9015L250.755 71.5119V102.318L239.319 108.993L224.156 117.785L210.792 110.019ZM277.997 149.297L251.333 164.7L224.67 149.297V118.491L231.352 114.64L251.333 103.088L269.837 113.742L277.997 118.491V149.297Z" fill="#E8E8E8"/>
<path d="M332.416 149.169L305.752 164.572L279.089 149.169V118.363L290.654 111.688L305.752 102.96L332.416 118.363V149.169ZM265.275 109.891L251.911 102.19V71.3836L265.275 63.6821L278.639 55.9806L305.303 71.3836V102.19L291.939 109.891L278.575 117.592L265.275 109.891ZM333.38 148.719V117.849L306.202 102.19V70.8701L279.025 55.2104V23.891L251.397 7.97461L223.77 23.891V55.2104L196.593 70.8701V102.19L169.415 117.849V148.848H-14.6591V149.746H169.608L197.171 165.663L224.348 150.003L251.526 165.663L278.703 150.003L305.881 165.663L333.508 149.746V149.682H373.921V148.784H333.38V148.719ZM224.798 24.4686L251.462 9.06565L278.125 24.4686V55.2746L269.965 60.0239L251.462 70.6776L231.48 59.1254L224.798 55.2746V24.4686ZM223.834 149.169L197.171 164.572L170.508 149.169V118.363L197.171 102.96L212.27 111.688L223.834 118.363V149.169ZM210.985 109.891L197.621 102.19V71.3836L224.284 55.9806L239.447 64.7731L250.948 71.3836V102.19L239.447 108.8L224.284 117.592L210.985 109.891ZM278.125 149.169L251.462 164.572L224.798 149.169V118.363L231.48 114.512L251.462 102.96L269.965 113.613L278.125 118.363V149.169Z" fill="#E7E7E7"/>
<path d="M332.609 149.04L305.945 164.443L279.282 149.04V118.234L290.846 111.56L305.945 102.831L332.609 118.234V149.04ZM265.404 109.763L252.04 102.061V71.2552L265.404 63.5537L278.768 55.8522L305.431 71.2552V102.061L292.067 109.763L278.703 117.464L265.404 109.763ZM333.508 148.591V117.721L306.331 102.061V70.7418L279.217 55.0821V23.7627L251.59 7.84628L223.963 23.7627V55.0821L196.785 70.7418V102.061L169.608 117.721V148.719H-14.4663V149.618H169.737L197.299 165.534L224.477 149.875L251.654 165.534L278.832 149.875L306.009 165.534L333.637 149.618V149.554H373.921V148.655H333.508V148.591ZM224.927 24.2761L251.59 8.87315L278.254 24.2761V55.0821L270.094 59.8314L251.59 70.4851L231.609 58.9328L224.927 55.0821V24.2761ZM223.963 149.04L197.299 164.443L170.636 149.04V118.234L197.299 102.831L212.398 111.56L223.963 118.234V149.04ZM211.113 109.763L197.749 102.061V71.2552L224.413 55.8522L239.576 64.6448L251.076 71.2552V102.061L239.64 108.672L224.477 117.464L211.113 109.763ZM278.254 149.04L251.59 164.443L224.927 149.04V118.234L231.609 114.384L251.59 102.831L270.094 113.485L278.254 118.234V149.04Z" fill="#E6E6E6"/>
<path d="M332.737 148.912L306.074 164.315L279.41 148.912V118.106L290.975 111.431L306.074 102.703L332.737 118.106V148.912ZM265.532 109.634L252.168 101.933V71.1269L265.532 63.4254L278.896 55.7239L305.56 71.1269V101.933L292.196 109.634L278.832 117.336L265.532 109.634ZM333.637 148.463V117.593L306.523 101.933V70.6134L279.346 54.9537V23.6343L251.719 7.71791L224.091 23.6343V54.9537L196.914 70.6134V101.933L169.737 117.593V148.591H-14.3378V149.49H169.865L197.428 165.406L224.605 149.746L251.783 165.406L278.96 149.746L306.138 165.406L333.765 149.49V149.425H374.178V148.527H333.637V148.463ZM225.055 24.1478L251.719 8.74478L278.382 24.1478V54.9537L270.222 59.703L251.719 70.3567L231.737 58.8045L225.055 54.9537V24.1478ZM224.091 148.912L197.428 164.315L170.764 148.912V118.106L197.428 102.703L212.527 111.431L224.091 118.106V148.912ZM211.242 109.634L197.878 101.933V71.1269L224.541 55.7239L239.704 64.5164L251.205 71.1269V101.933L239.704 108.543L224.605 117.336L211.242 109.634ZM278.382 148.912L251.719 164.315L225.055 148.912V118.106L231.737 114.255L251.719 102.703L270.222 113.357L278.382 118.106V148.912Z" fill="#E5E5E5"/>
<path d="M332.866 148.784L306.202 164.187L279.474 148.784V117.978L291.039 111.303L306.138 102.575L332.801 117.978V148.784H332.866ZM265.661 109.442L252.297 101.74V70.9343L265.661 63.2328L279.025 55.5313L305.688 70.9343V101.74L292.324 109.442L278.96 117.143L265.661 109.442ZM333.829 148.27V117.4L306.652 101.74V70.4851L279.474 54.8253V23.4418L251.847 7.52536L224.22 23.4418V54.7612L197.107 70.4851V101.804L169.929 117.464V148.463H-14.2093V149.361H169.994L197.556 165.278L224.734 149.618L251.911 165.278L279.089 149.618L306.266 165.278L333.894 149.361V149.297H374.306V148.398H333.829V148.27ZM225.184 24.0194L251.847 8.6164L278.511 24.0194V54.8253L270.351 59.5746L251.847 70.1642L231.866 58.6119L225.184 54.7612V24.0194ZM224.22 148.784L197.556 164.187L170.893 148.784V117.978L197.556 102.575L212.655 111.303L224.22 117.978V148.784ZM211.37 109.442L198.006 101.74V70.9343L224.67 55.5313L239.833 64.3239L251.333 70.9343V101.74L239.833 108.351L224.67 117.143L211.37 109.442ZM278.575 148.784L251.911 164.187L225.248 148.784V117.978L231.93 114.127L251.911 102.575L270.415 113.228L278.575 117.978V148.784Z" fill="#E4E4E4"/>
<path d="M332.994 148.591L306.331 163.994L279.667 148.591V117.785L291.232 111.11L306.331 102.382L332.994 117.785V148.591ZM265.854 109.313L252.49 101.612V70.806L265.854 63.1045L279.217 55.403L305.881 70.806V101.612L292.517 109.313L279.153 117.015L265.854 109.313ZM333.958 148.142V117.272L306.78 101.612V70.2925L279.603 54.6328V23.3134L251.976 7.39702L224.348 23.3134V54.6328L197.235 70.2925V101.612L170.058 117.272V148.27H-14.0808V149.169H170.122L197.685 165.085L224.862 149.425L252.04 165.085L279.217 149.425L306.395 165.085L334.022 149.169V149.104H374.435V148.142H333.958ZM225.312 23.891L251.976 8.48806L278.639 23.891V54.697L270.479 59.4463L251.976 70.1L231.994 58.5478L225.312 54.697V23.891ZM224.413 148.591L197.749 163.994L171.086 148.591V117.785L197.749 102.382L212.848 111.11L224.413 117.785V148.591ZM211.499 109.313L198.135 101.612V70.806L224.798 55.403L239.961 64.1955L251.462 70.806V101.612L239.961 108.222L224.862 117.015L211.499 109.313ZM278.703 148.591L252.04 163.994L225.376 148.591V117.785L232.058 113.934L252.04 102.382L270.544 113.036L278.703 117.785V148.591Z" fill="#E3E3E3"/>
<path d="M333.122 148.463L306.459 163.866L279.796 148.463V117.657L291.36 110.982L306.459 102.254L333.122 117.657V148.463ZM265.982 109.185L252.618 101.484V70.6776L265.982 62.9761L279.346 55.2746L306.009 70.6776V101.484L292.645 109.185L279.282 116.887L265.982 109.185ZM334.086 148.013V117.143L306.909 101.484V70.1642L279.731 54.5045V23.1851L252.104 7.26866L224.477 23.1851V54.5045L197.299 70.1642V101.484L170.122 117.143V148.142H-13.9523V149.04H170.25L197.813 164.957L224.991 149.297L252.168 164.957L279.346 149.297L306.523 164.957L334.15 149.04V148.976H374.563V148.078H334.086V148.013ZM225.441 23.7627L252.104 8.35971L278.768 23.7627V54.5687L270.608 59.3179L252.104 69.9716L232.123 58.4194L225.441 54.5687V23.7627ZM224.541 148.463L197.878 163.866L171.214 148.463V117.657L197.878 102.254L212.976 110.982L224.541 117.657V148.463ZM211.627 109.185L198.263 101.484V70.6776L224.927 55.2746L240.089 64.0672L251.59 70.6776V101.484L240.089 108.094L224.927 116.887L211.627 109.185ZM278.832 148.463L252.168 163.866L225.505 148.463V117.657L232.187 113.806L252.168 102.254L270.672 112.907L278.832 117.657V148.463Z" fill="#E2E2E2"/>
<path d="M333.315 148.334L306.652 163.737L279.988 148.334V117.528L291.553 110.854L306.652 102.125L333.315 117.528V148.334ZM266.111 109.057L252.747 101.355V70.5493L266.111 62.8478L279.474 55.1463L306.138 70.5493V101.355L292.774 109.057L279.41 116.758L266.111 109.057ZM334.215 147.885V117.015L307.102 101.355V70.0358L279.924 54.3761V23.0567L252.297 7.1403L224.67 23.0567V54.3761L197.492 70.0358V101.355L170.315 117.015V148.013H-13.7595V148.912H170.443L198.006 164.828L225.184 149.169L252.361 164.828L279.539 149.169L306.716 164.828L334.343 148.912V148.784H374.756V147.885H334.215ZM225.634 23.5702L252.297 8.16717L278.96 23.5702V54.3761L270.801 59.1254L252.297 69.7791L232.315 58.2269L225.634 54.3761V23.5702ZM224.67 148.334L198.006 163.737L171.343 148.334V117.528L198.006 102.125L213.105 110.854L224.67 117.528V148.334ZM211.82 109.057L198.456 101.355V70.5493L225.12 55.1463L240.282 63.9388L251.783 70.5493V101.355L240.282 107.966L225.12 116.758L211.82 109.057ZM278.96 148.334L252.297 163.737L225.634 148.334V117.528L232.315 113.678L252.297 102.125L270.801 112.779L278.96 117.528V148.334Z" fill="#E1E1E1"/>
<path d="M333.444 148.206L306.78 163.609L280.117 148.206V117.4L291.682 110.725L306.78 101.997L333.444 117.4V148.206ZM266.239 108.928L252.875 101.227V70.4209L266.239 62.7194L279.603 55.0179L306.266 70.4209V101.227L292.902 108.928L279.539 116.63L266.239 108.928ZM334.343 147.757V116.887L307.166 101.227V69.9075L279.988 54.2477V22.9283L252.361 7.01193L224.734 22.9283V54.2477L197.556 69.9075V101.227L170.379 116.887V147.885H-13.631V148.784H170.572L198.135 164.7L225.312 149.04L252.49 164.7L279.667 149.04L306.845 164.7L334.472 148.784V148.719H374.885V147.821H334.343V147.757ZM225.762 23.4418L252.425 8.0388L279.089 23.4418V54.2477L270.929 58.997L252.425 69.6507L232.444 58.0985L225.762 54.2477V23.4418ZM224.798 148.206L198.135 163.609L171.471 148.206V117.4L198.135 101.997L213.233 110.725L224.798 117.4V148.206ZM211.948 108.928L198.584 101.227V70.4209L225.248 55.0179L240.411 63.8104L251.911 70.4209V101.227L240.411 107.837L225.248 116.63L211.948 108.928ZM279.089 148.206L252.425 163.609L225.762 148.206V117.4L232.444 113.549L252.425 101.997L270.929 112.651L279.089 117.4V148.206Z" fill="#E0E0E0"/>
<path d="M333.572 148.078L306.909 163.481L280.245 148.078V117.272L291.81 110.597L306.909 101.869L333.572 117.272V148.078ZM266.368 108.8L253.004 101.098V70.2925L266.368 62.591L279.731 54.8895L306.395 70.2925V101.098L293.031 108.8L279.667 116.501L266.368 108.8ZM334.536 147.628V116.758L307.359 101.098V69.7791L280.181 54.1194V22.8L252.554 6.88358L224.927 22.8V54.1194L197.749 69.7791V101.098L170.572 116.758V147.757H-13.5026V148.655H170.7L198.263 164.572L225.441 148.912L252.618 164.572L279.796 148.912L306.973 164.572L334.6 148.655V148.591H375.013V147.693H334.536V147.628ZM225.89 23.3134L252.554 7.91044L279.217 23.3134V54.1194L271.058 58.8686L252.554 69.5224L232.572 57.9701L225.89 54.1194V23.3134ZM224.927 148.078L198.263 163.481L171.6 148.078V117.272L198.263 101.869L213.362 110.597L224.927 117.272V148.078ZM212.077 108.8L198.713 101.098V70.2925L225.376 54.8895L240.539 63.6821L252.04 70.2925V101.098L240.604 107.709L225.441 116.501L212.077 108.8ZM279.282 148.078L252.618 163.481L225.955 148.078V117.272L232.637 113.421L252.618 101.869L271.122 112.522L279.282 117.272V148.078Z" fill="#DFDFDF"/>
<path d="M333.701 147.885L307.037 163.288L280.374 147.885V117.079L291.939 110.404L307.037 101.676L333.701 117.079V147.885ZM266.496 108.607L253.132 100.906V70.1L266.496 62.3985L279.86 54.697L306.523 70.1V100.906L293.159 108.607L279.796 116.309L266.496 108.607ZM334.665 147.436V116.566L307.487 100.906V69.5866L280.31 53.9269V22.6075L252.682 6.69104L225.055 22.6075V53.9269L197.878 69.5866V100.906L170.7 116.566V147.564H-13.3741V148.463H170.829L198.392 164.379L225.569 148.719L252.747 164.379L279.924 148.719L307.102 164.379L334.729 148.463V148.398H375.142V147.5H334.665V147.436ZM226.019 23.1851L252.682 7.78208L279.346 23.1851V53.991L271.186 58.7403L252.682 69.394L232.701 57.8418L226.019 53.991V23.1851ZM225.055 147.885L198.392 163.288L171.728 147.885V117.079L198.392 101.676L213.49 110.404L225.055 117.079V147.885ZM212.205 108.607L198.841 100.906V70.1L225.505 54.697L240.668 63.4895L252.168 70.1V100.906L240.668 107.516L225.505 116.309L212.205 108.607ZM279.41 147.885L252.747 163.288L226.083 147.885V117.079L232.765 113.228L252.747 101.676L271.25 112.33L279.41 117.079V147.885Z" fill="#DEDEDE"/>
<path d="M333.829 147.757L307.166 163.16L280.502 147.757V116.951L292.067 110.276L307.166 101.548L333.829 116.951V147.757ZM266.689 108.479L253.325 100.778V69.9716L266.689 62.2701L280.053 54.5686L306.716 69.9716V100.778L293.352 108.479L279.988 116.181L266.689 108.479ZM334.793 147.307V116.437L307.616 100.778V69.4582L280.502 53.7985V22.4791L252.875 6.56268L225.248 22.4791V53.7985L198.07 69.4582V100.778L170.893 116.437V147.436H-13.2455V148.334H170.957L198.52 164.251L225.698 148.591L252.875 164.251L280.053 148.591L307.23 164.251L334.857 148.334V148.27H375.206V147.372H334.793V147.307ZM226.147 23.0567L252.811 7.65373L279.474 23.0567V53.8627L271.315 58.6119L252.875 69.2015L232.894 57.6492L226.212 53.7985V23.0567H226.147ZM225.248 147.757L198.584 163.16L171.921 147.757V116.951L198.584 101.548L213.683 110.276L225.248 116.951V147.757ZM212.334 108.479L198.97 100.778V69.9716L225.633 54.5686L240.796 63.3612L252.297 69.9716V100.778L240.796 107.388L225.633 116.181L212.334 108.479ZM279.539 147.757L252.875 163.16L226.212 147.757V116.951L232.894 113.1L252.875 101.548L271.379 112.201L279.539 116.951V147.757Z" fill="#DDDDDD"/>
<path d="M333.958 147.628L307.294 163.031L280.631 147.628V116.822L292.196 110.148L307.294 101.419L333.958 116.822V147.628ZM266.817 108.351L253.453 100.649V69.8433L266.817 62.1418L280.181 54.4403L306.845 69.8433V100.649L293.481 108.351L280.117 116.052L266.817 108.351ZM334.922 147.179V116.309L307.744 100.649V69.3298L280.567 53.6701V22.3507L252.939 6.43433L225.312 22.3507V53.6701L198.135 69.3298V100.649L170.957 116.309V147.307H-13.1171V148.206H171.086L198.649 164.122L225.826 148.463L253.004 164.122L280.181 148.463L307.359 164.122L334.986 148.206V148.142H375.399V147.243H334.922V147.179ZM226.34 22.8642L253.004 7.46119L279.667 22.8642V53.6701L271.508 58.4194L253.004 69.0731L233.022 57.5209L226.34 53.6701V22.8642ZM225.376 147.628L198.713 163.031L172.05 147.628V116.822L198.713 101.419L213.812 110.148L225.376 116.822V147.628ZM212.527 108.351L199.163 100.649V69.8433L225.826 54.4403L240.989 63.2328L252.49 69.8433V100.649L240.989 107.26L225.826 116.052L212.527 108.351ZM279.667 147.628L253.004 163.031L226.34 147.628V116.822L233.022 112.972L253.004 101.419L271.508 112.073L279.667 116.822V147.628Z" fill="#DCDCDC"/>
<path d="M334.151 147.5L307.487 162.903L280.759 147.5V116.694L292.324 110.019L307.423 101.291L334.086 116.694V147.5H334.151ZM266.946 108.222L253.582 100.521V69.7149L266.946 62.0134L280.31 54.3119L306.973 69.7149V100.521L293.609 108.222L280.245 115.924L266.946 108.222ZM335.05 147.051V116.181L307.873 100.521V69.2015L280.759 53.5418V22.2224L253.132 6.30595L225.505 22.2224V53.5418L198.327 69.2015V100.521L171.15 116.181V147.179H-12.9243V148.078H171.279L198.841 163.994L226.019 148.334L253.196 163.994L280.374 148.334L307.551 163.994L335.179 148.078V148.013H375.591V147.115H335.05V147.051ZM226.469 22.7358L253.132 7.33282L279.796 22.7358V53.5418L271.636 58.291L253.132 68.9448L233.151 57.3925L226.469 53.5418V22.7358ZM225.505 147.5L198.841 162.903L172.178 147.5V116.694L198.841 101.291L213.94 110.019L225.505 116.694V147.5ZM212.655 108.222L199.291 100.521V69.7149L225.955 54.3119L241.118 63.1045L252.618 69.7149V100.521L241.118 107.131L225.955 115.924L212.655 108.222ZM279.796 147.5L253.132 162.903L226.469 147.5V116.694L233.151 112.843L253.132 101.291L271.636 111.945L279.796 116.694V147.5Z" fill="#DBDBDB"/>
<path d="M334.279 147.372L307.616 162.775L280.952 147.372V116.566L292.517 109.891L307.616 101.163L334.279 116.566V147.372ZM267.074 108.094L253.71 100.393V69.5866L267.074 61.8851L280.438 54.1836L307.102 69.5866V100.393L293.738 108.094L280.374 115.796L267.074 108.094ZM335.179 146.922V116.052L308.001 100.393V69.0731L280.824 53.4134V22.094L253.196 6.17763L225.569 22.094V53.4134L198.52 69.0731V100.393L171.343 116.052V147.051H-12.7958V147.949H171.407L198.97 163.866L226.147 148.142L253.325 163.801L280.502 148.142L307.68 163.801L335.307 147.885V147.821H375.72V146.922H335.179ZM226.597 22.6075L253.261 7.20449L279.924 22.6075V53.4134L271.764 58.1627L253.261 68.8164L233.279 57.2642L226.597 53.4134V22.6075ZM225.633 147.372L198.97 162.775L172.307 147.372V116.566L198.97 101.163L214.069 109.891L225.633 116.566V147.372ZM212.784 108.094L199.42 100.393V69.5866L226.083 54.1836L241.246 62.9761L252.747 69.5866V100.393L241.246 107.003L226.147 115.731L212.784 108.094ZM279.988 147.372L253.325 162.775L226.661 147.372V116.566L233.343 112.715L253.325 101.163L271.829 111.816L279.988 116.566V147.372Z" fill="#DADADA"/>
<path d="M334.408 147.243L307.744 162.646L281.081 147.243V116.437L292.646 109.763L307.744 101.034L334.408 116.437V147.243ZM267.203 107.901L253.839 100.2V69.394L267.203 61.6925L280.567 53.991L307.23 69.394V100.2L293.866 107.901L280.502 115.603L267.203 107.901ZM335.371 146.73V115.86L308.194 100.2V68.8806L281.016 53.2209V21.9015L253.389 5.98506L225.762 21.9015V53.2209L198.584 68.8806V100.2L171.407 115.86V146.858H-12.6673V147.757H171.536L199.098 163.673L226.276 148.013L253.453 163.673L280.631 148.013L307.808 163.673L335.436 147.757V147.693H375.848V146.794H335.371V146.73ZM226.726 22.4791L253.389 7.07611L280.053 22.4791V53.2851L271.893 58.0343L253.389 68.688L233.408 57.1358L226.726 53.2851V22.4791ZM225.762 147.243L199.098 162.646L172.435 147.243V116.437L199.098 101.034L214.197 109.763L225.762 116.437V147.243ZM212.912 107.901L199.548 100.2V69.394L226.212 53.991L241.375 62.7836L252.875 69.394V100.2L241.375 106.81L226.212 115.603L212.912 107.901ZM280.117 147.243L253.453 162.646L226.79 147.243V116.437L233.472 112.587L253.453 101.034L271.957 111.688L280.117 116.437V147.243Z" fill="#D9D9D9"/>
<path d="M334.536 147.051L307.873 162.454L281.209 147.051V116.245L292.774 109.57L307.873 100.842L334.536 116.245V147.051ZM267.396 107.773L254.032 100.072V69.2657L267.396 61.5642L280.759 53.8627L307.423 69.2657V100.072L294.059 107.773L280.695 115.475L267.396 107.773ZM335.5 146.601V115.731L308.322 100.072V68.7522L281.145 53.0925V21.7731L253.518 5.8567L225.89 21.7731V53.0925L198.713 68.7522V100.072L171.536 115.731V146.73H-12.5388V147.628H171.664L199.227 163.545L226.404 147.885L253.582 163.545L280.759 147.885L307.937 163.545L335.564 147.628V147.564H375.977V146.666H335.5V146.601ZM226.854 22.3507L253.518 6.94775L280.181 22.3507V53.1567L272.021 57.906L253.518 68.5597L233.536 57.0074L226.854 53.1567V22.3507ZM225.955 147.051L199.291 162.454L172.628 147.051V116.245L199.291 100.842L214.39 109.57L225.955 116.245V147.051ZM213.041 107.773L199.677 100.072V69.2657L226.34 53.8627L241.503 62.6552L253.004 69.2657V100.072L241.567 106.746L226.404 115.539L213.041 107.773ZM280.245 147.051L253.582 162.454L226.918 147.051V116.245L233.6 112.394L253.582 100.842L272.086 111.495L280.245 116.245V147.051Z" fill="#D9D9D9"/>
<path d="M334.665 146.922L308.001 162.325L281.338 146.922V116.116L292.902 109.442L308.001 100.713L334.665 116.116V146.922ZM267.524 107.645L254.16 99.9433V69.1373L267.524 61.4358L280.888 53.7343L307.551 69.1373V99.9433L294.187 107.645L280.824 115.346L267.524 107.645ZM335.628 146.473V115.603L308.451 99.9433V68.6239L281.273 52.9642V21.6448L253.646 5.72836L226.019 21.6448V52.9642L198.841 68.6239V99.9433L171.664 115.603V146.602H-12.4103V147.5H171.792L199.355 163.416L226.533 147.757L253.71 163.416L280.888 147.757L308.065 163.416L335.693 147.5V147.436H376.105V146.537H335.628V146.473ZM226.983 22.2224L253.646 6.81941L280.31 22.2224V53.0284L272.15 57.7776L253.646 68.4314L233.665 56.8791L226.983 53.0284V22.2224ZM226.083 146.922L199.42 162.325L172.756 146.922V116.116L199.42 100.713L214.518 109.442L226.083 116.116V146.922ZM213.169 107.645L199.805 99.9433V69.1373L226.469 53.7343L241.632 62.5269L253.132 69.1373V99.9433L241.632 106.554L226.469 115.346L213.169 107.645ZM280.374 146.922L253.71 162.325L227.047 146.922V116.116L233.729 112.266L253.71 100.713L272.214 111.367L280.374 116.116V146.922Z" fill="#D8D8D8"/>
<path d="M334.857 146.794L308.194 162.197L281.53 146.794V115.988L293.095 109.313L308.194 100.585L334.857 115.988V146.794ZM267.652 107.516L254.289 99.8149V69.009L267.652 61.3075L281.016 53.606L307.68 69.009V99.8149L294.316 107.516L280.952 115.218L267.652 107.516ZM335.757 146.345V115.475L308.579 99.8149V68.4955L281.402 52.8358V21.5164L253.775 5.60001L226.147 21.5164V52.8358L198.97 68.4955V99.8149L171.792 115.475V146.473H-12.2176V147.372H171.985L199.548 163.288L226.726 147.628L253.903 163.288L281.081 147.628L308.258 163.288L335.885 147.372V147.307H376.298V146.409H335.757V146.345ZM227.175 22.0299L253.839 6.62687L280.502 22.0299V52.8358L272.343 57.5851L253.839 68.2388L233.857 56.6866L227.175 52.8358V22.0299ZM226.212 146.794L199.548 162.197L172.885 146.794V115.988L199.548 100.585L214.647 109.313L226.212 115.988V146.794ZM213.362 107.516L199.998 99.8149V69.009L226.661 53.606L241.824 62.3985L253.325 69.009V99.8149L241.888 106.425L226.726 115.218L213.362 107.516ZM280.502 146.794L253.839 162.197L227.175 146.794V115.988L233.857 112.137L253.839 100.585L272.343 111.239L280.502 115.988V146.794Z" fill="#D7D7D7"/>
<path d="M334.986 146.666L308.322 162.069L281.659 146.666V115.86L293.224 109.185L308.322 100.457L334.986 115.86V146.666ZM267.781 107.388L254.417 99.6866V68.8806L267.781 61.1791L281.145 53.4776L307.808 68.8806V99.6866L294.444 107.388L281.081 115.09L267.781 107.388ZM335.885 146.216V115.346L308.708 99.6866V68.3672L281.53 52.7075V21.3881L253.903 5.47165L226.276 21.3881V52.7075L199.163 68.3672V99.6866L171.985 115.346V146.345H-12.0891V147.243H172.114L199.677 163.16L226.79 147.5L253.967 163.16L281.145 147.5L308.322 163.16L335.95 147.243V147.179H376.362V146.216H335.885ZM227.304 21.9015L253.967 6.49851L280.631 21.9015V52.7075L272.471 57.4567L253.967 68.1105L233.986 56.5582L227.304 52.7075V21.9015ZM226.34 146.666L199.677 162.069L173.013 146.666V115.86L199.677 100.457L214.775 109.185L226.34 115.86V146.666ZM213.49 107.388L200.126 99.6866V68.8806L226.79 53.4776L241.953 62.2702L253.453 68.8806V99.6866L241.953 106.297L226.79 115.09L213.49 107.388ZM280.631 146.666L253.967 162.069L227.304 146.666V115.86L233.986 112.009L253.967 100.457L272.471 111.11L280.631 115.86V146.666Z" fill="#D6D6D6"/>
<path d="M335.114 146.537L308.451 161.94L281.787 146.537V115.731L293.352 109.057L308.451 100.328L335.114 115.731V146.537ZM267.91 107.26L254.546 99.5582V68.7522L267.91 61.0507L281.273 53.3493L307.937 68.7522V99.5582L294.573 107.26L281.209 114.961L267.91 107.26ZM336.078 146.088V115.218L308.901 99.5582V68.2388L281.723 52.5791V21.2597L254.096 5.34328L226.469 21.2597V52.5791L199.291 68.2388V99.5582L172.178 115.218V146.216H-11.9606V147.115H172.242L199.805 163.031L226.983 147.372L254.16 163.031L281.338 147.372L308.515 163.031L336.142 147.115V147.051H376.555V146.152H336.078V146.088ZM227.432 21.7731L254.096 6.37014L280.759 21.7731V52.5791L272.6 57.3284L254.096 67.9179L234.114 56.3657L227.432 52.5149V21.7731ZM226.469 146.537L199.805 161.94L173.142 146.537V115.731L199.805 100.328L214.904 109.057L226.469 115.731V146.537ZM213.619 107.26L200.255 99.5582V68.7522L226.918 53.3493L242.081 62.1418L253.582 68.7522V99.5582L242.081 106.169L226.918 114.961L213.619 107.26ZM280.824 146.537L254.16 161.94L227.497 146.537V115.731L234.179 111.881L254.16 100.328L272.664 110.982L280.824 115.731V146.537Z" fill="#D5D5D5"/>
<path d="M335.243 146.345L308.579 161.748L281.916 146.345V115.539L293.481 108.864L308.579 100.136L335.243 115.539V146.345ZM268.038 107.067L254.674 99.3657V68.5597L268.038 60.8582L281.402 53.1567L308.065 68.5597V99.3657L294.701 107.067L281.402 114.769L268.038 107.067ZM336.207 145.896V115.025L309.029 99.3657V68.0463L281.852 52.3866V21.0672L254.224 5.15076L226.597 21.0672V52.3866L199.42 68.0463V99.3657L172.242 115.025V146.024H-11.8321V146.922H172.371L199.934 162.839L227.111 147.179L254.289 162.839L281.466 147.179L308.644 162.839L336.271 146.922V146.858H376.684V145.96H336.207V145.896ZM227.561 21.6448L254.224 6.2418L280.888 21.6448V52.4508L272.728 57.2L254.224 67.8537L234.243 56.3015L227.561 52.4508V21.6448ZM226.661 146.345L199.998 161.748L173.334 146.345V115.539L199.998 100.136L215.097 108.864L226.661 115.539V146.345ZM213.747 107.067L200.448 99.3657V68.5597L227.111 53.1567L242.274 61.9493L253.775 68.5597V99.3657L242.274 105.976L227.111 114.769L213.747 107.067ZM280.952 146.345L254.289 161.748L227.625 146.345V115.539L234.307 111.688L254.289 100.136L272.792 110.79L280.952 115.539V146.345Z" fill="#D4D4D4"/>
<path d="M335.371 146.216L308.708 161.619L282.044 146.216V115.41L293.609 108.736L308.708 100.007L335.371 115.41V146.216ZM268.231 106.939L254.867 99.2373V68.4313L268.231 60.7299L281.595 53.0284L308.258 68.4313V99.2373L294.894 106.939L281.53 114.64L268.231 106.939ZM336.335 145.767V114.897L309.158 99.2373V67.9179L282.044 52.2582V20.9388L254.417 5.02238L226.79 20.9388V52.2582L199.612 67.9179V99.2373L172.435 114.897V145.896H-11.7036V146.794H172.499L200.062 162.71L227.24 147.051L254.417 162.71L281.595 147.051L308.772 162.71L336.399 146.794V146.73H376.812V145.831H336.335V145.767ZM227.689 21.5164L254.353 6.11343L281.016 21.5164V52.3224L272.857 57.0716L254.417 67.6612L234.436 56.109L227.754 52.2582V21.5164H227.689ZM226.79 146.216L200.126 161.619L173.463 146.216V115.41L200.126 100.007L215.225 108.736L226.79 115.41V146.216ZM213.876 106.939L200.512 99.2373V68.4313L227.175 53.0284L242.338 61.8209L253.839 68.4313V99.2373L242.338 105.848L227.175 114.64L213.876 106.939ZM281.081 146.216L254.417 161.619L227.754 146.216V115.41L234.436 111.56L254.417 100.007L272.921 110.661L281.081 115.41V146.216Z" fill="#D3D3D3"/>
<path d="M335.5 146.088L308.836 161.491L282.173 146.088V115.282L293.738 108.607L308.836 99.8791L335.5 115.282V146.088ZM268.359 106.81L254.995 99.1089V68.303L268.359 60.6015L281.723 52.9L308.387 68.303V99.1089L295.023 106.81L281.659 114.512L268.359 106.81ZM336.464 145.639V114.769L309.286 99.1089V67.7895L282.109 52.1298V20.8104L254.481 4.89403L226.854 20.8104V52.1298L199.677 67.7895V99.1089L172.628 114.769V145.767H-11.5751V146.666H172.628L200.191 162.582L227.368 146.922L254.546 162.582L281.723 146.922L308.901 162.582L336.528 146.666V146.601H376.941V145.703H336.464V145.639ZM227.882 21.3239L254.546 5.92089L281.209 21.3239V52.1298L273.049 56.8791L254.546 67.5328L234.564 55.9806L227.882 52.1298V21.3239ZM226.918 146.088L200.255 161.491L173.591 146.088V115.282L200.255 99.8791L215.354 108.607L226.918 115.282V146.088ZM214.069 106.81L200.705 99.1089V68.303L227.368 52.9L242.531 61.6925L254.032 68.303V99.1089L242.531 105.719L227.368 114.512L214.069 106.81ZM281.209 146.088L254.546 161.491L227.882 146.088V115.282L234.564 111.431L254.546 99.8791L273.049 110.533L281.209 115.282V146.088Z" fill="#D2D2D2"/>
<path d="M335.693 145.96L309.029 161.363L282.366 145.96V115.154L293.931 108.479L309.029 99.7507L335.693 115.154V145.96ZM268.488 106.682L255.124 98.9806V68.1746L268.488 60.4731L281.852 52.7716L308.515 68.1746V98.9806L295.151 106.682L281.787 114.384L268.488 106.682ZM336.592 145.51V114.64L309.415 98.9806V67.6612L282.237 52.0015V20.6821L254.61 4.76567L226.983 20.6821V52.0015L199.805 67.6612V98.9806L172.628 114.64V145.639H-11.3823V146.537H172.821L200.383 162.454L227.561 146.794L254.738 162.454L281.916 146.794L309.093 162.454L336.721 146.537V146.473H377.133V145.575H336.592V145.51ZM228.011 21.1955L254.674 5.79254L281.338 21.1955V52.0015L273.178 56.7507L254.674 67.4045L234.693 55.8522L228.011 52.0015V21.1955ZM227.047 145.96L200.383 161.363L173.72 145.96V115.154L200.383 99.7507L215.482 108.479L227.047 115.154V145.96ZM214.197 106.682L200.833 98.9806V68.1746L227.497 52.7716L242.66 61.5642L254.16 68.1746V98.9806L242.66 105.591L227.497 114.384L214.197 106.682ZM281.338 145.96L254.674 161.363L228.011 145.96V115.154L234.693 111.303L254.674 99.7507L273.178 110.404L281.338 115.154V145.96Z" fill="#D1D1D1"/>
<path d="M335.821 145.831L309.158 161.234L282.494 145.831V115.025L294.059 108.351L309.158 99.6224L335.821 115.025V145.831ZM268.616 106.554L255.252 98.8522V68.0462L268.616 60.3448L281.98 52.6433L308.644 68.0462V98.8522L295.28 106.554L281.916 114.255L268.616 106.554ZM336.721 145.382V114.512L309.543 98.8522V67.5328L282.43 51.8731V20.5537L254.803 4.6373L227.175 20.5537V51.8731L199.998 67.5328V98.8522L172.82 114.512V145.51H-11.2538V146.409H172.949L200.512 162.325L227.689 146.666L254.867 162.325L282.044 146.666L309.222 162.325L336.849 146.409V146.345H377.133V145.446H336.721V145.382ZM228.139 21.0671L254.803 5.66416L281.466 21.0671V51.8731L273.306 56.6224L254.803 67.2761L234.821 55.7239L228.139 51.8731V21.0671ZM227.175 145.831L200.512 161.234L173.848 145.831V115.025L200.512 99.6224L215.611 108.351L227.175 115.025V145.831ZM214.326 106.554L200.962 98.8522V68.0462L227.625 52.6433L242.788 61.4358L254.289 68.0462V98.8522L242.852 105.463L227.689 114.255L214.326 106.554ZM281.53 145.831L254.867 161.234L228.203 145.831V115.025L234.885 111.175L254.867 99.6224L273.371 110.276L281.53 115.025V145.831Z" fill="#D0D0D0"/>
<path d="M335.95 145.703L309.286 161.106L282.623 145.703V114.897L294.188 108.222L309.286 99.494L335.95 114.897V145.703ZM268.745 106.361L255.381 98.6597V67.8537L268.745 60.1522L282.109 52.4508L308.772 67.8537V98.6597L295.408 106.361L282.044 114.063L268.745 106.361ZM336.913 145.19V114.319L309.736 98.7239V67.4045L282.558 51.7448V20.3612L254.931 4.44478L227.304 20.3612V51.6806L200.126 67.3403V98.7239L172.949 114.384V145.382H-11.1253V146.281H173.078L200.64 162.197L227.818 146.537L254.995 162.197L282.173 146.537L309.35 162.197L336.978 146.281V146.216H377.39V145.318H336.913V145.19ZM228.268 20.9388L254.931 5.53582L281.595 20.9388V51.7448L273.435 56.494L254.931 67.1478L234.95 55.5955L228.268 51.7448V20.9388ZM227.304 145.703L200.64 161.106L173.977 145.703V114.897L200.64 99.494L215.739 108.222L227.304 114.897V145.703ZM214.454 106.361L201.09 98.7239V67.9179L227.754 52.5149L242.917 61.3075L254.417 67.9179V98.7239L242.917 105.334L227.754 114.127L214.454 106.361ZM281.659 145.703L254.995 161.106L228.332 145.703V114.897L235.014 111.046L254.995 99.494L273.499 110.148L281.659 114.897V145.703Z" fill="#CFCFCF"/>
<path d="M336.078 145.51L309.415 160.913L282.751 145.51V114.704L294.316 108.03L309.415 99.3015L336.078 114.704V145.51ZM268.938 106.233L255.574 98.5313V67.7254L268.938 60.0239L282.301 52.3224L308.965 67.7254V98.5313L295.601 106.233L282.237 113.934L268.938 106.233ZM337.042 145.061V114.191L309.864 98.5313V67.2119L282.687 51.5522V20.2328L255.06 4.31641L227.432 20.2328V51.5522L200.255 67.2119V98.5313L173.077 114.191V145.19H-10.9968V146.088H173.206L200.769 162.004L227.946 146.345L255.124 162.004L282.301 146.345L309.479 162.004L337.106 146.088V146.024H377.519V145.125H337.042V145.061ZM228.396 20.8104L255.06 5.40745L281.723 20.8104V51.6164L273.563 56.3657L255.06 67.0194L235.078 55.4672L228.396 51.6164V20.8104ZM227.497 145.51L200.833 160.913L174.17 145.51V114.704L200.833 99.3015L215.932 108.03L227.497 114.704V145.51ZM214.583 106.233L201.219 98.5313V67.7254L227.882 52.3224L243.045 61.1149L254.546 67.7254V98.5313L243.045 105.142L227.882 113.934L214.583 106.233ZM281.787 145.51L255.124 160.913L228.46 145.51V114.704L235.142 110.854L255.124 99.3015L273.628 109.955L281.787 114.704V145.51Z" fill="#CECECE"/>
<path d="M336.207 145.382L309.543 160.785L282.88 145.382V114.576L294.444 107.901L309.543 99.1731L336.207 114.576V145.382ZM269.066 106.104L255.702 98.403V67.597L269.066 59.8955L282.43 52.194L309.093 67.597V98.403L295.729 106.104L282.366 113.806L269.066 106.104ZM337.17 144.933V114.063L309.993 98.403V67.0836L282.815 51.4239V20.1045L255.188 4.18805L227.561 20.1045V51.4239L200.448 67.0836V98.403L173.27 114.063V145.061H-10.8683V145.96H173.334L200.897 161.876L228.075 146.216L255.252 161.876L282.43 146.216L309.607 161.876L337.235 145.96V145.896H377.647V144.933H337.17ZM228.525 20.6821L255.188 5.27909L281.852 20.6821V51.488L273.692 56.2373L255.188 66.891L235.207 55.3388L228.525 51.488V20.6821ZM227.625 145.382L200.962 160.785L174.298 145.382V114.576L200.962 99.1731L216.06 107.901L227.625 114.576V145.382ZM214.711 106.104L201.347 98.403V67.597L228.011 52.194L243.174 60.9866L254.674 67.597V98.403L243.174 105.013L228.075 113.806L214.711 106.104ZM281.916 145.382L255.252 160.785L228.589 145.382V114.576L235.271 110.725L255.252 99.1731L273.756 109.827L281.916 114.576V145.382Z" fill="#CDCDCD"/>
<path d="M336.399 145.254L309.736 160.657L283.072 145.254V114.448L294.637 107.773L309.736 99.0448L336.399 114.448V145.254ZM269.194 105.976L255.831 98.2746V67.4687L269.194 59.7672L282.558 52.0657L309.222 67.4687V98.2746L295.858 105.976L282.494 113.678L269.194 105.976ZM337.299 144.804V113.934L310.121 98.2746V66.9552L282.944 51.2955V19.9761L255.317 4.05971L227.689 19.9761V51.2955L200.512 66.9552V98.2746L173.463 113.934V144.933H-10.6756V145.831H173.527L201.09 161.748L228.268 146.088L255.445 161.748L282.623 146.088L309.8 161.748L337.427 145.831V145.767H377.84V144.869H337.299V144.804ZM228.717 20.4896L255.381 5.08657L282.044 20.4896V51.2955L273.885 56.0448L255.381 66.6985L235.399 55.1463L228.717 51.2955V20.4896ZM227.754 145.254L201.09 160.657L174.427 145.254V114.448L201.09 99.0448L216.189 107.773L227.754 114.448V145.254ZM214.904 105.976L201.54 98.2746V67.4687L228.203 52.0657L243.366 60.8582L254.867 67.4687V98.2746L243.366 104.885L228.203 113.678L214.904 105.976ZM282.044 145.254L255.381 160.657L228.717 145.254V114.448L235.399 110.597L255.381 99.0448L273.885 109.699L282.044 114.448V145.254Z" fill="#CCCCCC"/>
<path d="M336.528 145.125L309.864 160.528L283.201 145.125V114.319L294.766 107.645L309.864 98.9164L336.528 114.319V145.125ZM269.323 105.848L255.959 98.1463V67.3403L269.323 59.6388L282.687 51.9373L309.35 67.3403V98.1463L295.987 105.848L282.623 113.549L269.323 105.848ZM337.427 144.676V113.806L310.314 98.1463V66.8269L283.137 51.1672V19.8478L255.509 3.93135L227.882 19.8478V51.1672L200.705 66.8269V98.1463L173.527 113.806V144.804H-10.5471V145.703H173.656L201.219 161.619L228.396 145.96L255.574 161.619L282.751 145.96L309.929 161.619L337.556 145.703V145.575H377.969V144.676H337.427ZM228.846 20.3612L255.509 4.95822L282.173 20.3612V51.1672L274.013 55.9164L255.509 66.5702L235.528 55.0179L228.846 51.1672V20.3612ZM227.882 145.125L201.219 160.528L174.555 145.125V114.319L201.219 98.9164L216.317 107.645L227.882 114.319V145.125ZM215.032 105.848L201.668 98.1463V67.3403L228.332 51.9373L243.495 60.7299L254.995 67.3403V98.1463L243.495 104.757L228.332 113.549L215.032 105.848ZM282.173 145.125L255.509 160.528L228.846 145.125V114.319L235.528 110.469L255.509 98.9164L274.013 109.57L282.173 114.319V145.125Z" fill="#CBCBCB"/>
<path d="M336.656 144.997L309.993 160.4L283.329 144.997V114.191L294.894 107.516L309.993 98.7881L336.656 114.191V144.997ZM269.451 105.655L256.088 97.9537V67.1478L269.451 59.4463L282.815 51.7448L309.479 67.1478V97.9537L296.115 105.655L282.751 113.357L269.451 105.655ZM337.62 144.548V113.678L310.443 98.0179V66.6985L283.265 51.0388V19.7194L255.638 3.80299L228.011 19.7194V51.0388L200.833 66.6985V98.0179L173.656 113.678V144.676H-10.4186V145.575H173.784L201.347 161.491L228.525 145.831L255.702 161.491L282.88 145.831L310.057 161.491L337.684 145.575V145.51H378.097V144.612H337.62V144.548ZM228.974 20.2328L255.638 4.82986L282.301 20.2328V51.0388L274.142 55.7881L255.638 66.4418L235.656 54.8896L228.974 51.0388V20.2328ZM228.011 144.997L201.347 160.4L174.684 144.997V114.191L201.347 98.7881L216.446 107.516L228.011 114.191V144.997ZM215.161 105.655L201.797 97.9537V67.1478L228.46 51.7448L243.623 60.5373L255.124 67.1478V97.9537L243.623 104.564L228.46 113.357L215.161 105.655ZM282.366 144.997L255.702 160.4L229.039 144.997V114.191L235.721 110.34L255.702 98.7881L274.206 109.442L282.366 114.191V144.997Z" fill="#CACACA"/>
<path d="M336.785 144.804L310.121 160.207L283.458 144.804V113.999L295.023 107.324L310.121 98.5955L336.785 113.999V144.804ZM269.644 105.527L256.28 97.8254V67.0194L269.644 59.3179L283.008 51.6164L309.672 67.0194V97.8254L296.308 105.527L282.944 113.228L269.644 105.527ZM337.749 144.355V113.485L310.571 97.8254V66.506L283.394 50.8463V19.5269L255.766 3.61046L228.139 19.5269V50.8463L200.962 66.506V97.8254L173.848 113.485V144.484H-10.2901V145.382H173.913L201.476 161.299L228.653 145.639L255.831 161.299L283.008 145.639L310.186 161.299L337.813 145.382V145.318H378.226V144.419H337.749V144.355ZM229.103 20.1045L255.766 4.7015L282.43 20.1045V50.9105L274.27 55.6597L255.766 66.3134L235.785 54.7612L229.103 50.9105V20.1045ZM228.203 144.804L201.54 160.207L174.876 144.804V113.999L201.54 98.5955L216.639 107.324L228.203 113.999V144.804ZM215.289 105.527L201.925 97.8254V67.0194L228.589 51.6164L243.752 60.409L255.252 67.0194V97.8254L243.816 104.5L228.653 113.293L215.289 105.527ZM282.494 144.804L255.831 160.207L229.167 144.804V113.999L235.849 110.148L255.831 98.5955L274.334 109.249L282.494 113.999V144.804Z" fill="#C9C9C9"/>
<path d="M336.913 144.676L310.25 160.079L283.586 144.676V113.87L295.151 107.196L310.25 98.4672L336.913 113.87V144.676ZM269.773 105.399L256.409 97.697V66.8911L269.773 59.1896L283.137 51.4881L309.8 66.8911V97.697L296.436 105.399L283.072 113.1L269.773 105.399ZM337.877 144.227V113.357L310.7 97.697V66.3776L283.522 50.7179V19.3985L255.895 3.4821L228.268 19.3985V50.7179L201.09 66.3776V97.697L173.913 113.357V144.355H-10.1616V145.254H174.105L201.668 161.17L228.846 145.51L256.023 161.17L283.201 145.51L310.378 161.17L338.005 145.254V145.19H378.418V144.291H337.877V144.227ZM229.231 19.9761L255.895 4.57315L282.558 19.9761V50.7821L274.399 55.5314L255.895 66.1851L235.913 54.6329L229.231 50.7821V19.9761ZM228.332 144.676L201.668 160.079L175.005 144.676V113.87L201.668 98.4672L216.767 107.196L228.332 113.87V144.676ZM215.418 105.399L202.054 97.697V66.8911L228.717 51.4881L243.88 60.2806L255.381 66.8911V97.697L243.88 104.307L228.717 113.1L215.418 105.399ZM282.623 144.676L255.959 160.079L229.296 144.676V113.87L235.978 110.019L255.959 98.4672L274.463 109.121L282.623 113.87V144.676Z" fill="#C8C8C8"/>
<path d="M337.042 144.548L310.378 159.951L283.715 144.548V113.742L295.28 107.067L310.378 98.3388L337.042 113.742V144.548ZM269.901 105.27L256.537 97.5687V66.7627L269.901 59.0612L283.265 51.3597L309.929 66.7627V97.5687L296.565 105.27L283.201 112.972L269.901 105.27ZM338.005 144.099V113.228L310.828 97.5687V66.2493L283.715 50.5896V19.2701L256.088 3.35373L228.46 19.2701V50.5896L201.283 66.2493V97.5687L174.105 113.228V144.227H-10.0331V145.125H174.17L201.733 161.042L228.91 145.382L256.088 161.042L283.265 145.382L310.443 161.042L338.07 145.125V145.061H378.418V144.163H338.005V144.099ZM229.424 19.7836L256.088 4.3806L282.751 19.7836V50.5896L274.591 55.3388L256.088 65.9925L236.106 54.4403L229.424 50.5896V19.7836ZM228.46 144.548L201.797 159.951L175.133 144.548V113.742L201.797 98.3388L216.896 107.067L228.46 113.742V144.548ZM215.611 105.27L202.247 97.5687V66.7627L228.91 51.3597L244.073 60.1522L255.574 66.7627V97.5687L244.137 104.179L228.974 112.972L215.611 105.27ZM282.751 144.548L256.088 159.951L229.424 144.548V113.742L236.106 109.891L256.088 98.3388L274.591 108.993L282.751 113.742V144.548Z" fill="#C7C7C7"/>
<path d="M337.235 144.419L310.571 159.822L283.908 144.419V113.613L295.472 106.939L310.571 98.2104L337.235 113.613V144.419ZM270.03 105.142L256.666 97.4403V66.6343L270.03 58.9328L283.394 51.2313L310.057 66.6343V97.4403L296.693 105.142L283.329 112.843L270.03 105.142ZM338.134 143.97V113.1L311.021 97.4403V66.1209L283.843 50.4612V19.1418L256.216 3.22537L228.589 19.1418V50.4612L201.411 66.1209V97.4403L174.234 113.1V144.098H-9.84033V144.997H174.362L201.925 160.913L229.103 145.254L256.28 160.913L283.458 145.254L310.635 160.913L338.263 144.997V144.933H378.675V144.034H338.134V143.97ZM229.553 19.6552L256.216 4.25224L282.88 19.6552V50.4612L274.72 55.2104L256.216 65.8642L236.235 54.3119L229.553 50.4612V19.6552ZM228.589 144.419L201.925 159.822L175.262 144.419V113.613L201.925 98.2104L217.024 106.939L228.589 113.613V144.419ZM215.739 105.142L202.375 97.4403V66.6343L229.039 51.2313L244.202 60.0239L255.702 66.6343V97.4403L244.202 104.051L229.039 112.843L215.739 105.142ZM282.88 144.419L256.216 159.822L229.553 144.419V113.613L236.235 109.763L256.216 98.2104L274.72 108.864L282.88 113.613V144.419Z" fill="#C6C6C6"/>
<path d="M337.363 144.291L310.7 159.694L283.972 144.291V113.485L295.537 106.81L310.635 98.0821L337.299 113.485V144.291H337.363ZM270.158 105.013L256.794 97.3119V66.506L270.158 58.8045L283.522 51.103L310.186 66.506V97.3119L296.822 105.013L283.458 112.715L270.158 105.013ZM338.327 143.842V112.972L311.149 97.3119V65.9925L283.972 50.3328V19.0134L256.345 3.097L228.717 19.0134V50.3328L201.604 65.9925V97.3119L174.427 112.972V143.97H-9.71185V144.869H174.491L202.054 160.785L229.231 145.125L256.409 160.785L283.586 145.125L310.764 160.785L338.391 144.869V144.804H378.804V143.906H338.327V143.842ZM229.681 19.5268L256.345 4.12387L283.008 19.5268V50.3328L274.848 55.0821L256.345 65.6716L236.363 54.1194L229.681 50.2686V19.5268ZM228.717 144.291L202.054 159.694L175.39 144.291V113.485L202.054 98.0821L217.153 106.81L228.717 113.485V144.291ZM215.868 105.013L202.504 97.3119V66.506L229.167 51.103L244.33 59.8955L255.831 66.506V97.3119L244.33 103.922L229.167 112.715L215.868 105.013ZM283.072 144.291L256.409 159.694L229.745 144.291V113.485L236.427 109.634L256.409 98.0821L274.913 108.736L283.072 113.485V144.291Z" fill="#C5C5C5"/>
<path d="M337.492 144.163L310.828 159.566L284.165 144.163V113.357L295.729 106.682L310.828 97.9537L337.492 113.357V144.163ZM270.287 104.821L256.923 97.1194V66.3134L270.287 58.6119L283.651 50.9104L310.314 66.3134V97.1194L296.95 104.821L283.586 112.522L270.287 104.821ZM338.455 143.649V112.843L311.278 97.1836V65.8642L284.1 50.2045V18.8209L256.473 2.90448L228.846 18.8209V50.1403L201.733 65.8V97.1194L174.555 112.843V143.842H-9.58331V144.74H174.62L202.182 160.657L229.36 144.933L256.537 160.593L283.715 144.933L310.892 160.593L338.52 144.676V144.612H378.932V143.649H338.455ZM229.81 19.3985L256.473 3.99552L283.137 19.3985V50.2045L274.977 54.9537L256.473 65.6075L236.492 54.0552L229.81 50.2045V19.3985ZM228.846 144.163L202.182 159.566L175.519 144.163V113.357L202.182 97.9537L217.281 106.682L228.846 113.357V144.163ZM215.996 104.821L202.632 97.1194V66.3134L229.296 50.9104L244.459 59.703L255.959 66.3134V97.1194L244.459 103.73L229.36 112.522L215.996 104.821ZM283.201 144.163L256.537 159.566L229.874 144.163V113.357L236.556 109.506L256.537 97.9537L275.041 108.607L283.201 113.357V144.163Z" fill="#C4C4C4"/>
<path d="M337.62 143.97L310.957 159.373L284.293 143.97V113.164L295.858 106.49L310.957 97.7612L337.62 113.164V143.97ZM270.48 104.693L257.116 96.991V66.1851L270.48 58.4836L283.843 50.7821L310.507 66.1851V96.991L297.143 104.693L283.779 112.394L270.48 104.693ZM338.584 143.521V112.651L311.406 96.991V65.6716L284.229 50.0119V18.6925L256.602 2.77611L228.974 18.6925V50.0119L201.797 65.6716V96.991L174.62 112.651V143.649H-9.45483V144.548H174.748L202.311 160.464L229.488 144.804L256.666 160.464L283.843 144.804L311.021 160.464L338.648 144.548V144.484H379.061V143.585H338.584V143.521ZM229.938 19.2701L256.602 3.86715L283.265 19.2701V50.0761L275.105 54.8254L256.602 65.4791L236.62 53.9268L229.938 50.0761V19.2701ZM229.039 143.97L202.375 159.373L175.712 143.97V113.164L202.375 97.7612L217.474 106.49L229.039 113.164V143.97ZM216.125 104.693L202.761 96.991V66.1851L229.424 50.7821L244.587 59.5746L256.088 66.1851V96.991L244.587 103.601L229.424 112.394L216.125 104.693ZM283.329 143.97L256.666 159.373L230.002 143.97V113.164L236.684 109.313L256.666 97.7612L275.17 108.415L283.329 113.164V143.97Z" fill="#C3C3C3"/>
<path d="M337.749 143.842L311.085 159.245L284.422 143.842V113.036L295.986 106.361L311.085 97.6328L337.749 113.036V143.842ZM270.608 104.564L257.244 96.8627V66.0567L270.608 58.3552L283.972 50.6537L310.635 66.0567V96.8627L297.271 104.564L283.908 112.266L270.608 104.564ZM338.712 143.393V112.522L311.535 96.8627V65.5433L284.357 49.8836V18.5642L256.73 2.64775L229.103 18.5642V49.8836L201.925 65.5433V96.8627L174.748 112.522V143.521H-9.32635V144.419H174.876L202.439 160.336L229.617 144.676L256.794 160.336L283.972 144.676L311.149 160.336L338.777 144.419V144.291H379.189V143.393H338.712ZM230.067 19.1418L256.73 3.7388L283.394 19.1418V49.9478L275.234 54.697L256.73 65.3507L236.749 53.7985L230.067 49.9478V19.1418ZM229.167 143.842L202.504 159.245L175.84 143.842V113.036L202.504 97.6328L217.602 106.361L229.167 113.036V143.842ZM216.253 104.564L202.889 96.8627V66.0567L229.553 50.6537L244.715 59.4463L256.216 66.0567V96.8627L244.715 103.473L229.553 112.266L216.253 104.564ZM283.458 143.842L256.794 159.245L230.131 143.842V113.036L236.813 109.185L256.794 97.6328L275.298 108.287L283.458 113.036V143.842Z" fill="#C2C2C2"/>
<path d="M337.941 143.713L311.278 159.116L284.614 143.713V112.907L296.179 106.233L311.278 97.5045L337.941 112.907V143.713ZM270.736 104.436L257.373 96.7343V65.9284L270.736 58.2269L284.1 50.5254L310.764 65.9284V96.7343L297.4 104.436L284.036 112.137L270.736 104.436ZM338.841 143.264V112.394L311.663 96.7343V65.4149L284.486 49.7552V18.4358L256.859 2.51939L229.231 18.4358V49.7552L202.054 65.4149V96.7343L174.876 112.394V143.393H-9.13361V144.291H175.069L202.632 160.207L229.81 144.548L256.987 160.207L284.165 144.548L311.342 160.207L338.969 144.291V144.227H379.382V143.328H338.841V143.264ZM230.259 18.9492L256.923 3.54626L283.586 18.9492V49.7552L275.427 54.5045L256.923 65.1582L236.941 53.606L230.259 49.7552V18.9492ZM229.296 143.713L202.632 159.116L175.969 143.713V112.907L202.632 97.5045L217.731 106.233L229.296 112.907V143.713ZM216.446 104.436L203.082 96.7343V65.9284L229.745 50.5254L244.908 59.3179L256.409 65.9284V96.7343L244.908 103.345L229.745 112.137L216.446 104.436ZM283.586 143.713L256.923 159.116L230.259 143.713V112.907L236.941 109.057L256.923 97.5045L275.427 108.158L283.586 112.907V143.713Z" fill="#C1C1C1"/>
<path d="M338.07 143.585L311.406 158.988L284.743 143.585V112.779L296.308 106.104L311.406 97.3761L338.07 112.779V143.585ZM270.865 104.307L257.501 96.606V65.8L270.865 58.0985L284.229 50.397L310.892 65.8V96.606L297.528 104.307L284.165 112.009L270.865 104.307ZM338.969 143.136V112.266L311.792 96.606V65.2866L284.614 49.6269V18.3075L256.987 2.39105L229.36 18.3075V49.6269L202.182 65.2866V96.606L175.005 112.266V143.264H-9.00513V144.163H175.198L202.761 160.079L229.938 144.419L257.116 160.079L284.293 144.419L311.471 160.079L339.098 144.163V144.099H379.511V143.2H338.969V143.136ZM230.388 18.8209L257.051 3.41792L283.715 18.8209V49.6269L275.555 54.3761L257.051 65.0299L237.07 53.4776L230.388 49.6269V18.8209ZM229.424 143.585L202.761 158.988L176.097 143.585V112.779L202.761 97.3761L217.859 106.104L229.424 112.779V143.585ZM216.574 104.307L203.21 96.606V65.8L229.874 50.397L245.037 59.1896L256.537 65.8V96.606L245.101 103.216L229.938 112.009L216.574 104.307ZM283.715 143.585L257.051 158.988L230.388 143.585V112.779L237.07 108.928L257.051 97.3761L275.555 108.03L283.715 112.779V143.585Z" fill="#C0C0C0"/>
<path d="M338.198 143.457L311.535 158.86L284.871 143.457V112.651L296.436 105.976L311.535 97.2478L338.198 112.651V143.457ZM270.993 104.115L257.63 96.4134V65.6075L270.993 57.906L284.357 50.2045L311.021 65.6075V96.4134L297.657 104.115L284.293 111.816L270.993 104.115ZM339.162 143.007V112.137L311.985 96.4776V65.1582L284.807 49.4985V18.1791L257.18 2.2627L229.553 18.1791V49.4985L202.375 65.1582V96.4776L175.198 112.137V143.136H-8.87659V144.034H175.326L202.889 159.951L230.067 144.291L257.244 159.951L284.422 144.291L311.599 159.951L339.226 144.034V143.97H379.639V143.007H339.162ZM230.516 18.6925L257.18 3.28956L283.843 18.6925V49.4985L275.684 54.2478L257.18 64.9015L237.198 53.3493L230.516 49.4985V18.6925ZM229.553 143.457L202.889 158.86L176.226 143.457V112.651L202.889 97.2478L217.988 105.976L229.553 112.651V143.457ZM216.703 104.115L203.339 96.4134V65.6075L230.002 50.2045L245.165 58.997L256.666 65.6075V96.4134L245.165 103.024L230.002 111.816L216.703 104.115ZM283.908 143.457L257.244 158.86L230.581 143.457V112.651L237.263 108.8L257.244 97.2478L275.748 107.901L283.908 112.651V143.457Z" fill="#BFBFBF"/>
<path d="M338.327 143.264L311.663 158.667L285 143.264V112.458L296.565 105.784L311.663 97.0552L338.327 112.458V143.264ZM271.186 103.987L257.822 96.285V65.4791L271.186 57.7776L284.55 50.0761L311.214 65.4791V96.285L297.85 103.987L284.486 111.688L271.186 103.987ZM339.29 142.815V111.945L312.113 96.285V64.9656L285 49.3059V17.9865L257.373 2.07013L229.745 17.9865V49.3059L202.568 64.9656V96.285L175.39 111.945V142.943H-8.74811V143.842H175.455L203.018 159.758L230.195 144.098L257.373 159.758L284.55 144.098L311.728 159.758L339.355 143.842V143.778H379.703V142.879H339.29V142.815ZM230.645 18.5642L257.308 3.16117L283.972 18.5642V49.3701L275.812 54.1194L257.373 64.7089L237.391 53.1567L230.645 49.3059V18.5642ZM229.745 143.264L203.082 158.667L176.418 143.264V112.458L203.082 97.0552L218.181 105.784L229.745 112.458V143.264ZM216.831 103.987L203.467 96.285V65.4791L230.131 50.0761L245.294 58.8686L256.794 65.4791V96.285L245.294 102.896L230.131 111.688L216.831 103.987ZM284.036 143.264L257.373 158.667L230.709 143.264V112.458L237.391 108.607L257.373 97.0552L275.876 107.709L284.036 112.458V143.264Z" fill="#BEBEBE"/>
<path d="M338.455 143.136L311.792 158.539L285.128 143.136V112.33L296.693 105.655L311.792 96.9269L338.455 112.33V143.136ZM271.315 103.858L257.951 96.1567V65.3508L271.315 57.6493L284.679 49.9478L311.342 65.3508V96.1567L297.978 103.858L284.614 111.56L271.315 103.858ZM339.419 142.687V111.816L312.241 96.1567V64.8373L285.064 49.1776V17.8582L257.437 1.9418L229.81 17.8582V49.1776L202.632 64.8373V96.1567L175.455 111.816V142.815H-8.61963V143.713H175.583L203.146 159.63L230.324 143.97L257.501 159.63L284.679 143.97L311.856 159.63L339.483 143.713V143.649H379.896V142.751H339.419V142.687ZM230.773 18.4358L257.437 3.03285L284.1 18.4358V49.2418L275.941 53.9911L257.437 64.6448L237.455 53.0925L230.773 49.2418V18.4358ZM229.874 143.136L203.21 158.539L176.547 143.136V112.33L203.21 96.9269L218.309 105.655L229.874 112.33V143.136ZM216.96 103.858L203.66 96.1567V65.3508L230.324 49.9478L245.486 58.7403L256.987 65.3508V96.1567L245.486 102.767L230.324 111.56L216.96 103.858ZM284.165 143.136L257.501 158.539L230.838 143.136V112.33L237.52 108.479L257.501 96.9269L276.005 107.581L284.165 112.33V143.136Z" fill="#BDBDBD"/>
<path d="M338.584 143.007L311.92 158.41L285.257 143.007V112.202L296.822 105.527L311.92 96.7985L338.584 112.202V143.007ZM271.443 103.73L258.079 96.0284V65.2224L271.443 57.5209L284.807 49.8194L311.471 65.2224V96.0284L298.107 103.73L284.743 111.431L271.443 103.73ZM339.548 142.558V111.688L312.37 96.0284V64.709L285.257 49.0493V17.7299L257.63 1.81345L230.002 17.7299V49.0493L202.825 64.709V96.0284L175.647 111.688V142.687H-8.49109V143.585H175.712L203.275 159.502L230.452 143.842L257.63 159.502L284.807 143.842L311.985 159.502L339.612 143.585V143.521H380.025V142.622H339.548V142.558ZM230.966 18.2433L257.63 2.84031L284.293 18.2433V49.0493L276.133 53.7985L257.63 64.4523L237.648 52.9L230.966 49.0493V18.2433ZM230.002 143.007L203.339 158.41L176.675 143.007V112.202L203.339 96.7985L218.438 105.527L230.002 112.202V143.007ZM217.153 103.73L203.789 96.0284V65.2224L230.452 49.8194L245.615 58.612L257.116 65.2224V96.0284L245.615 102.639L230.452 111.431L217.153 103.73ZM284.293 143.007L257.63 158.41L230.966 143.007V112.202L237.648 108.351L257.63 96.7985L276.133 107.452L284.293 112.202V143.007Z" fill="#BCBCBC"/>
<path d="M338.777 142.879L312.113 158.282L285.45 142.879V112.073L297.014 105.398L312.113 96.6701L338.777 112.073V142.879ZM271.572 103.601L258.208 95.9V65.094L271.572 57.3925L284.936 49.691L311.599 65.094V95.9L298.235 103.601L284.871 111.303L271.572 103.601ZM339.676 142.43V111.56L312.499 95.9V64.5806L285.321 48.9209V17.6015L257.694 1.68507L230.067 17.6015V48.9209L202.889 64.5806V95.9L175.84 111.56V142.558H-8.29834V143.457H175.904L203.467 159.373L230.645 143.713L257.822 159.373L285 143.713L312.177 159.373L339.805 143.457V143.393H380.217V142.494H339.676V142.43ZM231.095 18.1149L257.758 2.71194L284.422 18.1149V48.9209L276.262 53.6701L257.758 64.3239L237.777 52.7716L231.095 48.9209V18.1149ZM230.131 142.879L203.467 158.282L176.804 142.879V112.073L203.467 96.6701L218.566 105.398L230.131 112.073V142.879ZM217.281 103.601L203.917 95.9V65.094L230.581 49.691L245.744 58.4836L257.244 65.094V95.9L245.744 102.51L230.581 111.303L217.281 103.601ZM284.422 142.879L257.758 158.282L231.095 142.879V112.073L237.777 108.222L257.758 96.6701L276.262 107.324L284.422 112.073V142.879Z" fill="#BBBBBB"/>
<path d="M338.905 142.751L312.242 158.154L285.578 142.751V111.945L297.143 105.27L312.242 96.5418L338.905 111.945V142.751ZM271.7 103.473L258.336 95.7716V64.9657L271.7 57.2642L285.064 49.5627L311.728 64.9657V95.7716L298.364 103.473L285 111.175L271.7 103.473ZM339.869 142.301V111.431L312.691 95.7716V64.4522L285.514 48.7925V17.4731L257.887 1.55672L230.259 17.4731V48.7925L203.082 64.4522V95.7716L175.904 111.431V142.43H-8.16986V143.328H176.033L203.596 159.245L230.773 143.585L257.951 159.245L285.128 143.585L312.306 159.245L339.933 143.328V143.264H380.346V142.366H339.869V142.301ZM231.223 17.9866L257.887 2.58358L284.55 17.9866V48.7925L276.39 53.5418L257.887 64.1955L237.905 52.6433L231.223 48.7925V17.9866ZM230.259 142.751L203.596 158.154L176.932 142.751V111.945L203.596 96.5418L218.695 105.27L230.259 111.945V142.751ZM217.41 103.473L204.046 95.7716V64.9657L230.709 49.5627L245.872 58.3552L257.373 64.9657V95.7716L245.872 102.382L230.709 111.175L217.41 103.473ZM284.614 142.751L257.951 158.154L231.287 142.751V111.945L237.969 108.094L257.951 96.5418L276.455 107.195L284.614 111.945V142.751Z" fill="#BABABA"/>
<path d="M339.034 142.622L312.37 158.025L285.707 142.622V111.816L297.271 105.142L312.37 96.4134L339.034 111.816V142.622ZM271.829 103.281L258.465 95.5791V64.7731L271.829 57.0716L285.193 49.3701L311.856 64.7731V95.5791L298.492 103.281L285.128 110.982L271.829 103.281ZM339.997 142.109V111.239L312.82 95.5791V64.2597L285.642 48.6V17.2806L258.015 1.36418L230.388 17.2806V48.6L203.21 64.2597V95.5791L176.033 111.239V142.237H-8.04138V143.136H176.161L203.724 159.052L230.902 143.393L258.079 159.052L285.257 143.393L312.434 159.052L340.062 143.136V143.072H380.346V142.173H339.997V142.109ZM231.352 17.8582L258.015 2.45523L284.679 17.8582V48.6642L276.519 53.4134L258.015 64.0672L238.034 52.5149L231.352 48.6642V17.8582ZM230.388 142.622L203.724 158.025L177.061 142.622V111.816L203.724 96.4134L218.823 105.142L230.388 111.816V142.622ZM217.538 103.281L204.174 95.5791V64.7731L230.838 49.3701L246 58.1627L257.501 64.7731V95.5791L246.065 102.254L230.902 111.046L217.538 103.281ZM284.743 142.622L258.079 158.025L231.416 142.622V111.816L238.098 107.966L258.079 96.4134L276.583 107.067L284.743 111.816V142.622Z" fill="#B9B9B9"/>
<path d="M339.162 142.43L312.499 157.833L285.835 142.43V111.624L297.4 104.949L312.499 96.2209L339.162 111.624V142.43ZM272.021 103.152L258.658 95.4507V64.6448L272.021 56.9433L285.385 49.2418L312.049 64.6448V95.4507L298.685 103.152L285.321 110.854L272.021 103.152ZM340.126 141.981V111.11L312.948 95.4507V64.1313L285.771 48.4716V17.1522L258.144 1.23582L230.516 17.1522V48.4716L203.339 64.1313V95.4507L176.161 111.11V142.109H-7.91284V143.007H176.29L203.853 158.924L231.03 143.264L258.208 158.924L285.385 143.264L312.563 158.924L340.19 143.007V142.943H380.603V142.045H340.126V141.981ZM231.48 17.7299L258.144 2.32687L284.807 17.7299V48.5358L276.647 53.2851L258.144 63.9388L238.162 52.3866L231.48 48.5358V17.7299ZM230.581 142.43L203.917 157.833L177.254 142.43V111.624L203.917 96.2209L219.016 104.949L230.581 111.624V142.43ZM217.667 103.152L204.303 95.4507V64.6448L230.966 49.2418L246.129 58.0343L257.63 64.6448V95.4507L246.129 102.061L230.966 110.854L217.667 103.152ZM284.871 142.43L258.208 157.833L231.544 142.43V111.624L238.226 107.773L258.208 96.2209L276.712 106.875L284.871 111.624V142.43Z" fill="#B8B8B8"/>
<path d="M339.29 142.301L312.627 157.704L285.964 142.301V111.495L297.528 104.821L312.627 96.0925L339.29 111.495V142.301ZM272.15 103.024L258.786 95.3224V64.5164L272.15 56.8149L285.514 49.1134L312.177 64.5164V95.3224L298.813 103.024L285.45 110.725L272.15 103.024ZM340.254 141.852V110.982L313.077 95.3224V64.003L285.899 48.3433V17.0239L258.272 1.10745L230.645 17.0239V48.3433L203.467 64.003V95.3224L176.29 110.982V141.981H-7.78436V142.879H176.418L203.981 158.796L231.159 143.136L258.336 158.796L285.514 143.136L312.691 158.796L340.318 142.879V142.815H380.731V141.916H340.254V141.852ZM231.673 17.6015L258.336 2.1985L285 17.6015V48.4074L276.84 53.1567L258.336 63.8104L238.355 52.2582L231.673 48.4074V17.6015ZM230.709 142.301L204.046 157.704L177.382 142.301V111.495L204.046 96.0925L219.144 104.821L230.709 111.495V142.301ZM217.859 103.024L204.495 95.3224V64.5164L231.159 49.1134L246.322 57.906L257.822 64.5164V95.3224L246.386 101.933L231.223 110.725L217.859 103.024ZM285 142.301L258.336 157.704L231.673 142.301V111.495L238.355 107.645L258.336 96.0925L276.84 106.746L285 111.495V142.301Z" fill="#B7B7B7"/>
<path d="M339.483 142.173L312.82 157.576L286.156 142.173V111.367L297.721 104.693L312.82 95.9641L339.483 111.367V142.173ZM272.278 102.896L258.915 95.194V64.388L272.278 56.6866L285.642 48.9851L312.306 64.388V95.194L298.942 102.896L285.578 110.597L272.278 102.896ZM340.383 141.724V110.854L313.205 95.194V63.8746L286.028 48.2149V16.8955L258.401 0.979095L230.773 16.8955V48.2149L203.66 63.8746V95.194L176.483 110.854V141.852H-7.59161V142.751H176.611L204.174 158.667L231.287 143.007L258.465 158.667L285.642 143.007L312.82 158.667L340.447 142.751V142.687H380.86V141.724H340.383ZM231.801 17.4089L258.465 2.00596L285.128 17.4089V48.2149L276.969 52.9642L258.465 63.6179L238.483 52.0657L231.801 48.2149V17.4089ZM230.838 142.173L204.174 157.576L177.511 142.173V111.367L204.174 95.9641L219.273 104.693L230.838 111.367V142.173ZM217.988 102.896L204.624 95.194V64.388L231.287 48.9851L246.45 57.7776L257.951 64.388V95.194L246.45 101.804L231.287 110.597L217.988 102.896ZM285.128 142.173L258.465 157.576L231.801 142.173V111.367L238.483 107.516L258.465 95.9641L276.969 106.618L285.128 111.367V142.173Z" fill="#B6B6B6"/>
<path d="M339.612 142.045L312.948 157.448L286.285 142.045V111.239L297.85 104.564L312.948 95.8358L339.612 111.239V142.045ZM272.407 102.767L259.043 95.0657V64.2597L272.407 56.5582L285.771 48.8567L312.434 64.2597V95.0657L299.07 102.767L285.707 110.469L272.407 102.767ZM340.511 141.596V110.725L313.334 95.0657V63.7463L286.156 48.0866V16.7672L258.529 0.850739L230.902 16.7672V48.0866L203.724 63.7463V95.0657L176.675 110.725V141.724H-7.46313V142.622H176.74L204.303 158.539L231.48 142.879L258.658 158.539L285.835 142.879L313.013 158.539L340.64 142.622V142.558H381.053V141.66H340.511V141.596ZM231.93 17.2806L258.593 1.8776L285.257 17.2806V48.0866L277.097 52.8358L258.593 63.4254L238.612 51.8731L231.93 48.0224V17.2806ZM230.966 142.045L204.303 157.448L177.639 142.045V111.239L204.303 95.8358L219.401 104.564L230.966 111.239V142.045ZM218.116 102.767L204.752 95.0657V64.2597L231.416 48.8567L246.579 57.6493L258.079 64.2597V95.0657L246.579 101.676L231.416 110.469L218.116 102.767ZM285.257 142.045L258.593 157.448L231.93 142.045V111.239L238.612 107.388L258.593 95.8358L277.097 106.49L285.257 111.239V142.045Z" fill="#B5B5B5"/>
<path d="M339.74 141.916L313.077 157.319L286.413 141.916V111.11L297.978 104.436L313.077 95.7075L339.74 111.11V141.916ZM272.535 102.575L259.172 94.8731V64.0672L272.535 56.3657L285.899 48.6642L312.563 64.0672V94.8731L299.199 102.575L285.899 110.276L272.535 102.575ZM340.704 141.403V110.533L313.527 94.9373V63.6179L286.349 47.9582V16.6388L258.722 0.722397L231.095 16.6388V47.9582L203.917 63.6179V94.9373L176.74 110.597V141.596H-7.33459V142.494H176.868L204.431 158.41L231.609 142.751L258.786 158.41L285.964 142.751L313.141 158.41L340.768 142.494V142.366H381.181V141.467H340.704V141.403ZM232.058 17.1522L258.722 1.74926L285.385 17.1522V47.9582L277.226 52.7075L258.722 63.3612L238.74 51.809L232.058 47.9582V17.1522ZM231.095 141.916L204.431 157.319L177.768 141.916V111.11L204.431 95.7075L219.53 104.436L231.095 111.11V141.916ZM218.245 102.575L204.881 94.8731V64.0672L231.544 48.6642L246.707 57.4567L258.208 64.0672V94.8731L246.707 101.484L231.609 110.276L218.245 102.575ZM285.45 141.916L258.786 157.319L232.123 141.916V111.11L238.805 107.26L258.786 95.7075L277.29 106.361L285.45 111.11V141.916Z" fill="#B4B4B4"/>
<path d="M339.869 141.724L313.205 157.127L286.542 141.724V110.918L298.107 104.243L313.205 95.5149L339.869 110.918V141.724ZM272.728 102.446L259.364 94.7448V63.9388L272.728 56.2373L286.092 48.5358L312.756 63.9388V94.7448L299.392 102.446L286.028 110.148L272.728 102.446ZM340.833 141.275V110.404L313.655 94.7448V63.4254L286.542 47.7657V16.4463L258.915 0.529846L231.287 16.4463V47.7657L204.11 63.4254V94.7448L176.932 110.404V141.403H-7.20612V142.301H176.997L204.56 158.218L231.737 142.558L258.915 158.218L286.092 142.558L313.27 158.218L340.897 142.301V142.237H381.31V141.339H340.833V141.275ZM232.187 17.0239L258.85 1.62089L285.514 17.0239V47.8298L277.354 52.5791L258.915 63.1687L238.933 51.6164L232.251 47.7657V17.0239H232.187ZM231.287 141.724L204.624 157.127L177.96 141.724V110.918L204.624 95.5149L219.723 104.243L231.287 110.918V141.724ZM218.373 102.446L205.009 94.7448V63.9388L231.673 48.5358L246.836 57.3284L258.336 63.9388V94.7448L246.836 101.355L231.673 110.148L218.373 102.446ZM285.578 141.724L258.915 157.127L232.251 141.724V110.918L238.933 107.067L258.915 95.5149L277.418 106.169L285.578 110.918V141.724Z" fill="#B3B3B3"/>
</g>
<path d="M340.833 141.275V110.404L313.655 94.7448V63.4254L286.542 47.7657V16.4463L258.915 0.529846L231.287 16.4463V47.7657L204.11 63.4254V94.7448L176.932 110.404V141.403H-7.20612V142.301H176.997L204.56 158.218L231.737 142.558L258.915 158.218L286.092 142.558L313.27 158.218L340.897 142.301V142.237H381.31V141.339H340.833V141.275ZM232.187 17.0239L258.85 1.62089L285.514 17.0239V47.8298L277.354 52.5791L258.915 63.1686L238.933 51.6164L232.251 47.7657V17.0239H232.187ZM231.287 141.724L204.624 157.127L177.96 141.724V110.918L204.624 95.5149L219.723 104.243L231.287 110.918V141.724ZM218.373 102.446L205.009 94.7448V63.9388L231.673 48.5358L246.836 57.3284L258.336 63.9388V94.7448L246.836 101.355L231.673 110.148L218.373 102.446ZM285.578 141.724L258.915 157.127L232.251 141.724V110.918L238.933 107.067L258.915 95.5149L277.418 106.169L285.578 110.918V141.724ZM272.728 102.446L259.364 94.7448V63.9388L272.728 56.2373L286.092 48.5358L312.756 63.9388V94.7448L299.392 102.446L286.028 110.148L272.728 102.446ZM339.869 141.724L313.205 157.127L286.542 141.724V110.918L298.107 104.243L313.205 95.5149L339.869 110.918V141.724Z" fill="white"/>
</svg>
