<svg width="375" height="334" viewBox="0 0 375 334" fill="none" xmlns="http://www.w3.org/2000/svg">
<circle cx="25" cy="228" r="106" fill="white" fill-opacity="0.1"/>
<circle cx="368.5" cy="41.5" r="73.5" fill="white" fill-opacity="0.1"/>
</svg>
