<svg width="13" height="12" viewBox="0 0 13 12" fill="none" xmlns="http://www.w3.org/2000/svg">
<path fill-rule="evenodd" clip-rule="evenodd" d="M9.33376 4.72667L7.6071 6.44667V0H6.27376V6.44667L4.5471 4.72667L3.6071 5.66667L6.94043 9L10.2738 5.66667L9.33376 4.72667ZM11.6071 10.6667V6H12.9404V10.6667C12.9404 11.4 12.3404 12 11.6071 12H2.27376C1.54043 12 0.94043 11.4 0.94043 10.6667V6H2.27376V10.6667H11.6071Z" fill="white"/>
</svg>
