<svg width="168" height="125" viewBox="0 0 168 125" fill="none" xmlns="http://www.w3.org/2000/svg">
<g clip-path="url(#clip0_39_284)">
<path d="M55.2805 107.23C55.2801 107.021 55.3208 106.815 55.4004 106.622C55.48 106.429 55.5969 106.253 55.7444 106.106C55.8918 105.958 56.067 105.841 56.2598 105.761C56.4527 105.681 56.6594 105.64 56.8681 105.64H77.3901C77.1793 104.8 76.9844 103.926 76.8021 103.025H60.8018C60.7742 103.025 60.7469 103.02 60.7213 103.009C60.6958 102.999 60.6726 102.983 60.6531 102.964C60.6336 102.944 60.6181 102.921 60.6076 102.896C60.5971 102.87 60.5917 102.843 60.5918 102.815H51.8021V124.865H55.2805V107.23Z" fill="#90C9ED"/>
<path d="M60.8021 102.608H76.7243C76.5076 101.48 76.3135 100.31 76.1413 99.1166H47.8653C47.7846 99.1166 47.7046 99.1325 47.6301 99.1634C47.5555 99.1943 47.4878 99.2396 47.4308 99.2967C47.3737 99.3538 47.3285 99.4216 47.2977 99.4962C47.2669 99.5708 47.2511 99.6508 47.2512 99.7315V102.204C47.2512 102.367 47.3159 102.523 47.4311 102.639C47.5462 102.754 47.7024 102.818 47.8653 102.818H60.5921C60.5921 102.763 60.6142 102.709 60.6536 102.67C60.693 102.631 60.7464 102.608 60.8021 102.608Z" fill="#75B2E1"/>
<path d="M60.8016 102.608C60.7459 102.608 60.6925 102.631 60.6531 102.67C60.6137 102.709 60.5916 102.763 60.5916 102.818C60.5915 102.846 60.5969 102.873 60.6074 102.899C60.6179 102.924 60.6333 102.948 60.6529 102.967C60.6724 102.987 60.6956 103.002 60.7211 103.013C60.7466 103.023 60.774 103.029 60.8016 103.028H76.8053C76.7776 102.89 76.7507 102.75 76.7213 102.608H60.8016Z" fill="#6279BA"/>
<path d="M69.1419 115.896C69.0256 115.896 68.9119 115.93 68.8152 115.995C68.7185 116.059 68.6432 116.151 68.5987 116.259C68.5541 116.366 68.5425 116.484 68.5652 116.598C68.5879 116.712 68.6439 116.817 68.7261 116.899C68.8083 116.982 68.9131 117.038 69.0272 117.06C69.1412 117.083 69.2595 117.071 69.3669 117.027C69.4743 116.982 69.5662 116.907 69.6308 116.81C69.6954 116.714 69.7299 116.6 69.7299 116.484C69.7299 116.328 69.6679 116.178 69.5577 116.068C69.4474 115.958 69.2978 115.896 69.1419 115.896Z" fill="#75B2E1"/>
<path d="M79.8246 124.868H90.8101C90.7908 122.367 90.8479 119.581 90.9562 116.673C85.0317 117.368 80.6066 115.413 78.2596 108.6C77.9421 107.676 77.6532 106.688 77.3902 105.643H56.8682C56.4474 105.643 56.0438 105.811 55.7462 106.108C55.4486 106.406 55.2814 106.809 55.2814 107.23V124.87H71.9974C72.0531 124.87 72.1065 124.892 72.1459 124.932C72.1853 124.971 72.2074 125.024 72.2074 125.08H79.6146C79.6143 125.052 79.6196 125.025 79.6301 124.999C79.6405 124.974 79.6559 124.95 79.6755 124.931C79.695 124.911 79.7182 124.895 79.7438 124.885C79.7694 124.874 79.7968 124.868 79.8246 124.868ZM69.1423 117.484C68.9429 117.484 68.748 117.425 68.5823 117.314C68.4165 117.203 68.2873 117.046 68.211 116.862C68.1347 116.678 68.1148 116.475 68.1536 116.279C68.1925 116.084 68.2885 115.904 68.4295 115.763C68.5705 115.622 68.7501 115.526 68.9456 115.487C69.1412 115.448 69.3438 115.468 69.528 115.545C69.7122 115.621 69.8696 115.75 69.9804 115.916C70.0912 116.082 70.1503 116.277 70.1503 116.476C70.1503 116.743 70.0441 117 69.855 117.189C69.666 117.378 69.4096 117.484 69.1423 117.484ZM72.6753 123.849C72.6753 123.904 72.6532 123.958 72.6138 123.997C72.5744 124.037 72.521 124.059 72.4653 124.059C72.4096 124.059 72.3562 124.037 72.3168 123.997C72.2774 123.958 72.2553 123.904 72.2553 123.849V106.366C72.2553 106.31 72.2774 106.257 72.3168 106.217C72.3562 106.178 72.4096 106.156 72.4653 106.156C72.521 106.156 72.5744 106.178 72.6138 106.217C72.6532 106.257 72.6753 106.31 72.6753 106.366V123.849Z" fill="#75B2E1"/>
<path d="M72.4652 106.156C72.4096 106.156 72.3561 106.178 72.3168 106.217C72.2774 106.257 72.2552 106.31 72.2552 106.366V123.85C72.2552 123.906 72.2774 123.959 72.3168 123.999C72.3561 124.038 72.4096 124.06 72.4652 124.06C72.5209 124.06 72.5744 124.038 72.6137 123.999C72.6531 123.959 72.6752 123.906 72.6752 123.85V106.366C72.6752 106.31 72.6531 106.257 72.6137 106.217C72.5744 106.178 72.5209 106.156 72.4652 106.156Z" fill="#6279BA"/>
<path d="M69.142 115.476C68.9426 115.476 68.7477 115.535 68.5819 115.645C68.4161 115.756 68.2869 115.914 68.2106 116.098C68.1343 116.282 68.1144 116.485 68.1533 116.68C68.1922 116.876 68.2882 117.055 68.4292 117.196C68.5701 117.337 68.7498 117.433 68.9453 117.472C69.1408 117.511 69.3435 117.491 69.5277 117.415C69.7119 117.339 69.8693 117.209 69.9801 117.044C70.0909 116.878 70.15 116.683 70.15 116.484C70.15 116.216 70.0438 115.96 69.8547 115.771C69.6657 115.582 69.4093 115.476 69.142 115.476ZM69.142 117.066C69.0257 117.066 68.912 117.031 68.8153 116.967C68.7186 116.902 68.6432 116.81 68.5987 116.703C68.5542 116.595 68.5425 116.477 68.5652 116.363C68.5879 116.249 68.6439 116.144 68.7262 116.062C68.8084 115.98 68.9132 115.924 69.0272 115.901C69.1413 115.878 69.2595 115.89 69.367 115.934C69.4744 115.979 69.5663 116.054 69.6309 116.151C69.6955 116.248 69.73 116.361 69.73 116.478C69.7295 116.633 69.6674 116.782 69.5572 116.892C69.4469 117.002 69.2976 117.064 69.142 117.064V117.066Z" fill="#6279BA"/>
<path d="M77.3808 78.7369C77.4079 78.75 77.4377 78.7568 77.4679 78.7567C77.5124 78.7565 77.5557 78.7413 77.5905 78.7135C77.6254 78.6857 77.6498 78.6469 77.6599 78.6035C77.67 78.5601 77.6651 78.5145 77.646 78.4742C77.627 78.4339 77.5949 78.4012 77.555 78.3814C75.7132 77.4795 75.6491 74.5474 75.6483 74.5173C75.6475 74.4653 75.6263 74.4158 75.5892 74.3794C75.5522 74.3429 75.5023 74.3225 75.4504 74.3225C75.4243 74.3229 75.3986 74.3284 75.3747 74.3387C75.3508 74.349 75.3291 74.364 75.311 74.3827C75.2929 74.4012 75.2785 74.4231 75.2689 74.4471C75.2592 74.4712 75.2544 74.4969 75.2548 74.5228C75.2516 74.6662 75.3237 77.7321 77.3808 78.7369Z" fill="#E07C69"/>
<path d="M72.4056 76.6409C69.2115 76.4533 65.9619 74.3613 65.9294 74.3399C65.8855 74.314 65.8332 74.306 65.7835 74.3177C65.7338 74.3294 65.6906 74.3598 65.6628 74.4026C65.635 74.4454 65.6248 74.4973 65.6344 74.5474C65.6439 74.5976 65.6725 74.6421 65.714 74.6717C65.8494 74.7604 69.0816 76.8421 72.3819 77.0361H72.3937C72.4197 77.0368 72.4456 77.0325 72.47 77.0233C72.4943 77.014 72.5165 77.0001 72.5355 76.9823C72.5544 76.9645 72.5696 76.9431 72.5803 76.9194C72.591 76.8956 72.5969 76.87 72.5976 76.844C72.5984 76.818 72.5941 76.7922 72.5848 76.7678C72.5756 76.7435 72.5617 76.7213 72.5439 76.7023C72.526 76.6834 72.5046 76.6682 72.4809 76.6575C72.4572 76.6468 72.4316 76.6409 72.4056 76.6402V76.6409Z" fill="#E07C69"/>
<path d="M71.9314 78.3663C68.5772 77.8215 66.6587 75.8816 66.6397 75.8618C66.603 75.8246 66.5532 75.8033 66.5009 75.8027C66.4487 75.8021 66.3983 75.8222 66.3608 75.8585C66.3233 75.8949 66.3017 75.9446 66.3007 75.9968C66.2997 76.049 66.3194 76.0995 66.3554 76.1373C66.4346 76.2213 68.3777 78.1905 71.868 78.7566C71.8786 78.7574 71.8891 78.7574 71.8997 78.7566C71.9522 78.7608 72.0042 78.744 72.0443 78.7099C72.0844 78.6757 72.1093 78.627 72.1135 78.5745C72.1177 78.522 72.1008 78.47 72.0667 78.4299C72.0325 78.3898 71.9839 78.3649 71.9314 78.3607V78.3663Z" fill="#E07C69"/>
<path d="M71.1284 79.5469C69.7205 79.4883 68.5035 78.569 67.7307 77.8049C67.7123 77.7861 67.6903 77.7713 67.6661 77.7611C67.6419 77.7509 67.6159 77.7457 67.5897 77.7457C67.5634 77.7456 67.5374 77.7508 67.5132 77.761C67.4889 77.7711 67.467 77.7859 67.4485 77.8046C67.4301 77.8233 67.4156 77.8455 67.4058 77.8699C67.396 77.8943 67.3912 77.9203 67.3916 77.9466C67.392 77.9728 67.3976 77.9988 67.4081 78.0228C67.4186 78.0469 67.4338 78.0686 67.4528 78.0868C68.2755 78.8968 69.578 79.8755 71.1125 79.9389H71.1204C71.1729 79.9399 71.2237 79.92 71.2616 79.8837C71.2994 79.8473 71.3213 79.7973 71.3224 79.7448C71.3234 79.6923 71.3036 79.6416 71.2672 79.6037C71.2308 79.5659 71.1809 79.544 71.1284 79.5429V79.5469Z" fill="#E07C69"/>
<path d="M90.0852 101.251C90.1264 101.041 90.1644 100.829 90.208 100.618H89.7677C89.839 100.832 89.9118 101.045 89.9839 101.258C90.0164 101.247 90.0514 101.245 90.0852 101.251Z" fill="#75B2E1"/>
<path d="M78.288 104.305C78.4567 105.155 78.6404 105.979 78.8423 106.77C79.0901 107.755 79.3625 108.69 79.6618 109.557C81.8741 115.977 86.0454 117.822 91.63 117.167C91.8003 112.591 92.1051 107.693 92.4393 103.177C92.3873 103.173 92.339 103.149 92.3047 103.11C92.2705 103.07 92.2531 103.019 92.2564 102.967C92.3522 101.502 92.4884 100.029 92.6523 98.5908L90.7709 97.7072L90.2056 100.618C90.1644 100.829 90.1264 101.041 90.0828 101.251C90.1094 101.256 90.1346 101.267 90.1569 101.282C90.1793 101.297 90.1982 101.317 90.2127 101.34C90.2737 101.437 91.7037 103.752 91.6815 106.772C91.6809 106.824 91.6598 106.874 91.6227 106.911C91.5857 106.947 91.5357 106.968 91.4836 106.968C91.4575 106.968 91.4318 106.963 91.4078 106.953C91.3838 106.943 91.3621 106.928 91.3438 106.909C91.3256 106.891 91.3111 106.869 91.3014 106.845C91.2917 106.821 91.2869 106.795 91.2872 106.769C91.3086 103.864 89.8936 101.573 89.8793 101.551C89.8655 101.529 89.8561 101.504 89.8518 101.478C89.8474 101.453 89.8481 101.426 89.854 101.401C89.8598 101.376 89.8705 101.352 89.8856 101.33C89.9007 101.309 89.9198 101.291 89.9419 101.277C89.9546 101.269 89.9685 101.263 89.9831 101.258C89.911 101.045 89.8382 100.832 89.7669 100.618C87.8064 94.7893 86.1008 88.6615 85.6629 82.5273C87.0732 78.0052 83.5623 75.4421 80.7648 73.4816C78.6127 71.9724 76.9277 70.3658 74.8262 68.6515C72.7849 66.984 73.6828 72.6771 75.3068 74.3858C75.325 74.3671 75.3466 74.3522 75.3705 74.3419C75.3944 74.3315 75.4202 74.326 75.4462 74.3257C75.4982 74.3257 75.548 74.3461 75.5851 74.3825C75.6221 74.419 75.6433 74.4685 75.6442 74.5205C75.6442 74.5505 75.7091 77.4826 77.5508 78.3845C77.5908 78.4043 77.6229 78.437 77.6419 78.4773C77.661 78.5176 77.6658 78.5632 77.6558 78.6066C77.6457 78.6501 77.6212 78.6888 77.5864 78.7166C77.5515 78.7444 77.5083 78.7597 77.4637 78.7598C77.4336 78.7599 77.4038 78.7531 77.3766 78.74C75.3179 77.7328 75.2506 74.6669 75.2482 74.5276C72.6083 74.5569 70.0112 73.4317 67.5202 73.0508C64.9666 72.6613 64.9492 73.8783 66.0735 77.1319C67.1979 80.3854 72.3106 82.7997 76.3805 84.0001C76.5239 88.9093 76.8509 95.0443 77.6577 100.619C77.8161 101.744 78.003 102.846 78.2072 103.91C78.2365 104.042 78.2603 104.175 78.288 104.305ZM71.1205 79.942H71.1126C69.5781 79.8787 68.2756 78.9 67.4529 78.0899C67.4339 78.0718 67.4187 78.0501 67.4082 78.026C67.3977 78.0019 67.392 77.976 67.3917 77.9498C67.3913 77.9235 67.3961 77.8974 67.4059 77.8731C67.4157 77.8487 67.4302 77.8265 67.4486 77.8078C67.4671 77.7891 67.489 77.7743 67.5133 77.7642C67.5375 77.754 67.5635 77.7488 67.5898 77.7488C67.616 77.7489 67.642 77.7541 67.6662 77.7643C67.6904 77.7744 67.7124 77.7893 67.7308 77.8081C68.5036 78.569 69.7206 79.4883 71.1284 79.5501C71.1809 79.5511 71.2309 79.573 71.2673 79.6108C71.3036 79.6487 71.3235 79.6995 71.3224 79.752C71.3214 79.8045 71.2995 79.8544 71.2617 79.8908C71.2238 79.9272 71.173 79.947 71.1205 79.946V79.942ZM72.0945 78.5959C72.087 78.6422 72.0633 78.6844 72.0276 78.7148C71.9919 78.7453 71.9466 78.7621 71.8997 78.7622C71.8891 78.763 71.8785 78.763 71.868 78.7622C68.3777 78.1961 66.437 76.2284 66.3554 76.1429C66.3193 76.1051 66.2997 76.0546 66.3007 76.0024C66.3017 75.9501 66.3233 75.9004 66.3608 75.8641C66.3983 75.8277 66.4487 75.8077 66.5009 75.8083C66.5531 75.8089 66.603 75.8301 66.6397 75.8673C66.6587 75.8871 68.5772 77.8271 71.9313 78.3718C71.9819 78.3802 72.0272 78.408 72.0577 78.4492C72.0881 78.4905 72.1013 78.542 72.0945 78.5928V78.5959ZM72.3938 77.04H72.3819C69.0816 76.846 65.8494 74.7643 65.714 74.6756C65.6725 74.6461 65.6439 74.6015 65.6344 74.5514C65.6248 74.5013 65.635 74.4494 65.6628 74.4066C65.6906 74.3638 65.7338 74.3334 65.7835 74.3217C65.8332 74.31 65.8855 74.3179 65.9294 74.3439C65.9619 74.3653 69.2115 76.4572 72.4056 76.6449C72.4316 76.6457 72.4572 76.6516 72.4809 76.6622C72.5047 76.6729 72.526 76.6881 72.5439 76.7071C72.5617 76.726 72.5756 76.7483 72.5849 76.7726C72.5941 76.7969 72.5984 76.8228 72.5977 76.8488C72.5969 76.8748 72.591 76.9004 72.5803 76.9241C72.5696 76.9478 72.5544 76.9692 72.5355 76.987C72.5165 77.0048 72.4943 77.0188 72.47 77.028C72.4457 77.0372 72.4198 77.0416 72.3938 77.0408V77.04Z" fill="#FBC3A8"/>
<path d="M89.9842 101.258C89.9696 101.263 89.9558 101.269 89.943 101.277C89.921 101.291 89.9018 101.309 89.8867 101.331C89.8717 101.352 89.8609 101.376 89.8551 101.401C89.8493 101.426 89.8485 101.453 89.8529 101.478C89.8572 101.504 89.8666 101.529 89.8805 101.551C89.8947 101.573 91.3058 103.864 91.2883 106.769C91.288 106.795 91.2929 106.821 91.3026 106.845C91.3123 106.869 91.3267 106.891 91.345 106.909C91.3632 106.928 91.385 106.943 91.409 106.953C91.4329 106.963 91.4587 106.968 91.4847 106.968C91.5369 106.968 91.5869 106.947 91.6239 106.911C91.6609 106.874 91.6821 106.824 91.6827 106.772C91.7048 103.752 90.2748 101.437 90.2138 101.34C90.1994 101.317 90.1804 101.297 90.1581 101.282C90.1358 101.267 90.1105 101.256 90.084 101.251C90.0507 101.245 90.0163 101.247 89.9842 101.258Z" fill="#E07C69"/>
<path d="M128.898 85.8173C129.478 89.2704 130.496 92.3965 131.628 95.1987C131.676 95.1791 131.731 95.1796 131.779 95.2001C131.828 95.2206 131.866 95.2594 131.886 95.308C132.796 97.5425 133.786 99.5838 134.657 101.391C134.925 101.946 135.183 102.48 135.428 102.997C135.354 101.749 135.269 100.495 135.158 99.2465L137.17 98.8696L137.272 98.8506C137.549 98.7976 137.796 98.6407 137.962 98.4118C138.127 98.183 138.2 97.8995 138.163 97.6193C137.618 93.4725 136.789 90.1897 135.839 87.5925C134.684 84.4332 133.348 82.2874 132.125 80.8415C130.439 78.8485 128.965 78.1763 128.464 77.991C128.286 77.8813 128.103 77.7814 127.915 77.6917C127.578 77.5333 127.156 77.3425 126.654 77.1374C126.725 77.2125 126.789 77.2938 126.844 77.3805C128 79.2223 128.898 85.8173 128.898 85.8173Z" fill="#F6AA7B"/>
<path d="M94.7428 85.5465C94.754 85.4951 94.785 85.4503 94.8292 85.4219C94.8511 85.4078 94.8755 85.3981 94.9011 85.3935C94.9267 85.3889 94.953 85.3893 94.9784 85.3948C95.0038 85.4003 95.0279 85.4108 95.0493 85.4256C95.0707 85.4404 95.0889 85.4593 95.103 85.4812C95.1171 85.5031 95.1267 85.5275 95.1314 85.5531C95.136 85.5787 95.1356 85.605 95.13 85.6304C95.1102 85.7183 93.2028 94.5177 92.6485 102.992C92.6453 103.042 92.6231 103.089 92.5865 103.123C92.5498 103.157 92.5015 103.176 92.4513 103.176H92.4339C92.1006 107.69 91.7949 112.59 91.6247 117.166C91.5225 119.908 91.4663 122.534 91.4869 124.892H135.47C135.515 124.056 135.686 120.633 135.725 115.97C135.047 116.463 134.167 116.841 133.038 117.054C127.119 118.178 123.947 115.35 122.992 107.723C122.038 100.095 120.496 90.2237 120.496 90.2237C120.496 90.2237 117.034 89.713 114.514 86.6138C113.284 85.1015 113.22 83.1678 113.476 81.5842C113.442 81.554 113.419 81.5128 113.412 81.4678C113.406 81.4238 113.414 81.3787 113.436 81.34C113.458 81.3014 113.493 81.2713 113.534 81.2548C113.548 81.1844 113.563 81.1155 113.577 81.0466L111.255 80.117C111.044 80.0326 110.845 79.9199 110.665 79.782C106.348 79.5667 103.131 78.7369 103.131 77.7455C103.131 77.2237 104.024 76.7462 105.5 76.3796L105.585 75.3732C102.828 76.0526 99.7439 77.3528 97.3685 79.8367C97.3685 79.8367 92.6176 83.2518 89.6562 96.3326C89.6068 96.5502 89.6331 96.7781 89.7307 96.9788C89.8283 97.1794 89.9914 97.3408 90.1931 97.4363L90.7711 97.7095L92.643 98.5932C93.4126 91.6822 94.7302 85.6209 94.7428 85.5465Z" fill="#F6AA7B"/>
<path d="M109.714 78.2008C106.659 78.2277 105.402 77.5761 105.402 77.5761L105.503 76.3773C104.027 76.7439 103.134 77.2213 103.134 77.7431C103.134 78.7345 106.35 79.5643 110.667 79.7797C110.161 79.393 109.82 78.8288 109.714 78.2008Z" fill="#D87334"/>
<path d="M92.4515 103.178C92.5017 103.178 92.55 103.159 92.5866 103.124C92.6233 103.09 92.6454 103.043 92.6487 102.993C93.2029 94.5208 95.1103 85.7199 95.1301 85.632C95.1413 85.5806 95.1315 85.527 95.1031 85.4828C95.0747 85.4386 95.0299 85.4076 94.9785 85.3964C94.9272 85.3853 94.8735 85.395 94.8293 85.4235C94.7851 85.4519 94.7541 85.4967 94.743 85.5481C94.7271 85.6209 93.4127 91.6822 92.6455 98.5907C92.4871 100.029 92.3494 101.502 92.2496 102.967C92.2463 103.019 92.2637 103.07 92.2979 103.11C92.3322 103.149 92.3805 103.173 92.4325 103.177H92.4475L92.4515 103.178Z" fill="#D87334"/>
<path d="M106.242 70.4227C108.86 70.2285 111.372 69.3077 113.496 67.7638L116.353 60.628C116.476 60.3219 116.657 60.0429 116.887 59.807C117.118 59.5711 117.392 59.3829 117.695 59.2531C117.999 59.1233 118.324 59.0545 118.654 59.0506C118.984 59.0467 119.311 59.1079 119.617 59.2305L122.129 60.2361C123.332 59.4601 123.95 58.0554 123.543 56.7418C123.399 56.2736 123.135 55.8512 122.778 55.5161C122.559 55.31 122.311 55.1369 122.041 55.0022L122.026 54.9951C121.985 54.9753 121.946 54.9555 121.904 54.9373L121.886 54.9301C121.846 54.9119 121.807 54.8945 121.763 54.8787L121.724 54.8644L121.619 54.8256L121.585 54.8153C121.449 54.7707 121.31 54.7344 121.169 54.7069H121.162C121.113 54.6981 121.064 54.6894 121.014 54.6823H120.998C120.951 54.676 120.904 54.6696 120.856 54.6649H120.835C120.737 54.6554 120.638 54.6498 120.537 54.6483C120.489 54.6483 120.44 54.6483 120.39 54.6483H120.377C120.31 54.6483 120.242 54.6546 120.174 54.6609L120.062 54.672C120.006 54.6791 119.95 54.6871 119.894 54.6966L119.854 54.7029C119.785 54.7148 119.715 54.7298 119.645 54.7457L119.605 54.7559C119.539 54.7726 119.473 54.79 119.406 54.8098C118.698 55.0225 118.072 55.4479 117.614 56.0284C116.374 54.5715 115.355 52.1113 115.248 48.4405C115.248 48.4405 101.932 53.2871 97.1682 49.4041C96.99 50.9715 96.9049 52.5482 96.9132 54.1257C96.9132 64.0344 100.844 70.5906 105.976 70.437H106.005C106.082 70.4322 106.162 70.4291 106.242 70.4227ZM121.108 59.312C121.979 58.9074 122.441 57.981 122.189 57.1583C122.123 56.9493 122.016 56.7555 121.874 56.5879C121.733 56.4204 121.56 56.2824 121.365 56.182C121.341 56.1707 121.319 56.1546 121.301 56.1345C121.283 56.1145 121.269 56.091 121.261 56.0655C121.252 56.04 121.249 56.013 121.251 55.9862C121.253 55.9594 121.261 55.9333 121.273 55.9095C121.286 55.8857 121.303 55.8648 121.324 55.8479C121.345 55.8311 121.369 55.8187 121.395 55.8115C121.421 55.8043 121.448 55.8025 121.475 55.8062C121.502 55.8098 121.527 55.8189 121.55 55.8328C121.791 55.9571 122.005 56.1279 122.18 56.3353C122.354 56.5427 122.486 56.7826 122.567 57.0411C122.878 58.0523 122.322 59.179 121.275 59.6699C121.25 59.6815 121.223 59.6877 121.196 59.6881C121.151 59.688 121.107 59.6726 121.072 59.6444C121.037 59.6163 121.013 59.577 121.003 59.5332C120.993 59.4894 120.999 59.4435 121.019 59.4032C121.038 59.3629 121.071 59.3304 121.112 59.3112L121.108 59.312ZM108.592 54.3434C109.187 54.3125 109.719 55.254 109.78 56.4473C109.841 57.6405 109.41 58.6327 108.816 58.6643C108.221 58.696 107.688 57.753 107.628 56.5597C107.568 55.3664 107.998 54.3743 108.592 54.3434ZM112.393 60.8418C112.437 60.7946 112.493 60.7603 112.554 60.7424C112.616 60.7246 112.682 60.7239 112.744 60.7405C112.762 60.7207 112.78 60.7017 112.798 60.6811C112.798 60.6811 112.798 60.7104 112.803 60.7602C112.864 60.7882 112.916 60.8328 112.953 60.8888C112.989 60.9448 113.009 61.01 113.011 61.077C113.022 62.0778 112.898 63.876 111.943 64.6663C111.64 64.9186 111.256 65.0535 110.861 65.0463C110.706 65.0457 110.551 65.0295 110.399 64.998C110.374 64.9933 110.349 64.9835 110.327 64.9692C110.305 64.9549 110.286 64.9363 110.272 64.9147C110.257 64.893 110.247 64.8687 110.241 64.843C110.236 64.8174 110.236 64.7909 110.241 64.7652C110.243 64.7559 110.246 64.7466 110.25 64.7375C109.745 64.5214 109.207 64.0051 108.675 63.0747C108.465 63.0871 108.255 63.0813 108.047 63.0573C108.021 63.0536 107.996 63.0448 107.974 63.0315C107.952 63.0182 107.932 63.0006 107.917 62.9797C107.901 62.9589 107.89 62.9352 107.883 62.91C107.877 62.8848 107.876 62.8586 107.879 62.8328C107.883 62.8071 107.892 62.7823 107.905 62.76C107.919 62.7376 107.936 62.7181 107.957 62.7026C107.978 62.687 108.002 62.6757 108.027 62.6694C108.052 62.663 108.078 62.6616 108.104 62.6654C108.132 62.6733 110.416 62.9686 112.395 60.8418H112.393ZM107.326 52.4486C107.39 52.4169 108.914 51.6877 110.588 52.2158C110.638 52.2317 110.68 52.2668 110.704 52.3134C110.728 52.36 110.733 52.4144 110.717 52.4644C110.701 52.5145 110.666 52.5563 110.619 52.5805C110.573 52.6047 110.518 52.6094 110.468 52.5935C108.95 52.1137 107.513 52.797 107.499 52.8041C107.475 52.8168 107.45 52.8246 107.423 52.8271C107.397 52.8296 107.37 52.8266 107.344 52.8185C107.319 52.8103 107.295 52.7971 107.275 52.7796C107.255 52.7622 107.239 52.7408 107.227 52.7168C107.215 52.6928 107.208 52.6667 107.207 52.64C107.206 52.6134 107.21 52.5867 107.219 52.5617C107.228 52.5366 107.242 52.5137 107.261 52.4942C107.279 52.4748 107.301 52.4593 107.326 52.4486ZM102.037 58.8773C101.442 58.9082 100.91 57.9659 100.849 56.7735C100.789 55.581 101.219 54.5881 101.814 54.5564C102.408 54.5247 102.94 55.4678 103.001 56.6603C103.062 57.8527 102.636 58.848 102.041 58.8789L102.037 58.8773ZM103.235 53.0338C103.222 53.0726 103.196 53.1063 103.163 53.1301C103.129 53.1539 103.089 53.1668 103.048 53.1668C103.026 53.1666 103.004 53.1628 102.983 53.1557C102.224 52.9276 101.419 52.9004 100.646 53.0765C100.595 53.089 100.541 53.0807 100.496 53.0535C100.451 53.0262 100.419 52.9822 100.406 52.9312C100.394 52.8802 100.402 52.8263 100.429 52.7814C100.457 52.7364 100.501 52.7042 100.552 52.6917C101.399 52.4944 102.283 52.5253 103.114 52.7812C103.139 52.7893 103.162 52.8024 103.182 52.8196C103.202 52.8369 103.219 52.858 103.23 52.8818C103.242 52.9055 103.249 52.9313 103.25 52.9577C103.252 52.984 103.248 53.0105 103.239 53.0353L103.235 53.0338ZM105.838 61.4198C105.826 61.4612 105.801 61.4977 105.767 61.5237C105.733 61.5497 105.691 61.5638 105.648 61.5639C105.629 61.5639 105.611 61.5615 105.593 61.5568L104.614 61.2797C104.53 61.2557 104.456 61.2032 104.405 61.131C104.355 61.0589 104.331 60.9716 104.337 60.8838C104.529 58.3088 104.641 56.7877 104.644 56.7117C104.644 56.6859 104.649 56.6604 104.659 56.6366C104.669 56.6128 104.684 56.5912 104.702 56.5731C104.72 56.555 104.742 56.5407 104.766 56.5311C104.79 56.5214 104.816 56.5166 104.842 56.5169C104.894 56.5176 104.945 56.5389 104.982 56.5764C105.019 56.6139 105.04 56.6645 105.04 56.7173C105.04 56.7347 105.04 56.7814 104.733 60.902L105.702 61.176C105.727 61.1825 105.751 61.1942 105.772 61.2102C105.793 61.2262 105.81 61.2462 105.823 61.2691C105.837 61.292 105.845 61.3172 105.848 61.3434C105.851 61.3696 105.849 61.3961 105.842 61.4214L105.838 61.4198Z" fill="#FBC3A8"/>
<path d="M105.401 77.5761C105.401 77.5761 106.659 78.2277 109.714 78.2008C109.637 77.7472 109.688 77.2814 109.859 76.8547L112.087 71.2906C110.471 72.4411 108.398 73.2654 105.763 73.2915L105.588 75.3748L105.503 76.3812L105.401 77.5761Z" fill="#FBC3A8"/>
<path d="M108.817 58.6635C109.412 58.6327 109.847 57.6405 109.782 56.4465C109.717 55.2524 109.187 54.3086 108.594 54.3426C108.001 54.3767 107.565 55.3656 107.63 56.5597C107.695 57.7537 108.222 58.6944 108.817 58.6635Z" fill="black"/>
<path d="M101.816 54.5588C101.221 54.5897 100.787 55.5819 100.852 56.7759C100.916 57.97 101.445 58.9139 102.039 58.8798C102.633 58.8458 103.069 57.8568 103.004 56.6627C102.939 55.4686 102.411 54.5279 101.816 54.5588Z" fill="black"/>
<path d="M107.417 52.8255C107.447 52.8256 107.476 52.8188 107.503 52.8057C107.517 52.7986 108.954 52.1153 110.472 52.5951C110.523 52.6109 110.577 52.6063 110.623 52.5821C110.67 52.5578 110.705 52.5161 110.721 52.466C110.737 52.4159 110.732 52.3616 110.708 52.315C110.684 52.2684 110.642 52.2333 110.592 52.2174C108.918 51.6893 107.394 52.4185 107.33 52.4502C107.29 52.47 107.258 52.5027 107.239 52.543C107.22 52.5833 107.215 52.6289 107.225 52.6723C107.235 52.7157 107.259 52.7545 107.294 52.7823C107.329 52.8101 107.372 52.8253 107.417 52.8255Z" fill="black"/>
<path d="M103.118 52.7835C102.287 52.5277 101.403 52.4968 100.556 52.6941C100.505 52.7066 100.461 52.7388 100.434 52.7837C100.406 52.8287 100.398 52.8826 100.41 52.9336C100.423 52.9846 100.455 53.0286 100.5 53.0558C100.545 53.0831 100.599 53.0914 100.65 53.0789C101.423 52.9027 102.228 52.93 102.987 53.158C103.008 53.1652 103.03 53.1689 103.052 53.1691C103.099 53.1692 103.144 53.1527 103.18 53.1226C103.216 53.0925 103.24 53.0506 103.248 53.0045C103.256 52.9584 103.247 52.911 103.223 52.8707C103.199 52.8304 103.162 52.7998 103.118 52.7843V52.7835Z" fill="black"/>
<path d="M105.705 61.1776L104.737 60.9036C105.043 56.7862 105.043 56.7363 105.043 56.7189C105.043 56.6662 105.023 56.6156 104.986 56.5781C104.949 56.5406 104.898 56.5192 104.845 56.5186C104.82 56.5182 104.794 56.523 104.77 56.5327C104.746 56.5423 104.724 56.5566 104.706 56.5747C104.687 56.5928 104.673 56.6144 104.663 56.6382C104.653 56.662 104.648 56.6875 104.647 56.7133C104.647 56.7925 104.533 58.3104 104.341 60.8854C104.335 60.9732 104.359 61.0606 104.409 61.1327C104.46 61.2048 104.533 61.2573 104.618 61.2813L105.597 61.5585C105.615 61.5632 105.633 61.5656 105.652 61.5656C105.699 61.5652 105.745 61.5478 105.781 61.5164C105.816 61.4851 105.84 61.4419 105.846 61.3948C105.853 61.3478 105.842 61.2999 105.816 61.26C105.79 61.2202 105.751 61.1909 105.705 61.1776Z" fill="#E07C69"/>
<path d="M125.15 45.3492C126.604 51.0669 124.926 54.4313 126.309 60.4143C126.448 61.0161 126.603 61.5735 126.771 62.0905L126.827 62.1127C127.429 62.3536 127.914 62.8177 128.181 63.408C128.448 63.9983 128.477 64.669 128.261 65.28C129.798 67.604 131.676 68.3332 133.025 68.57C133.099 68.5832 133.176 68.5754 133.246 68.5473C133.316 68.5193 133.376 68.4721 133.421 68.4112C133.465 68.3503 133.492 68.2781 133.498 68.2029C133.503 68.1277 133.488 68.0524 133.452 67.9856C132.423 66.0488 131.5 64.9585 132.393 58.6169C133.414 51.3638 138.05 40.7701 131.372 36.7556C126.737 33.9693 122.345 37.5292 120.849 38.9822C120.961 39.1224 121.071 39.2649 121.181 39.4114C121.182 39.4153 124.819 40.2586 125.15 45.3492Z" fill="#5C1E14"/>
<path d="M115.247 48.4404C115.353 52.1113 116.373 54.5714 117.612 56.0284C118.07 55.4462 118.697 55.0193 119.406 54.8058C119.473 54.786 119.539 54.7686 119.605 54.752L119.645 54.7417C119.715 54.7258 119.785 54.7108 119.854 54.6989L119.894 54.6926C119.95 54.6831 120.006 54.6752 120.062 54.668L120.174 54.657C120.242 54.6506 120.31 54.6467 120.377 54.6443H120.39C120.439 54.6443 120.489 54.6443 120.537 54.6443C120.637 54.6443 120.736 54.6514 120.835 54.6609H120.856C120.903 54.6657 120.951 54.672 120.998 54.6783H121.014C121.063 54.6855 121.112 54.6942 121.162 54.7029H121.169C121.31 54.7304 121.449 54.7667 121.585 54.8114L121.618 54.8216L121.724 54.8604L121.763 54.8747C121.805 54.8905 121.843 54.908 121.886 54.9262L121.904 54.9333C121.945 54.9515 121.983 54.9713 122.025 54.9911L122.041 54.9982C122.31 55.1329 122.558 55.306 122.778 55.5121C124.743 50.9821 125.302 47.7072 125.153 45.3452C124.823 40.2547 121.185 39.4114 121.185 39.4114C121.074 39.2649 120.964 39.1224 120.853 38.9822C112.248 28.0845 101.267 35.1118 99.0937 36.6194C97.906 37.4445 91.9404 41.7235 96.2693 48.4016C96.5154 48.7794 96.8192 49.1163 97.1696 49.4001C101.93 53.2871 115.247 48.4404 115.247 48.4404Z" fill="#5C1E14"/>
<path d="M121.192 59.6889C121.219 59.6885 121.246 59.6823 121.271 59.6707C122.318 59.183 122.873 58.0531 122.563 57.0419C122.482 56.7832 122.35 56.5432 122.176 56.3356C122.001 56.1281 121.787 55.9572 121.546 55.8328C121.523 55.8189 121.498 55.8099 121.471 55.8062C121.444 55.8025 121.417 55.8043 121.391 55.8115C121.365 55.8187 121.341 55.8311 121.32 55.8479C121.299 55.8648 121.282 55.8857 121.269 55.9095C121.257 55.9333 121.249 55.9594 121.247 55.9862C121.245 56.0131 121.248 56.04 121.256 56.0655C121.265 56.0911 121.279 56.1145 121.297 56.1346C121.315 56.1546 121.337 56.1707 121.361 56.182C121.556 56.2825 121.729 56.4204 121.87 56.588C122.012 56.7555 122.118 56.9493 122.185 57.1583C122.437 57.981 121.972 58.9074 121.104 59.312C121.063 59.3312 121.03 59.3637 121.011 59.404C120.991 59.4443 120.985 59.4902 120.995 59.534C121.005 59.5778 121.029 59.6171 121.064 59.6452C121.099 59.6734 121.143 59.6888 121.188 59.6889H121.192Z" fill="#E07C69"/>
<path d="M112.805 60.7627C112.805 60.7112 112.799 60.6835 112.799 60.6835C112.782 60.7041 112.764 60.7231 112.746 60.7429C112.759 60.7458 112.771 60.7497 112.784 60.7548C112.791 60.7569 112.798 60.7596 112.805 60.7627Z" fill="#DE8A74"/>
<path d="M110.48 64.6141C110.974 64.7138 111.37 64.6323 111.693 64.3654C112.516 63.6837 112.618 61.9829 112.617 61.1831C111.138 62.7303 109.539 63.0384 108.68 63.0835C109.212 64.0131 109.75 64.5293 110.255 64.7463C110.27 64.7006 110.301 64.662 110.342 64.6377C110.384 64.6133 110.432 64.6049 110.48 64.6141Z" fill="#FBC3A8"/>
<path d="M108.112 62.6701C108.086 62.6664 108.06 62.6678 108.035 62.6742C108.009 62.6805 107.986 62.6918 107.965 62.7074C107.944 62.7229 107.926 62.7424 107.913 62.7648C107.9 62.7871 107.891 62.8119 107.887 62.8376C107.884 62.8633 107.885 62.8896 107.891 62.9148C107.898 62.94 107.909 62.9637 107.925 62.9845C107.94 63.0054 107.96 63.023 107.982 63.0363C108.004 63.0496 108.029 63.0583 108.055 63.0621C108.263 63.0861 108.473 63.0919 108.683 63.0795C109.542 63.0383 111.137 62.7303 112.62 61.1792C112.62 61.9789 112.519 63.6797 111.696 64.3614C111.373 64.6283 110.977 64.7098 110.482 64.6101C110.436 64.6007 110.388 64.6084 110.346 64.6318C110.305 64.6552 110.273 64.6928 110.258 64.7375C110.254 64.7466 110.251 64.7559 110.249 64.7653C110.244 64.791 110.244 64.8174 110.249 64.8431C110.254 64.8687 110.265 64.8931 110.279 64.9147C110.294 64.9364 110.313 64.9549 110.335 64.9692C110.357 64.9835 110.382 64.9933 110.407 64.9981C110.559 65.0295 110.714 65.0457 110.869 65.0464C111.264 65.0535 111.648 64.9187 111.951 64.6663C112.906 63.8745 113.03 62.0779 113.019 61.077C113.017 61.0101 112.997 60.9449 112.961 60.8888C112.924 60.8328 112.872 60.7883 112.811 60.7603C112.804 60.7567 112.797 60.7535 112.79 60.7508C112.778 60.7458 112.765 60.7418 112.752 60.7389C112.69 60.7224 112.624 60.723 112.562 60.7409C112.501 60.7587 112.445 60.7931 112.401 60.8403C110.416 62.9687 108.132 62.6733 108.112 62.6701Z" fill="#FBC3A8"/>
<path d="M103.535 66.6187C103.941 66.9176 104.335 67.011 104.739 66.905C105.774 66.6343 106.583 65.135 106.92 64.4095C104.926 65.1884 103.346 64.7932 102.548 64.4717C102.639 65.539 102.909 66.2343 103.275 66.6437C103.308 66.6087 103.352 66.5867 103.4 66.5821C103.448 66.5775 103.496 66.5905 103.535 66.6187Z" fill="#DE8A74"/>
<path d="M102.208 63.8574C102.186 63.8431 102.162 63.8333 102.136 63.8285C102.111 63.8236 102.084 63.8239 102.059 63.8292C102.033 63.8345 102.009 63.8447 101.988 63.8594C101.966 63.874 101.948 63.8928 101.934 63.9145C101.919 63.9363 101.91 63.9606 101.905 63.9862C101.9 64.0117 101.9 64.038 101.905 64.0634C101.911 64.0889 101.921 64.1131 101.936 64.1345C101.95 64.156 101.969 64.1744 101.991 64.1887C102.17 64.2984 102.358 64.3923 102.553 64.4694C103.349 64.7944 104.926 65.1882 106.924 64.4072C106.587 65.1322 105.778 66.6319 104.744 66.9026C104.339 67.0086 103.945 66.9152 103.539 66.6163C103.501 66.5882 103.454 66.5747 103.406 66.5786C103.359 66.5824 103.315 66.6031 103.281 66.637C103.274 66.6438 103.268 66.651 103.262 66.6585C103.246 66.6797 103.235 66.7037 103.229 66.7291C103.223 66.7546 103.222 66.781 103.226 66.8069C103.231 66.8327 103.24 66.8575 103.254 66.8797C103.268 66.9019 103.286 66.9212 103.307 66.9364C103.431 67.029 103.565 67.1089 103.705 67.1749C104.06 67.3479 104.465 67.3877 104.847 67.2869C106.047 66.9718 106.917 65.395 107.329 64.4829C107.356 64.4216 107.365 64.354 107.355 64.2877C107.346 64.2215 107.318 64.1592 107.274 64.1082C107.27 64.102 107.264 64.0961 107.259 64.0906C107.25 64.0808 107.24 64.0719 107.229 64.0638C107.18 64.0225 107.12 63.9955 107.057 63.9856C106.993 63.9757 106.928 63.9834 106.869 64.0077C104.171 65.1 102.224 63.8686 102.208 63.8574Z" fill="#E07C69"/>
<path d="M113.496 67.7639C111.372 69.3079 108.859 70.2288 106.241 70.4228C106.161 70.4291 106.082 70.4323 106.003 70.4355H105.974L105.762 73.286C108.397 73.2599 110.47 72.4356 112.086 71.2851L113.496 67.7639Z" fill="#E07C69"/>
<path d="M126.828 62.1167L126.772 62.0945L122.127 60.2361L119.615 59.2305C119.308 59.1079 118.981 59.0468 118.652 59.0507C118.322 59.0545 117.996 59.1233 117.693 59.2531C117.39 59.3829 117.115 59.5711 116.885 59.8071C116.655 60.043 116.473 60.3219 116.351 60.6281L113.496 67.7639L112.086 71.2867L109.859 76.8508C109.611 77.4689 109.619 78.16 109.882 78.7721C110.144 79.3842 110.638 79.8671 111.256 80.1146L113.579 81.0442C113.742 80.2828 113.979 79.539 114.286 78.8232C114.26 78.8116 114.237 78.7946 114.219 78.7732C114.2 78.7518 114.186 78.7267 114.178 78.6994C114.17 78.6722 114.168 78.6435 114.172 78.6154C114.176 78.5872 114.186 78.5603 114.202 78.5365C111.091 76.4913 112.143 74.6709 112.143 74.6709C116.089 73.7469 121.033 74.5125 124.099 75.6813L128.224 65.3805C128.237 65.3481 128.248 65.3164 128.26 65.2839C128.476 64.6732 128.448 64.0026 128.181 63.4124C127.914 62.8221 127.429 62.3579 126.828 62.1167ZM119.147 61.7865L118.216 64.1136C118.133 64.3201 117.972 64.4853 117.767 64.5729C117.563 64.6605 117.332 64.6633 117.125 64.5808L116.952 64.5111C116.745 64.4284 116.58 64.2669 116.492 64.0623C116.405 63.8577 116.402 63.6266 116.485 63.42L117.416 61.0937C117.457 60.9912 117.517 60.8979 117.594 60.819C117.672 60.7401 117.763 60.6771 117.865 60.6337C117.966 60.5904 118.075 60.5674 118.185 60.5661C118.296 60.5649 118.405 60.5854 118.508 60.6265L118.68 60.6954C118.782 60.7364 118.876 60.7972 118.954 60.8743C119.033 60.9513 119.096 61.0431 119.139 61.1445C119.182 61.2458 119.205 61.3546 119.206 61.4648C119.207 61.575 119.187 61.6843 119.146 61.7865H119.147Z" fill="#617ABC"/>
<path d="M117.416 61.0965L116.485 63.423C116.312 63.8533 116.521 64.3419 116.952 64.5142L117.125 64.5836C117.556 64.7559 118.044 64.5467 118.216 64.1164L119.148 61.7899C119.32 61.3595 119.111 60.871 118.681 60.6987L118.507 60.6292C118.077 60.4569 117.588 60.6661 117.416 61.0965Z" fill="#1F3966"/>
<path d="M137.171 98.8695L135.159 99.2464L133.723 99.4388C134.04 100.117 134.357 100.768 134.659 101.391C134.927 101.946 135.185 102.48 135.43 102.996C135.588 103.334 135.742 103.664 135.891 103.986C136.312 104.899 136.687 105.831 137.014 106.781C137.014 106.781 137.014 106.787 137.014 106.79C137.054 106.908 137.093 107.028 137.13 107.141C137.132 107.148 137.134 107.155 137.137 107.161C137.172 107.274 137.207 107.385 137.24 107.495C137.244 107.507 137.247 107.518 137.251 107.53C137.282 107.636 137.313 107.741 137.343 107.847L137.358 107.9C137.384 107.998 137.411 108.095 137.437 108.191L137.456 108.265C137.479 108.354 137.502 108.443 137.522 108.53C137.53 108.563 137.537 108.595 137.545 108.628C137.563 108.707 137.582 108.786 137.6 108.865C137.609 108.91 137.618 108.952 137.628 108.996C137.641 109.062 137.656 109.13 137.669 109.196C137.681 109.261 137.692 109.317 137.703 109.378C137.712 109.426 137.722 109.474 137.73 109.522C137.749 109.629 137.767 109.737 137.783 109.844C137.787 109.87 137.786 109.896 137.779 109.921C137.773 109.946 137.762 109.97 137.747 109.991C137.731 110.012 137.712 110.029 137.69 110.043C137.668 110.056 137.643 110.065 137.617 110.069H137.587C137.54 110.069 137.494 110.052 137.458 110.021C137.422 109.991 137.399 109.948 137.392 109.901C137.377 109.803 137.36 109.705 137.343 109.605L137.324 109.504C137.312 109.438 137.301 109.372 137.287 109.306C137.279 109.264 137.27 109.226 137.262 109.18C137.25 109.122 137.237 109.062 137.225 109.003C137.215 108.957 137.205 108.911 137.194 108.865C137.184 108.818 137.168 108.754 137.156 108.698C137.143 108.643 137.132 108.598 137.119 108.548C137.107 108.497 137.093 108.446 137.08 108.394C137.068 108.343 137.053 108.285 137.038 108.23C137.03 108.199 137.021 108.168 137.012 108.137C136.973 107.991 136.931 107.843 136.886 107.694C136.879 107.672 136.873 107.65 136.867 107.627C136.843 107.548 136.818 107.469 136.794 107.393L136.768 107.309C136.742 107.23 136.716 107.151 136.688 107.072C136.68 107.047 136.672 107.021 136.663 106.993C136.635 106.908 136.605 106.823 136.575 106.737C136.57 106.72 136.564 106.704 136.558 106.688C136.379 106.178 136.174 105.65 135.944 105.104C135.814 104.793 135.675 104.477 135.527 104.154C135.157 103.345 134.741 102.481 134.299 101.566C133.982 100.908 133.647 100.22 133.307 99.4966V99.4926C133.166 99.1928 133.023 98.8872 132.88 98.5757L132.836 98.4783C132.779 98.3572 132.724 98.2352 132.668 98.1125C132.651 98.0753 132.634 98.0381 132.617 98.0009C132.554 97.8615 132.491 97.7206 132.428 97.5788C132.421 97.5638 132.414 97.5495 132.408 97.5345C132.338 97.3761 132.268 97.2178 132.198 97.0594L132.152 96.9525C132.099 96.8316 132.047 96.7097 131.994 96.5867C131.972 96.536 131.95 96.4861 131.929 96.4355C131.88 96.3206 131.832 96.205 131.782 96.0894C131.763 96.0411 131.742 95.9936 131.722 95.9453C131.655 95.787 131.588 95.6223 131.521 95.4584C131.511 95.4343 131.506 95.4086 131.506 95.3827C131.507 95.3567 131.512 95.3311 131.522 95.3072C131.532 95.2833 131.547 95.2616 131.565 95.2434C131.584 95.2252 131.606 95.2108 131.63 95.201C130.498 92.3988 129.48 89.2727 128.899 85.8196C128.899 85.8196 128.002 79.2246 126.841 77.386C126.785 77.2993 126.721 77.218 126.651 77.1429C126.191 76.6457 125.286 76.1349 124.1 75.6836C121.031 74.5157 116.087 73.7492 112.144 74.6733C112.144 74.6733 111.092 76.4944 114.203 78.5389C114.22 78.5122 114.243 78.4899 114.271 78.4741C114.298 78.4583 114.329 78.4492 114.361 78.4478C114.53 78.4407 118.513 78.2895 120.553 79.6728C120.575 79.687 120.595 79.7055 120.61 79.7273C120.625 79.7491 120.635 79.7736 120.641 79.7995C120.646 79.8255 120.646 79.8522 120.641 79.8782C120.636 79.9041 120.626 79.9288 120.611 79.9507C120.596 79.9727 120.577 79.9914 120.555 80.0058C120.532 80.0203 120.508 80.0301 120.482 80.0347C120.455 80.0394 120.429 80.0387 120.403 80.0329C120.377 80.027 120.353 80.016 120.331 80.0006C118.4 78.6901 114.418 78.8422 114.378 78.8437C114.347 78.845 114.316 78.8388 114.288 78.8255C113.981 79.5413 113.744 80.2851 113.58 81.0466C113.566 81.1155 113.552 81.1843 113.538 81.2548C113.552 81.249 113.566 81.2448 113.581 81.2421C113.686 81.2263 116.16 80.8573 118.404 81.5905C118.448 81.6055 118.486 81.6356 118.51 81.6757C118.535 81.7158 118.544 81.7632 118.536 81.8095C118.529 81.8558 118.505 81.8979 118.47 81.9284C118.434 81.959 118.389 81.9759 118.342 81.9762C118.321 81.9761 118.3 81.9729 118.28 81.9667C116.129 81.2643 113.666 81.6301 113.641 81.6333C113.613 81.6372 113.584 81.6349 113.557 81.6264C113.529 81.6179 113.504 81.6035 113.483 81.5842C113.227 83.1678 113.291 85.1014 114.521 86.6138C117.041 89.713 120.503 90.2237 120.503 90.2237C120.503 90.2237 122.046 100.098 123 107.723C123.953 115.347 127.127 118.175 133.045 117.053C134.174 116.838 135.054 116.463 135.732 115.97C135.989 115.784 136.226 115.571 136.439 115.337C136.459 115.315 136.477 115.293 136.496 115.271C136.515 115.249 136.536 115.227 136.555 115.204C139.381 111.853 138.129 103.449 137.171 98.8695ZM117.366 84.2574C117.358 84.2822 117.346 84.3053 117.329 84.3254C117.313 84.3454 117.292 84.3619 117.269 84.3741C117.246 84.3862 117.221 84.3937 117.195 84.3961C117.169 84.3985 117.143 84.3957 117.118 84.388C115.717 83.9581 114.181 84.7087 114.166 84.7166C114.119 84.7397 114.065 84.7432 114.016 84.7266C113.966 84.7099 113.925 84.6743 113.902 84.6277C113.879 84.581 113.875 84.5269 113.891 84.4773C113.907 84.4276 113.942 84.3864 113.989 84.3627C114.058 84.3286 115.679 83.5321 117.235 84.0095C117.285 84.026 117.326 84.0612 117.349 84.1075C117.373 84.1538 117.378 84.2076 117.363 84.2574H117.366Z" fill="#FBC3A8"/>
<path d="M120.33 79.9982C120.374 80.0258 120.426 80.0354 120.477 80.0249C120.527 80.0145 120.572 79.9847 120.601 79.942C120.629 79.8994 120.641 79.8471 120.632 79.7964C120.622 79.7457 120.594 79.7005 120.552 79.6704C118.512 78.2863 114.529 78.4383 114.36 78.4455C114.316 78.4476 114.273 78.4646 114.24 78.4936C114.206 78.5227 114.184 78.5621 114.175 78.6057C114.167 78.6492 114.173 78.6944 114.194 78.7338C114.214 78.7732 114.247 78.8047 114.287 78.8232C114.315 78.8364 114.346 78.8426 114.377 78.8414C114.417 78.8398 118.399 78.6878 120.33 79.9982Z" fill="#E07C69"/>
<path d="M113.64 81.631C113.665 81.631 116.128 81.262 118.279 81.9643C118.299 81.9706 118.32 81.9738 118.341 81.9738C118.388 81.9735 118.433 81.9566 118.469 81.9261C118.504 81.8956 118.528 81.8535 118.535 81.8072C118.543 81.7609 118.533 81.7135 118.509 81.6734C118.485 81.6333 118.447 81.6031 118.403 81.5882C116.159 80.855 113.684 81.224 113.58 81.2398C113.565 81.2424 113.55 81.2467 113.536 81.2525C113.495 81.269 113.46 81.299 113.438 81.3377C113.416 81.3764 113.408 81.4214 113.414 81.4655C113.423 81.5171 113.451 81.5635 113.493 81.5944C113.536 81.6254 113.588 81.6385 113.64 81.631Z" fill="#E07C69"/>
<path d="M117.231 84.0096C115.675 83.5345 114.054 84.3263 113.985 84.3627C113.938 84.3865 113.903 84.4277 113.887 84.4773C113.87 84.5269 113.874 84.581 113.898 84.6277C113.921 84.6744 113.962 84.7099 114.012 84.7266C114.061 84.7433 114.115 84.7397 114.162 84.7167C114.177 84.7087 115.712 83.9581 117.114 84.3881C117.139 84.3957 117.165 84.3984 117.191 84.3959C117.217 84.3935 117.242 84.3859 117.265 84.3738C117.288 84.3616 117.308 84.345 117.325 84.325C117.341 84.305 117.354 84.2819 117.361 84.257C117.369 84.2322 117.372 84.206 117.369 84.1802C117.367 84.1543 117.359 84.1291 117.347 84.1061C117.335 84.0832 117.318 84.0628 117.298 84.0463C117.278 84.0297 117.255 84.0172 117.23 84.0096H117.231Z" fill="#E07C69"/>
<path d="M131.886 95.308C131.866 95.2593 131.828 95.2206 131.779 95.2001C131.731 95.1796 131.677 95.1791 131.628 95.1987C131.604 95.2084 131.582 95.2228 131.563 95.241C131.545 95.2593 131.53 95.2809 131.52 95.3049C131.51 95.3288 131.505 95.3544 131.505 95.3804C131.505 95.4063 131.509 95.432 131.519 95.456C132.435 97.7024 133.425 99.7532 134.299 101.562C134.741 102.477 135.158 103.341 135.528 104.15C136.526 106.336 137.136 108.217 137.392 109.899C137.399 109.946 137.422 109.989 137.458 110.02C137.494 110.051 137.54 110.067 137.587 110.067H137.617C137.643 110.063 137.667 110.055 137.69 110.041C137.712 110.028 137.731 110.01 137.747 109.989C137.762 109.968 137.773 109.945 137.779 109.919C137.785 109.894 137.787 109.868 137.783 109.842C137.521 108.123 136.901 106.208 135.888 103.988C135.741 103.666 135.587 103.336 135.426 102.998C135.182 102.482 134.923 101.946 134.656 101.393C133.784 99.5869 132.797 97.5425 131.886 95.308Z" fill="#E07C69"/>
<path d="M139.749 124.893H81.1338C81.0813 124.893 81.031 124.913 80.9938 124.95C80.9567 124.988 80.9359 125.038 80.9359 125.09C80.9359 125.143 80.9567 125.193 80.9938 125.23C81.031 125.268 81.0813 125.288 81.1338 125.288H139.749C139.801 125.288 139.851 125.268 139.889 125.23C139.926 125.193 139.947 125.143 139.947 125.09C139.947 125.038 139.926 124.988 139.889 124.95C139.851 124.913 139.801 124.893 139.749 124.893Z" fill="#1F3966"/>
<path d="M71.997 124.868H39.5578C39.5021 124.868 39.4487 124.891 39.4093 124.93C39.37 124.969 39.3478 125.023 39.3478 125.078C39.3478 125.134 39.37 125.188 39.4093 125.227C39.4487 125.266 39.5021 125.288 39.5578 125.288H71.997C72.0527 125.288 72.1061 125.266 72.1455 125.227C72.1848 125.188 72.207 125.134 72.207 125.078C72.207 125.023 72.1848 124.969 72.1455 124.93C72.1061 124.891 72.0527 124.868 71.997 124.868Z" fill="#1F3966"/>
<path d="M62.3744 89.0626C64.7474 86.6266 64.2089 83.6664 64.2089 83.6664C61.7771 85.0289 60.313 86.6224 59.4327 88.0109C59.3885 88.357 59.3347 88.7076 59.2714 89.0626H62.3744Z" fill="#008E6D"/>
<path d="M56.4756 88.6392C56.4459 88.6264 56.4195 88.6068 56.3987 88.582C56.3779 88.5572 56.363 88.5279 56.3554 88.4965C56.1874 87.7766 56.0629 87.0473 55.9825 86.3125C54.4982 82.5871 52.6838 81.679 52.6493 81.7991C51.6741 85.2037 52.7821 87.5514 54.1613 89.0601H56.5411C56.5201 88.9282 56.4974 88.7871 56.4756 88.6392Z" fill="#008E6D"/>
<path d="M57.0655 78.9095C57.0504 78.9515 55.5426 83.1826 56.7648 88.4015C56.7711 88.4283 56.7721 88.4561 56.7677 88.4833C56.7633 88.5105 56.7535 88.5365 56.739 88.5599C56.7245 88.5833 56.7055 88.6037 56.6831 88.6197C56.6607 88.6358 56.6354 88.6472 56.6085 88.6535C56.5929 88.6574 56.5768 88.6594 56.5607 88.6593C56.5316 88.6589 56.503 88.6523 56.4767 88.64C56.4985 88.7879 56.5212 88.929 56.5439 89.06H59.2722C59.3355 88.7055 59.3892 88.355 59.4335 88.0083C60.1643 82.3501 58.5725 77.8301 58.1827 76.8364C58.1743 76.8149 58.1603 76.7961 58.1423 76.7818C58.1242 76.7676 58.1027 76.7583 58.0799 76.7551C58.0571 76.7518 58.0338 76.7547 58.0125 76.7634C57.9911 76.772 57.9725 76.7862 57.9584 76.8045C57.5315 77.3638 57.1891 77.9827 56.942 78.6415C56.9937 78.661 57.0356 78.7 57.0587 78.7502C57.0818 78.8003 57.0843 78.8576 57.0655 78.9095Z" fill="#54C0A1"/>
<path d="M56.4754 88.6392C56.5018 88.6515 56.5304 88.6581 56.5594 88.6585C56.5756 88.6586 56.5917 88.6566 56.6073 88.6527C56.6342 88.6464 56.6595 88.635 56.6819 88.6189C56.7043 88.6029 56.7233 88.5826 56.7378 88.5591C56.7523 88.5357 56.7621 88.5097 56.7665 88.4825C56.7709 88.4553 56.7699 88.4275 56.7636 88.4007C55.5413 83.1826 57.0492 78.9515 57.0643 78.9087C57.0833 78.8565 57.0809 78.799 57.0576 78.7486C57.0343 78.6983 56.992 78.6592 56.94 78.6399C56.8876 78.6209 56.8299 78.6234 56.7793 78.6469C56.7288 78.6703 56.6896 78.7128 56.6703 78.765C56.6569 78.802 55.5086 82.0175 55.9823 86.3149C56.0627 87.0498 56.1873 87.7791 56.3553 88.4989C56.3633 88.53 56.3782 88.5587 56.399 88.5831C56.4199 88.6074 56.446 88.6266 56.4754 88.6392Z" fill="#1F3966"/>
<path d="M64.2536 89.9085C64.2456 89.6812 64.1495 89.4659 63.9857 89.3081C63.8219 89.1503 63.6033 89.0623 63.3758 89.0626H52.4432C52.2157 89.0623 51.9971 89.1503 51.8333 89.3081C51.6695 89.4659 51.5734 89.6812 51.5654 89.9085C51.5083 91.5977 51.6805 95.5087 54.0972 98.7654C54.179 98.8747 54.2853 98.9634 54.4075 99.0244C54.5297 99.0853 54.6645 99.1169 54.8011 99.1165H61.0171C61.1536 99.1169 61.2882 99.0854 61.4103 99.0245C61.5324 98.9635 61.6385 98.8748 61.7202 98.7654C64.1385 95.5087 64.3107 91.5977 64.2536 89.9085ZM60.76 98.0724C60.7459 98.0968 60.727 98.1181 60.7044 98.135C60.6818 98.1519 60.6561 98.1641 60.6287 98.1709C60.6013 98.1776 60.5729 98.1788 60.545 98.1743C60.5172 98.1698 60.4905 98.1598 60.4666 98.1447C60.4428 98.1297 60.4221 98.1101 60.406 98.0869C60.3899 98.0638 60.3786 98.0376 60.3729 98.01C60.3671 97.9824 60.3669 97.9539 60.3724 97.9262C60.3779 97.8986 60.3889 97.8723 60.4047 97.8489C61.6647 95.8481 61.8882 93.0837 61.8907 93.0559C61.8928 93.0284 61.9003 93.0015 61.9128 92.9768C61.9253 92.9521 61.9425 92.9301 61.9635 92.9121C61.9845 92.8941 62.0088 92.8804 62.0351 92.8718C62.0614 92.8632 62.0891 92.8598 62.1166 92.8619C62.1442 92.864 62.1711 92.8715 62.1958 92.884C62.2205 92.8965 62.2425 92.9137 62.2605 92.9347C62.2785 92.9557 62.2922 92.98 62.3008 93.0063C62.3094 93.0326 62.3128 93.0603 62.3107 93.0879C62.2998 93.208 62.0763 95.98 60.76 98.0724Z" fill="#F6AA7B"/>
<path d="M62.1156 92.8627C62.0882 92.8606 62.0605 92.8638 62.0343 92.8724C62.0081 92.8809 61.9838 92.8946 61.9629 92.9125C61.942 92.9305 61.9248 92.9524 61.9124 92.977C61.9 93.0016 61.8925 93.0284 61.8905 93.0559C61.8905 93.0837 61.6612 95.8481 60.4045 97.8491C60.3898 97.8724 60.3798 97.8985 60.3752 97.9257C60.3706 97.9529 60.3714 97.9808 60.3776 98.0077C60.3837 98.0347 60.3951 98.0601 60.4111 98.0826C60.4271 98.1051 60.4474 98.1242 60.4708 98.1389C60.518 98.1683 60.5749 98.1778 60.629 98.1654C60.6832 98.1529 60.7302 98.1196 60.7598 98.0725C62.0762 95.98 62.2996 93.208 62.3088 93.0879C62.313 93.0324 62.295 92.9776 62.2588 92.9354C62.2226 92.8931 62.1711 92.867 62.1156 92.8627Z" fill="#F1F2F2"/>
<path d="M42.5428 61.2804L42.4101 61.2502L42.5428 61.2804Z" fill="#75B2E1"/>
<path d="M43.0819 61.3972L43.008 61.3821L43.0819 61.3972Z" fill="#75B2E1"/>
<path d="M53.1774 61.4442C52.9959 61.4795 52.8142 61.5126 52.6322 61.5434C52.8148 61.512 52.9965 61.479 53.1774 61.4442Z" fill="#75B2E1"/>
<path d="M53.7207 61.3325C53.5712 61.3644 53.42 61.3955 53.2688 61.4258C53.4242 61.3955 53.5712 61.3644 53.7207 61.3325Z" fill="#75B2E1"/>
<path d="M45.3414 61.7525L45.239 61.7408L45.3414 61.7525Z" fill="#75B2E1"/>
<path d="M45.9484 61.813L45.8409 61.8038L45.9484 61.813Z" fill="#75B2E1"/>
<path d="M48.8269 61.9079C48.6348 61.9118 48.4419 61.9141 48.2481 61.9146C48.4413 61.9146 48.6342 61.9124 48.8269 61.9079Z" fill="#75B2E1"/>
<path d="M50.7508 61.792C50.5635 61.8096 50.3745 61.8256 50.1855 61.839C50.3745 61.8289 50.5677 61.813 50.7508 61.792Z" fill="#75B2E1"/>
<path d="M49.4102 61.8878C49.2758 61.8936 49.1414 61.8987 49.0062 61.9029C49.1397 61.8987 49.2758 61.8936 49.4102 61.8878Z" fill="#75B2E1"/>
<path d="M50.0152 61.8542C49.88 61.8634 49.7439 61.8718 49.6086 61.8785C49.7439 61.876 49.88 61.8634 50.0152 61.8542Z" fill="#75B2E1"/>
<path d="M52.4728 61.5694C52.3401 61.5912 52.2074 61.6122 52.0739 61.6324C52.2074 61.6122 52.3401 61.5912 52.4728 61.5694Z" fill="#75B2E1"/>
<path d="M51.8816 61.6601C51.7531 61.6786 51.6238 61.6954 51.4952 61.7114C51.6238 61.6954 51.7531 61.6786 51.8816 61.6601Z" fill="#75B2E1"/>
<path d="M47.0967 61.8895L46.9968 61.8844L47.0967 61.8895Z" fill="#75B2E1"/>
<path d="M51.3141 61.734C51.1461 61.7542 50.9781 61.7727 50.8101 61.7895C50.9776 61.7727 51.1456 61.7542 51.3141 61.734Z" fill="#75B2E1"/>
<path d="M43.6282 61.5022L43.5165 61.4812L43.6282 61.5022Z" fill="#75B2E1"/>
<path d="M44.2213 61.6022L44.1045 61.5837L44.2213 61.6022Z" fill="#75B2E1"/>
<path d="M44.7614 61.6811L44.7169 61.6752L44.7614 61.6811Z" fill="#75B2E1"/>
<path d="M48.3292 2.47525C48.9612 3.38442 50.3517 4.02521 50.5073 3.96298C50.5987 3.92603 50.8262 2.55693 50.4373 1.38036C50.0775 0.292282 49.0088 -0.216268 48.4264 0.0861394C47.8439 0.388547 47.6747 1.534 48.3292 2.47525Z" fill="#5C1E14"/>
<path d="M77.0529 54.2545C76.933 54.3666 76.8117 54.4772 76.6892 54.5861C76.8117 54.4772 76.933 54.3666 77.0529 54.2545Z" fill="#75B2E1"/>
<path d="M45.1282 58.7595C45.0309 58.7148 44.9405 58.6681 44.8472 58.6224C44.9405 58.6681 45.0339 58.7148 45.1282 58.7595Z" fill="#75B2E1"/>
<path d="M47.4512 59.7464L47.2499 59.6706L47.4512 59.7464Z" fill="#75B2E1"/>
<path d="M45.6953 59.023C45.6185 58.9889 45.5436 58.9539 45.4678 58.9189C45.5436 58.9539 45.6185 58.9889 45.6953 59.023Z" fill="#75B2E1"/>
<path d="M48.0693 59.9691L47.8991 59.9098L48.0693 59.9691Z" fill="#75B2E1"/>
<path d="M44.6059 58.5028L44.2733 58.3326C44.3842 58.389 44.494 58.4464 44.6059 58.5028Z" fill="#75B2E1"/>
<path d="M46.3028 59.2894L46.0588 59.1853L46.3028 59.2894Z" fill="#75B2E1"/>
<path d="M50.4883 60.6915C50.4387 60.6799 50.3911 60.6663 50.3405 60.6536C50.3901 60.6663 50.4348 60.6799 50.4883 60.6915Z" fill="#75B2E1"/>
<path d="M77.5302 53.8004C77.4154 53.9126 77.2994 54.0237 77.1821 54.1339C77.3 54.0231 77.4161 53.9119 77.5302 53.8004Z" fill="#75B2E1"/>
<path d="M48.6184 60.1538L48.4463 60.0974L48.6184 60.1538Z" fill="#75B2E1"/>
<path d="M49.8964 60.536L49.7729 60.5029L49.8964 60.536Z" fill="#75B2E1"/>
<path d="M49.2744 60.358L49.0974 60.3046L49.2744 60.358Z" fill="#75B2E1"/>
<path d="M46.8123 59.4994C46.7452 59.4732 46.6801 59.4459 46.6179 59.4187C46.6801 59.4459 46.7452 59.4732 46.8123 59.4994Z" fill="#75B2E1"/>
<path d="M38.2937 45.3485C42.2804 35.1689 46.5063 33.9349 50.564 33.5363C51.8076 32.6086 53.0445 32.6796 53.1077 32.6845H53.1203L53.3089 28.3769L53.3031 28.3701C51.8825 27.0983 50.7487 25.3072 50.0369 23.2166C49.848 23.2483 49.6568 23.2643 49.4652 23.2642C47.7898 23.2642 46.4314 22.0974 46.4314 20.6496C46.4314 19.473 47.3328 18.4783 48.5706 18.1496C48.2633 17.7889 47.8627 17.0674 47.4038 15.6477C37.7706 19.263 31 27.7702 31 37.6902C31 43.5516 33.3648 48.919 37.2883 53.0769C36.8721 52.6361 36.4744 52.1823 36.0952 51.7156C36.6523 49.7961 37.3807 47.6793 38.2937 45.3485Z" fill="#C1DCFF"/>
<path d="M39.9609 55.5312C39.6815 55.3095 39.408 55.0826 39.1403 54.8506C39.4093 55.082 39.6828 55.3089 39.9609 55.5312Z" fill="#75B2E1"/>
<path d="M44.0103 58.1926C43.9257 58.1469 43.842 58.1022 43.7584 58.0555L44.0103 58.1926Z" fill="#75B2E1"/>
<path d="M40.5329 55.9736C40.3618 55.8453 40.1936 55.715 40.0263 55.5847C40.1936 55.715 40.3618 55.8453 40.5329 55.9736Z" fill="#75B2E1"/>
<path d="M37.2928 53.0818C37.7038 53.5175 38.1323 53.9388 38.5782 54.3459C38.1329 53.9395 37.7044 53.5181 37.2928 53.0818Z" fill="#75B2E1"/>
<path d="M89.5499 42.1018L84.5052 36.746C84.1056 27.5494 77.8844 19.6869 69.0446 16.0133C68.5657 16.4009 68.0475 16.7372 67.4986 17.0168C67.4986 17.0168 67.5151 16.6551 67.4908 16.0522C67.4966 16.5417 67.4966 17.0557 67.4908 17.5944C67.5835 17.5995 67.6713 17.6376 67.7383 17.7018C67.8054 17.766 67.8473 17.8521 67.8564 17.9444C67.8597 17.9822 67.8571 18.0203 67.8486 18.0572C69.3402 18.2225 70.4925 19.3213 70.4925 20.6496C70.4925 22.0935 69.1312 23.2642 67.4587 23.2642C67.207 23.2644 66.9559 23.2373 66.71 23.1835C65.9146 25.6076 64.5484 27.6019 62.8283 28.8767L62.8536 31.8064H62.84C62.8497 32.3344 62.8585 32.8109 62.8643 33.1502L63.1998 33.1823C63.2692 33.1378 63.3488 33.1116 63.4312 33.1064C63.5135 33.1011 63.5958 33.1169 63.6704 33.1522C63.7258 33.1784 63.7793 33.2076 63.8337 33.2358L64.1381 33.264H64.1741C64.2713 33.2747 64.3734 33.2844 64.4716 33.2961H64.5056C64.6029 33.3068 64.7001 33.3185 64.7973 33.3311L65.0764 33.37H65.1075L65.3603 33.4099L65.4031 33.4176C65.4838 33.4313 65.5626 33.4458 65.6394 33.4604L65.6744 33.4672C65.7532 33.4828 65.831 33.4984 65.9058 33.5149L65.9438 33.5217C66.8296 33.6724 67.7319 33.8873 68.6343 34.3181C68.8729 34.4192 69.115 34.5313 69.3607 34.6545L69.3363 34.6992C71.7809 36.1967 74.204 39.5717 76.3121 47.8631C76.8702 50.0606 77.2845 52.0063 77.5762 53.7351C80.4631 50.8968 82.5965 47.4372 83.6924 43.607H88.8896C89.0632 43.6053 89.2326 43.5535 89.3774 43.4578C89.5223 43.3622 89.6364 43.2267 89.7062 43.0678C89.7759 42.9088 89.7982 42.7331 89.7705 42.5617C89.7428 42.3904 89.6662 42.2307 89.5499 42.1018Z" fill="#C1DCFF"/>
<path d="M42.9801 57.6111C42.8342 57.5249 42.69 57.4374 42.5474 57.3486C42.6906 57.4367 42.8349 57.5243 42.9801 57.6111Z" fill="#75B2E1"/>
<path d="M43.5421 57.9349C43.4118 57.862 43.2834 57.7891 43.1531 57.7142C43.2834 57.7891 43.4118 57.862 43.5421 57.9349Z" fill="#75B2E1"/>
<path d="M42.401 57.263L42.1298 57.0909L42.401 57.263Z" fill="#75B2E1"/>
<path d="M42.0067 57.0063C41.8512 56.9052 41.6972 56.8024 41.5449 56.698C41.6972 56.8024 41.8512 56.9052 42.0067 57.0063Z" fill="#75B2E1"/>
<path d="M40.8722 56.2245L40.5873 56.0154L40.8722 56.2245Z" fill="#75B2E1"/>
<path d="M41.4303 56.6193C41.2468 56.4929 41.065 56.3632 40.8848 56.2303C41.0643 56.3632 41.2462 56.4929 41.4303 56.6193Z" fill="#75B2E1"/>
<path d="M39.1276 54.8399C38.9516 54.6872 38.7776 54.5316 38.6055 54.3751C38.7776 54.5316 38.9516 54.6872 39.1276 54.8399Z" fill="#75B2E1"/>
<path d="M64.7341 60.7635C64.5922 60.7975 64.4502 60.8306 64.3073 60.8607C64.4502 60.8335 64.5922 60.8004 64.7341 60.7635Z" fill="#75B2E1"/>
<path d="M65.4015 60.5982C65.2517 60.6381 65.1001 60.677 64.9484 60.7149C65.1001 60.677 65.2517 60.6381 65.4015 60.5982Z" fill="#75B2E1"/>
<path d="M76.5208 54.7349C76.4284 54.8165 76.3341 54.8982 76.2397 54.9779C76.3341 54.8972 76.4284 54.8156 76.5208 54.7349Z" fill="#75B2E1"/>
<path d="M66.7746 60.1966C66.6184 60.2472 66.4612 60.2961 66.303 60.3435C66.4606 60.2961 66.6178 60.2472 66.7746 60.1966Z" fill="#75B2E1"/>
<path d="M68.0342 59.7639C67.8883 59.8184 67.7425 59.8718 67.5947 59.9234C67.7425 59.8718 67.8835 59.8184 68.0342 59.7639Z" fill="#75B2E1"/>
<path d="M67.3824 59.9953C67.2491 60.041 67.115 60.0858 66.9798 60.1305C67.115 60.0828 67.2491 60.041 67.3824 59.9953Z" fill="#75B2E1"/>
<path d="M66.1724 60.3833C65.9721 60.4417 65.7698 60.499 65.5676 60.5545C65.7698 60.499 65.9721 60.4417 66.1724 60.3833Z" fill="#75B2E1"/>
<path d="M68.7518 59.4858C68.5619 59.5617 68.3706 59.6362 68.1781 59.7095C68.3706 59.6343 68.5619 59.5597 68.7518 59.4858Z" fill="#75B2E1"/>
<path d="M72.2765 57.7706C72.1608 57.8367 72.0451 57.9028 71.9284 57.9651C72.0451 57.9028 72.1608 57.8367 72.2765 57.7706Z" fill="#75B2E1"/>
<path d="M74.488 56.3461C74.384 56.4209 74.279 56.4948 74.173 56.5687C74.279 56.4948 74.384 56.4209 74.488 56.3461Z" fill="#75B2E1"/>
<path d="M71.1935 58.3647C71.0153 58.4567 70.836 58.5472 70.6558 58.636C70.8367 58.5478 71.0159 58.4574 71.1935 58.3647Z" fill="#75B2E1"/>
<path d="M75.0518 55.9318C74.9222 56.0284 74.7926 56.1237 74.6629 56.2177C74.7951 56.1237 74.9248 56.0284 75.0518 55.9318Z" fill="#75B2E1"/>
<path d="M73.4797 57.0335C73.3144 57.1405 73.1491 57.2455 72.9818 57.3495C73.151 57.2455 73.3163 57.1405 73.4797 57.0335Z" fill="#75B2E1"/>
<path d="M72.8706 57.4166C72.7364 57.499 72.6013 57.5803 72.4651 57.6607C72.6013 57.581 72.7364 57.4996 72.8706 57.4166Z" fill="#75B2E1"/>
<path d="M69.3256 59.2466C69.185 59.3069 69.0436 59.3659 68.9017 59.4236C69.0436 59.3665 69.185 59.3076 69.3256 59.2466Z" fill="#75B2E1"/>
<path d="M73.9831 56.699C73.8713 56.7749 73.7595 56.8497 73.6467 56.9236C73.7595 56.8497 73.8684 56.7768 73.9831 56.699Z" fill="#75B2E1"/>
<path d="M71.729 58.0759C71.6035 58.1449 71.4771 58.212 71.3497 58.2791C71.481 58.212 71.6074 58.1449 71.729 58.0759Z" fill="#75B2E1"/>
<path d="M75.598 55.5069C75.4483 55.6265 75.2976 55.7451 75.1439 55.8628C75.2976 55.7451 75.4483 55.6265 75.598 55.5069Z" fill="#75B2E1"/>
<path d="M76.0591 55.1306L75.7674 55.3718L76.0591 55.1306Z" fill="#75B2E1"/>
<path d="M70.5244 58.6992C70.3844 58.7673 70.2424 58.8353 70.1005 58.9005C70.2424 58.8353 70.3844 58.7673 70.5244 58.6992Z" fill="#75B2E1"/>
<path d="M69.9029 58.9909C69.7774 59.0483 69.652 59.1047 69.5266 59.1591C69.652 59.1047 69.7774 59.0483 69.9029 58.9909Z" fill="#75B2E1"/>
<path d="M64.135 33.268L63.8307 33.2398L64.135 33.268Z" fill="#D9E3F3"/>
<path d="M65.9436 33.5373C66.8684 33.6969 67.7714 33.9642 68.6341 34.3337C67.7318 33.902 66.8294 33.6871 65.9436 33.5373Z" fill="#D9E3F3"/>
<path d="M69.3366 34.7139L67.3627 38.4507C68.2116 41.6002 68.1095 45.1328 68.0181 46.5806C68.1256 46.6653 68.2099 46.776 68.263 46.9022C68.316 47.0284 68.3362 47.166 68.3215 47.3021L67.9218 50.9339C67.8981 51.1468 67.7909 51.3416 67.6238 51.4756C67.4566 51.6096 67.2431 51.6718 67.0302 51.6486L66.509 51.5912C66.1485 51.5514 65.8186 51.37 65.5918 51.087C65.365 50.8041 65.2598 50.4426 65.2993 50.0821L65.5765 47.5637C65.6155 47.2088 65.792 46.8833 66.068 46.6568C66.3441 46.4304 66.6978 46.321 67.0535 46.3521C67.1216 45.0521 67.1731 42.3508 66.6645 39.7673L65.5949 41.7927C65.5624 41.856 65.5448 41.9258 65.5434 41.9969L65.8779 42.1914C65.9334 42.224 65.9738 42.2773 65.9902 42.3396C66.0066 42.4019 65.9977 42.4682 65.9654 42.5239L65.9586 42.5317L66.4078 42.8234C66.4636 42.8586 66.5117 42.9047 66.5491 42.9591C66.5864 43.0134 66.6124 43.0748 66.6253 43.1394C66.6382 43.2041 66.6378 43.2707 66.6242 43.3353C66.6105 43.3998 66.5839 43.4609 66.5459 43.5148C65.7009 44.737 62.2743 48.3892 57.8997 51.1818C57.9333 51.2241 57.9515 51.2766 57.9512 51.3306C57.9512 51.353 57.9454 53.6332 58.1048 58.6136C58.1059 58.6455 58.1006 58.6774 58.0893 58.7073C58.0781 58.7371 58.061 58.7645 58.0392 58.7878C58.0173 58.8111 57.9911 58.8299 57.962 58.843C57.9329 58.8562 57.9014 58.8635 57.8695 58.8645H57.8617C57.7988 58.8643 57.7383 58.8396 57.6932 58.7957C57.648 58.7518 57.6216 58.6921 57.6196 58.6292C57.4592 53.638 57.465 51.352 57.465 51.3287C57.4658 51.2873 57.4772 51.2468 57.4981 51.211C53.6922 48.7898 50.5943 45.7123 49.2855 44.1342C49.5381 45.8258 49.8841 47.5021 50.322 49.1554C50.9099 49.1585 51.4758 49.3793 51.9104 49.7753C52.3449 50.1713 52.6173 50.7143 52.6748 51.2994C52.7323 51.8845 52.5709 52.4701 52.2218 52.9431C51.8726 53.4162 51.3605 53.743 50.7845 53.8604C50.2084 53.9779 49.6092 53.8776 49.1028 53.579C48.5964 53.2804 48.2186 52.8047 48.0424 52.2438C47.8663 51.6829 47.9043 51.0766 48.1492 50.5421C48.394 50.0076 48.8283 49.5829 49.3681 49.3499C48.2382 44.9675 47.8211 41.4047 48.1206 38.6909L46.066 34.8014C47.5722 33.9885 49.0647 33.7046 50.5515 33.5461L50.5641 33.5364C46.5064 33.935 42.2825 35.169 38.2939 45.3486C37.3808 47.6823 36.6525 49.7962 36.0953 51.7157C36.4746 52.1824 36.8723 52.6362 37.2884 53.077H37.2933C37.7043 53.5126 38.1328 53.934 38.5788 54.3411L38.606 54.3673C38.7781 54.5239 38.9521 54.6794 39.1281 54.8321L39.1408 54.8428C39.4092 55.0742 39.6827 55.3011 39.9615 55.5234L40.0266 55.575C40.1939 55.7072 40.3621 55.8375 40.5332 55.9639L40.5877 56.0057L40.8726 56.2148L40.8852 56.2245C41.0648 56.3542 41.2466 56.4838 41.4307 56.6135C41.4686 56.6407 41.5075 56.666 41.5454 56.6922C41.6978 56.7959 41.8517 56.8987 42.0073 57.0005L42.1298 57.0802L42.4011 57.2523L42.548 57.3427C42.6912 57.4309 42.8354 57.5184 42.9807 57.6053L43.1557 57.7083C43.284 57.7832 43.4124 57.8561 43.5446 57.9291L43.7605 58.0496C43.8441 58.0963 43.9277 58.141 44.0123 58.1868C44.0969 58.2325 44.1874 58.284 44.2758 58.3258L44.6084 58.4969L44.8495 58.6165C44.9468 58.6622 45.0362 58.7089 45.1306 58.7536C45.2433 58.8081 45.3561 58.8606 45.4699 58.9131C45.5458 58.9481 45.6206 58.9831 45.6974 59.0171C45.818 59.0726 45.9405 59.1261 46.0631 59.1795L46.3052 59.2836L46.6163 59.4129C46.6824 59.4401 46.7476 59.4674 46.8108 59.4936C46.956 59.5519 47.1019 59.609 47.2484 59.6647L47.4496 59.7406C47.5984 59.796 47.7472 59.8514 47.8979 59.9039L48.0681 59.9633C48.1925 60.007 48.3189 60.0498 48.4444 60.0916L48.6165 60.148C48.7759 60.1992 48.9357 60.2495 49.0959 60.2987L49.2728 60.3522C49.4391 60.4018 49.6044 60.4494 49.7717 60.4971L49.8951 60.5301C50.042 60.571 50.1869 60.6099 50.3385 60.6478C50.3881 60.6604 50.4358 60.6741 50.4863 60.6857C50.6584 60.7295 50.8306 60.7713 51.0046 60.8112L51.1582 60.8462C51.3372 60.887 51.517 60.9269 51.6969 60.9638L51.7825 60.9813C51.9497 61.0157 52.1173 61.0481 52.2852 61.0786L52.4145 61.1029C52.5973 61.1359 52.7811 61.1683 52.9659 61.2001L53.101 61.2215C53.2916 61.2513 53.4828 61.2795 53.6747 61.3061L53.7263 61.3129C53.91 61.3382 54.0948 61.3605 54.2795 61.3819L54.3982 61.3955C54.5926 61.4169 54.7845 61.4367 54.9738 61.4549L55.0983 61.4656C55.2927 61.4831 55.4969 61.4996 55.6982 61.5132H55.7216C55.916 61.5268 56.1163 61.5375 56.3147 61.5472L56.4304 61.5531C56.6249 61.5618 56.8252 61.5677 57.0236 61.5725H57.1412C57.3483 61.5725 57.5545 61.5793 57.7625 61.5793C57.9862 61.5793 58.2095 61.5767 58.4325 61.5715L58.6406 61.5657C58.7971 61.5609 58.9527 61.555 59.1083 61.5482L59.3378 61.5375C59.4943 61.5297 59.6519 61.52 59.8084 61.5093L60.0029 61.4957C60.2217 61.4801 60.4404 61.4617 60.6573 61.4412L60.7215 61.4344C60.9159 61.415 61.1104 61.3936 61.3049 61.3703C61.3749 61.3625 61.4449 61.3528 61.5149 61.344C61.6637 61.3255 61.8134 61.3061 61.9622 61.2847L62.1849 61.2526C62.3395 61.2293 62.4931 61.205 62.6467 61.1797L62.8305 61.1495C63.0412 61.1132 63.2515 61.075 63.4616 61.0348L63.5676 61.0134C63.7426 60.9784 63.9176 60.9424 64.0907 60.9055L64.2988 60.8588C64.4417 60.8267 64.5837 60.7937 64.7257 60.7616L64.9396 60.71C65.0913 60.6721 65.243 60.6332 65.3927 60.5933L65.559 60.5496C65.7612 60.4942 65.9635 60.4368 66.1638 60.3785L66.295 60.3386C66.4526 60.2913 66.6098 60.2423 66.7667 60.1918L66.9718 60.1256C67.107 60.0809 67.2412 60.0362 67.3744 59.9905L67.5815 59.9185C67.7293 59.867 67.8732 59.8135 68.021 59.7591L68.1698 59.7046C68.3642 59.632 68.5555 59.5575 68.7435 59.481L68.8932 59.4187C69.0352 59.3617 69.1765 59.3027 69.3172 59.2418L69.5184 59.1543C69.6439 59.0998 69.7693 59.0434 69.8947 58.986C69.9609 58.9569 70.026 58.9267 70.0892 58.8956C70.2312 58.8305 70.3731 58.7624 70.5132 58.6943L70.6444 58.6311C70.8253 58.543 71.0045 58.4525 71.1822 58.3598L71.3426 58.2743C71.47 58.2072 71.5964 58.1401 71.7218 58.071C71.7879 58.0351 71.8531 57.9991 71.9163 57.9621C72.033 57.898 72.1487 57.8318 72.2644 57.7677L72.453 57.6578C72.5892 57.5781 72.7243 57.4967 72.8585 57.4137L72.9713 57.3466C73.1386 57.2426 73.3039 57.1376 73.4692 57.0306L73.6345 56.9207C73.7473 56.8468 73.8591 56.772 73.9709 56.6961L74.1654 56.5658C74.2714 56.4919 74.3764 56.418 74.4804 56.3431C74.5397 56.3004 74.6 56.2586 74.6593 56.2148C74.789 56.1201 74.9186 56.0249 75.0483 55.9289L75.1455 55.8599C75.2992 55.7422 75.4499 55.6236 75.5996 55.504L75.7669 55.3688L76.0586 55.1277L76.2394 54.9741C76.3367 54.8943 76.4281 54.8127 76.5204 54.731L76.6887 54.5832C76.8112 54.4743 76.9324 54.3637 77.0523 54.2516L77.1817 54.131C77.299 54.0202 77.415 53.909 77.5298 53.7975L77.5813 53.7479C77.2896 52.019 76.8705 50.0734 76.3172 47.8758C74.2043 39.5864 71.7811 36.2113 69.3366 34.7139Z" fill="#D9E3F3"/>
<path d="M49.1168 42.7135L49.2937 42.5988C49.2909 42.5957 49.2883 42.5925 49.286 42.5891C49.254 42.5331 49.2456 42.4667 49.2625 42.4045C49.2795 42.3424 49.3204 42.2895 49.3764 42.2575L49.811 42.0085C49.8116 41.9335 49.7939 41.8594 49.7595 41.7927L49.0059 40.3672C49.0023 41.1507 49.0393 41.9338 49.1168 42.7135Z" fill="#D9E3F3"/>
<path d="M53.0733 33.7376V33.653C53.0616 33.653 53.051 33.653 53.0383 33.653C52.8461 33.6499 52.6543 33.6691 52.4666 33.7104C52.1428 42.0134 56.7391 49.7826 57.5764 51.1245C57.6147 51.0992 57.6597 51.0856 57.7057 51.0856C57.758 51.0862 57.8088 51.1036 57.8506 51.1352C62.4421 45.0433 63.2958 37.5065 63.4339 34.2073C63.4339 34.181 63.4339 34.1567 63.4339 34.1314C63.3697 34.0974 63.3065 34.0634 63.2394 34.0342C63.1232 33.9787 63.0337 33.8793 62.9907 33.7579C62.9477 33.6365 62.9546 33.5029 63.0099 33.3866C63.0492 33.3047 63.1109 33.2356 63.1879 33.1873L62.8524 33.1552C62.8592 33.48 62.8631 33.6812 62.8631 33.6812C62.8631 33.6812 58.8404 37.0942 53.0733 33.7376Z" fill="#54C0A1"/>
<path d="M50.5514 33.5461C49.0646 33.7046 47.5721 33.9885 46.0659 34.8014L48.1205 38.6909C48.3257 36.8366 48.8634 35.378 49.7365 34.3269C49.9764 34.0354 50.2499 33.7733 50.5514 33.5461Z" fill="#90C9ED"/>
<path d="M67.3626 38.4507L69.3365 34.7139L69.3608 34.6692C69.1152 34.546 68.873 34.4339 68.6345 34.3327C67.7717 33.9635 66.8688 33.6966 65.944 33.5373L65.906 33.5305C65.8312 33.514 65.7534 33.4984 65.6746 33.4829L65.6396 33.4761C65.5628 33.4615 65.484 33.4469 65.4033 33.4333L65.3605 33.4255L65.1077 33.3857H65.0766L64.7975 33.3468C64.701 33.3344 64.6037 33.3228 64.5058 33.3118H64.4718C64.3746 33.3001 64.2773 33.2904 64.1743 33.2797H64.1383L63.8339 33.2515C65.7009 34.218 66.7705 36.2386 67.3626 38.4507Z" fill="#90C9ED"/>
<path d="M63.442 34.1334V34.2083C63.3 37.5075 62.4501 45.0443 57.8586 51.1361C57.8169 51.1046 57.7661 51.0872 57.7138 51.0866C57.6675 51.0865 57.6221 51.1 57.5835 51.1255C56.7463 49.7836 52.1499 42.0144 52.4737 33.7114C51.6797 33.885 50.971 34.3299 50.4697 34.9696C49.7141 35.8914 49.0335 37.5153 49.0111 40.3672L49.7647 41.7927C49.7991 41.8594 49.8168 41.9335 49.8162 42.0086L50.8975 41.3901C50.9252 41.3734 50.9561 41.3624 50.9881 41.3577C51.0202 41.3531 51.0529 41.3549 51.0842 41.363C51.1156 41.3712 51.145 41.3855 51.1708 41.4052C51.1965 41.4249 51.218 41.4495 51.2341 41.4777C51.2502 41.5058 51.2605 41.5369 51.2644 41.5691C51.2683 41.6012 51.2657 41.6339 51.2568 41.665C51.2479 41.6962 51.2329 41.7253 51.2126 41.7505C51.1923 41.7758 51.1671 41.7967 51.1386 41.8121L49.6179 42.6776C49.5811 42.6984 49.5396 42.7095 49.4973 42.7096C49.4567 42.7093 49.4168 42.6988 49.3813 42.6791C49.3458 42.6594 49.3158 42.6311 49.2941 42.5968L49.1171 42.7116C49.1599 43.1618 49.2143 43.6344 49.2873 44.1322C50.6 45.7104 53.694 48.7879 57.4998 51.2091C57.479 51.2448 57.4676 51.2853 57.4668 51.3267C57.4668 51.3501 57.4609 53.6361 57.6214 58.6272C57.6234 58.6902 57.6498 58.7499 57.6949 58.7938C57.7401 58.8377 57.8005 58.8623 57.8635 58.8626H57.8713C57.9032 58.8615 57.9346 58.8543 57.9637 58.8411C57.9929 58.8279 58.0191 58.8092 58.0409 58.7859C58.0628 58.7626 58.0798 58.7352 58.0911 58.7053C58.1024 58.6754 58.1076 58.6436 58.1066 58.6117C57.9471 53.6312 57.953 51.351 57.953 51.3287C57.9533 51.2746 57.9351 51.2221 57.9014 51.1799C62.2771 48.3873 65.7027 44.7351 66.5477 43.5128C66.5857 43.4589 66.6123 43.3978 66.626 43.3333C66.6396 43.2688 66.64 43.2022 66.6271 43.1375C66.6141 43.0728 66.5882 43.0115 66.5508 42.9571C66.5134 42.9028 66.4654 42.8566 66.4096 42.8215L65.9604 42.5297C65.927 42.583 65.8742 42.6211 65.8131 42.6358C65.752 42.6505 65.6876 42.6407 65.6337 42.6085L64.0545 41.6819C64.0252 41.6667 63.9992 41.6458 63.9781 41.6203C63.9571 41.5948 63.9415 41.5654 63.9323 41.5336C63.9231 41.5019 63.9204 41.4687 63.9244 41.4359C63.9285 41.4031 63.9392 41.3715 63.9558 41.343C63.9725 41.3144 63.9948 41.2896 64.0214 41.27C64.048 41.2504 64.0783 41.2364 64.1105 41.2289C64.1426 41.2214 64.176 41.2205 64.2085 41.2264C64.241 41.2322 64.272 41.2446 64.2996 41.2628L65.5452 41.9969C65.5466 41.9258 65.5642 41.856 65.5967 41.7927L66.6663 39.7673C66.2015 37.3966 65.2671 35.1262 63.442 34.1334Z" fill="#90C9ED"/>
<path d="M63.9673 41.3532C63.9511 41.3807 63.9404 41.4112 63.9361 41.4429C63.9317 41.4746 63.9336 41.5068 63.9417 41.5377C63.9499 41.5686 63.9641 41.5976 63.9835 41.623C64.0029 41.6484 64.0271 41.6697 64.0548 41.6857L65.6339 42.6124C65.6879 42.6447 65.7523 42.6545 65.8134 42.6397C65.8745 42.625 65.9273 42.5869 65.9607 42.5337L65.9675 42.5259C65.9997 42.4701 66.0086 42.4039 65.9922 42.3416C65.9758 42.2793 65.9355 42.226 65.88 42.1933L65.5455 41.9989L64.2998 41.2686C64.2445 41.2358 64.1784 41.2263 64.1161 41.2422C64.0538 41.258 64.0002 41.298 63.9673 41.3532Z" fill="#75B2E1"/>
<path d="M49.2862 42.5892C49.2886 42.5926 49.2912 42.5958 49.294 42.5989C49.3157 42.6332 49.3457 42.6615 49.3812 42.6812C49.4167 42.7009 49.4566 42.7114 49.4972 42.7117C49.5395 42.7115 49.581 42.7005 49.6178 42.6796L51.1337 41.8122C51.1622 41.7968 51.1874 41.7758 51.2077 41.7505C51.2279 41.7253 51.243 41.6962 51.2519 41.665C51.2608 41.6339 51.2634 41.6012 51.2595 41.5691C51.2556 41.5369 51.2453 41.5058 51.2292 41.4777C51.2131 41.4495 51.1916 41.4249 51.1658 41.4052C51.1401 41.3855 51.1107 41.3712 51.0793 41.363C51.0479 41.3549 51.0153 41.3531 50.9832 41.3577C50.9511 41.3624 50.9203 41.3734 50.8926 41.3901L49.8113 42.0086L49.3766 42.2576C49.3207 42.2896 49.2797 42.3425 49.2628 42.4046C49.2458 42.4668 49.2542 42.5332 49.2862 42.5892Z" fill="#75B2E1"/>
<path d="M63.0185 33.3856C62.9632 33.502 62.9563 33.6355 62.9993 33.7569C63.0423 33.8783 63.1318 33.9777 63.248 34.0332C63.3132 34.0644 63.3764 34.0984 63.4425 34.1305C65.2676 35.1233 66.202 37.3937 66.6668 39.7643C67.1734 42.3479 67.1219 45.0491 67.0558 46.3492H67.0879L67.609 46.4065C67.7593 46.4232 67.9018 46.4819 68.0203 46.5757C68.1117 45.1279 68.2148 41.5953 67.365 38.4458C66.7699 36.2386 65.7003 34.218 63.8305 33.2398C63.776 33.2116 63.7225 33.1824 63.6671 33.1562C63.6095 33.1286 63.5469 33.1127 63.4831 33.1093C63.4193 33.1059 63.3555 33.1152 63.2953 33.1365C63.235 33.1578 63.1796 33.1908 63.1321 33.2335C63.0846 33.2763 63.046 33.328 63.0185 33.3856Z" fill="#1F3966"/>
<path d="M49.0062 40.3672C49.0305 37.5153 49.7112 35.8943 50.4648 34.9696C50.9661 34.3299 51.6748 33.885 52.4688 33.7114C52.6565 33.6701 52.8484 33.6508 53.0406 33.654C53.0532 33.654 53.0639 33.654 53.0756 33.654L53.1184 32.6875H53.1057C53.0425 32.6826 51.8057 32.6116 50.562 33.5393L50.5494 33.549C50.2481 33.7753 49.9746 34.0364 49.7345 34.3269C48.8594 35.378 48.3236 36.8366 48.1184 38.6909C47.8189 41.4047 48.2361 44.9675 49.3679 49.3509C49.666 49.2221 49.9874 49.1559 50.3121 49.1564H50.3218C49.8846 47.5033 49.5392 45.8273 49.2872 44.1361C49.2162 43.6382 49.1598 43.1637 49.1171 42.7155C49.0395 41.9352 49.0025 41.1513 49.0062 40.3672Z" fill="#1F3966"/>
<path d="M67.0848 46.354H67.0527C66.697 46.3229 66.3433 46.4323 66.0672 46.6587C65.7912 46.8852 65.6147 47.2107 65.5757 47.5656L65.2986 50.084C65.259 50.4445 65.3642 50.8059 65.591 51.0889C65.8178 51.3719 66.1477 51.5532 66.5082 51.5931L67.0293 51.6505C67.2423 51.6737 67.4558 51.6114 67.6229 51.4775C67.7901 51.3435 67.8973 51.1487 67.921 50.9358L68.3255 47.3021C68.3481 47.0893 68.2857 46.8763 68.1518 46.7094C68.0179 46.5425 67.8234 46.4354 67.6108 46.4114L67.0848 46.354Z" fill="white"/>
<path d="M49.3693 49.3509C48.8295 49.5838 48.3952 50.0086 48.1504 50.5431C47.9055 51.0776 47.8675 51.6838 48.0436 52.2447C48.2197 52.8056 48.5975 53.2813 49.104 53.5799C49.6104 53.8785 50.2096 53.9788 50.7856 53.8613C51.3617 53.7439 51.8738 53.4171 52.2229 52.9441C52.572 52.4711 52.7334 51.8854 52.6759 51.3003C52.6184 50.7152 52.3461 50.1723 51.9115 49.7763C51.477 49.3803 50.9111 49.1594 50.3232 49.1564H50.3134C49.9887 49.1559 49.6674 49.2221 49.3693 49.3509ZM51.1302 51.5319C51.1304 51.6934 51.0827 51.8514 50.993 51.9859C50.9034 52.1203 50.7759 52.2252 50.6267 52.2871C50.4775 52.3491 50.3132 52.3654 50.1547 52.334C49.9962 52.3026 49.8506 52.2249 49.7362 52.1107C49.6219 51.9965 49.544 51.851 49.5124 51.6925C49.4808 51.5341 49.497 51.3698 49.5587 51.2205C49.6205 51.0712 49.7252 50.9436 49.8596 50.8538C49.9939 50.764 50.1519 50.716 50.3134 50.716C50.5299 50.716 50.7375 50.802 50.8907 50.9549C51.0438 51.1079 51.13 51.3154 51.1302 51.5319Z" fill="white"/>
<path d="M49.4973 51.5319C49.4971 51.6934 49.5448 51.8514 49.6344 51.9859C49.7241 52.1203 49.8516 52.2252 50.0008 52.2871C50.15 52.3491 50.3143 52.3654 50.4728 52.334C50.6313 52.3026 50.7769 52.2249 50.8912 52.1107C51.0055 51.9965 51.0834 51.851 51.115 51.6925C51.1466 51.5341 51.1305 51.3698 51.0687 51.2205C51.0069 51.0712 50.9022 50.9436 50.7679 50.8538C50.6335 50.764 50.4756 50.7161 50.314 50.7161C50.0976 50.7161 49.89 50.802 49.7368 50.9549C49.5837 51.1079 49.4975 51.3154 49.4973 51.5319Z" fill="#90C9ED"/>
<path d="M53.3084 28.3838L53.1197 32.6914L53.077 33.6579V33.7425C58.8441 37.0991 62.8755 33.6851 62.8755 33.6851C62.8755 33.6851 62.8755 33.4839 62.8648 33.1591C62.8541 32.8343 62.8502 32.3433 62.8405 31.8153C57.3029 33.0862 53.4669 28.5685 53.3084 28.3838Z" fill="#FBC3A8"/>
<path d="M53.3043 28.3721L53.3102 28.3789C53.4687 28.5686 57.3046 33.0862 62.8393 31.8105H62.8529L62.8276 28.8807C61.5091 29.8531 59.9835 30.4122 58.345 30.4122C56.4635 30.4093 54.7366 29.6547 53.3043 28.3721Z" fill="#E07C69"/>
<path d="M48.7364 18.1127L48.7908 18.102L48.9026 18.0816L48.9658 18.0729L49.0757 18.0592H49.0825C49.074 18.0223 49.0714 17.9842 49.0747 17.9465C49.0846 17.8438 49.1348 17.7493 49.2143 17.6837C49.2938 17.618 49.3961 17.5866 49.4987 17.5964L50.5031 17.6936C51.7672 15.7353 51.4668 10.8453 51.4668 10.8453C55.7131 12.6247 57.334 10.3144 57.334 10.3144C62.613 12.9971 66.551 10.9386 66.551 10.9386C67.2521 12.9582 67.4398 14.9253 67.4855 16.0571C67.5098 16.66 67.4932 17.0217 67.4932 17.0217C68.0422 16.7421 68.5604 16.4058 69.0393 16.0183C70.7108 14.6725 72.7771 12.0432 72.0099 7.54605C70.776 0.315555 64.2485 3.25695 64.2485 3.25695C55.857 -3.37457 51.4065 5.12486 51.4065 5.12486C51.4065 5.12486 44.6495 5.12486 46.9949 14.1844C47.1388 14.7406 47.2798 15.2258 47.4149 15.6488C47.87 17.0684 48.2706 17.788 48.5818 18.1506C48.6275 18.137 48.6839 18.1244 48.7364 18.1127Z" fill="#5C1E14"/>
<path d="M55.62 13.9277C54.2451 13.9277 53.0822 15.9376 53.0822 18.316C53.0822 20.6944 54.249 22.7042 55.62 22.7042C56.9911 22.7042 58.1579 20.6944 58.1579 18.316C58.1579 15.9376 56.9959 13.9277 55.62 13.9277ZM55.9117 20.8869C55.5228 20.8869 55.2116 20.2928 55.2116 19.5587C55.2116 18.8245 55.5247 18.2294 55.9117 18.2294C56.2987 18.2294 56.6128 18.8245 56.6128 19.5587C56.6128 20.2928 56.2987 20.8869 55.9117 20.8869Z" fill="#FBC3A8"/>
<path d="M67.5026 18.3684L64.8043 18.6232C64.7071 21.3711 63.2874 23.485 61.4983 23.485C60.4287 23.485 59.4923 22.7324 58.8904 21.5403L59.0343 23.6192C59.0444 23.7596 59.0023 23.8987 58.9159 24.0099C58.8295 24.121 58.7051 24.1962 58.5666 24.2211L57.8247 24.3504C57.8101 24.3519 57.7955 24.3519 57.7809 24.3504C57.7164 24.3561 57.6524 24.3359 57.6028 24.2944C57.5532 24.2528 57.5221 24.1932 57.5164 24.1287C57.5108 24.0642 57.5309 24.0002 57.5725 23.9506C57.6141 23.901 57.6737 23.8699 57.7381 23.8642L58.482 23.7301C58.5026 23.7265 58.5211 23.7153 58.5339 23.6987C58.5467 23.6822 58.5528 23.6614 58.551 23.6406L58.3789 21.2097C57.7897 22.5827 56.7852 23.4714 55.6223 23.4714C53.8341 23.4714 52.4135 21.3701 52.3162 18.631L49.4263 18.3684C49.3433 18.3602 49.2652 18.3256 49.2033 18.2695C49.1415 18.2135 49.0994 18.1391 49.0831 18.0573H49.0734L48.9635 18.0709L48.9003 18.0796L48.7885 18.1001L48.734 18.1108C48.6786 18.1224 48.6251 18.1351 48.5716 18.1487C47.3309 18.4773 46.4324 19.4721 46.4324 20.6486C46.4324 22.0926 47.7937 23.2633 49.4662 23.2633C49.6578 23.2634 49.849 23.2474 50.038 23.2157C50.7497 25.3072 51.8855 27.0983 53.3041 28.3692C54.7228 29.6401 56.4614 30.4112 58.3429 30.4112C59.9814 30.4112 61.507 29.8569 62.8256 28.8797C64.5457 27.6049 65.9118 25.6106 66.7072 23.1865C66.9532 23.2403 67.2042 23.2674 67.456 23.2672C69.1313 23.2672 70.4897 22.1004 70.4897 20.6525C70.4897 19.3223 69.3375 18.2216 67.8459 18.0602C67.829 18.1415 67.7866 18.2152 67.7249 18.2707C67.6631 18.3262 67.5853 18.3604 67.5026 18.3684ZM48.9693 22.1607C48.9518 22.2069 48.9207 22.2467 48.8801 22.2748C48.8394 22.3029 48.7912 22.318 48.7418 22.3182C48.7123 22.3182 48.6829 22.3129 48.6553 22.3026C47.9007 22.0177 47.4126 21.3672 47.4126 20.6496C47.4126 20.0273 47.7704 19.4565 48.3694 19.124C48.4259 19.0928 48.4924 19.0853 48.5544 19.1031C48.6164 19.121 48.6688 19.1628 48.7 19.2193C48.7312 19.2757 48.7387 19.3423 48.7208 19.4043C48.7029 19.4663 48.6612 19.5187 48.6047 19.5499C48.1632 19.7949 47.8988 20.2062 47.8988 20.6496C47.8988 21.1679 48.2634 21.6395 48.8274 21.8524C48.8878 21.8753 48.9367 21.9212 48.9633 21.9801C48.9899 22.039 48.9921 22.106 48.9693 22.1665V22.1607ZM55.4521 26.0851C55.4454 26.1442 55.4173 26.1987 55.373 26.2383C55.3287 26.278 55.2714 26.2999 55.2119 26.3H55.1837C55.1001 26.2903 53.1184 26.0375 52.4611 23.5599C52.4472 23.4985 52.4576 23.4341 52.4902 23.3803C52.5228 23.3264 52.5751 23.2873 52.6359 23.2712C52.6968 23.2551 52.7615 23.2632 52.8165 23.2938C52.8715 23.3244 52.9124 23.3752 52.9308 23.4354C53.5015 25.5814 55.1672 25.808 55.2421 25.8167C55.2739 25.8209 55.3045 25.8314 55.3323 25.8474C55.3601 25.8635 55.3844 25.8848 55.4039 25.9103C55.4234 25.9358 55.4377 25.9648 55.446 25.9958C55.4543 26.0268 55.4563 26.0592 55.4521 26.091V26.0851ZM68.2504 19.3146C68.1911 19.2888 68.1444 19.2405 68.1207 19.1803C68.097 19.1201 68.0982 19.053 68.124 18.9937C68.1498 18.9344 68.1981 18.8877 68.2582 18.864C68.3184 18.8403 68.3855 18.8415 68.4449 18.8673C69.2227 19.2008 69.7089 19.8814 69.7089 20.6447C69.7089 21.6511 68.8494 22.4922 67.7097 22.6079H67.6854C67.621 22.611 67.5579 22.5884 67.5101 22.545C67.4623 22.5016 67.4338 22.441 67.4307 22.3765C67.4276 22.312 67.4502 22.249 67.4936 22.2012C67.537 22.1534 67.5976 22.1249 67.6621 22.1218C68.5518 22.0342 69.2227 21.3983 69.2227 20.6428C69.2227 20.0856 68.8503 19.5761 68.2504 19.3204V19.3146Z" fill="#FBC3A8"/>
<path d="M66.5514 10.9347C66.5514 10.9347 62.6134 12.9932 57.3344 10.3105C57.3344 10.3105 55.7135 12.6208 51.4672 10.8414C51.4672 10.8414 51.7676 15.7314 50.5035 17.6897L52.318 17.8609C52.4609 15.1849 53.8592 13.1498 55.624 13.1498C56.9153 13.1498 58.0121 14.2447 58.5615 15.8841C59.1109 14.2447 60.2077 13.1498 61.499 13.1498C63.2551 13.1498 64.6514 15.1762 64.8051 17.8434L67.4382 17.5954C67.4576 17.594 67.4771 17.594 67.4966 17.5954C67.5004 17.0567 67.5004 16.5427 67.4966 16.0533C67.4402 14.9253 67.2564 12.9543 66.5514 10.9347Z" fill="#FBC3A8"/>
<path d="M64.0292 18.1293C63.9709 15.8326 62.8342 13.9277 61.4953 13.9277C60.1194 13.9277 58.9574 15.9376 58.9574 18.316C58.9574 20.6944 60.1242 22.7042 61.4953 22.7042C62.8498 22.7042 63.9972 20.7527 64.0312 18.42C64.0112 18.374 64.0009 18.3243 64.0009 18.2742C64.0009 18.224 64.0112 18.1743 64.0312 18.1283L64.0292 18.1293ZM61.9805 20.8869C61.5915 20.8869 61.2794 20.2928 61.2794 19.5587C61.2794 18.8245 61.5935 18.2294 61.9805 18.2294C62.3675 18.2294 62.6806 18.8245 62.6806 19.5587C62.6806 20.2928 62.3675 20.8869 61.9805 20.8869Z" fill="#FBC3A8"/>
<path d="M64.7966 17.8434C64.6478 15.1762 63.2515 13.1498 61.4906 13.1498C60.1993 13.1498 59.1024 14.2447 58.553 15.8841C58.0037 14.2447 56.9068 13.1498 55.6155 13.1498C53.8546 13.1498 52.4563 15.185 52.3095 17.8609L50.5038 17.6878L49.4994 17.5906C49.3968 17.5809 49.2945 17.6122 49.215 17.6779C49.1355 17.7435 49.0853 17.838 49.0754 17.9407C49.0721 17.9784 49.0747 18.0165 49.0832 18.0534C49.0995 18.1353 49.1417 18.2097 49.2035 18.2657C49.2653 18.3217 49.3434 18.3564 49.4265 18.3646L52.3115 18.6369C52.4165 21.376 53.8322 23.4773 55.6175 23.4773C56.7843 23.4773 57.7849 22.5885 58.3741 21.2156L58.3518 20.8956C58.3495 20.8637 58.3536 20.8317 58.3638 20.8013C58.3739 20.771 58.3899 20.7429 58.4109 20.7188C58.4319 20.6946 58.4575 20.6748 58.4861 20.6606C58.5148 20.6463 58.5459 20.6378 58.5778 20.6355C58.6098 20.6333 58.6418 20.6374 58.6722 20.6475C58.7025 20.6577 58.7306 20.6737 58.7547 20.6947C58.7789 20.7157 58.7987 20.7412 58.8129 20.7699C58.8272 20.7985 58.8357 20.8297 58.838 20.8616L58.8856 21.5345C59.4875 22.7247 60.4229 23.4792 61.4935 23.4792C63.2855 23.4792 64.7023 21.3692 64.7995 18.6174L67.5027 18.3685C67.5857 18.3603 67.6639 18.3256 67.7257 18.2696C67.7875 18.2136 67.8296 18.1391 67.8459 18.0573C67.8544 18.0204 67.857 17.9823 67.8537 17.9445C67.8417 17.8428 67.7909 17.7497 67.7119 17.6845C67.633 17.6193 67.5319 17.587 67.4297 17.5945L64.7966 17.8434ZM55.6204 22.7052C54.2455 22.7052 53.0825 20.6953 53.0825 18.317C53.0825 15.9386 54.2494 13.9287 55.6204 13.9287C56.9914 13.9287 58.1583 15.9386 58.1583 18.317C58.1583 20.6953 56.9963 22.7042 55.6204 22.7042V22.7052ZM61.4954 22.7052C60.1195 22.7052 58.9576 20.6953 58.9576 18.317C58.9576 15.9386 60.1244 13.9287 61.4954 13.9287C62.8344 13.9287 63.9711 15.8335 64.0294 18.1303C64.0094 18.1763 63.9991 18.2259 63.9991 18.2761C63.9991 18.3263 64.0094 18.3759 64.0294 18.422C63.9973 20.7527 62.8499 22.7042 61.4954 22.7042V22.7052Z" fill="white"/>
<path d="M58.4799 23.7378L57.736 23.872C57.6715 23.8777 57.612 23.9087 57.5704 23.9583C57.5288 24.0079 57.5086 24.072 57.5143 24.1365C57.52 24.2009 57.551 24.2605 57.6006 24.3021C57.6502 24.3437 57.7143 24.3638 57.7788 24.3582C57.7933 24.3596 57.808 24.3596 57.8225 24.3582L58.5664 24.224C58.7049 24.1991 58.8294 24.1239 58.9157 24.0128C59.0021 23.9016 59.0442 23.7625 59.0341 23.6221L58.8873 21.5471L58.8396 20.8742C58.8374 20.8423 58.8289 20.8111 58.8146 20.7825C58.8003 20.7538 58.7806 20.7283 58.7564 20.7073C58.7323 20.6863 58.7042 20.6703 58.6739 20.6601C58.6435 20.65 58.6115 20.6459 58.5795 20.6481C58.5476 20.6504 58.5164 20.6589 58.4878 20.6732C58.4592 20.6874 58.4336 20.7072 58.4126 20.7314C58.3916 20.7555 58.3756 20.7836 58.3654 20.8139C58.3553 20.8443 58.3512 20.8763 58.3535 20.9083L58.3758 21.2282L58.5479 23.659C58.5472 23.6779 58.54 23.696 58.5276 23.7103C58.5153 23.7246 58.4984 23.7343 58.4799 23.7378Z" fill="#E07C69"/>
<path d="M67.6618 22.1296C67.5973 22.1327 67.5367 22.1613 67.4933 22.2091C67.4499 22.2569 67.4272 22.3199 67.4303 22.3844C67.4334 22.4489 67.462 22.5095 67.5098 22.5529C67.5576 22.5963 67.6206 22.6189 67.6851 22.6158H67.7094C68.849 22.503 69.7086 21.659 69.7086 20.6526C69.7086 19.8893 69.2224 19.2086 68.4445 18.8751C68.4152 18.8623 68.3836 18.8555 68.3515 18.8549C68.3195 18.8543 68.2877 18.8601 68.2579 18.8718C68.2281 18.8836 68.2009 18.9011 68.1779 18.9233C68.1548 18.9456 68.1364 18.9721 68.1236 19.0015C68.1109 19.0309 68.104 19.0625 68.1035 19.0945C68.1029 19.1265 68.1086 19.1583 68.1204 19.1881C68.1321 19.2179 68.1496 19.2451 68.1719 19.2681C68.1941 19.2912 68.2207 19.3096 68.25 19.3224C68.85 19.5781 69.2224 20.0876 69.2224 20.6526C69.2224 21.4062 68.5515 22.0421 67.6618 22.1296Z" fill="#E07C69"/>
<path d="M48.8273 21.8534C48.2633 21.6405 47.8987 21.1728 47.8987 20.6506C47.8987 20.2072 48.1632 19.7959 48.6046 19.5509C48.6611 19.5197 48.7029 19.4673 48.7207 19.4053C48.7386 19.3433 48.7311 19.2768 48.6999 19.2203C48.6687 19.1638 48.6163 19.1221 48.5543 19.1042C48.4923 19.0863 48.4258 19.0938 48.3693 19.125C47.7703 19.4576 47.4125 20.0283 47.4125 20.6506C47.4125 21.3731 47.8987 22.0236 48.6552 22.3036C48.6829 22.314 48.7122 22.3192 48.7417 22.3192C48.7987 22.3192 48.8538 22.2992 48.8975 22.2627C48.9412 22.2263 48.9707 22.1756 48.9809 22.1196C48.9911 22.0636 48.9813 22.0058 48.9532 21.9563C48.9251 21.9067 48.8806 21.8686 48.8273 21.8486V21.8534Z" fill="#E07C69"/>
<path d="M61.9798 18.2294C61.5909 18.2294 61.2787 18.8245 61.2787 19.5586C61.2787 20.2927 61.5928 20.8869 61.9798 20.8869C62.3668 20.8869 62.6799 20.2927 62.6799 19.5586C62.6799 18.8245 62.3668 18.2294 61.9798 18.2294Z" fill="black"/>
<path d="M55.912 18.2294C55.523 18.2294 55.2119 18.8245 55.2119 19.5586C55.2119 20.2927 55.525 20.8869 55.912 20.8869C56.299 20.8869 56.613 20.2927 56.613 19.5586C56.613 18.8245 56.299 18.2294 55.912 18.2294Z" fill="black"/>
<path d="M55.2395 25.8206C55.1685 25.8119 53.499 25.5853 52.9283 23.4393C52.91 23.3791 52.869 23.3283 52.814 23.2977C52.759 23.2671 52.6943 23.259 52.6334 23.2751C52.5726 23.2912 52.5204 23.3303 52.4878 23.3842C52.4552 23.438 52.4447 23.5024 52.4586 23.5638C53.1179 26.0414 55.0995 26.2942 55.1812 26.3039H55.2094C55.2738 26.3076 55.3372 26.2856 55.3854 26.2427C55.4336 26.1997 55.4628 26.1394 55.4666 26.0749C55.4703 26.0104 55.4483 25.9471 55.4053 25.8989C55.3624 25.8506 55.302 25.8214 55.2376 25.8177L55.2395 25.8206Z" fill="#FBC3A8"/>
<path d="M60.6927 26.6567C60.6446 26.7097 59.4979 27.944 57.4149 27.1746C57.3551 27.1549 57.29 27.1591 57.2333 27.1864C57.1765 27.2138 57.1326 27.262 57.1108 27.321C57.0889 27.3801 57.0908 27.4453 57.116 27.5029C57.1413 27.5606 57.1879 27.6062 57.2461 27.6302C59.6512 28.5182 60.9991 27.0439 61.0541 26.9827L61.0704 26.9597C61.1106 26.9091 61.129 26.8447 61.1217 26.7805C61.1144 26.7164 61.0818 26.6577 61.0313 26.6176C60.9807 26.5774 60.9163 26.5589 60.8521 26.5662C60.788 26.5736 60.7294 26.6061 60.6892 26.6566L60.6927 26.6567Z" fill="#E07C69"/>
<path d="M44.9394 58.4172H44.9277C44.8634 58.4142 44.8029 58.3858 44.7595 58.3382C44.7161 58.2906 44.6934 58.2278 44.6963 58.1634C44.8605 54.3673 44.82 50.565 44.5747 46.7732C44.5723 46.7412 44.5762 46.7091 44.5862 46.6787C44.5961 46.6483 44.612 46.6201 44.6329 46.5959C44.6537 46.5716 44.6792 46.5516 44.7077 46.5372C44.7363 46.5227 44.7674 46.514 44.7994 46.5116C44.8313 46.5092 44.8634 46.5131 44.8938 46.523C44.9242 46.533 44.9524 46.5489 44.9767 46.5697C45.001 46.5906 45.0209 46.616 45.0354 46.6446C45.0498 46.6732 45.0585 46.7043 45.0609 46.7362C45.3076 50.5478 45.3485 54.3698 45.1835 58.1858C45.1802 58.2483 45.1531 58.3072 45.1077 58.3503C45.0622 58.3933 45.002 58.4173 44.9394 58.4172Z" fill="#90C9ED"/>
<path d="M70.2892 57.9563C70.2285 57.956 70.1701 57.9332 70.1253 57.8922C70.0806 57.8512 70.0527 57.795 70.0471 57.7346C69.8731 55.7441 69.8857 50.0403 69.8867 49.7991C69.8867 49.7346 69.9123 49.6728 69.9579 49.6272C70.0035 49.5816 70.0653 49.556 70.1298 49.556C70.1943 49.5563 70.2561 49.5821 70.3017 49.6279C70.3473 49.6736 70.3728 49.7355 70.3728 49.8001C70.3728 49.8594 70.3592 55.7228 70.5323 57.6918C70.5351 57.7237 70.5316 57.7558 70.522 57.7863C70.5123 57.8168 70.4968 57.8451 70.4762 57.8696C70.4556 57.8941 70.4303 57.9142 70.4019 57.9289C70.3735 57.9437 70.3425 57.9526 70.3106 57.9553L70.2892 57.9563Z" fill="#90C9ED"/>
<path opacity="0.1" d="M38.3241 78.256L34.7592 80.3132C34.5414 80.4383 34.3605 80.6187 34.2347 80.8361C34.1088 81.0535 34.0426 81.3002 34.0426 81.5513C34.0426 81.8025 34.1088 82.0492 34.2347 82.2666C34.3605 82.484 34.5414 82.6644 34.7592 82.7895L38.3241 84.8475C38.5414 84.9736 38.788 85.0401 39.0392 85.0403C39.2903 85.0406 39.5371 84.9746 39.7546 84.849C39.9721 84.7234 40.1527 84.5427 40.278 84.325C40.4034 84.1074 40.4691 83.8605 40.4686 83.6094V79.4933C40.469 79.2422 40.4031 78.9955 40.2777 78.778C40.1523 78.5604 39.9717 78.3798 39.7543 78.2543C39.5368 78.1289 39.29 78.0629 39.039 78.0632C38.7879 78.0635 38.5413 78.13 38.3241 78.256Z" fill="#D9E3F3"/>
</g>
<defs>
<clipPath id="clip0_39_284">
<rect width="168" height="125" fill="white"/>
</clipPath>
</defs>
</svg>
