<svg width="168" height="125" viewBox="0 0 168 125" fill="none" xmlns="http://www.w3.org/2000/svg">
<path opacity="0.1" d="M137.627 86.5254L128.68 84.0734C128.159 83.9302 127.614 83.8912 127.078 83.9585C126.541 84.0259 126.023 84.1984 125.553 84.4661C125.083 84.7339 124.67 85.0916 124.339 85.5189C124.007 85.9462 123.763 86.4346 123.62 86.9563L123.131 88.7413C124.055 93.3075 124.234 97.4361 123.356 100.703C123.58 100.81 123.813 100.897 124.052 100.963L132.999 103.415C133.52 103.558 134.065 103.597 134.602 103.53C135.139 103.463 135.657 103.29 136.127 103.022C136.597 102.754 137.009 102.397 137.341 101.969C137.672 101.542 137.916 101.053 138.059 100.531L140.511 91.5847C140.654 91.0631 140.693 90.5185 140.625 89.9819C140.558 89.4453 140.385 88.9273 140.118 88.4574C139.85 87.9876 139.492 87.5751 139.065 87.2436C138.637 86.9121 138.149 86.668 137.627 86.5254Z" fill="white"/>
<path d="M60.0313 76.7881L31.6485 80.1482C30.9153 80.2355 30.1718 80.1613 29.4704 79.9306L29.5351 80.2439C29.6702 80.8963 29.9326 81.5156 30.3071 82.0665C30.6816 82.6175 31.161 83.0893 31.7179 83.4549C32.2747 83.8206 32.8981 84.073 33.5526 84.1978C34.207 84.3225 34.8795 84.3171 35.5318 84.1819L59.3602 79.2611C59.3854 79.1637 59.4097 79.0662 59.4349 78.9679C59.6222 78.2161 59.823 77.4912 60.0313 76.7881Z" fill="#617ABC"/>
<path d="M31.6486 80.1439L60.0313 76.7839C60.5586 74.9857 61.1917 73.2203 61.9272 71.4969C61.6593 71.7167 61.334 71.8549 60.9898 71.8951L55.3794 72.5587C55.1419 72.5867 54.9011 72.5676 54.6709 72.5026C54.4407 72.4375 54.2256 72.3277 54.0379 72.1795C53.8501 72.0313 53.6934 71.8476 53.5767 71.6388C53.4599 71.43 53.3855 71.2002 53.3575 70.9627L52.6948 65.3842C52.6667 65.1466 52.6856 64.9058 52.7506 64.6755C52.8156 64.4452 52.9254 64.23 53.0736 64.0421C53.2218 63.8543 53.4056 63.6975 53.6145 63.5807C53.8233 63.4639 54.0531 63.3895 54.2908 63.3615L59.9011 62.6979C60.3809 62.6416 60.8633 62.7781 61.2425 63.0774C61.6216 63.3766 61.8664 63.8142 61.923 64.2939L62.5858 69.8724C62.5917 69.9244 62.595 69.9757 62.5967 70.0269C63.9886 67.1256 65.5426 64.8324 67.1478 63.0213L65.1117 45.9038C64.9528 44.5684 64.2703 43.3508 63.214 42.5185C62.1577 41.6862 60.8141 41.3073 59.4786 41.4653L58.6185 41.5669L58.8604 43.6048C58.9156 44.071 58.7833 44.5401 58.4927 44.9089C58.202 45.2776 57.7768 45.5159 57.3106 45.5712L57.0409 45.6031C56.5749 45.6583 56.106 45.5261 55.7374 45.2356C55.3688 44.9452 55.1307 44.5202 55.0753 44.0542L54.8334 42.0146L32.0123 44.7127L32.2559 46.7506C32.3111 47.2168 32.1788 47.6859 31.8882 48.0547C31.5975 48.4234 31.1724 48.6617 30.7061 48.717L30.4365 48.7489C29.9704 48.8041 29.5016 48.6719 29.1329 48.3814C28.7643 48.0909 28.5262 47.666 28.4709 47.2L28.2239 45.1604L27.504 45.2444C26.1683 45.4034 24.9504 46.0865 24.1182 47.1433C23.286 48.2001 22.9076 49.5442 23.0663 50.88L26.0156 75.7036C26.1742 77.0391 26.8567 78.2569 27.913 79.0893C28.9694 79.9216 30.3131 80.3004 31.6486 80.1422V80.1439ZM52.9527 52.1165L58.5622 51.4529C58.9811 51.4028 59.4043 51.5002 59.7592 51.7284L60.9763 49.872C61.037 49.7798 61.1153 49.7004 61.2066 49.6384C61.2979 49.5764 61.4006 49.5331 61.5087 49.5107C61.6168 49.4884 61.7283 49.4876 61.8367 49.5084C61.9451 49.5292 62.0484 49.5711 62.1406 49.6317C62.2328 49.6924 62.3122 49.7707 62.3742 49.862C62.4361 49.9533 62.4795 50.056 62.5018 50.1641C62.5241 50.2722 62.5249 50.3837 62.5042 50.4921C62.4834 50.6005 62.4415 50.7038 62.3808 50.796L60.6328 53.4588L61.2468 58.6248C61.2749 58.8624 61.256 59.1032 61.191 59.3335C61.126 59.5638 61.0162 59.779 60.868 59.9669C60.7198 60.1547 60.536 60.3115 60.3271 60.4283C60.1183 60.5451 59.8885 60.6196 59.6508 60.6475L54.0413 61.3111C53.8037 61.3391 53.563 61.32 53.3328 61.255C53.1026 61.1899 52.8875 61.0801 52.6997 60.9319C52.512 60.7837 52.3553 60.6 52.2385 60.3912C52.1218 60.1824 52.0474 59.9527 52.0194 59.7151L51.3567 54.1375C51.3287 53.9 51.3477 53.6593 51.4128 53.4291C51.4779 53.199 51.5877 52.984 51.7359 52.7963C51.8841 52.6086 52.0678 52.4519 52.2766 52.3353C52.4854 52.2186 52.7151 52.1443 52.9527 52.1165ZM50.7594 65.6178L51.4222 71.1962C51.4503 71.4338 51.4313 71.6747 51.3663 71.9049C51.3013 72.1352 51.1916 72.3504 51.0434 72.5383C50.8951 72.7261 50.7114 72.8829 50.5025 72.9997C50.2937 73.1165 50.0638 73.191 49.8262 73.2189L44.2167 73.8825C43.9791 73.9105 43.7384 73.8914 43.5082 73.8264C43.278 73.7613 43.0629 73.6516 42.8751 73.5034C42.6874 73.3552 42.5306 73.1714 42.4139 72.9626C42.2972 72.7538 42.2227 72.5241 42.1948 72.2865L41.532 66.7089C41.5038 66.4712 41.5227 66.2303 41.5876 65.9999C41.6526 65.7695 41.7623 65.5542 41.9105 65.3663C42.0588 65.1783 42.2426 65.0215 42.4515 64.9046C42.6604 64.7878 42.8903 64.7133 43.128 64.6854L48.7376 64.0218C49.2173 63.9654 49.6998 64.1019 50.0789 64.4012C50.458 64.7005 50.7028 65.1381 50.7594 65.6178ZM41.7908 53.4378L47.4003 52.775C47.6378 52.7469 47.8786 52.7659 48.1089 52.8309C48.3391 52.8959 48.5543 53.0057 48.742 53.1539C48.9298 53.3021 49.0865 53.4859 49.2032 53.6948C49.3199 53.9036 49.3943 54.1334 49.4221 54.371L50.0849 59.9486C50.113 60.1862 50.0941 60.4271 50.0291 60.6574C49.964 60.8876 49.8543 61.1029 49.7061 61.2907C49.5579 61.4786 49.3741 61.6354 49.1652 61.7521C48.9564 61.8689 48.7266 61.9434 48.4889 61.9713L42.8794 62.6349C42.3995 62.6915 41.9168 62.5551 41.5375 62.2558C41.1582 61.9565 40.9133 61.5188 40.8567 61.0389L40.1939 55.4613C40.1656 55.2235 40.1844 54.9824 40.2493 54.7518C40.3142 54.5212 40.424 54.3057 40.5723 54.1176C40.7207 53.9295 40.9046 53.7724 41.1137 53.6555C41.3228 53.5386 41.5528 53.464 41.7908 53.4361V53.4378ZM29.804 62.3443L29.1412 56.7667C29.113 56.529 29.1318 56.2881 29.1968 56.0577C29.2617 55.8273 29.3715 55.612 29.5197 55.4241C29.6679 55.2361 29.8518 55.0792 30.0607 54.9624C30.2696 54.8456 30.4995 54.7711 30.7372 54.7431L36.3476 54.0804C36.5851 54.0523 36.8259 54.0713 37.0562 54.1363C37.2864 54.2013 37.5015 54.311 37.6893 54.4593C37.8771 54.6075 38.0338 54.7913 38.1505 55.0001C38.2672 55.209 38.3416 55.4388 38.3694 55.6764L39.0322 61.254C39.0603 61.4916 39.0413 61.7324 38.9763 61.9627C38.9113 62.193 38.8016 62.4082 38.6534 62.5961C38.5051 62.7839 38.3214 62.9407 38.1125 63.0575C37.9037 63.1743 37.6738 63.2488 37.4362 63.2767L31.8258 63.9403C31.5883 63.9683 31.3475 63.9492 31.1173 63.8842C30.8871 63.8191 30.672 63.7093 30.4843 63.5611C30.2965 63.4129 30.1398 63.2292 30.0231 63.0204C29.9063 62.8116 29.8319 62.5819 29.804 62.3443ZM32.072 65.9949L37.6823 65.328C37.9199 65.3 38.1606 65.319 38.3908 65.3841C38.621 65.4491 38.8361 65.5589 39.0239 65.7071C39.2116 65.8553 39.3684 66.0391 39.4851 66.2479C39.6018 66.4567 39.6763 66.6864 39.7042 66.924L40.367 72.5024C40.3953 72.7401 40.3765 72.981 40.3116 73.2114C40.2467 73.4417 40.1369 73.657 39.9887 73.8449C39.8404 74.0328 39.6565 74.1896 39.4476 74.3063C39.2386 74.4231 39.0087 74.4974 38.771 74.5251L33.1614 75.1887C32.9239 75.2167 32.6831 75.1976 32.4529 75.1326C32.2227 75.0675 32.0076 74.9578 31.8199 74.8096C31.6321 74.6613 31.4754 74.4776 31.3587 74.2688C31.2419 74.06 31.1675 73.8303 31.1396 73.5927L30.4768 68.0151C30.4207 67.5356 30.5573 67.0535 30.8566 66.6746C31.1559 66.2958 31.5933 66.0513 32.0728 65.9949H32.072Z" fill="#6F9BD4"/>
<path d="M30.435 48.749L30.7047 48.7171C30.9357 48.6899 31.1591 48.6175 31.3621 48.5039C31.5651 48.3903 31.7437 48.2379 31.8878 48.0553C32.0319 47.8727 32.1386 47.6635 32.2018 47.4396C32.265 47.2157 32.2834 46.9816 32.2561 46.7506L32.0142 44.7128L31.7622 42.5892C31.7349 42.3585 31.6624 42.1355 31.5489 41.9328C31.4354 41.7301 31.2831 41.5518 31.1006 41.4081C30.9181 41.2643 30.7091 41.1579 30.4855 41.0949C30.2619 41.0319 30.0281 41.0137 29.7975 41.0411L29.527 41.073C29.2956 41.0995 29.0718 41.1714 28.8683 41.2846C28.6648 41.3978 28.4857 41.5501 28.3412 41.7328C28.1967 41.9154 28.0898 42.1248 28.0264 42.3489C27.9631 42.573 27.9446 42.8074 27.9722 43.0386L28.2242 45.1605L28.4661 47.2C28.4935 47.4311 28.5661 47.6545 28.6799 47.8575C28.7937 48.0604 28.9465 48.2389 29.1293 48.3828C29.3122 48.5267 29.5217 48.6331 29.7457 48.6959C29.9698 48.7588 30.204 48.7768 30.435 48.749Z" fill="#617ABC"/>
<path d="M57.041 45.6031L57.3107 45.5712C57.7769 45.5159 58.2021 45.2776 58.4928 44.9089C58.7834 44.5401 58.9157 44.071 58.8605 43.6048L58.6186 41.5669L58.3666 39.4434C58.3393 39.2127 58.2668 38.9897 58.1533 38.787C58.0398 38.5843 57.8874 38.406 57.705 38.2622C57.5225 38.1185 57.3135 38.0121 57.0899 37.9491C56.8663 37.8861 56.6325 37.8678 56.4018 37.8953L56.1313 37.9272C55.9004 37.9544 55.6772 38.0268 55.4743 38.1403C55.2715 38.2538 55.093 38.4062 54.949 38.5888C54.8051 38.7713 54.6985 38.9805 54.6355 39.2042C54.5724 39.428 54.5541 39.662 54.5815 39.8928L54.8335 42.0146L55.0754 44.0542C55.1308 44.5202 55.3689 44.9452 55.7375 45.2356C56.1061 45.5261 56.575 45.6583 57.041 45.6031Z" fill="#617ABC"/>
<path d="M36.3428 54.0825L30.7337 54.7454C29.7349 54.8635 29.0209 55.7689 29.1389 56.7677L29.7982 62.346C29.9162 63.3448 30.8216 64.0588 31.8204 63.9408L37.4296 63.2779C38.4284 63.1599 39.1424 62.2545 39.0244 61.2556L38.3651 55.6773C38.2471 54.6785 37.3417 53.9645 36.3428 54.0825Z" fill="#D9E3F3"/>
<path d="M47.3984 52.7756L41.7892 53.4385C40.7904 53.5565 40.0764 54.4619 40.1944 55.4608L40.8537 61.0391C40.9717 62.0379 41.8771 62.7519 42.876 62.6339L48.4851 61.971C49.4839 61.8529 50.1979 60.9475 50.0799 59.9487L49.4206 54.3704C49.3026 53.3716 48.3972 52.6575 47.3984 52.7756Z" fill="#D9E3F3"/>
<path d="M52.0211 59.7177C52.0491 59.9553 52.1235 60.185 52.2402 60.3938C52.357 60.6026 52.5137 60.7863 52.7014 60.9345C52.8892 61.0827 53.1043 61.1925 53.3345 61.2576C53.5647 61.3226 53.8055 61.3417 54.043 61.3137L59.6526 60.6501C59.8902 60.6222 60.12 60.5477 60.3289 60.4309C60.5377 60.3141 60.7215 60.1573 60.8697 59.9695C61.0179 59.7816 61.1277 59.5664 61.1927 59.3361C61.2577 59.1058 61.2767 58.865 61.2486 58.6274L60.6345 53.4613L58.0019 57.469C57.7574 57.8407 57.3804 58.1053 56.9477 58.2089C56.515 58.3125 56.059 58.2474 55.6726 58.0268L55.6063 57.989L53.6373 56.3299C53.5514 56.2593 53.4803 56.1724 53.4283 56.0741C53.3762 55.9759 53.3442 55.8682 53.3341 55.7575C53.3239 55.6468 53.3359 55.5351 53.3692 55.429C53.4026 55.3229 53.4567 55.2245 53.5283 55.1395C53.6 55.0545 53.6878 54.9845 53.7868 54.9337C53.8857 54.8829 53.9937 54.8523 54.1046 54.8435C54.2154 54.8348 54.3269 54.8481 54.4326 54.8828C54.5382 54.9175 54.6359 54.9728 54.7201 55.0456L56.5378 56.5769C56.5495 56.5774 56.5612 56.5749 56.5716 56.5696C56.5821 56.5643 56.591 56.5564 56.5975 56.5467L59.7592 51.7284C59.4044 51.5003 58.9811 51.4028 58.5622 51.4529L52.9527 52.1165C52.7149 52.1443 52.485 52.2187 52.276 52.3355C52.067 52.4524 51.8832 52.6092 51.7349 52.7972C51.5867 52.9852 51.4769 53.2005 51.412 53.4309C51.3471 53.6614 51.3283 53.9023 51.3567 54.1401L52.0211 59.7177Z" fill="#D9E3F3"/>
<path d="M37.6793 65.334L32.0701 65.9968C31.0713 66.1149 30.3573 67.0203 30.4753 68.0191L31.1346 73.5973C31.2526 74.5961 32.158 75.3101 33.1568 75.1921L38.766 74.5292C39.7648 74.4111 40.4788 73.5057 40.3608 72.5069L39.7015 66.9287C39.5835 65.9299 38.6781 65.2159 37.6793 65.334Z" fill="#D9E3F3"/>
<path d="M48.734 64.028L43.1248 64.6909C42.126 64.8089 41.412 65.7143 41.53 66.7131L42.1893 72.2913C42.3073 73.2901 43.2127 74.0041 44.2115 73.8861L49.8207 73.2232C50.8195 73.1051 51.5335 72.1997 51.4155 71.2009L50.7562 65.6228C50.6382 64.6239 49.7328 63.9099 48.734 64.028Z" fill="#D9E3F3"/>
<path d="M61.9215 64.2981C61.8649 63.8184 61.6201 63.3809 61.241 63.0816C60.8618 62.7823 60.3794 62.6458 59.8996 62.7022L54.2893 63.3658C54.0516 63.3937 53.8218 63.4682 53.613 63.5849C53.4041 63.7017 53.2203 63.8585 53.0721 64.0464C52.9239 64.2342 52.8141 64.4494 52.7491 64.6797C52.6841 64.91 52.6652 65.1508 52.6933 65.3884L53.356 70.9668C53.384 71.2044 53.4584 71.4341 53.5752 71.6429C53.6919 71.8517 53.8486 72.0354 54.0364 72.1836C54.2241 72.3319 54.4392 72.4416 54.6694 72.5067C54.8996 72.5717 55.1404 72.5908 55.3779 72.5628L60.9883 71.8992C61.3325 71.859 61.6578 71.7208 61.9257 71.5011C62.1441 70.9971 62.3667 70.5071 62.5935 70.0311C62.5935 69.9798 62.5885 69.9286 62.5826 69.8765L61.9215 64.2981Z" fill="#D9E3F3"/>
<path d="M56.5379 56.5769L54.7201 55.0456C54.636 54.9728 54.5383 54.9175 54.4326 54.8828C54.327 54.8481 54.2155 54.8348 54.1046 54.8435C53.9938 54.8522 53.8858 54.8829 53.7868 54.9337C53.6879 54.9845 53.6001 55.0545 53.5284 55.1395C53.4567 55.2245 53.4026 55.3229 53.3693 55.429C53.3359 55.5351 53.324 55.6467 53.3341 55.7575C53.3443 55.8682 53.3763 55.9758 53.4283 56.0741C53.4804 56.1724 53.5514 56.2593 53.6374 56.3299L55.608 57.9889L55.6744 58.0267C56.0608 58.2474 56.5167 58.3125 56.9494 58.2089C57.3821 58.1053 57.7591 57.8407 58.0037 57.469L60.6346 53.4588L62.3809 50.796C62.4416 50.7038 62.4835 50.6005 62.5043 50.4921C62.525 50.3837 62.5242 50.2722 62.5019 50.1641C62.4796 50.056 62.4362 49.9534 62.3743 49.862C62.3123 49.7707 62.2329 49.6924 62.1407 49.6318C62.0485 49.5711 61.9452 49.5292 61.8368 49.5084C61.7284 49.4877 61.6169 49.4885 61.5088 49.5108C61.4007 49.5331 61.298 49.5764 61.2067 49.6384C61.1154 49.7004 61.0371 49.7798 60.9764 49.872L59.7593 51.7284L56.5975 56.5467C56.591 56.5564 56.5821 56.5643 56.5717 56.5696C56.5612 56.5749 56.5496 56.5774 56.5379 56.5769Z" fill="#617ABC"/>
<path d="M115.727 107.724C115.719 107.698 115.706 107.673 115.688 107.652C115.671 107.631 115.649 107.613 115.625 107.6C115.6 107.587 115.574 107.579 115.546 107.577C115.519 107.574 115.491 107.577 115.465 107.585C115.425 107.597 111.415 108.774 104.617 107.091C104.563 107.078 104.506 107.086 104.458 107.115C104.41 107.144 104.376 107.191 104.362 107.245C104.349 107.299 104.358 107.356 104.387 107.404C104.415 107.452 104.462 107.486 104.516 107.499C106.549 108.016 108.63 108.321 110.725 108.409C111.025 108.42 111.313 108.425 111.586 108.425C114.096 108.425 115.491 108.016 115.587 107.987C115.634 107.973 115.675 107.943 115.702 107.903C115.72 107.877 115.731 107.847 115.735 107.816C115.739 107.785 115.736 107.754 115.727 107.724Z" fill="#231F20"/>
<path d="M81.9143 57.4908C81.9143 57.3371 81.9143 57.196 81.9084 57.0649L81.8983 57.07C81.9 57.2044 81.9084 57.348 81.9143 57.4908Z" fill="#D9E3F3"/>
<path d="M101.611 68.9274L102.149 69.2348C102.173 69.2484 102.194 69.2667 102.211 69.2885C102.228 69.3102 102.24 69.3352 102.248 69.3618C102.255 69.3884 102.257 69.4162 102.253 69.4436C102.25 69.471 102.241 69.4974 102.227 69.5213C102.225 69.5243 102.223 69.5271 102.22 69.5297L102.841 69.9295L102.859 69.9421C103 68.5915 103.057 67.2333 103.027 65.8757L101.671 68.4419C101.591 68.5905 101.57 68.7638 101.611 68.9274Z" fill="#D9E3F3"/>
<path d="M98.4522 106.251C98.7664 106.323 99.0881 106.083 99.1712 105.72C99.2133 105.547 99.1897 105.363 99.1049 105.206C99.0691 105.138 99.0192 105.078 98.9583 105.031C98.8974 104.983 98.8271 104.949 98.7521 104.931C98.7152 104.922 98.6774 104.918 98.6395 104.918C98.5228 104.919 98.4094 104.957 98.3153 105.026C98.173 105.134 98.0734 105.288 98.0339 105.462C97.9944 105.636 98.0176 105.818 98.0994 105.976C98.1352 106.045 98.1853 106.104 98.2461 106.152C98.307 106.199 98.3772 106.233 98.4522 106.251Z" fill="#D9E3F3"/>
<path d="M106.555 58.1166C104.336 57.0246 102.137 56.6819 99.9465 56.4761C102.137 56.6819 104.336 57.0212 106.555 58.1166Z" fill="#D9E3F3"/>
<path d="M81.9158 56.1864C81.9158 56.0945 81.9208 56.0468 81.9208 56.0468H81.8773C81.8773 56.0903 81.8773 56.1362 81.8773 56.1822L81.9158 56.1864Z" fill="#D9E3F3"/>
<path d="M123.132 88.7413C122.175 84.0004 120.42 78.7882 118.223 73.5751C114.384 64.4712 110.663 60.325 107 58.3468L103.783 64.4368C103.796 64.5804 103.808 64.7232 103.818 64.8694C104.079 68.6393 103.454 73.4777 101.965 79.2535C102.782 79.5294 103.464 80.1023 103.878 80.8584C104.291 81.6146 104.405 82.4985 104.196 83.3346C103.988 84.1707 103.472 84.8978 102.752 85.3713C102.032 85.8448 101.16 86.0301 100.31 85.8903C99.4597 85.7505 98.6931 85.2959 98.1626 84.6169C97.6321 83.9379 97.3765 83.0841 97.4466 82.2252C97.5167 81.3663 97.9073 80.5653 98.541 79.9813C99.1746 79.3972 100.005 79.073 100.866 79.0729C100.959 79.0729 101.05 79.078 101.141 79.0847C101.897 76.1598 102.394 73.6163 102.688 71.4029C101.023 73.5306 96.2817 78.3816 90.3723 82.1162C90.388 82.1457 90.3964 82.1786 90.3967 82.212C90.3967 82.2439 90.4059 85.5434 90.1749 92.7473C90.1731 92.8018 90.1503 92.8535 90.1111 92.8914C90.0719 92.9294 90.0194 92.9506 89.9649 92.9506H89.9582C89.9025 92.9486 89.8499 92.9247 89.8119 92.8841C89.7738 92.8435 89.7533 92.7895 89.7549 92.7338C89.9859 85.5392 89.9767 82.2456 89.9767 82.2137C89.977 82.1628 89.9955 82.1136 90.0287 82.0751C83.6556 78.033 78.6534 72.704 77.4287 70.9274C77.3746 70.8494 77.3368 70.7612 77.3175 70.6683C77.2982 70.5753 77.2979 70.4793 77.3165 70.3862C77.335 70.2931 77.3722 70.2047 77.4257 70.1262C77.4792 70.0477 77.5479 69.9808 77.6278 69.9295L78.3947 69.4356L78.3888 69.4289C78.3749 69.405 78.3659 69.3787 78.3621 69.3514C78.3584 69.3241 78.3601 69.2963 78.3671 69.2696C78.3741 69.2429 78.3863 69.2179 78.403 69.1959C78.4197 69.1739 78.4406 69.1555 78.4644 69.1416L78.8618 68.9081C78.8986 68.7506 78.8775 68.585 78.8021 68.4419L77.0549 65.1356C76.241 69.0089 76.3166 73.1156 76.4174 75.0552C77.0073 75.007 77.5928 75.1905 78.0497 75.5669C78.5065 75.9433 78.7987 76.4829 78.8643 77.0712L79.2003 80.1086C79.2329 80.4059 79.2067 80.7068 79.123 80.9939C79.0394 81.2811 78.9 81.549 78.7127 81.7822C78.5255 82.0155 78.2942 82.2095 78.0319 82.3533C77.7696 82.4971 77.4816 82.5878 77.1843 82.6202L76.9079 82.6505C76.5537 82.6894 76.1986 82.586 75.9205 82.3631C75.6425 82.1402 75.4644 81.8161 75.4253 81.4619L74.8869 76.5714C74.8578 76.3056 74.9087 76.0372 75.0331 75.8004C75.1574 75.5637 75.3496 75.3695 75.5849 75.2425C75.5009 73.7473 75.4169 70.8166 75.7823 67.6993C75.9252 66.4495 76.1497 65.2104 76.4543 63.9899L73.3698 58.1527C71.3723 59.1557 69.2194 60.6895 67.1538 63.0247C65.5486 64.8358 63.9946 67.129 62.6027 70.0303C62.3787 70.5041 62.1561 70.9941 61.9349 71.5003C61.1993 73.2238 60.5663 74.9892 60.039 76.7873C59.8307 77.4904 59.6299 78.2153 59.4393 78.9713C59.4141 79.0696 59.3897 79.167 59.3645 79.2644C53.1485 103.772 55.0435 105.171 59.2284 107.124C61.2847 108.083 65.898 108.598 70.0737 108.874C69.9678 114.082 69.9561 119.675 69.9653 123.49H73.8747C73.9304 123.49 73.9838 123.513 74.0232 123.552C74.0625 123.591 74.0847 123.645 74.0847 123.7H80.2553C80.2552 123.673 80.2606 123.645 80.2711 123.62C80.2816 123.594 80.2971 123.571 80.3166 123.552C80.3361 123.532 80.3593 123.517 80.3848 123.506C80.4104 123.496 80.4377 123.49 80.4653 123.49H111.748C111.476 119.327 111.046 112.822 110.733 108.415C108.638 108.326 106.557 108.022 104.524 107.505C104.497 107.499 104.472 107.487 104.45 107.47C104.427 107.454 104.409 107.433 104.394 107.41C104.38 107.386 104.37 107.36 104.366 107.333C104.362 107.305 104.363 107.278 104.37 107.251C104.377 107.224 104.389 107.199 104.405 107.176C104.421 107.154 104.442 107.135 104.465 107.121C104.489 107.107 104.515 107.097 104.543 107.093C104.57 107.089 104.598 107.09 104.625 107.097C111.423 108.777 115.433 107.601 115.472 107.591C115.499 107.583 115.526 107.58 115.554 107.583C115.581 107.585 115.608 107.593 115.632 107.606C115.657 107.619 115.678 107.637 115.696 107.658C115.713 107.679 115.726 107.704 115.734 107.73C115.743 107.759 115.746 107.79 115.742 107.82C115.738 107.85 115.727 107.879 115.71 107.904C119.966 107.057 122.358 104.447 123.363 100.709C124.236 97.4362 124.053 93.3076 123.132 88.7413ZM115.248 98.8566C113.777 102.637 105.654 107.727 100.938 107.541C100.938 107.541 101.134 106.67 101.335 105.39C101.126 106.553 100.94 107.49 100.923 107.582C100.915 107.622 100.896 107.66 100.867 107.69C100.839 107.72 100.802 107.741 100.761 107.75C94.3245 109.157 86.6738 109.499 80.7476 109.499C75.1733 109.499 71.1245 109.196 71.0422 109.189C71.0146 109.187 70.9877 109.18 70.963 109.167C70.9384 109.155 70.9164 109.138 70.8984 109.117C70.862 109.074 70.8439 109.019 70.8481 108.963C70.8524 108.908 70.8786 108.856 70.9209 108.82C70.9633 108.783 71.0184 108.765 71.0741 108.769C71.2421 108.782 88.1194 110.045 100.537 107.367C100.693 106.565 101.491 102.432 101.522 101.095C101.614 97.0304 100.514 96.0947 100.346 95.9771C98.7631 95.6965 97.1637 95.4286 95.5627 95.1732C96.1759 96.0972 97.598 99.1775 95.9827 106.538C95.973 106.585 95.9474 106.627 95.91 106.658C95.8727 106.689 95.826 106.705 95.7777 106.706C95.7626 106.707 95.7474 106.707 95.7323 106.706C95.7053 106.7 95.6796 106.688 95.6569 106.672C95.6342 106.657 95.6149 106.636 95.6 106.613C95.5852 106.589 95.5751 106.563 95.5705 106.536C95.5658 106.509 95.5666 106.481 95.5727 106.454C96.569 101.918 96.364 99.0842 96.0163 97.5076C95.6425 95.8082 95.0276 95.1673 95.0217 95.1614C95.0008 95.1399 94.9848 95.1141 94.9747 95.0858C79.7068 92.6792 64.5784 91.431 64.4095 91.4176C64.382 91.4153 64.3551 91.4076 64.3305 91.395C64.3059 91.3824 64.284 91.365 64.2661 91.3439C64.2299 91.3013 64.2122 91.246 64.2168 91.1903C64.2213 91.1347 64.2478 91.083 64.2904 91.0469C64.3331 91.0107 64.3883 90.993 64.444 90.9976C64.4742 90.9976 64.9917 91.0421 65.9081 91.1244C63.9937 87.4956 64.6876 85.6711 65.3142 85.2536C65.3684 85.2183 65.4261 85.1887 65.4864 85.1654V85.1579C65.4777 85.1319 65.4743 85.1045 65.4762 85.0772C65.4781 85.0498 65.4854 85.0232 65.4977 84.9987C65.5099 84.9742 65.5269 84.9523 65.5476 84.9344C65.5683 84.9164 65.5923 84.9028 65.6183 84.8941C65.6578 84.8807 66.1895 84.7169 67.158 84.9857C66.5507 83.2091 66.9547 82.1028 67.3739 81.5047C67.4251 81.4312 67.4935 81.3714 67.5732 81.3304C67.6528 81.2894 67.7412 81.2684 67.8308 81.2693C67.9203 81.2702 68.0083 81.293 68.0871 81.3356C68.1659 81.3782 68.2331 81.4395 68.2828 81.514C68.5995 81.986 69.169 82.758 70.14 83.8609C70.2736 80.8764 70.2198 76.7965 70.2198 76.7478C70.2194 76.7203 70.2244 76.6929 70.2345 76.6673C70.2447 76.6417 70.2598 76.6184 70.279 76.5986C70.2982 76.5789 70.3211 76.5631 70.3464 76.5522C70.3717 76.5414 70.3989 76.5356 70.4265 76.5353C70.4815 76.5355 70.5343 76.5572 70.5735 76.5958C70.6128 76.6344 70.6354 76.6869 70.6365 76.7419C70.6365 76.7932 70.6953 81.283 70.5357 84.307C71.2539 85.1008 72.1602 86.0424 73.2976 87.1445C76.5921 90.3365 77.38 91.7813 77.5656 92.3222C84.2277 93.085 92.5647 94.1702 100.46 95.5756C100.479 95.5788 100.498 95.585 100.516 95.5941C100.577 95.6272 100.633 95.6679 100.684 95.715C101.188 95.0296 104.236 91.0631 108.278 89.2966C108.11 82.0415 108.588 76.3009 108.594 76.2253C108.597 76.1977 108.605 76.1709 108.617 76.1463C108.63 76.1218 108.648 76.0999 108.669 76.0821C108.69 76.0643 108.714 76.0508 108.741 76.0424C108.767 76.0341 108.795 76.031 108.823 76.0334C108.85 76.0357 108.877 76.0435 108.901 76.0563C108.926 76.069 108.948 76.0865 108.966 76.1077C108.984 76.1288 108.997 76.1533 109.005 76.1797C109.014 76.2061 109.017 76.2339 109.014 76.2614C109.008 76.3354 108.54 81.9734 108.696 89.1252C110.857 88.2785 113.279 88.0903 115.737 89.3621C115.85 89.4201 115.949 89.5018 116.027 89.6015C116.106 89.7012 116.162 89.8167 116.191 89.94C116.293 90.3692 116.306 91.1303 115.738 92.2458C114.791 94.0946 116.716 95.0749 115.248 98.8566ZM97.6249 105.369C97.6849 105.093 97.845 104.849 98.0743 104.684C98.1838 104.603 98.3096 104.546 98.4429 104.518C98.5763 104.49 98.7142 104.491 98.8471 104.521C98.98 104.552 99.1048 104.61 99.213 104.693C99.3211 104.776 99.4101 104.882 99.4737 105.002C99.6088 105.25 99.6477 105.539 99.5829 105.813C99.4653 106.329 99.0327 106.684 98.5648 106.684C98.3936 106.683 98.2256 106.636 98.0792 106.548C97.9328 106.459 97.8134 106.332 97.7341 106.18C97.5986 105.932 97.5591 105.644 97.6232 105.369H97.6249Z" fill="#D9E3F3"/>
<path d="M109.013 76.2547C109.015 76.2271 109.012 76.1994 109.004 76.173C108.995 76.1466 108.982 76.1221 108.964 76.1009C108.946 76.0798 108.924 76.0623 108.9 76.0496C108.875 76.0368 108.848 76.029 108.821 76.0267C108.793 76.0243 108.765 76.0274 108.739 76.0357C108.713 76.0441 108.688 76.0576 108.667 76.0754C108.646 76.0932 108.628 76.115 108.616 76.1396C108.603 76.1642 108.595 76.191 108.593 76.2186C108.586 76.2942 108.11 82.0348 108.276 89.29C108.414 89.23 108.554 89.174 108.696 89.122C108.538 81.9651 109.006 76.332 109.013 76.2547Z" fill="#90C9ED"/>
<path d="M116.19 89.9333C116.16 89.81 116.104 89.6945 116.025 89.5948C115.947 89.495 115.848 89.4134 115.735 89.3554C113.277 88.0836 110.855 88.2718 108.694 89.1185C108.554 89.1745 108.414 89.2305 108.274 89.2865C104.232 91.0505 101.186 95.0195 100.681 95.7049C101.076 96.0544 102.025 97.2908 101.941 101.099C101.921 101.956 101.605 103.862 101.334 105.383C101.133 106.664 100.937 107.534 100.937 107.534C105.653 107.72 113.776 102.632 115.247 98.8499C116.718 95.0682 114.792 94.0879 115.737 92.2324C116.304 91.1236 116.291 90.36 116.19 89.9333ZM110.764 96.2534C110.733 96.2536 110.702 96.2468 110.674 96.2334C110.646 96.22 110.621 96.2005 110.601 96.1761C110.566 96.1329 110.55 96.0775 110.555 96.0221C110.561 95.9667 110.588 95.9158 110.631 95.8805C112.395 94.4525 115.057 93.5806 115.167 93.5444C115.194 93.5358 115.221 93.5324 115.249 93.5345C115.277 93.5366 115.304 93.5441 115.328 93.5567C115.353 93.5692 115.375 93.5866 115.393 93.6077C115.411 93.6288 115.425 93.6532 115.433 93.6796C115.442 93.706 115.445 93.7338 115.442 93.7614C115.44 93.789 115.432 93.8159 115.42 93.8405C115.407 93.8651 115.389 93.8869 115.368 93.9048C115.347 93.9226 115.322 93.936 115.296 93.9443C115.269 93.9527 112.593 94.8246 110.894 96.2064C110.858 96.2365 110.812 96.2531 110.764 96.2534ZM115.603 96.1157C115.623 96.1352 115.638 96.1583 115.649 96.1839C115.66 96.2094 115.665 96.2367 115.665 96.2644C115.665 96.292 115.66 96.3193 115.649 96.3448C115.638 96.3703 115.623 96.3935 115.603 96.413C114.566 97.4173 113.382 98.2577 112.091 98.9053C112.062 98.9191 112.031 98.9263 111.999 98.9263C111.952 98.9261 111.906 98.91 111.869 98.8805C111.832 98.851 111.806 98.8099 111.795 98.7638C111.784 98.7177 111.79 98.6694 111.81 98.6266C111.83 98.5838 111.864 98.5491 111.906 98.5281C113.859 97.5739 115.29 96.1325 115.304 96.1182C115.324 96.0981 115.347 96.0821 115.372 96.0711C115.398 96.0601 115.425 96.0543 115.453 96.054C115.481 96.0538 115.509 96.0591 115.534 96.0697C115.56 96.0803 115.584 96.0959 115.603 96.1157ZM115.644 91.6569C115.6 91.6485 112.244 91.0354 109.607 93.3588C109.587 93.377 109.563 93.3911 109.537 93.4C109.51 93.409 109.483 93.4127 109.455 93.411C109.428 93.4092 109.401 93.4021 109.376 93.39C109.351 93.3779 109.329 93.361 109.311 93.3403C109.293 93.3196 109.279 93.2956 109.27 93.2695C109.261 93.2434 109.257 93.2158 109.259 93.1882C109.26 93.1607 109.268 93.1338 109.28 93.109C109.292 93.0842 109.309 93.062 109.329 93.0438C112.13 90.5759 115.579 91.2168 115.724 91.2445C115.779 91.2557 115.827 91.2881 115.858 91.3346C115.889 91.3812 115.9 91.438 115.888 91.4927C115.877 91.5474 115.845 91.5955 115.798 91.6262C115.752 91.657 115.695 91.6681 115.64 91.6569H115.644Z" fill="#FBC3A8"/>
<path d="M115.89 91.4915C115.895 91.4642 115.895 91.4362 115.889 91.409C115.884 91.3818 115.873 91.3559 115.857 91.3329C115.841 91.31 115.821 91.2903 115.798 91.2752C115.775 91.26 115.749 91.2496 115.722 91.2445C115.576 91.2168 112.127 90.5725 109.327 93.0438C109.306 93.0621 109.289 93.0842 109.277 93.109C109.265 93.1338 109.258 93.1607 109.256 93.1883C109.254 93.2158 109.258 93.2434 109.267 93.2695C109.276 93.2956 109.29 93.3197 109.308 93.3404C109.327 93.361 109.349 93.3779 109.373 93.39C109.398 93.4022 109.425 93.4093 109.453 93.411C109.48 93.4127 109.508 93.409 109.534 93.4C109.56 93.3911 109.584 93.3771 109.605 93.3588C112.242 91.0354 115.597 91.6486 115.641 91.657C115.668 91.6626 115.696 91.6628 115.723 91.6575C115.751 91.6522 115.777 91.6415 115.8 91.6261C115.823 91.6108 115.843 91.5909 115.858 91.5678C115.874 91.5447 115.884 91.5188 115.89 91.4915Z" fill="#EB7360"/>
<path d="M115.434 93.6797C115.417 93.6268 115.38 93.5829 115.33 93.5575C115.28 93.5322 115.223 93.5275 115.17 93.5444C115.057 93.5806 112.393 94.4483 110.634 95.8804C110.591 95.9157 110.563 95.9666 110.558 96.022C110.552 96.0774 110.569 96.1328 110.604 96.1761C110.639 96.2192 110.69 96.2465 110.745 96.2522C110.801 96.2579 110.856 96.2414 110.899 96.2063C112.598 94.8246 115.274 93.9527 115.301 93.9443C115.354 93.9268 115.397 93.8891 115.422 93.8396C115.447 93.79 115.452 93.7325 115.434 93.6797Z" fill="#EB7360"/>
<path d="M115.307 96.1182C115.293 96.1325 113.862 97.5738 111.909 98.528C111.867 98.549 111.833 98.5837 111.812 98.6265C111.792 98.6692 111.787 98.7176 111.798 98.7637C111.808 98.8097 111.834 98.8508 111.871 98.8803C111.908 98.9098 111.954 98.926 112.001 98.9262C112.033 98.9261 112.065 98.919 112.094 98.9052C113.384 98.2576 114.569 97.4173 115.606 96.413C115.626 96.3935 115.642 96.3702 115.652 96.3445C115.663 96.3188 115.669 96.2913 115.669 96.2634C115.669 96.2356 115.663 96.208 115.652 96.1823C115.642 96.1566 115.626 96.1333 115.606 96.1137C115.586 96.0941 115.563 96.0787 115.537 96.0684C115.511 96.058 115.483 96.0528 115.456 96.0533C115.428 96.0537 115.4 96.0596 115.375 96.0708C115.349 96.0819 115.326 96.0981 115.307 96.1182Z" fill="#EB7360"/>
<path d="M70.6365 76.7352C70.6354 76.6802 70.6128 76.6277 70.5736 76.5891C70.5343 76.5505 70.4815 76.5288 70.4265 76.5285C70.3989 76.5289 70.3717 76.5346 70.3464 76.5455C70.3211 76.5564 70.2982 76.5721 70.279 76.5919C70.2598 76.6116 70.2447 76.635 70.2345 76.6606C70.2244 76.6862 70.2194 76.7135 70.2198 76.7411C70.2198 76.7898 70.2736 80.8697 70.14 83.8542C70.266 83.9978 70.3987 84.1457 70.539 84.3002C70.6953 81.2762 70.6365 76.7864 70.6365 76.7352Z" fill="#90C9ED"/>
<path d="M73.2976 87.1377C72.1603 86.0357 71.2539 85.094 70.5357 84.3002C70.3954 84.1457 70.2627 83.9978 70.1367 83.8542C69.1657 82.7513 68.5961 81.9793 68.2795 81.5072C68.2297 81.4327 68.1626 81.3715 68.0838 81.3289C68.005 81.2862 67.917 81.2635 67.8275 81.2626C67.7379 81.2617 67.6495 81.2826 67.5698 81.3237C67.4902 81.3647 67.4218 81.4245 67.3706 81.498C66.9506 82.0961 66.5474 83.2023 67.1547 84.9789C67.9821 85.2074 69.1287 85.7526 70.5626 86.9781C70.5952 87.006 70.6185 87.0432 70.6293 87.0847C70.6401 87.1262 70.638 87.17 70.6232 87.2103C70.6083 87.2505 70.5816 87.2853 70.5464 87.3099C70.5112 87.3344 70.4694 87.3476 70.4265 87.3477C70.3762 87.3481 70.3276 87.3302 70.2896 87.2973C67.384 84.8135 65.762 85.2813 65.746 85.2864C65.6946 85.3024 65.6391 85.2981 65.5908 85.2744C65.5424 85.2506 65.5051 85.2092 65.4865 85.1587C65.4261 85.182 65.3684 85.2116 65.3143 85.2469C64.6876 85.6669 63.9938 87.4889 65.9081 91.1176C68.0224 91.3075 72.2636 91.7056 77.5657 92.3155C77.38 91.7745 76.5921 90.3297 73.2976 87.1377ZM69.6075 89.089C69.5919 89.1118 69.572 89.1314 69.5488 89.1465C69.5257 89.1615 69.4998 89.1719 69.4727 89.177C69.4455 89.1821 69.4176 89.1817 69.3906 89.176C69.3636 89.1703 69.3379 89.1593 69.3152 89.1436C67.1026 87.6317 65.5881 88.601 65.5243 88.6396C65.5014 88.655 65.4757 88.6658 65.4486 88.6712C65.4216 88.6767 65.3938 88.6768 65.3667 88.6715C65.3396 88.6661 65.3139 88.6556 65.2909 88.6403C65.2679 88.625 65.2482 88.6054 65.2328 88.5825C65.2174 88.5596 65.2067 88.5339 65.2012 88.5069C65.1957 88.4799 65.1957 88.452 65.201 88.425C65.2063 88.3979 65.2169 88.3721 65.2321 88.3492C65.2474 88.3262 65.267 88.3064 65.2899 88.291C65.3621 88.2423 67.0934 87.11 69.5529 88.795C69.576 88.8106 69.5958 88.8305 69.6111 88.8538C69.6264 88.8771 69.637 88.9032 69.642 88.9306C69.6471 88.9579 69.6467 88.9861 69.6408 89.0133C69.6348 89.0405 69.6235 89.0663 69.6075 89.089Z" fill="#FBC3A8"/>
<path d="M65.746 85.2864C65.762 85.2813 67.384 84.8135 70.2895 87.2973C70.3275 87.3302 70.3762 87.3481 70.4264 87.3477C70.4693 87.3476 70.5112 87.3344 70.5463 87.3098C70.5815 87.2853 70.6083 87.2505 70.6231 87.2103C70.6379 87.17 70.6401 87.1262 70.6292 87.0847C70.6184 87.0432 70.5951 87.006 70.5625 86.9781C69.1287 85.7526 67.9821 85.2074 67.1547 84.9789C66.1862 84.7102 65.6545 84.874 65.615 84.8874C65.589 84.896 65.565 84.9097 65.5443 84.9277C65.5236 84.9456 65.5066 84.9674 65.4943 84.9919C65.4821 85.0164 65.4748 85.0431 65.4729 85.0704C65.4709 85.0977 65.4744 85.1252 65.4831 85.1511V85.1587C65.5018 85.21 65.5396 85.252 65.5887 85.2758C65.6378 85.2996 65.6942 85.3034 65.746 85.2864Z" fill="#EB7360"/>
<path d="M69.552 88.7976C67.0925 87.1134 65.3613 88.2457 65.289 88.2936C65.2428 88.3247 65.2108 88.3728 65.2001 88.4275C65.1894 88.4821 65.2008 88.5388 65.2319 88.5851C65.263 88.6313 65.3111 88.6633 65.3658 88.674C65.4205 88.6847 65.4771 88.6733 65.5234 88.6422C65.5872 88.6002 67.1017 87.6283 69.3143 89.1462C69.337 89.1626 69.3627 89.1744 69.39 89.1807C69.4174 89.1871 69.4457 89.1879 69.4733 89.1831C69.5009 89.1784 69.5273 89.1681 69.5509 89.153C69.5745 89.1379 69.5949 89.1182 69.6107 89.0951C69.6266 89.072 69.6377 89.0459 69.6433 89.0185C69.649 88.991 69.6491 88.9627 69.6436 88.9352C69.6381 88.9077 69.6272 88.8816 69.6115 88.8584C69.5957 88.8352 69.5755 88.8154 69.552 88.8001V88.7976Z" fill="#EB7360"/>
<path d="M100.684 95.7083C100.633 95.6612 100.577 95.6205 100.516 95.5874C100.498 95.5783 100.479 95.5721 100.46 95.5689C92.5638 94.1661 84.2277 93.0783 77.5657 92.3155C72.2636 91.709 68.0224 91.3075 65.9082 91.1177C64.9917 91.0337 64.4743 90.9934 64.4441 90.9908C64.4165 90.9886 64.3887 90.9918 64.3624 91.0002C64.336 91.0087 64.3116 91.0223 64.2905 91.0402C64.2694 91.0581 64.252 91.0799 64.2394 91.1046C64.2268 91.1292 64.2191 91.156 64.2168 91.1836C64.2146 91.2112 64.2178 91.2389 64.2262 91.2653C64.2347 91.2916 64.2483 91.3161 64.2662 91.3372C64.2841 91.3583 64.3059 91.3756 64.3306 91.3883C64.3552 91.4009 64.382 91.4086 64.4096 91.4108C64.5776 91.4243 79.7068 92.6709 94.9746 95.0792C94.9848 95.1074 95.0008 95.1332 95.0217 95.1547C95.0275 95.1606 95.6424 95.8016 96.0162 97.5009C96.364 99.0776 96.5689 101.91 95.5727 106.447C95.5665 106.474 95.5657 106.502 95.5704 106.529C95.5751 106.557 95.5851 106.583 95.6 106.606C95.6148 106.63 95.6342 106.65 95.6569 106.666C95.6796 106.682 95.7052 106.693 95.7323 106.699C95.7474 106.701 95.7626 106.701 95.7777 106.699C95.8259 106.699 95.8727 106.682 95.91 106.651C95.9473 106.621 95.973 106.578 95.9826 106.531C97.5988 99.1708 96.1767 96.0872 95.5626 95.1665C97.1637 95.4185 98.763 95.6898 100.346 95.9704C100.514 96.088 101.611 97.0238 101.522 101.089C101.491 102.425 100.693 106.559 100.537 107.36C88.1194 110.038 71.2438 108.775 71.0742 108.763C71.0466 108.761 71.0189 108.764 70.9926 108.773C70.9663 108.781 70.942 108.795 70.921 108.813C70.8786 108.849 70.8524 108.901 70.8482 108.957C70.844 109.013 70.862 109.068 70.8984 109.11C70.9348 109.152 70.9865 109.179 71.0422 109.183C71.1262 109.19 75.1733 109.493 80.7476 109.493C86.6738 109.493 94.3245 109.15 100.761 107.743C100.802 107.734 100.839 107.713 100.867 107.683C100.896 107.654 100.915 107.616 100.923 107.575C100.939 107.491 101.126 106.546 101.335 105.384C101.61 103.859 101.923 101.953 101.942 101.099C102.026 97.2942 101.08 96.0578 100.684 95.7083Z" fill="#90C9ED"/>
<path d="M98.3589 106.661C98.4259 106.676 98.4943 106.684 98.563 106.684C99.0308 106.684 99.4634 106.329 99.581 105.813C99.6458 105.539 99.6069 105.25 99.4718 105.002C99.4081 104.881 99.3192 104.776 99.2111 104.693C99.1029 104.61 98.9781 104.552 98.8453 104.521C98.7124 104.491 98.5745 104.49 98.4411 104.518C98.3077 104.546 98.182 104.603 98.0725 104.684C97.8466 104.852 97.6885 105.095 97.6268 105.37C97.5652 105.644 97.6041 105.932 97.7365 106.181C97.8001 106.3 97.8885 106.405 97.9959 106.488C98.1032 106.571 98.2269 106.63 98.3589 106.661ZM98.033 105.461C98.0703 105.287 98.1708 105.132 98.3152 105.026C98.4093 104.957 98.5227 104.919 98.6394 104.918C98.6773 104.918 98.7151 104.922 98.752 104.931C98.827 104.949 98.8973 104.983 98.9582 105.031C99.019 105.078 99.069 105.138 99.1047 105.206C99.1895 105.363 99.2132 105.547 99.1711 105.72C99.0871 106.085 98.7663 106.323 98.4521 106.251C98.3772 106.233 98.3069 106.199 98.2461 106.152C98.1852 106.104 98.1352 106.045 98.0993 105.976C98.0146 105.819 97.991 105.635 98.033 105.461Z" fill="#90C9ED"/>
<path d="M102.841 69.9295L102.22 69.5297C102.202 69.5594 102.176 69.584 102.145 69.601C102.115 69.6181 102.08 69.6271 102.045 69.6271C102.008 69.627 101.972 69.6174 101.941 69.5994L99.7567 68.3478C99.7097 68.3195 99.6757 68.2739 99.6619 68.2208C99.6481 68.1678 99.6556 68.1114 99.6828 68.0638C99.71 68.0162 99.7548 67.9811 99.8075 67.966C99.8602 67.951 99.9168 67.9572 99.965 67.9832L101.616 68.9274C101.573 68.7643 101.592 68.591 101.671 68.4419L103.027 65.8757C102.916 61.9714 101.935 59.7067 100.857 58.3997C99.7794 57.0926 98.5395 56.6357 97.7432 56.4845C98.3589 69.1466 90.9518 81.0301 90.2453 82.1322V82.1414L90.1933 82.2162L90.1353 82.1423C83.3657 73.308 82.1208 62.2922 81.9142 57.4908C81.9083 57.3446 81.9033 57.2044 81.8982 57.0708C79.1884 58.4702 77.7721 61.711 77.0522 65.1348L78.7995 68.441C78.8748 68.5842 78.896 68.7497 78.8591 68.9072L80.7432 67.8026C80.767 67.7869 80.7938 67.7762 80.8219 67.7712C80.85 67.7662 80.8788 67.7669 80.9066 67.7734C80.9344 67.7799 80.9606 67.792 80.9835 67.8089C81.0065 67.8258 81.0258 67.8473 81.0402 67.8719C81.0546 67.8965 81.0638 67.9239 81.0673 67.9522C81.0708 67.9805 81.0685 68.0092 81.0605 68.0366C81.0525 68.064 81.039 68.0895 81.0209 68.1115C81.0027 68.1335 80.9803 68.1516 80.9549 68.1647L78.6743 69.5028C78.6418 69.5215 78.6051 69.5313 78.5676 69.5314C78.5326 69.5314 78.4981 69.5225 78.4674 69.5057C78.4367 69.4888 78.4108 69.4644 78.3921 69.4348L77.6251 69.9287C77.5452 69.98 77.4765 70.0469 77.423 70.1254C77.3695 70.2038 77.3324 70.2923 77.3138 70.3854C77.2952 70.4785 77.2956 70.5744 77.3149 70.6674C77.3341 70.7604 77.372 70.8485 77.426 70.9266C78.6533 72.7032 83.6555 78.0322 90.0261 82.0742C89.9928 82.1128 89.9743 82.1619 89.974 82.2128C89.974 82.2448 89.9833 85.5384 89.7523 92.733C89.7507 92.7886 89.7712 92.8426 89.8092 92.8832C89.8473 92.9238 89.8999 92.9477 89.9555 92.9497H89.9623C90.0168 92.9497 90.0692 92.9285 90.1084 92.8906C90.1476 92.8526 90.1705 92.801 90.1723 92.7464C90.4033 85.5426 90.394 82.2464 90.394 82.2112C90.3937 82.1777 90.3854 82.1449 90.3697 82.1154C96.2791 78.3808 101.02 73.5298 102.685 71.402C102.752 70.898 102.808 70.4111 102.853 69.9413L102.841 69.9295Z" fill="#90C9ED"/>
<path d="M101.484 57.8411C102.758 59.3766 103.53 61.595 103.783 64.4368L107 58.3468C106.852 58.2678 106.705 58.1914 106.557 58.1183C104.338 57.0263 102.14 56.6836 99.9491 56.4778C100.529 56.8489 101.047 57.309 101.484 57.8411Z" fill="#90C9ED"/>
<path d="M77.464 60.9978C78.4939 58.6853 79.921 57.0792 81.7069 56.2258C81.7593 56.2004 81.8166 56.1867 81.8749 56.1854C81.8749 56.1392 81.8749 56.093 81.8749 56.0494H81.8707L81.4347 56.0838L81.3608 56.0897L81.1995 56.104L81.0945 56.1132L80.9441 56.1275L80.8333 56.1384L80.6913 56.1527L80.5745 56.1653L80.4401 56.1804L80.3217 56.1938L80.194 56.2081L80.063 56.2249L79.953 56.2384L79.7262 56.2686L79.6354 56.2812L79.4943 56.3022L79.3977 56.3165L79.2675 56.3366L79.1734 56.3526L79.0466 56.3736L78.9567 56.3896L78.8299 56.4122L78.7459 56.4282L78.6115 56.4551L78.5443 56.4685C78.4779 56.482 78.4124 56.4954 78.3494 56.5097C78.3317 56.5139 78.3133 56.5164 78.2948 56.5189L78.0369 56.5651H78.0218C77.9378 56.5802 77.8538 56.597 77.7698 56.6147H77.753C77.669 56.6323 77.5774 56.6516 77.4884 56.671H77.4808C77.4036 56.6886 77.3246 56.7062 77.2456 56.7256L77.1028 56.76L77.0071 56.7835L76.8391 56.8272L76.7652 56.8465L76.5812 56.8978L76.5199 56.9146L76.3242 56.9717L76.2712 56.9868L76.0646 57.0506L76.0201 57.0641L75.8017 57.1355L75.7681 57.1464L75.5354 57.2254L75.5144 57.2329L75.2683 57.3169H75.259C75.1818 57.3455 75.1045 57.374 75.0264 57.4009L74.8794 57.458L74.7903 57.4933L74.6299 57.5588L74.5518 57.5899L74.3838 57.6605L74.3107 57.6924L74.1427 57.7672L74.0713 57.7991L73.9033 57.878L73.8302 57.9116L73.6572 57.9956L73.5841 58.0309L73.4094 58.1149L73.3699 58.1342L76.4543 63.9714C76.707 62.9536 77.0447 61.9589 77.464 60.9978Z" fill="#90C9ED"/>
<path d="M78.5677 69.532C78.6051 69.532 78.6419 69.5222 78.6744 69.5035L80.955 68.1656C80.9804 68.1525 81.0028 68.1344 81.021 68.1124C81.0391 68.0904 81.0526 68.0649 81.0606 68.0375C81.0686 68.0101 81.0709 67.9814 81.0674 67.9531C81.0639 67.9248 81.0547 67.8975 81.0402 67.8728C81.0258 67.8482 81.0066 67.8268 80.9836 67.8098C80.9606 67.7929 80.9345 67.7808 80.9067 67.7743C80.8789 67.7679 80.8501 67.7671 80.822 67.7721C80.7939 67.7772 80.7671 67.7879 80.7433 67.8036L78.8592 68.908L78.4618 69.1415C78.438 69.1554 78.4171 69.1738 78.4004 69.1958C78.3838 69.2177 78.3715 69.2428 78.3645 69.2695C78.3575 69.2961 78.3558 69.3239 78.3595 69.3512C78.3633 69.3786 78.3723 69.4049 78.3862 69.4287L78.3921 69.4354C78.4108 69.4651 78.4368 69.4894 78.4675 69.5063C78.4982 69.5232 78.5326 69.5321 78.5677 69.532Z" fill="#75B2E1"/>
<path d="M102.149 69.235L101.612 68.9275L99.96 67.9832C99.9118 67.9572 99.8552 67.951 99.8025 67.9661C99.7498 67.9811 99.705 68.0162 99.6778 68.0638C99.6506 68.1114 99.6431 68.1678 99.6569 68.2209C99.6707 68.2739 99.7047 68.3195 99.7517 68.3478L101.936 69.5996C101.968 69.6176 102.003 69.6272 102.04 69.6273C102.075 69.6272 102.11 69.6183 102.14 69.6012C102.171 69.5842 102.197 69.5596 102.216 69.5298C102.218 69.5272 102.22 69.5244 102.222 69.5214C102.251 69.4737 102.259 69.4168 102.245 69.3631C102.231 69.3094 102.197 69.2633 102.149 69.235Z" fill="#75B2E1"/>
<path d="M76.0739 75.0913C75.9019 75.11 75.7352 75.1622 75.5833 75.245C75.348 75.372 75.1558 75.5662 75.0315 75.8029C74.9071 76.0397 74.8562 76.3081 74.8853 76.5739L75.4237 81.4643C75.4628 81.8185 75.6409 82.1427 75.9189 82.3656C76.1969 82.5884 76.5521 82.6918 76.9063 82.6529L77.1827 82.6227C77.48 82.5902 77.768 82.4995 78.0303 82.3558C78.2925 82.212 78.5239 82.0179 78.7111 81.7846C78.8983 81.5514 79.0378 81.2835 79.1214 80.9964C79.2051 80.7092 79.2313 80.4084 79.1986 80.1111L78.8626 77.0737C78.7971 76.4854 78.5049 75.9458 78.0481 75.5695C77.5912 75.1931 77.0057 75.0095 76.4157 75.0577L76.3511 75.0636L76.0739 75.0913Z" fill="white"/>
<path d="M96.9091 56.4089C97.1876 56.401 97.4661 56.4252 97.739 56.4811C98.5353 56.6332 99.7717 57.0834 100.853 58.3963C101.934 59.7092 102.912 61.9714 103.022 65.8723C103.052 67.23 102.996 68.5882 102.854 69.9388C102.807 70.4081 102.751 70.895 102.686 71.3996C102.392 73.613 101.896 76.1565 101.14 79.0814C101.421 79.1034 101.697 79.1598 101.964 79.2494C103.453 73.4735 104.077 68.6351 103.817 64.8652C103.807 64.719 103.794 64.5762 103.782 64.4326C103.53 61.5908 102.757 59.3724 101.483 57.8369C101.045 57.3039 100.527 56.8433 99.9456 56.4719C98.3774 55.4773 96.9309 55.5613 96.8511 55.5664H96.8259L96.8629 56.3996C96.8781 56.4036 96.8935 56.4067 96.9091 56.4089Z" fill="#1F3966"/>
<path d="M100.866 79.0729C99.9475 79.0696 99.064 79.4268 98.4056 80.0678C97.7472 80.7088 97.3664 81.5824 97.3451 82.5011C97.3238 83.4197 97.6636 84.3101 98.2916 84.9809C98.9196 85.6518 99.7856 86.0496 100.704 86.0889C101.622 86.1282 102.519 85.8059 103.202 85.1912C103.885 84.5764 104.299 83.7184 104.356 82.8013C104.414 81.8842 104.109 80.9812 103.508 80.2862C102.907 79.5913 102.057 79.1599 101.141 79.0847C101.052 79.078 100.959 79.0729 100.866 79.0729ZM102.042 82.5044C102.042 82.737 101.973 82.9644 101.844 83.1578C101.715 83.3512 101.531 83.5019 101.316 83.5909C101.102 83.6799 100.865 83.7032 100.637 83.6578C100.409 83.6124 100.199 83.5004 100.035 83.336C99.8704 83.1715 99.7584 82.962 99.713 82.7338C99.6676 82.5057 99.6909 82.2692 99.7799 82.0543C99.8689 81.8395 100.02 81.6558 100.213 81.5266C100.406 81.3973 100.634 81.3284 100.866 81.3284C101.021 81.328 101.174 81.3582 101.317 81.4172C101.46 81.4761 101.59 81.5627 101.7 81.6719C101.809 81.7812 101.896 81.9109 101.955 82.0538C102.014 82.1966 102.045 82.3497 102.045 82.5044H102.042Z" fill="white"/>
<path d="M101.699 83.3379C102.16 82.8776 102.16 82.1314 101.699 81.6711C101.239 81.2109 100.493 81.2109 100.033 81.6711C99.5724 82.1314 99.5724 82.8776 100.033 83.3379C100.493 83.7981 101.239 83.7981 101.699 83.3379Z" fill="#90C9ED"/>
<path d="M96.8816 56.8104L96.8639 56.408L96.827 55.5748L96.5414 49.0732C96.3129 49.347 90.7739 55.8696 82.7829 54.0292C82.7703 54.7902 82.7577 55.4782 82.7485 55.9696C82.7392 56.4391 82.7333 56.7256 82.7333 56.7256C82.7333 56.7256 88.5537 61.6572 96.8816 56.8104Z" fill="#FBC3A8"/>
<path d="M96.541 49.0732L96.5485 49.0639C94.4796 50.9119 91.9891 52.0039 89.2734 52.0039C86.9079 52.0039 84.7038 51.2034 82.8054 49.793L82.7684 54.0233L82.7869 54.0275C90.7736 55.8696 96.3125 49.347 96.541 49.0732Z" fill="#EB7360"/>
<path d="M80.8339 34.6462C80.8667 38.217 82.5979 41.1041 84.7215 41.1041C86.8669 41.1041 88.6116 38.1641 88.6116 34.5428C88.6116 30.9216 86.8669 27.9808 84.7215 27.9808C82.6215 27.9808 80.907 30.8032 80.8356 34.316C80.8692 34.3755 80.8838 34.4438 80.8776 34.5118C80.8725 34.5591 80.8577 34.6049 80.8339 34.6462ZM84.7215 34.4185C85.2809 34.4185 85.7295 35.277 85.7295 36.3371C85.7295 37.3972 85.2767 38.2556 84.7215 38.2556C84.1662 38.2556 83.7135 37.3963 83.7135 36.3371C83.7135 35.2778 84.1629 34.416 84.7215 34.416V34.4185Z" fill="#FBC3A8"/>
<path d="M93.2047 41.1041C95.3492 41.1041 97.0939 38.1641 97.0939 34.5428C97.0939 30.9216 95.3492 27.9808 93.2047 27.9808C91.0602 27.9808 89.3146 30.9208 89.3146 34.5428C89.3146 38.1649 91.056 41.1041 93.2047 41.1041ZM93.4836 34.416C94.043 34.416 94.4916 35.2745 94.4916 36.3346C94.4916 37.3946 94.0388 38.2531 93.4836 38.2531C92.9283 38.2531 92.4756 37.3938 92.4756 36.3346C92.4756 35.2753 92.925 34.416 93.4836 34.416Z" fill="#FBC3A8"/>
<path d="M96.5487 49.0639C98.6 47.2276 100.236 44.6413 101.265 41.6206C101.537 41.666 101.814 41.6887 102.09 41.6887C104.51 41.6887 106.472 39.9986 106.472 37.9137C106.472 36.2153 105.17 34.7789 103.379 34.3018C103.084 34.2242 102.782 34.1739 102.477 34.1514H102.459C102.406 34.1514 102.352 34.1438 102.299 34.1422H102.28C102.217 34.1422 102.154 34.1422 102.09 34.1422C101.752 34.1419 101.414 34.1757 101.082 34.243C100.709 34.3188 100.346 34.4383 100 34.5991L97.7592 34.8108C97.7189 36.6151 97.2678 38.3069 96.4765 39.5988C95.6147 41.0049 94.4521 41.7828 93.2005 41.7828C91.9489 41.7828 90.7872 41.0083 89.9245 39.5988C89.4842 38.8621 89.1582 38.0628 88.9577 37.2283C88.7578 38.0629 88.4321 38.8622 87.9917 39.5988C87.1298 41.0049 85.9673 41.7828 84.7157 41.7828C83.4641 41.7828 82.3032 41.0083 81.4396 39.5988C80.645 38.301 80.1931 36.5992 80.1561 34.7856L76.0603 34.3992C75.9928 34.3925 75.929 34.3656 75.8771 34.322C75.8252 34.2784 75.7878 34.2201 75.7696 34.1548C73.5159 34.3009 71.736 35.928 71.736 37.9137C71.736 39.9986 73.6974 41.6887 76.1166 41.6887C76.4795 41.6888 76.8414 41.65 77.196 41.5728C78.3451 45.0722 80.3166 47.9567 82.8013 49.7938C84.7039 51.2042 86.908 52.0047 89.2693 52.0047C91.9892 52.0047 94.4798 50.916 96.5487 49.0639ZM103.063 39.7819C103.932 39.4543 104.491 38.721 104.491 37.9137C104.491 37.2216 104.082 36.5815 103.399 36.2018C103.35 36.1748 103.314 36.1295 103.299 36.0759C103.284 36.0223 103.29 35.9649 103.317 35.9162C103.345 35.8676 103.39 35.8316 103.443 35.8163C103.497 35.8011 103.554 35.8077 103.603 35.8348C104.422 36.29 104.912 37.067 104.912 37.9137C104.912 38.8974 104.24 39.7853 103.207 40.175C103.155 40.1946 103.098 40.1927 103.047 40.1697C102.996 40.1467 102.957 40.1045 102.937 40.0524C102.917 40.0002 102.919 39.9425 102.942 39.8917C102.965 39.841 103.007 39.8015 103.06 39.7819H103.063ZM93.7709 45.5199C93.8767 45.5073 96.3749 45.1755 97.2266 41.9768C97.2409 41.9229 97.276 41.8769 97.3242 41.8488C97.3724 41.8208 97.4297 41.813 97.4837 41.8273C97.5376 41.8415 97.5836 41.8766 97.6116 41.9248C97.6397 41.973 97.6474 42.0304 97.6332 42.0843C96.7092 45.5695 93.8473 45.9332 93.8187 45.9366H93.7944C93.7668 45.9381 93.7392 45.9342 93.7131 45.9251C93.6871 45.9159 93.663 45.9018 93.6424 45.8834C93.6218 45.865 93.6051 45.8427 93.5931 45.8178C93.5811 45.7929 93.5742 45.7659 93.5726 45.7383C93.5711 45.7107 93.575 45.6831 93.5841 45.6571C93.5932 45.631 93.6074 45.607 93.6258 45.5864C93.6442 45.5658 93.6665 45.549 93.6914 45.537C93.7163 45.5251 93.7433 45.5181 93.7709 45.5166V45.5199ZM75.7822 40.6084H75.7621C74.1888 40.4539 73.0027 39.2955 73.0027 37.9146C73.0027 36.8705 73.6747 35.9372 74.7474 35.4786C74.7727 35.4676 74.8 35.4616 74.8277 35.4612C74.8554 35.4607 74.8828 35.4656 74.9086 35.4758C74.9343 35.4859 74.9578 35.501 74.9777 35.5203C74.9976 35.5395 75.0135 35.5624 75.0246 35.5878C75.0356 35.6132 75.0415 35.6405 75.042 35.6681C75.0425 35.6958 75.0375 35.7233 75.0274 35.749C75.0172 35.7748 75.0021 35.7982 74.9829 35.8181C74.9637 35.838 74.9407 35.854 74.9154 35.865C73.9964 36.2564 73.426 37.041 73.426 37.9146C73.426 39.0788 74.4492 40.0574 75.8066 40.191C75.8623 40.1938 75.9146 40.2186 75.952 40.2599C75.9894 40.3013 76.0089 40.3558 76.0061 40.4115C76.0033 40.4672 75.9785 40.5195 75.9372 40.5569C75.8958 40.5943 75.8413 40.6138 75.7856 40.611L75.7822 40.6084ZM88.4158 42.2044L88.6964 38.2363C88.7003 38.1806 88.7262 38.1287 88.7683 38.0921C88.8105 38.0555 88.8654 38.0371 88.9211 38.041C88.9768 38.0449 89.0287 38.0708 89.0653 38.1129C89.1019 38.155 89.1203 38.21 89.1164 38.2657L88.8358 42.2338C88.8311 42.2985 88.8504 42.3625 88.8902 42.4137C88.9299 42.4649 88.9871 42.4996 89.0509 42.511L90.1253 42.7051C90.181 42.71 90.2324 42.7368 90.2683 42.7797C90.3042 42.8225 90.3217 42.8779 90.3168 42.9336C90.3119 42.9893 90.2851 43.0407 90.2422 43.0766C90.1994 43.1126 90.144 43.13 90.0883 43.1251C90.0757 43.1263 90.0631 43.1263 90.0505 43.1251L88.977 42.931C88.8095 42.9017 88.6592 42.8107 88.5553 42.6761C88.4515 42.5415 88.4018 42.3738 88.4158 42.2044Z" fill="#FBC3A8"/>
<path d="M80.1696 34.1078C80.2334 32.3673 80.6812 30.7411 81.4472 29.4878C82.3091 28.0816 83.4716 27.3038 84.7232 27.3038C85.9748 27.3038 87.1365 28.0783 87.9992 29.4878C88.4396 30.2247 88.7654 31.0243 88.9652 31.8591C89.1657 31.0243 89.4917 30.2248 89.9321 29.4878C90.7939 28.0816 91.9565 27.3038 93.2081 27.3038C94.4596 27.3038 95.6205 28.0783 96.484 29.4878C97.2543 30.7478 97.702 32.3816 97.7634 34.1313L100.745 33.8499C100.548 33.5802 100.381 33.2899 100.246 32.9839C100.198 32.8764 100.151 32.7647 100.106 32.6479C100.083 32.5899 100.062 32.532 100.041 32.4732C99.9978 32.3556 99.9566 32.2346 99.9188 32.112C99.8995 32.0498 99.8802 31.9876 99.8617 31.9247C99.8247 31.7986 99.7903 31.6726 99.7567 31.5408C99.7231 31.4089 99.692 31.2778 99.6626 31.1434C99.5584 30.6747 99.4753 30.185 99.4106 29.6911C99.4005 29.6205 99.3913 29.55 99.3829 29.4794C99.3652 29.3374 99.3484 29.1963 99.3333 29.0544C99.2955 28.7007 99.2661 28.3488 99.2418 28.0035C99.2325 27.8649 99.2241 27.728 99.2166 27.5919C99.2059 27.3886 99.1967 27.189 99.1888 26.993C99.1838 26.8628 99.1796 26.7351 99.1762 26.6091C99.1729 26.4831 99.1704 26.3571 99.1687 26.2395C99.167 26.1219 99.1687 26.0009 99.1636 25.8859C99.1636 25.4852 99.1636 25.1223 99.1695 24.814C99.1695 24.73 99.1695 24.646 99.1754 24.562C99.1888 24.0505 99.2073 23.7439 99.2073 23.7439C93.0753 26.3126 90.7359 22.9778 90.7359 22.9778C83.1062 26.8561 77.4203 23.885 77.4203 23.885C76.4123 26.7998 76.1376 29.644 76.0763 31.277C76.0662 32.052 76.0662 32.8702 76.0763 33.7315C76.0967 33.7298 76.1172 33.7298 76.1376 33.7315L80.1696 34.1078Z" fill="#FBC3A8"/>
<path d="M100.587 13.8176C100.811 13.9075 102.818 12.9826 103.732 11.6705C104.677 10.3114 104.431 8.65661 103.59 8.21981C102.75 7.78301 101.207 8.51801 100.687 10.0897C100.128 11.789 100.455 13.7655 100.587 13.8176Z" fill="#5C1E14"/>
<path d="M84.7214 38.2556C85.2799 38.2556 85.7327 37.3967 85.7327 36.3371C85.7327 35.2775 85.2799 34.4185 84.7214 34.4185C84.1629 34.4185 83.7101 35.2775 83.7101 36.3371C83.7101 37.3967 84.1629 38.2556 84.7214 38.2556Z" fill="#2B100E"/>
<path d="M93.4836 38.2556C94.0421 38.2556 94.4949 37.3967 94.4949 36.3371C94.4949 35.2775 94.0421 34.4185 93.4836 34.4185C92.925 34.4185 92.4722 35.2775 92.4722 36.3371C92.4722 37.3967 92.925 38.2556 93.4836 38.2556Z" fill="#2B100E"/>
<path d="M93.7944 45.9383H93.8187C93.8473 45.9383 96.7059 45.5713 97.6333 42.086C97.6475 42.0321 97.6398 41.9748 97.6117 41.9266C97.5837 41.8783 97.5376 41.8433 97.4837 41.829C97.4298 41.8147 97.3724 41.8225 97.3242 41.8505C97.276 41.8786 97.2409 41.9246 97.2267 41.9785C96.3757 45.1773 93.8767 45.5066 93.7708 45.5217C93.7433 45.5232 93.7163 45.5302 93.6914 45.5422C93.6665 45.5542 93.6442 45.5709 93.6258 45.5915C93.6074 45.6121 93.5932 45.6361 93.5841 45.6622C93.575 45.6883 93.5711 45.7159 93.5726 45.7435C93.5741 45.771 93.5811 45.798 93.5931 45.8229C93.6051 45.8478 93.6218 45.8701 93.6424 45.8885C93.663 45.9069 93.687 45.9211 93.7131 45.9302C93.7392 45.9393 93.7668 45.9432 93.7944 45.9417V45.9383Z" fill="#FBC3A8"/>
<path d="M86.1554 46.993L86.1722 47.0106C86.1919 47.0314 88.4248 48.8535 91.5922 47.129C91.6412 47.1023 91.6775 47.0572 91.6932 47.0036C91.7089 46.9501 91.7027 46.8926 91.6759 46.8436C91.6492 46.7947 91.6041 46.7584 91.5506 46.7427C91.4971 46.727 91.4395 46.7332 91.3906 46.7599C88.4836 48.3429 86.5254 46.7557 86.4416 46.6893C86.4216 46.6703 86.3979 46.6555 86.3721 46.6457C86.3463 46.6359 86.3188 46.6312 86.2912 46.632C86.2636 46.6328 86.2364 46.6391 86.2112 46.6504C86.186 46.6617 86.1633 46.6778 86.1443 46.6979C86.1254 46.718 86.1106 46.7417 86.1007 46.7675C86.0909 46.7933 86.0863 46.8208 86.0871 46.8484C86.0879 46.876 86.0941 46.9032 86.1054 46.9284C86.1168 46.9536 86.1329 46.9763 86.153 46.9953L86.1554 46.993Z" fill="#EB7360"/>
<path d="M90.0875 43.121C90.1432 43.1259 90.1986 43.1085 90.2415 43.0726C90.2843 43.0366 90.3111 42.9852 90.316 42.9295C90.3209 42.8738 90.3035 42.8184 90.2676 42.7756C90.2317 42.7327 90.1802 42.7059 90.1245 42.701L89.0501 42.5069C88.9863 42.4955 88.9291 42.4608 88.8894 42.4096C88.8496 42.3584 88.8303 42.2944 88.8351 42.2297L89.1156 38.2615C89.1176 38.2339 89.114 38.2063 89.1053 38.18C89.0965 38.1538 89.0827 38.1296 89.0645 38.1087C89.0279 38.0666 88.976 38.0407 88.9203 38.0368C88.8646 38.0329 88.8097 38.0513 88.7675 38.0879C88.7254 38.1246 88.6995 38.1764 88.6956 38.2321L88.415 42.2003C88.4029 42.3684 88.4534 42.535 88.5569 42.6679C88.6604 42.8009 88.8095 42.8908 88.9753 42.9202L90.0489 43.1143C90.0615 43.1178 90.0745 43.1201 90.0875 43.121Z" fill="#EB7360"/>
<path d="M75.8031 40.1901C74.4457 40.0566 73.4226 39.078 73.4226 37.9138C73.4226 37.041 73.993 36.2556 74.9119 35.8642C74.9631 35.8419 75.0034 35.8002 75.0239 35.7482C75.0444 35.6962 75.0434 35.6382 75.0211 35.587C74.9988 35.5357 74.9571 35.4954 74.9051 35.475C74.8531 35.4545 74.7951 35.4555 74.7439 35.4778C73.6679 35.9364 72.9993 36.8696 72.9993 37.9138C72.9993 39.2947 74.1853 40.4531 75.7586 40.6076H75.7788C75.8345 40.6104 75.889 40.591 75.9303 40.5535C75.9717 40.5161 75.9965 40.4638 75.9993 40.4081C76.002 40.3524 75.9826 40.2979 75.9452 40.2566C75.9078 40.2152 75.8555 40.1904 75.7998 40.1876L75.8031 40.1901Z" fill="#EB7360"/>
<path d="M76.0678 34.3958L80.1637 34.7822C80.2006 36.5958 80.6525 38.2976 81.4472 39.5954C82.309 41.0016 83.4716 41.7794 84.7232 41.7794C85.9748 41.7794 87.1365 41.005 87.9992 39.5954C88.4396 38.8589 88.7653 38.0596 88.9652 37.225C89.1657 38.0595 89.4917 38.8587 89.932 39.5954C90.7939 41.0016 91.9564 41.7794 93.208 41.7794C94.4596 41.7794 95.6205 41.005 96.484 39.5954C97.2753 38.3035 97.7264 36.6118 97.7667 34.8074L100.008 34.5958C100.353 34.435 100.716 34.3154 101.09 34.2396C101.056 34.2085 101.023 34.1758 100.991 34.1422L100.944 34.0909L100.901 34.0422C100.88 34.0187 100.859 33.9943 100.839 33.9691L100.817 33.9422C100.793 33.9131 100.77 33.8829 100.746 33.8515L97.7642 34.1329C97.7029 32.3832 97.2552 30.7469 96.4849 29.4894C95.623 28.0832 94.4605 27.3054 93.2089 27.3054C91.9573 27.3054 90.7956 28.0799 89.9329 29.4894C89.4925 30.2264 89.1665 31.0259 88.966 31.8607C88.7662 31.0259 88.4404 30.2263 88 29.4894C87.1382 28.0832 85.9756 27.3054 84.724 27.3054C83.4724 27.3054 82.3115 28.0799 81.448 29.4894C80.6819 30.741 80.2342 32.3672 80.1704 34.1094L76.1325 33.728C76.1121 33.7264 76.0916 33.7264 76.0712 33.728C75.9931 33.7349 75.9198 33.7689 75.8641 33.8242C75.8084 33.8794 75.7738 33.9524 75.7663 34.0304C75.7625 34.0714 75.7665 34.1127 75.778 34.1522C75.7963 34.2173 75.8337 34.2753 75.8854 34.3187C75.937 34.3622 76.0006 34.3891 76.0678 34.3958ZM93.2038 27.9808C95.3484 27.9808 97.093 30.9208 97.093 34.5428C97.093 38.1649 95.3484 41.1041 93.2038 41.1041C91.0593 41.1041 89.3138 38.1641 89.3138 34.5428C89.3138 30.9216 91.056 27.9808 93.2047 27.9808H93.2038ZM80.8357 34.316C80.9071 30.8032 82.6224 27.9808 84.7215 27.9808C86.8669 27.9808 88.6116 30.9208 88.6116 34.5428C88.6116 38.1649 86.8669 41.1041 84.7215 41.1041C82.598 41.1041 80.8667 38.217 80.834 34.6462C80.8577 34.6049 80.8726 34.5591 80.8777 34.5118C80.8839 34.4438 80.8692 34.3755 80.8357 34.316Z" fill="white"/>
<path d="M90.7293 22.9845C90.7293 22.9845 93.072 26.3193 99.2041 23.748C99.2041 23.748 99.1856 24.0546 99.1721 24.5662C99.1721 24.6443 99.1721 24.7283 99.1663 24.8182C99.1604 25.1265 99.157 25.4902 99.1604 25.89C99.1604 26.0051 99.1604 26.1227 99.1654 26.2437C99.1705 26.3646 99.1654 26.4873 99.173 26.6133C99.1805 26.7393 99.1805 26.8653 99.1856 26.9971C99.1929 27.1931 99.2021 27.3928 99.2133 27.5961C99.2209 27.7321 99.2293 27.8691 99.2385 28.0077C99.2629 28.3529 99.2923 28.7048 99.3301 29.0585C99.3452 29.2004 99.362 29.3416 99.3796 29.4835C99.388 29.5541 99.3973 29.6246 99.4073 29.6952C99.4737 30.1891 99.5569 30.6789 99.6593 31.1476C99.6887 31.282 99.7207 31.4147 99.7534 31.5449C99.7862 31.6751 99.8215 31.8028 99.8584 31.9288C99.8769 31.9918 99.8962 32.0539 99.9155 32.1161C99.9542 32.2387 99.9945 32.3597 100.037 32.4773C100.058 32.5361 100.08 32.594 100.103 32.652C100.147 32.7662 100.194 32.878 100.243 32.988C100.377 33.294 100.545 33.5844 100.742 33.854C100.766 33.8854 100.789 33.9156 100.813 33.9448L100.835 33.9716C100.855 33.9968 100.876 34.0212 100.897 34.0447L100.94 34.0934L100.987 34.1447C101.02 34.1783 101.053 34.211 101.087 34.2421C101.418 34.1748 101.756 34.1411 102.095 34.1413C102.158 34.1413 102.221 34.1413 102.284 34.1413H102.304C102.357 34.1413 102.41 34.1464 102.463 34.1506H102.482C102.786 34.1733 103.088 34.2239 103.383 34.3018C103.958 33.6239 104.762 32.0724 105.668 28.5738C109.055 15.4925 99.2981 15.4925 99.2981 15.4925C99.2981 15.4925 92.8671 3.22014 80.7492 12.7894C80.7492 12.7894 71.3244 8.54321 69.5428 18.9827C68.0182 27.9178 74.2384 31.7507 76.0637 32.6654C76.0637 32.6654 76.041 32.1413 76.0763 31.2694C76.1418 29.6406 76.4123 26.7964 77.4203 23.8774C77.4203 23.8849 83.1063 26.856 90.7293 22.9845Z" fill="#5C1E14"/>
<path d="M103.137 40.1885C103.162 40.1886 103.187 40.184 103.211 40.1751C104.246 39.7853 104.915 38.8974 104.915 37.9138C104.915 37.0671 104.425 36.29 103.606 35.8348C103.582 35.8214 103.556 35.8128 103.528 35.8097C103.501 35.8065 103.473 35.8088 103.447 35.8163C103.42 35.8239 103.395 35.8366 103.374 35.8538C103.352 35.8709 103.334 35.8921 103.321 35.9162C103.307 35.9403 103.299 35.9668 103.296 35.9942C103.293 36.0216 103.295 36.0494 103.302 36.0759C103.31 36.1024 103.323 36.1272 103.34 36.1488C103.357 36.1704 103.378 36.1884 103.402 36.2018C104.086 36.5815 104.494 37.2216 104.494 37.9138C104.494 38.721 103.931 39.4544 103.066 39.782C103.02 39.7993 102.982 39.8322 102.958 39.875C102.933 39.9178 102.925 39.9677 102.934 40.0161C102.942 40.0645 102.968 40.1083 103.006 40.1398C103.043 40.1713 103.091 40.1885 103.14 40.1885H103.137Z" fill="#EB7360"/>
<path d="M73.8671 123.485H40.7476C40.6919 123.485 40.6385 123.507 40.5991 123.546C40.5597 123.585 40.5376 123.639 40.5376 123.695C40.5376 123.75 40.5597 123.804 40.5991 123.843C40.6385 123.882 40.6919 123.905 40.7476 123.905H73.8671C73.9227 123.905 73.9762 123.882 74.0155 123.843C74.0549 123.804 74.0771 123.75 74.0771 123.695C74.0771 123.639 74.0549 123.585 74.0155 123.546C73.9762 123.507 73.9227 123.485 73.8671 123.485Z" fill="#1F3966"/>
<path d="M80.2476 123.695C80.2475 123.722 80.2529 123.75 80.2634 123.775C80.2739 123.801 80.2894 123.824 80.3089 123.843C80.3284 123.863 80.3516 123.878 80.3771 123.889C80.4027 123.899 80.43 123.905 80.4576 123.905H136.623C136.678 123.905 136.732 123.883 136.771 123.843C136.811 123.804 136.833 123.75 136.833 123.695C136.833 123.639 136.811 123.585 136.771 123.546C136.732 123.507 136.678 123.485 136.623 123.485H80.4576C80.43 123.484 80.4027 123.49 80.3771 123.5C80.3516 123.511 80.3284 123.526 80.3089 123.546C80.2894 123.565 80.2739 123.589 80.2634 123.614C80.2529 123.64 80.2475 123.667 80.2476 123.695Z" fill="#1F3966"/>
<path d="M81.732 56.2148L81.7068 56.2258C79.921 57.0792 78.4938 58.6853 77.464 60.9978C77.0418 61.9656 76.7024 62.9674 76.4492 63.9924C76.1446 65.2129 75.9202 66.452 75.7772 67.7018C75.411 70.8191 75.4941 73.7498 75.5798 75.245C75.7317 75.1622 75.8984 75.11 76.0704 75.0913L76.3468 75.0611L76.4114 75.0552C76.3106 73.1165 76.235 69.0072 77.049 65.1356C77.7689 61.7101 79.1851 58.4694 81.895 57.0716L81.905 57.0666L82.7299 56.7306L82.7459 55.9066C82.7459 55.9066 82.1234 56.0158 81.732 56.2148Z" fill="#1F3966"/>
<path d="M82.2864 56.0116L81.921 56.046C81.921 56.046 81.921 56.0754 81.921 56.13C82.0408 56.0845 82.1627 56.045 82.2864 56.0116Z" fill="#75B2E1"/>
<path d="M97.739 56.4811C97.4661 56.4252 97.1876 56.401 96.9091 56.4089C96.894 56.4097 96.8789 56.4097 96.8637 56.4089L96.8814 56.8112C88.5536 61.658 82.7333 56.7272 82.7333 56.7272L81.9084 57.0632C81.9084 57.1943 81.9084 57.3354 81.9143 57.4891C82.1209 62.2905 83.3658 73.3071 90.132 82.1396L90.1899 82.2135L90.242 82.1388V82.1295C90.9476 81.0266 98.3547 69.1432 97.739 56.4811Z" fill="#75B2E1"/>
<path d="M82.7485 55.9687L82.7333 56.7247C82.7333 56.7247 82.7392 56.4358 82.7485 55.9687Z" fill="#75B2E1"/>
<path opacity="0.1" fill-rule="evenodd" clip-rule="evenodd" d="M46.4521 101.909L45.5785 105.753C45.555 105.856 45.5591 105.963 45.5904 106.064C45.6216 106.165 45.6789 106.256 45.7564 106.328C45.834 106.4 45.9291 106.45 46.0322 106.474C46.1353 106.497 46.2427 106.493 46.3437 106.462L50.1103 105.297C50.2112 105.266 50.3022 105.208 50.374 105.131C50.4458 105.053 50.496 104.958 50.5194 104.855C50.5428 104.752 50.5387 104.644 50.5074 104.543C50.4761 104.442 50.4188 104.351 50.3413 104.28L47.4491 101.6C47.3714 101.528 47.2762 101.478 47.1731 101.455C47.07 101.432 46.9625 101.436 46.8615 101.467C46.7605 101.498 46.6695 101.556 46.5976 101.633C46.5258 101.711 46.4756 101.806 46.4521 101.909Z" fill="white"/>
</svg>
