<svg width="19" height="19" viewBox="0 0 19 19" fill="none" xmlns="http://www.w3.org/2000/svg">
<path d="M9.49212 1.58325C5.12212 1.58325 1.58337 5.12992 1.58337 9.49992C1.58337 13.8699 5.12212 17.4166 9.49212 17.4166C13.87 17.4166 17.4167 13.8699 17.4167 9.49992C17.4167 5.12992 13.87 1.58325 9.49212 1.58325ZM9.50004 15.8333C6.00087 15.8333 3.16671 12.9991 3.16671 9.49992C3.16671 6.00075 6.00087 3.16659 9.50004 3.16659C12.9992 3.16659 15.8334 6.00075 15.8334 9.49992C15.8334 12.9991 12.9992 15.8333 9.50004 15.8333Z" fill="black"/>
<path d="M9.89587 5.54175H8.70837V10.2917L12.8646 12.7855L13.4584 11.8117L9.89587 9.698V5.54175Z" fill="black"/>
</svg>
