module gitlab.com/bugielektrik/phobos/account-service

// +heroku goVersion go1.18
go 1.18

require (
	github.com/go-playground/validator/v10 v10.4.1
	github.com/gofiber/fiber/v2 v2.32.0
	github.com/golang-migrate/migrate/v4 v4.14.1
	github.com/google/uuid v1.2.0
	github.com/hashicorp/go-hclog v1.0.0
	github.com/jmoiron/sqlx v1.3.3
	github.com/pkg/errors v0.9.1
	github.com/shopspring/decimal v0.0.0-20180709203117-cd690d0c9e24
	github.com/sirupsen/logrus v1.8.1
	github.com/spf13/viper v1.10.1
)

require (
	github.com/Microsoft/go-winio v0.4.18 // indirect
	github.com/andybalholm/brotli v1.0.4 // indirect
	github.com/containerd/containerd v1.4.4 // indirect
	github.com/dhui/dktest v0.3.4 // indirect
	github.com/docker/docker v20.10.6+incompatible // indirect
	github.com/fatih/color v1.13.0 // indirect
	github.com/fsnotify/fsnotify v1.5.1 // indirect
	github.com/go-playground/locales v0.13.0 // indirect
	github.com/go-playground/universal-translator v0.17.0 // indirect
	github.com/go-sql-driver/mysql v1.6.0 // indirect
	github.com/hashicorp/errwrap v1.1.0 // indirect
	github.com/hashicorp/go-multierror v1.1.1 // indirect
	github.com/hashicorp/hcl v1.0.0 // indirect
	github.com/klauspost/compress v1.15.0 // indirect
	github.com/kr/text v0.2.0 // indirect
	github.com/leodido/go-urn v1.2.1 // indirect
	github.com/lib/pq v1.10.0 // indirect
	github.com/magiconair/properties v1.8.5 // indirect
	github.com/mattn/go-colorable v0.1.12 // indirect
	github.com/mattn/go-isatty v0.0.14 // indirect
	github.com/mattn/go-sqlite3 v1.14.7 // indirect
	github.com/mitchellh/mapstructure v1.4.3 // indirect
	github.com/moby/term v0.0.0-20201216013528-df9cb8a40635 // indirect
	github.com/niemeyer/pretty v0.0.0-20200227124842-a10e7caefd8e // indirect
	github.com/pelletier/go-toml v1.9.4 // indirect
	github.com/spf13/afero v1.6.0 // indirect
	github.com/spf13/cast v1.4.1 // indirect
	github.com/spf13/jwalterweatherman v1.1.0 // indirect
	github.com/spf13/pflag v1.0.5 // indirect
	github.com/subosito/gotenv v1.2.0 // indirect
	github.com/valyala/bytebufferpool v1.0.0 // indirect
	github.com/valyala/fasthttp v1.35.0 // indirect
	github.com/valyala/tcplisten v1.0.0 // indirect
	golang.org/x/crypto v0.0.0-20220214200702-86341886e292 // indirect
	golang.org/x/sys v0.0.0-20220227234510-4e6760a101f9 // indirect
	golang.org/x/text v0.3.7 // indirect
	gopkg.in/check.v1 v1.0.0-20200227125254-8fa46927fb4f // indirect
	gopkg.in/ini.v1 v1.66.2 // indirect
	gopkg.in/yaml.v2 v2.4.0 // indirect
)
