<?xml version="1.0" encoding="UTF-8"?>
<glyph name="Uhorn" format="1">
  <advance width="604"/>
  <unicode hex="01AF"/>
  <outline>
    <contour>
      <point x="168" y="698" type="line" name=""/>
      <point x="83" y="274" type="line" smooth="yes"/>
      <point x="75" y="232"/>
      <point x="73" y="194"/>
      <point x="73" y="172" type="curve" smooth="yes"/>
      <point x="73" y="34"/>
      <point x="147" y="-12"/>
      <point x="263" y="-12" type="curve" smooth="yes"/>
      <point x="399" y="-12"/>
      <point x="475" y="45"/>
      <point x="518" y="260" type="curve" smooth="yes"/>
      <point x="596" y="649" type="line"/>
      <point x="619" y="649" type="line" smooth="yes"/>
      <point x="656" y="649"/>
      <point x="668" y="666"/>
      <point x="673" y="690" type="curve" smooth="yes"/>
      <point x="697" y="810" type="line"/>
      <point x="631" y="810" type="line"/>
      <point x="609" y="698" type="line"/>
      <point x="529" y="698" type="line"/>
      <point x="443" y="268" type="line" smooth="yes"/>
      <point x="410" y="101"/>
      <point x="359" y="56"/>
      <point x="266" y="56" type="curve" smooth="yes"/>
      <point x="193" y="56"/>
      <point x="148" y="89"/>
      <point x="148" y="183" type="curve" smooth="yes"/>
      <point x="148" y="196"/>
      <point x="148" y="216"/>
      <point x="155" y="249" type="curve" smooth="yes"/>
      <point x="245" y="698" type="line"/>
    </contour>
    <contour>
      <point x="246.0" y="0.0" type="move" name="bottom"/>
    </contour>
    <contour>
      <point x="380.0" y="698.0" type="move" name="top"/>
    </contour>
  </outline>
</glyph>
