<?xml version="1.0" encoding="UTF-8"?>
<glyph name="oneinferior" format="1">
  <advance width="320"/>
  <unicode hex="2081"/>
  <outline>
    <contour>
      <point x="286" y="0" type="line" name=""/>
      <point x="286" y="17" type="line"/>
      <point x="181" y="17" type="line"/>
      <point x="181" y="369" type="line"/>
      <point x="150" y="369" type="line"/>
      <point x="36" y="273" type="line"/>
      <point x="47" y="261" type="line"/>
      <point x="158" y="354" type="line"/>
      <point x="162" y="354" type="line"/>
      <point x="162" y="17" type="line"/>
      <point x="47" y="17" type="line"/>
      <point x="47" y="0" type="line"/>
    </contour>
  </outline>
  <lib>
    <dict>
      <key>com.type-invaders.name.final</key>
      <string>uni2081</string>
      <key>com.type-invaders.name.production</key>
      <string>oneinferior</string>
    </dict>
  </lib>
</glyph>
