<?xml version="1.0" encoding="UTF-8"?>
<glyph name="uni0413" format="1">
  <advance width="485"/>
  <unicode hex="0413"/>
  <outline>
    <contour>
      <point x="39" y="0" type="line" name=""/>
      <point x="120" y="0" type="line"/>
      <point x="246" y="626" type="line"/>
      <point x="529" y="626" type="line"/>
      <point x="543" y="698" type="line"/>
      <point x="179" y="698" type="line"/>
    </contour>
    <contour>
      <point x="346.0" y="698.0" type="move" name="top"/>
    </contour>
  </outline>
</glyph>
