<?xml version="1.0" encoding="UTF-8"?>
<glyph name="acaron" format="1">
  <advance width="571"/>
  <unicode hex="01CE"/>
  <outline>
    <component base="a"/>
    <component base="caron" xOffset="-29"/>
    <contour>
      <point x="254.0" y="0.0" type="move" name="bottom"/>
    </contour>
    <contour>
      <point x="523.0" y="0.0" type="move" name="bottomright"/>
    </contour>
  </outline>
  <lib>
    <dict>
      <key>com.typemytype.robofont.mark</key>
      <array>
        <real>0.6</real>
        <real>0.986</real>
        <real>1.0</real>
        <real>1.0</real>
      </array>
    </dict>
  </lib>
</glyph>
