<?xml version="1.0" encoding="UTF-8"?>
<glyph name="Acircumflexacute" format="1">
  <advance width="641"/>
  <unicode hex="1EA4"/>
  <outline>
    <component base="A"/>
    <component base="circumflexacute.case" xOffset="322"/>
    <contour>
      <point x="322.0" y="0.0" type="move" name="bottom"/>
    </contour>
    <contour>
      <point x="618.0" y="0.0" type="move" name="bottomright"/>
    </contour>
  </outline>
  <lib>
    <dict>
      <key>com.type-invaders.name.final</key>
      <string>uni1EA4</string>
      <key>com.type-invaders.name.production</key>
      <string>Acircumflexacute</string>
      <key>com.typemytype.robofont.mark</key>
      <array>
        <real>0.6</real>
        <real>0.986</real>
        <real>1.0</real>
        <real>1.0</real>
      </array>
    </dict>
  </lib>
</glyph>
