<?xml version="1.0" encoding="UTF-8"?>
<glyph name="uni04B8" format="1">
  <advance width="645"/>
  <outline>
    <contour>
      <point x="468" y="0" type="line" name=""/>
      <point x="552" y="0" type="line"/>
      <point x="552" y="698" type="line"/>
      <point x="468" y="698" type="line"/>
      <point x="468" y="349" type="line"/>
      <point x="438" y="337"/>
      <point x="392" y="328"/>
      <point x="338" y="326" type="curve"/>
      <point x="338" y="493" type="line"/>
      <point x="274" y="493" type="line"/>
      <point x="274" y="328" type="line"/>
      <point x="186" y="339"/>
      <point x="142" y="392"/>
      <point x="142" y="500" type="curve" smooth="yes"/>
      <point x="142" y="698" type="line"/>
      <point x="58" y="698" type="line"/>
      <point x="58" y="500" type="line" smooth="yes"/>
      <point x="58" y="344"/>
      <point x="126" y="264"/>
      <point x="274" y="253" type="curve"/>
      <point x="274" y="112" type="line"/>
      <point x="338" y="112" type="line"/>
      <point x="338" y="252" type="line"/>
      <point x="388" y="255"/>
      <point x="432" y="263"/>
      <point x="463" y="275" type="curve"/>
      <point x="468" y="275" type="line"/>
    </contour>
  </outline>
</glyph>
