<?xml version="1.0" encoding="UTF-8"?>
<glyph name="hookcomb.case" format="1">
  <advance width="0"/>
  <outline>
    <contour>
      <point x="-84" y="874" type="line" name=""/>
      <point x="34" y="874" type="line"/>
      <point x="-24" y="770" type="line"/>
      <point x="22" y="747" type="line"/>
      <point x="46" y="777" type="line" smooth="yes"/>
      <point x="77" y="816"/>
      <point x="95" y="851"/>
      <point x="95" y="880" type="curve" smooth="yes"/>
      <point x="95" y="910"/>
      <point x="76" y="935"/>
      <point x="25" y="935" type="curve" smooth="yes"/>
      <point x="-84" y="935" type="line"/>
    </contour>
    <contour>
      <point x="0.0" y="698.0" type="move" name="_top"/>
    </contour>
  </outline>
  <lib>
    <dict>
      <key>com.type-invaders.name.final</key>
      <string>uni0309.case</string>
      <key>com.type-invaders.name.production</key>
      <string>hookcomb.case</string>
    </dict>
  </lib>
</glyph>
