<?xml version="1.0" encoding="UTF-8"?>
<glyph name="ohorngrave" format="1">
  <advance width="550"/>
  <unicode hex="1EDD"/>
  <outline>
    <component base="ohorn"/>
    <component base="grave" xOffset="28"/>
    <contour>
      <point x="233.0" y="0.0" type="move" name="bottom"/>
    </contour>
  </outline>
  <lib>
    <dict>
      <key>com.type-invaders.name.final</key>
      <string>uni1EDD</string>
      <key>com.type-invaders.name.production</key>
      <string>ohorngrave</string>
      <key>com.typemytype.robofont.mark</key>
      <array>
        <real>0.6</real>
        <real>0.986</real>
        <real>1.0</real>
        <real>1.0</real>
      </array>
    </dict>
  </lib>
</glyph>
