<?xml version="1.0" encoding="UTF-8"?>
<glyph name="emdash" format="1">
  <advance width="761"/>
  <unicode hex="2014"/>
  <outline>
    <contour>
      <point x="743" y="296" type="line" name=""/>
      <point x="747" y="314" type="line"/>
      <point x="39" y="314" type="line"/>
      <point x="35" y="296" type="line"/>
    </contour>
  </outline>
</glyph>
