<?xml version="1.0" encoding="UTF-8"?>
<glyph name="commaturnedtop" format="1">
  <advance width="600"/>
  <unicode hex="02BB"/>
  <outline>
    <contour>
      <point x="299" y="599" type="curve" smooth="yes" name=""/>
      <point x="317" y="599"/>
      <point x="323" y="608"/>
      <point x="323" y="621" type="curve" smooth="yes"/>
      <point x="323" y="629" type="line" smooth="yes"/>
      <point x="323" y="640"/>
      <point x="317" y="649"/>
      <point x="295" y="649" type="curve"/>
      <point x="298" y="671"/>
      <point x="311" y="713"/>
      <point x="340" y="745" type="curve"/>
      <point x="322" y="745" type="line"/>
      <point x="296" y="716"/>
      <point x="277" y="666"/>
      <point x="277" y="632" type="curve" smooth="yes"/>
      <point x="277" y="621" type="line" smooth="yes"/>
      <point x="277" y="608"/>
      <point x="283" y="599"/>
    </contour>
    <contour>
      <point x="300.0" y="540.0" type="move" name="_top"/>
    </contour>
  </outline>
  <lib>
    <dict>
      <key>com.type-invaders.name.final</key>
      <string>uni02BB</string>
      <key>com.type-invaders.name.production</key>
      <string>commaturnedtop</string>
    </dict>
  </lib>
</glyph>
