<?xml version="1.0" encoding="UTF-8"?>
<glyph name="dotlessj" format="1">
  <advance width="209"/>
  <unicode hex="0237"/>
  <outline>
    <contour>
      <point x="17" y="-200" type="line" name=""/>
      <point x="88" y="-200" type="line" smooth="yes"/>
      <point x="108" y="-200"/>
      <point x="115" y="-193"/>
      <point x="115" y="-173" type="curve" smooth="yes"/>
      <point x="115" y="506" type="line"/>
      <point x="94" y="506" type="line"/>
      <point x="94" y="-181" type="line"/>
      <point x="17" y="-181" type="line"/>
    </contour>
    <contour>
      <point x="104.0" y="540.0" type="move" name="top"/>
    </contour>
  </outline>
  <lib>
    <dict>
      <key>com.type-invaders.name.final</key>
      <string>uni0237</string>
      <key>com.type-invaders.name.production</key>
      <string>dotlessj</string>
    </dict>
  </lib>
</glyph>
