<?xml version="1.0" encoding="UTF-8"?>
<glyph name="zerosuperior" format="1">
  <advance width="350"/>
  <unicode hex="2070"/>
  <outline>
    <contour>
      <point x="206" y="362" type="curve" name=""/>
      <point x="174" y="362"/>
      <point x="156" y="381"/>
      <point x="156" y="420" type="curve" smooth="yes"/>
      <point x="156" y="449"/>
      <point x="175" y="517"/>
      <point x="182" y="544" type="curve" smooth="yes"/>
      <point x="201" y="620"/>
      <point x="226" y="666"/>
      <point x="277" y="666" type="curve" smooth="yes"/>
      <point x="309" y="666"/>
      <point x="327" y="647"/>
      <point x="327" y="608" type="curve" smooth="yes"/>
      <point x="327" y="579"/>
      <point x="308" y="511"/>
      <point x="301" y="484" type="curve" smooth="yes"/>
      <point x="282" y="408"/>
      <point x="257" y="362"/>
    </contour>
    <contour>
      <point x="200" y="324" type="curve" smooth="yes"/>
      <point x="360" y="324"/>
      <point x="387" y="536"/>
      <point x="387" y="591" type="curve" smooth="yes"/>
      <point x="387" y="666"/>
      <point x="350" y="704"/>
      <point x="283" y="704" type="curve" smooth="yes"/>
      <point x="123" y="704"/>
      <point x="96" y="492"/>
      <point x="96" y="437" type="curve" smooth="yes"/>
      <point x="96" y="362"/>
      <point x="133" y="324"/>
    </contour>
  </outline>
</glyph>
