<?xml version="1.0" encoding="UTF-8"?>
<glyph name="OE" format="1">
  <advance width="836"/>
  <unicode hex="0152"/>
  <outline>
    <contour>
      <point x="721" y="0" type="line"/>
      <point x="725" y="20" type="line"/>
      <point x="405" y="20" type="line"/>
      <point x="470" y="344" type="line"/>
      <point x="777" y="344" type="line"/>
      <point x="781" y="364" type="line"/>
      <point x="474" y="364" type="line"/>
      <point x="537" y="678" type="line"/>
      <point x="855" y="678" type="line"/>
      <point x="859" y="698" type="line"/>
      <point x="519" y="698" type="line"/>
      <point x="488" y="705"/>
      <point x="437" y="710"/>
      <point x="396" y="710" type="curve" smooth="yes" name=""/>
      <point x="174" y="710"/>
      <point x="96" y="512"/>
      <point x="71" y="360" type="curve" smooth="yes"/>
      <point x="63" y="311"/>
      <point x="60" y="266"/>
      <point x="60" y="235" type="curve" smooth="yes"/>
      <point x="60" y="70"/>
      <point x="144" y="-12"/>
      <point x="274" y="-12" type="curve" smooth="yes"/>
      <point x="306" y="-12"/>
      <point x="351" y="-10"/>
      <point x="382" y="0" type="curve" name=""/>
    </contour>
    <contour>
      <point x="275" y="8" type="curve" smooth="yes" name=""/>
      <point x="152" y="8"/>
      <point x="82" y="88"/>
      <point x="82" y="235" type="curve" smooth="yes"/>
      <point x="82" y="261"/>
      <point x="85" y="303"/>
      <point x="91" y="335" type="curve" smooth="yes"/>
      <point x="102" y="394" type="line" smooth="yes"/>
      <point x="134" y="568"/>
      <point x="235" y="690"/>
      <point x="393" y="690" type="curve" smooth="yes"/>
      <point x="437" y="690"/>
      <point x="488" y="684"/>
      <point x="515" y="677" type="curve"/>
      <point x="383" y="22" type="line"/>
      <point x="351" y="8"/>
      <point x="306" y="8"/>
    </contour>
    <contour>
      <point x="390.0" y="0.0" type="move" name="bottom"/>
    </contour>
    <contour>
      <point x="529.0" y="698.0" type="move" name="top"/>
    </contour>
  </outline>
</glyph>
