<?xml version="1.0" encoding="UTF-8"?>
<glyph name="Abrevegrave" format="1">
  <advance width="590"/>
  <unicode hex="1EB0"/>
  <outline>
    <component base="A"/>
    <component base="brevegrave.case" xOffset="385"/>
    <contour>
      <point x="256.0" y="0.0" type="move" name="bottom"/>
    </contour>
    <contour>
      <point x="526.0" y="0.0" type="move" name="bottomright"/>
    </contour>
  </outline>
  <lib>
    <dict>
      <key>com.type-invaders.name.final</key>
      <string>uni1EB0</string>
      <key>com.type-invaders.name.production</key>
      <string>Abrevegrave</string>
      <key>com.typemytype.robofont.mark</key>
      <array>
        <real>0.6</real>
        <real>0.986</real>
        <real>1.0</real>
        <real>1.0</real>
      </array>
    </dict>
  </lib>
</glyph>
