<?xml version="1.0" encoding="UTF-8"?>
<glyph name="ccedilla" format="1">
  <advance width="432"/>
  <unicode hex="00E7"/>
  <outline>
    <contour>
      <point x="275" y="518" type="curve" smooth="yes" name=""/>
      <point x="163" y="518"/>
      <point x="89" y="419"/>
      <point x="63" y="288" type="curve" smooth="yes"/>
      <point x="56" y="253"/>
      <point x="52" y="215"/>
      <point x="52" y="176" type="curve" smooth="yes"/>
      <point x="52" y="75"/>
      <point x="95" y="-1"/>
      <point x="185" y="-11" type="curve"/>
      <point x="156" y="-84" type="line"/>
      <point x="190" y="-86" type="line" smooth="yes"/>
      <point x="225" y="-88"/>
      <point x="237" y="-104"/>
      <point x="237" y="-128" type="curve" smooth="yes"/>
      <point x="237" y="-164"/>
      <point x="209" y="-184"/>
      <point x="173" y="-184" type="curve" smooth="yes"/>
      <point x="147" y="-184"/>
      <point x="128" y="-174"/>
      <point x="116" y="-157" type="curve"/>
      <point x="102" y="-170" type="line"/>
      <point x="111" y="-187"/>
      <point x="138" y="-202"/>
      <point x="173" y="-202" type="curve" smooth="yes"/>
      <point x="223" y="-202"/>
      <point x="257" y="-171"/>
      <point x="257" y="-127" type="curve" smooth="yes"/>
      <point x="257" y="-93"/>
      <point x="238" y="-72"/>
      <point x="205" y="-72" type="curve" smooth="yes"/>
      <point x="198" y="-72"/>
      <point x="188" y="-73"/>
      <point x="181" y="-75" type="curve"/>
      <point x="179" y="-73" type="line"/>
      <point x="203" y="-12" type="line"/>
      <point x="206" y="-12" type="line" smooth="yes"/>
      <point x="285" y="-12"/>
      <point x="330" y="37"/>
      <point x="376" y="115" type="curve"/>
      <point x="359" y="124" type="line"/>
      <point x="319" y="51"/>
      <point x="275" y="7"/>
      <point x="206" y="7" type="curve" smooth="yes"/>
      <point x="109" y="7"/>
      <point x="72" y="83"/>
      <point x="72" y="176" type="curve" smooth="yes"/>
      <point x="72" y="196"/>
      <point x="74" y="227"/>
      <point x="79" y="252" type="curve" smooth="yes"/>
      <point x="89" y="302" type="line" smooth="yes"/>
      <point x="114" y="425"/>
      <point x="181" y="499"/>
      <point x="273" y="499" type="curve" smooth="yes"/>
      <point x="335" y="499"/>
      <point x="377" y="463"/>
      <point x="390" y="398" type="curve"/>
      <point x="409" y="403" type="line"/>
      <point x="397" y="471"/>
      <point x="349" y="518"/>
    </contour>
    <contour>
      <point x="296.0" y="540.0" type="move" name="top"/>
    </contour>
  </outline>
</glyph>
