<?xml version="1.0" encoding="UTF-8"?>
<glyph name="ecircumflexgrave" format="1">
  <advance width="480"/>
  <unicode hex="1EC1"/>
  <outline>
    <component base="e"/>
    <component base="circumflexgrave" xOffset="242"/>
    <contour>
      <point x="245.0" y="0.0" type="move" name="bottom"/>
    </contour>
    <contour>
      <point x="316.0" y="0.0" type="move" name="bottomright"/>
    </contour>
  </outline>
  <lib>
    <dict>
      <key>com.type-invaders.name.final</key>
      <string>uni1EC1</string>
      <key>com.type-invaders.name.production</key>
      <string>ecircumflexgrave</string>
      <key>com.typemytype.robofont.mark</key>
      <array>
        <real>0.6</real>
        <real>0.986</real>
        <real>1.0</real>
        <real>1.0</real>
      </array>
    </dict>
  </lib>
</glyph>
