<?xml version="1.0" encoding="UTF-8"?>
<glyph name="Tcommaaccent" format="1">
  <advance width="504"/>
  <unicode hex="021A"/>
  <outline>
    <component base="T"/>
    <component base="commabelowcomb" xOffset="252"/>
    <contour>
      <point x="252.0" y="698.0" type="move" name="top"/>
    </contour>
  </outline>
  <lib>
    <dict>
      <key>com.type-invaders.name.final</key>
      <string>uni021A</string>
      <key>com.type-invaders.name.production</key>
      <string>Tcommaaccent</string>
      <key>com.typemytype.robofont.mark</key>
      <array>
        <real>0.6</real>
        <real>0.986</real>
        <real>1.0</real>
        <real>1.0</real>
      </array>
    </dict>
  </lib>
</glyph>
