<?xml version="1.0" encoding="UTF-8"?>
<glyph name="O" format="1">
  <advance width="679"/>
  <unicode hex="004F"/>
  <outline>
    <contour>
      <point x="298" y="-12" type="curve" smooth="yes"/>
      <point x="479" y="-12"/>
      <point x="601" y="134"/>
      <point x="639" y="314" type="curve" smooth="yes"/>
      <point x="648" y="354"/>
      <point x="652" y="396"/>
      <point x="652" y="438" type="curve" smooth="yes"/>
      <point x="652" y="614"/>
      <point x="548" y="710"/>
      <point x="409" y="710" type="curve" smooth="yes" name=""/>
      <point x="228" y="710"/>
      <point x="106" y="564"/>
      <point x="68" y="384" type="curve" smooth="yes"/>
      <point x="59" y="344"/>
      <point x="55" y="302"/>
      <point x="55" y="260" type="curve" smooth="yes"/>
      <point x="55" y="84"/>
      <point x="159" y="-12"/>
    </contour>
    <contour>
      <point x="306" y="61" type="curve" smooth="yes"/>
      <point x="198" y="61"/>
      <point x="135" y="130"/>
      <point x="135" y="236" type="curve" smooth="yes"/>
      <point x="135" y="256"/>
      <point x="137" y="280"/>
      <point x="142" y="305" type="curve" smooth="yes"/>
      <point x="162" y="405" type="line" smooth="yes"/>
      <point x="191" y="550"/>
      <point x="278" y="637"/>
      <point x="401" y="637" type="curve" smooth="yes"/>
      <point x="509" y="637"/>
      <point x="572" y="568"/>
      <point x="572" y="462" type="curve" smooth="yes"/>
      <point x="572" y="442"/>
      <point x="570" y="418"/>
      <point x="565" y="393" type="curve" smooth="yes"/>
      <point x="545" y="293" type="line" smooth="yes"/>
      <point x="516" y="148"/>
      <point x="429" y="61"/>
    </contour>
    <contour>
      <point x="289.0" y="0.0" type="move" name="bottom"/>
    </contour>
    <contour>
      <point x="405.0" y="698.0" type="move" name="top"/>
    </contour>
  </outline>
  <lib>
    <dict>
      <key>com.typemytype.robofont.layerData</key>
      <dict>
        <key>IBM Plex Sans-Italic-38-eW</key>
        <dict>
          <key>anchors</key>
          <array>
            <dict>
              <key>name</key>
              <string>bottom</string>
              <key>x</key>
              <real>289.0</real>
              <key>y</key>
              <real>0.0</real>
            </dict>
            <dict>
              <key>name</key>
              <string>top</string>
              <key>x</key>
              <real>405.0</real>
              <key>y</key>
              <real>698.0</real>
            </dict>
          </array>
          <key>components</key>
          <array>
          </array>
          <key>contours</key>
          <array>
            <dict>
              <key>points</key>
              <array>
                <dict>
                  <key>name</key>
                  <string>hr00</string>
                  <key>segmentType</key>
                  <string>curve</string>
                  <key>smooth</key>
                  <true/>
                  <key>x</key>
                  <integer>298</integer>
                  <key>y</key>
                  <integer>-12</integer>
                </dict>
                <dict>
                  <key>smooth</key>
                  <false/>
                  <key>x</key>
                  <integer>519</integer>
                  <key>y</key>
                  <integer>-12</integer>
                </dict>
                <dict>
                  <key>smooth</key>
                  <false/>
                  <key>x</key>
                  <integer>652</integer>
                  <key>y</key>
                  <integer>207</integer>
                </dict>
                <dict>
                  <key>segmentType</key>
                  <string>curve</string>
                  <key>smooth</key>
                  <true/>
                  <key>x</key>
                  <integer>652</integer>
                  <key>y</key>
                  <integer>438</integer>
                </dict>
                <dict>
                  <key>smooth</key>
                  <false/>
                  <key>x</key>
                  <integer>652</integer>
                  <key>y</key>
                  <integer>614</integer>
                </dict>
                <dict>
                  <key>smooth</key>
                  <false/>
                  <key>x</key>
                  <integer>548</integer>
                  <key>y</key>
                  <integer>710</integer>
                </dict>
                <dict>
                  <key>segmentType</key>
                  <string>curve</string>
                  <key>smooth</key>
                  <true/>
                  <key>x</key>
                  <integer>409</integer>
                  <key>y</key>
                  <integer>710</integer>
                </dict>
                <dict>
                  <key>smooth</key>
                  <false/>
                  <key>x</key>
                  <integer>188</integer>
                  <key>y</key>
                  <integer>710</integer>
                </dict>
                <dict>
                  <key>smooth</key>
                  <false/>
                  <key>x</key>
                  <integer>55</integer>
                  <key>y</key>
                  <integer>491</integer>
                </dict>
                <dict>
                  <key>segmentType</key>
                  <string>curve</string>
                  <key>smooth</key>
                  <true/>
                  <key>x</key>
                  <integer>55</integer>
                  <key>y</key>
                  <integer>260</integer>
                </dict>
                <dict>
                  <key>smooth</key>
                  <false/>
                  <key>x</key>
                  <integer>55</integer>
                  <key>y</key>
                  <integer>84</integer>
                </dict>
                <dict>
                  <key>smooth</key>
                  <false/>
                  <key>x</key>
                  <integer>159</integer>
                  <key>y</key>
                  <integer>-12</integer>
                </dict>
              </array>
            </dict>
            <dict>
              <key>points</key>
              <array>
                <dict>
                  <key>segmentType</key>
                  <string>curve</string>
                  <key>smooth</key>
                  <true/>
                  <key>x</key>
                  <integer>306</integer>
                  <key>y</key>
                  <integer>61</integer>
                </dict>
                <dict>
                  <key>smooth</key>
                  <false/>
                  <key>x</key>
                  <integer>198</integer>
                  <key>y</key>
                  <integer>61</integer>
                </dict>
                <dict>
                  <key>smooth</key>
                  <false/>
                  <key>x</key>
                  <integer>135</integer>
                  <key>y</key>
                  <integer>130</integer>
                </dict>
                <dict>
                  <key>segmentType</key>
                  <string>curve</string>
                  <key>smooth</key>
                  <true/>
                  <key>x</key>
                  <integer>135</integer>
                  <key>y</key>
                  <integer>236</integer>
                </dict>
                <dict>
                  <key>smooth</key>
                  <false/>
                  <key>x</key>
                  <integer>135</integer>
                  <key>y</key>
                  <integer>256</integer>
                </dict>
                <dict>
                  <key>smooth</key>
                  <false/>
                  <key>x</key>
                  <integer>137</integer>
                  <key>y</key>
                  <integer>280</integer>
                </dict>
                <dict>
                  <key>segmentType</key>
                  <string>curve</string>
                  <key>smooth</key>
                  <true/>
                  <key>x</key>
                  <integer>142</integer>
                  <key>y</key>
                  <integer>305</integer>
                </dict>
                <dict>
                  <key>segmentType</key>
                  <string>line</string>
                  <key>smooth</key>
                  <true/>
                  <key>x</key>
                  <integer>162</integer>
                  <key>y</key>
                  <integer>405</integer>
                </dict>
                <dict>
                  <key>smooth</key>
                  <false/>
                  <key>x</key>
                  <integer>191</integer>
                  <key>y</key>
                  <integer>550</integer>
                </dict>
                <dict>
                  <key>smooth</key>
                  <false/>
                  <key>x</key>
                  <integer>278</integer>
                  <key>y</key>
                  <integer>637</integer>
                </dict>
                <dict>
                  <key>segmentType</key>
                  <string>curve</string>
                  <key>smooth</key>
                  <true/>
                  <key>x</key>
                  <integer>401</integer>
                  <key>y</key>
                  <integer>637</integer>
                </dict>
                <dict>
                  <key>smooth</key>
                  <false/>
                  <key>x</key>
                  <integer>509</integer>
                  <key>y</key>
                  <integer>637</integer>
                </dict>
                <dict>
                  <key>smooth</key>
                  <false/>
                  <key>x</key>
                  <integer>572</integer>
                  <key>y</key>
                  <integer>568</integer>
                </dict>
                <dict>
                  <key>segmentType</key>
                  <string>curve</string>
                  <key>smooth</key>
                  <true/>
                  <key>x</key>
                  <integer>572</integer>
                  <key>y</key>
                  <integer>462</integer>
                </dict>
                <dict>
                  <key>smooth</key>
                  <false/>
                  <key>x</key>
                  <integer>572</integer>
                  <key>y</key>
                  <integer>442</integer>
                </dict>
                <dict>
                  <key>smooth</key>
                  <false/>
                  <key>x</key>
                  <integer>570</integer>
                  <key>y</key>
                  <integer>418</integer>
                </dict>
                <dict>
                  <key>segmentType</key>
                  <string>curve</string>
                  <key>smooth</key>
                  <true/>
                  <key>x</key>
                  <integer>565</integer>
                  <key>y</key>
                  <integer>393</integer>
                </dict>
                <dict>
                  <key>segmentType</key>
                  <string>line</string>
                  <key>smooth</key>
                  <true/>
                  <key>x</key>
                  <integer>545</integer>
                  <key>y</key>
                  <integer>293</integer>
                </dict>
                <dict>
                  <key>smooth</key>
                  <false/>
                  <key>x</key>
                  <integer>516</integer>
                  <key>y</key>
                  <integer>148</integer>
                </dict>
                <dict>
                  <key>smooth</key>
                  <false/>
                  <key>x</key>
                  <integer>429</integer>
                  <key>y</key>
                  <integer>61</integer>
                </dict>
              </array>
            </dict>
          </array>
          <key>lib</key>
          <dict>
          </dict>
          <key>name</key>
          <string>O</string>
          <key>unicodes</key>
          <array>
          </array>
          <key>width</key>
          <integer>679</integer>
        </dict>
      </dict>
    </dict>
  </lib>
</glyph>
