<?xml version="1.0" encoding="UTF-8"?>
<glyph name="ocircumflextilde" format="1">
  <advance width="540"/>
  <unicode hex="1ED7"/>
  <outline>
    <component base="o"/>
    <component base="circumflextilde" xOffset="270"/>
    <contour>
      <point x="270.0" y="0.0" type="move" name="bottom"/>
    </contour>
  </outline>
  <lib>
    <dict>
      <key>com.type-invaders.name.final</key>
      <string>uni1ED7</string>
      <key>com.type-invaders.name.production</key>
      <string>ocircumflextilde</string>
      <key>com.typemytype.robofont.mark</key>
      <array>
        <real>0.6</real>
        <real>0.986</real>
        <real>1.0</real>
        <real>1.0</real>
      </array>
    </dict>
  </lib>
</glyph>
