<?xml version="1.0" encoding="UTF-8"?>
<glyph name="acircumflexdotbelow.alt01" format="1">
  <advance width="524"/>
  <outline>
    <component base="a.alt01"/>
    <component base="circumflex" xOffset="-18"/>
    <component base="dotbelowcomb" xOffset="230"/>
    <contour>
      <point x="448.0" y="0.0" type="move" name="bottomright"/>
    </contour>
  </outline>
  <lib>
    <dict>
      <key>com.type-invaders.name.final</key>
      <string>uni1EAD.alt01</string>
      <key>com.type-invaders.name.production</key>
      <string>acircumflexdotbelow.alt01</string>
      <key>com.typemytype.robofont.mark</key>
      <array>
        <real>0.6</real>
        <real>0.986</real>
        <real>1.0</real>
        <real>1.0</real>
      </array>
    </dict>
  </lib>
</glyph>
