<?xml version="1.0" encoding="UTF-8"?>
<glyph name="Ocaron" format="1">
  <advance width="614"/>
  <unicode hex="01D1"/>
  <outline>
    <component base="O"/>
    <component base="caron.case" xOffset="37"/>
    <contour>
      <point x="307.0" y="0.0" type="move" name="bottom"/>
    </contour>
  </outline>
  <lib>
    <dict>
      <key>com.type-invaders.name.final</key>
      <string>uni01D1</string>
      <key>com.type-invaders.name.production</key>
      <string>Ocaron</string>
      <key>com.typemytype.robofont.mark</key>
      <array>
        <real>0.6</real>
        <real>0.986</real>
        <real>1.0</real>
        <real>1.0</real>
      </array>
    </dict>
  </lib>
</glyph>
