<?xml version="1.0" encoding="UTF-8"?>
<glyph name="a" format="1">
  <advance width="483"/>
  <unicode hex="0061"/>
  <outline>
    <contour>
      <point x="456" y="0" type="line"/>
      <point x="456" y="67" type="line"/>
      <point x="404" y="67" type="line"/>
      <point x="404" y="359" type="line" smooth="yes"/>
      <point x="404" y="469"/>
      <point x="341" y="527"/>
      <point x="225" y="527" type="curve" smooth="yes"/>
      <point x="146" y="527"/>
      <point x="84" y="483"/>
      <point x="57" y="428" type="curve"/>
      <point x="102" y="386" type="line"/>
      <point x="128" y="435"/>
      <point x="163" y="462"/>
      <point x="222" y="462" type="curve" smooth="yes"/>
      <point x="295" y="462"/>
      <point x="328" y="427"/>
      <point x="328" y="351" type="curve" smooth="yes"/>
      <point x="328" y="294" type="line"/>
      <point x="235" y="294" type="line" smooth="yes"/>
      <point x="101" y="294"/>
      <point x="39" y="234"/>
      <point x="39" y="138" type="curve" smooth="yes"/>
      <point x="39" y="40"/>
      <point x="88" y="-12"/>
      <point x="188" y="-12" type="curve" smooth="yes" name=""/>
      <point x="251" y="-12"/>
      <point x="301" y="22"/>
      <point x="318" y="84" type="curve"/>
      <point x="338" y="84" type="line"/>
      <point x="328" y="94" type="line"/>
      <point x="328" y="74" type="line" smooth="yes"/>
      <point x="328" y="26"/>
      <point x="354" y="0"/>
      <point x="402" y="0" type="curve" smooth="yes" name=""/>
    </contour>
    <contour>
      <point x="328" y="236" type="line"/>
      <point x="328" y="158" type="line" smooth="yes"/>
      <point x="328" y="105"/>
      <point x="277" y="54"/>
      <point x="207" y="54" type="curve" smooth="yes" name=""/>
      <point x="153" y="54"/>
      <point x="118" y="78"/>
      <point x="118" y="130" type="curve" smooth="yes"/>
      <point x="118" y="158" type="line" smooth="yes"/>
      <point x="118" y="208"/>
      <point x="153" y="236"/>
      <point x="233" y="236" type="curve" smooth="yes"/>
    </contour>
    <contour>
      <point x="222.0" y="0.0" type="move" name="bottom"/>
    </contour>
    <contour>
      <point x="457.0" y="0.0" type="move" name="bottomright"/>
    </contour>
    <contour>
      <point x="228.0" y="540.0" type="move" name="top"/>
    </contour>
  </outline>
  <lib>
    <dict>
      <key>com.typemytype.robofont.layerData</key>
      <dict>
        <key>IBM Plex Sans Condensed-Regular-43-eW</key>
        <dict>
          <key>anchors</key>
          <array>
            <dict>
              <key>name</key>
              <string>bottom</string>
              <key>x</key>
              <real>222.0</real>
              <key>y</key>
              <real>0.0</real>
            </dict>
            <dict>
              <key>name</key>
              <string>bottomright</string>
              <key>x</key>
              <real>457.0</real>
              <key>y</key>
              <real>0.0</real>
            </dict>
            <dict>
              <key>name</key>
              <string>top</string>
              <key>x</key>
              <real>228.0</real>
              <key>y</key>
              <real>540.0</real>
            </dict>
            <dict>
              <key>name</key>
              <string>mark0</string>
              <key>x</key>
              <real>222.0</real>
              <key>y</key>
              <real>0.0</real>
            </dict>
            <dict>
              <key>name</key>
              <string>mark0</string>
              <key>x</key>
              <real>457.0</real>
              <key>y</key>
              <real>0.0</real>
            </dict>
            <dict>
              <key>name</key>
              <string>mark0</string>
              <key>x</key>
              <real>228.0</real>
              <key>y</key>
              <real>540.0</real>
            </dict>
            <dict>
              <key>name</key>
              <string>mark0</string>
              <key>x</key>
              <real>222.0</real>
              <key>y</key>
              <real>0.0</real>
            </dict>
            <dict>
              <key>name</key>
              <string>mark0</string>
              <key>x</key>
              <real>457.0</real>
              <key>y</key>
              <real>0.0</real>
            </dict>
            <dict>
              <key>name</key>
              <string>mark0</string>
              <key>x</key>
              <real>228.0</real>
              <key>y</key>
              <real>540.0</real>
            </dict>
          </array>
          <key>components</key>
          <array>
          </array>
          <key>contours</key>
          <array>
            <dict>
              <key>points</key>
              <array>
                <dict>
                  <key>segmentType</key>
                  <string>line</string>
                  <key>smooth</key>
                  <false/>
                  <key>x</key>
                  <integer>456</integer>
                  <key>y</key>
                  <integer>0</integer>
                </dict>
                <dict>
                  <key>segmentType</key>
                  <string>line</string>
                  <key>smooth</key>
                  <false/>
                  <key>x</key>
                  <integer>456</integer>
                  <key>y</key>
                  <integer>67</integer>
                </dict>
                <dict>
                  <key>segmentType</key>
                  <string>line</string>
                  <key>smooth</key>
                  <false/>
                  <key>x</key>
                  <integer>404</integer>
                  <key>y</key>
                  <integer>67</integer>
                </dict>
                <dict>
                  <key>segmentType</key>
                  <string>line</string>
                  <key>smooth</key>
                  <true/>
                  <key>x</key>
                  <integer>404</integer>
                  <key>y</key>
                  <integer>359</integer>
                </dict>
                <dict>
                  <key>smooth</key>
                  <false/>
                  <key>x</key>
                  <integer>404</integer>
                  <key>y</key>
                  <integer>469</integer>
                </dict>
                <dict>
                  <key>smooth</key>
                  <false/>
                  <key>x</key>
                  <integer>341</integer>
                  <key>y</key>
                  <integer>527</integer>
                </dict>
                <dict>
                  <key>segmentType</key>
                  <string>curve</string>
                  <key>smooth</key>
                  <true/>
                  <key>x</key>
                  <integer>225</integer>
                  <key>y</key>
                  <integer>527</integer>
                </dict>
                <dict>
                  <key>smooth</key>
                  <false/>
                  <key>x</key>
                  <integer>146</integer>
                  <key>y</key>
                  <integer>527</integer>
                </dict>
                <dict>
                  <key>smooth</key>
                  <false/>
                  <key>x</key>
                  <integer>84</integer>
                  <key>y</key>
                  <integer>483</integer>
                </dict>
                <dict>
                  <key>segmentType</key>
                  <string>curve</string>
                  <key>smooth</key>
                  <false/>
                  <key>x</key>
                  <integer>57</integer>
                  <key>y</key>
                  <integer>428</integer>
                </dict>
                <dict>
                  <key>segmentType</key>
                  <string>line</string>
                  <key>smooth</key>
                  <false/>
                  <key>x</key>
                  <integer>102</integer>
                  <key>y</key>
                  <integer>386</integer>
                </dict>
                <dict>
                  <key>smooth</key>
                  <false/>
                  <key>x</key>
                  <integer>128</integer>
                  <key>y</key>
                  <integer>435</integer>
                </dict>
                <dict>
                  <key>smooth</key>
                  <false/>
                  <key>x</key>
                  <integer>163</integer>
                  <key>y</key>
                  <integer>462</integer>
                </dict>
                <dict>
                  <key>segmentType</key>
                  <string>curve</string>
                  <key>smooth</key>
                  <true/>
                  <key>x</key>
                  <integer>222</integer>
                  <key>y</key>
                  <integer>462</integer>
                </dict>
                <dict>
                  <key>smooth</key>
                  <false/>
                  <key>x</key>
                  <integer>295</integer>
                  <key>y</key>
                  <integer>462</integer>
                </dict>
                <dict>
                  <key>smooth</key>
                  <false/>
                  <key>x</key>
                  <integer>328</integer>
                  <key>y</key>
                  <integer>427</integer>
                </dict>
                <dict>
                  <key>segmentType</key>
                  <string>curve</string>
                  <key>smooth</key>
                  <true/>
                  <key>x</key>
                  <integer>328</integer>
                  <key>y</key>
                  <integer>351</integer>
                </dict>
                <dict>
                  <key>segmentType</key>
                  <string>line</string>
                  <key>smooth</key>
                  <false/>
                  <key>x</key>
                  <integer>328</integer>
                  <key>y</key>
                  <integer>294</integer>
                </dict>
                <dict>
                  <key>segmentType</key>
                  <string>line</string>
                  <key>smooth</key>
                  <true/>
                  <key>x</key>
                  <integer>235</integer>
                  <key>y</key>
                  <integer>294</integer>
                </dict>
                <dict>
                  <key>smooth</key>
                  <false/>
                  <key>x</key>
                  <integer>101</integer>
                  <key>y</key>
                  <integer>294</integer>
                </dict>
                <dict>
                  <key>smooth</key>
                  <false/>
                  <key>x</key>
                  <integer>39</integer>
                  <key>y</key>
                  <integer>234</integer>
                </dict>
                <dict>
                  <key>segmentType</key>
                  <string>curve</string>
                  <key>smooth</key>
                  <true/>
                  <key>x</key>
                  <integer>39</integer>
                  <key>y</key>
                  <integer>138</integer>
                </dict>
                <dict>
                  <key>smooth</key>
                  <false/>
                  <key>x</key>
                  <integer>39</integer>
                  <key>y</key>
                  <integer>40</integer>
                </dict>
                <dict>
                  <key>smooth</key>
                  <false/>
                  <key>x</key>
                  <integer>88</integer>
                  <key>y</key>
                  <integer>-12</integer>
                </dict>
                <dict>
                  <key>name</key>
                  <string>hr01</string>
                  <key>segmentType</key>
                  <string>curve</string>
                  <key>smooth</key>
                  <true/>
                  <key>x</key>
                  <integer>188</integer>
                  <key>y</key>
                  <integer>-12</integer>
                </dict>
                <dict>
                  <key>smooth</key>
                  <false/>
                  <key>x</key>
                  <integer>251</integer>
                  <key>y</key>
                  <integer>-12</integer>
                </dict>
                <dict>
                  <key>smooth</key>
                  <false/>
                  <key>x</key>
                  <integer>301</integer>
                  <key>y</key>
                  <integer>22</integer>
                </dict>
                <dict>
                  <key>segmentType</key>
                  <string>curve</string>
                  <key>smooth</key>
                  <false/>
                  <key>x</key>
                  <integer>318</integer>
                  <key>y</key>
                  <integer>84</integer>
                </dict>
                <dict>
                  <key>segmentType</key>
                  <string>line</string>
                  <key>smooth</key>
                  <false/>
                  <key>x</key>
                  <integer>328</integer>
                  <key>y</key>
                  <integer>84</integer>
                </dict>
                <dict>
                  <key>segmentType</key>
                  <string>line</string>
                  <key>smooth</key>
                  <true/>
                  <key>x</key>
                  <integer>328</integer>
                  <key>y</key>
                  <integer>74</integer>
                </dict>
                <dict>
                  <key>smooth</key>
                  <false/>
                  <key>x</key>
                  <integer>328</integer>
                  <key>y</key>
                  <integer>26</integer>
                </dict>
                <dict>
                  <key>smooth</key>
                  <false/>
                  <key>x</key>
                  <integer>354</integer>
                  <key>y</key>
                  <integer>0</integer>
                </dict>
                <dict>
                  <key>name</key>
                  <string>hr02</string>
                  <key>segmentType</key>
                  <string>curve</string>
                  <key>smooth</key>
                  <true/>
                  <key>x</key>
                  <integer>402</integer>
                  <key>y</key>
                  <integer>0</integer>
                </dict>
              </array>
            </dict>
            <dict>
              <key>points</key>
              <array>
                <dict>
                  <key>name</key>
                  <string>hr03</string>
                  <key>segmentType</key>
                  <string>curve</string>
                  <key>smooth</key>
                  <true/>
                  <key>x</key>
                  <integer>207</integer>
                  <key>y</key>
                  <integer>54</integer>
                </dict>
                <dict>
                  <key>smooth</key>
                  <false/>
                  <key>x</key>
                  <integer>153</integer>
                  <key>y</key>
                  <integer>54</integer>
                </dict>
                <dict>
                  <key>smooth</key>
                  <false/>
                  <key>x</key>
                  <integer>118</integer>
                  <key>y</key>
                  <integer>78</integer>
                </dict>
                <dict>
                  <key>segmentType</key>
                  <string>curve</string>
                  <key>smooth</key>
                  <true/>
                  <key>x</key>
                  <integer>118</integer>
                  <key>y</key>
                  <integer>130</integer>
                </dict>
                <dict>
                  <key>segmentType</key>
                  <string>line</string>
                  <key>smooth</key>
                  <true/>
                  <key>x</key>
                  <integer>118</integer>
                  <key>y</key>
                  <integer>158</integer>
                </dict>
                <dict>
                  <key>smooth</key>
                  <false/>
                  <key>x</key>
                  <integer>118</integer>
                  <key>y</key>
                  <integer>208</integer>
                </dict>
                <dict>
                  <key>smooth</key>
                  <false/>
                  <key>x</key>
                  <integer>153</integer>
                  <key>y</key>
                  <integer>236</integer>
                </dict>
                <dict>
                  <key>segmentType</key>
                  <string>curve</string>
                  <key>smooth</key>
                  <true/>
                  <key>x</key>
                  <integer>233</integer>
                  <key>y</key>
                  <integer>236</integer>
                </dict>
                <dict>
                  <key>segmentType</key>
                  <string>line</string>
                  <key>smooth</key>
                  <false/>
                  <key>x</key>
                  <integer>328</integer>
                  <key>y</key>
                  <integer>236</integer>
                </dict>
                <dict>
                  <key>segmentType</key>
                  <string>line</string>
                  <key>smooth</key>
                  <true/>
                  <key>x</key>
                  <integer>328</integer>
                  <key>y</key>
                  <integer>158</integer>
                </dict>
                <dict>
                  <key>smooth</key>
                  <false/>
                  <key>x</key>
                  <integer>328</integer>
                  <key>y</key>
                  <integer>105</integer>
                </dict>
                <dict>
                  <key>smooth</key>
                  <false/>
                  <key>x</key>
                  <integer>277</integer>
                  <key>y</key>
                  <integer>54</integer>
                </dict>
              </array>
            </dict>
          </array>
          <key>lib</key>
          <dict>
          </dict>
          <key>name</key>
          <string>a</string>
          <key>unicodes</key>
          <array>
          </array>
          <key>width</key>
          <integer>483</integer>
        </dict>
      </dict>
    </dict>
  </lib>
</glyph>
