<?xml version="1.0" encoding="UTF-8"?>
<glyph name="Eth" format="1">
  <advance width="755"/>
  <unicode hex="00D0"/>
  <outline>
    <component base="Dcroat"/>
    <contour>
      <point x="328.0" y="0.0" type="move" name="bottom"/>
    </contour>
    <contour>
      <point x="328.0" y="698.0" type="move" name="top"/>
    </contour>
  </outline>
  <lib>
    <dict>
      <key>com.typemytype.robofont.mark</key>
      <array>
        <real>0.6</real>
        <real>0.986</real>
        <real>1.0</real>
        <real>1.0</real>
      </array>
    </dict>
  </lib>
</glyph>
