<?xml version="1.0" encoding="UTF-8"?>
<glyph name="tugrik" format="1">
  <advance width="589"/>
  <unicode hex="20AE"/>
  <outline>
    <contour>
      <point x="487" y="265" type="line" name=""/>
      <point x="505" y="355" type="line"/>
      <point x="374" y="297" type="line"/>
      <point x="388" y="364" type="line"/>
      <point x="519" y="423" type="line"/>
      <point x="537" y="513" type="line"/>
      <point x="406" y="454" type="line"/>
      <point x="431" y="578" type="line"/>
      <point x="615" y="578" type="line"/>
      <point x="639" y="698" type="line"/>
      <point x="125" y="698" type="line"/>
      <point x="101" y="578" type="line"/>
      <point x="286" y="578" type="line"/>
      <point x="247" y="384" type="line"/>
      <point x="120" y="328" type="line"/>
      <point x="102" y="238" type="line"/>
      <point x="229" y="294" type="line"/>
      <point x="215" y="226" type="line"/>
      <point x="88" y="170" type="line"/>
      <point x="70" y="80" type="line"/>
      <point x="197" y="136" type="line"/>
      <point x="170" y="0" type="line"/>
      <point x="315" y="0" type="line"/>
      <point x="356" y="207" type="line"/>
    </contour>
  </outline>
  <lib>
    <dict>
      <key>com.type-invaders.name.final</key>
      <string>uni20AE</string>
      <key>com.type-invaders.name.production</key>
      <string>tugrik</string>
    </dict>
  </lib>
</glyph>
