<?xml version="1.0" encoding="UTF-8"?>
<glyph name="sixsuperior" format="1">
  <advance width="320"/>
  <unicode hex="2076"/>
  <outline>
    <contour>
      <point x="183" y="323" type="curve" smooth="yes" name=""/>
      <point x="274" y="323"/>
      <point x="323" y="381"/>
      <point x="323" y="462" type="curve" smooth="yes"/>
      <point x="323" y="521"/>
      <point x="298" y="559"/>
      <point x="236" y="559" type="curve" smooth="yes"/>
      <point x="192" y="559"/>
      <point x="172" y="541"/>
      <point x="154" y="509" type="curve"/>
      <point x="148" y="509" type="line"/>
      <point x="173" y="577"/>
      <point x="236" y="646"/>
      <point x="330" y="698" type="curve"/>
      <point x="247" y="698" type="line"/>
      <point x="175" y="659"/>
      <point x="97" y="564"/>
      <point x="81" y="477" type="curve" smooth="yes"/>
      <point x="78" y="460"/>
      <point x="75" y="441"/>
      <point x="75" y="422" type="curve" smooth="yes"/>
      <point x="75" y="360"/>
      <point x="111" y="323"/>
    </contour>
    <contour>
      <point x="189" y="368" type="curve" smooth="yes"/>
      <point x="149" y="368"/>
      <point x="133" y="387"/>
      <point x="133" y="417" type="curve" smooth="yes"/>
      <point x="133" y="430"/>
      <point x="136" y="446"/>
      <point x="138" y="456" type="curve" smooth="yes"/>
      <point x="147" y="502"/>
      <point x="177" y="515"/>
      <point x="210" y="515" type="curve" smooth="yes"/>
      <point x="250" y="515"/>
      <point x="266" y="496"/>
      <point x="266" y="466" type="curve" smooth="yes"/>
      <point x="266" y="453"/>
      <point x="263" y="437"/>
      <point x="261" y="427" type="curve" smooth="yes"/>
      <point x="252" y="381"/>
      <point x="222" y="368"/>
    </contour>
  </outline>
  <lib>
    <dict>
      <key>com.type-invaders.name.final</key>
      <string>uni2076</string>
      <key>com.type-invaders.name.production</key>
      <string>sixsuperior</string>
    </dict>
  </lib>
</glyph>
