<?xml version="1.0" encoding="UTF-8"?>
<glyph name="arrowleftdowncorner" format="1">
  <advance width="746"/>
  <unicode hex="2B10"/>
  <outline>
    <contour>
      <point x="205" y="101" type="line" name=""/>
      <point x="392" y="288" type="line"/>
      <point x="377" y="303" type="line"/>
      <point x="266" y="192" type="line"/>
      <point x="216" y="138" type="line"/>
      <point x="214" y="139" type="line"/>
      <point x="215" y="247" type="line"/>
      <point x="215" y="555" type="line"/>
      <point x="728" y="555" type="line"/>
      <point x="728" y="575" type="line"/>
      <point x="195" y="575" type="line"/>
      <point x="195" y="247" type="line"/>
      <point x="196" y="139" type="line"/>
      <point x="194" y="138" type="line"/>
      <point x="144" y="192" type="line"/>
      <point x="33" y="303" type="line"/>
      <point x="18" y="288" type="line"/>
    </contour>
  </outline>
  <lib>
    <dict>
      <key>com.type-invaders.name.final</key>
      <string>uni2B10</string>
      <key>com.type-invaders.name.production</key>
      <string>arrowleftdowncorner</string>
    </dict>
  </lib>
</glyph>
