<?xml version="1.0" encoding="UTF-8"?>
<glyph name="Icaron" format="1">
  <advance width="330"/>
  <unicode hex="01CF"/>
  <outline>
    <component base="I"/>
    <component base="caron.case" xOffset="-16"/>
    <contour>
      <point x="115.0" y="0.0" type="move" name="bottom"/>
    </contour>
    <contour>
      <point x="221.0" y="0.0" type="move" name="bottomright"/>
    </contour>
  </outline>
  <lib>
    <dict>
      <key>com.type-invaders.name.final</key>
      <string>uni01CF</string>
      <key>com.type-invaders.name.production</key>
      <string>Icaron</string>
      <key>com.typemytype.robofont.mark</key>
      <array>
        <real>0.6</real>
        <real>0.986</real>
        <real>1.0</real>
        <real>1.0</real>
      </array>
    </dict>
  </lib>
</glyph>
