<?xml version="1.0" encoding="UTF-8"?>
<glyph name="circumflexhook" format="1">
  <advance width="0"/>
  <outline>
    <contour>
      <point x="83" y="824" type="line" name=""/>
      <point x="203" y="824" type="line"/>
      <point x="133" y="715" type="line"/>
      <point x="173" y="692" type="line"/>
      <point x="198" y="723" type="line" smooth="yes"/>
      <point x="231" y="764"/>
      <point x="259" y="797"/>
      <point x="259" y="831" type="curve" smooth="yes"/>
      <point x="259" y="855"/>
      <point x="247" y="880"/>
      <point x="199" y="880" type="curve" smooth="yes"/>
      <point x="92" y="880" type="line"/>
    </contour>
    <contour>
      <point x="-9" y="745" type="line"/>
      <point x="-138" y="613" type="line"/>
      <point x="-97" y="581" type="line"/>
      <point x="33" y="693" type="line"/>
      <point x="128" y="581" type="line"/>
      <point x="169" y="613" type="line"/>
      <point x="85" y="745" type="line"/>
    </contour>
    <contour>
      <point x="0.0" y="540.0" type="move" name="_top"/>
    </contour>
  </outline>
</glyph>
