<?xml version="1.0" encoding="UTF-8"?>
<glyph name="acircumflexacute.alt01" format="1">
  <advance width="580"/>
  <outline>
    <component base="a.alt01"/>
    <component base="circumflexacute" xOffset="278"/>
    <contour>
      <point x="279.0" y="0.0" type="move" name="bottom"/>
    </contour>
    <contour>
      <point x="495.0" y="0.0" type="move" name="bottomright"/>
    </contour>
  </outline>
  <lib>
    <dict>
      <key>com.type-invaders.name.final</key>
      <string>uni1EA5.alt01</string>
      <key>com.type-invaders.name.production</key>
      <string>acircumflexacute.alt01</string>
      <key>com.typemytype.robofont.mark</key>
      <array>
        <real>0.6</real>
        <real>0.986</real>
        <real>1.0</real>
        <real>1.0</real>
      </array>
    </dict>
  </lib>
</glyph>
