<?xml version="1.0" encoding="UTF-8"?>
<glyph name="Ocircumflexhook" format="1">
  <advance width="695"/>
  <unicode hex="1ED4"/>
  <outline>
    <component base="O"/>
    <component base="circumflexhook.case" xOffset="439"/>
    <contour>
      <point x="300.0" y="0.0" type="move" name="bottom"/>
    </contour>
  </outline>
  <lib>
    <dict>
      <key>com.type-invaders.name.final</key>
      <string>uni1ED4</string>
      <key>com.type-invaders.name.production</key>
      <string>Ocircumflexhook</string>
      <key>com.typemytype.robofont.mark</key>
      <array>
        <real>0.6</real>
        <real>0.986</real>
        <real>1.0</real>
        <real>1.0</real>
      </array>
    </dict>
  </lib>
</glyph>
