<?xml version="1.0" encoding="UTF-8"?>
<glyph name="uni044F" format="1">
  <advance width="576"/>
  <outline>
    <contour>
      <point x="24" y="0" type="line"/>
      <point x="145" y="0" type="line"/>
      <point x="286" y="222" type="line"/>
      <point x="370" y="222" type="line"/>
      <point x="370" y="46" type="line"/>
      <point x="296" y="46" type="line"/>
      <point x="296" y="0" type="line"/>
      <point x="526" y="0" type="line"/>
      <point x="526" y="46" type="line"/>
      <point x="452" y="46" type="line"/>
      <point x="452" y="471" type="line"/>
      <point x="526" y="471" type="line"/>
      <point x="526" y="516" type="line"/>
      <point x="237" y="516" type="line" smooth="yes"/>
      <point x="129" y="516"/>
      <point x="75" y="449"/>
      <point x="75" y="369" type="curve" smooth="yes"/>
      <point x="75" y="291"/>
      <point x="138" y="239"/>
      <point x="233" y="235" type="curve"/>
      <point x="233" y="233" type="line"/>
      <point x="205" y="229"/>
      <point x="186" y="214"/>
      <point x="165" y="180" type="curve" smooth="yes"/>
      <point x="80" y="46" type="line"/>
      <point x="24" y="46" type="line"/>
    </contour>
    <contour>
      <point x="249" y="268" type="line" smooth="yes"/>
      <point x="197" y="268"/>
      <point x="164" y="303"/>
      <point x="164" y="355" type="curve" smooth="yes"/>
      <point x="164" y="380" type="line" smooth="yes"/>
      <point x="164" y="421"/>
      <point x="187" y="467"/>
      <point x="249" y="467" type="curve" smooth="yes" name=""/>
      <point x="370" y="467" type="line"/>
      <point x="370" y="268" type="line"/>
    </contour>
  </outline>
</glyph>
