<?xml version="1.0" encoding="UTF-8"?>
<glyph name="kasrasmall-ar" format="1">
  <advance width="0"/>
  <unicode hex="061A"/>
  <outline>
    <contour>
      <point x="168" y="456" type="line" name="hr00"/>
      <point x="0" y="379" type="line"/>
      <point x="8" y="361" type="line"/>
      <point x="176" y="438" type="line"/>
    </contour>
    <contour>
      <point x="88.0" y="543.0" type="move" name="_bottom"/>
    </contour>
    <contour>
      <point x="88.0" y="427.0" type="move" name="bottom"/>
    </contour>
  </outline>
</glyph>
