<?xml version="1.0" encoding="UTF-8"?>
<glyph name="naira" format="1">
  <advance width="776"/>
  <unicode hex="20A6"/>
  <outline>
    <contour>
      <point x="495" y="0" type="line" name=""/>
      <point x="670" y="0" type="line"/>
      <point x="670" y="228" type="line"/>
      <point x="759" y="228" type="line"/>
      <point x="759" y="318" type="line"/>
      <point x="670" y="318" type="line"/>
      <point x="670" y="386" type="line"/>
      <point x="759" y="386" type="line"/>
      <point x="759" y="476" type="line"/>
      <point x="670" y="476" type="line"/>
      <point x="670" y="698" type="line"/>
      <point x="539" y="698" type="line"/>
      <point x="539" y="476" type="line"/>
      <point x="391" y="476" type="line"/>
      <point x="279" y="698" type="line"/>
      <point x="105" y="698" type="line"/>
      <point x="105" y="476" type="line"/>
      <point x="17" y="476" type="line"/>
      <point x="17" y="386" type="line"/>
      <point x="105" y="386" type="line"/>
      <point x="105" y="318" type="line"/>
      <point x="17" y="318" type="line"/>
      <point x="17" y="228" type="line"/>
      <point x="105" y="228" type="line"/>
      <point x="105" y="0" type="line"/>
      <point x="238" y="0" type="line"/>
      <point x="238" y="228" type="line"/>
      <point x="381" y="228" type="line"/>
    </contour>
    <contour>
      <point x="238" y="314" type="line"/>
      <point x="238" y="403" type="line"/>
      <point x="238" y="514" type="line"/>
      <point x="241" y="514" type="line"/>
      <point x="295" y="403" type="line"/>
      <point x="338" y="314" type="line"/>
    </contour>
    <contour>
      <point x="435" y="390" type="line"/>
      <point x="539" y="390" type="line"/>
      <point x="539" y="295" type="line"/>
      <point x="539" y="184" type="line"/>
      <point x="536" y="184" type="line"/>
      <point x="482" y="295" type="line"/>
    </contour>
  </outline>
  <lib>
    <dict>
      <key>com.type-invaders.name.final</key>
      <string>uni20A6</string>
      <key>com.type-invaders.name.production</key>
      <string>naira</string>
      <key>com.typemytype.robofont.layerData</key>
      <dict>
        <key>IBM Plex Sans-Bold-39-eW</key>
        <dict>
          <key>anchors</key>
          <array>
          </array>
          <key>components</key>
          <array>
          </array>
          <key>contours</key>
          <array>
            <dict>
              <key>points</key>
              <array>
                <dict>
                  <key>name</key>
                  <string>hr00</string>
                  <key>segmentType</key>
                  <string>line</string>
                  <key>smooth</key>
                  <false/>
                  <key>x</key>
                  <integer>495</integer>
                  <key>y</key>
                  <integer>0</integer>
                </dict>
                <dict>
                  <key>segmentType</key>
                  <string>line</string>
                  <key>smooth</key>
                  <false/>
                  <key>x</key>
                  <integer>670</integer>
                  <key>y</key>
                  <integer>0</integer>
                </dict>
                <dict>
                  <key>segmentType</key>
                  <string>line</string>
                  <key>smooth</key>
                  <false/>
                  <key>x</key>
                  <integer>670</integer>
                  <key>y</key>
                  <integer>228</integer>
                </dict>
                <dict>
                  <key>segmentType</key>
                  <string>line</string>
                  <key>smooth</key>
                  <false/>
                  <key>x</key>
                  <integer>759</integer>
                  <key>y</key>
                  <integer>228</integer>
                </dict>
                <dict>
                  <key>segmentType</key>
                  <string>line</string>
                  <key>smooth</key>
                  <false/>
                  <key>x</key>
                  <integer>759</integer>
                  <key>y</key>
                  <integer>318</integer>
                </dict>
                <dict>
                  <key>segmentType</key>
                  <string>line</string>
                  <key>smooth</key>
                  <false/>
                  <key>x</key>
                  <integer>670</integer>
                  <key>y</key>
                  <integer>318</integer>
                </dict>
                <dict>
                  <key>segmentType</key>
                  <string>line</string>
                  <key>smooth</key>
                  <false/>
                  <key>x</key>
                  <integer>670</integer>
                  <key>y</key>
                  <integer>386</integer>
                </dict>
                <dict>
                  <key>segmentType</key>
                  <string>line</string>
                  <key>smooth</key>
                  <false/>
                  <key>x</key>
                  <integer>759</integer>
                  <key>y</key>
                  <integer>386</integer>
                </dict>
                <dict>
                  <key>segmentType</key>
                  <string>line</string>
                  <key>smooth</key>
                  <false/>
                  <key>x</key>
                  <integer>759</integer>
                  <key>y</key>
                  <integer>476</integer>
                </dict>
                <dict>
                  <key>segmentType</key>
                  <string>line</string>
                  <key>smooth</key>
                  <false/>
                  <key>x</key>
                  <integer>670</integer>
                  <key>y</key>
                  <integer>476</integer>
                </dict>
                <dict>
                  <key>segmentType</key>
                  <string>line</string>
                  <key>smooth</key>
                  <false/>
                  <key>x</key>
                  <integer>670</integer>
                  <key>y</key>
                  <integer>698</integer>
                </dict>
                <dict>
                  <key>segmentType</key>
                  <string>line</string>
                  <key>smooth</key>
                  <false/>
                  <key>x</key>
                  <integer>539</integer>
                  <key>y</key>
                  <integer>698</integer>
                </dict>
                <dict>
                  <key>segmentType</key>
                  <string>line</string>
                  <key>smooth</key>
                  <false/>
                  <key>x</key>
                  <integer>539</integer>
                  <key>y</key>
                  <integer>476</integer>
                </dict>
                <dict>
                  <key>segmentType</key>
                  <string>line</string>
                  <key>smooth</key>
                  <false/>
                  <key>x</key>
                  <integer>391</integer>
                  <key>y</key>
                  <integer>476</integer>
                </dict>
                <dict>
                  <key>segmentType</key>
                  <string>line</string>
                  <key>smooth</key>
                  <false/>
                  <key>x</key>
                  <integer>279</integer>
                  <key>y</key>
                  <integer>698</integer>
                </dict>
                <dict>
                  <key>segmentType</key>
                  <string>line</string>
                  <key>smooth</key>
                  <false/>
                  <key>x</key>
                  <integer>105</integer>
                  <key>y</key>
                  <integer>698</integer>
                </dict>
                <dict>
                  <key>segmentType</key>
                  <string>line</string>
                  <key>smooth</key>
                  <false/>
                  <key>x</key>
                  <integer>105</integer>
                  <key>y</key>
                  <integer>476</integer>
                </dict>
                <dict>
                  <key>segmentType</key>
                  <string>line</string>
                  <key>smooth</key>
                  <false/>
                  <key>x</key>
                  <integer>17</integer>
                  <key>y</key>
                  <integer>476</integer>
                </dict>
                <dict>
                  <key>segmentType</key>
                  <string>line</string>
                  <key>smooth</key>
                  <false/>
                  <key>x</key>
                  <integer>17</integer>
                  <key>y</key>
                  <integer>386</integer>
                </dict>
                <dict>
                  <key>segmentType</key>
                  <string>line</string>
                  <key>smooth</key>
                  <false/>
                  <key>x</key>
                  <integer>105</integer>
                  <key>y</key>
                  <integer>386</integer>
                </dict>
                <dict>
                  <key>segmentType</key>
                  <string>line</string>
                  <key>smooth</key>
                  <false/>
                  <key>x</key>
                  <integer>105</integer>
                  <key>y</key>
                  <integer>318</integer>
                </dict>
                <dict>
                  <key>segmentType</key>
                  <string>line</string>
                  <key>smooth</key>
                  <false/>
                  <key>x</key>
                  <integer>17</integer>
                  <key>y</key>
                  <integer>318</integer>
                </dict>
                <dict>
                  <key>segmentType</key>
                  <string>line</string>
                  <key>smooth</key>
                  <false/>
                  <key>x</key>
                  <integer>17</integer>
                  <key>y</key>
                  <integer>228</integer>
                </dict>
                <dict>
                  <key>segmentType</key>
                  <string>line</string>
                  <key>smooth</key>
                  <false/>
                  <key>x</key>
                  <integer>105</integer>
                  <key>y</key>
                  <integer>228</integer>
                </dict>
                <dict>
                  <key>segmentType</key>
                  <string>line</string>
                  <key>smooth</key>
                  <false/>
                  <key>x</key>
                  <integer>105</integer>
                  <key>y</key>
                  <integer>0</integer>
                </dict>
                <dict>
                  <key>segmentType</key>
                  <string>line</string>
                  <key>smooth</key>
                  <false/>
                  <key>x</key>
                  <integer>238</integer>
                  <key>y</key>
                  <integer>0</integer>
                </dict>
                <dict>
                  <key>segmentType</key>
                  <string>line</string>
                  <key>smooth</key>
                  <false/>
                  <key>x</key>
                  <integer>238</integer>
                  <key>y</key>
                  <integer>228</integer>
                </dict>
                <dict>
                  <key>segmentType</key>
                  <string>line</string>
                  <key>smooth</key>
                  <false/>
                  <key>x</key>
                  <integer>381</integer>
                  <key>y</key>
                  <integer>228</integer>
                </dict>
              </array>
            </dict>
            <dict>
              <key>points</key>
              <array>
                <dict>
                  <key>segmentType</key>
                  <string>line</string>
                  <key>smooth</key>
                  <false/>
                  <key>x</key>
                  <integer>238</integer>
                  <key>y</key>
                  <integer>314</integer>
                </dict>
                <dict>
                  <key>segmentType</key>
                  <string>line</string>
                  <key>smooth</key>
                  <false/>
                  <key>x</key>
                  <integer>238</integer>
                  <key>y</key>
                  <integer>514</integer>
                </dict>
                <dict>
                  <key>segmentType</key>
                  <string>line</string>
                  <key>smooth</key>
                  <false/>
                  <key>x</key>
                  <integer>241</integer>
                  <key>y</key>
                  <integer>514</integer>
                </dict>
                <dict>
                  <key>segmentType</key>
                  <string>line</string>
                  <key>smooth</key>
                  <false/>
                  <key>x</key>
                  <integer>338</integer>
                  <key>y</key>
                  <integer>314</integer>
                </dict>
              </array>
            </dict>
            <dict>
              <key>points</key>
              <array>
                <dict>
                  <key>segmentType</key>
                  <string>line</string>
                  <key>smooth</key>
                  <false/>
                  <key>x</key>
                  <integer>435</integer>
                  <key>y</key>
                  <integer>390</integer>
                </dict>
                <dict>
                  <key>segmentType</key>
                  <string>line</string>
                  <key>smooth</key>
                  <false/>
                  <key>x</key>
                  <integer>539</integer>
                  <key>y</key>
                  <integer>390</integer>
                </dict>
                <dict>
                  <key>segmentType</key>
                  <string>line</string>
                  <key>smooth</key>
                  <false/>
                  <key>x</key>
                  <integer>539</integer>
                  <key>y</key>
                  <integer>184</integer>
                </dict>
                <dict>
                  <key>segmentType</key>
                  <string>line</string>
                  <key>smooth</key>
                  <false/>
                  <key>x</key>
                  <integer>536</integer>
                  <key>y</key>
                  <integer>184</integer>
                </dict>
              </array>
            </dict>
          </array>
          <key>lib</key>
          <dict>
          </dict>
          <key>name</key>
          <string>naira</string>
          <key>unicodes</key>
          <array>
          </array>
          <key>width</key>
          <integer>776</integer>
        </dict>
      </dict>
    </dict>
  </lib>
</glyph>
