<?xml version="1.0" encoding="UTF-8"?>
<glyph name="hahTahbelow-ar" format="1">
  <advance width="591"/>
  <unicode hex="076E"/>
  <outline>
    <component base="hah-ar"/>
    <component base="tahcenter-ar" xOffset="188" yOffset="-478"/>
    <contour>
      <point x="332.0" y="-304.0" type="move" name="bottom"/>
    </contour>
    <contour>
      <point x="319.0" y="11.0" type="move" name="center"/>
    </contour>
    <contour>
      <point x="300.0" y="424.0" type="move" name="top"/>
    </contour>
  </outline>
  <lib>
    <dict>
      <key>com.typemytype.robofont.mark</key>
      <array>
        <real>0.6</real>
        <real>0.986</real>
        <real>1.0</real>
        <real>1.0</real>
      </array>
    </dict>
  </lib>
</glyph>
