<?xml version="1.0" encoding="UTF-8"?>
<glyph name="N" format="1">
  <advance width="692"/>
  <unicode hex="004E"/>
  <outline>
    <contour>
      <point x="552" y="0" type="line" name=""/>
      <point x="584" y="0" type="line"/>
      <point x="584" y="698" type="line"/>
      <point x="563" y="698" type="line"/>
      <point x="563" y="197" type="line"/>
      <point x="563" y="27" type="line"/>
      <point x="560" y="27" type="line"/>
      <point x="454" y="197" type="line"/>
      <point x="140" y="698" type="line"/>
      <point x="108" y="698" type="line"/>
      <point x="108" y="0" type="line"/>
      <point x="129" y="0" type="line"/>
      <point x="129" y="501" type="line"/>
      <point x="129" y="671" type="line"/>
      <point x="132" y="671" type="line"/>
      <point x="239" y="501" type="line"/>
    </contour>
    <contour>
      <point x="346.0" y="0.0" type="move" name="bottom"/>
    </contour>
    <contour>
      <point x="346.0" y="698.0" type="move" name="top"/>
    </contour>
  </outline>
  <lib>
    <dict>
      <key>com.typemytype.robofont.layerData</key>
      <dict>
        <key>IBM Plex Sans-Thin-37-eW</key>
        <dict>
          <key>anchors</key>
          <array>
            <dict>
              <key>name</key>
              <string>bottom</string>
              <key>x</key>
              <real>346.0</real>
              <key>y</key>
              <real>0.0</real>
            </dict>
            <dict>
              <key>name</key>
              <string>top</string>
              <key>x</key>
              <real>346.0</real>
              <key>y</key>
              <real>698.0</real>
            </dict>
          </array>
          <key>components</key>
          <array>
          </array>
          <key>contours</key>
          <array>
            <dict>
              <key>points</key>
              <array>
                <dict>
                  <key>name</key>
                  <string>hr00</string>
                  <key>segmentType</key>
                  <string>line</string>
                  <key>smooth</key>
                  <false/>
                  <key>x</key>
                  <integer>552</integer>
                  <key>y</key>
                  <integer>0</integer>
                </dict>
                <dict>
                  <key>segmentType</key>
                  <string>line</string>
                  <key>smooth</key>
                  <false/>
                  <key>x</key>
                  <integer>584</integer>
                  <key>y</key>
                  <integer>0</integer>
                </dict>
                <dict>
                  <key>segmentType</key>
                  <string>line</string>
                  <key>smooth</key>
                  <false/>
                  <key>x</key>
                  <integer>584</integer>
                  <key>y</key>
                  <integer>698</integer>
                </dict>
                <dict>
                  <key>segmentType</key>
                  <string>line</string>
                  <key>smooth</key>
                  <false/>
                  <key>x</key>
                  <integer>563</integer>
                  <key>y</key>
                  <integer>698</integer>
                </dict>
                <dict>
                  <key>segmentType</key>
                  <string>line</string>
                  <key>smooth</key>
                  <false/>
                  <key>x</key>
                  <integer>563</integer>
                  <key>y</key>
                  <integer>27</integer>
                </dict>
                <dict>
                  <key>segmentType</key>
                  <string>line</string>
                  <key>smooth</key>
                  <false/>
                  <key>x</key>
                  <integer>560</integer>
                  <key>y</key>
                  <integer>27</integer>
                </dict>
                <dict>
                  <key>segmentType</key>
                  <string>line</string>
                  <key>smooth</key>
                  <false/>
                  <key>x</key>
                  <integer>140</integer>
                  <key>y</key>
                  <integer>698</integer>
                </dict>
                <dict>
                  <key>segmentType</key>
                  <string>line</string>
                  <key>smooth</key>
                  <false/>
                  <key>x</key>
                  <integer>108</integer>
                  <key>y</key>
                  <integer>698</integer>
                </dict>
                <dict>
                  <key>segmentType</key>
                  <string>line</string>
                  <key>smooth</key>
                  <false/>
                  <key>x</key>
                  <integer>108</integer>
                  <key>y</key>
                  <integer>0</integer>
                </dict>
                <dict>
                  <key>segmentType</key>
                  <string>line</string>
                  <key>smooth</key>
                  <false/>
                  <key>x</key>
                  <integer>129</integer>
                  <key>y</key>
                  <integer>0</integer>
                </dict>
                <dict>
                  <key>segmentType</key>
                  <string>line</string>
                  <key>smooth</key>
                  <false/>
                  <key>x</key>
                  <integer>129</integer>
                  <key>y</key>
                  <integer>671</integer>
                </dict>
                <dict>
                  <key>segmentType</key>
                  <string>line</string>
                  <key>smooth</key>
                  <false/>
                  <key>x</key>
                  <integer>132</integer>
                  <key>y</key>
                  <integer>671</integer>
                </dict>
              </array>
            </dict>
          </array>
          <key>lib</key>
          <dict>
          </dict>
          <key>name</key>
          <string>N</string>
          <key>unicodes</key>
          <array>
          </array>
          <key>width</key>
          <integer>692</integer>
        </dict>
      </dict>
    </dict>
  </lib>
</glyph>
