<?xml version="1.0" encoding="UTF-8"?>
<glyph name="M" format="1">
  <advance width="730"/>
  <unicode hex="004D"/>
  <outline>
    <contour>
      <point x="82" y="0" type="line"/>
      <point x="160" y="0" type="line"/>
      <point x="160" y="479" type="line"/>
      <point x="153" y="597" type="line"/>
      <point x="163" y="597" type="line"/>
      <point x="215" y="479" type="line"/>
      <point x="365" y="171" type="line"/>
      <point x="515" y="479" type="line"/>
      <point x="567" y="599" type="line"/>
      <point x="577" y="599" type="line"/>
      <point x="570" y="479" type="line"/>
      <point x="570" y="0" type="line" name=""/>
      <point x="648" y="0" type="line"/>
      <point x="648" y="698" type="line"/>
      <point x="542" y="698" type="line"/>
      <point x="416" y="427" type="line"/>
      <point x="369" y="298" type="line"/>
      <point x="361" y="298" type="line"/>
      <point x="314" y="427" type="line"/>
      <point x="188" y="698" type="line"/>
      <point x="82" y="698" type="line"/>
    </contour>
    <contour>
      <point x="366.0" y="0.0" type="move" name="bottom"/>
    </contour>
    <contour>
      <point x="366.0" y="698.0" type="move" name="top"/>
    </contour>
  </outline>
</glyph>
