<?xml version="1.0" encoding="UTF-8"?>
<glyph name="qaf_yehHamzaabove-ar.rlig" format="1">
  <advance width="726"/>
  <outline>
    <component base="fehDotless_alefMaksura-ar.rlig"/>
    <component base="hamzaabove-ar" xOffset="5" yOffset="-98"/>
    <component base="twodotshorizontalabove-ar" xOffset="366" yOffset="341"/>
    <contour>
      <point x="627.0" y="-240.0" type="move" name="bottom_1"/>
    </contour>
    <contour>
      <point x="347.0" y="-240.0" type="move" name="bottom_2"/>
    </contour>
    <contour>
      <point x="495.0" y="811.0" type="move" name="top_1"/>
    </contour>
    <contour>
      <point x="118.0" y="437.0" type="move" name="top_2"/>
    </contour>
  </outline>
  <lib>
    <dict>
      <key>com.typemytype.robofont.mark</key>
      <array>
        <real>0.6</real>
        <real>0.986</real>
        <real>1.0</real>
        <real>1.0</real>
      </array>
    </dict>
  </lib>
</glyph>
