<?xml version="1.0" encoding="UTF-8"?>
<glyph name="arrowdownrightcorner" format="1">
  <advance width="900"/>
  <unicode hex="21B3"/>
  <outline>
    <contour>
      <point x="717" y="227" type="line" name=""/>
      <point x="478" y="466" type="line"/>
      <point x="398" y="386" type="line"/>
      <point x="458" y="326" type="line"/>
      <point x="502" y="288" type="line"/>
      <point x="501" y="284" type="line"/>
      <point x="421" y="288" type="line"/>
      <point x="306" y="288" type="line"/>
      <point x="306" y="698" type="line"/>
      <point x="184" y="698" type="line"/>
      <point x="184" y="166" type="line"/>
      <point x="421" y="166" type="line"/>
      <point x="501" y="170" type="line"/>
      <point x="502" y="166" type="line"/>
      <point x="458" y="128" type="line"/>
      <point x="398" y="68" type="line"/>
      <point x="478" y="-12" type="line"/>
    </contour>
  </outline>
  <lib>
    <dict>
      <key>com.type-invaders.name.final</key>
      <string>uni21B3</string>
      <key>com.type-invaders.name.production</key>
      <string>arrowdownrightcorner</string>
      <key>com.typemytype.robofont.layerData</key>
      <dict>
        <key>IBM Plex Sans-Bold Italic-40-eW</key>
        <dict>
          <key>anchors</key>
          <array>
          </array>
          <key>components</key>
          <array>
          </array>
          <key>contours</key>
          <array>
            <dict>
              <key>points</key>
              <array>
                <dict>
                  <key>name</key>
                  <string>hr00</string>
                  <key>segmentType</key>
                  <string>line</string>
                  <key>smooth</key>
                  <false/>
                  <key>x</key>
                  <integer>717</integer>
                  <key>y</key>
                  <integer>227</integer>
                </dict>
                <dict>
                  <key>segmentType</key>
                  <string>line</string>
                  <key>smooth</key>
                  <false/>
                  <key>x</key>
                  <integer>478</integer>
                  <key>y</key>
                  <integer>466</integer>
                </dict>
                <dict>
                  <key>segmentType</key>
                  <string>line</string>
                  <key>smooth</key>
                  <false/>
                  <key>x</key>
                  <integer>398</integer>
                  <key>y</key>
                  <integer>386</integer>
                </dict>
                <dict>
                  <key>segmentType</key>
                  <string>line</string>
                  <key>smooth</key>
                  <false/>
                  <key>x</key>
                  <integer>458</integer>
                  <key>y</key>
                  <integer>326</integer>
                </dict>
                <dict>
                  <key>segmentType</key>
                  <string>line</string>
                  <key>smooth</key>
                  <false/>
                  <key>x</key>
                  <integer>502</integer>
                  <key>y</key>
                  <integer>288</integer>
                </dict>
                <dict>
                  <key>segmentType</key>
                  <string>line</string>
                  <key>smooth</key>
                  <false/>
                  <key>x</key>
                  <integer>501</integer>
                  <key>y</key>
                  <integer>284</integer>
                </dict>
                <dict>
                  <key>segmentType</key>
                  <string>line</string>
                  <key>smooth</key>
                  <false/>
                  <key>x</key>
                  <integer>421</integer>
                  <key>y</key>
                  <integer>288</integer>
                </dict>
                <dict>
                  <key>segmentType</key>
                  <string>line</string>
                  <key>smooth</key>
                  <false/>
                  <key>x</key>
                  <integer>306</integer>
                  <key>y</key>
                  <integer>288</integer>
                </dict>
                <dict>
                  <key>segmentType</key>
                  <string>line</string>
                  <key>smooth</key>
                  <false/>
                  <key>x</key>
                  <integer>306</integer>
                  <key>y</key>
                  <integer>698</integer>
                </dict>
                <dict>
                  <key>segmentType</key>
                  <string>line</string>
                  <key>smooth</key>
                  <false/>
                  <key>x</key>
                  <integer>184</integer>
                  <key>y</key>
                  <integer>698</integer>
                </dict>
                <dict>
                  <key>segmentType</key>
                  <string>line</string>
                  <key>smooth</key>
                  <false/>
                  <key>x</key>
                  <integer>184</integer>
                  <key>y</key>
                  <integer>166</integer>
                </dict>
                <dict>
                  <key>segmentType</key>
                  <string>line</string>
                  <key>smooth</key>
                  <false/>
                  <key>x</key>
                  <integer>421</integer>
                  <key>y</key>
                  <integer>166</integer>
                </dict>
                <dict>
                  <key>segmentType</key>
                  <string>line</string>
                  <key>smooth</key>
                  <false/>
                  <key>x</key>
                  <integer>501</integer>
                  <key>y</key>
                  <integer>170</integer>
                </dict>
                <dict>
                  <key>segmentType</key>
                  <string>line</string>
                  <key>smooth</key>
                  <false/>
                  <key>x</key>
                  <integer>502</integer>
                  <key>y</key>
                  <integer>166</integer>
                </dict>
                <dict>
                  <key>segmentType</key>
                  <string>line</string>
                  <key>smooth</key>
                  <false/>
                  <key>x</key>
                  <integer>458</integer>
                  <key>y</key>
                  <integer>128</integer>
                </dict>
                <dict>
                  <key>segmentType</key>
                  <string>line</string>
                  <key>smooth</key>
                  <false/>
                  <key>x</key>
                  <integer>398</integer>
                  <key>y</key>
                  <integer>68</integer>
                </dict>
                <dict>
                  <key>segmentType</key>
                  <string>line</string>
                  <key>smooth</key>
                  <false/>
                  <key>x</key>
                  <integer>478</integer>
                  <key>y</key>
                  <integer>-12</integer>
                </dict>
              </array>
            </dict>
          </array>
          <key>lib</key>
          <dict>
          </dict>
          <key>name</key>
          <string>arrowdownrightcorner</string>
          <key>unicodes</key>
          <array>
          </array>
          <key>width</key>
          <integer>900</integer>
        </dict>
      </dict>
    </dict>
  </lib>
</glyph>
