<?xml version="1.0" encoding="UTF-8"?>
<glyph name="Iotadieresis" format="1">
  <advance width="314"/>
  <unicode hex="03AA"/>
  <outline>
    <component base="I"/>
    <component base="dieresis.case" xOffset="-34"/>
    <contour>
      <point x="92.0" y="0.0" type="move" name="bottom"/>
    </contour>
    <contour>
      <point x="206.0" y="0.0" type="move" name="bottomright"/>
    </contour>
  </outline>
  <lib>
    <dict>
      <key>com.typemytype.robofont.mark</key>
      <array>
        <real>0.6</real>
        <real>0.986</real>
        <real>1.0</real>
        <real>1.0</real>
      </array>
    </dict>
  </lib>
</glyph>
