<?xml version="1.0" encoding="UTF-8"?>
<glyph name="eightsuperior" format="1">
  <advance width="396"/>
  <unicode hex="2078"/>
  <outline>
    <contour>
      <point x="198" y="323" type="curve" smooth="yes"/>
      <point x="289" y="323"/>
      <point x="335" y="364"/>
      <point x="335" y="426" type="curve" smooth="yes"/>
      <point x="335" y="480"/>
      <point x="300" y="507"/>
      <point x="248" y="518" type="curve"/>
      <point x="248" y="521" type="line"/>
      <point x="303" y="535"/>
      <point x="321" y="573"/>
      <point x="321" y="610" type="curve" smooth="yes" name=""/>
      <point x="321" y="669"/>
      <point x="275" y="704"/>
      <point x="198" y="704" type="curve" smooth="yes"/>
      <point x="121" y="704"/>
      <point x="75" y="669"/>
      <point x="75" y="610" type="curve" smooth="yes"/>
      <point x="75" y="573"/>
      <point x="93" y="535"/>
      <point x="148" y="521" type="curve"/>
      <point x="148" y="518" type="line"/>
      <point x="96" y="507"/>
      <point x="61" y="480"/>
      <point x="61" y="426" type="curve" smooth="yes" name=""/>
      <point x="61" y="364"/>
      <point x="107" y="323"/>
    </contour>
    <contour>
      <point x="198" y="528" type="curve" smooth="yes"/>
      <point x="127" y="528"/>
      <point x="95" y="558"/>
      <point x="95" y="604" type="curve" smooth="yes" name=""/>
      <point x="95" y="611" type="line" smooth="yes"/>
      <point x="95" y="657"/>
      <point x="127" y="687"/>
      <point x="198" y="687" type="curve" smooth="yes"/>
      <point x="269" y="687"/>
      <point x="301" y="657"/>
      <point x="301" y="611" type="curve" smooth="yes"/>
      <point x="301" y="604" type="line" smooth="yes"/>
      <point x="301" y="558"/>
      <point x="269" y="528"/>
    </contour>
    <contour>
      <point x="198" y="340" type="curve" smooth="yes"/>
      <point x="122" y="340"/>
      <point x="81" y="370"/>
      <point x="81" y="421" type="curve" smooth="yes" name=""/>
      <point x="81" y="430" type="line" smooth="yes"/>
      <point x="81" y="481"/>
      <point x="122" y="511"/>
      <point x="198" y="511" type="curve" smooth="yes"/>
      <point x="274" y="511"/>
      <point x="315" y="481"/>
      <point x="315" y="430" type="curve" smooth="yes"/>
      <point x="315" y="421" type="line" smooth="yes"/>
      <point x="315" y="370"/>
      <point x="274" y="340"/>
    </contour>
  </outline>
  <lib>
    <dict>
      <key>com.type-invaders.name.final</key>
      <string>uni2078</string>
      <key>com.type-invaders.name.production</key>
      <string>eightsuperior</string>
    </dict>
  </lib>
</glyph>
