<?xml version="1.0" encoding="UTF-8"?>
<glyph name="caronslovak" format="1">
  <advance width="600"/>
  <unicode hex="02BC"/>
  <outline>
    <contour>
      <point x="300" y="740" type="line" name=""/>
      <point x="143" y="740" type="line"/>
      <point x="137" y="525" type="line"/>
      <point x="234" y="525" type="line"/>
    </contour>
    <contour>
      <point x="137.0" y="740.0" type="move" name="_topright"/>
    </contour>
  </outline>
  <lib>
    <dict>
      <key>com.type-invaders.name.final</key>
      <string>uni02BC</string>
      <key>com.type-invaders.name.production</key>
      <string>caronslovak</string>
    </dict>
  </lib>
</glyph>
