<?xml version="1.0" encoding="UTF-8"?>
<glyph name="gdotaccent" format="1">
  <advance width="474"/>
  <unicode hex="0121"/>
  <outline>
    <component base="g.alt02"/>
    <component base="dotaccent" xOffset="-33"/>
  </outline>
  <lib>
    <dict>
      <key>com.typemytype.robofont.mark</key>
      <array>
        <real>0.6</real>
        <real>0.986</real>
        <real>1.0</real>
        <real>1.0</real>
      </array>
    </dict>
  </lib>
</glyph>
