Division,WeightClassKg,Place,Name,Team,BodyweightKg,Best3SquatKg,Best3BenchKg,Best3DeadliftKg,TotalKg,Equipment,Event,Sex
Boys,55.79,1,Diego Rivera,Mexia,52.62,181.44,88.45,158.76,428.64,Single-ply,SBD,M
Boys,55.79,2,Omar Hernandez #3,Athens,53.98,127.01,86.18,170.1,383.29,Single-ply,SBD,M
Boys,55.79,3,Manuel Vazquez,Athens,55.34,124.74,77.11,124.74,326.59,Single-ply,SBD,M
Boys,55.79,4,Alex Rodriguez #9,Fairfield,55.79,136.08,63.5,127.01,326.59,Single-ply,SBD,M
Boys,55.79,5,Corbin Donoho,Corsicana Mildred,54.88,113.4,65.77,140.61,319.78,Single-ply,SBD,M
Boys,55.79,6,Daniel Vazquez,Athens,53.52,120.2,61.23,117.93,299.37,Single-ply,SBD,M
Boys,55.79,7,Travis Berryhill,Blooming Grove,54.43,111.13,65.77,102.06,278.96,Single-ply,SBD,M
Boys,55.79,8,Joseph Saldivar,Groesbeck,55.79,90.72,47.63,127.01,265.35,Single-ply,SBD,M
Boys,55.79,DQ,Demetrius Smith,Blooming Grove,55.79,,,,,Single-ply,SBD,M
Boys,59.87,1,Alec Bailey,Mexia,57.61,142.88,81.65,151.95,376.48,Single-ply,SBD,M
Boys,59.87,2,Michael McCarter,Blooming Grove,59.42,113.4,58.97,140.61,312.98,Single-ply,SBD,M
Boys,59.87,3,Michael Rosales,Rusk,56.25,120.2,65.77,124.74,310.71,Single-ply,SBD,M
Boys,67.13,1,Joseph Mahmoud,Athens,64.41,183.7,104.33,167.83,455.86,Single-ply,SBD,M
Boys,67.13,2,David Dilbeck,Blooming Grove,65.32,154.22,106.59,192.78,453.59,Single-ply,SBD,M
Boys,67.13,3,Blayne Stauffer,Fairfield,67.13,158.76,90.72,158.76,408.23,Single-ply,SBD,M
Boys,67.13,4,Ulysse Ramirez,Fairfield,63.96,170.1,68.04,165.56,403.7,Single-ply,SBD,M
Boys,67.13,5,David Sarabia,Mexia,66.22,156.49,72.57,158.76,387.82,Single-ply,SBD,M
Boys,67.13,6,Jesse Heath,Corsicana Mildred,61.23,136.08,79.38,156.49,371.95,Single-ply,SBD,M
Boys,67.13,7,Erwin Levano,Blooming Grove,63.32,136.08,86.18,147.42,369.68,Single-ply,SBD,M
Boys,67.13,8,Ty Bachtel,Fairfield,66.68,136.08,68.04,145.15,349.27,Single-ply,SBD,M
Boys,67.13,9,Manuel Villages,Blooming Grove,60.24,117.93,83.91,140.61,342.46,Single-ply,SBD,M
Boys,67.13,10,Traetin Turbriarte,Groesbeck,66.22,120.2,70.31,138.35,328.85,Single-ply,SBD,M
Boys,67.13,11,Zach Zea,Rusk,61.69,124.74,63.5,129.27,317.51,Single-ply,SBD,M
Boys,67.13,DQ,Jose Rodriguez #4,Fairfield,67.13,,,,,Single-ply,SBD,M
Boys,74.84,1,Darius Dorsey,Mexia,74.39,219.99,127.01,208.65,555.65,Single-ply,SBD,M
Boys,74.84,2,JaShaughn Hatcher,Fairfield,73.03,199.58,99.79,215.46,514.83,Single-ply,SBD,M
Boys,74.84,3,Jossie Palacios,Mexia,73.48,183.7,102.06,195.04,480.81,Single-ply,SBD,M
Boys,74.84,4,Hamilton Hamilton,Fairfield,74.84,181.44,102.06,161.03,444.52,Single-ply,SBD,M
Boys,74.84,5,Dustin Thompson,Corsicana Mildred,73.94,163.29,86.18,179.17,428.64,Single-ply,SBD,M
Boys,74.84,6,Dalton McCluney,Corsicana Mildred,68.49,163.29,79.38,174.63,417.3,Single-ply,SBD,M
Boys,74.84,7,Dusty Roberts,Groesbeck,74.84,158.76,77.11,167.83,403.7,Single-ply,SBD,M
Boys,74.84,8,Ruben Jimenez,Groesbeck,73.94,170.1,90.72,136.08,396.89,Single-ply,SBD,M
Boys,74.84,9,Colton Haven,Corsicana Mildred,68.95,147.42,79.38,158.76,385.55,Single-ply,SBD,M
Boys,74.84,10,Tharron Pearl,Mexia,74.84,142.88,79.38,140.61,362.87,Single-ply,SBD,M
Boys,82.1,1,Maalik Hall,Athens,79.83,206.38,97.52,210.92,514.83,Single-ply,SBD,M
Boys,82.1,2,Myles McGruder,Groesbeck,81.19,204.12,104.33,199.58,508.02,Single-ply,SBD,M
Boys,82.1,3,Darius Oliver,Mexia,75.75,195.04,92.99,199.58,487.61,Single-ply,SBD,M
Boys,82.1,4,Jed Wout,Blooming Grove,80.29,163.29,111.13,181.44,455.86,Single-ply,SBD,M
Boys,82.1,5,Eidson Edison,Fairfield,78.93,142.88,63.5,147.42,353.8,Single-ply,SBD,M
Boys,82.1,6,Colby Minze,Fairfield,77.11,136.08,63.5,124.74,324.32,Single-ply,SBD,M
Boys,82.1,7,Kevin Montoya,Groesbeck,78.02,158.76,,158.76,317.51,Single-ply,SD,M
Boys,82.1,8,Tyler Loyd,Groesbeck,77.56,104.33,56.7,136.08,297.1,Single-ply,SBD,M
Boys,89.81,1,Logan Fuller,Athens,89.36,251.74,151.95,229.06,632.76,Single-ply,SBD,M
Boys,89.81,2,Brandon Amaya,Fairfield,86.64,215.46,122.47,204.12,542.04,Single-ply,SBD,M
Boys,89.81,3,Austin Brodgen,Fairfield,85.73,226.8,136.08,215.46,578.33,Single-ply,SBD,M
Boys,89.81,4,Rahi Patel,Mexia,86.18,192.78,108.86,199.58,501.22,Single-ply,SBD,M
Boys,89.81,5,Antonio Miranda,Athens,83.01,204.12,81.65,181.44,467.2,Single-ply,SBD,M
Boys,89.81,6,Juan Quezada,Fairfield,88,181.44,102.06,151.95,435.45,Single-ply,SBD,M
Boys,89.81,7,Bear Williams,Corsicana Mildred,88.9,181.44,88.45,156.49,426.38,Single-ply,SBD,M
Boys,89.81,8,Mod Foreman,Rusk,86.64,158.76,104.33,156.49,419.57,Single-ply,SBD,M
Boys,89.81,9,Caydon Ramsey,Mexia,85.28,142.88,83.91,147.42,374.21,Single-ply,SBD,M
Boys,99.79,1,Enrique Zamora,Corsicana Mildred,99.34,260.82,138.35,219.99,619.15,Single-ply,SBD,M
Boys,99.79,2,Johnny Bustamante,Blooming Grove,90.45,226.8,113.4,195.04,535.24,Single-ply,SBD,M
Boys,99.79,3,Patrick Ball,Rusk,97.16,181.44,122.47,174.63,478.54,Single-ply,SBD,M
Boys,99.79,4,Justin Horn #1,Corsicana Mildred,92.26,192.78,104.33,176.9,474,Single-ply,SBD,M
Boys,99.79,5,Jason Garcia #4,Blooming Grove,91.26,176.9,95.25,163.29,435.45,Single-ply,SBD,M
Boys,99.79,6,Luis Reyes,Mexia,90.72,183.7,65.77,167.83,417.3,Single-ply,SBD,M
Boys,99.79,7,Matt Mooneyham,Fairfield,98.88,204.12,,204.12,408.23,Single-ply,SD,M
Boys,99.79,8,Seth Hoffman,Rusk,98.07,165.56,86.18,154.22,405.97,Single-ply,SBD,M
Boys,109.77,1,Noah Bush,Athens,101.7,238.14,151.95,231.33,621.42,Single-ply,SBD,M
Boys,109.77,2,Alfredo Miranda,Athens,106.78,204.12,124.74,190.51,519.36,Single-ply,SBD,M
Boys,109.77,3,Jeremiah Brown,Fairfield,104.33,226.8,124.74,165.56,517.1,Single-ply,SBD,M
Boys,109.77,4,Travis Pepin,Rusk,106.32,204.12,113.4,172.37,489.88,Single-ply,SBD,M
Boys,109.77,5,Ryan Hardin,Groesbeck,107.05,174.63,95.25,181.44,451.32,Single-ply,SBD,M
Boys,109.77,6,Clayton Herridge,Groesbeck,100.33,151.95,99.79,154.22,405.97,Single-ply,SBD,M
Boys,109.77,7,Trenton Mcright,Rusk,100.7,102.06,65.77,158.76,326.59,Single-ply,SBD,M
Boys,109.77,8,Brandon Rossa,Rusk,102.42,117.93,65.77,127.01,310.71,Single-ply,SBD,M
Boys,109.77,DQ,Chris Fletcher,Rusk,104.42,181.44,102.06,,,Single-ply,SBD,M
Boys,124.74,1,Chad Walker #2,Athens,121.2,272.16,201.85,229.06,703.07,Single-ply,SBD,M
Boys,124.74,2,Timothy Collums,Corsicana Mildred,111.31,181.44,136.08,181.44,498.95,Single-ply,SBD,M
Boys,124.74,3,DJ Roberts,Groesbeck,117.57,142.88,88.45,142.88,374.21,Single-ply,SBD,M
Boys,124.74+,1,Josh West,Athens,136.62,265.35,145.15,204.12,614.62,Single-ply,SBD,M
Boys,124.74+,2,Trederek Anglin,Mexia,147.78,219.99,145.15,222.26,587.4,Single-ply,SBD,M
Boys,124.74+,3,Coby Wilbanks,Rusk,141.79,192.78,117.93,199.58,510.29,Single-ply,SBD,M
Boys,124.74+,4,Adam Patterson,Rusk,130.27,165.56,88.45,158.76,412.77,Single-ply,SBD,M
