Place,Name,WeightClassKg,Division,Sex,Age,State,Best3SquatKg,Best3BenchKg,Best3DeadliftKg,TotalKg,Event,Equipment,BirthDate
1,Sophie Lassiter,48,F_TCR_2_APF,F,17,UT,65,52.5,75,192.5,SBD,Wraps,
1,Chloe Cella,56,F_OCR_APF,F,19,UT,77.5,40,102.5,220,SBD,Wraps,
1,Brooke Freeze,56,F_OCR_AAPF,F,27,UT,62.5,35,77.5,175,SBD,Wraps,
1,Jenessa Curtis,56,F_OR_AAPF,F,25,UT,132.5,85,130,347.5,SBD,Raw,
1,Chloe Cella,56,F_TCR_3_APF,F,19,UT,77.5,40,102.5,220,SBD,Wraps,
1,Kaitlyn Anderson,60,F_OR_AAPF,F,27,UT,85,52.5,125,262.5,SBD,Raw,
1,Isabella Bourret,67.5,F_JCR_APF,F,22,UT,125,67.5,130,322.5,SBD,Wraps,
1,Kelsy Fernandez-Salazar,67.5,F_JCR_AAPF,F,22,UT,107.5,55,112.5,275,SBD,Wraps,
1,Samantha Bradley,67.5,F_OCR_AAPF,F,26,UT,112.5,52.5,150,315,SBD,Wraps,
2,Nicole Callister,67.5,F_OR_AAPF,F,28,UT,87.5,55,122.5,265,SBD,Raw,
1,Natalie Hoose,67.5,F_OR_AAPF,F,27,UT,102.5,65,120,287.5,SBD,Raw,
1,Brianna Patterson,75,F_JCR_AAPF,F,23,TX,130,57.5,120,307.5,SBD,Wraps,
1,Teshina May,75,F_OCR_AAPF,F,30,UT,152.5,67.5,160,380,SBD,Wraps,
1,Shayla Cullens,90,F_OCR_APF,F,30,UT,135,75,157.5,367.5,SBD,Wraps,
1,Alex Porpora,90,F_SCR_APF,F,37,UT,137.5,50,107.5,295,SBD,Wraps,
2,Alex Porpora,90,F_SCR_AAPF,F,37,UT,137.5,50,107.5,295,SBD,Wraps,
1,Brittani Frade,90,F_SCR_AAPF,F,34,UT,122.5,55,152.5,330,SBD,Wraps,
1,Kelsy Fernandez-Salazar,67.5,F_JR_AAPF,F,22,UT,,,112.5,112.5,D,Raw,
1,Natalie Hoose,67.5,F_OR_AAPF,F,27,UT,,,120,120,D,Raw,
1,Brittani Frade,90,F_SR_AAPF,F,34,UT,,,152.5,152.5,D,Raw,
1,Courtney Manwaring,60,F_OR_AAPF,F,28,UT,,67.5,,67.5,B,Raw,
1,Kelsy Fernandez-Salazar,67.5,F_JR_AAPF,F,22,UT,,55,,55,B,Raw,
1,Natalie Hoose,67.5,F_OR_AAPF,F,27,UT,,65,,65,B,Raw,
1,Brittani Frade,90,F_SR_AAPF,F,34,UT,,55,,55,B,Raw,
1,Jack Benton,67.5,M_OR_APF,M,25,UT,135,95,175,405,SBD,Raw,
1,Aaron Lozano,67.5,M_TCR_1_AAPF,M,15,UT,142.5,100,175,417.5,SBD,Wraps,
1,Terrence Smothers,67.5,M_TR_3_AAPF,M,19,UT,137.5,90,162.5,390,SBD,Raw,
1,David Perez #9,75,M_OCR_AAPF,M,29,UT,170,127.5,215,512.5,SBD,Wraps,
1,David Bowen,75,M_OR_AAPF,M,24,UT,165,130,195,490,SBD,Raw,
1,Graham Hay,75,M_TCR_3_AAPF,M,19,UT,170,95,207.5,472.5,SBD,Wraps,
1,Ethan Byrd,75,M_TR_1_APF,M,14,ID,117.5,82.5,150,350,SBD,Raw,
1,Ethan Byrd,75,M_TR_1_AAPF,M,14,ID,117.5,82.5,150,350,SBD,Raw,
1,David Bagley,82.5,M_MCR_2_APF,M,45,UT,182.5,120,217.5,520,SBD,Wraps,
1,David Bagley,82.5,M_MCR_2_AAPF,M,45,UT,182.5,120,217.5,520,SBD,Wraps,
1,Jaxon Kern,82.5,M_TR_3_AAPF,M,18,UT,160,110,200,470,SBD,Raw,
3,Niko Griggs,90,M_OCR_APF,M,29,UT,187.5,140,237.5,565,SBD,Wraps,
2,Brayden Roberts,90,M_OCR_APF,M,28,UT,207.5,180,242.5,630,SBD,Wraps,
1,Boris Campos,90,M_OCR_APF,M,32,UT,227.5,150,255,632.5,SBD,Wraps,
1,Christopher Aldana,90,M_OCR_AAPF,M,29,UT,260,152.5,250,662.5,SBD,Wraps,
1,Ross Larrabee,90,M_TEM_3_APF,M,18,UT,285,145,227.5,657.5,SBD,Multi-ply,
2,Christian Kirby,100,M_JCR_APF,M,20,UT,210,110,235,555,SBD,Wraps,
1,Ethan Moline,100,M_JCR_APF,M,20,UT,227.5,132.5,240,600,SBD,Wraps,
1,Alex Hooper,100,M_JCR_AAPF,M,23,UT,225,145,250,620,SBD,Wraps,
1,Jarron Brownfield,100,M_OCR_APF,M,26,UT,195,115,202.5,512.5,SBD,Wraps,
1,Brady Lindley,100,M_OCR_AAPF,M,25,UT,190,115,220,525,SBD,Wraps,
2,Michael Mejia,100,M_OR_AAPF,M,24,UT,215,112.5,237.5,565,SBD,Raw,
1,Nathan Radke,100,M_OR_AAPF,M,23,UT,190,140,240,570,SBD,Raw,
1,Jack Munoz,100,M_TCR_1_AAPF,M,15,UT,107.5,50,90,247.5,SBD,Wraps,
1,Samuel Hill,100,M_TCR_2_AAPF,M,17,UT,212.5,150,255,617.5,SBD,Wraps,
3,Carson Webber,110,M_JCR_APF,M,20,UT,167.5,115,230,512.5,SBD,Wraps,
2,Dayton Underwood,110,M_JCR_APF,M,22,UT,192.5,117.5,217.5,527.5,SBD,Wraps,
1,Cole Dunkley,110,M_JCR_APF,M,22,UT,227.5,142.5,240,610,SBD,Wraps,
1,Carson Webber,110,M_JCR_AAPF,M,20,UT,167.5,115,230,512.5,SBD,Wraps,
1,Adam Lassiter,110,M_MR_3_APF,M,51,UT,172.5,125,197.5,495,SBD,Raw,
1,Jess Hoesman-Bevans,110,M_OCR_APF,M,26,CA,217.5,142.5,255,615,SBD,Wraps,
1,Jess Hoesman-Bevans,110,M_OCR_AAPF,M,26,CA,217.5,142.5,255,615,SBD,Wraps,
1,Bo Bertoch,110,M_SR_APF,M,38,UT,192.5,155,205,552.5,SBD,Raw,
1,Dallas Pedersen,125,M_OCR_APF,M,28,UT,217.5,175,252.5,645,SBD,Wraps,
1,Mashama Johnson,140,M_OCR_AAPF,M,27,UT,227.5,162.5,225,615,SBD,Wraps,
1,Cody Dedmon,140,M_OR_AAPF,M,30,ID,172.5,130,207.5,510,SBD,Raw,
1,Jeremy Clifford,140,M_OEM_APF,M,38,UT,400,265,332.5,997.5,SBD,Multi-ply,
1,Ethan Byrd,75,M_TR_1_APF,M,14,ID,,,150,150,D,Raw,
1,Ethan Byrd,75,M_TR_1_AAPF,M,14,ID,,,150,150,D,Raw,
1,Adam Gardner,100,M_OR_APF,M,34,UT,,,302.5,302.5,D,Raw,
1,Jack Munoz,100,M_TR_1_AAPF,M,15,UT,,,90,90,D,Raw,
1,Samuel Hill,100,M_TR_2_AAPF,M,17,UT,,,255,255,D,Raw,
1,CJ Jenkins,140,M_MR_1_APF,M,42,UT,,,287.5,287.5,D,Raw,
1,CJ Jenkins,140,M_OR_APF,M,42,UT,,,287.5,287.5,D,Raw,
1,David Bowen,75,M_OR_AAPF,M,24,UT,,130,,130,B,Raw,
1,Ethan Byrd,75,M_TR_1_APF,M,14,ID,,82.5,,82.5,B,Raw,
1,Ethan Byrd,75,M_TR_1_AAPF,M,14,ID,,82.5,,82.5,B,Raw,
1,Jack Munoz,100,M_TR_1_AAPF,M,15,UT,,50,,50,B,Raw,
1,Samuel Hill,100,M_TR_2_AAPF,M,17,UT,,150,,150,B,Raw,
1,Welly Lu,110,M_MR_2_APF,M,45,UT,,182.5,,182.5,B,Raw,
1,Welly Lu,110,M_OR_APF,M,45,UT,,182.5,,182.5,B,Raw,
1,Jason Miller,125,M_MR_1_APF,M,41,UT,,182.5,,182.5,B,Raw,
1,CJ Jenkins,140,M_MR_1_APF,M,42,UT,,205,,205,B,Raw,
1,CJ Jenkins,140,M_OR_APF,M,42,UT,,205,,205,B,Raw,
