Division,WeightClassKg,Place,Name,Team,BodyweightKg,Best3SquatKg,Best3BenchKg,Best3DeadliftKg,TotalKg,Equipment,Event,Sex
Boys,51.71,1,George Bankhead,Freeport Brazosport,51.07,156.49,88.45,185.97,430.91,Single-ply,SBD,M
Boys,55.79,2,Cecilio Hernandez,Dickinson,51.94,142.88,81.65,136.08,360.61,Single-ply,SBD,M
Boys,51.71,3,Julian Perez,Beaumont West Brook,50.53,129.27,63.5,145.15,337.93,Single-ply,SBD,M
Boys,51.71,4,Melvin Quitugua,Vidor,51.17,120.2,81.65,133.81,335.66,Single-ply,SBD,M
Boys,51.71,5,Mason Rice,Freeport Brazosport,51.44,131.54,65.77,138.35,335.66,Single-ply,SBD,M
Boys,51.71,6,Bryant Carruth,Lumberton,50.35,111.13,77.11,142.88,331.12,Single-ply,SBD,M
Boys,55.79,7,Cody Tunning,Montgomery,51.94,127.01,74.84,120.2,322.05,Single-ply,SBD,M
Boys,55.79,8,Taylor Riley,La Porte,51.89,120.2,68.04,129.27,317.51,Single-ply,SBD,M
Boys,51.71,9,Logan Green #1,Conroe Oak Ridge,51.26,104.33,61.23,113.4,278.96,Single-ply,SBD,M
Boys,51.71,10,Dylan Jenkins,Conroe The Woodlands,51.44,90.72,58.97,124.74,274.42,Single-ply,SBD,M
Boys,51.71,NS,Grayson Danner,Conroe The Woodlands,,,,,,Single-ply,SBD,M
Boys,55.79,1,Jeremy Charles,Willis,54.79,167.83,113.4,167.83,449.06,Single-ply,SBD,M
Boys,59.87,2,Jamahl Johnson,Houston Cypress Woods,55.97,167.83,99.79,181.44,449.06,Single-ply,SBD,M
Boys,55.79,3,Randy Holland,Clute Brazoswood,54.25,151.95,102.06,167.83,421.84,Single-ply,SBD,M
Boys,55.79,4,Trey Marrero,Alvin,55.43,163.29,90.72,151.95,405.97,Single-ply,SBD,M
Boys,59.87,5,JC Hooper,Montgomery,56.02,136.08,79.38,172.37,387.82,Single-ply,SBD,M
Boys,55.79,6,Trey Barnes,Willis,54.7,142.88,90.72,136.08,369.68,Single-ply,SBD,M
Boys,55.79,7,Juan Ochoa,Crosby,55.34,133.81,79.38,151.95,365.14,Single-ply,SBD,M
Boys,55.79,8,Cooper Houston,Montgomery,55.61,154.22,79.38,131.54,365.14,Single-ply,SBD,M
Boys,55.79,9,Brandon Felan,Conroe Woodlands College Park,55.79,129.27,81.65,142.88,353.8,Single-ply,SBD,M
Boys,59.87,10,Kevin Mueller,Waller,55.97,127.01,81.65,142.88,351.53,Single-ply,SBD,M
Boys,55.79,11,Justin Rios,Clute Brazoswood,55.7,124.74,68.04,133.81,326.59,Single-ply,SBD,M
Boys,55.79,12,Gafar Akinpelu,Alief Taylor,54.52,97.52,68.04,102.06,267.62,Single-ply,SBD,M
Boys,59.87,1,Kenny Nguyen,Dickinson,58.79,222.26,158.76,204.12,585.13,Single-ply,SBD,M
Boys,59.87,2,DeMarco Corner,Manvel,59.24,174.63,95.25,192.78,462.66,Single-ply,SBD,M
Boys,59.87,3,Alec DeLeon,Dickinson,59.42,179.17,104.33,179.17,462.66,Single-ply,SBD,M
Boys,59.87,4,Fidencio Cruz,Dickinson,59.69,165.56,104.33,190.51,460.4,Single-ply,SBD,M
Boys,59.87,5,Grayson Brown,Conroe The Woodlands,59.24,167.83,90.72,176.9,435.45,Single-ply,SBD,M
Boys,59.87,6,Christian Diaz,Katy Mayde Creek,58.69,165.56,92.99,161.03,419.57,Single-ply,SBD,M
Boys,59.87,7,Ashanti Velez,Beaumont West Brook,59.15,181.44,83.91,154.22,419.57,Single-ply,SBD,M
Boys,59.87,8,Jacob Cadieux,Waller,58.88,145.15,79.38,174.63,399.16,Single-ply,SBD,M
Boys,59.87,9,Daniel Segura,Magnolia,58.51,133.81,92.99,165.56,392.36,Single-ply,SBD,M
Boys,67.13,10,Eduardo Trevino,Clute Brazoswood,60.06,136.08,88.45,165.56,390.09,Single-ply,SBD,M
Boys,59.87,NS,Javier Garcia #6,Orange Little Cypress-Mauriceville,,,,,,Single-ply,SBD,M
Boys,59.87,DQ,Zach Mutchler,Manvel,58.69,149.69,,,,Single-ply,SBD,M
Boys,74.84,1,Steven McCartha,Montgomery,67.36,226.8,136.08,195.04,557.92,Single-ply,SBD,M
Boys,67.13,2,Jamal Simms,Houston Madison,66.68,215.46,117.93,210.92,544.31,Single-ply,SBD,M
Boys,67.13,3,Ritchie Lyttle,New Caney Porter,67.04,213.19,113.4,217.72,544.31,Single-ply,SBD,M
Boys,67.13,4,Zack Massey,Vidor,66.59,197.31,133.81,197.31,528.44,Single-ply,SBD,M
Boys,67.13,5,Tyler Marcel,Conroe Oak Ridge,65.23,179.17,129.27,208.65,517.1,Single-ply,SBD,M
Boys,67.13,6,Calvin Laskey,Katy Mayde Creek,65.95,183.7,117.93,210.92,512.56,Single-ply,SBD,M
Boys,67.13,7,Craig Collins,Conroe The Woodlands,66.22,176.9,124.74,199.58,501.22,Single-ply,SBD,M
Boys,67.13,8,Patrick Dorn,Vidor,66.41,208.65,115.67,176.9,501.22,Single-ply,SBD,M
Boys,67.13,9,Garrett Shantz,Montgomery,64.32,190.51,108.86,195.04,494.42,Single-ply,SBD,M
Boys,67.13,10,Samuel Fisher,Bay City,66.22,167.83,106.59,190.51,464.93,Single-ply,SBD,M
Boys,82.1,1,Ronald Winston,Katy Mayde Creek,75.07,238.14,136.08,238.14,612.35,Single-ply,SBD,M
Boys,74.84,2,Ryan McBride,Dayton,72.39,231.33,122.47,235.87,589.67,Single-ply,SBD,M
Boys,74.84,3,Michael Godeaux,Vidor,73.84,231.33,136.08,222.26,589.67,Single-ply,SBD,M
Boys,74.84,4,Colton Frisby,Waller,74.57,226.8,113.4,222.26,562.45,Single-ply,SBD,M
Boys,74.84,5,Travis Hill,Pasadena Memorial,74.48,213.19,122.47,217.72,553.38,Single-ply,SBD,M
Boys,74.84,6,Eric Johnson,Houston Cypress Woods,71.58,226.8,102.06,213.19,542.04,Single-ply,SBD,M
Boys,82.1,7,Thomas Bridges,Dickinson,74.93,185.97,136.08,197.31,519.36,Single-ply,SBD,M
Boys,74.84,8,Kyle Oswald,Houston Cypress Woods,74.57,183.7,122.47,204.12,510.29,Single-ply,SBD,M
Boys,74.84,9,Christian Quitugua,Vidor,73.21,197.31,106.59,190.51,494.42,Single-ply,SBD,M
Boys,74.84,NS,Kirby Nielsen,Livingston,,,,,,Single-ply,SBD,M
Boys,82.1,1,Troy Angelo,Orange Little Cypress-Mauriceville,80.74,254.01,124.74,272.16,650.91,Single-ply,SBD,M
Boys,82.1,2,Brandon Wilson,Vidor,81.56,244.94,140.61,242.67,628.23,Single-ply,SBD,M
Boys,82.1,3,Toney Robinson,Dayton,81.83,240.4,129.27,249.48,619.15,Single-ply,SBD,M
Boys,82.1,4,Darius Thornton,Houston Westbury,78.2,226.8,145.15,226.8,598.74,Single-ply,SBD,M
Boys,82.1,5,Kyle Leal,Crosby,81.47,226.8,145.15,226.8,598.74,Single-ply,SBD,M
Boys,82.1,6,Casey Viator,Orange Little Cypress-Mauriceville,78.29,247.21,136.08,206.38,589.67,Single-ply,SBD,M
Boys,82.1,7,Joseph Valdez,Texas City,81.01,254.01,138.35,192.78,585.13,Single-ply,SBD,M
Boys,82.1,8,Jonathan Saenz,Clute Brazoswood,81.47,249.48,127.01,208.65,585.13,Single-ply,SBD,M
Boys,82.1,9,Percy Alford,Tomball,79.92,233.6,131.54,208.65,573.79,Single-ply,SBD,M
Boys,82.1,10,Chris Okwegba,Alief Taylor,79.02,229.06,106.59,217.72,553.38,Single-ply,SBD,M
Boys,82.1,DQ,Kaleb Campbell,Alief Taylor,81.74,215.46,,,,Single-ply,SBD,M
Boys,82.1,DQ,Dj Bell,La Porte,75.84,,,,,Single-ply,SBD,M
Boys,82.1,DQ,Brandon Pitre,Manvel,80.65,204.12,,,,Single-ply,SBD,M
Boys,89.81,1,George Stephenson,Conroe Oak Ridge,88.99,263.08,145.15,240.4,648.64,Single-ply,SBD,M
Boys,89.81,2,Coleton Boudreaux,Orange Little Cypress-Mauriceville,86.18,272.16,142.88,231.33,646.37,Single-ply,SBD,M
Boys,89.81,3,Val Hernandez,Crosby,89.45,242.67,156.49,244.94,644.1,Single-ply,SBD,M
Boys,89.81,4,Zack Griffin,Beaumont Central,88.63,238.14,147.42,231.33,616.89,Single-ply,SBD,M
Boys,89.81,5,Sam Garza,Montgomery,85.64,242.67,149.69,210.92,603.28,Single-ply,SBD,M
Boys,89.81,6,Donovon Jackson,Dayton,89.63,226.8,154.22,222.26,603.28,Single-ply,SBD,M
Boys,89.81,7,Chase Nix,Crosby,89.72,238.14,142.88,215.46,596.47,Single-ply,SBD,M
Boys,89.81,8,Tyler Ray,Magnolia West,89.18,219.99,151.95,204.12,576.06,Single-ply,SBD,M
Boys,89.81,9,Zach Burkhalter,Lumberton,87.18,199.58,129.27,210.92,539.77,Single-ply,SBD,M
Boys,89.81,10,Jason Paul,Conroe Woodlands College Park,87.72,260.82,,,260.82,Single-ply,S,M
Boys,99.79,1,Mitchell Fountain,Conroe The Woodlands,97.16,299.37,151.95,288.03,739.36,Single-ply,SBD,M
Boys,99.79,2,Roderick Wiltz,Houston Madison,97.25,294.84,161.03,265.35,721.21,Single-ply,SBD,M
Boys,99.79,3,Chris Sherill,Bay City,96.62,281.23,167.83,226.8,675.85,Single-ply,SBD,M
Boys,99.79,4,Matthew Moore,Beaumont Central,97.25,254.01,163.29,254.01,671.32,Single-ply,SBD,M
Boys,99.79,5,Chad Murski,Conroe Woodlands College Park,98.43,256.28,142.88,235.87,635.03,Single-ply,SBD,M
Boys,99.79,6,Daniel Lema,Clute Brazoswood,99.79,254.01,147.42,233.6,635.03,Single-ply,SBD,M
Boys,99.79,7,Francois Bonilla,Texas City,94.71,238.14,154.22,224.53,616.89,Single-ply,SBD,M
Boys,99.79,8,Ben Hodges,Port Neches-Groves,95.53,215.46,170.1,219.99,605.55,Single-ply,SBD,M
Boys,99.79,9,Mathew Carter,Beaumont West Brook,95.98,242.67,124.74,204.12,571.53,Single-ply,SBD,M
Boys,99.79,10,Cedric Edwards,Galveston Ball,90.81,204.12,120.2,240.4,564.72,Single-ply,SBD,M
Boys,99.79,NS,Gerardo Torres,Houston Madison,,,,,,Single-ply,SBD,M
Boys,99.79,DQ,Jerry Medford,Alief Taylor,93.35,,,,,Single-ply,SBD,M
Boys,99.79,DQ,Coy Laughlin,Orange Little Cypress-Mauriceville,93.98,,,,,Single-ply,SBD,M
Boys,109.77,1,Tremonte Green,Crosby,108.77,263.08,170.1,254.01,687.19,Single-ply,SBD,M
Boys,109.77,2,Justin Latanero,Conroe Oak Ridge,105.6,272.16,181.44,226.8,680.39,Single-ply,SBD,M
Boys,109.77,3,Reno Dominguez,Katy Mayde Creek,106.05,294.84,131.54,254.01,680.39,Single-ply,SBD,M
Boys,109.77,4,Mike Alvair,Freeport Brazosport,106.68,272.16,163.29,222.26,657.71,Single-ply,SBD,M
Boys,109.77,5,Charles Flores,Dickinson,102.97,249.48,181.44,213.19,644.1,Single-ply,SBD,M
Boys,109.77,6,Korey Robinson,Texas City,105.51,242.67,154.22,235.87,632.76,Single-ply,SBD,M
Boys,109.77,DQ,Nestor Mendez,Freeport Brazosport,108.95,,,,,Single-ply,SBD,M
Boys,109.77,DQ,Devante Williams,Beaumont West Brook,102.15,,,,,Single-ply,SBD,M
Boys,109.77,DQ,Jose Guevara,Magnolia West,109.23,,,,,Single-ply,SBD,M
Boys,109.77,DQ,Dustin Castleberry,Montgomery,108.41,244.94,,,,Single-ply,SBD,M
Boys,124.74,1,Curtis Emery,Alvin,112.4,285.76,161.03,263.08,709.87,Single-ply,SBD,M
Boys,124.74,2,Matt Oubre,Dayton,121.93,278.96,183.7,244.94,707.6,Single-ply,SBD,M
Boys,124.74,3,Chris Shepherd,Alvin,111.58,281.23,147.42,274.42,703.07,Single-ply,SBD,M
Boys,124.74,4,Chris Mangini,Port Neches-Groves,122.65,283.5,170.1,226.8,680.39,Single-ply,SBD,M
Boys,124.74,5,Marquise White,Houston Cypress Woods,117.39,274.42,140.61,249.48,664.51,Single-ply,SBD,M
Boys,124.74,6,Cody Skrivanek,Magnolia West,118.84,265.35,163.29,226.8,655.44,Single-ply,SBD,M
Boys,124.74,7,Joshua McKinnies,Katy Mayde Creek,123.92,267.62,149.69,219.99,637.3,Single-ply,SBD,M
Boys,124.74,NS,Ray Madrigal,Freeport Brazosport,,,,,,Single-ply,SBD,M
Boys,124.74,DQ,Ismail Hassan,Katy Mayde Creek,113.85,244.94,145.15,,,Single-ply,SBD,M
Boys,124.74,DQ,Grant Narcisse,Crosby,119.93,,,,,Single-ply,SBD,M
Boys,124.74+,1,Travis Romero,Manvel,162.57,326.59,176.9,254.01,757.5,Single-ply,SBD,M
Boys,124.74+,2,William Simpson,Houston Madison,141.43,294.84,185.97,249.48,730.28,Single-ply,SBD,M
Boys,124.74+,3,Andrew Bluiett,Beaumont West Brook,156.67,272.16,170.1,283.5,725.75,Single-ply,SBD,M
Boys,124.74+,4,Kevin Butts,Conroe The Woodlands,134.81,217.72,210.92,251.74,680.39,Single-ply,SBD,M
Boys,124.74+,5,Caleb Malveaux,Nederland,126.92,251.74,176.9,226.8,655.44,Single-ply,SBD,M
Boys,124.74+,6,Skler Scott,Vidor,145.69,249.48,190.51,215.46,655.44,Single-ply,SBD,M
Boys,124.74+,7,Devon Miles #2,Clute Brazoswood,154.77,242.67,129.27,242.67,614.62,Single-ply,SBD,M
Boys,124.74+,8,Osiel Cerna,Magnolia,132.45,260.82,147.42,204.12,612.35,Single-ply,SBD,M
Boys,124.74+,9,Chance Harmanson,Dickinson,130.27,233.6,145.15,231.33,610.08,Single-ply,SBD,M
Boys,124.74+,NS,Corey Lee,La Porte,,,,,,Single-ply,SBD,M
Boys,124.74+,DQ,Alonzo Crittendon,Dickinson,138.62,317.51,,,,Single-ply,SBD,M
