{
  "cordova-plugin-ble-central": {
    "source": {
      "type": "registry",
      "id": "cordova-plugin-ble-central@~1.1.4"
    },
    "is_top_level": true,
    "variables": {}
  },
  "cordova-plugin-compat": {
    "source": {
      "type": "registry",
      "id": "cordova-plugin-compat"
    },
    "is_top_level": false,
    "variables": {}
  }
}