{
  "id": "urn:uuid:90d566bc-20bc-4b13-936d-753a8f996d50",
  "type": "Endorsement",
  "claim": {
    "type": [
      "MinistryClaim",
      "Extension"
    ],
    "id": "https://www.titols.ad/certificate/70570d13-c822-4dfb-afb9-9440710139be",
    "ministrySignature": {
      "image": "data:image/png;base64...",
      "type": [
        "SignatureLine",
        "Extension"
      ],
      "jobTitle": "Ministre",
      "name": "Eric Jover"
    },
    "registryCode": "314159-26/IFG-ES"
  },
  "issuer": {
    "id": "https://www.titols.ad/ministry/ministeri.json",
    "type": "Profile",
    "name": "Govern d'Andorra - Ministeri d'educació",
    "url": "https://www.educacio.ad/",
    "image": "data:image/png;base64..."
  },
  "issuedOn": "2019-03-14T15:09:10.342568+01:00",
  "verification": {
    "type": [
      "MerkleProofVerification2017",
      "Extension"
    ],
    "publicKey": "ecdsa-koblitz-pubkey:1DLJ95Kqv7vkhZbfrdkKnyocHg2Wm9Ub9s"
  },
  "signature": {
    "type": [
      "MerkleProof2017",
      "Extension"
    ],
    "targetHash": "cccccccccccccccccccccccccccccccccccccccccccccccccccccc",
    "merkleRoot": "cccccccccccccccccccccccccccccccccccccccccccccccccccccc",
    "anchors": [
      {
        "sourceId": "afdca5f843360461c7e7e730f06d036aa4955e2d003fb366d2e99b6fe1011181",
        "type": "ETHData"
      }
    ],
    "proof": []
  }
}
