{
  "$schema": "http://json-schema.org/draft-07/schema#",
  "title": "RecipientClaim schema.",
  "description": "This field belongs to an endorsement. It gives extra information about the recipient of the Assertion being awarded.",
  "type": "object",
  "properties": {
    "type": {
      "type": "array"
    },
    "id": {
      "type": "string",
      "format": "iri"
    },
    "givenName": {
      "type": "string"
    },
    "familyName": {
      "type": "string"
    },
    "birthplace": {
      "type": "string"
    },
    "birthdate": {
      "type": "string",
      "format": "date-time"
    },
    "nationality": {
      "type": "string",
      "minLength": 2,
      "maxLength": 2
    },
    "nationalId": {
      "type": "string",
      "description": "The national ID person of their country, e.g. the CIF/NIF in Spain or NPI in Andorra."
    }
  },
  "required": [
    "id",
    "type",
    "givenName",
    "familyName",
    "birthplace",
    "birthdate",
    "nationality",
    "nationalId"
  ],
  "additionalProperties": true
}
