{
  "type": [
    "MinistryClaim",
    "Extension"
  ],
  "id": "https://www.titols.ad/certificate/70570d13-c822-4dfb-afb9-9440710139be",
  "ministrySignature": {
    "image": "data:image/png;base64...",
    "type": [
      "SignatureLine",
      "Extension"
    ],
    "jobTitle": "Ministre",
    "name": "Eric Jover"
  },
  "registryCode": "314159-26/IFG-ES"
}
