Row.names	baseMean	log2FoldChange	lfcSE	stat	pvalue	padj
2610507I01Rik	1120.77577012608	0.508464132282099	0.141291075338431	3.59869957153476	0.000319812380326515	0.0177489196160979
3300005D01Rik	508.370101916215	0.42085693357723	0.115601214682919	3.64059265926914	0.000272011192277022	0.0156668183613753
4930432K21Rik	1303.94678141408	0.30661322208288	0.0799847238608822	3.83339726991086	0.000126385595367478	0.0090054973671512
5430437J10Rik	436.736969614998	0.511317615405113	0.120171557134823	4.25489714534909	2.09145132806993e-05	0.00230065365043835
6430548M08Rik	2425.1833733221	0.864378299703079	0.141726507920989	6.09891764344437	1.06789068098289e-09	8.60786632039773e-07
ATP6	144.005887302973	-1.19687544057044	0.323158735056168	-3.70367658594287	0.000212497140509502	0.0130246682110963
Aars	31479.3262060595	-0.265711026607931	0.0663457911540435	-4.0049417150064	6.20327744177119e-05	0.00529825623619358
Aatk	320.424464746648	0.652576583957477	0.158889805900282	4.10710164985052	4.00654936043162e-05	0.00388514790236741
Abcg1	4173.39797589041	0.528683104561014	0.13924274968918	3.79684476025609	0.000146549498783528	0.00994695980548064
Abi3	1444.7557545891	0.503921817845008	0.0878055376859464	5.73906647718943	9.51998484837274e-09	4.72227863805628e-06
Abtb2	1477.83510987235	-0.484977407756815	0.135755731915579	-3.5724267470224	0.000353688435215841	0.018849255161069
Adam32	75.7147552735311	-1.08708596900136	0.249516558022686	-4.35676885580684	1.31996531735963e-05	0.00157625858314696
Adam33	57.8863513811134	1.39106596000065	0.299092156778356	4.65096101143003	3.30391792947781e-06	0.000546290122262505
Adgre1	25216.3466417134	0.347731396513512	0.075719386088596	4.59236946409797	4.38241627275779e-06	0.000672857412735205
Adora2b	700.254100039601	-0.794991157771454	0.222438934046075	-3.57397485822686	0.000351602705612655	0.018849255161069
Adrb2	385.264714698985	0.436210168882241	0.1358870982831	3.21009260182644	0.00132692217162828	0.047405305394709
Ap1s3	1657.8614380164	-0.279159684736179	0.0734806811573975	-3.79908950678086	0.000145228639919624	0.00991012576213438
Ap5b1	1169.11553228075	0.299341622772807	0.0794128604468861	3.76943509008867	0.000163617452024678	0.010711544562245
Apold1	111.151144575552	-0.958339588618646	0.212836243506267	-4.50270862157191	6.70928410558972e-06	0.000950875133074623
Arhgap25	1410.028347468	0.821024165716822	0.14792500020985	5.55027320974882	2.85223501048703e-08	1.05100785515004e-05
Arhgap27	877.52817561525	0.594939258748854	0.165784204597777	3.58863656638632	0.000332411852779606	0.0182430453842493
Arhgap8	2713.36106251335	0.299594824756084	0.0842368863506482	3.55657524554003	0.000375720899734416	0.0194269740020719
Arid3a	1294.94317680569	0.468228005166478	0.0929750176600001	5.03606255691974	4.75205314504162e-07	0.000131013332411943
Arl14ep	4226.71465784922	-0.350476114927255	0.0695196041413079	-5.04139974984417	4.62138938943414e-07	0.000131013332411943
Arl5b	980.897108219642	-0.379320544707286	0.086576874213865	-4.38131485054861	1.17965261847336e-05	0.00146288267504335
Atf3	11598.3431900242	-0.55809765426409	0.170206735210561	-3.27893989373378	0.00104197826555431	0.0407224051238
Atf4	21310.108590855	-0.445491652716099	0.0716559870505959	-6.21708905358515	5.06462358348504e-10	4.65546592916209e-07
Atg13	5963.58848472509	-0.274373865389256	0.0812927287255849	-3.37513415640707	0.000737797150623521	0.0319307713140656
Atg16l2	1330.58303906487	-0.389696695171633	0.0791641253434577	-4.92264259196844	8.53833078509882e-07	0.000183831152767207
Atl2	3716.05033528284	-0.250147143744559	0.0649115707409742	-3.85366030877233	0.000116365012778575	0.00852704301025729
Bahcc1	674.286560478687	0.578899365403178	0.168551449223459	3.43455584671774	0.000593525758966572	0.0276343022144111
Baiap2	1564.84775803732	0.26585122243478	0.0814084922616773	3.26564483690762	0.00109215136721448	0.0416116877177226
Baz1a	9536.33087655564	-0.256149559862605	0.0787497363431768	-3.25270371377947	0.00114312623235125	0.042733040633722
Bcar1	288.523008079656	-0.830721914708437	0.16711665312842	-4.97091043386365	6.6639230970748e-07	0.000153472528898167
Bcl2	1302.23646002234	0.412413306005683	0.110305252560572	3.73883651441904	0.000184873900273296	0.0118035578803203
Bcl3	931.511432554804	-0.629469305404275	0.127434141191802	-4.93956564165058	7.82967835731915e-07	0.000174102347886802
Bclaf3	1853.92894461621	-0.287908532542917	0.0815349297411154	-3.53110664910201	0.000413824857225365	0.0206065605545774
Blnk	4780.14236668118	0.510527245106126	0.0885744394715459	5.7638213479198	8.22304585917055e-09	4.24210489782891e-06
Bmf	284.419954705139	0.973601098116457	0.202130389021575	4.81669828485085	1.45953122763189e-06	0.000275987853286542
Btbd17	72.2949570753236	0.822620268875317	0.253290572716756	3.24773346300266	0.0011632818618973	0.0432358679333992
Btg2	523.793633113629	-0.873061809975939	0.22745424257168	-3.83840635419584	0.000123835425354038	0.00892237698765938
C1galt1	820.19318269716	-0.443378727793076	0.112154626561637	-3.95328076411905	7.70868946017636e-05	0.00633241834190411
Calhm2	1667.42561126961	0.262902922379055	0.0793563860090697	3.31293970908665	0.000923208790237163	0.0376791891382554
Cars	6173.06571385826	-0.396163364544883	0.0676812192228552	-5.85337216282154	4.81704545882646e-09	2.82388342193113e-06
Ccdc125	376.048601853878	0.761125219595651	0.121564068300136	6.26110355007591	3.82262574142543e-10	3.79233878362798e-07
Ccdc194	94.1767841866439	0.839395742004993	0.215725053411392	3.89104431187346	9.98137007358669e-05	0.00758490738949483
Ccnb1	7900.57250915825	-0.225875036833362	0.070542162300706	-3.20198629396282	0.0013648349178602	0.0486250716454226
Ccng2	506.817819269866	-0.694700955187778	0.125020580107629	-5.55669278281796	2.74934037049995e-08	1.04288949289229e-05
Ccp110	1344.78862910774	-0.331980941233677	0.100515114849833	-3.30279621855525	0.000957259248390243	0.0383490423592975
Cd101	124.502872515304	0.838534731358752	0.190468126908397	4.40249371361768	1.07013691661211e-05	0.00137687891256419
Cd300c2	1286.72872106344	0.303353354278336	0.0848970473746297	3.57319086657646	0.000352657515007134	0.018849255161069
Cd300lb	2817.88846963121	0.558868692620433	0.132190240996628	4.22776060022986	2.36028728070254e-05	0.00249513320157546
Cd300ld	1072.10983977835	0.348225719864795	0.090955443046861	3.82853085202813	0.00012891047330985	0.0090869814747781
Cd52	2148.78744216481	0.300949387488469	0.0766716731795224	3.92517047050497	8.66683398431216e-05	0.00694417713665998
Cd72	876.601129357453	0.827268211545493	0.139651670092659	5.92379748123744	3.14590845304368e-09	1.93752931794891e-06
Cd83	2704.65746719699	-1.15078166197477	0.189276998978542	-6.07988116984689	1.20271646427696e-09	9.12437308222352e-07
Cdc45	4480.68330753994	-0.273894092759546	0.0634724239972271	-4.31516673715677	1.59482482111583e-05	0.00181725763604653
Cdk14	2746.0691391448	-0.438069113603595	0.111925269413437	-3.91394290046715	9.08011162046468e-05	0.0070973454284323
Cenpi	2802.76708705002	-0.25103008541991	0.062357853307437	-4.02563706262113	5.68212716003659e-05	0.00495151310695891
Cep170b	1649.09160141876	0.38555261315806	0.094030717689391	4.10028363743479	4.12644073620108e-05	0.00388806474662967
Cep76	2144.00315635411	-0.237365904186025	0.0695843124523344	-3.41119852766559	0.000646779804250554	0.0293293615733821
Chac1	94.9453428557881	-1.53647822693154	0.275371642531231	-5.5796530565317	2.40998799765175e-08	9.7130047517858e-06
Chka	3098.72616253931	-0.314297449159075	0.085682728802576	-3.66815405568205	0.000244307970688303	0.014519999529802
Chst12	1089.18152445922	0.428045834596247	0.120340272419061	3.55696248638745	0.000375167705896694	0.0194269740020719
Cish	167.963317781794	-1.34777772861108	0.366706073407315	-3.67536243969988	0.00023751198953632	0.0141814450418978
Cited2	3926.07928118181	-0.468327580847664	0.143312791141037	-3.26787007020729	0.00108360098867566	0.0414893581781276
Cldn12	859.017383409205	-0.407854062992779	0.11624804206209	-3.50848113876135	0.000450673189087898	0.0221844737391856
Clec12a	1573.85195103355	0.644616600175013	0.173157268171373	3.72272331957235	0.000197085456979865	0.0123388890226666
Clec4a3	1406.07500924004	0.377622653103289	0.0973540470439489	3.87885932397672	0.000104947420457347	0.00782373920022196
Cln8	3221.06319629094	0.231230757958383	0.0642139513778935	3.60094267673407	0.000317065484383535	0.0177489196160979
Cmbl	211.656289742133	-0.606356414191783	0.143344170521767	-4.23007375873516	2.33614700757458e-05	0.0024900237980735
Cmklr1	264.555129533894	0.621789848297898	0.142262593223944	4.37071920458458	1.23837962255294e-05	0.00149265252262292
Cry1	1939.16666019989	-0.485855211296261	0.137581627017753	-3.53139602887214	0.000413372335458399	0.0206065605545774
Cry2	456.737498788672	-0.41431395744865	0.116546440064537	-3.55492589236726	0.000378085638095685	0.0194269740020719
Csf1r	51149.1275187217	0.223618175866708	0.0690842645112715	3.23689015796388	0.00120839914689664	0.0442747835156988
Csf3r	2183.77651716156	0.412414900215943	0.0891719719953934	4.62493865490883	3.74709284448275e-06	0.00060086894077762
Cstf3	3367.20085240522	0.287090922129867	0.0675259117815974	4.25156676237738	2.12280208112091e-05	0.00230065365043835
Cx3cr1	175.86654251107	1.21310380303313	0.171848862704837	7.05913198341456	1.67545880242263e-12	1.08041960874223e-08
Cxcr3	82.1708297969328	0.932919404367505	0.272313590445117	3.42590100935682	0.000612763660896013	0.0281238894468892
Cysltr1	678.984504602534	0.604080451234305	0.0938367385196416	6.4375687045843	1.21402376613032e-10	1.73969605686474e-07
Cyth4	8238.09533300538	0.722983379572806	0.120272523944946	6.01120984127471	1.84143863006499e-09	1.31939077844157e-06
Ddit4	317.130154230565	-1.41307343616775	0.249009923673518	-5.67476755673588	1.388770990853e-08	6.17619981690729e-06
Ddx58	404.943572897187	0.708463858028599	0.215315234260405	3.29035639518091	0.00100060560979743	0.0395853084342253
Dglucy	1955.23527916285	0.268974210823487	0.0771242688438416	3.48754308929782	0.000487480365498677	0.0232853121253201
Dlg3	313.07040062675	0.652548112552269	0.189801726813734	3.43805150515128	0.000585916241944427	0.0273788470012945
Dmd	21.629873015833	-1.76559999153977	0.484499279478107	-3.64417464860142	0.000268251227954645	0.0156119616937173
Dok3	1029.6846995458	0.409759888216484	0.113165629672543	3.6208863892877	0.000293595426348189	0.0166074570772482
Dsn1	2092.15513651274	-0.263513131741594	0.0756048730010814	-3.48539877499463	0.000491404108762216	0.0233001426128908
Dusp1	1756.0153410291	-0.547451573647725	0.132479337329604	-4.13235440848925	3.59066204685028e-05	0.00351493178379507
Dusp14	184.105612001317	-0.579263650892879	0.162662535795023	-3.56113746820491	0.000369251685264699	0.0193586950604017
Dusp18	561.781647864766	-0.502327514531171	0.126578062890175	-3.96851952906733	7.23205314721774e-05	0.00601753480255918
Dusp2	3160.53324330217	-0.513271684947821	0.114197181696085	-4.49460903784651	6.96978826452029e-06	0.000977058252690414
Dusp4	4098.11476271602	-0.501175976948171	0.122335890783797	-4.09672070671307	4.19043963543091e-05	0.00388806474662967
Dusp5	577.792804991413	-0.512689789992581	0.136296601142815	-3.76157428500635	0.000168847257643107	0.0109980963728442
Dusp6	438.539803626703	0.609464792214199	0.183755308838442	3.31671937026887	0.000910810522002137	0.0374689659480467
Dusp7	2787.000072649	0.54155706424922	0.15114075605987	3.58313057554574	0.000339500788054675	0.0184239113517821
Dusp8	138.240170736131	-1.64944291406558	0.422866303274048	-3.90062509425496	9.59446337482091e-05	0.00736546393720627
E330020D12Rik	1272.63128732544	0.516796426265429	0.136158173053858	3.79555934597484	0.000147310950054028	0.00994695980548064
Efr3b	2314.51928179458	0.541514160502254	0.130734357915384	4.14209523140613	3.44147381269322e-05	0.00344067346994609
Emp1	3711.7393163086	-0.50748509179392	0.126871996512582	-3.9999771875868	6.33485899256488e-05	0.00533991349196793
Epsti1	323.33504681929	0.89503952481452	0.128530400925556	6.96364065131111	3.31589779533395e-12	1.15768376113419e-08
Erbin	7183.22298067929	-0.343895110806296	0.104188615763459	-3.30069756936829	0.000964447826271496	0.0385092371994535
Erich1	787.39494917451	-0.432463322099587	0.0962798102900512	-4.49173425660847	7.06455388282679e-06	0.000979694101363625
Esf1	7966.91792847328	-0.478462829915229	0.114188557235859	-4.19011187720809	2.78816948674492e-05	0.00287672174964393
Ets2	2746.81506009792	-0.856906423578103	0.185338469460012	-4.62346768091222	3.77377562246935e-06	0.00060086894077762
Evl	544.803335266507	0.602093675365737	0.120457575748719	4.99838778610102	5.78116335079698e-07	0.000146195419088684
F3	100.315780313379	-1.02194265614193	0.317018266377791	-3.22360811513641	0.00126586503324528	0.0458243305977248
Fbxo11	2867.72483388768	-0.28682134472645	0.0704508767886079	-4.0712246291423	4.67666244420572e-05	0.0043082082530658
Fbxo30	1505.8140096224	-0.501482921107097	0.146784292212522	-3.41646175859897	0.000634405733871467	0.0290139388288664
Fbxw7	854.307541942231	-0.324843718151835	0.0847342077959818	-3.83367858862828	0.000126241071351223	0.0090054973671512
Fhl3	2270.59309278164	0.453678859144888	0.0802729272890705	5.65170443468627	1.58864592636295e-08	6.82958883743432e-06
Flt1	5715.42444027619	0.270026677317896	0.0794335761951098	3.39940224590466	0.000675333157355367	0.0301516477228983
Fosl2	1252.67660800539	-0.538028134551086	0.117899481110358	-4.56344785815873	5.03203116218301e-06	0.000754629138356677
Foxq1	67.8836648405396	-0.955903930948626	0.292432519166382	-3.2688017518488	0.00108003945822682	0.0414893581781276
Frmd4a	1481.08290417438	0.493098654068756	0.151335396321774	3.25831673259252	0.00112075240603782	0.0421624385485213
Frmd4b	2732.44924233691	0.580178789509419	0.155567629192418	3.7294313252779	0.000191912400703852	0.0120736303994028
Fut7	296.022755000831	0.666078116878567	0.164882723008199	4.03970837408748	5.35177029662482e-05	0.0047931792719146
Fyb	12863.8107005397	0.683533204356233	0.137423702068814	4.9739105704921	6.56155880666766e-07	0.000153472528898167
Fzd5	214.687591335813	-0.717539779309593	0.220122746805008	-3.25972571996483	0.00111520002797244	0.0421624385485213
Gadd45a	583.129142151296	-1.30454810151581	0.259087644565647	-5.03516137831603	4.77446431213561e-07	0.000131013332411943
Gcm2	28.8549753775923	1.20395715460699	0.368054355853624	3.27113953539462	0.00107115045067954	0.0413611597677066
Gdf15	2044.59165336585	-1.88552433584475	0.509192214776084	-3.70297165025178	0.000213088702220774	0.0130246682110963
Gimap6	559.310502645794	-0.629256003048105	0.183459798164859	-3.42993947089514	0.000603715907732414	0.0280076405108811
Gm12185	136.518670646838	0.771078767954591	0.214400704595263	3.59643765821667	0.000322604853258719	0.017780490566144
Gm13421	413.45463859109	0.4881318989348	0.131426288111669	3.71411158260857	0.000203918809648226	0.0127050284446047
Gm26740	323.327028007776	0.651065763595609	0.157569922398025	4.13191650847554	3.59751101388656e-05	0.00351493178379507
Gm26812	252.578847445664	-0.731812715299827	0.135461796345206	-5.40235501849467	6.57716125814459e-08	2.2925851012511e-05
Gm31613	94.5743146105127	0.763347819691256	0.212034388990794	3.60011328032453	0.000318078575680958	0.0177489196160979
Gm31657	148.962098607494	0.855846811200866	0.211669494095552	4.04331675122973	5.27003477731407e-05	0.00475298171489647
Gm32006	219.13923406658	1.07922640792344	0.245001699677933	4.40497518728293	1.05795986847152e-05	0.00137687891256419
Gm32124	114.969150757599	1.26916399856486	0.267310575861182	4.7479004318331	2.05539171954577e-06	0.000373357563478616
Gm32725	248.448003202115	0.728785714756369	0.199219567496099	3.65820347828353	0.000253989369543816	0.0150261509128743
Gm32997	185.288769032416	0.757584998836445	0.172110324904099	4.40174056529483	1.07385914976195e-05	0.00137687891256419
Gm33103	450.3702783646	0.733708579525036	0.105751233368707	6.93806167694447	3.97516176197708e-12	1.15768376113419e-08
Gm33168	392.774141292304	0.397556604606459	0.120371872472908	3.30273673109087	0.000957462327649361	0.0383490423592975
Gm33661	486.766801852414	7.26909385954734	1.58531433992025	4.58526973263422	4.53400720207726e-06	0.000687942245708122
Gm35200	38.0341648385066	1.65485855081358	0.34161013739247	4.84428993660787	1.27065270010371e-06	0.000256056373019336
Gm36319	49.0682294974134	1.47236837641225	0.38884718302821	3.78649618841505	0.000152786438587231	0.0102097756396866
Gm39673	99.9388485137046	0.749805640360876	0.199524704636709	3.75795890401697	0.000171305006664587	0.0111021139243878
Gm40447	26.8219434404349	-1.52591306795282	0.473655167850927	-3.2215695542312	0.0012749051335771	0.0459286354964911
Gm44507	3379.61825062963	0.383035821899061	0.117919705824106	3.24827660671418	0.00116106339946355	0.0432358679333992
Gm5431	316.316886244513	1.06964823065676	0.21730555958619	4.92232335285701	8.55227507639947e-07	0.000183831152767207
Gng2	3043.34061774628	0.401285525867329	0.0760281850833736	5.27811528615701	1.30519344626891e-07	4.20826996913254e-05
Grb2	7298.93223641908	0.21899898566666	0.0651446672573926	3.36173312239626	0.000774549443749643	0.0331872563988012
Grk2	12237.4087159709	0.253076387541031	0.0617274876082247	4.09989774972326	4.13332717101822e-05	0.00388806474662967
Gsto2	184.758808792057	0.575382124894974	0.179988741344312	3.19676731220809	0.00138976987601881	0.0492413793709194
H6pd	5297.1651456703	0.350032937136757	0.0960513618229347	3.64422669802458	0.000268196953244971	0.0156119616937173
Heca	1611.77888585492	-0.468556579933802	0.134398385570271	-3.48632595507493	0.00048970392108917	0.0233001426128908
Herpud1	2968.64102711337	-0.514297976405448	0.108930290699388	-4.72134952641173	2.3428492638478e-06	0.000413914067888289
Hilpda	615.433948965502	-0.4900450958594	0.116696975424356	-4.19929560365557	2.67746595423934e-05	0.00278478051708264
Hipk1	6933.35514110854	-0.344245109208174	0.100020401920876	-3.44174890919255	0.00057796646125364	0.0272045016452124
Hivep1	1499.58163950133	-0.864126866739085	0.173023281664095	-4.99428087612332	5.90553990364048e-07	0.000146468746417791
Hivep2	815.195676997849	-0.742880415933355	0.17945495754861	-4.13964833338264	3.47838629216249e-05	0.00345082677000151
Idh1	3678.24538496888	0.371975749499072	0.0736231278299669	5.05243067583535	4.36222707434786e-07	0.000127862824040601
Igf1	8338.42322377081	0.285773081230975	0.0671960408752124	4.25282617113819	2.11089432195227e-05	0.00230065365043835
Igtp	402.850379256203	0.645146683118576	0.135125507612568	4.77442560266521	1.80220890176204e-06	0.00033204411722893
Il23a	40.4739395001563	-2.00094092689398	0.569840565184194	-3.51140485452663	0.000445744991265751	0.0220259507753042
Il27	41.8285889865088	-2.50786952983271	0.688273141619994	-3.64371261666542	0.000268733464837191	0.0156119616937173
Ildr2	207.283883515304	-0.616894480817983	0.182699110744201	-3.37655984369679	0.000733984032235348	0.0318727005513107
Inka1	508.679961640615	0.501199903904881	0.132553519970283	3.78111350054865	0.000156128468248119	0.0103260966922871
Irf7	306.062782455393	1.09996686207667	0.2325533007403	4.72995592225562	2.24568588947219e-06	0.000402258484951707
Irf8	6317.11858548723	0.460497805517596	0.128523945246794	3.58297284317984	0.000339705936506585	0.0184239113517821
Irs2	617.645914153194	-0.726558065154861	0.166073400690392	-4.37492134281859	1.2147627269512e-05	0.00147799951787638
Itgal	9175.24096269155	0.400608107574885	0.124295790696872	3.22302231900895	0.00126845669716893	0.0458243305977248
Itgav	10076.190895967	-0.445394036489625	0.135626237759562	-3.28398135823262	0.00102351692278465	0.0403678830371669
Itpkc	316.335278249135	-0.404742598983104	0.122307319498955	-3.30922630502554	0.0009355418482891	0.0378981429527892
Iws1	3663.20320482161	-0.203986682204616	0.0623114644639261	-3.27366214162258	0.0010616346327312	0.041240668247995
Jade3	1743.0105128788	-0.362335963119227	0.0899240294047049	-4.0293563969262	5.59297695597393e-05	0.00494059067131478
Junb	13727.4223223137	-0.609557810342053	0.118036872148179	-5.16413048946975	2.41559146189982e-07	7.2450890893307e-05
Kcna7	325.542837412356	-0.51498409954309	0.155625277244039	-3.30912888100776	0.000935867460953371	0.0378981429527892
Kdm6b	1654.33731121914	-0.950271928621868	0.176670434392728	-5.37878299721316	7.4991031884564e-08	2.54515615319795e-05
Kif5c	96.5914373777212	1.00812390422778	0.201471098022606	5.00381401661226	5.62069875378719e-07	0.000146195419088684
Kras	2739.0698514552	-0.297101066531261	0.0915110172843763	-3.24661527483625	0.0011678614240757	0.0432813470870813
LOC115488773	85.3141510859265	0.773653204853975	0.216534338014544	3.5728892329401	0.000353064131119982	0.018849255161069
LOC118567915	41.8413807752208	-1.35497777901573	0.380380519147859	-3.56216396689081	0.000367810537003017	0.0193586950604017
LOC118568626	1076.25684265634	0.307372376753035	0.0784704538774489	3.91704599075052	8.96406523731455e-05	0.00709261039053042
Lair1	2067.42116461479	0.400805233034088	0.0950283152388362	4.21774533229109	2.46757282010205e-05	0.00258734037893139
Larp1b	1463.45234882952	-0.293508884240146	0.0766711069911808	-3.82815503464567	0.000129107425793768	0.0090869814747781
Lgals3bp	4207.49722546976	0.329964535658879	0.0753925812654145	4.37661809850045	1.20534895262651e-05	0.00147799951787638
Lgals9	1396.82712880371	0.588160770979724	0.0878262591402939	6.69686693634752	2.12935344393652e-11	3.43278392080616e-08
Llgl2	421.825521505346	-0.764885497372446	0.218574382545826	-3.49942883728418	0.000466256042741217	0.0226064067038853
Lrp12	7228.3040873159	-0.443591668820576	0.133678363398436	-3.31835053589357	0.000905507691051399	0.037430553498365
Lrrc20	1357.75985522744	0.416309346637871	0.106080562842133	3.92446396855391	8.69230675316039e-05	0.00694417713665998
Lrrc75a	2419.73276789759	0.238848108186807	0.0694523812286658	3.43901971338349	0.000583824718581872	0.0273788470012945
Lrsam1	1047.60443081002	0.30801592873163	0.0836841506207113	3.68069612282589	0.00023259807394517	0.0139924180270621
Lyn	4744.11922683099	0.342693290230677	0.0886803878549283	3.86436390863881	0.000111379066883829	0.00820831900343279
Maf	1854.61080792094	0.755927836541213	0.187876066306146	4.02354515614256	5.7328586045332e-05	0.00496219311561508
Mafb	8645.45040635362	0.756216974077396	0.207723282690711	3.64050174964433	0.000272107258505704	0.0156668183613753
Maml2	1047.51869311453	0.560737855624021	0.100206933513504	5.59579897281712	2.19608047252662e-08	9.13640317876638e-06
Map11	1350.38883407146	0.358417413111935	0.0895990539123385	4.00023658132151	6.32791901563382e-05	0.00533991349196793
Map3k5	2006.44845396529	-0.676242063601654	0.190634415324786	-3.5473241410767	0.000389165465379269	0.0197601063267576
Mapkapk3	4732.36543656706	-0.242545659757987	0.0683372625281799	-3.54924459635722	0.000386338038664275	0.0196940778049532
Mdk	176.939196726965	0.611605866270352	0.183864333698021	3.32639753436277	0.000879763588949773	0.0366756644756083
Metrnl	1756.16748812905	-0.419691362653335	0.11780471741457	-3.56260234618947	0.000367196680214648	0.0193586950604017
Mib2	1714.16828627163	-0.366150692977863	0.110663876776523	-3.30867401037537	0.000937389129405268	0.0378981429527892
Midn	2531.34365142503	0.555321480801427	0.170190730698077	3.26293611011391	0.00110264374886951	0.0418258718505001
Mir155hg	96.8373210326414	-1.68242139251003	0.460803616727107	-3.65105943494878	0.000261160788738817	0.0153798661751805
Mov10	1773.24601460797	0.330680024726686	0.0730079970656387	4.52936716548167	5.91606142381786e-06	0.000877005105551482
Ms4a6c	462.024772016521	0.551734834522517	0.168624176946783	3.2719794071798	0.00106797354556348	0.0413611597677066
Ms4a7	853.423479372777	0.296919396907014	0.0908639997869704	3.26773416978273	0.00108412140079313	0.0414893581781276
Msantd2	1329.57482536849	-0.312814273189566	0.0946055822006352	-3.30650967853212	0.000944660869808423	0.0380727851184976
Mtbp	2582.95077538011	-0.395145321339758	0.0916049665737786	-4.31357966842888	1.60632217189504e-05	0.00181725763604653
Mthfd2	10613.0739262838	-0.369239299961753	0.0916816263495381	-4.02740783146691	5.63951633115618e-05	0.00494781238931437
Mtss1	5879.74439342363	0.280214679632057	0.0839523619526285	3.33778196485016	0.00084449988887674	0.0356124102880621
Mttp	499.99977639479	0.439166641945649	0.110748297966336	3.96544822818987	7.32581523269235e-05	0.00605647686256623
Mybl1	782.951719060232	-0.328224584064078	0.0966499054464176	-3.3960155734042	0.000683744691901447	0.0304077768670792
Naf1	6405.20715118604	-0.22410555991286	0.0636985533743352	-3.51822055668778	0.000434451113182867	0.0215504461796901
Napepld	1842.38231798812	0.521293494888993	0.0972958751340986	5.3578170109526	8.42334875117949e-08	2.78553663702466e-05
Nfam1	5121.9717854248	0.712483764073926	0.154825732405241	4.60184333059747	4.18768159665611e-06	0.000650705175326191
Nfe2l2	18304.3686431288	-0.448610037283321	0.128285146932878	-3.4969756671678	0.000470564751893417	0.0226595854327715
Nfkbie	1867.16432738464	-1.21159937149886	0.369411407806245	-3.27981038456274	0.00103876876438056	0.0407203670340916
Nfkbiz	4170.75870960091	-1.5459394174259	0.351281938103077	-4.40085085437064	1.07827223516309e-05	0.00137687891256419
Noct	2801.52870087983	-0.567341689082528	0.167469773587996	-3.38772589779863	0.000704746558055429	0.0310208749462146
Nr0b2	415.552325186677	0.543965530883828	0.153931386950745	3.53381816184042	0.000409602773394997	0.0205550465699427
Nr1d2	1244.13146163702	-0.314694660541064	0.0878360104929414	-3.58275220806338	0.000339993091550294	0.0184239113517821
Nr1h3	2992.53010201877	0.268599073572626	0.0739519203596667	3.63207706123504	0.000281149130602938	0.0160441607848942
Nr4a1	828.72694485971	-1.15255441590439	0.244566369683281	-4.71264474096327	2.44522279984372e-06	0.00042616268175114
Nr4a3	93.8592804887787	-1.75767961962546	0.362619921752	-4.84716783108116	1.25236476247282e-06	0.000256056373019336
Nuak2	1486.89440031833	0.303826199855156	0.0777334427667408	3.90856482153845	9.28460368996761e-05	0.00721346589093448
Oas2	510.732270067367	1.13002068515488	0.243123159821418	4.6479351699152	3.35274244413097e-06	0.000547345813948824
Oas3	934.948571232727	0.728939288882538	0.134095473322603	5.43597237715011	5.44983980235455e-08	1.95240510919352e-05
Odf2	3543.37299675003	-0.283037901781216	0.0655255695284526	-4.31950311638749	1.56380900662806e-05	0.00181697700526865
Osbp2	214.338000819092	-0.877628067633422	0.204302805494437	-4.2957220558448	1.7412563910008e-05	0.00193594686851184
Osm	1004.99685628016	-0.664810492150881	0.175368301002144	-3.79093877486304	0.000150078949766984	0.0100810844538791
P2ry6	1449.32533770722	1.18965533380585	0.124733804011614	9.5375535383742	1.46241402040682e-21	1.88607536211868e-17
Pak4	1057.57963625825	-0.324763757707218	0.0968942935548898	-3.35173255092925	0.000803075595797354	0.034069953812495
Pakap	231.263542683528	-1.33301872018965	0.356374338457317	-3.74050142319467	0.000183653506269588	0.0117839764694472
Paqr3	469.640187502054	-0.374645881364109	0.116107269782046	-3.22672199654154	0.00125217055239142	0.0454908270822314
Paqr7	2267.25172067179	0.470590768871532	0.143353371875175	3.2827324723223	0.00102806179734402	0.0404235152449567
Pard6b	809.567357208551	0.329996103429583	0.0858173260619712	3.84533192273182	0.000120389362649282	0.00872281803420105
Parp12	2455.58007945531	0.293418043039126	0.0751048322154089	3.90677982207018	9.35343113920412e-05	0.00722342523367159
Pck2	6207.2751236379	-0.307110832261883	0.0802963641729688	-3.82471654134085	0.000130922631157713	0.0090869814747781
Pcsk5	245.937084481995	4.49156955544158	1.36376921977994	3.29349679571618	0.000989494694732337	0.0392661940860398
Pdcd1	74.6171005563907	1.05871484083026	0.328086155736674	3.22694152837097	0.0012512102583176	0.0454908270822314
Pde1c	667.757924974014	-0.504045251238324	0.144222289062561	-3.49491922860605	0.000474205238142178	0.0227354087595527
Pde3b	2569.40710685254	-0.348740551428637	0.103849349773943	-3.35813899834488	0.000784691437523533	0.0335104816878841
Pde7b	274.498173498077	-1.17451955065166	0.25205717980814	-4.6597345552532	3.16617421407417e-06	0.000530313621284605
Pex5	2484.16446126707	-0.344892729250793	0.0847694772629549	-4.06859568310107	4.72973379640313e-05	0.00432619693419937
Pfkfb3	2952.81692992341	0.263419711164077	0.0824640145354632	3.19435953546495	0.00140141464613441	0.0495179306608094
Pfkp	5704.33036516135	-0.286822180208471	0.0709351087965136	-4.04344456609289	5.26716137126229e-05	0.00475298171489647
Pgap2	7314.0092415747	0.217584330527617	0.0643364553884259	3.38197572766435	0.000719665031354557	0.0315697956101351
Phf11d	523.393423515778	0.506453702590432	0.113408550328092	4.46574531748494	7.97904841912739e-06	0.00109474241980304
Phlda1	191.127654735982	-1.4041716384471	0.356256459065356	-3.94146296219011	8.09861417586675e-05	0.00656904572491531
Phlpp1	3819.51220658122	-0.378795281166776	0.111343689744955	-3.40203636177721	0.000668857379824201	0.0300566328487551
Plcd3	894.861107276693	-0.319419521925769	0.0899308625276744	-3.55183429745794	0.000382555692666282	0.0195786538425279
Plekhh3	1077.75112231765	-0.672044249047712	0.153079981450254	-4.39015110062646	1.13271923820902e-05	0.0014183184480759
Plk3	639.761979260084	-0.504851214216831	0.117274363488519	-4.30487277184204	1.67081730231441e-05	0.00187378528243034
Pnrc1	1204.251960596	-0.764604570656342	0.123192335895874	-6.2065920342854	5.41459168313804e-10	4.65546592916209e-07
Pou2f2	3739.44138897979	0.96753094365534	0.168872832273748	5.72934634084268	1.00818366194182e-08	4.81575729187543e-06
Ppp1r15a	2151.18133950071	-0.704566817124405	0.207601921208167	-3.39383572668348	0.000689210218570912	0.0305455126766634
Ppp1r15b	9909.56916969014	-0.256788698666378	0.0569356457022516	-4.51015695877535	6.47796772101807e-06	0.000929495081169184
Ppp1r21	1791.9191536084	0.306717886325045	0.0827504029365931	3.70654251146142	0.000210107981943866	0.0129734931655658
Ppp1r9b	6745.71277154398	0.336409071658608	0.0745937572600153	4.50988238179194	6.48635785882194e-06	0.000929495081169184
Prdm1	751.94088636901	-0.717004440099321	0.209185867997751	-3.42759502332647	0.000608953143155431	0.0281238894468892
Prkab2	700.366880694674	-0.420954194643691	0.11357544523025	-3.70638383842826	0.000210239596154397	0.0129734931655658
Prmt2	815.657740422893	-0.440081331683477	0.137642653444205	-3.19727439620939	0.00138732886025844	0.0492413793709194
Prrg4	867.305687230112	-1.01370882199263	0.181896969886828	-5.57298355559931	2.50413216279751e-08	9.78660378896952e-06
Psd2	306.743479245633	0.495067714069578	0.150222286399035	3.29556769462642	0.000982230357255075	0.0390982250540701
Pstpip1	1422.48511713209	0.712501476830243	0.142900057905002	4.98601251305234	6.16381542296365e-07	0.000149990051905589
Ptk2b	6648.10018167523	0.487844756355948	0.071312719300668	6.84092208430731	7.86850470007965e-12	1.69133508528212e-08
Ptpn22	424.380662997773	0.404634448137795	0.115458475776298	3.50458851476419	0.000457313516636942	0.0224167397036277
Ptpn6	15008.5459101166	0.392669205952507	0.0813808413324086	4.82508167184716	1.39945908292612e-06	0.000273467027159063
Ptprd	25.2285142927528	-1.51190451361645	0.431518398001906	-3.50368494279072	0.000458867898097054	0.0224167397036277
Pwwp3a	3141.64174190582	0.440545484700271	0.10033891168212	4.39057467651181	1.13051480923308e-05	0.0014183184480759
Rab20	1459.38977988661	-0.783563516224828	0.161856646317605	-4.84109571062824	1.29125157910207e-06	0.000256204178702761
Rab40c	3069.31242067542	0.423830141684059	0.103437443841558	4.09745374540838	4.17719601699909e-05	0.00388806474662967
Rac2	12796.8053606266	0.286349785772667	0.0756601099218943	3.78468635676412	0.000153902548039384	0.0102313461962059
Ralgds	1976.265457248	-0.685307424055008	0.200932677831647	-3.41063201590931	0.000648124994061713	0.0293293615733821
Rbm27	4216.27637343142	-0.217781050624739	0.0671585657879202	-3.24278888433188	0.00118365883210993	0.0436161370220622
Rc3h1	3627.27465594005	-0.393645082894354	0.0996555522895451	-3.9500567088388	7.81326791065029e-05	0.00637770355972511
Rel	4012.77542653828	-0.516563151008124	0.130033171498058	-3.97254904311736	7.11075899220577e-05	0.00595502978717388
Relt	1442.28954507199	0.302691013694336	0.0948790803080345	3.19028191158282	0.00142134071623638	0.0499483139435985
Resf1	3863.31317589295	-0.49990415122851	0.0843957832991194	-5.92333090216993	3.15485118065651e-09	1.93752931794891e-06
Rgs1	5593.91605147695	-0.439688845931579	0.091328191229653	-4.81438250349163	1.47655748443603e-06	0.000275987853286542
Rgs2	7850.78445798282	0.703157094185156	0.187850853457622	3.74316688608383	0.000181715452827053	0.0117179209755525
Rin2	1638.71753111865	0.839596564693755	0.224801016196198	3.73484328007212	0.000187832120600546	0.0119333539871194
Rnd1	609.394650524574	-0.891382973234055	0.213738243168537	-4.17044212593804	3.04009255613495e-05	0.00311175188067242
Rnf19a	1611.30105996368	-0.603140143856371	0.157705423282583	-3.82447306695117	0.000131052070582983	0.0090869814747781
Rnf2	2678.18451968313	-0.326409109072213	0.0875153511641609	-3.72973546618051	0.000191680905556234	0.0120736303994028
Rngtt	1585.00054359305	-0.253428829522925	0.0777825194175548	-3.25817203429037	0.00112132406157578	0.0421624385485213
Rsrp1	14836.9297791209	0.221498657503736	0.0678356451411232	3.26522519308156	0.00109377080997968	0.0416116877177226
Rusc2	2246.15591732095	-0.500478365092687	0.124458874183839	-4.02123487276149	5.78938439298337e-05	0.0049777127010871
S1pr2	3256.25717100646	0.449131748319088	0.0753091449007271	5.96384076477214	2.46376848027607e-09	1.67238011000634e-06
Scnn1a	179.007756312305	0.772069702278594	0.158361450105247	4.87536393336557	1.08608037067373e-06	0.00022592223452547
Sema4a	3978.96590362252	0.395556934344905	0.10884960710589	3.63397668454701	0.000279086093455157	0.0159972148768496
Sema4c	1056.58564896371	0.429935432193521	0.121283434558017	3.54488173723229	0.000392789277385791	0.0198658953350767
Serpina3f	28.0176806309287	2.22078130991306	0.452198894434563	4.91107195803733	9.05798372917614e-07	0.000191509534680631
Serpina3g	140.961294995691	1.43608597732683	0.276685019522613	5.19032790356567	2.09924067675077e-07	6.44616833525113e-05
Serpinb1a	2915.76731382947	-0.402103264537558	0.105128790235935	-3.82486342356968	0.00013084460174553	0.0090869814747781
Sertad2	2252.87065639813	-0.424091677224021	0.125577564674251	-3.37712933296738	0.000732466008911491	0.0318727005513107
Sesn2	2226.22942705414	-0.964808691941205	0.153010866683293	-6.30549132133338	2.87281101768929e-10	3.08755364126157e-07
Sft2d2	4638.19290521673	0.402345430552045	0.113057861595659	3.55875677174045	0.000372614398005348	0.0194269740020719
Sgk3	4684.71206540344	0.402099828759851	0.118086124686357	3.40514035690348	0.000661300553167274	0.0298209553643298
Sgms1	2163.08366557195	-0.451392496831098	0.141462106447061	-3.19090750285145	0.0014182667805087	0.0499483139435985
Sh2d3c	1185.78682870878	0.626685550899236	0.124591222984159	5.0299333764379	4.90650295176621e-07	0.000131831601185268
Sh3bp1	2597.21883642102	0.338665702285311	0.0967557368512624	3.50021314814567	0.000464886275410373	0.0226064067038853
Sh3bp2	5556.94093116524	0.255780916725776	0.0653442914834671	3.91435748890922	9.06452552212459e-05	0.0070973454284323
Sh3bp5	2856.57162664532	0.300033423661463	0.0847541493234933	3.54004406930311	0.000400060222240467	0.0201545964306067
Shtn1	7313.50630866967	0.327279826229272	0.065460686186102	4.99963940644968	5.74376313826226e-07	0.000146195419088684
Siah2	1309.13366070259	-0.283824727708502	0.0876660369692383	-3.2375676775271	0.00120553342088958	0.0442747835156988
Siglece	232.644154934384	1.23099173423073	0.213129492952065	5.77579253429557	7.65917015278483e-09	4.11584656085275e-06
Slc15a4	4344.66378891247	0.194243765106428	0.0579495996878763	3.35194317394164	0.000802464883924405	0.034069953812495
Slc1a4	2138.35220754538	-0.444607508379864	0.108445723118066	-4.09981597795069	4.13478784475274e-05	0.00388806474662967
Slc22a23	188.827698705152	-0.557969039274554	0.167175126637255	-3.33763192227311	0.000844956001251998	0.0356124102880621
Slc25a45	2550.13654322644	0.341700343867819	0.106154350575182	3.21890098725455	0.00128682910432455	0.0462290667366956
Slc40a1	6565.41597252087	-0.303467323836528	0.0889674694647714	-3.41099196888692	0.000647269979786313	0.0293293615733821
Slc6a9	1640.3859643402	-0.343669061518432	0.1062861299189	-3.23343282684828	0.00122312096528599	0.0446872268818512
Slc7a1	16915.7651952778	-0.318208385078185	0.0977643365360756	-3.25485137374982	0.00113451721244266	0.0425345014211425
Slc7a5	22500.0579295146	-0.207093533947747	0.0582462811599066	-3.55548079334373	0.000377288507640483	0.0194269740020719
Slc8b1	1760.49216207247	0.335430796019635	0.0741258832439133	4.52515074816567	6.03524710299293e-06	0.00088450661235568
Slf1	2103.61762405676	-0.269888144389203	0.074358578416029	-3.62954954409168	0.000283916236590992	0.0161306947282556
Slfn5	42.1494272736892	1.39500597827552	0.420766749695122	3.31539024717688	0.000915152692380763	0.0374689659480467
Sowahc	1570.82433466063	-0.404064500555521	0.112044598875963	-3.60628271785625	0.000310614715790868	0.0174934410024228
Spdl1	4399.06161579927	-0.32925137249358	0.0715140130625355	-4.60401197462749	4.14428618233089e-06	0.000650705175326191
Spic	543.597722200703	-1.01187836801887	0.250922060642618	-4.03264011712413	5.51537097677847e-05	0.00490563720603531
Srpk3	78.6161757537642	0.871616346734955	0.256412427565805	3.39927496888295	0.000675647529806747	0.0301516477228983
Sstr5	68.5346094005425	-1.46491701626205	0.397050276317995	-3.68950005487166	0.000224695179828427	0.0136051349025691
St8sia4	1154.84047169914	-0.455818687659107	0.109555157513619	-4.16063194106078	3.17368202227475e-05	0.00322291157805334
Stat1	2589.56173813268	0.265223970402863	0.0647107532736029	4.09860737181458	4.15643414690129e-05	0.00388806474662967
Stoml1	425.145282420254	0.401875195840569	0.117290531621918	3.42632257082781	0.000611813331542707	0.0281238894468892
Syt11	1682.7475429329	0.603628059056419	0.0956664159203745	6.30971750377722	2.79545249003059e-10	3.08755364126157e-07
Tap1	2247.86118016372	0.302275285718568	0.07006471590617	4.31422980610343	1.60160279748843e-05	0.00181725763604653
Tbc1d10a	1508.93034392843	-0.320520095662457	0.084284703122093	-3.80282641795817	0.000143054592900055	0.00981369725868089
Tbc1d13	5812.04815839066	0.268969768344993	0.0620156857233791	4.33712479685756	1.44358668746614e-05	0.00169253977347735
Tesk1	2492.03642427654	0.317947300704861	0.0765950056954361	4.15101869655982	3.3099872246982e-05	0.00333507072163536
Tfeb	1373.30922674235	0.655476150539849	0.168969831350323	3.87924959918353	0.000104779198479109	0.00782373920022196
Themis2	3319.99897522845	0.553707237991132	0.0813973446042493	6.80252212996917	1.02803218026941e-11	1.89407586127637e-08
Thoc2l	1041.07745544397	-0.420166044483802	0.120157145015393	-3.49680449240016	0.000470866782661298	0.0226595854327715
Tjap1	1836.58694614964	-0.30588838071761	0.0786215718754485	-3.89064188645573	9.99793949146407e-05	0.00758490738949483
Tjp2	5018.54604629737	-0.309215944716213	0.0953481353142876	-3.24302036633409	0.00118269756639475	0.0436161370220622
Tmem119	562.093110677992	0.753261878130213	0.226549578317146	3.32493171572239	0.000884401926953105	0.0366756644756083
Tmem170b	1357.48301074002	0.296664292820095	0.0892201823838444	3.32508054672856	0.000883929944162303	0.0366756644756083
Tmem176a	2151.87578085813	0.332755082716606	0.0871415223169112	3.81855944065863	0.000134233242763191	0.00925778680169454
Tmem176b	15418.1627725806	0.384633378535433	0.0980300901675686	3.92362567328008	8.72262306070339e-05	0.00694417713665998
Tmem229b	1659.1994607236	0.352381935900858	0.0708065249349812	4.97668733530471	6.46816746794527e-07	0.000153472528898167
Tmem241	567.129174280294	0.378705560840385	0.106331246455308	3.56156420116414	0.000368651935469334	0.0193586950604017
Tmem86a	576.61941206503	0.834005454712909	0.247249670569791	3.37313070141177	0.00074318665822688	0.0320564492680671
Tnfrsf12a	1067.96232856597	-0.480890650338818	0.108180748655981	-4.44525163962462	8.77890478207607e-06	0.00119180563130984
Tnfrsf13b	1436.77789855597	0.268624425454055	0.0805194257168593	3.33614432868228	0.000849490495042484	0.0356869020018336
Tnfsf13b	307.555287922567	0.514899526441631	0.15281991485465	3.36932216544788	0.00075353298144392	0.0323943828722741
Tnfsf9	755.499850194071	-1.46067825809989	0.255555670340902	-5.71569496443338	1.09256573181082e-08	5.03243580113006e-06
Tnks1bp1	423.881805337024	-0.412647802256641	0.121764967775074	-3.38888770552536	0.000701767431361326	0.0309955293228323
Tor3a	6764.97905681977	0.488861239717903	0.125965421256593	3.88091616604913	0.000104063710366172	0.00782373920022196
Tor4a	3584.33481696181	0.504940338485572	0.11911679107208	4.23903577271506	2.24481888919424e-05	0.00241261910116151
Trerf1	1260.25425315864	0.510565897031691	0.153306373069733	3.33036315978497	0.000867327828354385	0.0363179448126185
Trib3	2377.75485693755	-0.860177443836439	0.184385273859551	-4.6651092347627	3.08453137206014e-06	0.000523436856650785
Trim14	374.490760486081	0.523181746274961	0.120148813774357	4.35444787043436	1.33402720122089e-05	0.00157843567102256
Trip10	2360.49939623579	-0.394628942883574	0.107236994260055	-3.67997019691337	0.000233261213911635	0.0139924180270621
Trpc4	307.34829792738	0.920511615011644	0.145926057496152	6.30806883161299	2.8253856736818e-10	3.08755364126157e-07
Trpm1	906.533768255328	0.44295284268381	0.0999742673348888	4.43066855593978	9.3941384546547e-06	0.00126204378801752
Tspoap1	954.930338442206	0.718510562251687	0.137505443842159	5.2253244829816	1.73849963033666e-07	5.46864139815901e-05
Ttc21a	109.827299311761	0.830118444830587	0.224742657512811	3.69363989025211	0.000221066806110238	0.0134485782943573
Ttc39b	1791.96734283356	-0.350624882195865	0.107067910047857	-3.27478963621447	0.00105740681967563	0.0412005309769081
Twf2	3483.6213925676	0.292533761904124	0.0756759842738635	3.86560894729132	0.000110812368825437	0.00820831900343279
Uba7	457.740812948817	0.413478110348011	0.124686334156812	3.31614617707824	0.000912680765115177	0.0374689659480467
Ubash3b	3195.54133056122	0.575312291378149	0.115863158167599	4.96544631163898	6.85432537372485e-07	0.000155088130429701
Ubtd1	1564.40958845882	0.361405004353789	0.0816580667934116	4.42583346074203	9.60706231827791e-06	0.00127734312081268
Unc93b1	15346.8919097437	0.273953318666449	0.0583245541774416	4.69704951079432	2.63946488590989e-06	0.000453882381781065
Usp18	39.9833773137693	1.1648698682263	0.334867152673236	3.47860295919494	0.000504034771555692	0.0238114888232738
Vegfa	2605.06806532292	-0.60860719303169	0.0879377229136182	-6.92088870244603	4.48819012613085e-12	1.15768376113419e-08
Vezf1	2239.10558088712	-0.288223643942015	0.0749436685046676	-3.84587050104258	0.000120125197978289	0.00872281803420105
Wdfy2	3566.26786749797	0.449962099493202	0.133096684712759	3.38071605963952	0.000722972102025178	0.0316073599993855
Wnt6	584.218307360676	0.444078403241777	0.138317230672077	3.21057905138803	0.00132467827504776	0.047405305394709
Zbtb10	1108.67814565841	-0.532939868293865	0.141112383627916	-3.77670516642337	0.000158916661128781	0.0104568784621321
Zbtb40	2990.85307789602	-0.351644274851574	0.0977328695300986	-3.59801442996902	0.000320655832406824	0.0177489196160979
Zfp710	4456.07102100638	0.463590356890599	0.0800768967032147	5.78931472093358	7.06741664948574e-09	3.96297706645294e-06
Zswim4	1794.24338257661	-0.691798186610937	0.143552240234879	-4.81913891053891	1.44179145168033e-06	0.000275987853286542
