{
    "authors": [
        "damien.dosimont@bsc.es",
        "guillaume.houzeaux@bsc.es"
    ],
    "comparisons": [],
    "description": "Turbulent flow over a sphere. Vreman turbulence model, convective term using the EMACS scheme. Solution strategy: fractional step with Runge-Kutta of order 3. Algebraic solvers: CG",
    "executions": [
        {
            "commands": {
                "modules": [
                    "ALYA/mpio"
                ],
                "postprocess": "rm -fr *post.mpio.bin"
            },
            "mpi": 336,
            "openmp": 0,
            "include": [
                "bsc",
                "mn"
            ]
        },
        {
            "commands": {
                "modules": [
                    "ALYA/mpio"
                ],
                "bind": "--bind-to core",
                "map": "--map-by ppr:23:socket"
                "postprocess": "rm -fr *post.mpio.bin"
            },
            "mpi": 322,
            "openmp": 0,
            "include": [
                "bsc",
                "mn"
            ],
            "sbatch": {
                "--ntasks-per-node": 46,
                "--ntasks-per-socket": 23
            }
        }
    ],
    "geometry": {
        "elements": 16677400,
        "nodes": 2876880
    },
    "modules": [
        "nastin"
    ],
    "name": "sphere-16M-MPIO-async",
    "postprocess": "none",
    "timeout": "02:00:00"
}
