date,close
2014-06-13,178.05
2014-06-16,176.88
2014-06-17,178.22
2014-06-18,176.68
2014-06-19,174.39
2014-06-20,174.4999
2014-06-23,177.54
2014-06-24,181.19
2014-06-25,184.46
2014-06-26,183.71
2014-06-27,184.96
2014-06-30,186.81
2014-07-01,191.28
2014-07-02,189.96
2014-07-03,191.2
2014-07-07,188
2014-07-08,182.3
2014-07-09,184.94
2014-07-10,183.32
2014-07-11,186.1
2014-07-14,188.52
2014-07-15,189.87
2014-07-16,189.42
2014-07-17,186.91
2014-07-18,191.17
2014-07-21,197.72
2014-07-22,198.43
2014-07-23,200.12
2014-07-24,204.27
2014-07-25,226.5
2014-07-28,225.8
2014-07-29,220
2014-07-30,219.13
2014-07-31,216.05
2014-08-01,212.38
2014-08-04,218.9
2014-08-05,215.57
2014-08-06,215.14
2014-08-07,213.51
2014-08-08,215.09
2014-08-11,217.98
2014-08-12,216.16
2014-08-13,218.59
2014-08-14,219.58
2014-08-15,218.85
2014-08-18,219.24
2014-08-19,218.21
2014-08-20,219.02
2014-08-21,216.84
2014-08-22,214.19
2014-08-25,216.8
2014-08-26,216.08
2014-08-27,215.46
2014-08-28,213.81
2014-08-29,214.52
2014-09-02,224.8
2014-09-03,227.45
2014-09-04,224.2
2014-09-05,226.7
2014-09-08,225.46
2014-09-09,221.23
2014-09-10,220.68
2014-09-11,220.02
2014-09-12,217.96
2014-09-15,210.73
2014-09-16,215.57
2014-09-17,219.08
2014-09-18,228.45
2014-09-19,224.93
2014-09-22,214.86
2014-09-23,214.79
2014-09-24,221.97
2014-09-25,217.55
2014-09-26,219.02
2014-09-29,220.47
2014-09-30,218.23
2014-10-01,212.03
2014-10-02,214.8
2014-10-03,216.45
2014-10-06,217.2
2014-10-07,215.63
2014-10-08,217.54
2014-10-09,213
2014-10-10,203.35
2014-10-13,199.68
2014-10-14,199.07
2014-10-15,205.73
2014-10-16,211.22
2014-10-17,211.73
2014-10-20,216.62
2014-10-21,222.35
2014-10-22,219.26
2014-10-23,217.03
2014-10-24,222.55
2014-10-27,219.92
2014-10-28,228.96
2014-10-29,224.55
2014-10-30,237.01
2014-10-31,238.77
2014-11-03,236.54
2014-11-04,241.96
2014-11-05,237.7
2014-11-06,236.9
2014-11-07,236.54
2014-11-10,247.58
2014-11-11,250.34
2014-11-12,249.82
2014-11-13,244.09
2014-11-14,249.7
2014-11-17,244.15
2014-11-18,242.75
2014-11-19,240.42
2014-11-20,238.39
2014-11-21,245.3
2014-11-24,243.91
2014-11-25,244.34
2014-11-26,246.03
2014-11-28,245.11
2014-12-01,236.61
2014-12-02,234.74
2014-12-03,231.29
2014-12-04,230.81
2014-12-05,232.72
2014-12-08,227.67
2014-12-09,229.9
2014-12-10,225.12
2014-12-11,229.23
2014-12-12,229.32
2014-12-15,225.81
2014-12-16,219.96
2014-12-17,223.85
2014-12-18,231.88
2014-12-19,234.23
2014-12-22,234.6
2014-12-23,233.16
2014-12-24,230.98
2014-12-26,234.88
2014-12-29,230.21
2014-12-30,230.01
2014-12-31,227.97
2015-01-02,223.08
2015-01-05,219.785
2015-01-06,220.18
2015-01-07,224.35
2015-01-08,229.21
2015-01-09,226.9
2015-01-12,220.89
2015-01-13,219.6
2015-01-14,216.82
2015-01-15,215.97
2015-01-16,220.195
2015-01-20,220.36
2015-01-21,228.28
2015-01-22,229.88
2015-01-23,233.325
2015-01-26,229.455
2015-01-27,227.53
2015-01-28,220.31
2015-01-29,220.39
2015-01-30,217.92
2015-02-02,217.595
2015-02-03,217.16
2015-02-04,217.24
2015-02-05,216.8
2015-02-06,211.78
2015-02-09,215.03
2015-02-10,219.44
2015-02-11,214.67
2015-02-12,205.02
2015-02-13,212.13
2015-02-17,208.81
2015-02-18,207.15
2015-02-19,207.24
2015-02-20,209.63
2015-02-23,206.43
2015-02-24,208.06
2015-02-25,203.53
2015-02-26,205.88
2015-02-27,203.75
2015-03-02,205.04
2015-03-03,206.34
2015-03-04,207.69
2015-03-05,214.23
2015-03-06,213.31
2015-03-09,211.615
2015-03-10,210.39
2015-03-11,204.38
2015-03-12,203.39
2015-03-13,204.445
2015-03-16,205.3
2015-03-17,203.265
2015-03-18,210.95
2015-03-19,214.57
2015-03-20,212.69
2015-03-23,216.78
2015-03-24,213.6
2015-03-25,207.74
2015-03-26,205.44
2015-03-27,207.33
2015-03-30,210.54
2015-03-31,208.4
2015-04-01,211.07
2015-04-02,208.51
2015-04-06,203.6
2015-04-07,203.865
2015-04-08,212.84
2015-04-09,218.475
2015-04-10,214.79
2015-04-13,215.4
2015-04-14,213.91
2015-04-15,210.77
2015-04-16,206.9
2015-04-17,207.87
2015-04-20,211.86
2015-04-21,212.845
2015-04-22,213.37
2015-04-23,212.28
2015-04-24,216.9
2015-04-27,220.46
2015-04-28,219.19
2015-04-29,219
2015-04-30,200.28
2015-05-01,202.47
2015-05-04,203.7
2015-05-05,194.74
2015-05-06,190.05
2015-05-07,193.63
2015-05-08,193.54
2015-05-11,190.835
2015-05-12,189.97
2015-05-13,189.18
2015-05-14,190.27
2015-05-15,192.98
2015-05-18,191.32
2015-05-19,193.14
2015-05-20,195.51
2015-05-21,200.13
2015-05-22,203.8
2015-05-26,200.19
2015-05-27,201.45
2015-05-28,200.27
2015-05-29,197.4
2015-06-01,201.56
2015-06-02,203.36
2015-06-03,203.88
2015-06-04,204.325
2015-06-05,205.89
2015-06-08,203.15
2015-06-09,202.56
2015-06-10,204.63
2015-06-11,206.77
2015-06-12,207.6
2015-06-15,205.73
2015-06-16,205
2015-06-17,209.51
2015-06-18,210.7
2015-06-19,210.87
2015-06-22,209.64
2015-06-23,211.98
2015-06-24,210.32
2015-06-25,207.55
2015-06-26,203.36
2015-06-29,200.5
2015-06-30,199.08
2015-07-01,198.71
2015-07-02,197.03
2015-07-06,189.03
2015-07-07,187.54
2015-07-08,184.58
2015-07-09,187.57
2015-07-10,187.75
2015-07-13,193.27
2015-07-14,191.28
2015-07-15,186.58
2015-07-16,190.1
2015-07-17,198.44
2015-07-20,199.61
2015-07-21,202.4
2015-07-22,205.74
2015-07-23,207.63
2015-07-24,206.25
2015-07-27,197.68
2015-07-28,168.03
2015-07-29,170.01
2015-07-30,174.47
2015-07-31,172.66
2015-08-03,169.14
2015-08-04,170.32
2015-08-05,172.74
2015-08-06,174.46
2015-08-07,176.08
2015-08-10,176.85
2015-08-11,167.94
2015-08-12,160.82
2015-08-13,160.89
2015-08-14,164.24
2015-08-17,167.43
2015-08-18,166.11
2015-08-19,162.89
2015-08-20,157.4
2015-08-21,152.91
2015-08-24,141.08
2015-08-25,136.99
2015-08-26,142.4
2015-08-27,152.06
2015-08-28,152.13
2015-08-31,147.25
2015-09-01,143.57
2015-09-02,148.15
2015-09-03,149.08
2015-09-04,146
2015-09-08,148.18
2015-09-09,150.11
2015-09-10,146.75
2015-09-11,144.03
2015-09-14,141.27
2015-09-15,141.4
2015-09-16,150.35
2015-09-17,147.06
2015-09-18,142.57
2015-09-21,140.84
2015-09-22,136.12
2015-09-23,132.37
2015-09-24,132.59
2015-09-25,134.34
2015-09-28,133.06
2015-09-29,136.68
2015-09-30,137.41
2015-10-01,137.53
2015-10-02,148.51
2015-10-05,149.62
2015-10-06,149.8
2015-10-07,144.77
2015-10-08,141.26
2015-10-09,144.22
2015-10-12,144.07
2015-10-13,146.5
2015-10-14,145.02
2015-10-15,150.24
2015-10-16,151
2015-10-19,154.68
2015-10-20,153.21
2015-10-21,149.63
2015-10-22,153.5
2015-10-23,157.6
2015-10-26,166.24
2015-10-27,173.86
2015-10-28,172.54
2015-10-29,168.99
2015-10-30,187.47
2015-11-02,195.19
2015-11-03,192.5
2015-11-04,197.92
2015-11-05,198.91
2015-11-06,200.3
2015-11-09,194.01
2015-11-10,196.99
2015-11-11,199.49
2015-11-12,198.14
2015-11-13,193.95
2015-11-16,198.72
2015-11-17,196.83
2015-11-18,204.73
2015-11-19,207.8
2015-11-20,206.69
2015-11-23,207.46
2015-11-24,205.33
2015-11-25,201.8
2015-11-27,205.58
2015-11-30,217.97
2015-12-01,214.11
2015-12-02,211.36
2015-12-03,207.48
2015-12-04,208.3
2015-12-07,208.54
2015-12-08,205.02
2015-12-09,200.46
2015-12-10,200.01
2015-12-11,193.68
2015-12-14,193.89
2015-12-15,199.13
2015-12-16,199.34
2015-12-17,196.94
2015-12-18,191.92
2015-12-21,197.44
2015-12-22,197.03
2015-12-23,196.53
2015-12-24,193.93
2015-12-28,192.8
2015-12-29,194.68
2015-12-30,192.13
2015-12-31,189.04
2016-01-04,184.03
2016-01-05,187.37
2016-01-06,185.61
2016-01-07,174.37
2016-01-08,171.34
2016-01-11,170.37
2016-01-12,172.91
2016-01-13,166.04
2016-01-14,172.23
2016-01-15,163.92
2016-01-19,166.03
2016-01-20,164.99
2016-01-21,169.56
2016-01-22,171.17
2016-01-25,167.54
2016-01-26,167.08
2016-01-27,158.27
2016-01-28,156.94
2016-01-29,163.27
2016-02-01,161.1
2016-02-02,154.82
2016-02-03,153.08
2016-02-04,152.59
2016-02-05,145.34
2016-02-08,145.05
2016-02-09,140.68
2016-02-10,143.78
2016-02-11,141.21
2016-02-12,152.73
2016-02-16,157.52
2016-02-17,163.53
2016-02-18,160.7
2016-02-19,164.47
2016-02-22,168.67
2016-02-23,161.02
2016-02-24,162.75
2016-02-25,158.22
2016-02-26,173.8
2016-02-29,173.42
2016-03-01,180.2
2016-03-02,176.94
2016-03-03,177.3
2016-03-04,178.55
2016-03-07,177.2
2016-03-08,172.81
2016-03-09,176.5
2016-03-10,176.08
2016-03-11,182.98
2016-03-14,182.02
2016-03-15,180.22
2016-03-16,183.05
2016-03-17,183.44
2016-03-18,187.92
2016-03-21,187.12
2016-03-22,188.4
2016-03-23,183.84
2016-03-24,184.86
2016-03-28,185.17
2016-03-29,189.84
2016-03-30,189.89
2016-03-31,190.88
2016-04-01,190.33
2016-04-04,188.97
2016-04-05,183.8
2016-04-06,186.82
2016-04-07,182.53
2016-04-08,183.98
2016-04-11,185.07
2016-04-12,187.4
2016-04-13,193.98
2016-04-14,195.72
2016-04-15,193.22
2016-04-18,192.94
2016-04-19,194.52
2016-04-20,193.67
2016-04-21,192.74
2016-04-22,190.76
2016-04-25,188.04
2016-04-26,188.25
2016-04-27,187.95
2016-04-28,186.02
2016-04-29,194.3
2016-05-02,178.91
2016-05-03,174.36
2016-05-04,177.28
2016-05-05,175.22
2016-05-06,173.94
2016-05-09,169.49
2016-05-10,166.21
2016-05-11,163.05
2016-05-12,161.28
2016-05-13,159.75
2016-05-16,167.96
2016-05-17,171.04
2016-05-18,169.45
2016-05-19,168.51
2016-05-20,170.05
2016-05-23,169.77
2016-05-24,175.91
2016-05-25,176.71
2016-05-26,177.67
2016-05-27,185.01
2016-05-31,178.54
2016-06-01,176.53
2016-06-02,175.64
2016-06-03,173.74
2016-06-06,174.62
2016-06-07,170.86
2016-06-08,168.71
2016-06-09,168.99
2016-06-10,164.28
2016-06-13,163.55
2016-06-14,160.84
2016-06-15,161.03
2016-06-16,165.52
2016-06-17,162.68
2016-06-20,166.53
2016-06-21,162.8
2016-06-22,162.22
2016-06-23,163.92
2016-06-24,159.12
2016-06-27,156.92
2016-06-28,160.41
2016-06-29,164.41
2016-06-30,165.15
2016-07-01,165.19
2016-07-05,161.87
2016-07-06,161.56
2016-07-07,163.42
2016-07-08,159.8
2016-07-11,167.03
2016-07-12,164.98
2016-07-13,164.16
2016-07-14,164.85
2016-07-15,162.74
2016-07-18,164.79
2016-07-19,161.19
2016-07-20,160.65
2016-07-21,161.4
2016-07-22,160.88
2016-07-25,160.25
2016-07-26,164.03
2016-07-27,165.5
2016-07-28,165.63
2016-07-29,159.6
2016-08-01,163.23
2016-08-02,160.75
2016-08-03,162.24
2016-08-04,162.56
2016-08-05,167.38
2016-08-08,166.45
2016-08-09,165.54
2016-08-10,165.63
2016-08-11,167.72
2016-08-12,167.98
2016-08-15,172.95
2016-08-16,173.3
2016-08-17,172.73
2016-08-18,175.4
2016-08-19,177.53
2016-08-22,173.85
2016-08-23,173.49
2016-08-24,171.49
2016-08-25,172.85
2016-08-26,173.47
2016-08-29,173.65
2016-08-30,175.45
2016-08-31,171.07
2016-09-01,176.55
2016-09-02,177.78
2016-09-06,189.06
2016-09-07,189.15
2016-09-08,187.5
2016-09-09,182.1
2016-09-12,184.13
2016-09-13,181.9
2016-09-14,182.18
2016-09-15,186.5
2016-09-16,185.01
2016-09-19,184.74
2016-09-20,186.37
2016-09-21,196.03
2016-09-22,195.45
2016-09-23,191.72
2016-09-26,188.86
2016-09-27,190.83
2016-09-28,187.74
2016-09-29,182.23
2016-09-30,182.07
2016-10-03,183.54
2016-10-04,184.08
2016-10-05,184.11
2016-10-06,181.52
2016-10-07,179.8
2016-10-10,181.49
2016-10-11,177.04
2016-10-12,175.41
2016-10-13,174.61
2016-10-14,175.51
2016-10-17,175.15
2016-10-18,175.65
2016-10-19,176.2
2016-10-20,175.17
2016-10-21,176.76
2016-10-24,180.86
2016-10-25,176.68
2016-10-26,172.82
2016-10-27,175.1
2016-10-28,179.59
2016-10-31,176.86
2016-11-01,173.49
2016-11-02,168.78
2016-11-03,168.57
2016-11-04,167.7
2016-11-07,171.56
2016-11-08,170.92
2016-11-09,168.66
2016-11-10,163.47
2016-11-11,162.95
2016-11-14,161.73
2016-11-15,164.44
2016-11-16,166.74
2016-11-17,166.21
2016-11-18,164.38
2016-11-21,165.69
2016-11-22,164.47
2016-11-23,163.63
2016-11-25,164.44
2016-11-28,167
2016-11-29,169.18
2016-11-30,166.95
2016-12-01,163.08
2016-12-02,161.67
2016-12-05,164.32
2016-12-06,165.17
2016-12-07,169.33
2016-12-08,167.75
2016-12-09,170.82
2016-12-12,168.48
2016-12-13,171.46
2016-12-14,169.83
2016-12-15,165.78
2016-12-16,164.93
2016-12-19,163.69
2016-12-20,165.28
2016-12-21,163.92
2016-12-22,162.89
2016-12-23,163.62
2016-12-27,164.77
2016-12-28,165.54
2016-12-29,166.5
2016-12-30,164.41
2017-01-03,168.3
2017-01-04,171.96
2017-01-05,177.47
2017-01-06,176.38
2017-01-09,177.16
2017-01-10,180.31
2017-01-11,179.32
2017-01-12,177.57
2017-01-13,176.48
2017-01-17,176.96
2017-01-18,176.54
2017-01-19,176.09
2017-01-20,173.44
2017-01-23,175.97
2017-01-24,176.05
2017-01-25,176.61
2017-01-26,174.95
2017-01-27,174.1
2017-01-30,174.72
2017-01-31,175.07
2017-02-01,173.82
2017-02-02,173.4
2017-02-03,175.17
2017-02-06,177.81
2017-02-07,178.17
2017-02-08,181.5
2017-02-09,181.5
2017-02-10,183.99
2017-02-13,184.31
2017-02-14,182.77
2017-02-15,183.58
2017-02-16,184.94
2017-02-17,185.17
2017-02-21,185.62
2017-02-22,186.01
2017-02-23,184.64
2017-02-24,175.17
2017-02-27,172.97
2017-02-28,174.13
2017-03-01,175.33
2017-03-02,174.48
2017-03-03,173.79
2017-03-06,173.3
2017-03-07,173.74
2017-03-08,173.87
2017-03-09,173.32
2017-03-10,172.74
2017-03-13,173.25
2017-03-14,172.84
2017-03-15,172.04
2017-03-16,176.57
2017-03-17,176.62
2017-03-20,176.13
2017-03-21,171.4
2017-03-22,169.56
2017-03-23,169.61
2017-03-24,168.26
2017-03-27,168.93
2017-03-28,169.79
2017-03-29,170.66
2017-03-30,172.36
2017-03-31,172.52
2017-04-03,175
2017-04-04,175.2
2017-04-05,172.92
2017-04-06,173.38
2017-04-07,172.44
2017-04-10,174.22
2017-04-11,173.01
2017-04-12,173.61
2017-04-13,172.61
2017-04-17,173.31
2017-04-18,174.47
2017-04-19,177.81
2017-04-20,178.64
2017-04-21,178.08
2017-04-24,180.03
2017-04-25,186.99
2017-04-26,186.67
2017-04-27,187.86
2017-04-28,180.23
2017-05-01,180.06
2017-05-02,178.64
2017-05-03,177.4
2017-05-04,176.71
2017-05-05,178.03
2017-05-08,177.47
2017-05-09,182.98
2017-05-10,183.57
2017-05-11,186.6
2017-05-12,186.83
2017-05-15,186.14
2017-05-16,190.64
2017-05-17,186.05
2017-05-18,182.43
2017-05-19,188.76
2017-05-22,191.69
2017-05-23,191.8
2017-05-24,190.63
2017-05-25,191.95
2017-05-26,190.39
2017-05-30,189.88
2017-05-31,186.1
2017-06-01,187.26
2017-06-02,187.6
2017-06-05,187.31
2017-06-06,185.75
2017-06-07,187.53
2017-06-08,185.75
2017-06-09,181.07
2017-06-12,180.06
2017-06-13,179.19
2017-06-14,178.2
2017-06-15,176.33
2017-06-16,173.88
2017-06-19,176.93
2017-06-20,177.85
2017-06-21,180.17
2017-06-22,179.33
2017-06-23,178.14
2017-06-26,178.46
2017-06-27,175.6
2017-06-28,178
2017-06-29,179.63
2017-06-30,178.86
2017-07-03,179.97
2017-07-05,183.83
2017-07-06,181.79
2017-07-07,181.4
2017-07-10,182.93
2017-07-11,184.41
2017-07-12,186.76
2017-07-13,186.92
2017-07-14,188.55
2017-07-17,188.23
2017-07-18,189.51
2017-07-19,190.91
2017-07-20,191.32
2017-07-21,193.18
2017-07-24,198.65
2017-07-25,197.05
2017-07-26,201.17
2017-07-27,201
2017-07-28,220
2017-07-31,226.35
2017-08-01,227.16
2017-08-02,221.96
2017-08-03,227.39
2017-08-04,226.05
2017-08-07,227.16
2017-08-08,229.45
2017-08-09,230.3
2017-08-10,222.57
2017-08-11,223.49
2017-08-14,223.69
2017-08-15,225.33
2017-08-16,226.14
2017-08-17,221.05
2017-08-18,220.69
2017-08-21,222.48
2017-08-22,226.11
2017-08-23,224.99
2017-08-24,224.86
2017-08-25,225.55
2017-08-28,219.99
2017-08-29,220.69
2017-08-30,223.88
2017-08-31,228.05
2017-09-01,232.64
2017-09-05,225.3
2017-09-06,226.97
2017-09-07,233.18
2017-09-08,229.23
2017-09-11,233.5
2017-09-12,237.6
2017-09-13,236.41
2017-09-14,237.33
2017-09-15,235.21
2017-09-18,239.07
2017-09-19,237.85
2017-09-20,237.96
2017-09-21,238.92
2017-09-22,240.57
2017-09-25,234.49
2017-09-26,236.19
2017-09-27,239.82
2017-09-28,241.28
2017-09-29,247.69
2017-10-02,248.67
2017-10-03,247
2017-10-04,243.97
2017-10-05,245.27
2017-10-06,247.69
2017-10-09,252.22
2017-10-10,262.41
2017-10-11,260.32
2017-10-12,259.33
2017-10-13,262.68
2017-10-16,272.82
2017-10-17,270.32
2017-10-18,268.97
2017-10-19,264.52
2017-10-20,264.9
2017-10-23,266.13
2017-10-24,264
2017-10-25,263.04
2017-10-26,260.62
2017-10-27,239.37
2017-10-30,236.42
2017-10-31,243.94
2017-11-01,245.43
2017-11-02,242.09
2017-11-03,241.54
2017-11-06,244.53
2017-11-07,243.47
2017-11-08,241.18
2017-11-09,240.06
2017-11-10,237.4
2017-11-13,237.37
2017-11-14,234.92
2017-11-15,234.21
2017-11-16,239.32
2017-11-17,239.27
2017-11-20,238.54
2017-11-21,244.3
2017-11-22,249.65
2017-11-24,249.42
2017-11-27,247.02
2017-11-28,244.03
2017-11-29,235.49
2017-11-30,238.58
2017-12-01,235.07
2017-12-04,229.66
2017-12-05,231.75
2017-12-06,231.15
2017-12-07,233.01
2017-12-08,234.59
2017-12-11,233.54
2017-12-12,232.73
2017-12-13,233.24
2017-12-14,231.82
2017-12-15,233.48
2017-12-18,240.93
2017-12-19,235.62
2017-12-20,233.37
2017-12-21,239.49
2017-12-22,239.05
2017-12-26,237.83
2017-12-27,237.71
2017-12-28,234.74
2017-12-29,234.21
2018-01-02,242.4
2018-01-03,245.55
2018-01-04,245.73
2018-01-05,245.14
2018-01-08,250.82
2018-01-09,254.73
2018-01-10,248.95
2018-01-11,250.22
2018-01-12,253.04
2018-01-16,257.78
2018-01-17,255.49
2018-01-18,254.96
2018-01-19,255.98
2018-01-22,254.34
2018-01-23,257.35
2018-01-24,257.96
2018-01-25,254.14
2018-01-26,260.25
2018-01-29,253.73
2018-01-30,244.07
2018-01-31,246.92
2018-02-01,240.53
2018-02-02,233.17
2018-02-05,225.32
2018-02-06,228.77
2018-02-07,222.5
2018-02-08,212.07
2018-02-09,215.67
2018-02-12,221.64
2018-02-13,225.6
2018-02-14,235.89
2018-02-15,248.2
2018-02-16,244.72
2018-02-20,245.43
2018-02-21,246.92
2018-02-22,249.35
2018-02-23,250.74
2018-02-26,256.25
2018-02-27,250.46
2018-02-28,252.34
2018-03-01,249.75
2018-03-02,250.6
2018-03-05,254.89
2018-03-06,258.73
2018-03-07,257.26
2018-03-08,257.14
2018-03-09,263.56
2018-03-12,265.67
2018-03-13,258.35
2018-03-14,259.35
2018-03-15,262.71
2018-03-16,262.39
2018-03-19,252.83
2018-03-20,254.46
2018-03-21,250.05
2018-03-22,236.11
2018-03-23,230.08
2018-03-26,235.94
2018-03-27,230.96
2018-03-28,223.1
2018-03-29,223.19
2018-04-02,220.06
2018-04-03,220.02
2018-04-04,224.3
2018-04-05,225.57
2018-04-06,219.82
2018-04-09,224.33
2018-04-10,231.5
2018-04-11,229.65
2018-04-12,231.34
2018-04-13,228.17
2018-04-16,229.9
2018-04-17,235.67
2018-04-18,237.75
2018-04-19,237.11
2018-04-20,232.5
2018-04-23,231.42
2018-04-24,231.41
2018-04-25,231.41
2018-04-26,238.69
2018-04-27,251.93
2018-04-30,250.9
2018-05-01,252.13
2018-05-02,249.8
2018-05-03,252.46
2018-05-04,251.73
2018-05-07,253.9
2018-05-08,263.09
2018-05-09,261.29
2018-05-10,268.68
2018-05-11,269.91
2018-05-14,272.26
2018-05-15,271.92
2018-05-16,284.07
2018-05-17,279.68
2018-05-18,253.01
2018-05-21,240.51
2018-05-22,239.97
2018-05-23,240.39
2018-05-24,240.28
2018-05-25,243.8
2018-05-29,242.05
2018-05-30,241.63
2018-05-31,242.56
2018-06-01,248.46
2018-06-04,260.9
2018-06-05,259.98
2018-06-06,263.94
2018-06-07,264.89
2018-06-08,263.59
2018-06-11,269.78
2018-06-12,267.42
2018-06-13,270
2018-06-14,270.64
2018-06-15,272.97
2018-06-18,268.89
2018-06-19,262.11
2018-06-20,264.06
2018-06-21,260.5
2018-06-22,259
2018-06-25,250.41
2018-06-26,250.77
2018-06-27,243
2018-06-28,242.21
2018-06-29,243
2018-07-02,246.25
2018-07-03,246.43
2018-07-05,244.07
2018-07-06,251.77
2018-07-09,261.97
2018-07-10,261.25
2018-07-11,261.25
2018-07-12,271.45
2018-07-13,267.19
2018-07-16,267.08
2018-07-17,270.02
2018-07-18,269.42
2018-07-19,262.42
2018-07-20,259.98
2018-07-23,260.38
2018-07-24,256.48
2018-07-25,262.91
2018-07-26,260.35
2018-07-27,255.09
2018-07-30,251.4
2018-07-31,247.18
2018-08-01,228.07
2018-08-02,230.46
2018-08-03,235.65
2018-08-06,232.96
2018-08-07,226.67
2018-08-08,222
2018-08-09,219.89
2018-08-10,220.1
2018-08-13,217.57
2018-08-14,216.21
2018-08-15,213.47
2018-08-16,217.3
2018-08-17,222.67
2018-08-20,223.71
2018-08-21,223.13
2018-08-22,223.03
2018-08-23,219.3
2018-08-24,224.36
2018-08-27,228.61
2018-08-28,225.72
2018-08-29,225.87
2018-08-30,224.25
2018-08-31,226.48
2018-09-04,222.18
2018-09-05,216.24
2018-09-06,215.05
2018-09-07,216.04
2018-09-10,213.59
2018-09-11,216.1
2018-09-12,218.69
2018-09-13,222.42
2018-09-14,220.03
2018-09-17,217.66
2018-09-18,216.88
2018-09-19,226.41
2018-09-20,230.62
2018-09-21,228.85
2018-09-24,226.63
2018-09-25,226.6
2018-09-26,228.42
2018-09-27,230.47
2018-09-28,228.68
2018-10-01,227.4
2018-10-02,218.9
2018-10-03,216.35
2018-10-04,210.07
2018-10-05,205.62
2018-10-08,203.98
2018-10-09,200.85
2018-10-10,194.26
2018-10-11,198
2018-10-12,204.36
2018-10-15,200.12
2018-10-16,203.21
2018-10-17,200.72
2018-10-18,191.88
2018-10-19,191.92
2018-10-22,196.19
2018-10-23,193.42
2018-10-24,184.47
2018-10-25,190.43
2018-10-26,188.51
2018-10-29,181.75
2018-10-30,183.37
2018-10-31,190.06
2018-11-01,201.47
2018-11-02,194.69
2018-11-05,190.59
2018-11-06,192.44
2018-11-07,195.41
2018-11-08,188.55
2018-11-09,183.75
2018-11-12,180.43
2018-11-13,183.34
2018-11-14,185.06
2018-11-15,188.41
2018-11-16,186.95
2018-11-19,183.09
2018-11-20,177.48
2018-11-21,183.95
2018-11-23,182.61
2018-11-26,185.19
2018-11-27,182.79
2018-11-28,188.44
2018-11-29,183.22
2018-11-30,188.28
2018-12-03,191.33
2018-12-04,182.66
2018-12-06,180.7
2018-12-07,179.56
2018-12-10,179.2
2018-12-11,176.85
2018-12-12,179.75
2018-12-13,179.9
2018-12-14,177.54
2018-12-17,169.86
2018-12-18,167.61
2018-12-19,162.48
2018-12-20,160.36
2018-12-21,157.42
2018-12-24,157.12
2018-12-26,163.04
2018-12-27,161.58
2018-12-28,162.17
2018-12-31,158.6
2019-01-02,162.25
2019-01-03,154.71
2019-01-04,160.95
2019-01-07,162.6
2019-01-08,163.4
2019-01-09,166.64
2019-01-10,168.35
2019-01-11,166.11
2019-01-14,163.03
2019-01-15,167.93
2019-01-16,169.75
2019-01-17,168.11
2019-01-18,171.36
2019-01-22,160.39
2019-01-23,163.26
2019-01-24,162.7
2019-01-25,167.1
2019-01-28,167.5
2019-01-29,165.27
2019-01-30,169.34
2019-01-31,172.63
2019-02-01,171.27
2019-02-04,173.94
2019-02-05,176.23
2019-02-06,173.85
2019-02-07,171.58
2019-02-08,169.9
2019-02-11,168.06
2019-02-12,170.25
2019-02-13,173.82
2019-02-14,174.08
2019-02-15,170.06
2019-02-19,172.45
2019-02-20,171.18
2019-02-21,171.81
2019-02-22,167.17
2019-02-25,165
2019-02-26,161.98
2019-02-27,162.17
2019-02-28,162.54
2019-03-01,162.09
2019-03-04,160.92
2019-03-05,167.74
2019-03-06,170.24
2019-03-07,165.72
2019-03-08,163.65
2019-03-11,166.96
2019-03-12,166.99
2019-03-13,168.17
2019-03-14,167.74
2019-03-15,170.48
2019-03-18,171.17
2019-03-19,170.73
2019-03-20,170.17
2019-03-21,171.77
2019-03-22,166.73
2019-03-25,166.88
2019-03-26,167.2
2019-03-27,164.29
2019-03-28,164.11
2019-03-29,164.85
2019-04-01,170.4
2019-04-02,170.98
2019-04-03,174.91
2019-04-04,179.13
2019-04-05,181.55
2019-04-08,184.77
2019-04-09,181
2019-04-10,177.04
2019-04-11,171.2
2019-04-12,173.09
2019-04-15,168.67
2019-04-16,170.28
2019-04-17,170.33
2019-04-18,171.02
2019-04-22,169.37
2019-04-23,173.29
2019-04-24,169.3
2019-04-25,167.93
2019-04-26,166.12
2019-04-29,165.85
2019-04-30,166.23
2019-05-01,165.42
2019-05-02,166.24
2019-05-03,167.04
2019-05-06,164.5
2019-05-07,162.13
2019-05-08,159.58
2019-05-09,158.7
2019-05-10,156.75
2019-05-13,151.54
2019-05-14,152.39
2019-05-15,152.5
2019-05-16,153.7
2019-05-17,128.31
2019-05-20,117.55
2019-05-21,120.49
2019-05-22,118.4
2019-05-23,113.46
2019-05-24,114.47
2019-05-28,114.14
2019-05-29,112.95
2019-05-30,111.82
2019-05-31,110
2019-06-03,107.78
2019-06-04,111.43
2019-06-05,109.14
2019-06-06,108.89
2019-06-07,109.81
2019-06-10,111.76
2019-06-11,115.37
2019-06-12,113.09
2019-06-13,113.95
2019-06-14,112.555
2019-06-17,114.29
2019-06-18,117
2019-06-19,117.225
2019-06-20,118.33
2019-06-21,116.23
2019-06-24,116.565
2019-06-25,113.14
2019-06-26,115.84
2019-06-27,116
2019-06-28,116.96
2019-07-01,118.22
2019-07-02,119.02
2019-07-03,118.44
2019-07-04,118.44
2019-07-05,116.14
2019-07-08,113.24
2019-07-09,114.65
2019-07-10,114.22
2019-07-11,114.81
2019-07-12,114.835
2019-07-15,115.685
2019-07-16,114.295
2019-07-17,113.62
2019-07-18,111.73
2019-07-19,112.22
2019-07-22,112
2019-07-23,114.995
2019-07-24,116.29
2019-07-25,114.4
2019-07-26,114.04
2019-07-29,113.49
2019-07-30,112.66
2019-07-31,111.74
2019-08-01,109.19
2019-08-02,107.78
2019-08-05,100.32
2019-08-06,99.515
2019-08-07,99.26
2019-08-08,99.755
2019-08-09,97.37
2019-08-12,95.09
2019-08-13,97.36
2019-08-14,94.98
2019-08-15,94.38
2019-08-16,96.78
2019-08-19,104.475
2019-08-20,108.62
2019-08-21,107.775
2019-08-22,105.57
2019-08-23,101.6
2019-08-26,103.59
2019-08-27,103.79
2019-08-28,103.58
2019-08-29,104.75
2019-08-30,104.395
2019-09-02,104.41
2019-09-03,102.52
2019-09-04,102.555
2019-09-05,104.05
2019-09-06,102.59
2019-09-09,105.12
2019-09-10,110.19
2019-09-11,111.76
2019-09-12,111.445
2019-09-13,110.51
2019-09-16,110.87
2019-09-17,108.92
2019-09-18,108.41
2019-09-19,107.78
2019-09-20,105.41
2019-09-23,102.34
2019-09-24,97.625
2019-09-25,102.895
2019-09-26,105.01
2019-09-27,101.07
2019-09-30,102.8
2019-10-01,101.995
2019-10-02,102.67
2019-10-03,104.26
2019-10-04,104.44
2019-10-07,101.59
2019-10-08,99.38
2019-10-09,99.76
2019-10-10,103.89
2019-10-11,104.63
2019-10-14,105.445
2019-10-15,107.66
2019-10-16,108.205
2019-10-17,107.51
2019-10-18,103.715
2019-10-21,104.28
2019-10-22,103.61
2019-10-23,104.15
2019-10-24,103.7
2019-10-25,103.81
2019-10-28,104.86
2019-10-29,102.85
2019-10-30,102.765
2019-10-31,101.81
2019-11-01,104.57
2019-11-04,109.53
2019-11-05,108.17
2019-11-06,107.29
2019-11-07,122.025
2019-11-08,124.54
2019-11-11,120.93
2019-11-12,121.72
2019-11-13,118.33
2019-11-14,118.075
2019-11-15,116.98
2019-11-18,116.42
2019-11-19,115.84
2019-11-20,114.625
2019-11-21,115.66
2019-11-22,118.11
2019-11-25,120.27
