date,close
2014-06-13,39.2662
2014-06-16,39.356
2014-06-17,39.8524
2014-06-18,39.6822
2014-06-19,39.6633
2014-06-20,39.8051
2014-06-23,39.7153
2014-06-24,39.3891
2014-06-25,39.1764
2014-06-26,39.2
2014-06-27,38.8833
2014-06-30,39.0724
2014-07-01,39.7059
2014-07-02,39.7437
2014-07-03,40.2731
2014-07-07,39.9611
2014-07-08,39.8004
2014-07-09,39.8004
2014-07-10,39.0251
2014-07-11,38.576
2014-07-14,38.6374
2014-07-15,38.1458
2014-07-16,37.9567
2014-07-17,37.8196
2014-07-18,38.1269
2014-07-21,38.0134
2014-07-22,38.8691
2014-07-23,38.8927
2014-07-24,39.356
2014-07-25,35.8246
2014-07-28,36.4675
2014-07-29,36.5905
2014-07-30,36.4014
2014-07-31,35.3424
2014-08-01,35.1959
2014-08-04,35.4181
2014-08-05,35.4181
2014-08-06,35.4464
2014-08-07,35.1297
2014-08-08,35.2479
2014-08-11,35.5741
2014-08-12,35.3799
2014-08-13,35.5504
2014-08-14,35.6261
2014-08-15,35.1762
2014-08-18,36.7628
2014-08-19,37.3833
2014-08-20,37.317
2014-08-21,37.1417
2014-08-22,36.9286
2014-08-25,37.0091
2014-08-26,36.9428
2014-08-27,36.5971
2014-08-28,36.3034
2014-08-29,36.0714
2014-09-02,36.2466
2014-09-03,36.0619
2014-09-04,36.4076
2014-09-05,36.5213
2014-09-08,36.6918
2014-09-09,36.0429
2014-09-10,36.1992
2014-09-11,36.2419
2014-09-12,35.9814
2014-09-15,35.6688
2014-09-16,36.1092
2014-09-17,35.8109
2014-09-18,36.1092
2014-09-19,35.4746
2014-09-22,35.0531
2014-09-23,34.9204
2014-09-24,34.9299
2014-09-25,34.4326
2014-09-26,35.1762
2014-09-29,33.7411
2014-09-30,33.8927
2014-10-01,33.5517
2014-10-02,34.7073
2014-10-03,34.9346
2014-10-06,34.5273
2014-10-07,34.0063
2014-10-08,34.0726
2014-10-09,33.6464
2014-10-10,33.9306
2014-10-13,33.2106
2014-10-14,33.7695
2014-10-15,33.277
2014-10-16,33.2485
2014-10-17,33.3433
2014-10-20,33.4285
2014-10-21,33.7695
2014-10-22,33.9969
2014-10-23,34.0442
2014-10-24,34.0537
2014-10-27,34.2337
2014-10-28,34.0916
2014-10-29,35.3514
2014-10-30,35.4083
2014-10-31,36.5071
2014-11-03,37.388
2014-11-04,37.066
2014-11-05,37.8995
2014-11-06,38.0227
2014-11-07,38.2784
2014-11-10,38.449
2014-11-11,38.61
2014-11-12,38.6668
2014-11-13,38.8468
2014-11-14,38.9699
2014-11-17,39.2636
2014-11-18,39.5963
2014-11-19,41.5167
2014-11-20,41.1745
2014-11-21,41.1745
2014-11-24,42.3438
2014-11-25,42.1252
2014-11-26,42.2107
2014-11-28,42.8287
2014-12-01,41.5072
2014-12-02,42.2488
2014-12-03,42.6576
2014-12-04,42.1822
2014-12-05,42.4009
2014-12-08,42.2107
2014-12-09,42.2963
2014-12-10,42.2298
2014-12-11,42.4674
2014-12-12,41.878
2014-12-15,41.6974
2014-12-16,41.1935
2014-12-17,42.8952
2014-12-18,42.6433
2014-12-19,42.2773
2014-12-22,42.7716
2014-12-23,43.1424
2014-12-24,42.553
2014-12-26,42.629
2014-12-29,42.8002
2014-12-30,42.7336
2014-12-31,42.3438
2015-01-02,42.1442
2015-01-05,42.4864
2015-01-06,42.2107
2015-01-07,42.7051
2015-01-08,43.3801
2015-01-09,41.5833
2015-01-12,41.8495
2015-01-13,42.0396
2015-01-14,41.1555
2015-01-15,40.2143
2015-01-16,40.0812
2015-01-20,39.815
2015-01-21,39.5678
2015-01-22,40.8132
2015-01-23,40.4139
2015-01-26,40.471
2015-01-27,40.2998
2015-01-28,40.7277
2015-01-29,41.3076
2015-01-30,40.4044
2015-02-02,40.8798
2015-02-03,42.0776
2015-02-04,41.1935
2015-02-05,41.0794
2015-02-06,41.0889
2015-02-09,40.0337
2015-02-10,40.0051
2015-02-11,39.8815
2015-02-12,41.4407
2015-02-13,48.9607
2015-02-17,51.8508
2015-02-18,53.0201
2015-02-19,53.1722
2015-02-20,53.1437
2015-02-23,52.8965
2015-02-24,52.8395
2015-02-25,52.811
2015-02-26,53.2578
2015-02-27,53.1342
2015-03-02,53.5715
2015-03-03,53.7526
2015-03-04,53.9909
2015-03-05,54.1911
2015-03-06,53.562
2015-03-09,54.2483
2015-03-10,53.7145
2015-03-11,53.8861
2015-03-12,54.4866
2015-03-13,53.9719
2015-03-16,55.0204
2015-03-17,55.7354
2015-03-18,56.374
2015-03-19,56.4789
2015-03-20,56.7934
2015-03-23,57.0794
2015-03-24,56.9936
2015-03-25,56.1643
2015-03-26,56.3645
2015-03-27,58.0708
2015-03-30,58.6332
2015-03-31,58.0517
2015-04-01,57.8325
2015-04-02,57.5084
2015-04-06,57.5179
2015-04-07,57.4798
2015-04-08,58.3186
2015-04-09,58.4139
2015-04-10,58.2614
2015-04-13,58.1756
2015-04-14,57.6227
2015-04-15,58.0231
2015-04-16,58.147
2015-04-17,57.3844
2015-04-20,57.7848
2015-04-21,57.4416
2015-04-22,57.6418
2015-04-23,59.2051
2015-04-24,59.901
2015-04-27,60.4824
2015-04-28,60.4252
2015-04-29,60.7112
2015-04-30,59.7675
2015-05-01,55.4398
2015-05-04,53.9814
2015-05-05,54.0005
2015-05-06,53.705
2015-05-07,53.5239
2015-05-08,53.8575
2015-05-11,54.1339
2015-05-12,54.3246
2015-05-13,54.1911
2015-05-14,55.3636
2015-05-15,54.8012
2015-05-18,55.0395
2015-05-19,54.5234
2015-05-20,54.3801
2015-05-21,54.1029
2015-05-22,53.8735
2015-05-26,53.2714
2015-05-27,54.0551
2015-05-28,53.8831
2015-05-29,53.5677
2015-06-01,53.8735
2015-06-02,54.0264
2015-06-03,56.1864
2015-06-04,55.6894
2015-06-05,56.0526
2015-06-08,55.6225
2015-06-09,55.2784
2015-06-10,55.7181
2015-06-11,55.5365
2015-06-12,55.6129
2015-06-15,55.3453
2015-06-16,57.2185
2015-06-17,56.8076
2015-06-18,58.0118
2015-06-19,58.1456
2015-06-22,58.6617
2015-06-23,58.9006
2015-06-24,58.9101
2015-06-25,58.7286
2015-06-26,60.2481
2015-06-29,58.1742
2015-06-30,57.7824
2015-07-01,58.9388
2015-07-02,58.7763
2015-07-06,57.6104
2015-07-07,58.0691
2015-07-08,57.2376
2015-07-09,56.7502
2015-07-10,58.3749
2015-07-13,59.5027
2015-07-14,59.6078
2015-07-15,59.0535
2015-07-16,58.9197
2015-07-17,58.3558
2015-07-20,58.7668
2015-07-21,58.6808
2015-07-22,58.891
2015-07-23,57.7537
2015-07-24,57.0465
2015-07-27,56.1481
2015-07-28,57.4383
2015-07-29,58.6712
2015-07-30,59.8659
2015-07-31,68.3717
2015-08-03,61.8251
2015-08-04,61.892
2015-08-05,63.0484
2015-08-06,63.4307
2015-08-07,64.6157
2015-08-10,63.6027
2015-08-11,63.2491
2015-08-12,61.5766
2015-08-13,62.1691
2015-08-14,62.6183
2015-08-17,63.3255
2015-08-18,63.8811
2015-08-19,63.0669
2015-08-20,61.8791
2015-08-21,59.9921
2015-08-24,55.6625
2015-08-25,56.4096
2015-08-26,58.2967
2015-08-27,59.0534
2015-08-28,58.0859
2015-08-31,58.7852
2015-09-01,57.2143
2015-09-02,58.22
2015-09-03,59.5898
2015-09-04,58.5744
2015-09-08,60.1645
2015-09-09,58.8139
2015-09-10,58.9289
2015-09-11,60.2795
2015-09-14,60.2986
2015-09-15,60.8638
2015-09-16,62.8945
2015-09-17,62.6454
2015-09-18,59.5228
2015-09-21,60.8446
2015-09-22,60.1262
2015-09-23,59.3599
2015-09-24,57.9231
2015-09-25,57.5974
2015-09-28,56.4863
2015-09-29,56.4575
2015-09-30,56.3138
2015-10-01,55.8924
2015-10-02,55.7679
2015-10-05,57.607
2015-10-06,54.7908
2015-10-07,55.3368
2015-10-08,56.266
2015-10-09,55.9594
2015-10-12,56.1893
2015-10-13,54.6567
2015-10-14,53.4785
2015-10-15,55.4039
2015-10-16,55.2889
2015-10-19,55.5188
2015-10-20,54.7238
2015-10-21,53.6414
2015-10-22,53.3253
2015-10-23,48.2676
2015-10-26,48.8232
2015-10-27,48.3251
2015-10-28,50.5474
2015-10-29,51.5053
2015-10-30,52.5398
2015-11-02,52.7793
2015-11-03,53.4306
2015-11-04,52.923
2015-11-05,53.2582
2015-11-06,53.5073
2015-11-09,52.6164
2015-11-10,52.8846
2015-11-11,49.1393
2015-11-12,46.6967
2015-11-13,47.0128
2015-11-16,47.7025
2015-11-17,45.7233
2015-11-18,46.4919
2015-11-19,44.8394
2015-11-20,46.4919
2015-11-23,48.1733
2015-11-24,48.8842
2015-11-25,48.6248
2015-11-27,47.3854
2015-11-30,44.9931
2015-12-01,46.2133
2015-12-02,45.2045
2015-12-03,44.0419
2015-12-04,44.2725
2015-12-07,43.6096
2015-12-08,44.1188
2015-12-09,43.7057
2015-12-10,43.5712
2015-12-11,43.1484
2015-12-14,42.2837
2015-12-15,42.7161
2015-12-16,42.6872
2015-12-17,42.2549
2015-12-18,43.6
2015-12-21,43.8017
2015-12-22,43.8114
2015-12-23,44.4647
2015-12-24,44.801
2015-12-28,45.56
2015-12-29,47.7505
2015-12-30,46.7898
2015-12-31,46.8474
2016-01-04,47.4431
2016-01-05,48.6921
2016-01-06,47.9619
2016-01-07,47.7313
2016-01-08,44.4743
2016-01-11,44.2053
2016-01-12,46.0211
2016-01-13,44.5223
2016-01-14,44.3302
2016-01-15,44.2437
2016-01-19,43.8017
2016-01-20,44.4839
2016-01-21,45.3486
2016-01-22,46.9339
2016-01-25,47.4431
2016-01-26,49.1629
2016-01-27,49.0284
2016-01-28,51.2574
2016-01-29,53.0156
2016-02-01,52.1125
2016-02-02,51.5648
2016-02-03,51.6225
2016-02-04,50.2485
2016-02-05,46.9531
2016-02-08,47.2509
2016-02-09,45.0796
2016-02-10,45.7329
2016-02-11,46.0596
2016-02-12,53.3615
2016-02-16,56.0516
2016-02-17,56.5032
2016-02-18,56.2054
2016-02-19,56.2246
2016-02-22,56.0516
2016-02-23,56.1957
2016-02-24,57.291
2016-02-25,58.0885
2016-02-26,56.753
2016-02-29,57.1853
2016-03-01,57.7042
2016-03-02,57.8487
2016-03-03,57.5789
2016-03-04,57.7813
2016-03-07,58.0125
2016-03-08,56.3264
2016-03-09,57.2417
2016-03-10,57.7138
2016-03-11,59.2651
2016-03-14,58.1378
2016-03-15,58.08
2016-03-16,57.3477
2016-03-17,58.87
2016-03-18,58.5617
2016-03-21,58.6003
2016-03-22,57.8584
2016-03-23,57.3862
2016-03-24,57.367
2016-03-28,57.9354
2016-03-29,59.1302
2016-03-30,58.7062
2016-03-31,57.8969
2016-04-01,59.1976
2016-04-04,57.8584
2016-04-05,57.155
2016-04-06,58.1763
2016-04-07,57.5693
2016-04-08,56.4516
2016-04-11,55.8157
2016-04-12,56.8467
2016-04-13,58.2245
2016-04-14,58.3883
2016-04-15,58.369
2016-04-18,59.4385
2016-04-19,59.2362
2016-04-20,59.0242
2016-04-21,59.4674
2016-04-22,59.2362
2016-04-25,59.477
2016-04-26,60.2671
2016-04-27,59.3421
2016-04-28,57.9643
2016-04-29,56.4324
2016-05-02,57.8102
2016-05-03,57.2899
2016-05-04,56.3457
2016-05-05,55.6712
2016-05-06,55.7386
2016-05-09,55.7483
2016-05-10,55.5748
2016-05-11,51.5667
2016-05-12,52.0195
2016-05-13,51.1716
2016-05-16,51.2873
2016-05-17,50.92
2016-05-18,50.63
2016-05-19,50.5817
2016-05-20,51.3163
2016-05-23,51.036
2016-05-24,51.3549
2016-05-25,51.2583
2016-05-26,51.2293
2016-05-27,51.5869
2016-05-31,51.3936
2016-06-01,51.6159
2016-06-02,52.6792
2016-06-03,52.5922
2016-06-06,53.5104
2016-06-07,54.5544
2016-06-08,56.1396
2016-06-09,55.9849
2016-06-10,54.9603
2016-06-13,54.4964
2016-06-14,54.622
2016-06-15,55.7529
2016-06-16,55.7723
2016-06-17,56.5359
2016-06-20,56.8935
2016-06-21,57.4831
2016-06-22,56.4102
2016-06-23,56.9805
2016-06-24,54.8057
2016-06-27,52.9401
2016-06-28,53.0271
2016-06-29,54.8057
2016-06-30,55.6176
2016-07-01,55.9656
2016-07-05,54.564
2016-07-06,55.0763
2016-07-07,55.8303
2016-07-08,57.4831
2016-07-11,58.5754
2016-07-12,59.2327
2016-07-13,59.513
2016-07-14,59.31
2016-07-15,59.281
2016-07-18,59.3486
2016-07-19,58.672
2016-07-20,59.1457
2016-07-21,58.469
2016-07-22,58.4014
2016-07-25,58.4884
2016-07-26,58.4014
2016-07-27,57.3188
2016-07-28,57.4831
2016-07-29,55.3373
2016-08-01,54.999
2016-08-02,52.8435
2016-08-03,52.4472
2016-08-04,52.2055
2016-08-05,52.7468
2016-08-08,52.6792
2016-08-09,52.0509
2016-08-10,52.1862
2016-08-11,53.1045
2016-08-12,53.1141
2016-08-15,54.4287
2016-08-16,54.8359
2016-08-17,54.5353
2016-08-18,54.9425
2016-08-19,55.563
2016-08-22,55.0492
2016-08-23,55.4273
2016-08-24,55.2625
2016-08-25,55.5243
2016-08-26,55.2334
2016-08-29,55.6697
2016-08-30,53.7791
2016-08-31,54.4578
2016-09-01,55.2819
2016-09-02,55.1461
2016-09-06,54.3511
2016-09-07,54.8262
2016-09-08,54.0506
2016-09-09,52.6836
2016-09-12,53.4301
2016-09-13,52.2182
2016-09-14,52.1309
2016-09-15,52.48
2016-09-16,52.1309
2016-09-19,53.0714
2016-09-20,54.768
2016-09-21,55.8151
2016-09-22,56.0478
2016-09-23,55.4467
2016-09-26,53.9924
2016-09-27,54.6614
2016-09-28,54.7196
2016-09-29,54.293
2016-09-30,55.0104
2016-10-03,55.0201
2016-10-04,55.2722
2016-10-05,54.8844
2016-10-06,54.9522
2016-10-07,56.4259
2016-10-10,57.5118
2016-10-11,57.3954
2016-10-12,58.2292
2016-10-13,58.3455
2016-10-14,58.1613
2016-10-17,57.4148
2016-10-18,58.2777
2016-10-19,58.8109
2016-10-20,58.1904
2016-10-21,57.9577
2016-10-24,57.8026
2016-10-25,56.3096
2016-10-26,55.7957
2016-10-27,54.4772
2016-10-28,56.1738
2016-10-31,54.9135
2016-11-01,54.2542
2016-11-02,55.1946
2016-11-03,54.0215
2016-11-04,54.3996
2016-11-07,54.9232
2016-11-08,55.1461
2016-11-09,55.9799
2016-11-10,56.9591
2016-11-11,57.0852
2016-11-14,58.6558
2016-11-15,57.7125
2016-11-16,57.7028
2016-11-17,58.0334
2016-11-18,56.7596
2016-11-21,57.4111
2016-11-22,58.2474
2016-11-23,58.2474
2016-11-25,58.7433
2016-11-28,57.9459
2016-11-29,56.8957
2016-11-30,55.301
2016-12-01,56.6818
2016-12-02,56.7012
2016-12-05,58.1987
2016-12-06,58.1696
2016-12-07,60.0852
2016-12-08,61.4952
2016-12-09,61.4466
2016-12-12,60.6589
2016-12-13,59.8129
2016-12-14,59.0642
2016-12-15,57.8195
2016-12-16,57.3236
2016-12-19,56.3512
2016-12-20,56.3123
2016-12-21,55.7774
2016-12-22,54.8926
2016-12-23,55.0676
2016-12-27,56.0983
2016-12-28,55.7191
2016-12-29,56.2053
2016-12-30,56.6915
2017-01-03,55.4274
2017-01-04,55.6997
2017-01-05,54.6689
2017-01-06,54.3091
2017-01-09,54.2702
2017-01-10,54.8634
2017-01-11,54.0757
2017-01-12,53.3561
2017-01-13,54.7467
2017-01-17,55.5343
2017-01-18,54.066
2017-01-19,53.6381
2017-01-20,53.8521
2017-01-23,54.0077
2017-01-24,54.6592
2017-01-25,54.8731
2017-01-26,53.9979
2017-01-27,53.5409
2017-01-30,52.6657
2017-01-31,52.8699
2017-02-01,53.5215
2017-02-02,52.5782
2017-02-03,50.5556
2017-02-06,51.5961
2017-02-07,51.6155
2017-02-08,52.3059
2017-02-09,51.8197
2017-02-10,58.1793
2017-02-13,56.4679
2017-02-14,56.7401
2017-02-15,55.933
2017-02-16,55.194
2017-02-17,55.2426
2017-02-21,54.5328
2017-02-22,54.5619
2017-02-23,54.0174
2017-02-24,54.1924
2017-02-27,55.1454
2017-02-28,53.4242
2017-03-01,54.1049
2017-03-02,54.2216
2017-03-03,53.5215
2017-03-06,53.5604
2017-03-07,53.453
2017-03-08,53.8628
2017-03-09,53.814
2017-03-10,54.136
2017-03-13,54.2238
2017-03-14,54.7506
2017-03-15,55.7945
2017-03-16,55.9213
2017-03-17,55.9603
2017-03-20,56.1262
2017-03-21,56.1067
2017-03-22,56.0579
2017-03-23,56.2042
2017-03-24,56.4481
2017-03-27,57.0237
2017-03-28,56.8286
2017-03-29,57.9603
2017-03-30,57.4432
2017-03-31,57.3164
2017-04-03,56.8871
2017-04-04,56.2725
2017-04-05,55.8628
2017-04-06,56.5945
2017-04-07,56.7213
2017-04-10,57.1896
2017-04-11,57.4823
2017-04-12,57.0823
2017-04-13,56.6432
2017-04-17,57.3749
2017-04-18,56.8676
2017-04-19,57.3554
2017-04-20,57.9115
2017-04-21,57.014
2017-04-24,57.531
2017-04-25,57.8627
2017-04-26,57.9798
2017-04-27,58.3115
2017-04-28,55.2384
2017-05-01,54.692
2017-05-02,55.5213
2017-05-03,54.9262
2017-05-04,55.2091
2017-05-05,55.6384
2017-05-08,55.7652
2017-05-09,56.1067
2017-05-10,56.3408
2017-05-11,55.0042
2017-05-12,54.214
2017-05-15,54.3311
2017-05-16,53.3621
2017-05-17,50.8956
2017-05-18,50.9152
2017-05-19,51.5416
2017-05-22,52.0408
2017-05-23,52.1191
2017-05-24,51.6884
2017-05-25,52.2169
2017-05-26,52.8336
2017-05-30,53.0783
2017-05-31,53.1272
2017-06-01,53.8906
2017-06-02,54.194
2017-06-05,54.4583
2017-06-06,54.3996
2017-06-07,54.4779
2017-06-08,54.5953
2017-06-09,56.0439
2017-06-12,56.318
2017-06-13,56.132
2017-06-14,56.1614
2017-06-15,56.2494
2017-06-16,55.3881
2017-06-19,55.7503
2017-06-20,53.7634
2017-06-21,53.7242
2017-06-22,54.38
2017-06-23,55.349
2017-06-26,55.2413
2017-06-27,55.5154
2017-06-28,55.7601
2017-06-29,56.2005
2017-06-30,56.8269
2017-07-03,56.9541
2017-07-05,56.6997
2017-07-06,55.5741
2017-07-07,56.318
2017-07-10,55.4371
2017-07-11,54.4975
2017-07-12,54.6932
2017-07-13,54.9085
2017-07-14,54.6736
2017-07-17,54.7617
2017-07-18,55.1043
2017-07-19,55.9069
2017-07-20,56.7192
2017-07-21,56.4158
2017-07-24,55.4469
2017-07-25,56.1809
2017-07-26,56.5822
2017-07-27,56.4452
2017-07-28,60.693
2017-07-31,59.2934
2017-08-01,58.6376
2017-08-02,57.6393
2017-08-03,57.6099
2017-08-04,57.8644
2017-08-07,58.207
2017-08-08,58.1678
2017-08-09,57.8155
2017-08-10,56.8758
2017-08-11,56.9737
2017-08-14,57.698
2017-08-15,56.9715
2017-08-16,57.158
2017-08-17,56.5788
2017-08-18,55.4203
2017-08-21,54.8803
2017-08-22,54.3895
2017-08-23,54.2127
2017-08-24,55.2632
2017-08-25,56.1468
2017-08-28,56.3039
2017-08-29,55.9603
2017-08-30,55.8425
2017-08-31,56.245
2017-09-01,57.1089
2017-09-05,56.9617
2017-09-06,57.6194
2017-09-07,57.2758
2017-09-08,57.1875
2017-09-11,57.5704
2017-09-12,57.5311
2017-09-13,58.1594
2017-09-14,57.5507
2017-09-15,57.9631
2017-09-18,57.2856
2017-09-19,57.3445
2017-09-20,57.5605
2017-09-21,57.3347
2017-09-22,57.2464
2017-09-25,56.7948
2017-09-26,57.9532
2017-09-27,58.8859
2017-09-28,59.6222
2017-09-29,60.4567
2017-10-02,60.928
2017-10-03,60.5745
2017-10-04,60.3389
2017-10-05,61.3109
2017-10-06,61.4778
2017-10-09,60.7709
2017-10-10,61.2029
2017-10-11,59.3081
2017-10-12,59.2982
2017-10-13,59.1903
2017-10-16,59.0234
2017-10-17,58.6699
2017-10-18,59.5437
2017-10-19,59.691
2017-10-20,60.7022
2017-10-23,61.3109
2017-10-24,61.4876
2017-10-25,61.841
2017-10-26,63.1467
2017-10-27,63.9518
2017-10-30,62.4301
2017-10-31,61.2421
2017-11-01,61.0458
2017-11-02,60.8298
2017-11-03,60.6629
2017-11-06,60.8592
2017-11-07,60.0444
2017-11-08,60.4862
2017-11-09,60.9967
2017-11-10,61.3796
2017-11-13,61.6643
2017-11-14,62.2239
2017-11-15,62.9427
2017-11-16,64.2229
2017-11-17,65.4341
2017-11-20,66.8028
2017-11-21,67.0687
2017-11-22,67.2361
2017-11-24,67.2952
2017-11-27,67.3542
2017-11-28,67.8663
2017-11-29,69.2055
2017-11-30,69.235
2017-12-01,68.8215
2017-12-04,68.6048
2017-12-05,67.886
2017-12-06,68.5261
2017-12-07,68.5162
2017-12-08,68.0731
2017-12-11,67.2361
2017-12-12,67.1672
2017-12-13,68.0337
2017-12-14,67.561
2017-12-15,69.0381
2017-12-18,70.1016
2017-12-19,69.9834
2017-12-20,70.2395
2017-12-21,70.0327
2017-12-22,70.5053
2017-12-26,70.8697
2017-12-27,70.4364
2017-12-28,70.4758
2017-12-29,70.781
2018-01-02,71.9233
2018-01-03,70.8598
2018-01-04,70.9189
2018-01-05,70.8992
2018-01-08,71.6476
2018-01-09,71.0863
2018-01-10,71.2143
2018-01-11,72.1203
2018-01-12,72.3763
2018-01-16,71.3719
2018-01-17,71.9332
2018-01-18,71.6968
2018-01-19,72.78
2018-01-22,73.0656
2018-01-23,73.9223
2018-01-24,73.1542
2018-01-25,73.4496
2018-01-26,73.745
2018-01-29,73.6367
2018-01-30,73.4496
2018-01-31,73.5284
2018-02-01,74.7199
2018-02-02,73.9321
2018-02-05,72.0415
2018-02-06,72.7406
2018-02-07,74.1783
2018-02-08,72.1793
2018-02-09,75.5274
2018-02-12,72.1793
2018-02-13,73.5185
2018-02-14,75.0744
2018-02-15,75.0251
2018-02-16,73.5579
2018-02-20,72.652
2018-02-21,73.3019
2018-02-22,73.9715
2018-02-23,74.5426
2018-02-26,76.2166
2018-02-27,75.6357
2018-02-28,74.4245
2018-03-01,74.7987
2018-03-02,75.5864
2018-03-05,76.2265
2018-03-06,77.0635
2018-03-07,77.2703
2018-03-08,75.3941
2018-03-09,78.1689
2018-03-12,76.6186
2018-03-13,76.5198
2018-03-14,76.2927
2018-03-15,76.036
2018-03-16,76.9543
2018-03-19,76.194
2018-03-20,76.352
2018-03-21,76.51
2018-03-22,75.7792
2018-03-23,75.0386
2018-03-26,77.0235
2018-03-27,75.7299
2018-03-28,74.7917
2018-03-29,75.4731
2018-04-02,74.1993
2018-04-03,75.3447
2018-04-04,77.1617
2018-04-05,78.791
2018-04-06,77.8628
2018-04-09,77.5468
2018-04-10,79.6798
2018-04-11,80.9832
2018-04-12,79.7489
2018-04-13,78.8404
2018-04-16,78.8602
2018-04-17,79.5613
2018-04-18,78.9885
2018-04-19,78.9293
2018-04-20,77.9813
2018-04-23,79.5119
2018-04-24,78.8108
2018-04-25,79.6896
2018-04-26,81.0622
2018-04-27,83.4519
2018-04-30,81.9707
2018-05-01,81.7831
2018-05-02,81.1906
2018-05-03,80.0155
2018-05-04,80.0649
2018-05-07,81.0524
2018-05-08,81.398
2018-05-09,81.2795
2018-05-10,81.3486
2018-05-11,81.1906
2018-05-14,81.4869
2018-05-15,81.951
2018-05-16,83.951
2018-05-17,84.753
2018-05-18,84.8718
2018-05-21,85.3569
2018-05-22,84.8124
2018-05-23,85.4461
2018-05-24,86.2381
2018-05-25,86.654
2018-05-29,87.5847
2018-05-30,87.6738
2018-05-31,86.248
2018-06-01,87.951
2018-06-04,88.5352
2018-06-05,89.9015
2018-06-06,90.4065
2018-06-07,90.4857
2018-06-08,91.2382
2018-06-11,91.0996
2018-06-12,91.7035
2018-06-13,90.3075
2018-06-14,90.1392
2018-06-15,90.7629
2018-06-18,91.7134
2018-06-19,91.6738
2018-06-20,92.1392
2018-06-21,91.6837
2018-06-22,90.1193
2018-06-25,90.4362
2018-06-26,92.159
2018-06-27,89.9411
2018-06-28,90.0797
2018-06-29,90.5649
2018-07-02,89.3471
2018-07-03,89.5946
2018-07-05,89.7431
2018-07-06,90.3174
2018-07-09,91.1986
2018-07-10,90.9609
2018-07-11,90.3768
2018-07-12,90.4065
2018-07-13,91.159
2018-07-16,91.6144
2018-07-17,92.8322
2018-07-18,92.5055
2018-07-19,93.3867
2018-07-20,93.0303
2018-07-23,92.7233
2018-07-24,91.258
2018-07-25,92.0203
2018-07-26,91.6045
2018-07-27,84.5352
2018-07-30,84.4857
2018-07-31,86.1193
2018-08-01,86.3074
2018-08-02,86.9312
2018-08-03,85.7332
2018-08-06,86.6441
2018-08-07,87.555
2018-08-08,87.3372
2018-08-09,89.7728
2018-08-10,89.2382
2018-08-13,88.5847
2018-08-14,89.3867
2018-08-15,90.8655
2018-08-16,88.8706
2018-08-17,90.1906
2018-08-20,90.6869
2018-08-21,90.667
2018-08-22,90.2006
2018-08-23,89.9127
2018-08-24,89.8135
2018-08-27,89.3271
2018-08-28,90.012
2018-08-29,90.4586
2018-08-30,89.0691
2018-08-31,90.0219
2018-09-04,90.3197
2018-09-05,89.4462
2018-09-06,90.3097
2018-09-07,90.0517
2018-09-10,91.8779
2018-09-11,91.6794
2018-09-12,91.6099
2018-09-13,91.3817
2018-09-14,91.0343
2018-09-17,89.8532
2018-09-18,91.6298
2018-09-19,91.074
2018-09-20,91.1534
2018-09-21,90.5182
2018-09-24,89.7142
2018-09-25,89.9723
2018-09-26,90.9549
2018-09-27,92.0268
2018-09-28,92.3742
2018-10-01,92.6223
2018-10-02,89.6844
2018-10-03,91.2526
2018-10-04,88.8904
2018-10-05,88.8606
2018-10-08,88.9301
2018-10-09,88.811
2018-10-10,85.2082
2018-10-11,84.4638
2018-10-12,86.4587
2018-10-15,86.8657
2018-10-16,88.5728
2018-10-17,88.156
2018-10-18,87.2329
2018-10-19,85.228
2018-10-22,86.5778
2018-10-23,86.7962
2018-10-24,85.5655
2018-10-25,87.0443
2018-10-26,84.9303
2018-10-29,89.1286
2018-10-30,91.3717
2018-10-31,89.605
2018-11-01,90.5876
2018-11-02,92.7811
2018-11-05,92.4734
2018-11-06,91.9772
2018-11-07,92.2054
2018-11-08,92.9895
2018-11-09,92.3543
2018-11-12,90.9549
2018-11-13,90.5777
2018-11-14,91.6127
2018-11-15,91.3738
2018-11-16,90.0901
2018-11-19,88.1993
2018-11-20,87.5724
2018-11-21,89.4731
2018-11-23,89.3935
2018-11-26,90.8962
2018-11-27,87.6122
2018-11-28,89.4234
2018-11-29,89.6721
2018-11-30,90.8862
2018-12-03,94.4787
2018-12-04,91.8316
2018-12-06,91.5331
2018-12-07,87.9406
2018-12-10,87.5724
2018-12-11,87.1843
2018-12-12,87.3137
2018-12-13,84.1292
2018-12-14,83.9998
2018-12-17,82.9549
2018-12-18,84.3083
2018-12-19,83.5122
2018-12-20,83.2634
2018-12-21,81.4722
2018-12-24,79.9098
2018-12-26,83.6117
2018-12-27,84.2486
2018-12-28,84.0197
2018-12-31,83.6814
2019-01-02,83.363
2019-01-03,81.1338
2019-01-04,82.5768
2019-01-07,83.4824
2019-01-08,83.9799
2019-01-09,83.6018
2019-01-10,81.4324
2019-01-11,82.1489
2019-01-14,82.2185
2019-01-15,82.328
2019-01-16,82.3181
2019-01-17,83.4326
2019-01-18,85.6717
2019-01-22,85.1741
2019-01-23,85.2736
2019-01-24,86.0001
2019-01-25,87.2241
2019-01-28,87.1146
2019-01-29,87.453
2019-01-30,88.2989
2019-01-31,88.7566
2019-02-01,89.3836
2019-02-04,90.7071
2019-02-05,92.8068
2019-02-06,92.9163
2019-02-07,92.0008
2019-02-08,106.3408
2019-02-11,106.4502
2019-02-12,104.6391
2019-02-13,103.843
2019-02-14,103.4548
2019-02-15,104.1415
2019-02-19,103.9823
2019-02-20,103.1961
2019-02-21,104.3007
2019-02-22,104.7386
2019-02-25,104.7784
2019-02-26,104.7187
2019-02-27,104.4599
2019-02-28,102.4498
2019-03-01,104.6092
2019-03-04,103.226
2019-03-05,102.8976
2019-03-06,101.561
2019-03-07,101.0523
2019-03-08,100.7032
2019-03-11,102.5185
2019-03-12,102.728
2019-03-13,103.2167
2019-03-14,103.4661
2019-03-15,103.4861
2019-03-18,104.7429
2019-03-19,105.0221
2019-03-20,102.9275
2019-03-21,104.7229
2019-03-22,100.8229
2019-03-25,102.6282
2019-03-26,102.6282
2019-03-27,102.8577
2019-03-28,104.5334
2019-03-29,103.915
2019-04-01,104.5035
2019-04-02,103.7853
2019-04-03,103.496
2019-04-04,104.9324
2019-04-05,103.8152
2019-04-08,102.9375
2019-04-09,101.6408
2019-04-10,102.2692
2019-04-11,102.339
2019-04-12,103.7055
2019-04-15,103.0671
2019-04-16,103.9748
2019-04-17,102.738
2019-04-18,102.9175
2019-04-22,101.6408
2019-04-23,103.107
2019-04-24,104.7728
2019-04-25,104.1843
2019-04-26,100.9924
2019-04-29,98.2793
2019-04-30,99.7157
2019-05-01,98.2793
2019-05-02,98.9676
2019-05-03,99.7456
2019-05-06,98.8978
2019-05-07,96.3443
2019-05-08,97.8903
2019-05-09,96.4839
2019-05-10,96.1548
2019-05-13,92.4841
2019-05-14,94.11
2019-05-15,94.86
2019-05-16,97.77
2019-05-17,97.2
2019-05-20,97.6
2019-05-21,98.18
2019-05-22,98.07
2019-05-23,96.64
2019-05-24,97.12
2019-05-28,96.36
2019-05-29,94.21
2019-05-30,93.76
2019-05-31,93.78
2019-06-03,94.43
2019-06-04,95.9
2019-06-05,96.32
2019-06-06,95.72
2019-06-07,97.39
2019-06-10,96.82
2019-06-11,97.1
2019-06-12,95.92
2019-06-13,96.84
2019-06-14,98.78
2019-06-17,98.67
2019-06-18,99.68
2019-06-19,98.94
2019-06-20,100.13
2019-06-21,99.69
2019-06-24,98.78
2019-06-25,98.44
2019-06-26,98.2
2019-06-27,98.72
2019-06-28,99.785
2019-07-01,100.52
2019-07-02,99.465
2019-07-03,101.41
2019-07-04,101.41
2019-07-05,100.78
2019-07-08,101.62
2019-07-09,100.29
2019-07-10,99.805
2019-07-11,99.88
2019-07-12,102.27
2019-07-15,102.5
2019-07-16,103.15
2019-07-17,103.74
2019-07-18,104.06
2019-07-19,103.95
2019-07-22,102.195
2019-07-23,104.89
2019-07-24,105.115
2019-07-25,104.76
2019-07-26,103.77
2019-07-29,106.68
2019-07-30,107.39
2019-07-31,106.03
2019-08-01,103.04
2019-08-02,101.95
2019-08-05,98.98
2019-08-06,99.35
2019-08-07,99.06
2019-08-08,100.98
2019-08-09,100.03
2019-08-12,97.165
2019-08-13,99.04
2019-08-14,94.72
2019-08-15,92.085
2019-08-16,93.06
2019-08-19,94.23
2019-08-20,94.17
2019-08-21,95.42
2019-08-22,96.3
2019-08-23,92.94
2019-08-26,94.13
2019-08-27,93.92
2019-08-28,93.595
2019-08-29,94.87
2019-08-30,93.805
2019-09-02,93.775
2019-09-03,91.35
2019-09-04,92.59
2019-09-05,94.905
2019-09-06,96.145
2019-09-09,98.51
2019-09-10,99.2
2019-09-11,101.01
2019-09-12,101.18
2019-09-13,99.01
2019-09-16,98.28
2019-09-17,97.985
2019-09-18,97.02
2019-09-19,95.375
2019-09-20,95.83
2019-09-23,95.5
2019-09-24,95.69
2019-09-25,97.28
2019-09-26,98.22
2019-09-27,96.56
2019-09-30,96.8
2019-10-01,96.925
2019-10-02,93.87
2019-10-03,93.49
2019-10-04,94.05
2019-10-07,96.245
2019-10-08,95.48
2019-10-09,96.015
2019-10-10,97.21
2019-10-11,98.29
2019-10-14,98.245
2019-10-15,99.08
2019-10-16,99.3
2019-10-17,101.18
2019-10-18,101.18
2019-10-21,101.04
2019-10-22,101.62
2019-10-23,97.09
2019-10-24,95.92
2019-10-25,94.4
2019-10-28,95.22
2019-10-29,94.205
2019-10-30,93.56
2019-10-31,90.425
2019-11-01,90.19
2019-11-04,90.78
2019-11-05,93.26
2019-11-06,92.515
2019-11-07,93.21
2019-11-08,93.51
2019-11-11,94.42
2019-11-12,93.155
2019-11-13,92.64
2019-11-14,94.39
2019-11-15,93.07
2019-11-18,92.36
2019-11-19,91.435
2019-11-20,90.455
2019-11-21,90.375
2019-11-22,90.845
2019-11-25,91.045
