date,close
2014-06-13,5.08
2014-06-16,5.24
2014-06-17,5.39
2014-06-18,5.48
2014-06-19,5.49
2014-06-20,5.53
2014-06-23,5.51
2014-06-24,5.45
2014-06-25,5.59
2014-06-26,5.31
2014-06-27,5.63
2014-06-30,5.8
2014-07-01,5.67
2014-07-02,5.53
2014-07-03,5.65
2014-07-07,5.32
2014-07-08,5.11
2014-07-09,5.02
2014-07-10,4.85
2014-07-11,4.77
2014-07-14,4.81
2014-07-15,4.68
2014-07-16,4.63
2014-07-17,4.51
2014-07-18,4.63
2014-07-21,4.44
2014-07-22,4.52
2014-07-23,4.44
2014-07-24,4.5
2014-07-25,4.4
2014-07-28,4.33
2014-07-29,4.39
2014-07-30,4.53
2014-07-31,4.43
2014-08-01,3.39
2014-08-04,3.37
2014-08-05,3.31
2014-08-06,3.3
2014-08-07,3.42
2014-08-08,3.46
2014-08-11,3.54
2014-08-12,3.44
2014-08-13,3.46
2014-08-14,3.49
2014-08-15,3.41
2014-08-18,3.51
2014-08-19,3.46
2014-08-20,3.34
2014-08-21,3.61
2014-08-22,3.5
2014-08-25,3.51
2014-08-26,3.68
2014-08-27,3.58
2014-08-28,3.84
2014-08-29,3.8
2014-09-02,3.98
2014-09-03,4.25
2014-09-04,4.05
2014-09-05,3.98
2014-09-08,4.01
2014-09-09,4
2014-09-10,4.04
2014-09-11,4.04
2014-09-12,4.02
2014-09-15,3.96
2014-09-16,3.77
2014-09-17,3.7
2014-09-18,3.69
2014-09-19,3.61
2014-09-22,3.46
2014-09-23,3.35
2014-09-24,3.43
2014-09-25,3.27
2014-09-26,3.33
2014-09-29,3.3
2014-09-30,3.23
2014-10-01,3.08
2014-10-02,3.3
2014-10-03,3.33
2014-10-06,3.415
2014-10-07,3.2
2014-10-08,3.23
2014-10-09,3.03
2014-10-10,2.9
2014-10-13,2.83
2014-10-14,2.98
2014-10-15,3.28
2014-10-16,3.36
2014-10-17,3.26
2014-10-20,3.39
2014-10-21,3.33
2014-10-22,3.27
2014-10-23,3.06
2014-10-24,3
2014-10-27,3.11
2014-10-28,3.305
2014-10-29,3.23
2014-10-30,3.34
2014-10-31,3.82
2014-11-03,3.89
2014-11-04,3.77
2014-11-05,3.93
2014-11-06,3.875
2014-11-07,4.16
2014-11-10,4.2
2014-11-11,4.39
2014-11-12,4.44
2014-11-13,4.2
2014-11-14,4.44
2014-11-17,4.32
2014-11-18,4.25
2014-11-19,3.99
2014-11-20,4.05
2014-11-21,4.06
2014-11-24,4.05
2014-11-25,4.1
2014-11-26,4.09
2014-11-28,4.07
2014-12-01,4.2
2014-12-02,4.27
2014-12-03,4.45
2014-12-04,4.18
2014-12-05,4.21
2014-12-08,3.86
2014-12-09,4.26
2014-12-10,4.04
2014-12-11,4.07
2014-12-12,4.03
2014-12-15,3.93
2014-12-16,4.02
2014-12-17,4.17
2014-12-18,4.34
2014-12-19,4.55
2014-12-22,4.59
2014-12-23,4.52
2014-12-24,4.8
2014-12-26,4.69
2014-12-29,4.62
2014-12-30,4.69
2014-12-31,4.68
2015-01-02,4.5
2015-01-05,4.43
2015-01-06,4.34
2015-01-07,4.33
2015-01-08,4.33
2015-01-09,4.26
2015-01-12,4.27
2015-01-13,4.33
2015-01-14,4.25
2015-01-15,4.06
2015-01-16,3.95
2015-01-20,3.88
2015-01-21,3.79
2015-01-22,3.81
2015-01-23,3.87
2015-01-26,3.75
2015-01-27,3.67
2015-01-28,3.515
2015-01-29,3.44
2015-01-30,3.35
2015-02-02,3.27
2015-02-03,3.56
2015-02-04,3.51
2015-02-05,3.67
2015-02-06,3.79
2015-02-09,3.76
2015-02-10,3.6
2015-02-11,3.53
2015-02-12,3.56
2015-02-13,3.65
2015-02-17,3.78
2015-02-18,3.81
2015-02-19,3.8
2015-02-20,3.84
2015-02-23,3.65
2015-02-24,3.58
2015-02-25,3.57
2015-02-26,3.48
2015-02-27,3.72
2015-03-02,3.61
2015-03-03,3.37
2015-03-04,3.37
2015-03-05,3.31
2015-03-06,3.36
2015-03-09,3.36
2015-03-10,3.42
2015-03-11,3.35
2015-03-12,3.4
2015-03-13,3.29
2015-03-16,3.34
2015-03-17,3.28
2015-03-18,3.39
2015-03-19,3.45
2015-03-20,3.51
2015-03-23,3.54
2015-03-24,3.57
2015-03-25,3.49
2015-03-26,3.42
2015-03-27,3.34
2015-03-30,3.15
2015-03-31,3.1
2015-04-01,3.1
2015-04-02,3.16
2015-04-06,3.12
2015-04-07,3.29
2015-04-08,3.27
2015-04-09,3.26
2015-04-10,3.31
2015-04-13,3.3
2015-04-14,3.28
2015-04-15,3.29
2015-04-16,3.24
2015-04-17,3.06
2015-04-20,3.2
2015-04-21,3.33
2015-04-22,3.35
2015-04-23,3.38
2015-04-24,3.46
2015-04-27,3.37
2015-04-28,3.69
2015-04-29,3.7
2015-04-30,3.57
2015-05-01,3.61
2015-05-04,3.68
2015-05-05,3.6
2015-05-06,3.74
2015-05-07,3.75
2015-05-08,4.35
2015-05-11,4.4
2015-05-12,4.22
2015-05-13,4.17
2015-05-14,4.11
2015-05-15,4.51
2015-05-18,4.58
2015-05-19,4.6
2015-05-20,4.6
2015-05-21,4.57
2015-05-22,4.6
2015-05-26,4.47
2015-05-27,4.44
2015-05-28,4.42
2015-05-29,4.38
2015-06-01,4.5
2015-06-02,4.56
2015-06-03,4.685
2015-06-04,4.63
2015-06-05,4.64
2015-06-08,4.57
2015-06-09,4.53
2015-06-10,4.73
2015-06-11,4.77
2015-06-12,4.85
2015-06-15,4.75
2015-06-16,4.78
2015-06-17,4.79
2015-06-18,4.79
2015-06-19,5
2015-06-22,4.96
2015-06-23,4.97
2015-06-24,5.2
2015-06-25,5.47
2015-06-26,5.28
2015-06-29,5.3
2015-06-30,5.47
2015-07-01,5.62
2015-07-02,5.39
2015-07-06,5.36
2015-07-07,5.37
2015-07-08,5.67
2015-07-09,5.69
2015-07-10,5.89
2015-07-13,6.08
2015-07-14,6.02
2015-07-15,5.66
2015-07-16,5.6
2015-07-17,5.55
2015-07-20,5.46
2015-07-21,5.52
2015-07-22,5.46
2015-07-23,5.29
2015-07-24,5.19
2015-07-27,5.09
2015-07-28,5.08
2015-07-29,5
2015-07-30,5.14
2015-07-31,5.3
2015-08-03,5.1
2015-08-04,5.1
2015-08-05,5.03
2015-08-06,4.78
2015-08-07,5.7
2015-08-10,5.78
2015-08-11,5.7
2015-08-12,5.44
2015-08-13,5.72
2015-08-14,5.71
2015-08-17,5.67
2015-08-18,5.41
2015-08-19,5.26
2015-08-20,5.05
2015-08-21,5.1
2015-08-24,4.97
2015-08-25,4.82
2015-08-26,4.9
2015-08-27,4.8
2015-08-28,4.82
2015-08-31,4.74
2015-09-01,4.5
2015-09-02,4.53
2015-09-03,4.49
2015-09-04,4.44
2015-09-08,4.41
2015-09-09,4.3
2015-09-10,4.35
2015-09-11,4.42
2015-09-14,4.35
2015-09-15,4.36
2015-09-16,4.35
2015-09-17,4.37
2015-09-18,4.35
2015-09-21,4.51
2015-09-22,4.41
2015-09-23,4.38
2015-09-24,4.31
2015-09-25,4.2
2015-09-28,4.11
2015-09-29,4
2015-09-30,4
2015-10-01,4
2015-10-02,4.1
2015-10-05,4.34
2015-10-06,4.24
2015-10-07,4.44
2015-10-08,4.5
2015-10-09,4.49
2015-10-12,4.35
2015-10-13,4.47
2015-10-14,4.3
2015-10-15,4.61
2015-10-16,4.43
2015-10-19,4.46
2015-10-20,4.1
2015-10-21,4.22
2015-10-22,4.44
2015-10-23,4.66
2015-10-26,4.65
2015-10-27,4.45
2015-10-28,4.77
2015-10-29,4.46
2015-10-30,4.27
2015-11-02,4.31
2015-11-03,4.58
2015-11-04,4.71
2015-11-05,4.67
2015-11-06,5.22
2015-11-09,5.19
2015-11-10,5.25
2015-11-11,5.16
2015-11-12,5.06
2015-11-13,5.02
2015-11-16,5.03
2015-11-17,4.95
2015-11-18,4.94
2015-11-19,4.82
2015-11-20,5.01
2015-11-23,5.1
2015-11-24,5.24
2015-11-25,5.24
2015-11-27,5.24
2015-11-30,5.4
2015-12-01,5.45
2015-12-02,5.31
2015-12-03,5.25
2015-12-04,5.25
2015-12-07,4.97
2015-12-08,4.86
2015-12-09,4.72
2015-12-10,4.58
2015-12-11,4.54
2015-12-14,4.5
2015-12-15,4.55
2015-12-16,4.63
2015-12-17,4.51
2015-12-18,4.5
2015-12-21,4.53
2015-12-22,4.54
2015-12-23,4.65
2015-12-24,4.62
2015-12-28,4.47
2015-12-29,4.56
2015-12-30,4.6
2015-12-31,4.61
2016-01-04,4.36
2016-01-05,4.33
2016-01-06,4.305
2016-01-07,4.16
2016-01-08,4.08
2016-01-11,4.28
2016-01-12,4.18
2016-01-13,4.08
2016-01-14,4.21
2016-01-15,4.11
2016-01-19,4.1
2016-01-20,3.88
2016-01-21,4.04
2016-01-22,4.21
2016-01-25,3.94
2016-01-26,3.91
2016-01-27,3.78
2016-01-28,3.78
2016-01-29,3.87
2016-02-01,3.86
2016-02-02,3.72
2016-02-03,3.71
2016-02-04,3.69
2016-02-05,3.46
2016-02-08,3.58
2016-02-09,3.51
2016-02-10,3.61
2016-02-11,3.61
2016-02-12,3.66
2016-02-16,3.79
2016-02-17,3.9
2016-02-18,3.96
2016-02-19,4.11
2016-02-22,4.15
2016-02-23,3.78
2016-02-24,3.78
2016-02-25,3.78
2016-02-26,3.86
2016-02-29,4.06
2016-03-01,4.17
2016-03-02,4.29
2016-03-03,4.31
2016-03-04,4.32
2016-03-07,4.46
2016-03-08,4.22
2016-03-09,4.25
2016-03-10,4.13
2016-03-11,4.25
2016-03-14,4.18
2016-03-15,4.06
2016-03-16,4.19
2016-03-17,4.31
2016-03-18,4.37
2016-03-21,4.32
2016-03-22,4.48
2016-03-23,4.21
2016-03-24,4.12
2016-03-28,4.11
2016-03-29,4.19
2016-03-30,4.24
2016-03-31,4.26
2016-04-01,4.24
2016-04-04,4.21
2016-04-05,4.15
2016-04-06,4.21
2016-04-07,4.08
2016-04-08,4.08
2016-04-11,3.87
2016-04-12,3.91
2016-04-13,4.08
2016-04-14,4.11
2016-04-15,4.14
2016-04-18,4.21
2016-04-19,4.18
2016-04-20,4.19
2016-04-21,4.24
2016-04-22,4.22
2016-04-25,4.15
2016-04-26,4.19
2016-04-27,4.19
2016-04-28,4.07
2016-04-29,4.03
2016-05-02,4.12
2016-05-03,3.9
2016-05-04,3.91
2016-05-05,3.9
2016-05-06,3.79
2016-05-09,3.73
2016-05-10,3.79
2016-05-11,3.78
2016-05-12,3.75
2016-05-13,3.72
2016-05-16,3.7
2016-05-17,3.58
2016-05-18,3.62
2016-05-19,3.61
2016-05-20,3.69
2016-05-23,3.67
2016-05-24,3.68
2016-05-25,3.73
2016-05-26,3.71
2016-05-27,3.72
2016-05-31,3.72
2016-06-01,3.76
2016-06-02,4.04
2016-06-03,3.97
2016-06-06,4.04
2016-06-07,3.99
2016-06-08,4.03
2016-06-09,4.02
2016-06-10,4.04
2016-06-13,4.05
2016-06-14,4
2016-06-15,4.12
2016-06-16,4.15
2016-06-17,4.29
2016-06-20,4.24
2016-06-21,4.14
2016-06-22,4.1
2016-06-23,4.12
2016-06-24,3.94
2016-06-27,3.76
2016-06-28,3.79
2016-06-29,3.88
2016-06-30,4.03
2016-07-01,4.08
2016-07-05,3.97
2016-07-06,3.99
2016-07-07,4.05
2016-07-08,4.12
2016-07-11,4.06
2016-07-12,4.17
2016-07-13,4.17
2016-07-14,4.24
2016-07-15,4.37
2016-07-18,4.21
2016-07-19,4.26
2016-07-20,4.3
2016-07-21,4.29
2016-07-22,4.37
2016-07-25,4.29
2016-07-26,4.41
2016-07-27,4.4
2016-07-28,4.48
2016-07-29,4.52
2016-08-01,4.59
2016-08-02,4.67
2016-08-03,4.68
2016-08-04,4.63
2016-08-05,4.7
2016-08-08,4.7
2016-08-09,5.02
2016-08-10,5.04
2016-08-11,5.11
2016-08-12,5.02
2016-08-15,5.11
2016-08-16,5.14
2016-08-17,5.03
2016-08-18,5.03
2016-08-19,5.01
2016-08-22,5
2016-08-23,5.06
2016-08-24,5.09
2016-08-25,5.11
2016-08-26,5.1
2016-08-29,5.09
2016-08-30,5.1
2016-08-31,5.06
2016-09-01,5.09
2016-09-02,5.1
2016-09-06,5.03
2016-09-07,4.99
2016-09-08,4.98
2016-09-09,4.79
2016-09-12,4.88
2016-09-13,4.75
2016-09-14,4.7
2016-09-15,4.71
2016-09-16,4.745
2016-09-19,4.7
2016-09-20,4.73
2016-09-21,4.85
2016-09-22,4.99
2016-09-23,4.96
2016-09-26,4.86
2016-09-27,4.92
2016-09-28,4.92
2016-09-29,4.81
2016-09-30,4.88
2016-10-03,4.83
2016-10-04,4.79
2016-10-05,4.75
2016-10-06,4.73
2016-10-07,4.75
2016-10-10,4.81
2016-10-11,4.77
2016-10-12,4.79
2016-10-13,4.78
2016-10-14,4.8
2016-10-17,4.81
2016-10-18,4.82
2016-10-19,4.86
2016-10-20,4.81
2016-10-21,4.8
2016-10-24,4.86
2016-10-25,4.78
2016-10-26,4.79
2016-10-27,4.83
2016-10-28,4.76
2016-10-31,4.75
2016-11-01,4.75
2016-11-02,4.65
2016-11-03,4.51
2016-11-04,4.43
2016-11-07,4.65
2016-11-08,4.74
2016-11-09,4.91
2016-11-10,5.35
2016-11-11,5.65
2016-11-14,5.51
2016-11-15,5.57
2016-11-16,5.6
2016-11-17,5.82
2016-11-18,5.9
2016-11-21,5.85
2016-11-22,5.91
2016-11-23,5.94
2016-11-25,5.95
2016-11-28,5.87
2016-11-29,5.92
2016-11-30,5.93
2016-12-01,5.9
2016-12-02,5.85
2016-12-05,5.89
2016-12-06,5.91
2016-12-07,5.99
2016-12-08,6.15
2016-12-09,5.88
2016-12-12,5.84
2016-12-13,5.89
2016-12-14,5.76
2016-12-15,5.68
2016-12-16,5.74
2016-12-19,5.72
2016-12-20,5.87
2016-12-21,5.69
2016-12-22,5.62
2016-12-23,5.54
2016-12-27,5.6
2016-12-28,5.57
2016-12-29,5.59
2016-12-30,5.68
2017-01-03,5.67
2017-01-04,5.66
2017-01-05,5.66
2017-01-06,5.67
2017-01-09,5.66
2017-01-10,5.7
2017-01-11,5.77
2017-01-12,5.52
2017-01-13,5.55
2017-01-17,5.43
2017-01-18,5.45
2017-01-19,5.34
2017-01-20,5.31
2017-01-23,5.3
2017-01-24,5.46
2017-01-25,5.51
2017-01-26,5.4
2017-01-27,5.46
2017-01-30,5.32
2017-01-31,5.3
2017-02-01,5.3
2017-02-02,5.29
2017-02-03,5.37
2017-02-06,5.35
2017-02-07,5.3
2017-02-08,5.17
2017-02-09,5.36
2017-02-10,5.64
2017-02-13,5.7
2017-02-14,5.75
2017-02-15,5.81
2017-02-16,5.76
2017-02-17,5.83
2017-02-21,6.05
2017-02-22,4.18
2017-02-23,3.99
2017-02-24,4.01
2017-02-27,4
2017-02-28,3.94
2017-03-01,3.94
2017-03-02,3.82
2017-03-03,3.76
2017-03-06,3.65
2017-03-07,3.69
2017-03-08,3.68
2017-03-09,3.66
2017-03-10,3.72
2017-03-13,3.75
2017-03-14,3.76
2017-03-15,3.76
2017-03-16,3.77
2017-03-17,3.83
2017-03-20,3.73
2017-03-21,3.64
2017-03-22,3.58
2017-03-23,3.62
2017-03-24,3.69
2017-03-27,3.7
2017-03-28,3.77
2017-03-29,3.77
2017-03-30,3.79
2017-03-31,3.88
2017-04-03,3.74
2017-04-04,3.69
2017-04-05,3.55
2017-04-06,3.545
2017-04-07,3.7
2017-04-10,3.65
2017-04-11,3.7
2017-04-12,3.61
2017-04-13,3.57
2017-04-17,3.58
2017-04-18,3.62
2017-04-19,3.65
2017-04-20,3.65
2017-04-21,3.62
2017-04-24,3.61
2017-04-25,3.61
2017-04-26,3.71
2017-04-27,3.78
2017-04-28,3.76
2017-05-01,3.75
2017-05-02,3.71
2017-05-03,3.67
2017-05-04,3.7
2017-05-05,3.76
2017-05-08,3.85
2017-05-09,3.29
2017-05-10,3.4
2017-05-11,3.31
2017-05-12,3.28
2017-05-15,3.36
2017-05-16,3.31
2017-05-17,3.18
2017-05-18,3.18
2017-05-19,3.17
2017-05-22,3.27
2017-05-23,3.4
2017-05-24,3.49
2017-05-25,3.55
2017-05-26,3.5
2017-05-30,3.46
2017-05-31,3.46
2017-06-01,3.66
2017-06-02,3.6
2017-06-05,3.47
2017-06-06,3.5
2017-06-07,3.51
2017-06-08,3.67
2017-06-09,3.56
2017-06-12,3.66
2017-06-13,3.73
2017-06-14,3.86
2017-06-15,3.64
2017-06-16,3.58
2017-06-19,3.64
2017-06-20,3.54
2017-06-21,3.56
2017-06-22,3.58
2017-06-23,3.7
2017-06-26,3.82
2017-06-27,3.75
2017-06-28,3.96
2017-06-29,3.9
2017-06-30,3.88
2017-07-03,3.91
2017-07-05,3.77
2017-07-06,3.79
2017-07-07,3.89
2017-07-10,3.85
2017-07-11,3.83
2017-07-12,3.89
2017-07-13,3.85
2017-07-14,3.86
2017-07-17,3.94
2017-07-18,3.81
2017-07-19,3.81
2017-07-20,3.81
2017-07-21,3.75
2017-07-24,3.79
2017-07-25,3.85
2017-07-26,3.86
2017-07-27,3.8
2017-07-28,3.8
2017-07-31,3.8
2017-08-01,3.83
2017-08-02,3.82
2017-08-03,3.81
2017-08-04,3.75
2017-08-07,3.76
2017-08-08,3.76
2017-08-09,3.66
2017-08-10,3.52
2017-08-11,3.55
2017-08-14,3.55
2017-08-15,3.5
2017-08-16,3.42
2017-08-17,3.24
2017-08-18,3.28
2017-08-21,3.3
2017-08-22,3.36
2017-08-23,3.41
2017-08-24,3.66
2017-08-25,3.66
2017-08-28,3.65
2017-08-29,3.7
2017-08-30,3.56
2017-08-31,3.52
2017-09-01,3.56
2017-09-05,3.59
2017-09-06,3.37
2017-09-07,3.54
2017-09-08,3.47
2017-09-11,3.53
2017-09-12,3.65
2017-09-13,3.69
2017-09-14,3.71
2017-09-15,3.58
2017-09-18,3.53
2017-09-19,3.42
2017-09-20,3.5
2017-09-21,3.48
2017-09-22,3.48
2017-09-25,3.41
2017-09-26,3.37
2017-09-27,3.48
2017-09-28,3.48
2017-09-29,3.46
2017-10-02,3.52
2017-10-03,3.48
2017-10-04,3.47
2017-10-05,3.51
2017-10-06,3.55
2017-10-09,3.52
2017-10-10,3.54
2017-10-11,3.55
2017-10-12,3.54
2017-10-13,3.55
2017-10-16,3.6
2017-10-17,3.6
2017-10-18,3.55
2017-10-19,3.61
2017-10-20,3.59
2017-10-23,3.5
2017-10-24,3.5
2017-10-25,3.49
2017-10-26,3.5
2017-10-27,3.51
2017-10-30,3.48
2017-10-31,3.48
2017-11-01,3.48
2017-11-02,3.52
2017-11-03,3.53
2017-11-06,3.54
2017-11-07,3.46
2017-11-08,3.22
2017-11-09,2.87
2017-11-10,2.81
2017-11-13,2.78
2017-11-14,2.76
2017-11-15,2.64
2017-11-16,2.87
2017-11-17,3.02
2017-11-20,3.02
2017-11-21,3.02
2017-11-22,3.02
2017-11-24,3.05
2017-11-27,2.99
2017-11-28,2.97
2017-11-29,2.93
2017-11-30,2.87
2017-12-01,2.87
2017-12-04,2.89
2017-12-05,2.86
2017-12-06,2.82
2017-12-07,2.85
2017-12-08,2.87
2017-12-11,2.96
2017-12-12,3.05
2017-12-13,3.01
2017-12-14,3.1
2017-12-15,3.03
2017-12-18,3.09
2017-12-19,3.12
2017-12-20,3.1
2017-12-21,3.15
2017-12-22,3.18
2017-12-26,3.19
2017-12-27,3.17
2017-12-28,3.18
2017-12-29,3.09
2018-01-02,3.18
2018-01-03,3.2
2018-01-04,3.29
2018-01-05,3.37
2018-01-08,3.38
2018-01-09,3.36
2018-01-10,3.37
2018-01-11,3.42
2018-01-12,3.43
2018-01-16,3.33
2018-01-17,3.39
2018-01-18,3.32
2018-01-19,3.33
2018-01-22,3.43
2018-01-23,3.47
2018-01-24,3.46
2018-01-25,3.55
2018-01-26,3.5
2018-01-29,3.48
2018-01-30,3.46
2018-01-31,3.4
2018-02-01,3.4
2018-02-02,3.37
2018-02-05,3.12
2018-02-06,3.17
2018-02-07,3.22
2018-02-08,3.17
2018-02-09,3.18
2018-02-12,3.3
2018-02-13,3.49
2018-02-14,3.46
2018-02-15,3.55
2018-02-16,3.69
2018-02-20,3.63
2018-02-21,3.7
2018-02-22,3.755
2018-02-23,3.75
2018-02-26,3.79
2018-02-27,3.77
2018-02-28,3.66
2018-03-01,3.71
2018-03-02,3.8
2018-03-05,3.79
2018-03-06,3.94
2018-03-07,3.98
2018-03-08,4
2018-03-09,4.08
2018-03-12,4.06
2018-03-13,4.01
2018-03-14,4.03
2018-03-15,3.97
2018-03-16,3.97
2018-03-19,3.92
2018-03-20,3.86
2018-03-21,3.83
2018-03-22,3.74
2018-03-23,3.64
2018-03-26,3.7
2018-03-27,3.66
2018-03-28,3.76
2018-03-29,3.81
2018-04-02,3.7
2018-04-03,3.7
2018-04-04,3.75
2018-04-05,3.75
2018-04-06,3.76
2018-04-09,3.72
2018-04-10,3.79
2018-04-11,3.78
2018-04-12,3.78
2018-04-13,3.75
2018-04-16,3.78
2018-04-17,3.91
2018-04-18,3.9
2018-04-19,3.89
2018-04-20,3.88
2018-04-23,3.84
2018-04-24,3.87
2018-04-25,3.86
2018-04-26,3.9
2018-04-27,3.81
2018-04-30,3.79
2018-05-01,3.75
2018-05-02,3.74
2018-05-03,3.74
2018-05-04,3.83
2018-05-07,3.84
2018-05-08,3.8
2018-05-09,3.84
2018-05-10,3.88
2018-05-11,3.91
2018-05-14,3.89
2018-05-15,3.98
2018-05-16,4
2018-05-17,4
2018-05-18,4.05
2018-05-21,4.25
2018-05-22,4.22
2018-05-23,4.28
2018-05-24,4.25
2018-05-25,4.42
2018-05-29,4.26
2018-05-30,4.26
2018-05-31,4.19
2018-06-01,4.2
2018-06-04,4.26
2018-06-05,4.33
2018-06-06,4.3
2018-06-07,4.19
2018-06-08,4.12
2018-06-11,4.11
2018-06-12,4.14
2018-06-13,4.02
2018-06-14,3.99
2018-06-15,4.07
2018-06-18,4
2018-06-19,4
2018-06-20,4.07
2018-06-21,4.03
2018-06-22,4.12
2018-06-25,4.01
2018-06-26,3.97
2018-06-27,3.95
2018-06-28,4.01
2018-06-29,3.94
2018-07-02,3.96
2018-07-03,3.88
2018-07-05,3.89
2018-07-06,3.97
2018-07-09,3.88
2018-07-10,3.76
2018-07-11,3.75
2018-07-12,3.73
2018-07-13,3.76
2018-07-16,3.74
2018-07-17,3.83
2018-07-18,3.77
2018-07-19,3.75
2018-07-20,3.7
2018-07-23,3.74
2018-07-24,3.66
2018-07-25,3.77
2018-07-26,3.69
2018-07-27,3.52
2018-07-30,3.44
2018-07-31,3.5
2018-08-01,3.45
2018-08-02,3.68
2018-08-03,3.76
2018-08-06,3.82
2018-08-07,3.305
2018-08-08,3.18
2018-08-09,3.37
2018-08-10,3.22
2018-08-13,3.15
2018-08-14,2.99
2018-08-15,2.98
2018-08-16,3.17
2018-08-17,3.17
2018-08-20,3.2
2018-08-21,3.27
2018-08-22,3.28
2018-08-23,3.23
2018-08-24,3.19
2018-08-27,3.17
2018-08-28,3.17
2018-08-29,3.12
2018-08-30,3.13
2018-08-31,3.19
2018-09-04,3.18
2018-09-05,3.1
2018-09-06,3.05
2018-09-07,3.05
2018-09-10,3
2018-09-11,2.97
2018-09-12,2.99
2018-09-13,2.9
2018-09-14,3
2018-09-17,2.84
2018-09-18,2.79
2018-09-19,2.81
2018-09-20,2.81
2018-09-21,2.89
2018-09-24,2.88
2018-09-25,2.83
2018-09-26,2.78
2018-09-27,2.75
2018-09-28,2.85
2018-10-01,2.78
2018-10-02,2.77
2018-10-03,2.81
2018-10-04,2.78
2018-10-05,2.84
2018-10-08,2.7
2018-10-09,2.7
2018-10-10,2.61
2018-10-11,2.59
2018-10-12,2.53
2018-10-15,2.56
2018-10-16,2.7
2018-10-17,2.68
2018-10-18,2.61
2018-10-19,1.405
2018-10-22,1.37
2018-10-23,1.38
2018-10-24,1.37
2018-10-25,1.37
2018-10-26,1.32
2018-10-29,1.32
2018-10-30,1.34
2018-10-31,1.33
2018-11-01,1.32
2018-11-02,1.33
2018-11-05,1.3
2018-11-06,1.36
2018-11-07,1.38
2018-11-08,1.46
2018-11-09,1.45
2018-11-12,1.44
2018-11-13,1.37
2018-11-14,1.36
2018-11-15,1.39
2018-11-16,1.35
2018-11-19,1.38
2018-11-20,1.34
2018-11-21,1.37
2018-11-23,1.38
2018-11-26,1.35
2018-11-27,1.36
2018-11-28,1.36
2018-11-29,1.39
2018-11-30,1.32
2018-12-03,1.3
2018-12-04,1.22
2018-12-06,1.19
2018-12-07,1.2
2018-12-10,1.2
2018-12-11,1.18
2018-12-12,1.19
2018-12-13,1.09
2018-12-14,1.05
2018-12-17,0.9812
2018-12-18,1.01
2018-12-19,0.9555
2018-12-20,0.9587
2018-12-21,0.9658
2018-12-24,0.9864
2018-12-26,0.9975
2018-12-27,0.988
2018-12-28,1.01
2018-12-31,1.08
2019-01-02,1.06
2019-01-03,1.025
2019-01-04,1.06
2019-01-07,1.04
2019-01-08,1.02
2019-01-09,1.06
2019-01-10,1.01
2019-01-11,1.02
2019-01-14,1.01
2019-01-15,1.02
2019-01-16,1.08
2019-01-17,1.06
2019-01-18,1
2019-01-22,1.01
2019-01-23,1.06
2019-01-24,1.06
2019-01-25,1.16
2019-01-28,1.19
2019-01-29,1.17
2019-01-30,1.17
2019-01-31,1.2
2019-02-01,1.195
2019-02-04,1.22
2019-02-05,1.2
2019-02-06,1.2
2019-02-07,1.18
2019-02-08,1.17
2019-02-11,1.16
2019-02-12,1.2
2019-02-13,1.18
2019-02-14,1.18
2019-02-15,1.19
2019-02-19,1.18
2019-02-20,1.14
2019-02-21,1
2019-02-22,1.05
2019-02-25,0.98
2019-02-26,0.9661
2019-02-27,0.9602
2019-02-28,0.9305
2019-03-01,1.01
2019-03-04,1.02
2019-03-05,1.02
2019-03-06,1.02
2019-03-07,1
2019-03-08,0.98
2019-03-11,1.01
2019-03-12,0.9929
2019-03-13,0.99
2019-03-14,0.961
2019-03-15,1.04
2019-03-18,0.995
2019-03-19,0.9575
2019-03-20,0.9446
2019-03-21,0.9236
2019-03-22,0.8904
2019-03-25,0.8646
2019-03-26,0.8604
2019-03-27,0.8526
2019-03-28,0.8999
2019-03-29,0.9214
2019-04-01,0.9123
2019-04-02,0.8845
2019-04-03,0.916
2019-04-04,0.9164
2019-04-05,0.9275
2019-04-08,0.92
2019-04-09,0.9317
2019-04-10,0.9332
2019-04-11,0.9099
2019-04-12,0.91
2019-04-15,0.9087
2019-04-16,0.895
2019-04-17,0.9001
2019-04-18,0.9
2019-04-22,0.9088
2019-04-23,0.9356
2019-04-24,1.01
2019-04-25,1.02
2019-04-26,1.05
2019-04-29,1.05
2019-04-30,1.06
2019-05-01,1.1
2019-05-02,1.06
2019-05-03,1.07
2019-05-06,1.06
2019-05-07,1.02
2019-05-08,1
2019-05-09,1.05
2019-05-10,1.05
2019-05-13,0.9601
2019-05-14,0.9719
2019-05-15,0.9777
2019-05-16,0.97
2019-05-17,0.9679
2019-05-20,0.9961
2019-05-21,1.04
2019-05-22,1
2019-05-23,0.9801
2019-05-24,1.02
2019-05-28,1.02
2019-05-29,1.03
2019-05-30,1.05
2019-05-31,1.04
2019-06-03,1.03
2019-06-04,1.07
2019-06-05,1.06
2019-06-06,1.05
2019-06-07,1.03
2019-06-10,1.04
2019-06-11,1.03
2019-06-12,1.03
2019-06-13,1.025
2019-06-14,1.01
2019-06-17,0.9501
2019-06-18,0.9847
2019-06-19,0.98
2019-06-20,0.9911
2019-06-21,0.99
2019-06-24,0.9767
2019-06-25,0.9703
2019-06-26,0.9493
2019-06-27,0.9257
2019-06-28,0.9435
2019-07-01,0.96
2019-07-02,0.9296
2019-07-03,0.9514
2019-07-04,0.9514
2019-07-05,0.9491
2019-07-08,0.9351
2019-07-09,0.914
2019-07-10,0.9295
2019-07-11,0.95
2019-07-12,1.01
2019-07-15,1.01
2019-07-16,1.01
2019-07-17,1.01
2019-07-18,0.985
2019-07-19,0.9797
2019-07-22,0.9395
2019-07-23,0.9146
2019-07-24,0.9175
2019-07-25,0.91
2019-07-26,0.91
2019-07-29,0.9129
2019-07-30,0.9271
2019-07-31,0.93
2019-08-01,0.936
2019-08-02,0.9035
2019-08-05,0.8766
2019-08-06,0.88
2019-08-07,0.86
2019-08-08,0.77
2019-08-09,0.7799
2019-08-12,0.7373
2019-08-13,0.7383
2019-08-14,0.7383
2019-08-15,0.7576
2019-08-16,0.8499
2019-08-19,0.8729
2019-08-20,0.9201
2019-08-21,0.87
2019-08-22,0.9351
2019-08-23,0.9026
2019-08-26,0.9168
2019-08-27,0.9398
2019-08-28,0.9398
2019-08-29,0.9398
2019-08-30,0.92
2019-09-02,0.92
2019-09-03,0.92
2019-09-04,0.9599
2019-09-05,0.9546
2019-09-06,0.9987
2019-09-09,0.9953
2019-09-10,1
2019-09-11,0.9724
2019-09-12,0.9319
2019-09-13,0.9201
2019-09-16,0.91
2019-09-17,0.9098
2019-09-18,0.9001
2019-09-19,0.9014
2019-09-20,0.8804
2019-09-23,0.8804
2019-09-24,0.8804
2019-09-25,0.91
2019-09-26,0.9129
2019-09-27,0.9129
2019-09-30,0.9129
2019-10-01,0.9002
2019-10-02,0.9
2019-10-03,0.9
2019-10-04,0.8786
2019-10-07,0.8857
2019-10-08,0.8547
2019-10-09,0.8661
2019-10-10,0.938
2019-10-11,0.98
2019-10-14,0.9574
2019-10-15,0.9574
2019-10-16,0.9081
2019-10-17,0.8857
2019-10-18,0.883
2019-10-21,0.9105
2019-10-22,0.9224
2019-10-23,0.9176
2019-10-24,0.9176
2019-10-25,1.05
2019-10-28,1.11
2019-10-29,1.055
2019-10-30,1.08
2019-10-31,1.28
2019-11-01,1.225
2019-11-04,1.25
2019-11-05,1.185
2019-11-06,1.19
2019-11-07,1.235
2019-11-08,1.275
2019-11-11,1.31
2019-11-12,1.225
2019-11-13,1.425
2019-11-14,1.465
2019-11-15,1.625
2019-11-18,1.715
2019-11-19,1.695
2019-11-20,1.69
2019-11-21,1.65
2019-11-22,1.585
2019-11-25,1.555
