date,close
2014-06-13,5.8936
2014-06-16,5.9002
2014-06-17,5.9002
2014-06-18,5.9399
2014-06-19,5.9375
2014-06-20,5.9375
2014-06-23,5.9442
2014-06-24,5.9042
2014-06-25,5.9508
2014-06-26,5.9575
2014-06-27,5.9508
2014-06-30,5.9375
2014-07-01,6.0041
2014-07-02,5.9908
2014-07-03,5.9841
2014-07-07,5.9708
2014-07-08,5.9109
2014-07-09,5.9309
2014-07-10,5.9042
2014-07-11,5.9309
2014-07-14,5.9775
2014-07-15,5.9642
2014-07-16,5.9908
2014-07-17,5.9242
2014-07-18,5.9442
2014-07-21,5.9176
2014-07-22,5.9554
2014-07-23,5.9889
2014-07-24,5.9822
2014-07-25,5.9554
2014-07-28,5.9621
2014-07-29,5.9487
2014-07-30,5.942
2014-07-31,5.8147
2014-08-01,5.7812
2014-08-04,5.808
2014-08-05,5.741
2014-08-06,5.741
2014-08-07,5.6874
2014-08-08,5.741
2014-08-11,5.7879
2014-08-12,5.7946
2014-08-13,5.8281
2014-08-14,5.8482
2014-08-15,5.8281
2014-08-18,5.8884
2014-08-19,5.9353
2014-08-20,5.9464
2014-08-21,5.9734
2014-08-22,5.9464
2014-08-25,5.9801
2014-08-26,5.9936
2014-08-27,6.0004
2014-08-28,5.9801
2014-08-29,5.9869
2014-09-02,5.9936
2014-09-03,6.0139
2014-09-04,6.0206
2014-09-05,6.0341
2014-09-08,5.9801
2014-09-09,5.9667
2014-09-10,5.9936
2014-09-11,6.0004
2014-09-12,5.9532
2014-09-15,5.906
2014-09-16,5.9599
2014-09-17,5.9734
2014-09-18,6.0071
2014-09-19,5.9708
2014-09-22,5.8623
2014-09-23,5.8419
2014-09-24,5.8894
2014-09-25,5.8148
2014-09-26,5.8419
2014-09-29,5.7876
2014-09-30,5.774
2014-10-01,5.7401
2014-10-02,5.6723
2014-10-03,5.713
2014-10-06,5.7401
2014-10-07,5.7062
2014-10-08,5.7673
2014-10-09,5.6723
2014-10-10,5.523
2014-10-13,5.3941
2014-10-14,5.4009
2014-10-15,5.333
2014-10-16,5.3393
2014-10-17,5.4484
2014-10-20,5.5298
2014-10-21,5.6858
2014-10-22,5.6966
2014-10-23,5.7581
2014-10-24,5.7649
2014-10-27,5.7444
2014-10-28,5.8059
2014-10-29,5.8264
2014-10-30,5.8468
2014-10-31,5.922
2014-11-03,5.9561
2014-11-04,5.9152
2014-11-05,5.9493
2014-11-06,5.9425
2014-11-07,5.9288
2014-11-10,5.922
2014-11-11,5.9971
2014-11-12,5.9903
2014-11-13,5.9835
2014-11-14,5.922
2014-11-17,5.9015
2014-11-18,5.9403
2014-11-19,5.9266
2014-11-20,5.9678
2014-11-21,5.961
2014-11-24,5.9747
2014-11-25,6.0091
2014-11-26,6.0503
2014-11-28,6.0435
2014-12-01,5.9816
2014-12-02,6.0435
2014-12-03,6.0297
2014-12-04,6.0022
2014-12-05,6.0366
2014-12-08,5.9953
2014-12-09,5.9266
2014-12-10,5.8785
2014-12-11,5.8853
2014-12-12,5.8166
2014-12-15,5.7341
2014-12-16,5.7272
2014-12-17,5.8578
2014-12-18,5.9472
2014-12-19,5.9197
2014-12-22,5.9403
2014-12-23,6.0022
2014-12-24,6.0136
2014-12-26,6.0206
2014-12-29,6.0067
2014-12-30,5.9929
2014-12-31,5.8752
2015-01-02,5.9652
2015-01-05,5.8406
2015-01-06,5.8129
2015-01-07,5.8614
2015-01-08,5.9721
2015-01-09,5.9583
2015-01-12,5.9514
2015-01-13,5.9306
2015-01-14,5.8752
2015-01-15,5.8476
2015-01-16,5.9375
2015-01-20,5.9514
2015-01-21,5.9837
2015-01-22,6.0604
2015-01-23,6.0325
2015-01-26,6.0464
2015-01-27,6.0046
2015-01-28,5.9419
2015-01-29,5.9837
2015-01-30,5.8932
2015-02-02,5.9837
2015-02-03,6.0395
2015-02-04,5.9907
2015-02-05,6.0464
2015-02-06,6.0046
2015-02-09,5.9977
2015-02-10,6.0255
2015-02-11,6.0186
2015-02-12,6.0604
2015-02-13,6.0952
2015-02-17,6.1022
2015-02-18,6.1348
2015-02-19,6.1207
2015-02-20,6.1488
2015-02-23,6.1698
2015-02-24,6.2119
2015-02-25,6.2189
2015-02-26,6.2329
2015-02-27,6.247
2015-03-02,6.303
2015-03-03,6.261
2015-03-04,6.2399
2015-03-05,6.268
2015-03-06,6.2119
2015-03-09,6.2189
2015-03-10,6.1348
2015-03-11,6.1488
2015-03-12,6.2189
2015-03-13,6.1838
2015-03-16,6.2189
2015-03-17,6.2329
2015-03-18,6.296
2015-03-19,6.282
2015-03-20,6.343
2015-03-23,6.3219
2015-03-24,6.3007
2015-03-25,6.2584
2015-03-26,6.2372
2015-03-27,6.2372
2015-03-30,6.3078
2015-03-31,6.2866
2015-04-01,6.2654
2015-04-02,6.2866
2015-04-06,6.3148
2015-04-07,6.3219
2015-04-08,6.343
2015-04-09,6.3713
2015-04-10,6.3854
2015-04-13,6.3713
2015-04-14,6.3995
2015-04-15,6.4418
2015-04-16,6.4489
2015-04-17,6.3783
2015-04-20,6.4065
2015-04-21,6.3827
2015-04-22,6.4112
2015-04-23,6.4325
2015-04-24,6.4467
2015-04-27,6.4325
2015-04-28,6.4183
2015-04-29,6.3827
2015-04-30,6.3543
2015-05-01,6.397
2015-05-04,6.3756
2015-05-05,6.326
2015-05-06,6.2763
2015-05-07,6.3189
2015-05-08,6.3827
2015-05-11,6.3615
2015-05-12,6.3615
2015-05-13,6.3615
2015-05-14,6.4467
2015-05-15,6.4325
2015-05-18,6.4325
2015-05-19,6.445
2015-05-20,6.4735
2015-05-21,6.4878
2015-05-22,6.5021
2015-05-26,6.4307
2015-05-27,6.4664
2015-05-28,6.4878
2015-05-29,6.4235
2015-06-01,6.4521
2015-06-02,6.4592
2015-06-03,6.4664
2015-06-04,6.4307
2015-06-05,6.4021
2015-06-08,6.3449
2015-06-09,6.3521
2015-06-10,6.4021
2015-06-11,6.3949
2015-06-12,6.3806
2015-06-15,6.3449
2015-06-16,6.3735
2015-06-17,6.3664
2015-06-18,6.4307
2015-06-19,6.3785
2015-06-22,6.4001
2015-06-23,6.4073
2015-06-24,6.3713
2015-06-25,6.3641
2015-06-26,6.3426
2015-06-29,6.1772
2015-06-30,6.2131
2015-07-01,6.2563
2015-07-02,6.2419
2015-07-06,6.1916
2015-07-07,6.2059
2015-07-08,6.0981
2015-07-09,6.1412
2015-07-10,6.2419
2015-07-13,6.3066
2015-07-14,6.3426
2015-07-15,6.3282
2015-07-16,6.3857
2015-07-17,6.3641
2015-07-20,6.3354
2015-07-21,6.3354
2015-07-22,6.3191
2015-07-23,6.2829
2015-07-24,6.1816
2015-07-27,6.1237
2015-07-28,6.1888
2015-07-29,6.225
2015-07-30,6.2395
2015-07-31,6.2467
2015-08-03,6.2105
2015-08-04,6.2033
2015-08-05,6.2395
2015-08-06,6.1888
2015-08-07,6.1599
2015-08-10,6.225
2015-08-11,6.2033
2015-08-12,6.1599
2015-08-13,6.1526
2015-08-14,6.1816
2015-08-17,6.1816
2015-08-18,6.1671
2015-08-19,6.1164
2015-08-20,5.998
2015-08-21,5.8668
2015-08-24,5.5826
2015-08-25,5.6263
2015-08-26,5.7575
2015-08-27,5.8522
2015-08-28,5.896
2015-08-31,5.8304
2015-09-01,5.6846
2015-09-02,5.7429
2015-09-03,5.7648
2015-09-04,5.6992
2015-09-08,5.8158
2015-09-09,5.7648
2015-09-10,5.7721
2015-09-11,5.7794
2015-09-14,5.6919
2015-09-15,5.7502
2015-09-16,5.8231
2015-09-17,5.845
2015-09-18,5.7794
2015-09-21,5.7995
2015-09-22,5.7261
2015-09-23,5.7261
2015-09-24,5.7041
2015-09-25,5.6894
2015-09-28,5.5132
2015-09-29,5.4765
2015-09-30,5.5059
2015-10-01,5.5646
2015-10-02,5.6234
2015-10-05,5.7188
2015-10-06,5.7041
2015-10-07,5.7482
2015-10-08,5.8216
2015-10-09,5.8436
2015-10-12,5.8583
2015-10-13,5.8069
2015-10-14,5.7702
2015-10-15,5.8216
2015-10-16,5.8583
2015-10-19,5.8583
2015-10-20,5.8803
2015-10-21,5.8489
2015-10-22,5.9154
2015-10-23,5.945
2015-10-26,5.9006
2015-10-27,5.8637
2015-10-28,5.908
2015-10-29,5.8785
2015-10-30,5.9228
2015-11-02,6.0042
2015-11-03,6.0263
2015-11-04,6.0116
2015-11-05,6.0189
2015-11-06,6.0042
2015-11-09,5.9228
2015-11-10,5.9228
2015-11-11,5.8785
2015-11-12,5.7823
2015-11-13,5.701
2015-11-16,5.7749
2015-11-17,5.7897
2015-11-18,5.8698
2015-11-19,5.8996
2015-11-20,5.9145
2015-11-23,5.8996
2015-11-24,5.907
2015-11-25,5.8996
2015-11-27,5.9219
2015-11-30,5.8996
2015-12-01,5.9666
2015-12-02,5.8996
2015-12-03,5.8177
2015-12-04,5.8773
2015-12-07,5.7879
2015-12-08,5.7581
2015-12-09,5.7283
2015-12-10,5.7208
2015-12-11,5.5942
2015-12-14,5.5644
2015-12-15,5.624
2015-12-16,5.6985
2015-12-17,5.691
2015-12-18,5.6538
2015-12-21,5.6819
2015-12-22,5.712
2015-12-23,5.787
2015-12-24,5.802
2015-12-28,5.7645
2015-12-29,5.8095
2015-12-30,5.7945
2015-12-31,5.7645
2016-01-04,5.712
2016-01-05,5.7195
2016-01-06,5.6519
2016-01-07,5.5618
2016-01-08,5.4718
2016-01-11,5.3892
2016-01-12,5.4192
2016-01-13,5.3292
2016-01-14,5.3517
2016-01-15,5.1565
2016-01-19,5.164
2016-01-20,5.041
2016-01-21,5.1092
2016-01-22,5.2757
2016-01-25,5.2076
2016-01-26,5.2681
2016-01-27,5.253
2016-01-28,5.3135
2016-01-29,5.3892
2016-02-01,5.3968
2016-02-02,5.3135
2016-02-03,5.3287
2016-02-04,5.3741
2016-02-05,5.2605
2016-02-08,5.1092
2016-02-09,5.0259
2016-02-10,5.0335
2016-02-11,4.9653
2016-02-12,5.0335
2016-02-16,5.0864
2016-02-17,5.2
2016-02-18,5.2151
2016-02-19,5.2378
2016-02-22,5.2664
2016-02-23,5.2436
2016-02-24,5.2512
2016-02-25,5.3199
2016-02-26,5.3428
2016-02-29,5.3122
2016-03-01,5.4267
2016-03-02,5.4496
2016-03-03,5.4878
2016-03-04,5.5183
2016-03-07,5.5336
2016-03-08,5.4878
2016-03-09,5.5031
2016-03-10,5.5183
2016-03-11,5.6175
2016-03-14,5.6175
2016-03-15,5.5717
2016-03-16,5.6328
2016-03-17,5.7015
2016-03-18,5.7244
2016-03-21,5.7225
2016-03-22,5.7071
2016-03-23,5.6763
2016-03-24,5.6379
2016-03-28,5.6225
2016-03-29,5.6917
2016-03-30,5.7456
2016-03-31,5.7686
2016-04-01,5.7763
2016-04-04,5.6917
2016-04-05,5.584
2016-04-06,5.6533
2016-04-07,5.5994
2016-04-08,5.6148
2016-04-11,5.6302
2016-04-12,5.6994
2016-04-13,5.7763
2016-04-14,5.7686
2016-04-15,5.784
2016-04-18,5.8225
2016-04-19,5.884
2016-04-20,5.8898
2016-04-21,5.8666
2016-04-22,5.8821
2016-04-25,5.8588
2016-04-26,5.9131
2016-04-27,5.9286
2016-04-28,5.8666
2016-04-29,5.8666
2016-05-02,5.8898
2016-05-03,5.8356
2016-05-04,5.8046
2016-05-05,5.8123
2016-05-06,5.8046
2016-05-09,5.7968
2016-05-10,5.8433
2016-05-11,5.7968
2016-05-12,5.7503
2016-05-13,5.7193
2016-05-16,5.7581
2016-05-17,5.7193
2016-05-18,5.7271
2016-05-19,5.7095
2016-05-20,5.7407
2016-05-23,5.7407
2016-05-24,5.7954
2016-05-25,5.8345
2016-05-26,5.8423
2016-05-27,5.8579
2016-05-31,5.8501
2016-06-01,5.8813
2016-06-02,5.9048
2016-06-03,5.9204
2016-06-06,5.9282
2016-06-07,5.936
2016-06-08,5.9751
2016-06-09,5.9751
2016-06-10,5.9048
2016-06-13,5.7954
2016-06-14,5.772
2016-06-15,5.7485
2016-06-16,5.7642
2016-06-17,5.772
2016-06-20,5.8501
2016-06-21,5.8717
2016-06-22,5.8639
2016-06-23,5.9032
2016-06-24,5.7064
2016-06-27,5.4939
2016-06-28,5.549
2016-06-29,5.6592
2016-06-30,5.7143
2016-07-01,5.7694
2016-07-05,5.7064
2016-07-06,5.7143
2016-07-07,5.7143
2016-07-08,5.7773
2016-07-11,5.8245
2016-07-12,5.8796
2016-07-13,5.9111
2016-07-14,5.9977
2016-07-15,5.9347
2016-07-18,5.9583
2016-07-19,5.9662
2016-07-20,6.0039
2016-07-21,5.9404
2016-07-22,5.9721
2016-07-25,5.9721
2016-07-26,6.0039
2016-07-27,6.0673
2016-07-28,6.0832
2016-07-29,6.1387
2016-08-01,6.1228
2016-08-02,6.0276
2016-08-03,6.0514
2016-08-04,6.0197
2016-08-05,6.0356
2016-08-08,6.0435
2016-08-09,6.099
2016-08-10,6.1466
2016-08-11,6.1942
2016-08-12,6.1545
2016-08-15,6.1625
2016-08-16,6.2021
2016-08-17,6.218
2016-08-18,6.218
2016-08-19,6.218
2016-08-22,6.208
2016-08-23,6.192
2016-08-24,6.2
2016-08-25,6.192
2016-08-26,6.184
2016-08-29,6.192
2016-08-30,6.216
2016-08-31,6.192
2016-09-01,6.1681
2016-09-02,6.1601
2016-09-06,6.1681
2016-09-07,6.184
2016-09-08,6.208
2016-09-09,6.1281
2016-09-12,6.1121
2016-09-13,6.0642
2016-09-14,6.0083
2016-09-15,6.0402
2016-09-16,6.0402
2016-09-19,6.0562
2016-09-20,6.0882
2016-09-21,6.1425
2016-09-22,6.1506
2016-09-23,6.1264
2016-09-26,6.062
2016-09-27,6.1586
2016-09-28,6.1586
2016-09-29,6.1264
2016-09-30,6.1425
2016-10-03,6.1345
2016-10-04,6.1022
2016-10-05,6.1022
2016-10-06,6.0942
2016-10-07,6.1022
2016-10-10,6.1264
2016-10-11,6.0378
2016-10-12,6.0459
2016-10-13,6.0137
2016-10-14,6.0056
2016-10-17,5.9332
2016-10-18,5.9573
2016-10-19,5.9815
2016-10-20,5.9632
2016-10-21,5.9795
2016-10-24,6.0119
2016-10-25,6.0281
2016-10-26,6.0525
2016-10-27,5.9957
2016-10-28,5.9795
2016-10-31,5.9795
2016-11-01,5.9308
2016-11-02,5.874
2016-11-03,5.8172
2016-11-04,5.7442
2016-11-07,5.8497
2016-11-08,5.8983
2016-11-09,5.8983
2016-11-10,5.9146
2016-11-11,5.874
2016-11-14,5.8983
2016-11-15,5.9551
2016-11-16,5.9551
2016-11-17,5.9511
2016-11-18,5.9368
2016-11-21,5.9695
2016-11-22,6.0104
2016-11-23,6.0758
2016-11-25,6.1494
2016-11-28,6.0676
2016-11-29,6.1167
2016-11-30,6.0104
2016-12-01,5.9858
2016-12-02,5.9695
2016-12-05,6.0185
2016-12-06,6.0594
2016-12-07,6.1575
2016-12-08,6.1903
2016-12-09,6.2148
2016-12-12,6.2066
2016-12-13,6.272
2016-12-14,6.2066
2016-12-15,6.2066
2016-12-16,6.2393
2016-12-19,6.223
2016-12-20,6.2456
2016-12-21,6.2621
2016-12-22,6.2621
2016-12-23,6.2291
2016-12-27,6.2374
2016-12-28,6.2456
2016-12-29,6.2127
2016-12-30,6.2456
2017-01-03,6.3363
2017-01-04,6.4104
2017-01-05,6.3939
2017-01-06,6.4599
2017-01-09,6.4763
2017-01-10,6.5093
2017-01-11,6.5422
2017-01-12,6.5175
2017-01-13,6.5587
2017-01-17,6.4928
2017-01-18,6.4846
2017-01-19,6.4104
2017-01-20,6.4665
2017-01-23,6.4582
2017-01-24,6.4831
2017-01-25,6.5578
2017-01-26,6.5661
2017-01-27,6.5661
2017-01-30,6.5495
2017-01-31,6.5993
2017-02-01,6.6159
2017-02-02,6.6159
2017-02-03,6.674
2017-02-06,6.6491
2017-02-07,6.6906
2017-02-08,6.7072
2017-02-09,6.7155
2017-02-10,6.7736
2017-02-13,6.8317
2017-02-14,6.8732
2017-02-15,6.8898
2017-02-16,6.8208
2017-02-17,6.754
2017-02-21,6.7958
2017-02-22,6.8208
2017-02-23,6.8626
2017-02-24,6.8543
2017-02-27,6.871
2017-02-28,6.8877
2017-03-01,6.9546
2017-03-02,6.9379
2017-03-03,6.9044
2017-03-06,6.9044
2017-03-07,6.8877
2017-03-08,6.8125
2017-03-09,6.7874
2017-03-10,6.8208
2017-03-13,6.8208
2017-03-14,6.8041
2017-03-15,6.8459
2017-03-16,6.8961
2017-03-17,6.9128
2017-03-20,6.9379
2017-03-21,6.8292
2017-03-22,6.8271
2017-03-23,6.886
2017-03-24,6.8608
2017-03-27,6.8692
2017-03-28,6.8944
2017-03-29,6.9281
2017-03-30,6.9618
2017-03-31,6.9534
2017-04-03,6.945
2017-04-04,6.9029
2017-04-05,6.8776
2017-04-06,6.9029
2017-04-07,6.9702
2017-04-10,7.0123
2017-04-11,6.9955
2017-04-12,6.987
2017-04-13,6.9702
2017-04-17,6.987
2017-04-18,6.9955
2017-04-19,7.0272
2017-04-20,7.0357
2017-04-21,7.0696
2017-04-24,7.1374
2017-04-25,7.1968
2017-04-26,7.2137
2017-04-27,7.2561
2017-04-28,7.307
2017-05-01,7.2392
2017-05-02,7.2392
2017-05-03,7.29
2017-05-04,7.2222
2017-05-05,7.2985
2017-05-08,7.307
2017-05-09,7.3239
2017-05-10,7.3239
2017-05-11,7.3155
2017-05-12,7.307
2017-05-15,7.3324
2017-05-16,7.3239
2017-05-17,7.2476
2017-05-18,7.2561
2017-05-19,7.2881
2017-05-22,7.382
2017-05-23,7.382
2017-05-24,7.4247
2017-05-25,7.4673
2017-05-26,7.4844
2017-05-30,7.4844
2017-05-31,7.4247
2017-06-01,7.4759
2017-06-02,7.4759
2017-06-05,7.51
2017-06-06,7.4588
2017-06-07,7.4929
2017-06-08,7.5015
2017-06-09,7.4759
2017-06-12,7.4503
2017-06-13,7.4844
2017-06-14,7.5015
2017-06-15,7.4759
2017-06-16,7.4844
2017-06-19,7.5271
2017-06-20,7.4844
2017-06-21,7.4393
2017-06-22,7.4565
2017-06-23,7.4651
2017-06-26,7.4479
2017-06-27,7.4565
2017-06-28,7.5338
2017-06-29,7.4651
2017-06-30,7.4651
2017-07-03,7.5596
2017-07-05,7.5596
2017-07-06,7.5338
2017-07-07,7.5166
2017-07-10,7.5424
2017-07-11,7.5166
2017-07-12,7.5682
2017-07-13,7.5338
2017-07-14,7.5596
2017-07-17,7.5853
2017-07-18,7.6283
2017-07-19,7.6712
2017-07-20,7.6345
2017-07-21,7.6258
2017-07-24,7.6172
2017-07-25,7.6691
2017-07-26,7.6691
2017-07-27,7.6518
2017-07-28,7.6431
2017-07-31,7.6431
2017-08-01,7.6345
2017-08-02,7.6086
2017-08-03,7.6172
2017-08-04,7.6604
2017-08-07,7.695
2017-08-08,7.6691
2017-08-09,7.6258
2017-08-10,7.427
2017-08-11,7.4529
2017-08-14,7.5048
2017-08-15,7.5221
2017-08-16,7.548
2017-08-17,7.4789
2017-08-18,7.4702
2017-08-21,7.4789
2017-08-22,7.5115
2017-08-23,7.5202
2017-08-24,7.5463
2017-08-25,7.5289
2017-08-28,7.5463
2017-08-29,7.555
2017-08-30,7.5724
2017-08-31,7.5637
2017-09-01,7.6508
2017-09-05,7.5898
2017-09-06,7.6159
2017-09-07,7.6421
2017-09-08,7.6421
2017-09-11,7.6943
2017-09-12,7.703
2017-09-13,7.6856
2017-09-14,7.6595
2017-09-15,7.6769
2017-09-18,7.7378
2017-09-19,7.7726
2017-09-20,7.7813
2017-09-21,7.7704
2017-09-22,7.8054
2017-09-25,7.7879
2017-09-26,7.7879
2017-09-27,7.8405
2017-09-28,7.858
2017-09-29,7.8843
2017-10-02,7.9368
2017-10-03,7.9894
2017-10-04,7.9719
2017-10-05,7.9894
2017-10-06,7.9631
2017-10-09,7.9894
2017-10-10,7.9368
2017-10-11,7.9456
2017-10-12,7.9981
2017-10-13,7.9981
2017-10-16,8.0069
2017-10-17,7.9981
2017-10-18,7.9543
2017-10-19,7.9981
2017-10-20,8.0332
2017-10-23,7.9605
2017-10-24,8.031
2017-10-25,7.9384
2017-10-26,7.9076
2017-10-27,7.9869
2017-10-30,7.9516
2017-10-31,7.9516
2017-11-01,8.031
2017-11-02,8.0222
2017-11-03,7.9957
2017-11-06,8.0222
2017-11-07,8.0222
2017-11-08,8.031
2017-11-09,7.9693
2017-11-10,7.9605
2017-11-13,7.9076
2017-11-14,7.8194
2017-11-15,7.8458
2017-11-16,7.9252
2017-11-17,7.9252
2017-11-20,7.9693
2017-11-21,8.0114
2017-11-22,7.9937
2017-11-24,8.0646
2017-11-27,8.0025
2017-11-28,8.0292
2017-11-29,8.0646
2017-11-30,8.109
2017-12-01,8.109
2017-12-04,8.1267
2017-12-05,8.0824
2017-12-06,8.1179
2017-12-07,8.0824
2017-12-08,8.1179
2017-12-11,8.1622
2017-12-12,8.1445
2017-12-13,8.1622
2017-12-14,8.109
2017-12-15,8.1445
2017-12-18,8.1889
2017-12-19,8.1889
2017-12-20,8.2759
2017-12-21,8.2491
2017-12-22,8.4187
2017-12-26,8.3562
2017-12-27,8.4098
2017-12-28,8.4366
2017-12-29,8.4545
2018-01-02,8.4009
2018-01-03,8.4545
2018-01-04,8.4902
2018-01-05,8.5884
2018-01-08,8.6062
2018-01-09,8.6241
2018-01-10,8.633
2018-01-11,8.6598
2018-01-12,8.6866
2018-01-16,8.6866
2018-01-17,8.758
2018-01-18,8.7758
2018-01-19,8.8116
2018-01-22,8.883
2018-01-23,8.9256
2018-01-24,8.9077
2018-01-25,8.9526
2018-01-26,8.9795
2018-01-29,8.9795
2018-01-30,8.8628
2018-01-31,8.8089
2018-02-01,8.8269
2018-02-02,8.7011
2018-02-05,8.2881
2018-02-06,8.3958
2018-02-07,8.4318
2018-02-08,8.1444
2018-02-09,8.1444
2018-02-12,8.2611
2018-02-13,8.2701
2018-02-14,8.4228
2018-02-15,8.5036
2018-02-16,8.5395
2018-02-20,8.4559
2018-02-21,8.465
2018-02-22,8.4469
2018-02-23,8.5192
2018-02-26,8.6095
2018-02-27,8.5101
2018-02-28,8.4017
2018-03-01,8.3204
2018-03-02,8.3114
2018-03-05,8.3475
2018-03-06,8.4108
2018-03-07,8.5373
2018-03-08,8.5463
2018-03-09,8.5915
2018-03-12,8.6095
2018-03-13,8.5282
2018-03-14,8.483
2018-03-15,8.5373
2018-03-16,8.5192
2018-03-19,8.4198
2018-03-20,8.3837
2018-03-21,8.3359
2018-03-22,8.1814
2018-03-23,8.0451
2018-03-26,8.1269
2018-03-27,8.0541
2018-03-28,8.0269
2018-03-29,8.1269
2018-04-02,8.0269
2018-04-03,8.0541
2018-04-04,8.0541
2018-04-05,8.145
2018-04-06,8.0087
2018-04-09,8.0814
2018-04-10,8.1723
2018-04-11,8.1814
2018-04-12,8.1905
2018-04-13,8.136
2018-04-16,8.1905
2018-04-17,8.2269
2018-04-18,8.2541
2018-04-19,8.2723
2018-04-20,8.2151
2018-04-23,8.1785
2018-04-24,8.1877
2018-04-25,8.206
2018-04-26,8.2517
2018-04-27,8.2426
2018-04-30,8.2334
2018-05-01,8.1968
2018-05-02,8.1785
2018-05-03,8.1785
2018-05-04,8.2609
2018-05-07,8.2975
2018-05-08,8.2883
2018-05-09,8.3158
2018-05-10,8.3524
2018-05-11,8.4073
2018-05-14,8.4255
2018-05-15,8.2975
2018-05-16,8.3615
2018-05-17,8.3798
2018-05-18,8.3524
2018-05-21,8.3981
2018-05-22,8.3406
2018-05-23,8.3037
2018-05-24,8.2669
2018-05-25,8.2853
2018-05-29,8.1841
2018-05-30,8.2117
2018-05-31,8.1749
2018-06-01,8.2485
2018-06-04,8.2853
2018-06-05,8.2945
2018-06-06,8.3129
2018-06-07,8.3406
2018-06-08,8.2853
2018-06-11,8.3314
2018-06-12,8.3498
2018-06-13,8.3406
2018-06-14,8.3866
2018-06-15,8.405
2018-06-18,8.3222
2018-06-19,8.2853
2018-06-20,8.3108
2018-06-21,8.2645
2018-06-22,8.3016
2018-06-25,8.144
2018-06-26,8.1718
2018-06-27,8.1162
2018-06-28,8.0885
2018-06-29,8.107
2018-07-02,8.0792
2018-07-03,8.0885
2018-07-05,8.1255
2018-07-06,8.1904
2018-07-09,8.1996
2018-07-10,8.2089
2018-07-11,8.1718
2018-07-12,8.1811
2018-07-13,8.1996
2018-07-16,8.1533
2018-07-17,8.2182
2018-07-18,8.2182
2018-07-19,8.1996
2018-07-20,8.2066
2018-07-23,8.2066
2018-07-24,8.2533
2018-07-25,8.2812
2018-07-26,8.2812
2018-07-27,8.2906
2018-07-30,8.2253
2018-07-31,8.2719
2018-08-01,8.2626
2018-08-02,8.2719
2018-08-03,8.2626
2018-08-06,8.3279
2018-08-07,8.3372
2018-08-08,8.3372
2018-08-09,8.3372
2018-08-10,8.2533
2018-08-13,8.2066
2018-08-14,8.2253
2018-08-15,8.1134
2018-08-16,8.1786
2018-08-17,8.1857
2018-08-20,8.2326
2018-08-21,8.2889
2018-08-22,8.2889
2018-08-23,8.2608
2018-08-24,8.3077
2018-08-27,8.3453
2018-08-28,8.3359
2018-08-29,8.3734
2018-08-30,8.3547
2018-08-31,8.3453
2018-09-04,8.2983
2018-09-05,8.2514
2018-09-06,8.2045
2018-09-07,8.2045
2018-09-10,8.2045
2018-09-11,8.2608
2018-09-12,8.2608
2018-09-13,8.2514
2018-09-14,8.2796
2018-09-17,8.2608
2018-09-18,8.2889
2018-09-19,8.3359
2018-09-20,8.364
2018-09-21,8.39
2018-09-24,8.3711
2018-09-25,8.3428
2018-09-26,8.3428
2018-09-27,8.3333
2018-09-28,8.2955
2018-10-01,8.3333
2018-10-02,8.2672
2018-10-03,8.305
2018-10-04,8.1822
2018-10-05,8.1066
2018-10-08,8.0499
2018-10-09,8.0782
2018-10-10,7.842
2018-10-11,7.7286
2018-10-12,7.7948
2018-10-15,7.8609
2018-10-16,7.9554
2018-10-17,7.946
2018-10-18,7.8104
2018-10-19,7.8009
2018-10-22,7.7723
2018-10-23,7.7057
2018-10-24,7.525
2018-10-25,7.6106
2018-10-26,7.4869
2018-10-29,7.3823
2018-10-30,7.4394
2018-10-31,7.5535
2018-11-01,7.6582
2018-11-02,7.6677
2018-11-05,7.6677
2018-11-06,7.7343
2018-11-07,7.8675
2018-11-08,7.9055
2018-11-09,7.8199
2018-11-12,7.7343
2018-11-13,7.6962
2018-11-14,7.6677
2018-11-15,7.6962
2018-11-16,7.7034
2018-11-19,7.6268
2018-11-20,7.4926
2018-11-21,7.531
2018-11-23,7.531
2018-11-26,7.5884
2018-11-27,7.5884
2018-11-28,7.7226
2018-11-29,7.7609
2018-11-30,7.7705
2018-12-03,7.8855
2018-12-04,7.6651
2018-12-06,7.5214
2018-12-07,7.4543
2018-12-10,7.3872
2018-12-11,7.3489
2018-12-12,7.4351
2018-12-13,7.3872
2018-12-14,7.2818
2018-12-17,7.071
2018-12-18,7.071
2018-12-19,7.0423
2018-12-20,6.8603
2018-12-21,6.7836
2018-12-24,6.7165
2018-12-26,6.8794
2018-12-27,6.8698
2018-12-28,6.9447
2018-12-31,6.964
2019-01-02,7.0703
2019-01-03,7.022
2019-01-04,7.1862
2019-01-07,7.2924
2019-01-08,7.3793
2019-01-09,7.4856
2019-01-10,7.5146
2019-01-11,7.5242
2019-01-14,7.5049
2019-01-15,7.5918
2019-01-16,7.6015
2019-01-17,7.6691
2019-01-18,7.756
2019-01-22,7.6661
2019-01-23,7.6855
2019-01-24,7.7147
2019-01-25,7.7925
2019-01-28,7.7731
2019-01-29,7.8023
2019-01-30,7.9579
2019-01-31,7.9579
2019-02-01,7.9968
2019-02-04,8.0163
2019-02-05,8.0941
2019-02-06,8.0552
2019-02-07,7.9579
2019-02-08,7.9385
2019-02-11,7.9871
2019-02-12,8.026
2019-02-13,8.0455
2019-02-14,8.0552
2019-02-15,8.1136
2019-02-19,8.1622
2019-02-20,8.1989
2019-02-21,8.15
2019-02-22,8.1793
2019-02-25,8.1696
2019-02-26,8.1402
2019-02-27,8.1402
2019-02-28,8.1304
2019-03-01,8.15
2019-03-04,8.1598
2019-03-05,8.1304
2019-03-06,8.0814
2019-03-07,7.954
2019-03-08,7.9443
2019-03-11,8.0618
2019-03-12,8.0422
2019-03-13,8.1206
2019-03-14,8.1304
2019-03-15,8.1598
2019-03-18,8.2283
2019-03-19,8.2577
2019-03-20,8.275
2019-03-21,8.275
2019-03-22,8.1566
2019-03-25,8.1073
2019-03-26,8.1172
2019-03-27,8.0876
2019-03-28,8.1468
2019-03-29,8.1369
2019-04-01,8.2059
2019-04-02,8.2552
2019-04-03,8.3046
2019-04-04,8.3144
2019-04-05,8.344
2019-04-08,8.344
2019-04-09,8.3243
2019-04-10,8.3637
2019-04-11,8.3736
2019-04-12,8.4328
2019-04-15,8.4426
2019-04-16,8.4624
2019-04-17,8.4624
2019-04-18,8.4599
2019-04-22,8.44
2019-04-23,8.45
2019-04-24,8.44
2019-04-25,8.4003
2019-04-26,8.4102
2019-04-29,8.44
2019-04-30,8.4599
2019-05-01,8.4797
2019-05-02,8.44
2019-05-03,8.4797
2019-05-06,8.4202
2019-05-07,8.2712
2019-05-08,8.2613
2019-05-09,8.2117
2019-05-10,8.2017
2019-05-13,8.023
2019-05-14,8.1024
2019-05-15,8.1124
2019-05-16,8.1322
2019-05-17,8.1322
2019-05-20,8.0925
2019-05-21,8.11
2019-05-22,8.09
2019-05-23,8.02
2019-05-24,8.02
2019-05-28,8
2019-05-29,7.9
2019-05-30,7.92
2019-05-31,7.82
2019-06-03,7.78
2019-06-04,7.92
2019-06-05,7.96
2019-06-06,8
2019-06-07,8.05
2019-06-10,8.11
2019-06-11,8.13
2019-06-12,8.12
2019-06-13,8.145
2019-06-14,8.1
2019-06-17,8.12
2019-06-18,8.23
2019-06-19,8.23
2019-06-20,8.225
2019-06-21,8.215
2019-06-24,8.245
2019-06-25,8.225
2019-06-26,8.225
2019-06-27,8.29
2019-06-28,8.325
2019-07-01,8.345
2019-07-02,8.37
2019-07-03,8.385
2019-07-04,8.385
2019-07-05,8.385
2019-07-08,8.34
2019-07-09,8.33
2019-07-10,8.39
2019-07-11,8.345
2019-07-12,8.4
2019-07-15,8.41
2019-07-16,8.435
2019-07-17,8.425
2019-07-18,8.395
2019-07-19,8.355
2019-07-22,8.37
2019-07-23,8.395
2019-07-24,8.45
2019-07-25,8.365
2019-07-26,8.375
2019-07-29,8.37
2019-07-30,8.405
2019-07-31,8.355
2019-08-01,8.275
2019-08-02,8.22
2019-08-05,8.045
2019-08-06,8.1
2019-08-07,8.055
2019-08-08,8.155
2019-08-09,8.105
2019-08-12,8.095
2019-08-13,8.165
2019-08-14,8.005
2019-08-15,8.005
2019-08-16,7.985
2019-08-19,8.105
2019-08-20,8.05
2019-08-21,8.12
2019-08-22,8.105
2019-08-23,8.045
2019-08-26,8.01
2019-08-27,8.035
2019-08-28,8.005
2019-08-29,8.025
2019-08-30,8.045
2019-09-02,8.045
2019-09-03,8.025
2019-09-04,8.085
2019-09-05,8.165
2019-09-06,8.195
2019-09-09,8.215
2019-09-10,8.21
2019-09-11,8.27
2019-09-12,8.355
2019-09-13,8.395
2019-09-16,8.35
2019-09-17,8.34
2019-09-18,8.385
2019-09-19,8.4
2019-09-20,8.375
2019-09-23,8.34
2019-09-24,8.3
2019-09-25,8.25
2019-09-26,8.255
2019-09-27,8.24
2019-09-30,8.325
2019-10-01,8.275
2019-10-02,8.125
2019-10-03,8.135
2019-10-04,8.215
2019-10-07,8.195
2019-10-08,8.125
2019-10-09,8.185
2019-10-10,8.215
2019-10-11,8.31
2019-10-14,8.305
2019-10-15,8.335
2019-10-16,8.325
2019-10-17,8.335
2019-10-18,8.305
2019-10-21,8.325
2019-10-22,8.355
2019-10-23,8.385
2019-10-24,8.375
2019-10-25,8.385
2019-10-28,8.415
2019-10-29,8.475
2019-10-30,8.505
2019-10-31,8.465
2019-11-01,8.51
2019-11-04,8.57
2019-11-05,8.55
2019-11-06,8.605
2019-11-07,8.65
2019-11-08,8.615
2019-11-11,8.605
2019-11-12,8.615
2019-11-13,8.605
2019-11-14,8.61
2019-11-15,8.62
2019-11-18,8.665
2019-11-19,8.615
2019-11-20,8.485
2019-11-21,8.545
2019-11-22,8.565
2019-11-25,8.595
