date,close
2015-04-16,30
2015-04-17,27.58
2015-04-20,24.9
2015-04-21,25.75
2015-04-22,25.12
2015-04-23,25.62
2015-04-24,25.58
2015-04-27,25.9
2015-04-28,24.49
2015-04-29,22.42
2015-04-30,22.24
2015-05-01,21.75
2015-05-04,23.24
2015-05-05,24.15
2015-05-06,23.4
2015-05-07,23.69
2015-05-08,22.71
2015-05-11,20.85
2015-05-12,20.57
2015-05-13,19.83
2015-05-14,20.6
2015-05-15,20.05
2015-05-18,20.56
2015-05-19,21
2015-05-20,17.2
2015-05-21,17.51
2015-05-22,17.17
2015-05-26,17.09
2015-05-27,17.06
2015-05-28,17.04
2015-05-29,16.76
2015-06-01,16.05
2015-06-02,15.86
2015-06-03,15.32
2015-06-04,15.07
2015-06-05,15.03
2015-06-08,14.86
2015-06-09,15.99
2015-06-10,16.78
2015-06-11,16.86
2015-06-12,16.64
2015-06-15,16.32
2015-06-16,16.29
2015-06-17,15.77
2015-06-18,15.33
2015-06-19,14.31
2015-06-22,14.42
2015-06-23,14.34
2015-06-24,14.39
2015-06-25,14.9
2015-06-26,14.25
2015-06-29,14.23
2015-06-30,14.05
2015-07-01,14.01
2015-07-02,13.27
2015-07-06,13.4
2015-07-07,13.32
2015-07-08,14.55
2015-07-09,16.2
2015-07-10,16.53
2015-07-13,16.03
2015-07-14,16.51
2015-07-15,16.82
2015-07-16,16.83
2015-07-17,21.98
2015-07-20,19.56
2015-07-21,18.98
2015-07-22,18.45
2015-07-23,18.44
2015-07-24,19.31
2015-07-27,18.3
2015-07-28,18.65
2015-07-29,18.98
2015-07-30,21.2
2015-07-31,20.84
2015-08-03,20.5
2015-08-04,19.23
2015-08-05,13.78
2015-08-06,13.59
2015-08-07,13.44
2015-08-10,14.29
2015-08-11,16.01
2015-08-12,16.88
2015-08-13,16.99
2015-08-14,17.08
2015-08-17,17.35
2015-08-18,15.86
2015-08-19,14.98
2015-08-20,14.25
2015-08-21,13.46
2015-08-24,12.93
2015-08-25,12.87
2015-08-26,13.04
2015-08-27,14.29
2015-08-28,14.82
2015-08-31,14.33
2015-09-01,14.06
2015-09-02,14.35
2015-09-03,14.02
2015-09-04,14.21
2015-09-08,14.36
2015-09-09,13.99
2015-09-10,14.23
2015-09-11,14.31
2015-09-14,14.38
2015-09-15,14.6
2015-09-16,14.39
2015-09-17,15.61
2015-09-18,15.4
2015-09-21,15.9
2015-09-22,15.18
2015-09-23,14.61
2015-09-24,14.98
2015-09-25,14.11
2015-09-28,13.88
2015-09-29,13.82
2015-09-30,13.69
2015-10-01,14.15
2015-10-02,14.32
2015-10-05,14.66
2015-10-06,14.07
2015-10-07,14.18
2015-10-08,13.57
2015-10-09,13.86
2015-10-12,12.31
2015-10-13,11.6
2015-10-14,10.99
2015-10-15,11.03
2015-10-16,10.99
2015-10-19,10.94
2015-10-20,11.34
2015-10-21,10.68
2015-10-22,11.39
2015-10-23,11.18
2015-10-26,11.27
2015-10-27,10.98
2015-10-28,11.09
2015-10-29,10.91
2015-10-30,10.9
2015-11-02,10.69
2015-11-03,11.03
2015-11-04,9.97
2015-11-05,9.96
2015-11-06,9.21
2015-11-09,8.8
2015-11-10,8.49
2015-11-11,8.96
2015-11-12,8.94
2015-11-13,8.69
2015-11-16,8.78
2015-11-17,8.81
2015-11-18,8.72
2015-11-19,8.72
2015-11-20,8.47
2015-11-23,8.9
2015-11-24,8.91
2015-11-25,9.24
2015-11-27,9.29
2015-11-30,9.31
2015-12-01,9.28
2015-12-02,9.23
2015-12-03,9.2
2015-12-04,9.27
2015-12-07,9.47
2015-12-08,9.51
2015-12-09,9.43
2015-12-10,9.24
2015-12-11,8.86
2015-12-14,9.03
2015-12-15,9.51
2015-12-16,9.79
2015-12-17,9.59
2015-12-18,8.62
2015-12-21,8.71
2015-12-22,8.78
2015-12-23,8.84
2015-12-24,8.92
2015-12-28,8.52
2015-12-29,8.51
2015-12-30,8.48
2015-12-31,8.26
2016-01-04,8.24
2016-01-05,8.51
2016-01-06,8.8
2016-01-07,8.67
2016-01-08,8.38
2016-01-11,7.44
2016-01-12,7.35
2016-01-13,6.99
2016-01-14,7.07
2016-01-15,7
2016-01-19,6.65
2016-01-20,6.88
2016-01-21,6.99
2016-01-22,7.42
2016-01-25,7.25
2016-01-26,7.38
2016-01-27,7.3
2016-01-28,7.49
2016-01-29,7.76
2016-02-01,7.55
2016-02-02,7.12
2016-02-03,7.32
2016-02-04,7.48
2016-02-05,7.03
2016-02-08,6.72
2016-02-09,6.36
2016-02-10,6.72
2016-02-11,6.73
2016-02-12,6.9
2016-02-16,7.49
2016-02-17,8.04
2016-02-18,7.8
2016-02-19,7.93
2016-02-22,7.95
2016-02-23,7.39
2016-02-24,7.9
2016-02-25,7.9
2016-02-26,7.65
2016-02-29,7.94
2016-03-01,8.36
2016-03-02,8.92
2016-03-03,8.89
2016-03-04,8.82
2016-03-07,8.94
2016-03-08,8.68
2016-03-09,8.74
2016-03-10,9.06
2016-03-11,9.27
2016-03-14,9.05
2016-03-15,9.17
2016-03-16,9.16
2016-03-17,9.27
2016-03-18,9.23
2016-03-21,9.06
2016-03-22,9.15
2016-03-23,8.87
2016-03-24,8.85
2016-03-28,8.7
2016-03-29,8.75
2016-03-30,8.91
2016-03-31,8.7
2016-04-01,8.67
2016-04-04,8.71
2016-04-05,8.32
2016-04-06,8.48
2016-04-07,8.38
2016-04-08,8.26
2016-04-11,8.05
2016-04-12,8.25
2016-04-13,8.49
2016-04-14,8.46
2016-04-15,8.77
2016-04-18,8.83
2016-04-19,8.83
2016-04-20,8.79
2016-04-21,8.98
2016-04-22,9.025
2016-04-25,9
2016-04-26,9.06
2016-04-27,9.33
2016-04-28,8.7
2016-04-29,8.78
2016-05-02,8.51
2016-05-03,8.4
2016-05-04,8.82
2016-05-05,8.97
2016-05-06,8.27
2016-05-09,8.19
2016-05-10,8.41
2016-05-11,8.29
2016-05-12,8.28
2016-05-13,8.59
2016-05-16,8.61
2016-05-17,8.48
2016-05-18,8.34
2016-05-19,8.22
2016-05-20,8.38
2016-05-23,8.55
2016-05-24,8.49
2016-05-25,8.56
2016-05-26,8.86
2016-05-27,8.94
2016-05-31,9.25
2016-06-01,9.4
2016-06-02,9.32
2016-06-03,9.21
2016-06-06,9.64
2016-06-07,9.63
2016-06-08,9.56
2016-06-09,9.67
2016-06-10,9.44
2016-06-13,9.57
2016-06-14,9.58
2016-06-15,9.79
2016-06-16,9.9
2016-06-17,9.72
2016-06-20,10
2016-06-21,9.75
2016-06-22,9.58
2016-06-23,9.93
2016-06-24,9.26
2016-06-27,8.74
2016-06-28,8.84
2016-06-29,9.41
2016-06-30,9.59
2016-07-01,9.66
2016-07-05,9.46
2016-07-06,9.2
2016-07-07,9.21
2016-07-08,9.6
2016-07-11,9.71
2016-07-12,10.2
2016-07-13,10.16
2016-07-14,10.14
2016-07-15,9.99
2016-07-18,9.88
2016-07-19,9.83
2016-07-20,9.99
2016-07-21,9.83
2016-07-22,9.82
2016-07-25,9.88
2016-07-26,9.86
2016-07-27,9.82
2016-07-28,10.11
2016-07-29,10.06
2016-08-01,11.86
2016-08-02,12.71
2016-08-03,13.84
2016-08-04,14.07
2016-08-05,13.77
2016-08-08,13.69
2016-08-09,13.76
2016-08-10,13.78
2016-08-11,14.5
2016-08-12,14.45
2016-08-15,14.49
2016-08-16,14.26
2016-08-17,13.98
2016-08-18,14.19
2016-08-19,14.07
2016-08-22,13.99
2016-08-23,13.98
2016-08-24,13.67
2016-08-25,13.55
2016-08-26,13.42
2016-08-29,13.53
2016-08-30,13.47
2016-08-31,13.46
2016-09-01,13.78
2016-09-02,13.87
2016-09-06,14.19
2016-09-07,14.36
2016-09-08,14.27
2016-09-09,13.64
2016-09-12,13.87
2016-09-13,13.68
2016-09-14,13.69
2016-09-15,13.63
2016-09-16,13.57
2016-09-19,13.36
2016-09-20,13.51
2016-09-21,14.54
2016-09-22,14.82
2016-09-23,15.215
2016-09-26,14.82
2016-09-27,14.7
2016-09-28,14.76
2016-09-29,14.43
2016-09-30,14.28
2016-10-03,14.72
2016-10-04,15.37
2016-10-05,15.35
2016-10-06,15.13
2016-10-07,15.48
2016-10-10,15.81
2016-10-11,15.27
2016-10-12,15.11
2016-10-13,14.82
2016-10-14,14.48
2016-10-17,14.37
2016-10-18,14.39
2016-10-19,14.48
2016-10-20,14.31
2016-10-21,14.23
2016-10-24,14.1
2016-10-25,13.55
2016-10-26,13.13
2016-10-27,12.83
2016-10-28,12.43
2016-10-31,12.98
2016-11-01,12.95
2016-11-02,11.27
2016-11-03,11.09
2016-11-04,11.45
2016-11-07,11.77
2016-11-08,11.52
2016-11-09,11.37
2016-11-10,11.48
2016-11-11,11.72
2016-11-14,11.67
2016-11-15,12.05
2016-11-16,12
2016-11-17,12.46
2016-11-18,12.59
2016-11-21,12.94
2016-11-22,13.1
2016-11-23,13.12
2016-11-25,13.09
2016-11-28,12.84
2016-11-29,12.73
2016-11-30,12.4
2016-12-01,11.93
2016-12-02,11.83
2016-12-05,12.09
2016-12-06,12.36
2016-12-07,12.6
2016-12-08,12.57
2016-12-09,12.37
2016-12-12,12.18
2016-12-13,12.24
2016-12-14,11.84
2016-12-15,12.55
2016-12-16,12.78
2016-12-19,12.92
2016-12-20,12.78
2016-12-21,12.67
2016-12-22,11.94
2016-12-23,11.98
2016-12-27,12.18
2016-12-28,11.87
2016-12-29,11.76
2016-12-30,11.78
2017-01-03,11.88
2017-01-04,11.97
2017-01-05,12.4
2017-01-06,13.08
2017-01-09,12.35
2017-01-10,12.77
2017-01-11,12.73
2017-01-12,12.47
2017-01-13,12.52
2017-01-17,12.77
2017-01-18,12.9
2017-01-19,12.6
2017-01-20,12.41
2017-01-23,12.65
2017-01-24,12.97
2017-01-25,12.82
2017-01-26,13
2017-01-27,12.93
2017-01-30,12.75
2017-01-31,12.61
2017-02-01,12.46
2017-02-02,12.7
2017-02-03,12.64
2017-02-06,12.34
2017-02-07,12.43
2017-02-08,12.5
2017-02-09,12.5
2017-02-10,12.84
2017-02-13,12.76
2017-02-14,12.86
2017-02-15,13.33
2017-02-16,12.92
2017-02-17,12.9
2017-02-21,13.01
2017-02-22,12.9
2017-02-23,12.51
2017-02-24,12.72
2017-02-27,12.79
2017-02-28,12.12
2017-03-01,10.69
2017-03-02,10.66
2017-03-03,10.19
2017-03-06,10.14
2017-03-07,9.81
2017-03-08,9.56
2017-03-09,9.64
2017-03-10,9.72
2017-03-13,10.05
2017-03-14,10.04
2017-03-15,10.23
2017-03-16,10.38
2017-03-17,10.37
2017-03-20,10.27
2017-03-21,9.99
2017-03-22,10.04
2017-03-23,9.89
2017-03-24,9.88
2017-03-27,10.15
2017-03-28,10.11
2017-03-29,10.35
2017-03-30,10.4
2017-03-31,10.63
2017-04-03,10.63
2017-04-04,10.7
2017-04-05,10.59
2017-04-06,10.61
2017-04-07,10.47
2017-04-10,10.57
2017-04-11,10.57
2017-04-12,10.53
2017-04-13,10.29
2017-04-17,10.53
2017-04-18,10.65
2017-04-19,10.87
2017-04-20,11.01
2017-04-21,10.63
2017-04-24,10.71
2017-04-25,10.48
2017-04-26,10.46
2017-04-27,10.68
2017-04-28,10.76
2017-05-01,11.06
2017-05-02,11.39
2017-05-03,10.505
2017-05-04,10.62
2017-05-05,11.66
2017-05-08,11.32
2017-05-09,11.54
2017-05-10,11.42
2017-05-11,11.16
2017-05-12,11.26
2017-05-15,11.32
2017-05-16,13.73
2017-05-17,12.94
2017-05-18,13.13
2017-05-19,13.31
2017-05-22,13.15
2017-05-23,13.31
2017-05-24,13.4
2017-05-25,13.18
2017-05-26,13.45
2017-05-30,13.36
2017-05-31,13.41
2017-06-01,13.55
2017-06-02,13.47
2017-06-05,13.54
2017-06-06,13.49
2017-06-07,13.43
2017-06-08,13.92
2017-06-09,13.45
2017-06-12,13.26
2017-06-13,13.64
2017-06-14,13.57
2017-06-15,13.85
2017-06-16,13.67
2017-06-19,14.2
2017-06-20,13.98
2017-06-21,14.2
2017-06-22,14.68
2017-06-23,15.24
2017-06-26,15.27
2017-06-27,14.8
2017-06-28,15.19
2017-06-29,14.97
2017-06-30,15
2017-07-03,14.72
2017-07-05,14.89
2017-07-06,14.63
2017-07-07,15.02
2017-07-10,15.01
2017-07-11,14.82
2017-07-12,14.93
2017-07-13,15.18
2017-07-14,15.06
2017-07-17,14.77
2017-07-18,14.91
2017-07-19,14.6
2017-07-20,14.5
2017-07-21,14.62
2017-07-24,14.49
2017-07-25,14.65
2017-07-26,14.92
2017-07-27,14.84
2017-07-28,14.64
2017-07-31,14.37
2017-08-01,14.31
2017-08-02,14.02
2017-08-03,13.59
2017-08-04,15.15
2017-08-07,15.46
2017-08-08,15.62
2017-08-09,15.85
2017-08-10,15.9
2017-08-11,16.22
2017-08-14,16.19
2017-08-15,15.64
2017-08-16,15.6
2017-08-17,15.58
2017-08-18,15.59
2017-08-21,15.43
2017-08-22,15.63
2017-08-23,15.61
2017-08-24,15.84
2017-08-25,15.64
2017-08-28,15.83
2017-08-29,16.03
2017-08-30,16.17
2017-08-31,16.37
2017-09-01,16.31
2017-09-05,16.32
2017-09-06,16.62
2017-09-07,17
2017-09-08,16.88
2017-09-11,17.34
2017-09-12,17.62
2017-09-13,17.79
2017-09-14,17.76
2017-09-15,17.17
2017-09-18,17.13
2017-09-19,17.17
2017-09-20,17.18
2017-09-21,17.11
2017-09-22,17.11
2017-09-25,16.9
2017-09-26,17.04
2017-09-27,16.96
2017-09-28,16.82
2017-09-29,16.88
2017-10-02,17.2
2017-10-03,17.03
2017-10-04,16.55
2017-10-05,16.5
2017-10-06,16.72
2017-10-09,16.47
2017-10-10,16.4
2017-10-11,16.34
2017-10-12,16.2
2017-10-13,16.51
2017-10-16,16.36
2017-10-17,16.2
2017-10-18,16.36
2017-10-19,16.19
2017-10-20,16.38
2017-10-23,15.76
2017-10-24,15.74
2017-10-25,15.81
2017-10-26,16.27
2017-10-27,16.75
2017-10-30,16.71
2017-10-31,16.7
2017-11-01,16.73
2017-11-02,16.5
2017-11-03,16.59
2017-11-06,17.15
2017-11-07,16.86
2017-11-08,16.51
2017-11-09,16.51
2017-11-10,16.72
2017-11-13,16.65
2017-11-14,16.59
2017-11-15,16.47
2017-11-16,16.42
2017-11-17,16.47
2017-11-20,16.65
2017-11-21,16.93
2017-11-22,16.87
2017-11-24,17.12
2017-11-27,16.98
2017-11-28,16.98
2017-11-29,16.32
2017-11-30,16.46
2017-12-01,16.83
2017-12-04,17.91
2017-12-05,18.19
2017-12-06,18.74
2017-12-07,18.96
2017-12-08,19.32
2017-12-11,19.93
2017-12-12,20.21
2017-12-13,20.16
2017-12-14,20.14
2017-12-15,20.5
2017-12-18,20.77
2017-12-19,20.31
2017-12-20,20.72
2017-12-21,21.76
2017-12-22,21.69
2017-12-26,21.75
2017-12-27,20.82
2017-12-28,20.65
2017-12-29,20.45
2018-01-02,20.83
2018-01-03,20.41
2018-01-04,20.23
2018-01-05,20.25
2018-01-08,20.32
2018-01-09,20.9
2018-01-10,20.26
2018-01-11,20.56
2018-01-12,19.54
2018-01-16,19.35
2018-01-17,19.74
2018-01-18,19.6
2018-01-19,19.7
2018-01-22,20.03
2018-01-23,19.94
2018-01-24,19.05
2018-01-25,19.14
2018-01-26,19.2
2018-01-29,18.96
2018-01-30,18.89
2018-01-31,18.76
2018-02-01,19.16
2018-02-02,18.79
2018-02-05,18.44
2018-02-06,18.71
2018-02-07,18.61
2018-02-08,17.73
2018-02-09,18.63
2018-02-12,18.62
2018-02-13,19.42
2018-02-14,19.95
2018-02-15,19.81
2018-02-16,20.96
2018-02-20,21.31
2018-02-21,21.43
2018-02-22,21.03
2018-02-23,21.07
2018-02-26,21.12
2018-02-27,21.03
2018-02-28,25.31
2018-03-01,25.32
2018-03-02,25.71
2018-03-05,25.4
2018-03-06,25.67
2018-03-07,26.09
2018-03-08,26.38
2018-03-09,27.93
2018-03-12,27.93
2018-03-13,27.92
2018-03-14,28.37
2018-03-15,28.38
2018-03-16,28.3
2018-03-19,27.83
2018-03-20,28.31
2018-03-21,28.95
2018-03-22,27.94
2018-03-23,26.64
2018-03-26,27.36
2018-03-27,27.66
2018-03-28,27.91
2018-03-29,28.06
2018-04-02,27.97
2018-04-03,27.83
2018-04-04,27.84
2018-04-05,28.54
2018-04-06,27.63
2018-04-09,27.6
2018-04-10,29.9
2018-04-11,30.2
2018-04-12,30.58
2018-04-13,28.97
2018-04-16,29.39
2018-04-17,30.28
2018-04-18,30.4
2018-04-19,30.23
2018-04-20,30.01
2018-04-23,29.73
2018-04-24,28.97
2018-04-25,28.73
2018-04-26,29.53
2018-04-27,29.5
2018-04-30,29.94
2018-05-01,30.32
2018-05-02,30.77
2018-05-03,30.85
2018-05-04,30.59
2018-05-07,31.42
2018-05-08,31.42
2018-05-09,29.99
2018-05-10,29.28
2018-05-11,30.01
2018-05-14,29.42
2018-05-15,29.09
2018-05-16,29.4
2018-05-17,29.47
2018-05-18,29.64
2018-05-21,29.4
2018-05-22,28.99
2018-05-23,29.38
2018-05-24,29.5
2018-05-25,30.44
2018-05-29,30.41
2018-05-30,31.71
2018-05-31,32.34
2018-06-01,31.62
2018-06-04,31.67
2018-06-05,32.92
2018-06-06,33.48
2018-06-07,33.43
2018-06-08,33.25
2018-06-11,32.05
2018-06-12,33.22
2018-06-13,32.99
2018-06-14,41.65
2018-06-15,42.54
2018-06-18,43.82
2018-06-19,43.33
2018-06-20,44.21
2018-06-21,43.6
2018-06-22,43.18
2018-06-25,41.75
2018-06-26,41.98
2018-06-27,40.42
2018-06-28,42.24
2018-06-29,42.19
2018-07-02,42.78
2018-07-03,42.58
2018-07-05,43.86
2018-07-06,44.71
2018-07-09,44.51
2018-07-10,43.79
2018-07-11,43.39
2018-07-12,43.24
2018-07-13,43
2018-07-16,42.91
2018-07-17,44.25
2018-07-18,44.44
2018-07-19,43.23
2018-07-20,43.8
2018-07-23,43.23
2018-07-24,41.77
2018-07-25,42.98
2018-07-26,42.61
2018-07-27,41.97
2018-07-30,40.23
2018-07-31,40.86
2018-08-01,41.2
2018-08-02,42.4
2018-08-03,41.54
2018-08-06,42.43
2018-08-07,43.84
2018-08-08,43.12
2018-08-09,43.73
2018-08-10,46.06
2018-08-13,45.19
2018-08-14,46.14
2018-08-15,44.86
2018-08-16,45.63
2018-08-17,46.53
2018-08-20,46.9
2018-08-21,47.57
2018-08-22,47.84
2018-08-23,48.81
2018-08-24,49.04
2018-08-27,48.14
2018-08-28,47.88
2018-08-29,47.76
2018-08-30,48.31
2018-08-31,48.69
2018-09-04,50.66
2018-09-05,47.39
2018-09-06,46.12
2018-09-07,47.14
2018-09-10,47.19
2018-09-11,49.4
2018-09-12,49.17
2018-09-13,50.55
2018-09-14,52.85
2018-09-17,50.1
2018-09-18,51.63
2018-09-19,50.16
2018-09-20,48.75
2018-09-21,47.54
2018-09-24,49.2
2018-09-25,50.44
2018-09-26,50.9
2018-09-27,52.01
2018-09-28,51.38
2018-10-01,49.96
2018-10-02,47.52
2018-10-03,48.14
2018-10-04,46.02
2018-10-05,44.4
2018-10-08,42.99
2018-10-09,42.25
2018-10-10,39.98
2018-10-11,38.99
2018-10-12,41.55
2018-10-15,41.15
2018-10-16,43.41
2018-10-17,43.17
2018-10-18,43.25
2018-10-19,41.49
2018-10-22,43.69
2018-10-23,42.67
2018-10-24,41.81
2018-10-25,43.5
2018-10-26,40.87
2018-10-29,38.97
2018-10-30,41.39
2018-10-31,42.52
2018-11-01,43.46
2018-11-02,42.84
2018-11-05,42.13
2018-11-06,40.43
2018-11-07,50.01
2018-11-08,54.1
2018-11-09,52.01
2018-11-12,50.71
2018-11-13,47.35
2018-11-14,47.71
2018-11-15,48.72
2018-11-16,47.26
2018-11-19,45.45
2018-11-20,43.21
2018-11-21,44.02
2018-11-23,45.27
2018-11-26,48.23
2018-11-27,48.58
2018-11-28,51.38
2018-11-29,52.8
2018-11-30,54.04
2018-12-03,56.61
2018-12-04,54.87
2018-12-06,55.5
2018-12-07,53.92
2018-12-10,55.34
2018-12-11,55.28
2018-12-12,57.43
2018-12-13,55.05
2018-12-14,54.34
2018-12-17,51.17
2018-12-18,51.85
2018-12-19,50.06
2018-12-20,48.26
2018-12-21,43.68
2018-12-24,43.12
2018-12-26,46.9
2018-12-27,47.35
2018-12-28,47.29
2018-12-31,47.57
2019-01-02,47
2019-01-03,46.03
2019-01-04,49.7
2019-01-07,51.57
2019-01-08,53.88
2019-01-09,52.77
2019-01-10,51.34
2019-01-11,52.07
2019-01-14,52.04
2019-01-15,54.33
2019-01-16,54.53
2019-01-17,54.59
2019-01-18,55.83
2019-01-22,53.54
2019-01-23,53.83
2019-01-24,54.34
2019-01-25,55
2019-01-28,54.92
2019-01-29,53.52
2019-01-30,54.19
2019-01-31,54.65
2019-02-01,54.38
2019-02-04,54.74
2019-02-05,55.44
2019-02-06,52.59
2019-02-07,51.53
2019-02-08,53.15
2019-02-11,53.15
2019-02-12,55.83
2019-02-13,55.04
2019-02-14,54.06
2019-02-15,54.66
2019-02-19,55.28
2019-02-20,54.18
2019-02-21,53.03
2019-02-22,56.67
2019-02-25,59.01
2019-02-26,68.65
2019-02-27,71.74
2019-02-28,71.27
2019-03-01,72.77
2019-03-04,68.99
2019-03-05,70.61
2019-03-06,70.04
2019-03-07,67.24
2019-03-08,67.77
2019-03-11,70.66
2019-03-12,71.15
2019-03-13,70.15
2019-03-14,69.91
2019-03-15,69.89
2019-03-18,69.55
2019-03-19,68.5
2019-03-20,68.9
2019-03-21,69.44
2019-03-22,66.02
2019-03-25,67.86
2019-03-26,67.74
2019-03-27,65.51
2019-03-28,67.13
2019-03-29,67.22
2019-04-01,68.16
2019-04-02,69.73
2019-04-03,69.46
2019-04-04,68.3
2019-04-05,68.22
2019-04-08,67.65
2019-04-09,66.69
2019-04-10,68.21
2019-04-11,67.65
2019-04-12,65.38
2019-04-15,66.2
2019-04-16,66.28
2019-04-17,64.25
2019-04-18,63.4
2019-04-22,63.51
2019-04-23,65.22
2019-04-24,66.08
2019-04-25,67.85
2019-04-26,67.71
2019-04-29,69.41
2019-04-30,67.54
2019-05-01,66.79
2019-05-02,68.07
2019-05-03,69.65
2019-05-06,69.03
2019-05-07,66.97
2019-05-08,68.08
2019-05-09,60.76
2019-05-10,61.8
2019-05-13,57.23
2019-05-14,58.82
2019-05-15,61.89
2019-05-16,63.65
2019-05-17,62.78
2019-05-20,63.12
2019-05-21,65.21
2019-05-22,64.01
2019-05-23,63.32
2019-05-24,64.71
2019-05-28,65.03
2019-05-29,62.13
2019-05-30,62.95
2019-05-31,62.31
2019-06-03,61.07
2019-06-04,61.25
2019-06-05,61.49
2019-06-06,61.96
2019-06-07,63.89
2019-06-10,65.31
2019-06-11,67.18
2019-06-12,69.17
2019-06-13,70.17
2019-06-14,68.16
2019-06-17,68.5
2019-06-18,66.545
2019-06-19,68.045
2019-06-20,68.68
2019-06-21,66.285
2019-06-24,63.995
2019-06-25,61.9
2019-06-26,60.49
2019-06-27,62.15
2019-06-28,61.48
2019-07-01,62.26
2019-07-02,62.415
2019-07-03,64.28
2019-07-04,64.28
2019-07-05,63.615
2019-07-08,64.295
2019-07-09,66.69
2019-07-10,66.525
2019-07-11,64.75
2019-07-12,65.08
2019-07-15,65.43
2019-07-16,64.24
2019-07-17,63.385
2019-07-18,65.24
2019-07-19,65.95
2019-07-22,68.565
2019-07-23,67.73
2019-07-24,67.97
2019-07-25,68.78
2019-07-26,70.7
2019-07-29,69.095
2019-07-30,67.91
2019-07-31,66.99
2019-08-01,68.11
2019-08-02,60.005
2019-08-05,53.945
2019-08-06,55.275
2019-08-07,56.155
2019-08-08,57.93
2019-08-09,56.46
2019-08-12,55
2019-08-13,55.7
2019-08-14,52.93
2019-08-15,51.785
2019-08-16,52.71
2019-08-19,52.425
2019-08-20,52.85
2019-08-21,54.245
2019-08-22,55.485
2019-08-23,53.99
2019-08-26,53.4
2019-08-27,53.32
2019-08-28,54.385
2019-08-29,54.43
2019-08-30,52.86
2019-09-02,52.81
2019-09-03,50.4
2019-09-04,50.05
2019-09-05,50.16
2019-09-06,47.82
2019-09-09,50.46
2019-09-10,50.52
2019-09-11,52.665
2019-09-12,54.91
2019-09-13,56.885
2019-09-16,57.925
2019-09-17,59.83
2019-09-18,59.49
2019-09-19,59.145
2019-09-20,60.555
2019-09-23,60.61
2019-09-24,56.98
2019-09-25,55.105
2019-09-26,54.72
2019-09-27,54.885
2019-09-30,56.545
2019-10-01,55.27
2019-10-02,53.9
2019-10-03,55.7
2019-10-04,56.45
2019-10-07,55.855
2019-10-08,55.13
2019-10-09,57.19
2019-10-10,57.74
2019-10-11,59.305
2019-10-14,59.06
2019-10-15,60.58
2019-10-16,58.31
2019-10-17,60.38
2019-10-18,57.745
2019-10-21,58.02
2019-10-22,56.83
2019-10-23,56.68
2019-10-24,57.625
2019-10-25,58.555
2019-10-28,57.22
2019-10-29,54.435
2019-10-30,53.1
2019-10-31,44.26
2019-11-01,45.7
2019-11-04,44.74
2019-11-05,43.18
2019-11-06,42.56
2019-11-07,41.815
2019-11-08,41.97
2019-11-11,40.83
2019-11-12,40.86
2019-11-13,40.71
2019-11-14,41.82
2019-11-15,41.98
2019-11-18,42.005
2019-11-19,40.92
2019-11-20,40.52
2019-11-21,41.465
2019-11-22,41.845
2019-11-25,42.765
