date,close
2014-06-13,23.6858
2014-06-16,23.5753
2014-06-17,23.5201
2014-06-18,23.7726
2014-06-19,23.8989
2014-06-20,24.1594
2014-06-23,23.9463
2014-06-24,24.1041
2014-06-25,24.0568
2014-06-26,24.0328
2014-06-27,24.2089
2014-06-30,24.2009
2014-07-01,24.4811
2014-07-02,24.377
2014-07-03,24.433
2014-07-07,24.313
2014-07-08,24.2169
2014-07-09,24.1528
2014-07-10,24.1929
2014-07-11,24.2809
2014-07-14,24.6732
2014-07-15,24.5771
2014-07-16,24.4971
2014-07-17,24.1929
2014-07-18,24.5691
2014-07-21,24.449
2014-07-22,24.5531
2014-07-23,24.5451
2014-07-24,24.2569
2014-07-25,23.9367
2014-07-28,23.9367
2014-07-29,23.6165
2014-07-30,23.5684
2014-07-31,23.4403
2014-08-01,23.2322
2014-08-04,23.4804
2014-08-05,23.4403
2014-08-06,23.7686
2014-08-07,23.5204
2014-08-08,23.5444
2014-08-11,23.6885
2014-08-12,23.4964
2014-08-13,23.9047
2014-08-14,23.8406
2014-08-15,23.9687
2014-08-18,24.2169
2014-08-19,24.2329
2014-08-20,24.1288
2014-08-21,24.0888
2014-08-22,23.8887
2014-08-25,23.6405
2014-08-26,23.7446
2014-08-27,23.6965
2014-08-28,23.4964
2014-08-29,23.6405
2014-09-02,23.7205
2014-09-03,23.8166
2014-09-04,23.4964
2014-09-05,23.8166
2014-09-08,23.4884
2014-09-09,23.3123
2014-09-10,23.1521
2014-09-11,23.2482
2014-09-12,22.7198
2014-09-15,22.4316
2014-09-16,22.5917
2014-09-17,22.5837
2014-09-18,22.4637
2014-09-19,22.6318
2014-09-22,22.5998
2014-09-23,22.1594
2014-09-24,22.1354
2014-09-25,22.1675
2014-09-26,22.4358
2014-09-29,22.3382
2014-09-30,22.265
2014-10-01,22.078
2014-10-02,22.0943
2014-10-03,22.0292
2014-10-06,22.4358
2014-10-07,22.3626
2014-10-08,22.7042
2014-10-09,22.7367
2014-10-10,23.1758
2014-10-13,23.4279
2014-10-14,23.8101
2014-10-15,23.8426
2014-10-16,23.7532
2014-10-17,23.4116
2014-10-20,23.8589
2014-10-21,23.802
2014-10-22,23.9321
2014-10-23,24.0784
2014-10-24,24.0134
2014-10-27,24.0866
2014-10-28,24.1923
2014-10-29,23.8995
2014-10-30,24.8428
2014-10-31,24.8916
2014-11-03,25.5178
2014-11-04,25.2738
2014-11-05,25.1844
2014-11-06,24.9892
2014-11-07,24.8835
2014-11-10,25.1518
2014-11-11,24.8916
2014-11-12,24.916
2014-11-13,24.8428
2014-11-14,24.6395
2014-11-17,24.7534
2014-11-18,24.8591
2014-11-19,24.5907
2014-11-20,24.6883
2014-11-21,24.5501
2014-11-24,24.7127
2014-11-25,24.7046
2014-11-26,24.9729
2014-11-28,25.0543
2014-12-01,24.8835
2014-12-02,25.1193
2014-12-03,25.1356
2014-12-04,24.6802
2014-12-05,24.7371
2014-12-08,25.1193
2014-12-09,25.347
2014-12-10,25.3714
2014-12-11,25.5178
2014-12-12,25.1518
2014-12-15,24.6233
2014-12-16,24.8022
2014-12-17,25.2169
2014-12-18,25.5178
2014-12-19,25.658
2014-12-22,25.8643
2014-12-23,25.7488
2014-12-24,25.8065
2014-12-26,25.9385
2014-12-29,26.0953
2014-12-30,26.0788
2014-12-31,25.6498
2015-01-02,25.955
2015-01-05,26.252
2015-01-06,26.417
2015-01-07,26.7223
2015-01-08,26.813
2015-01-09,26.6233
2015-01-12,26.4748
2015-01-13,26.549
2015-01-14,27.0688
2015-01-15,27.3411
2015-01-16,27.8361
2015-01-20,27.6628
2015-01-21,27.8691
2015-01-22,28.9333
2015-01-23,29.2468
2015-01-26,29.0571
2015-01-27,29.0901
2015-01-28,28.9746
2015-01-29,29.1643
2015-01-30,28.5786
2015-02-02,28.1578
2015-02-03,28.3311
2015-02-04,28.3806
2015-02-05,28.7023
2015-02-06,27.8608
2015-02-09,27.5061
2015-02-10,27.3411
2015-02-11,27.3328
2015-02-12,27.4731
2015-02-13,27.5226
2015-02-17,27.3081
2015-02-18,27.3906
2015-02-19,26.9038
2015-02-20,26.9533
2015-02-23,27.3411
2015-02-24,26.9863
2015-02-25,27.0276
2015-02-26,26.7305
2015-02-27,27.0853
2015-03-02,27.2503
2015-03-03,27.4318
2015-03-04,27.0606
2015-03-05,27.2751
2015-03-06,26.12
2015-03-09,26.252
2015-03-10,26.2685
2015-03-11,26.3098
2015-03-12,26.9698
2015-03-13,26.8213
2015-03-16,26.9368
2015-03-17,26.9038
2015-03-18,27.5803
2015-03-19,27.6381
2015-03-20,28.1908
2015-03-23,28.2733
2015-03-24,28.4301
2015-03-25,27.3988
2015-03-26,27.2256
2015-03-27,27.2674
2015-03-30,27.6605
2015-03-31,27.5768
2015-04-01,27.7023
2015-04-02,27.7943
2015-04-06,27.903
2015-04-07,27.1001
2015-04-08,27.351
2015-04-09,26.6986
2015-04-10,27.3092
2015-04-13,27.1335
2015-04-14,27.0917
2015-04-15,26.8575
2015-04-16,26.9328
2015-04-17,26.64
2015-04-20,26.6651
2015-04-21,26.6735
2015-04-22,26.615
2015-04-23,26.5982
2015-04-24,26.4728
2015-04-27,26.615
2015-04-28,26.6568
2015-04-29,26.1884
2015-04-30,25.7451
2015-05-01,25.9876
2015-05-04,26.0378
2015-05-05,25.536
2015-05-06,25.4942
2015-05-07,25.7367
2015-05-08,25.9375
2015-05-11,25.6447
2015-05-12,25.7869
2015-05-13,25.5025
2015-05-14,25.9458
2015-05-15,26.0546
2015-05-18,25.9793
2015-05-19,25.9542
2015-05-20,25.904
2015-05-21,25.6614
2015-05-22,25.6363
2015-05-26,25.4523
2015-05-27,25.6363
2015-05-28,25.6029
2015-05-29,25.352
2015-06-01,25.5527
2015-06-02,25.5025
2015-06-03,25.2683
2015-06-04,25.2934
2015-06-05,25.1345
2015-06-08,25.0508
2015-06-09,24.8585
2015-06-10,24.9839
2015-06-11,25.1178
2015-06-12,25.0592
2015-06-15,24.8417
2015-06-16,25.0676
2015-06-17,25.193
2015-06-18,25.4858
2015-06-19,25.4691
2015-06-22,25.3771
2015-06-23,25.1345
2015-06-24,25.0174
2015-06-25,24.7414
2015-06-26,25.077
2015-06-29,24.8986
2015-06-30,24.7881
2015-07-01,25.145
2015-07-02,25.1535
2015-07-06,25.298
2015-07-07,25.5954
2015-07-08,25.6209
2015-07-09,25.6209
2015-07-10,25.9268
2015-07-13,25.9948
2015-07-14,26.0713
2015-07-15,26.2412
2015-07-16,26.4367
2015-07-17,26.4452
2015-07-20,26.2582
2015-07-21,26.2327
2015-07-22,26.3687
2015-07-23,25.8418
2015-07-24,25.8248
2015-07-27,25.7993
2015-07-28,25.7908
2015-07-29,26.0033
2015-07-30,25.9608
2015-07-31,26.3347
2015-08-03,26.4367
2015-08-04,26.1393
2015-08-05,25.9353
2015-08-06,25.9183
2015-08-07,25.9183
2015-08-10,25.7993
2015-08-11,25.9863
2015-08-12,25.9098
2015-08-13,25.7908
2015-08-14,25.7654
2015-08-17,25.9608
2015-08-18,25.9353
2015-08-19,25.7654
2015-08-20,25.5359
2015-08-21,25.179
2015-08-24,24.0998
2015-08-25,23.7259
2015-08-26,24.2188
2015-08-27,24.4822
2015-08-28,24.4737
2015-08-31,24.1763
2015-09-01,23.6749
2015-09-02,23.9043
2015-09-03,23.9723
2015-09-04,23.7599
2015-09-08,23.8873
2015-09-09,23.6239
2015-09-10,23.7599
2015-09-11,24.2697
2015-09-14,24.3717
2015-09-15,24.5417
2015-09-16,24.7286
2015-09-17,25.094
2015-09-18,24.9581
2015-09-21,25.3745
2015-09-22,25.247
2015-09-23,25.6804
2015-09-24,25.5784
2015-09-25,25.7059
2015-09-28,25.3736
2015-09-29,25.6239
2015-09-30,25.762
2015-10-01,25.7188
2015-10-02,25.7274
2015-10-05,26.1245
2015-10-06,26.0554
2015-10-07,26.4351
2015-10-08,26.6595
2015-10-09,26.4783
2015-10-12,26.7372
2015-10-13,26.556
2015-10-14,26.323
2015-10-15,26.7372
2015-10-16,26.5387
2015-10-19,27.022
2015-10-20,26.9443
2015-10-21,27.186
2015-10-22,27.8419
2015-10-23,27.8333
2015-10-26,27.8937
2015-10-27,28.446
2015-10-28,28.6532
2015-10-29,28.2648
2015-10-30,27.9455
2015-11-02,28.4892
2015-11-03,28.4719
2015-11-04,28.4547
2015-11-05,28.6532
2015-11-06,28.2217
2015-11-09,27.747
2015-11-10,28.2217
2015-11-11,28.1612
2015-11-12,27.9886
2015-11-13,27.8764
2015-11-16,28.2562
2015-11-17,28.2562
2015-11-18,28.3166
2015-11-19,28.3339
2015-11-20,28.6187
2015-11-23,28.5755
2015-11-24,28.7309
2015-11-25,28.7826
2015-11-27,29.0674
2015-11-30,28.9466
2015-12-01,29.1969
2015-12-02,28.8776
2015-12-03,28.4547
2015-12-04,28.7999
2015-12-07,28.8948
2015-12-08,28.1699
2015-12-09,28.4202
2015-12-10,28.2907
2015-12-11,28.4202
2015-12-14,28.144
2015-12-15,28.5841
2015-12-16,29.3091
2015-12-17,29.404
2015-12-18,28.7347
2015-12-21,29.1984
2015-12-22,29.2159
2015-12-23,29.4346
2015-12-24,29.4696
2015-12-28,29.7671
2015-12-29,30.1609
2015-12-30,29.9946
2015-12-31,29.7409
2016-01-04,29.1634
2016-01-05,29.8984
2016-01-06,30.0646
2016-01-07,29.5134
2016-01-08,28.7784
2016-01-11,28.9972
2016-01-12,28.8222
2016-01-13,28.4284
2016-01-14,28.6997
2016-01-15,28.4634
2016-01-19,28.9622
2016-01-20,29.0234
2016-01-21,28.9097
2016-01-22,30.1609
2016-01-25,30.1696
2016-01-26,30.6509
2016-01-27,30.4146
2016-01-28,30.9134
2016-01-29,32.3046
2016-02-01,32.5059
2016-02-02,32.6984
2016-02-03,33.0309
2016-02-04,32.9959
2016-02-05,32.2784
2016-02-08,31.8409
2016-02-09,31.6134
2016-02-10,31.5609
2016-02-11,31.9371
2016-02-12,32.0859
2016-02-16,32.5759
2016-02-17,32.3484
2016-02-18,32.7159
2016-02-19,32.7071
2016-02-22,32.6634
2016-02-23,32.6634
2016-02-24,32.5934
2016-02-25,32.7421
2016-02-26,32.3834
2016-02-29,32.4184
2016-03-01,32.8734
2016-03-02,32.9959
2016-03-03,32.9171
2016-03-04,31.8234
2016-03-07,32.0509
2016-03-08,32.3834
2016-03-09,32.6809
2016-03-10,32.4884
2016-03-11,33.0134
2016-03-14,32.8646
2016-03-15,33.1184
2016-03-16,33.4683
2016-03-17,33.8796
2016-03-18,33.7221
2016-03-21,33.5733
2016-03-22,33.2496
2016-03-23,33.2059
2016-03-24,33.8621
2016-03-28,33.6834
2016-03-29,34.5559
2016-03-30,34.3345
2016-03-31,34.0776
2016-04-01,34.0953
2016-04-04,34.0953
2016-04-05,34.1839
2016-04-06,34.0333
2016-04-07,33.8916
2016-04-08,34.2725
2016-04-11,34.2193
2016-04-12,34.3965
2016-04-13,34.6622
2016-04-14,34.7419
2016-04-15,35.0431
2016-04-18,35.2823
2016-04-19,35.4772
2016-04-20,34.6711
2016-04-21,34.4762
2016-04-22,34.8837
2016-04-25,35.1937
2016-04-26,35.9644
2016-04-27,35.4417
2016-04-28,35.1849
2016-04-29,34.3522
2016-05-02,34.9723
2016-05-03,35.5215
2016-05-04,36.7262
2016-05-05,37.9841
2016-05-06,38.1524
2016-05-09,38.4004
2016-05-10,38.1967
2016-05-11,37.4703
2016-05-12,37.8069
2016-05-13,37.8246
2016-05-16,38.2144
2016-05-17,37.2754
2016-05-18,36.5845
2016-05-19,36.1593
2016-05-20,36.5579
2016-05-23,37.0274
2016-05-24,37.1602
2016-05-25,37.0274
2016-05-26,37.2488
2016-05-27,37.4614
2016-05-31,37.7095
2016-06-01,37.9132
2016-06-02,37.8689
2016-06-03,38.4978
2016-06-06,38.3384
2016-06-07,38.7104
2016-06-08,39.0648
2016-06-09,39.4634
2016-06-10,39.1888
2016-06-13,39.2242
2016-06-14,39.4191
2016-06-15,39.862
2016-06-16,39.9417
2016-06-17,39.5342
2016-06-20,39.6051
2016-06-21,40.1012
2016-06-22,40.048
2016-06-23,39.8266
2016-06-24,40.3138
2016-06-27,41.3635
2016-06-28,41.9811
2016-06-29,42.7241
2016-06-30,43.1806
2016-07-01,43.5923
2016-07-05,44.1384
2016-07-06,43.7445
2016-07-07,43.6998
2016-07-08,44.0757
2016-07-11,44.577
2016-07-12,44.3353
2016-07-13,44.6486
2016-07-14,44.022
2016-07-15,43.9325
2016-07-18,44.1563
2016-07-19,44.3711
2016-07-20,44.1026
2016-07-21,44.1026
2016-07-22,44.6665
2016-07-25,44.7381
2016-07-26,44.1384
2016-07-27,44.2279
2016-07-28,44.9708
2016-07-29,45.4005
2016-08-01,45.4721
2016-08-02,44.9619
2016-08-03,44.1831
2016-08-04,44.0757
2016-08-05,44.0667
2016-08-08,43.476
2016-08-09,43.834
2016-08-10,43.9056
2016-08-11,43.1716
2016-08-12,43.3417
2016-08-15,43.1358
2016-08-16,42.8136
2016-08-17,42.9031
2016-08-18,43.3686
2016-08-19,42.7778
2016-08-22,43.1537
2016-08-23,43.1806
2016-08-24,42.7778
2016-08-25,43.0105
2016-08-26,42.4287
2016-08-29,42.9031
2016-08-30,42.8852
2016-08-31,42.9568
2016-09-01,42.6793
2016-09-02,43.279
2016-09-06,43.4939
2016-09-07,43.7624
2016-09-08,43.4849
2016-09-09,42.1243
2016-09-12,42.7867
2016-09-13,41.1934
2016-09-14,41.2292
2016-09-15,41.274
2016-09-16,41.5425
2016-09-19,42.3213
2016-09-20,42.6883
2016-09-21,43.1179
2016-09-22,44.1115
2016-09-23,44.4337
2016-09-26,45.0424
2016-09-27,44.9887
2016-09-28,45.4315
2016-09-29,44.8893
2016-09-30,44.6814
2016-10-03,43.7325
2016-10-04,42.7926
2016-10-05,41.0664
2016-10-06,41.2291
2016-10-07,41.3285
2016-10-10,41.8437
2016-10-11,41.7985
2016-10-12,42.404
2016-10-13,42.5667
2016-10-14,42.3136
2016-10-17,42.8287
2016-10-18,43.0095
2016-10-19,43.3348
2016-10-20,43.5246
2016-10-21,43.3439
2016-10-24,43.5879
2016-10-25,43.8771
2016-10-26,44.5097
2016-10-27,42.8378
2016-10-28,42.6028
2016-10-31,43.6963
2016-11-01,42.3407
2016-11-02,41.7985
2016-11-03,41.6358
2016-11-04,41.455
2016-11-07,42.3949
2016-11-08,42.5305
2016-11-09,41.3376
2016-11-10,38.3552
2016-11-11,39.0601
2016-11-14,38.4456
2016-11-15,38.5902
2016-11-16,39.0059
2016-11-17,38.8703
2016-11-18,39.3945
2016-11-21,39.042
2016-11-22,40.0452
2016-11-23,39.9367
2016-11-25,40.2621
2016-11-28,40.6417
2016-11-29,41.0935
2016-11-30,40.5694
2016-12-01,39.756
2016-12-02,40.3434
2016-12-05,40.0723
2016-12-06,40.3344
2016-12-07,40.9218
2016-12-08,40.5694
2016-12-09,41.202
2016-12-12,41.3737
2016-12-13,41.3195
2016-12-14,39.756
2016-12-15,39.1324
2016-12-16,40.3254
2016-12-19,41.6268
2016-12-20,41.5816
2016-12-21,40.9284
2016-12-22,40.8005
2016-12-23,40.8918
2016-12-27,40.7548
2016-12-28,40.1427
2016-12-29,41.1933
2016-12-30,42.0704
2017-01-03,42.2165
2017-01-04,43.1666
2017-01-05,43.0022
2017-01-06,42.3992
2017-01-09,41.9607
2017-01-10,41.7597
2017-01-11,41.8511
2017-01-12,41.9425
2017-01-13,41.8328
2017-01-17,42.1434
2017-01-18,42.1983
2017-01-19,41.3212
2017-01-20,42.0155
2017-01-23,42.655
2017-01-24,42.8743
2017-01-25,42.5546
2017-01-26,42.5728
2017-01-27,42.2896
2017-01-30,42.3262
2017-01-31,42.8469
2017-02-01,42.3079
2017-02-02,42.655
2017-02-03,42.8195
2017-02-06,42.8195
2017-02-07,42.6916
2017-02-08,43.0113
2017-02-09,43.4133
2017-02-10,43.8975
2017-02-13,43.998
2017-02-14,43.6234
2017-02-15,43.7331
2017-02-16,43.9432
2017-02-17,44.4731
2017-02-21,45.2405
2017-02-22,44.6832
2017-02-23,44.4183
2017-02-24,46.355
2017-02-27,45.7521
2017-02-28,45.341
2017-03-01,44.8933
2017-03-02,44.4731
2017-03-03,44.6192
2017-03-06,44.1259
2017-03-07,43.9706
2017-03-08,42.6916
2017-03-09,42.2439
2017-03-10,42.3992
2017-03-13,42.6733
2017-03-14,42.6459
2017-03-15,43.4955
2017-03-16,43.6234
2017-03-17,44.0528
2017-03-20,43.9706
2017-03-21,43.7239
2017-03-22,43.2215
2017-03-23,43.8518
2017-03-24,43.9797
2017-03-27,43.6417
2017-03-28,43.6874
2017-03-29,43.9689
2017-03-30,44.1813
2017-03-31,44.2736
2017-04-03,44.1443
2017-04-04,44.4028
2017-04-05,44.1074
2017-04-06,44.7628
2017-04-07,44.8921
2017-04-10,45.1413
2017-04-11,45.9444
2017-04-12,45.9537
2017-04-13,46.2675
2017-04-17,46.7383
2017-04-18,46.7845
2017-04-19,47.0245
2017-04-20,47.1722
2017-04-21,47.1537
2017-04-24,46.1752
2017-04-25,46.5168
2017-04-26,46.1568
2017-04-27,45.7137
2017-04-28,44.7536
2017-05-01,44.7167
2017-05-02,44.7259
2017-05-03,43.8951
2017-05-04,41.7626
2017-05-05,42.4827
2017-05-08,42.4642
2017-05-09,42.3165
2017-05-10,42.4181
2017-05-11,41.7072
2017-05-12,41.698
2017-05-15,41.8642
2017-05-16,41.3842
2017-05-17,41.7626
2017-05-18,41.7996
2017-05-19,41.6334
2017-05-22,41.9288
2017-05-23,42.335
2017-05-24,42.2796
2017-05-25,42.5381
2017-05-26,42.4735
2017-05-30,42.1134
2017-05-31,42.0303
2017-06-01,42.8519
2017-06-02,43.055
2017-06-05,42.9719
2017-06-06,42.9073
2017-06-07,43.2673
2017-06-08,43.2581
2017-06-09,43.8582
2017-06-12,43.9966
2017-06-13,44.1166
2017-06-14,44.6336
2017-06-15,44.4951
2017-06-16,44.3843
2017-06-19,44.1813
2017-06-20,44.1628
2017-06-21,43.9043
2017-06-22,43.5166
2017-06-23,43.6089
2017-06-26,43.7289
2017-06-27,43.7197
2017-06-28,43.8083
2017-06-29,43.0152
2017-06-30,42.8006
2017-07-03,42.6886
2017-07-05,42.5673
2017-07-06,42.7166
2017-07-07,43.1738
2017-07-10,42.5673
2017-07-11,42.614
2017-07-12,43.5844
2017-07-13,43.0619
2017-07-14,43.743
2017-07-17,43.9949
2017-07-18,44.2282
2017-07-19,44.2842
2017-07-20,44.0883
2017-07-21,44.0883
2017-07-24,43.8363
2017-07-25,44.5828
2017-07-26,45.6652
2017-07-27,45.7585
2017-07-28,45.8798
2017-07-31,45.8798
2017-08-01,45.7305
2017-08-02,45.7305
2017-08-03,46.253
2017-08-04,46.3463
2017-08-07,46.1037
2017-08-08,46.2717
2017-08-09,46.0291
2017-08-10,45.8704
2017-08-11,45.2639
2017-08-14,45.9358
2017-08-15,45.5532
2017-08-16,45.7491
2017-08-17,45.5345
2017-08-18,45.5625
2017-08-21,46.337
2017-08-22,46.0944
2017-08-23,46.309
2017-08-24,46.1037
2017-08-25,46.0757
2017-08-28,45.6745
2017-08-29,45.7585
2017-08-30,45.7025
2017-08-31,46.7662
2017-09-01,46.8968
2017-09-05,46.8782
2017-09-06,46.7755
2017-09-07,47.1021
2017-09-08,47.1208
2017-09-11,47.2048
2017-09-12,46.8502
2017-09-13,46.7942
2017-09-14,47.4847
2017-09-15,47.606
2017-09-18,47.5313
2017-09-19,47.3727
2017-09-20,46.8688
2017-09-21,46.7196
2017-09-22,46.393
2017-09-25,46.6076
2017-09-26,46.4396
2017-09-27,46.0011
2017-09-28,46.5526
2017-09-29,46.2697
2017-10-02,46.8542
2017-10-03,46.7882
2017-10-04,46.5714
2017-10-05,46.496
2017-10-06,46.2132
2017-10-09,46.5149
2017-10-10,46.7223
2017-10-11,46.5714
2017-10-12,46.5714
2017-10-13,46.9014
2017-10-16,47.0616
2017-10-17,47.3162
2017-10-18,47.467
2017-10-19,47.401
2017-10-20,46.6845
2017-10-23,46.2509
2017-10-24,46.3452
2017-10-25,45.2233
2017-10-26,44.422
2017-10-27,44.4974
2017-10-30,44.5539
2017-10-31,44.5822
2017-11-01,44.8556
2017-11-02,45.4118
2017-11-03,45.261
2017-11-06,45.4213
2017-11-07,45.9304
2017-11-08,46.2132
2017-11-09,46.1
2017-11-10,45.8832
2017-11-13,46.6468
2017-11-14,46.562
2017-11-15,46.2132
2017-11-16,46.7034
2017-11-17,46.7505
2017-11-20,46.6845
2017-11-21,46.8354
2017-11-22,46.9956
2017-11-24,47.3162
2017-11-27,46.7882
2017-11-28,46.694
2017-11-29,46.5808
2017-11-30,46.6091
2017-12-01,46.6563
2017-12-04,46.4017
2017-12-05,45.9963
2017-12-06,46.0718
2017-12-07,46.6091
2017-12-08,46.8448
2017-12-11,46.8448
2017-12-12,47.3162
2017-12-13,48.2495
2017-12-14,48.3343
2017-12-15,48.7303
2017-12-18,49.673
2017-12-19,49.5207
2017-12-20,48.8351
2017-12-21,48.2639
2017-12-22,48.302
2017-12-26,48.5209
2017-12-27,48.7685
2017-12-28,49.0161
2017-12-29,48.978
2018-01-02,48.9684
2018-01-03,48.8828
2018-01-04,48.0925
2018-01-05,48.1496
2018-01-08,48.1115
2018-01-09,47.7497
2018-01-10,47.3689
2018-01-11,47.207
2018-01-12,46.6262
2018-01-16,46.5595
2018-01-17,46.9404
2018-01-18,46.9214
2018-01-19,47.3498
2018-01-22,47.4355
2018-01-23,48.1877
2018-01-24,47.5688
2018-01-25,47.3213
2018-01-26,46.8357
2018-01-29,45.893
2018-01-30,45.5788
2018-01-31,45.8359
2018-02-01,45.3313
2018-02-02,45.1789
2018-02-05,43.6936
2018-02-06,43.2937
2018-02-07,43.2556
2018-02-08,42.1511
2018-02-09,43.1223
2018-02-12,43.1604
2018-02-13,43.2747
2018-02-14,42.6082
2018-02-15,43.3794
2018-02-16,44.3315
2018-02-20,43.6365
2018-02-21,42.9033
2018-02-22,43.7222
2018-02-23,45.4455
2018-02-26,45.2742
2018-02-27,44.8838
2018-02-28,44.8457
2018-03-01,44.979
2018-03-02,45.9121
2018-03-05,45.417
2018-03-06,46.3977
2018-03-07,46.9309
2018-03-08,46.5405
2018-03-09,46.6548
2018-03-12,47.1118
2018-03-13,46.8928
2018-03-14,45.6645
2018-03-15,45.6264
2018-03-16,45.6931
2018-03-19,45.3598
2018-03-20,45.1694
2018-03-21,44.8647
2018-03-22,45.2646
2018-03-23,44.2744
2018-03-26,44.7695
2018-03-27,45.1409
2018-03-28,46.402
2018-03-29,46.2479
2018-04-02,45.8725
2018-04-03,46.9411
2018-04-04,47.4321
2018-04-05,47.3454
2018-04-06,47.6535
2018-04-09,47.4321
2018-04-10,47.3454
2018-04-11,47.0759
2018-04-12,46.0939
2018-04-13,46.6234
2018-04-16,47.1048
2018-04-17,47.8075
2018-04-18,47.8268
2018-04-19,47.1048
2018-04-20,46.2961
2018-04-23,45.9399
2018-04-24,46.1324
2018-04-25,46.0073
2018-04-26,46.7293
2018-04-27,47.6246
2018-04-30,47.0566
2018-05-01,47.4802
2018-05-02,47.1336
2018-05-03,47.1721
2018-05-04,47.8653
2018-05-07,48.3466
2018-05-08,48.3851
2018-05-09,48.9724
2018-05-10,49.2131
2018-05-11,49.2804
2018-05-14,48.7317
2018-05-15,48.0674
2018-05-16,48.1348
2018-05-17,47.769
2018-05-18,47.9423
2018-05-21,48.4718
2018-05-22,48.4622
2018-05-23,49.6559
2018-05-24,49.5115
2018-05-25,50.0699
2018-05-29,51.0711
2018-05-30,51.1384
2018-05-31,50.9652
2018-06-01,50.3779
2018-06-04,50.9363
2018-06-05,51.1673
2018-06-06,51.2636
2018-06-07,51.3502
2018-06-08,51.331
2018-06-11,51.3888
2018-06-12,51.8701
2018-06-13,51.2058
2018-06-14,51.8027
2018-06-15,51.8797
2018-06-18,51.408
2018-06-19,51.4465
2018-06-20,51.7353
2018-06-21,51.6679
2018-06-22,51.7257
2018-06-25,51.6679
2018-06-26,51.8701
2018-06-27,51.7257
2018-06-28,51.3561
2018-06-29,51.3172
2018-07-02,51.4048
2018-07-03,51.9299
2018-07-05,52.3675
2018-07-06,52.7565
2018-07-09,52.2605
2018-07-10,52.2508
2018-07-11,52.6009
2018-07-12,52.6495
2018-07-13,52.6204
2018-07-16,52.3092
2018-07-17,51.8716
2018-07-18,51.6673
2018-07-19,52.9218
2018-07-20,52.0174
2018-07-23,51.5701
2018-07-24,51.2589
2018-07-25,51.6576
2018-07-26,51.9202
2018-07-27,50.7727
2018-07-30,51.0838
2018-07-31,51.7743
2018-08-01,52.2703
2018-08-02,52.3481
2018-08-03,52.5815
2018-08-06,52.4745
2018-08-07,52.1536
2018-08-08,52.28
2018-08-09,52.7176
2018-08-10,52.2508
2018-08-13,52.1438
2018-08-14,52.9315
2018-08-15,53.1455
2018-08-16,53.9235
2018-08-17,54.3513
2018-08-20,54.5847
2018-08-21,54.7501
2018-08-22,54.682
2018-08-23,54.7792
2018-08-24,55.0613
2018-08-27,55.0126
2018-08-28,55.635
2018-08-29,55.6447
2018-08-30,55.3822
2018-08-31,55.4989
2018-09-04,55.0418
2018-09-05,52.8829
2018-09-06,53.3594
2018-09-07,53.233
2018-09-10,53.8943
2018-09-11,53.6609
2018-09-12,53.9332
2018-09-13,54.0499
2018-09-14,53.6123
2018-09-17,53.9235
2018-09-18,53.5053
2018-09-19,51.6284
2018-09-20,52.5231
2018-09-21,51.998
2018-09-24,51.2686
2018-09-25,51.4437
2018-09-26,50.5976
2018-09-27,50.9416
2018-09-28,52.1994
2018-10-01,51.5312
2018-10-02,51.4919
2018-10-03,50.7352
2018-10-04,50.4699
2018-10-05,50.7942
2018-10-08,51.8849
2018-10-09,52.3959
2018-10-10,51.9046
2018-10-11,50.6959
2018-10-12,50.5682
2018-10-15,51.0693
2018-10-16,52.5531
2018-10-17,52.8185
2018-10-18,52.956
2018-10-19,53.1034
2018-10-22,52.1994
2018-10-23,53.1427
2018-10-24,55.4815
2018-10-25,55.8647
2018-10-26,55.9532
2018-10-29,56.6509
2018-10-30,57.6335
2018-10-31,56.2775
2018-11-01,56.2283
2018-11-02,55.8254
2018-11-05,56.9948
2018-11-06,57.1029
2018-11-07,57.3584
2018-11-08,57.4075
2018-11-09,57.8989
2018-11-12,57.8104
2018-11-13,57.6729
2018-11-14,56.9555
2018-11-15,56.8572
2018-11-16,57.6729
2018-11-19,57.5058
2018-11-20,57.1815
2018-11-21,57.4665
2018-11-23,57.5648
2018-11-26,57.5451
2018-11-27,57.8399
2018-11-28,58.4197
2018-11-29,58.0561
2018-11-30,58.5376
2018-12-03,59.1763
2018-12-04,58.5179
2018-12-06,61.3087
2018-12-07,60.837
2018-12-10,60.444
2018-12-11,61.181
2018-12-12,59.5694
2018-12-13,60.1492
2018-12-14,58.8324
2018-12-17,56.9948
2018-12-18,57.948
2018-12-19,57.5648
2018-12-20,57.4209
2018-12-21,58.1649
2018-12-24,56.2205
2018-12-26,58.3931
2018-12-27,58.3534
2018-12-28,58.7701
2018-12-31,58.6511
2019-01-02,57.153
2019-01-03,58.4328
2019-01-04,58.2344
2019-01-07,58.5221
2019-01-08,59.8911
2019-01-09,59.2562
2019-01-10,60.2582
2019-01-11,60.4269
2019-01-14,60.3277
2019-01-15,60.8138
2019-01-16,61.5975
2019-01-17,61.9646
2019-01-18,61.2106
2019-01-22,61.4785
2019-01-23,60.8038
2019-01-24,61.3296
2019-01-25,62.4011
2019-01-28,63.1154
2019-01-29,63.7602
2019-01-30,64.5142
2019-01-31,65.5062
2019-02-01,64.8614
2019-02-04,65.8832
2019-02-05,65.7543
2019-02-06,65.6947
2019-02-07,65.4666
2019-02-08,66.042
2019-02-11,65.7939
2019-02-12,64.9209
2019-02-13,64.663
2019-02-14,64.6035
2019-02-15,65.1293
2019-02-19,64.286
2019-02-20,64.0082
2019-02-21,63.8693
2019-02-22,65.1392
2019-02-25,65.4666
2019-02-26,64.8912
2019-02-27,64.792
2019-02-28,65.2086
2019-03-01,64.9507
2019-03-04,65.4368
2019-03-05,65.8237
2019-03-06,65.3178
2019-03-07,65.2285
2019-03-08,65.7245
2019-03-11,66.1709
2019-03-12,66.4586
2019-03-13,65.8237
2019-03-14,65.8932
2019-03-15,65.3376
2019-03-18,65.2979
2019-03-19,65.1094
2019-03-20,65.7443
2019-03-21,67.1729
2019-03-22,67.3912
2019-03-25,68.2146
2019-03-26,69.2662
2019-03-27,69.415
2019-03-28,70.15
2019-03-29,69.34
2019-04-01,68.29
2019-04-02,67.89
2019-04-03,67.47
2019-04-04,67.66
2019-04-05,68.34
2019-04-08,67.93
2019-04-09,67.69
2019-04-10,68.89
2019-04-11,68.78
2019-04-12,68.75
2019-04-15,68.34
2019-04-16,65.83
2019-04-17,63.89
2019-04-18,65.31
2019-04-22,64.45
2019-04-23,65.49
2019-04-24,66.44
2019-04-25,66.85
2019-04-26,67.51
2019-04-29,67.17
2019-04-30,65.47
2019-05-01,65.32
2019-05-02,66
2019-05-03,66.35
2019-05-06,66.5
2019-05-07,65.02
2019-05-08,65.58
2019-05-09,66.05
2019-05-10,66.77
2019-05-13,67.06
2019-05-14,67.45
2019-05-15,67.71
2019-05-16,67.93
2019-05-17,67.83
2019-05-20,66.88
2019-05-21,67.65
2019-05-22,67.34
2019-05-23,67.75
2019-05-24,68.28
2019-05-28,67.69
2019-05-29,66.43
2019-05-30,66.32
2019-05-31,66.95
2019-06-03,66.78
2019-06-04,64.72
2019-06-05,66.93
2019-06-06,66.19
2019-06-07,66.22
2019-06-10,66.36
2019-06-11,66.44
2019-06-12,66.99
2019-06-13,67.19
2019-06-14,67.91
2019-06-17,68.17
2019-06-18,68.03
2019-06-19,68.37
2019-06-20,68.09
2019-06-21,66.695
2019-06-24,66.005
2019-06-25,66.14
2019-06-26,63.705
2019-06-27,63.6
2019-06-28,64.09
2019-07-01,63.125
2019-07-02,64.71
2019-07-03,65.57
2019-07-04,65.57
2019-07-05,65.015
2019-07-08,65.09
2019-07-09,65.885
2019-07-10,65.95
2019-07-11,65.485
2019-07-12,65.405
2019-07-15,65.48
2019-07-16,64.87
2019-07-17,64.72
2019-07-18,64.87
2019-07-19,63.15
2019-07-22,62.84
2019-07-23,66.64
2019-07-24,66.795
2019-07-25,65.945
2019-07-26,67.295
2019-07-29,67.195
2019-07-30,67.31
2019-07-31,66.945
2019-08-01,66.71
2019-08-02,67.07
2019-08-05,67.4
2019-08-06,67.935
2019-08-07,69.07
2019-08-08,70.55
2019-08-09,70.59
2019-08-12,70.76
2019-08-13,70.705
2019-08-14,70.79
2019-08-15,71.665
2019-08-16,72.42
2019-08-19,72.93
2019-08-20,72.055
2019-08-21,71.965
2019-08-22,72.03
2019-08-23,72.17
2019-08-26,73.315
2019-08-27,73.455
2019-08-28,73.72
2019-08-29,74.4
2019-08-30,74.66
2019-09-02,74.64
2019-09-03,74.78
2019-09-04,75.95
2019-09-05,74.43
2019-09-06,74.64
2019-09-09,73.155
2019-09-10,71.405
2019-09-11,72.025
2019-09-12,72.33
2019-09-13,71.29
2019-09-16,71.95
2019-09-17,72.95
2019-09-18,72.88
2019-09-19,73.045
2019-09-20,73.4
2019-09-23,73.47
2019-09-24,72.915
2019-09-25,73.24
2019-09-26,73.59
2019-09-27,72.685
2019-09-30,73.13
2019-10-01,73.41
2019-10-02,73.6
2019-10-03,74.135
2019-10-04,74.84
2019-10-07,74.605
2019-10-08,74.18
2019-10-09,74.405
2019-10-10,74.51
2019-10-11,75.035
2019-10-14,75.07
2019-10-15,74.19
2019-10-16,74.43
2019-10-17,75.18
2019-10-18,75.89
2019-10-21,77.04
2019-10-22,77.25
2019-10-23,77.605
2019-10-24,77.76
2019-10-25,77.705
2019-10-28,77.845
2019-10-29,78.35
2019-10-30,78.86
2019-10-31,78.895
2019-11-01,78.265
2019-11-04,77.27
2019-11-05,75.65
2019-11-06,75.595
2019-11-07,74.9
2019-11-08,74.635
2019-11-11,74.365
2019-11-12,73.735
2019-11-13,74.34
2019-11-14,74.47
2019-11-15,74.75
2019-11-18,74.945
2019-11-19,75.145
2019-11-20,75.35
2019-11-21,74.34
2019-11-22,73.74
2019-11-25,73.65
