date,close
2015-05-07,12.29
2015-05-08,12.95
2015-05-11,12.7
2015-05-12,12.99
2015-05-13,13.25
2015-05-14,14.9
2015-05-15,15.62
2015-05-18,15.6
2015-05-19,15.98
2015-05-20,16.68
2015-05-21,16.65
2015-05-22,17.82
2015-05-26,17.39
2015-05-27,16.91
2015-05-28,16.7
2015-05-29,17
2015-06-01,16.8
2015-06-02,17.54
2015-06-03,18.33
2015-06-04,18.99
2015-06-05,19.08
2015-06-08,18.82
2015-06-09,19.21
2015-06-10,19.49
2015-06-11,19.5
2015-06-12,19.19
2015-06-15,19.39
2015-06-16,18.87
2015-06-17,19.41
2015-06-18,19.37
2015-06-19,18.79
2015-06-22,19.14
2015-06-23,17.81
2015-06-24,18.8
2015-06-25,19.18
2015-06-26,18.53
2015-06-29,17.61
2015-06-30,17.84
2015-07-01,16.91
2015-07-02,16.98
2015-07-06,16.64
2015-07-07,17.77
2015-07-08,18.12
2015-07-09,17.19
2015-07-10,18.67
2015-07-13,18.89
2015-07-14,19.47
2015-07-15,19.3
2015-07-16,19.5
2015-07-17,19.36
2015-07-20,19.35
2015-07-21,18.73
2015-07-22,19.2
2015-07-23,19.17
2015-07-24,18.82
2015-07-27,19.19
2015-07-28,19.12
2015-07-29,19
2015-07-30,19.34
2015-07-31,20.03
2015-08-03,19.35
2015-08-04,19.18
2015-08-05,19.58
2015-08-06,18.97
2015-08-07,17.01
2015-08-10,18.12
2015-08-11,17.22
2015-08-12,17.51
2015-08-13,16.85
2015-08-14,16.76
2015-08-17,16.49
2015-08-18,15.67
2015-08-19,14.97
2015-08-20,15.29
2015-08-21,15.25
2015-08-24,14.51
2015-08-25,14.51
2015-08-26,15.09
2015-08-27,15.27
2015-08-28,15.34
2015-08-31,15.12
2015-09-01,13.01
2015-09-02,15.14
2015-09-03,15.55
2015-09-04,16.11
2015-09-08,14.82
2015-09-09,13.53
2015-09-10,13.45
2015-09-14,18.76
2015-09-15,19.03
2015-09-16,22.12
2015-09-17,23.75
2015-09-18,23.98
2015-09-21,23.02
2015-09-22,21.41
2015-09-23,21.64
2015-09-24,21.69
2015-09-25,21.28
2015-09-28,20.56
2015-09-29,19.32
2015-09-30,22.11
2015-10-01,21.28
2015-10-02,21.91
2015-10-05,21.75
2015-10-06,20.06
2015-10-07,20.01
2015-10-08,20.86
2015-10-09,20.67
2015-10-12,20.09
2015-10-13,19.04
2015-10-14,19.15
2015-10-15,19.51
2015-10-16,19.27
2015-10-19,19.09
2015-10-20,18.12
2015-10-21,17.45
2015-10-22,16.92
2015-10-23,16.99
2015-10-26,16.83
2015-10-27,16
2015-10-28,16.84
2015-10-29,18.07
2015-10-30,18.37
2015-11-02,20.45
2015-11-03,21.3
2015-11-04,22.19
2015-11-05,21.7
2015-11-06,22.09
2015-11-09,21.63
2015-11-10,21.16
2015-11-11,20.9
2015-11-12,19.68
2015-11-13,18.73
2015-11-16,18.45
2015-11-17,18.04
2015-11-18,17.95
2015-11-19,17.43
2015-11-20,18.12
2015-11-23,18.91
2015-11-24,19.08
2015-11-25,19.24
2015-11-27,19
2015-11-30,18.99
2015-12-01,20.74
2015-12-02,21.7
2015-12-03,22.59
2015-12-04,22.85
2015-12-07,22.08
2015-12-08,22.95
2015-12-09,21.63
2015-12-10,21.89
2015-12-11,23.43
2015-12-14,24.76
2015-12-15,25.91
2015-12-16,26.85
2015-12-17,27.02
2015-12-18,25.51
2015-12-21,24.19
2015-12-22,23.56
2015-12-23,24.45
2015-12-24,25.01
2015-12-28,26.21
2015-12-29,25.41
2015-12-30,28.74
2015-12-31,27.5
2016-01-04,26.23
2016-01-05,23.96
2016-01-06,23.73
2016-01-07,21.13
2016-01-08,19.72
2016-01-11,18.5
2016-01-12,17.93
2016-01-13,15.11
2016-01-14,16.26
2016-01-15,15.57
2016-01-19,14.9
2016-01-20,16.15
2016-01-21,16.4
2016-01-22,17.06
2016-01-25,17.2
2016-01-26,17.01
2016-01-27,16.35
2016-01-28,16.18
2016-01-29,17.03
2016-02-01,18.75
2016-02-02,18.78
2016-02-03,19.52
2016-02-04,19.27
2016-02-05,18.75
2016-02-08,16.29
2016-02-09,15.41
2016-02-10,17.63
2016-02-11,18.95
2016-02-12,19.04
2016-02-16,19.25
2016-02-17,21.16
2016-02-18,20.67
2016-02-19,21.17
2016-02-22,20.89
2016-02-23,19.59
2016-02-24,19.22
2016-02-25,19.22
2016-02-26,18.81
2016-02-29,17.44
2016-03-01,18.01
2016-03-02,18.88
2016-03-03,18.2
2016-03-04,18.43
2016-03-07,18.63
2016-03-08,17.65
2016-03-09,17.74
2016-03-10,17.71
2016-03-11,17.66
2016-03-14,17.83
2016-03-15,17.19
2016-03-16,16.83
2016-03-17,15.39
2016-03-18,15.83
2016-03-21,16.29
2016-03-22,17.04
2016-03-23,16.92
2016-03-24,17.13
2016-03-28,16.47
2016-03-29,17.61
2016-03-30,17.01
2016-03-31,18.15
2016-04-01,19.17
2016-04-04,19.25
2016-04-05,18.17
2016-04-06,19.33
2016-04-07,18.96
2016-04-08,18.74
2016-04-11,18.74
2016-04-12,18.55
2016-04-13,18.87
2016-04-14,18.8
2016-04-15,18.54
2016-04-18,18.96
2016-04-19,17.97
2016-04-20,17.92
2016-04-21,18.43
2016-04-22,18.83
2016-04-25,18.84
2016-04-26,18.43
2016-04-27,18.09
2016-04-28,18.7
2016-04-29,19.06
2016-05-02,19.1
2016-05-03,18.65
2016-05-04,17.05
2016-05-05,15.95
2016-05-06,15.1
2016-05-09,15.54
2016-05-10,15.35
2016-05-11,15.07
2016-05-12,15.01
2016-05-13,15.11
2016-05-16,16.08
2016-05-17,15.59
2016-05-18,16.21
2016-05-19,15.53
2016-05-20,16.99
2016-05-23,16.46
2016-05-24,16.89
2016-05-25,16.67
2016-05-26,16.65
2016-05-27,16.6
2016-05-31,16.72
2016-06-01,16.39
2016-06-02,16.47
2016-06-03,16.13
2016-06-06,17.3
2016-06-07,16.72
2016-06-08,16.6
2016-06-09,16.49
2016-06-10,16.17
2016-06-13,15.33
2016-06-14,15.36
2016-06-15,14.91
2016-06-16,15.27
2016-06-17,14.27
2016-06-20,14.2
2016-06-21,13.2
2016-06-22,13.29
2016-06-23,13.7
2016-06-24,12.93
2016-06-27,11.67
2016-06-28,12.22
2016-06-29,12.02
2016-06-30,11.85
2016-07-01,12.6
2016-07-05,12.45
2016-07-06,12.49
2016-07-07,12.5
2016-07-08,12.74
2016-07-11,12.63
2016-07-12,12.88
2016-07-13,12.51
2016-07-14,12.61
2016-07-15,12.75
2016-07-18,12.8
2016-07-19,12.12
2016-07-20,12.13
2016-07-21,12.2
2016-07-22,12.23
2016-07-25,11.92
2016-07-26,11.93
2016-07-27,12.7
2016-07-28,12.19
2016-07-29,12.13
2016-08-01,11.86
2016-08-02,11.53
2016-08-03,12.4
2016-08-04,11.99
2016-08-05,12.04
2016-08-08,12.04
2016-08-09,12.25
2016-08-10,11.74
2016-08-11,10.65
2016-08-12,10.57
2016-08-15,11.06
2016-08-16,11.06
2016-08-17,10.76
2016-08-18,11.31
2016-08-19,11.28
2016-08-22,11.33
2016-08-23,11.41
2016-08-24,10.53
2016-08-25,10.22
2016-08-26,9.89
2016-08-29,9.61
2016-08-30,8.99
2016-08-31,8.33
2016-09-01,8.83
2016-09-02,8.98
2016-09-06,9.43
2016-09-07,9.78
2016-09-08,10.15
2016-09-09,9.33
2016-09-12,8.94
2016-09-13,9.31
2016-09-14,9.95
2016-09-15,11
2016-09-16,10.86
2016-09-19,10.53
2016-09-20,11.82
2016-09-21,12.82
2016-09-22,15.3
2016-09-23,15.48
2016-09-26,15.82
2016-09-27,16.39
2016-09-28,17.49
2016-09-29,17.34
2016-09-30,19.26
2016-10-03,19.98
2016-10-04,20.12
2016-10-05,19.05
2016-10-06,17.66
2016-10-07,18.17
2016-10-10,18.1
2016-10-11,17.66
2016-10-12,18.19
2016-10-13,18.17
2016-10-14,17.73
2016-10-17,17.45
2016-10-18,17.75
2016-10-19,17.4
2016-10-20,17.88
2016-10-21,18.3
2016-10-24,17.11
2016-10-25,16.87
2016-10-26,15.62
2016-10-27,14.96
2016-10-28,15.23
2016-10-31,14.97
2016-11-01,15.03
2016-11-02,14.16
2016-11-03,14.01
2016-11-04,14.32
2016-11-07,14.62
2016-11-08,14.91
2016-11-09,16.22
2016-11-10,16.84
2016-11-11,17.5
2016-11-14,16.65
2016-11-15,16.52
2016-11-16,16.19
2016-11-17,16.42
2016-11-18,16.79
2016-11-21,16.98
2016-11-22,16.6
2016-11-23,17.04
2016-11-25,17.16
2016-11-28,16.36
2016-11-29,16.31
2016-11-30,16.56
2016-12-01,16.61
2016-12-02,16.78
2016-12-05,16.35
2016-12-06,16.69
2016-12-07,16.39
2016-12-08,15.89
2016-12-09,16.21
2016-12-12,15.9
2016-12-13,15.86
2016-12-14,15.63
2016-12-15,16.75
2016-12-16,17.23
2016-12-19,17.45
2016-12-20,17.1
2016-12-21,16.01
2016-12-22,15.56
2016-12-23,16.35
2016-12-27,15.74
2016-12-28,15.44
2016-12-29,15.95
2016-12-30,15.57
2017-01-03,15.68
2017-01-04,16.64
2017-01-05,16.96
2017-01-06,16.81
2017-01-09,17.26
2017-01-10,16.5
2017-01-11,15.7
2017-01-12,16
2017-01-13,16.32
2017-01-17,15.3
2017-01-18,14.78
2017-01-19,14.76
2017-01-20,14.95
2017-01-23,14.76
2017-01-24,14.63
2017-01-25,14.96
2017-01-26,15.4
2017-01-27,16.14
2017-01-30,16.1
2017-01-31,16.82
2017-02-01,16.99
2017-02-02,16.1
2017-02-03,15.7
2017-02-06,15.49
2017-02-07,15.36
2017-02-08,14.99
2017-02-09,15.29
2017-02-10,15.27
2017-02-13,14.94
2017-02-14,15.15
2017-02-15,15.46
2017-02-16,14.97
2017-02-17,14.87
2017-02-21,14.54
2017-02-22,14.22
2017-02-23,13.91
2017-02-24,14.04
2017-02-27,14
2017-02-28,13.26
2017-03-01,13.9
2017-03-02,14.5
2017-03-03,14.49
2017-03-06,14.95
2017-03-07,15.37
2017-03-08,15
2017-03-09,15.49
2017-03-10,16.19
2017-03-13,15.64
2017-03-14,16.11
2017-03-15,16.54
2017-03-16,16.3
2017-03-17,15.38
2017-03-20,14.73
2017-03-21,13.57
2017-03-22,13.48
2017-03-23,12.73
2017-03-24,11.31
2017-03-27,11.3
2017-03-28,11.6
2017-03-29,11.21
2017-03-30,10.79
2017-03-31,10.06
2017-04-03,9.79
2017-04-04,9.54
2017-04-05,9.71
2017-04-06,10.12
2017-04-07,9.81
2017-04-10,9.78
2017-04-11,9.79
2017-04-12,9.74
2017-04-13,9.99
2017-04-17,9.99
2017-04-18,9.73
2017-04-19,9.88
2017-04-20,10.05
2017-04-21,10.24
2017-04-24,10.13
2017-04-25,10.13
2017-04-26,10.05
2017-04-27,10.02
2017-04-28,9.81
2017-05-01,9.73
2017-05-02,9.12
2017-05-03,8.83
2017-05-04,8.5
2017-05-05,8.1
2017-05-08,7.59
2017-05-09,8.19
2017-05-10,8.36
2017-05-11,9.21
2017-05-12,9.42
2017-05-15,9.13
2017-05-16,9.54
2017-05-17,8.97
2017-05-18,8.8
2017-05-19,8.66
2017-05-22,8.44
2017-05-23,9.18
2017-05-24,9.33
2017-05-25,9.15
2017-05-26,8.8
2017-05-30,8.32
2017-05-31,8.22
2017-06-01,9.17
2017-06-02,9.53
2017-06-05,9.35
2017-06-06,10.3
2017-06-07,9.74
2017-06-08,10.01
2017-06-09,10.48
2017-06-12,10.14
2017-06-13,10.04
2017-06-14,10.29
2017-06-15,10.29
2017-06-16,10.61
2017-06-19,11.12
2017-06-20,11.27
2017-06-21,11.91
2017-06-22,11.93
2017-06-23,12.84
2017-06-26,13.02
2017-06-27,12.36
2017-06-28,12.07
2017-06-29,11.61
2017-06-30,12.51
2017-07-03,13.05
2017-07-05,13.41
2017-07-06,12.99
2017-07-07,13.43
2017-07-10,12.84
2017-07-11,12.7
2017-07-12,12.21
2017-07-13,12.28
2017-07-14,12.23
2017-07-17,12.24
2017-07-18,12.17
2017-07-19,12.57
2017-07-20,12.39
2017-07-21,12.72
2017-07-24,13.2
2017-07-25,12.98
2017-07-26,12.63
2017-07-27,12.49
2017-07-28,12.48
2017-07-31,11.97
2017-08-01,11.47
2017-08-02,11.73
2017-08-03,11.05
2017-08-04,11.32
2017-08-07,11.37
2017-08-08,10.46
2017-08-09,9.89
2017-08-10,10.02
2017-08-11,10.34
2017-08-14,10.45
2017-08-15,10.53
2017-08-16,10.46
2017-08-17,10.31
2017-08-18,10.07
2017-08-21,9.81
2017-08-22,9.34
2017-08-23,9.15
2017-08-24,9.4
2017-08-25,9.6
2017-08-28,10.04
2017-08-29,10.04
2017-08-30,9.75
2017-08-31,10.04
2017-09-01,9.99
2017-09-05,9.85
2017-09-06,9.74
2017-09-07,10.19
2017-09-08,10.21
2017-09-11,10.58
2017-09-12,10.65
2017-09-13,10.62
2017-09-14,10.62
2017-09-15,10.58
2017-09-18,10.16
2017-09-19,9.69
2017-09-20,9.44
2017-09-21,10.06
2017-09-22,10.31
2017-09-25,10.4
2017-09-26,10.33
2017-09-27,10.59
2017-09-28,10.44
2017-09-29,10.49
2017-10-02,10.98
2017-10-03,10.69
2017-10-04,10.74
2017-10-05,11.38
2017-10-06,11.79
2017-10-09,11.78
2017-10-10,11.66
2017-10-11,11.83
2017-10-12,11.84
2017-10-13,11.36
2017-10-16,11.24
2017-10-17,11.09
2017-10-18,11.4
2017-10-19,11.78
2017-10-20,11.74
2017-10-23,11.3
2017-10-24,11.14
2017-10-25,11.16
2017-10-26,10.22
2017-10-27,9.94
2017-10-30,9.59
2017-10-31,10.33
2017-11-01,9.55
2017-11-02,9.3
2017-11-03,9.82
2017-11-06,9.99
2017-11-07,10.1
2017-11-08,10.03
2017-11-09,12.71
2017-11-10,14.09
2017-11-13,14.61
2017-11-14,14.16
2017-11-15,15.14
2017-11-16,16.82
2017-11-17,17.14
2017-11-20,17.6
2017-11-21,18.58
2017-11-22,16.3
2017-11-24,16.81
2017-11-27,15.52
2017-11-28,16.19
2017-11-29,15.86
2017-11-30,17.26
2017-12-01,17
2017-12-04,16.94
2017-12-05,17.74
2017-12-06,17.21
2017-12-07,18.34
2017-12-08,17.7
2017-12-11,17.79
2017-12-12,17.91
2017-12-13,17.82
2017-12-14,17.3
2017-12-15,17.43
2017-12-18,18.02
2017-12-19,17.87
2017-12-20,18.21
2017-12-21,18.26
2017-12-22,18.59
2017-12-26,19.14
2017-12-27,19.01
2017-12-28,19.06
2017-12-29,18.46
2018-01-02,18.7
2018-01-03,19.1
2018-01-04,18.82
2018-01-05,18.15
2018-01-08,18.18
2018-01-09,18.49
2018-01-10,18.91
2018-01-11,20.29
2018-01-12,20.02
2018-01-16,21.13
2018-01-17,20.98
2018-01-18,20.21
2018-01-19,23.38
2018-01-22,24.32
2018-01-23,25.73
2018-01-24,24.92
2018-01-25,24.35
2018-01-26,23.37
2018-01-29,23.18
2018-01-30,24.23
2018-01-31,23.84
2018-02-01,23.65
2018-02-02,22.6
2018-02-05,21.35
2018-02-06,21.43
2018-02-07,21.43
2018-02-08,21
2018-02-09,21.77
2018-02-12,23.62
2018-02-13,24.37
2018-02-14,25.5
2018-02-15,25.36
2018-02-16,25.9
2018-02-20,25.7
2018-02-21,24.5
2018-02-22,23.91
2018-02-23,24.5
2018-02-26,24.58
2018-02-27,25.34
2018-02-28,23.99
2018-03-01,24.09
2018-03-02,24.82
2018-03-05,25.28
2018-03-06,24.77
2018-03-07,23.76
2018-03-08,29.21
2018-03-09,26.8
2018-03-12,26.32
2018-03-13,27.59
2018-03-14,27.31
2018-03-15,26.86
2018-03-16,27
2018-03-19,27.08
2018-03-20,26.4
2018-03-21,26.98
2018-03-22,27.05
2018-03-23,26.54
2018-03-26,27.73
2018-03-27,26.44
2018-03-28,25.06
2018-03-29,25.55
2018-04-02,23.64
2018-04-03,24.18
2018-04-04,24.03
2018-04-05,24.21
2018-04-06,21.81
2018-04-09,21.79
2018-04-10,23.2
2018-04-11,22.64
2018-04-12,23.53
2018-04-13,23.28
2018-04-16,23.2
2018-04-17,24.8
2018-04-18,24.89
2018-04-19,25.43
2018-04-20,24.67
2018-04-23,24.21
2018-04-24,23.53
2018-04-25,23.39
2018-04-26,23.31
2018-04-27,24.09
2018-04-30,23.65
2018-05-01,24
2018-05-02,24.45
2018-05-03,22.65
2018-05-04,22.16
2018-05-07,23.33
2018-05-08,23.11
2018-05-09,23.94
2018-05-10,25.79
2018-05-11,25.49
2018-05-14,25.1
2018-05-15,25.26
2018-05-16,24.56
2018-05-17,25.2
2018-05-18,25.72
2018-05-21,25.59
2018-05-22,25.18
2018-05-23,25.02
2018-05-24,24.95
2018-05-25,24.62
2018-05-29,23.54
2018-05-30,23.46
2018-05-31,22.62
2018-06-01,24.37
2018-06-04,24.34
2018-06-05,24.56
2018-06-06,25.01
2018-06-07,24.77
2018-06-08,25.36
2018-06-11,24.96
2018-06-12,26.74
2018-06-13,27.48
2018-06-14,26.32
2018-06-15,26.45
2018-06-18,26.69
2018-06-19,26.66
2018-06-20,28.29
2018-06-21,27.85
2018-06-22,26.62
2018-06-25,25.15
2018-06-26,25.8
2018-06-27,24.79
2018-06-28,24.38
2018-06-29,23.85
2018-07-02,24.3
2018-07-03,23.99
2018-07-05,23
2018-07-06,21.14
2018-07-09,19.26
2018-07-10,19.02
2018-07-11,19.08
2018-07-12,19.98
2018-07-13,19.74
2018-07-16,19.4
2018-07-17,19.1
2018-07-18,19.54
2018-07-19,20.02
2018-07-20,20.15
2018-07-23,20.61
2018-07-24,19.59
2018-07-25,19.99
2018-07-26,20.06
2018-07-27,18.64
2018-07-30,18.56
2018-07-31,19.27
2018-08-01,19.29
2018-08-02,19.555
2018-08-03,18.27
2018-08-06,18.34
2018-08-07,18.75
2018-08-08,19.03
2018-08-09,17.68
2018-08-10,18.03
2018-08-13,18.38
2018-08-14,17.28
2018-08-15,16.19
2018-08-16,16.5
2018-08-17,16.84
2018-08-20,16.55
2018-08-21,16.98
2018-08-22,16.87
2018-08-23,16.25
2018-08-24,16.72
2018-08-27,16.62
2018-08-28,17
2018-08-29,17.1
2018-08-30,16.72
2018-08-31,17.1
2018-09-04,16.45
2018-09-05,15.71
2018-09-06,15.32
2018-09-07,15.81
2018-09-10,15.86
2018-09-11,15.41
2018-09-12,15.8
2018-09-13,15.55
2018-09-14,15.32
2018-09-17,14.16
2018-09-18,14.2
2018-09-19,14.88
2018-09-20,15.68
2018-09-21,15.3
2018-09-24,15.77
2018-09-25,15.24
2018-09-26,14.23
2018-09-27,14.82
2018-09-28,14.74
2018-10-01,14.93
2018-10-02,15.34
2018-10-03,17.07
2018-10-04,16.67
2018-10-05,17.08
2018-10-08,16.98
2018-10-09,17.2
2018-10-10,17.2
2018-10-11,17.02
2018-10-12,16.95
2018-10-15,16.89
2018-10-16,17.67
2018-10-17,17.69
2018-10-18,16.9
2018-10-19,16.4
2018-10-22,16.49
2018-10-23,16.95
2018-10-24,16.28
2018-10-25,16.36
2018-10-26,16.32
2018-10-29,16.58
2018-10-30,16.52
2018-10-31,16.05
2018-11-01,16.76
2018-11-02,16.38
2018-11-05,15.47
2018-11-06,15.6
2018-11-07,15.48
2018-11-08,15.56
2018-11-09,15.42
2018-11-12,15.85
2018-11-13,17.15
2018-11-14,17.4
2018-11-15,16.85
2018-11-16,17.38
2018-11-19,17
2018-11-20,17.15
2018-11-21,18.01
2018-11-23,18.32
2018-11-26,18.96
2018-11-27,18.48
2018-11-28,19.47
2018-11-29,18.98
2018-11-30,19.19
2018-12-03,19.11
2018-12-04,19.3
2018-12-06,19.68
2018-12-07,19.06
2018-12-10,19.2
2018-12-11,18.58
2018-12-12,18.57
2018-12-13,18.71
2018-12-14,18.14
2018-12-17,17.95
2018-12-18,17.55
2018-12-19,16.11
2018-12-20,16.03
2018-12-21,14.78
2018-12-24,14.9
2018-12-26,15.83
2018-12-27,16.26
2018-12-28,16.57
2018-12-31,17.17
2019-01-02,17.8
2019-01-03,17.77
2019-01-04,18.72
2019-01-07,15.06
2019-01-08,14.8
2019-01-09,15.21
2019-01-10,15.87
2019-01-11,15.95
2019-01-14,15.74
2019-01-15,15.64
2019-01-16,15.88
2019-01-17,16.04
2019-01-18,15.76
2019-01-22,15.32
2019-01-23,15.08
2019-01-24,15.25
2019-01-25,15.9
2019-01-28,15.67
2019-01-29,15.68
2019-01-30,15.89
2019-01-31,16.01
2019-02-01,15.89
2019-02-04,15.72
2019-02-05,15.88
2019-02-06,15.16
2019-02-07,15.02
2019-02-08,14.39
2019-02-11,13.87
2019-02-12,13.64
2019-02-13,13.58
2019-02-14,13.89
2019-02-15,14.79
2019-02-19,15.04
2019-02-20,14.98
2019-02-21,15.09
2019-02-22,15.51
2019-02-25,15.22
2019-02-26,14.84
2019-02-27,14.45
2019-02-28,17.59
2019-03-01,18.29
2019-03-04,18.17
2019-03-05,18.35
2019-03-06,17.78
2019-03-07,17.99
2019-03-08,18.07
2019-03-11,17.49
2019-03-12,17.15
2019-03-13,17.51
2019-03-14,17.34
2019-03-15,16.98
2019-03-18,17.59
2019-03-19,17.34
2019-03-20,17.6
2019-03-21,17
2019-03-22,15.8
2019-03-25,15.17
2019-03-26,15.64
2019-03-27,15.33
2019-03-28,15.65
2019-03-29,15.14
2019-04-01,15.12
2019-04-02,15.73
2019-04-03,15.7
2019-04-04,16.07
2019-04-05,16.41
2019-04-08,16.17
2019-04-09,16.09
2019-04-10,16.4
2019-04-11,16.33
2019-04-12,16.59
2019-04-15,14.66
2019-04-16,14.4
2019-04-17,13.61
2019-04-18,13.52
2019-04-22,14.15
2019-04-23,14.83
2019-04-24,14.48
2019-04-25,14.57
2019-04-26,14.99
2019-04-29,15.01
2019-04-30,13.93
2019-05-01,13.82
2019-05-02,13.9
2019-05-03,13.97
2019-05-06,14.69
2019-05-07,13.98
2019-05-08,14.05
2019-05-09,14.76
2019-05-10,14.12
2019-05-13,13.58
2019-05-14,13.51
2019-05-15,13.13
2019-05-16,12.67
2019-05-17,12.51
2019-05-20,11.97
2019-05-21,11.9
2019-05-22,11.67
2019-05-23,11.81
2019-05-24,11.84
2019-05-28,11.79
2019-05-29,11.6
2019-05-30,11.56
2019-05-31,11.51
2019-06-03,11.55
2019-06-04,11.26
2019-06-05,10.96
2019-06-06,10.62
2019-06-07,11.47
2019-06-10,11.76
2019-06-11,11.75
2019-06-12,11.75
2019-06-13,12.16
2019-06-14,12.08
2019-06-17,11.205
2019-06-18,11.38
2019-06-19,12.08
2019-06-20,12.19
2019-06-21,12.595
2019-06-24,12.39
2019-06-25,12.695
2019-06-26,13.38
2019-06-27,13.27
2019-06-28,13.23
2019-07-01,13.235
2019-07-02,13.185
2019-07-03,13.08
2019-07-04,13.08
2019-07-05,12.9
2019-07-08,12.29
2019-07-09,12.3
2019-07-10,12.39
2019-07-11,11.5
2019-07-12,11.555
2019-07-15,11.23
2019-07-16,10.865
2019-07-17,10.855
2019-07-18,10.565
2019-07-19,10.375
2019-07-22,10.145
2019-07-23,10.475
2019-07-24,10.705
2019-07-25,10.44
2019-07-26,10.64
2019-07-29,10.65
2019-07-30,10.865
2019-07-31,10.985
2019-08-01,10.915
2019-08-02,10.4
2019-08-05,10.51
2019-08-06,10.715
2019-08-07,10.575
2019-08-08,11.155
2019-08-09,11.25
2019-08-12,11.755
2019-08-13,11.82
2019-08-14,11.33
2019-08-15,10.975
2019-08-16,11.495
2019-08-19,11.63
2019-08-20,11.835
2019-08-21,11.98
2019-08-22,11.825
2019-08-23,11.31
2019-08-26,11.47
2019-08-27,11.095
2019-08-28,11.46
2019-08-29,11.58
2019-08-30,11.59
2019-09-02,11.57
2019-09-03,10.89
2019-09-04,10.57
2019-09-05,10.91
2019-09-06,10.835
2019-09-09,11.275
2019-09-10,12.19
2019-09-11,13.01
2019-09-12,12.115
2019-09-13,11.945
2019-09-16,12.45
2019-09-17,12.13
2019-09-18,11.71
2019-09-19,11.675
2019-09-20,11.69
2019-09-23,11.35
2019-09-24,10.935
2019-09-25,11.28
2019-09-26,10.97
2019-09-27,11.455
2019-09-30,11.58
2019-10-01,10.64
2019-10-02,10.7
2019-10-03,11.11
2019-10-04,11.685
2019-10-07,11.84
2019-10-08,11.735
2019-10-09,11.5
2019-10-10,11.97
2019-10-11,11.785
2019-10-14,11.78
2019-10-15,12.09
2019-10-16,11.87
2019-10-17,12.08
2019-10-18,11.555
2019-10-21,11.845
2019-10-22,11.525
2019-10-23,11.475
2019-10-24,12.155
2019-10-25,12.635
2019-10-28,12.59
2019-10-29,11.88
2019-10-30,11.895
2019-10-31,11.98
2019-11-01,12.82
2019-11-04,13.42
2019-11-05,13.665
2019-11-06,13.69
2019-11-07,17.805
2019-11-08,19.95
2019-11-11,19.015
2019-11-12,19.085
2019-11-13,18.265
2019-11-14,18.31
2019-11-15,18.135
2019-11-18,18.85
2019-11-19,19.06
2019-11-20,19.195
2019-11-21,19.245
2019-11-22,19.33
2019-11-25,20.91
