date,close
2013-11-06,112.1895
2013-11-07,110.6656
2013-11-08,110.9419
2013-11-11,111.1112
2013-11-12,110.5498
2013-11-13,110.9864
2013-11-14,111.9489
2013-11-15,113.0005
2013-11-18,112.546
2013-11-19,112.5014
2013-11-20,110.9508
2013-11-21,111.7707
2013-11-22,112.7955
2013-11-25,112.3499
2013-11-26,112.3499
2013-11-27,112.8044
2013-11-29,112.5193
2013-12-02,111.2003
2013-12-03,110.7191
2013-12-04,110.7011
2013-12-05,109.6892
2013-12-06,112.3489
2013-12-09,112.3041
2013-12-10,112.7787
2013-12-11,111.1489
2013-12-12,111.6504
2013-12-13,111.2653
2013-12-16,111.9548
2013-12-17,112.1518
2013-12-18,113.4235
2013-12-19,113.8622
2013-12-20,114.2115
2013-12-23,114.5876
2013-12-24,115.492
2013-12-26,116.0293
2013-12-27,116.4234
2013-12-30,116.4234
2013-12-31,116.4413
2014-01-02,115.9667
2014-01-03,116.1278
2014-01-06,115.9577
2014-01-07,116.6293
2014-01-08,117.2472
2014-01-09,117.3099
2014-01-10,118.6442
2014-01-13,117.1308
2014-01-14,118.08
2014-01-15,119.0293
2014-01-16,118.7158
2014-01-17,118.5994
2014-01-21,119.2889
2014-01-22,119.2889
2014-01-23,117.5606
2014-01-24,113.7011
2014-01-27,112.5996
2014-01-28,112.5638
2014-01-29,114.0234
2014-01-30,112.3757
2014-01-31,111.6862
2014-02-03,108.8116
2014-02-04,109.5907
2014-02-05,109.8862
2014-02-06,111.2922
2014-02-07,113.7816
2014-02-10,114.3369
2014-02-11,115.0085
2014-02-12,114.6951
2014-02-13,115.8861
2014-02-14,116.2443
2014-02-18,116.1637
2014-02-19,114.7577
2014-02-20,114.6861
2014-02-21,114.6861
2014-02-24,113.8622
2014-02-25,115.3398
2014-02-26,115.3667
2014-02-27,116.2801
2014-02-28,116.7457
2014-03-03,116.6741
2014-03-04,117.3099
2014-03-05,116.59
2014-03-06,117.7419
2014-03-07,117.9579
2014-03-10,118.4169
2014-03-11,118.4259
2014-03-12,118.8669
2014-03-13,118.8399
2014-03-14,118.5699
2014-03-17,119.1728
2014-03-18,119.5508
2014-03-19,119.3888
2014-03-20,119.2538
2014-03-21,119.6228
2014-03-24,118.5699
2014-03-25,118.2099
2014-03-26,116.6889
2014-03-27,115.915
2014-03-28,116.401
2014-03-31,117.8679
2014-04-01,117.9489
2014-04-02,118.4439
2014-04-03,118.1019
2014-04-04,116.509
2014-04-07,114.808
2014-04-08,115.384
2014-04-09,117.2739
2014-04-10,115.321
2014-04-11,114.2951
2014-04-14,114.529
2014-04-15,116.266
2014-04-16,118.3899
2014-04-17,118.6689
2014-04-21,119.5958
2014-04-22,118.7679
2014-04-23,118.5249
2014-04-24,117.5799
2014-04-25,116.419
2014-04-28,116.455
2014-04-29,115.609
2014-04-30,117.4899
2014-05-01,117.2559
2014-05-02,117.8949
2014-05-05,117.5799
2014-05-06,117.3819
2014-05-07,116.9949
2014-05-08,117.1479
2014-05-09,117.0849
2014-05-12,117.9579
2014-05-13,117.8949
2014-05-14,118.2819
2014-05-15,117.3189
2014-05-16,117.8949
2014-05-19,118.3809
2014-05-20,117.1659
2014-05-21,117.4539
2014-05-22,117.2559
2014-05-23,117.8319
2014-05-27,117.7419
2014-05-28,117.1479
2014-05-29,119.2448
2014-05-30,119.0108
2014-06-02,120.6218
2014-06-03,120.3068
2014-06-04,120.0354
2014-06-05,120.9036
2014-06-06,121.7899
2014-06-09,120.985
2014-06-10,120.8132
2014-06-11,119.8093
2014-06-12,118.4619
2014-06-13,118.9502
2014-06-16,118.1182
2014-06-17,118.3262
2014-06-18,119.6918
2014-06-19,118.9231
2014-06-20,119.4747
2014-06-23,119.2486
2014-06-24,118.6608
2014-06-25,118.8236
2014-06-26,118.498
2014-06-27,119.2848
2014-06-30,120.1349
2014-07-01,120.1349
2014-07-02,120.0354
2014-07-03,120.5509
2014-07-07,120.2796
2014-07-08,120.0807
2014-07-09,119.746
2014-07-10,119.2577
2014-07-11,119.0045
2014-07-14,119.746
2014-07-15,119.9721
2014-07-16,120.777
2014-07-17,119.0768
2014-07-18,120.0716
2014-07-21,118.905
2014-07-22,119.0949
2014-07-23,118.6066
2014-07-24,116.8702
2014-07-25,118.0549
2014-07-28,117.8378
2014-07-29,116.3728
2014-07-30,116.8611
2014-07-31,115.8844
2014-08-01,116.5808
2014-08-04,116.5808
2014-08-05,114.8987
2014-08-06,115.6493
2014-08-07,114.8896
2014-08-08,116.5717
2014-08-11,116.2643
2014-08-12,116.5446
2014-08-13,117.042
2014-08-14,117.2862
2014-08-15,117.1867
2014-08-18,118.1996
2014-08-19,118.1001
2014-08-20,117.9554
2014-08-21,118.8869
2014-08-22,118.2539
2014-08-25,119.0587
2014-08-26,118.7965
2014-08-27,118.5975
2014-08-28,118.8688
2014-08-29,119.0678
2014-09-02,119.0678
2014-09-03,119.5833
2014-09-04,119.8559
2014-09-05,120.474
2014-09-08,120.4467
2014-09-09,120.065
2014-09-10,120.6921
2014-09-11,119.2016
2014-09-12,119.6287
2014-09-15,119.556
2014-09-16,120.1377
2014-09-17,120.4103
2014-09-18,121.2919
2014-09-19,121.3464
2014-09-22,121.0283
2014-09-23,120.0014
2014-09-24,121.5554
2014-09-25,119.7469
2014-09-26,120.474
2014-09-29,118.9471
2014-09-30,117.2385
2014-10-01,114.3576
2014-10-02,113.8759
2014-10-03,114.0758
2014-10-06,114.1667
2014-10-07,112.2127
2014-10-08,113.5487
2014-10-09,110.8586
2014-10-10,109.7589
2014-10-13,107.9776
2014-10-14,109.2318
2014-10-15,110.3224
2014-10-16,111.2039
2014-10-17,112.7944
2014-10-20,114.0667
2014-10-21,115.9389
2014-10-22,115.43
2014-10-23,115.0392
2014-10-24,116.0752
2014-10-27,114.0667
2014-10-28,114.2394
2014-10-29,111.4311
2014-10-30,114.7211
2014-10-31,114.503
2014-11-03,113.0761
2014-11-04,112.9398
2014-11-05,114.303
2014-11-06,115.0301
2014-11-07,115.121
2014-11-10,114.8483
2014-11-11,115.1482
2014-11-12,114.7211
2014-11-13,115.1755
2014-11-14,114.3848
2014-11-17,114.7483
2014-11-18,116.1752
2014-11-19,116.566
2014-11-20,117.0749
2014-11-21,118.6472
2014-11-24,117.6748
2014-11-25,116.9204
2014-11-26,118.0383
2014-11-28,116.6751
2014-12-01,115.9298
2014-12-02,116.7387
2014-12-03,118.4742
2014-12-04,118.3006
2014-12-05,118.3189
2014-12-08,116.9853
2014-12-09,116.6473
2014-12-10,114.7291
2014-12-11,115.3319
2014-12-12,113.0118
2014-12-15,113.1853
2014-12-16,112.6007
2014-12-17,115.5329
2014-12-18,119.1593
2014-12-19,118.7939
2014-12-22,119.9722
2014-12-23,120.6573
2014-12-24,120.3376
2014-12-26,120.7852
2014-12-29,120.8674
2014-12-30,119.9722
2014-12-31,118.3463
2015-01-02,118.7026
2015-01-05,115.5694
2015-01-06,114.0896
2015-01-07,115.3685
2015-01-08,117.2684
2015-01-09,115.6882
2015-01-12,115.4324
2015-01-13,114.6377
2015-01-14,113.8065
2015-01-15,113.6969
2015-01-16,112.8382
2015-01-20,114.0988
2015-01-21,114.793
2015-01-22,116.4281
2015-01-23,115.405
2015-01-26,113.7425
2015-01-27,112.5368
2015-01-28,112.0161
2015-01-29,110.9382
2015-01-30,110.1527
2015-02-02,111.6416
2015-02-03,112.7925
2015-02-04,112.0892
2015-02-05,113.8247
2015-02-06,114.4093
2015-02-09,114.2175
2015-02-10,114.0988
2015-02-11,113.5872
2015-02-12,114.5098
2015-02-13,115.9074
2015-02-17,116.4189
2015-02-18,116.5833
2015-02-19,117.7069
2015-02-20,118.1179
2015-02-23,117.2776
2015-02-24,117.2684
2015-02-25,117.4603
2015-02-26,116.83
2015-02-27,116.83
2015-03-02,119.004
2015-03-03,117.8804
2015-03-04,117.3155
2015-03-05,117.3339
2015-03-06,116.002
2015-03-09,115.9652
2015-03-10,114.2292
2015-03-11,114.1006
2015-03-12,115.3957
2015-03-13,113.7148
2015-03-16,114.119
2015-03-17,112.8147
2015-03-18,114.6425
2015-03-19,112.0706
2015-03-20,111.988
2015-03-23,112.0431
2015-03-24,111.6481
2015-03-25,110.4999
2015-03-26,110.6928
2015-03-27,110.3714
2015-03-30,111.6206
2015-03-31,110.9041
2015-04-01,111.1521
2015-04-02,112.3095
2015-04-06,112.3003
2015-04-07,112.7687
2015-04-08,112.3921
2015-04-09,112.585
2015-04-10,112.3921
2015-04-13,111.345
2015-04-14,111.1429
2015-04-15,111.6022
2015-04-16,111.3634
2015-04-17,110.6377
2015-04-20,112.0615
2015-04-21,111.3542
2015-04-22,111.3817
2015-04-23,111.9329
2015-04-24,112.484
2015-04-27,113.5219
2015-04-28,112.7871
2015-04-29,114.5323
2015-04-30,111.9972
2015-05-01,112.7504
2015-05-04,112.3095
2015-05-05,111.0603
2015-05-06,110.0866
2015-05-07,110.9317
2015-05-08,111.1613
2015-05-11,109.4436
2015-05-12,108.2403
2015-05-13,108.2128
2015-05-14,110.7847
2015-05-15,112.4289
2015-05-18,111.9237
2015-05-19,111.446
2015-05-20,111.5838
2015-05-21,111.9329
2015-05-22,112.0706
2015-05-26,111.7583
2015-05-27,111.6297
2015-05-28,112.7504
2015-05-29,112.8514
2015-06-01,112.484
2015-06-02,112.5575
2015-06-03,113.4768
2015-06-04,112.1463
2015-06-05,112.1463
2015-06-08,112.5252
2015-06-09,112.6822
2015-06-10,113.6523
2015-06-11,113.8648
2015-06-12,113.8094
2015-06-15,111.9985
2015-06-16,112.479
2015-06-17,113.3382
2015-06-18,114.373
2015-06-19,113.6431
2015-06-22,113.9665
2015-06-23,114.1051
2015-06-24,113.1719
2015-06-25,112.9132
2015-06-26,112.3311
2015-06-29,110.2246
2015-06-30,110.4556
2015-07-01,110.2061
2015-07-02,109.855
2015-07-06,108.8941
2015-07-07,109.4854
2015-07-08,107.2588
2015-07-09,107.1756
2015-07-10,108.4414
2015-07-13,109.4577
2015-07-14,110.1969
2015-07-15,109.661
2015-07-16,109.2175
2015-07-17,108.1088
2015-07-20,107.8316
2015-07-21,106.6213
2015-07-22,106.3903
2015-07-23,106.4365
2015-07-24,104.3853
2015-07-27,103.3136
2015-07-28,106.6028
2015-07-29,107.1109
2015-07-30,105.5772
2015-07-31,105.4571
2015-08-03,104.9859
2015-08-04,104.7642
2015-08-05,104.7642
2015-08-06,104.718
2015-08-07,104.5424
2015-08-10,106.6859
2015-08-11,105.3093
2015-08-12,104.8196
2015-08-13,105.0229
2015-08-14,105.3185
2015-08-17,105.3278
2015-08-18,104.875
2015-08-19,103.8679
2015-08-20,103.1565
2015-08-21,100.3478
2015-08-24,97.345
2015-08-25,95.1646
2015-08-26,96.1347
2015-08-27,97.188
2015-08-28,98.1119
2015-08-31,97.7053
2015-09-01,94.5917
2015-09-02,95.1184
2015-09-03,95.8394
2015-09-04,94.3787
2015-09-08,97.0117
2015-09-09,97.0396
2015-09-10,97.8676
2015-09-11,97.4769
2015-09-14,97.1419
2015-09-15,98.3421
2015-09-16,99.9703
2015-09-17,99.5982
2015-09-18,97.8118
2015-09-21,97.9235
2015-09-22,96.2302
2015-09-23,93.6344
2015-09-24,93.9693
2015-09-25,93.8949
2015-09-28,92.2667
2015-09-29,93.5506
2015-09-30,94.7694
2015-10-01,94.3508
2015-10-02,95.9696
2015-10-05,98.9376
2015-10-06,98.5933
2015-10-07,99.7749
2015-10-08,101.031
2015-10-09,101.0868
2015-10-12,100.9751
2015-10-13,100.8263
2015-10-14,101.3845
2015-10-15,101.8683
2015-10-16,101.8125
2015-10-19,101.5334
2015-10-20,101.7474
2015-10-21,100.3704
2015-10-22,102.5847
2015-10-23,103.971
2015-10-26,102.4731
2015-10-27,101.6636
2015-10-28,102.2591
2015-10-29,104.9014
2015-10-30,103.3569
2015-11-02,104.5571
2015-11-03,105.655
2015-11-04,105.1526
2015-11-05,105.4875
2015-11-06,105.6736
2015-11-09,104.6688
2015-11-10,103.8314
2015-11-11,103.3104
2015-11-12,102.4917
2015-11-13,105.6085
2015-11-16,107.9065
2015-11-17,105.5154
2015-11-18,107.5344
2015-11-19,107.5158
2015-11-20,107.0413
2015-11-23,106.604
2015-11-24,106.0923
2015-11-25,105.3294
2015-11-27,105.9806
2015-11-30,104.9479
2015-12-01,104.2315
2015-12-02,102.6778
2015-12-03,102.1299
2015-12-04,103.2724
2015-12-07,102.5982
2015-12-08,99.9386
2015-12-09,100.257
2015-12-10,99.9012
2015-12-11,98.6089
2015-12-14,98.0657
2015-12-15,99.0865
2015-12-16,99.255
2015-12-17,96.3801
2015-12-18,95.0691
2015-12-21,95.6309
2015-12-22,96.2771
2015-12-23,98.0845
2015-12-24,97.8691
2015-12-28,97.1855
2015-12-29,97.7661
2015-12-30,96.6236
2015-12-31,95.8931
2016-01-04,95.2095
2016-01-05,94.8818
2016-01-06,93.9266
2016-01-07,91.5761
2016-01-08,91.6323
2016-01-11,92.1848
2016-01-12,93.5426
2016-01-13,91.7821
2016-01-14,93.449
2016-01-15,91.2015
2016-01-19,91.9413
2016-01-20,91.6042
2016-01-21,91.7353
2016-01-22,91.857
2016-01-25,90.0216
2016-01-26,91.9038
2016-01-27,91.8664
2016-01-28,91.96
2016-01-29,93.6457
2016-02-01,94.142
2016-02-02,91.9132
2016-02-03,96.7266
2016-02-04,98.8243
2016-02-05,98.4216
2016-02-08,95.453
2016-02-09,97.2229
2016-02-10,96.8015
2016-02-11,95.5748
2016-02-12,97.2323
2016-02-16,97.3915
2016-02-17,97.8597
2016-02-18,97.8597
2016-02-19,96.7453
2016-02-22,97.5975
2016-02-23,95.7246
2016-02-24,95.4156
2016-02-25,96.0898
2016-02-26,96.6798
2016-02-29,95.3219
2016-03-01,98.6463
2016-03-02,97.5226
2016-03-03,99.8336
2016-03-04,102.6161
2016-03-07,102.4275
2016-03-08,102.003
2016-03-09,102.8708
2016-03-10,104.38
2016-03-11,104.8045
2016-03-14,103.6632
2016-03-15,103.2293
2016-03-16,103.8801
2016-03-17,106.7004
2016-03-18,106.474
2016-03-21,106.5495
2016-03-22,106.1911
2016-03-23,106.3986
2016-03-24,105.3987
2016-03-28,106.0684
2016-03-29,106.0779
2016-03-30,108.4737
2016-03-31,107.9549
2016-04-01,108.7001
2016-04-04,108.2002
2016-04-05,106.5778
2016-04-06,106.8513
2016-04-07,105.3327
2016-04-08,105.927
2016-04-11,106.342
2016-04-12,107.5871
2016-04-13,109.0114
2016-04-14,108.9736
2016-04-15,109.7188
2016-04-18,109.5302
2016-04-19,112.0769
2016-04-20,112.5203
2016-04-21,112.1052
2016-04-22,112.8315
2016-04-25,112.4259
2016-04-26,112.6429
2016-04-27,111.7279
2016-04-28,111.5487
2016-04-29,110.7941
2016-05-02,110.7375
2016-05-03,108.5586
2016-05-04,107.4739
2016-05-05,107.0306
2016-05-06,107.8135
2016-05-09,106.6155
2016-05-10,107.5493
2016-05-11,106.9928
2016-05-12,107.1532
2016-05-13,105.6062
2016-05-16,106.5401
2016-05-17,105.9081
2016-05-18,104.4932
2016-05-19,103.8141
2016-05-20,103.8329
2016-05-23,104.2197
2016-05-24,104.4838
2016-05-25,105.295
2016-05-26,104.2951
2016-05-27,104.4838
2016-05-31,103.6254
2016-06-01,104.5498
2016-06-02,104.2857
2016-06-03,104.6941
2016-06-06,106.0332
2016-06-07,106.2326
2016-06-08,107.9515
2016-06-09,107.7331
2016-06-10,108.0085
2016-06-13,107.2013
2016-06-14,106.7929
2016-06-15,106.3656
2016-06-16,106.4795
2016-06-17,106.4605
2016-06-20,106.9544
2016-06-21,106.2231
2016-06-22,107.1823
2016-06-23,109.4046
2016-06-24,104.7416
2016-06-27,101.6266
2016-06-28,103.0226
2016-06-29,105.0835
2016-06-30,106.7359
2016-07-01,107.6856
2016-07-05,105.8717
2016-07-06,106.2041
2016-07-07,106.2136
2016-07-08,108.9677
2016-07-11,108.6068
2016-07-12,111.1045
2016-07-13,111.6364
2016-07-14,112.3961
2016-07-15,113.0039
2016-07-18,112.6905
2016-07-19,112.2347
2016-07-20,112.3201
2016-07-21,111.7598
2016-07-22,111.7788
2016-07-25,111.8168
2016-07-26,112.4341
2016-07-27,112.3866
2016-07-28,111.2185
2016-07-29,110.6772
2016-08-01,110.0694
2016-08-02,110.2118
2016-08-03,110.7152
2016-08-04,110.8006
2016-08-05,110.8386
2016-08-08,110.9336
2016-08-09,111.038
2016-08-10,110.6297
2016-08-11,111.095
2016-08-12,110.8956
2016-08-15,112.0922
2016-08-16,115.1692
2016-08-17,114.381
2016-08-18,115.758
2016-08-19,116.3943
2016-08-22,116.2709
2016-08-23,116.2899
2016-08-24,115.948
2016-08-25,116.8502
2016-08-26,115.6915
2016-08-29,116.0999
2016-08-30,116.3563
2016-08-31,115.9005
2016-09-01,116.6697
2016-09-02,117.2301
2016-09-06,116.7237
2016-09-07,116.8001
2016-09-08,115.2044
2016-09-09,112.185
2016-09-12,113.2552
2016-09-13,112.7488
2016-09-14,111.6404
2016-09-15,112.9494
2016-09-16,112.443
2016-09-19,112.5672
2016-09-20,112.3761
2016-09-21,112.7488
2016-09-22,113.1023
2016-09-23,111.6404
2016-09-26,111.2486
2016-09-27,111.7933
2016-09-28,113.0832
2016-09-29,113.5705
2016-09-30,115.4528
2016-10-03,115.8446
2016-10-04,115.0038
2016-10-05,115.0038
2016-10-06,115.4719
2016-10-07,113.561
2016-10-10,113.4845
2016-10-11,111.9175
2016-10-12,112.0895
2016-10-13,111.8888
2016-10-14,111.9653
2016-10-17,111.8697
2016-10-18,113.217
2016-10-19,114.5451
2016-10-20,114.44
2016-10-21,114.5451
2016-10-24,114.2394
2016-10-25,113.2552
2016-10-26,113.2934
2016-10-27,111.3729
2016-10-28,112.2137
2016-10-31,111.8506
2016-11-01,110.8187
2016-11-02,109.8823
2016-11-03,109.7294
2016-11-04,109.4045
2016-11-07,112.2519
2016-11-08,112.6055
2016-11-09,113.3985
2016-11-10,114.8795
2016-11-11,112.6055
2016-11-14,111.5926
2016-11-15,111.8697
2016-11-16,111.9366
2016-11-17,111.1149
2016-11-18,110.6276
2016-11-21,111.5449
2016-11-22,111.6308
2016-11-23,113.4272
2016-11-25,113.7807
2016-11-28,113.4081
2016-11-29,116.7428
2016-11-30,114.9464
2016-12-01,114.4018
2016-12-02,114.2585
2016-12-05,115.1527
2016-12-06,114.4412
2016-12-07,117.5565
2016-12-08,118.2296
2016-12-09,119.1527
2016-12-12,118.7296
2016-12-13,118.97
2016-12-14,117.8642
2016-12-15,118.6815
2016-12-16,117.7777
2016-12-19,118.268
2016-12-20,113.8354
2016-12-21,113.97
2016-12-22,112.6816
2016-12-23,113.0662
2016-12-27,113.9892
2016-12-28,112.9604
2016-12-29,112.8931
2016-12-30,112.6816
2017-01-03,112.4027
2017-01-04,112.3546
2017-01-05,111.22
2017-01-06,111.7297
2017-01-09,112.0662
2017-01-10,111.3931
2017-01-11,112.422
2017-01-12,112.7393
2017-01-13,112.5758
2017-01-17,112.422
2017-01-18,112.1143
2017-01-19,111.6335
2017-01-20,112.8739
2017-01-23,112.1912
2017-01-24,113.1623
2017-01-25,114.97
2017-01-26,114.9027
2017-01-27,115.5758
2017-01-30,114.7104
2017-01-31,113.8835
2017-02-01,113.4123
2017-02-02,112.1335
2017-02-03,112.9508
2017-02-06,111.9604
2017-02-07,111.8258
2017-02-08,111.8258
2017-02-09,111.3066
2017-02-10,111.7585
2017-02-13,112.9219
2017-02-14,112.8066
2017-02-15,113.0662
2017-02-16,112.9796
2017-02-17,112.9027
2017-02-21,113.7585
2017-02-22,113.2585
2017-02-23,113.5181
2017-02-24,113.5662
2017-02-27,113.9604
2017-02-28,114.1431
2017-03-01,115.7296
2017-03-02,114.2104
2017-03-03,113.8305
2017-03-06,113.9563
2017-03-07,114.9823
2017-03-08,114.7694
2017-03-09,113.24
2017-03-10,113.2013
2017-03-13,112.9787
2017-03-14,112.9109
2017-03-15,114.8178
2017-03-16,113.3659
2017-03-17,114.5274
2017-03-20,114.45
2017-03-21,113.2013
2017-03-22,113.3175
2017-03-23,113.8692
2017-03-24,112.6786
2017-03-27,114.1112
2017-03-28,114.9727
2017-03-29,114.5855
2017-03-30,114.7984
2017-03-31,114.7984
2017-04-03,114.2177
2017-04-04,115.447
2017-04-05,114.3435
2017-04-06,115.5438
2017-04-07,115.0404
2017-04-10,115.7373
2017-04-11,115.3598
2017-04-12,114.4403
2017-04-13,113.7047
2017-04-17,114.2661
2017-04-18,114.5274
2017-04-19,114.3725
2017-04-20,115.8922
2017-04-21,115.747
2017-04-24,119.0671
2017-04-25,120.7029
2017-04-26,121.0998
2017-04-27,121.4579
2017-04-28,120.9739
2017-05-01,120.9546
2017-05-02,121.545
2017-05-03,121.5063
2017-05-04,122.271
2017-05-05,125.3297
2017-05-08,124.9522
2017-05-09,124.4973
2017-05-10,125.0296
2017-05-11,124.9522
2017-05-12,125.562
2017-05-15,125.9976
2017-05-16,126.83
2017-05-17,124.6908
2017-05-18,124.2553
2017-05-19,125.0877
2017-05-22,125.6588
2017-05-23,125.804
2017-05-24,128.0303
2017-05-25,127.7012
2017-05-26,127.7399
2017-05-30,127.3721
2017-05-31,128.0496
2017-06-01,129.7919
2017-06-02,132.2408
2017-06-05,129.8921
2017-06-06,129.7655
2017-06-07,129.5611
2017-06-08,129.4637
2017-06-09,132.5889
2017-06-12,131.4011
2017-06-13,132.6765
2017-06-14,131.6153
2017-06-15,131.294
2017-06-16,132.4039
2017-06-19,132.8517
2017-06-20,131.1967
2017-06-21,129.3469
2017-06-22,128.9672
2017-06-23,129.2885
2017-06-26,129.3664
2017-06-27,128.7336
2017-06-28,130.1063
2017-06-29,128.1884
2017-06-30,129.0451
2017-07-03,130.632
2017-07-05,129.1522
2017-07-06,128.9283
2017-07-07,129.5416
2017-07-10,129.8142
2017-07-11,129.4443
2017-07-12,130.2815
2017-07-13,130.0479
2017-07-14,130.7586
2017-07-17,130.9825
2017-07-18,130.6125
2017-07-19,132.0339
2017-07-20,131.6348
2017-07-21,131.1772
2017-07-24,131.6445
2017-07-25,132.2676
2017-07-26,131.4595
2017-07-27,129.2009
2017-07-28,128.7628
2017-07-31,126.7183
2017-08-01,126.7086
2017-08-02,127.1467
2017-08-03,126.8741
2017-08-04,126.7086
2017-08-07,126.7767
2017-08-08,125.1801
2017-08-09,125.4527
2017-08-10,124.2455
2017-08-11,124.0702
2017-08-14,127.5945
2017-08-15,127.9937
2017-08-16,130.0576
2017-08-17,128.3052
2017-08-18,128.8017
2017-08-21,127.7405
2017-08-22,129.2398
2017-08-23,128.8796
2017-08-24,128.6557
2017-08-25,128.9185
2017-08-28,128.5875
2017-08-29,127.4193
2017-08-30,127.1856
2017-08-31,128.0618
2017-09-01,127.5653
2017-09-05,126.8546
2017-09-06,128.2857
2017-09-07,129.5173
2017-09-08,129.7328
2017-09-11,132.2303
2017-09-12,132.0442
2017-09-13,131.388
2017-09-14,131.3292
2017-09-15,131.4565
2017-09-18,131.9658
2017-09-19,133.6994
2017-09-20,135.1489
2017-09-21,135.717
2017-09-22,134.7669
2017-09-25,134.8649
2017-09-26,135.5798
2017-09-27,135.8541
2017-09-28,138.1557
2017-09-29,136.8629
2017-10-02,138.283
2017-10-03,139.5563
2017-10-04,139.4191
2017-10-05,139.4191
2017-10-06,139.0372
2017-10-09,137.9696
2017-10-10,137.7248
2017-10-11,138.2732
2017-10-12,138.949
2017-10-13,139.282
2017-10-16,138.381
2017-10-17,138.5279
2017-10-18,137.0196
2017-10-19,137.5191
2017-10-20,140.1929
2017-10-23,139.5073
2017-10-24,140.0068
2017-10-25,140.7218
2017-10-26,146.5199
2017-10-27,145.0899
2017-10-30,144.4141
2017-10-31,143.1115
2017-11-01,144.8745
2017-11-02,144.8549
2017-11-03,144.4631
2017-11-06,144.4337
2017-11-07,145.8832
2017-11-08,146.8822
2017-11-09,145.4033
2017-11-10,145.227
2017-11-13,145.0997
2017-11-14,144.5904
2017-11-15,143.1605
2017-11-16,145.9714
2017-11-17,147.5385
2017-11-20,147.7637
2017-11-21,148.2338
2017-11-22,148.5962
2017-11-24,149.7323
2017-11-27,148.9488
2017-11-28,153.1407
2017-11-29,151.9752
2017-11-30,150.7509
2017-12-01,148.7431
2017-12-04,150.2024
2017-12-05,149.9282
2017-12-06,148.0552
2017-12-07,148.6163
2017-12-08,149.0594
2017-12-11,149.8962
2017-12-12,148.9904
2017-12-13,148.9215
2017-12-14,146.8246
2017-12-15,147.2775
2017-12-18,150.9496
2017-12-19,151.7765
2017-12-20,151.619
2017-12-21,151.7076
2017-12-22,151.4516
2017-12-26,150.2407
2017-12-27,151.7962
2017-12-28,152.8791
2017-12-29,152.2786
2018-01-02,153.7652
2018-01-03,155.0548
2018-01-04,157.4865
2018-01-05,158.8647
2018-01-08,158.8057
2018-01-09,160.3513
2018-01-10,160.0953
2018-01-11,161.2669
2018-01-12,161.6016
2018-01-16,159.5834
2018-01-17,160.9223
2018-01-18,158.9927
2018-01-19,159.3668
2018-01-22,158.1264
2018-01-23,156.758
2018-01-24,158.3725
2018-01-25,160.814
2018-01-26,163.1177
2018-01-29,160.3021
2018-01-30,158.2248
2018-01-31,158.9829
2018-02-01,157.3486
2018-02-02,152.6429
2018-02-05,147.9863
2018-02-06,152.8988
2018-02-07,147.6811
2018-02-08,141.8333
2018-02-09,147.1593
2018-02-12,151.363
2018-02-13,151.4418
2018-02-14,152.6625
2018-02-15,153.3812
2018-02-16,151.2252
2018-02-20,151.2154
2018-02-21,150.3687
2018-02-22,151.2843
2018-02-23,153.204
2018-02-26,153.4107
2018-02-27,151.6092
2018-02-28,147.4251
2018-03-01,145.6235
2018-03-02,147.1101
2018-03-05,150.3687
2018-03-06,152.086
2018-03-07,153.5212
2018-03-08,156.2729
2018-03-09,158.4604
2018-03-12,159.4701
2018-03-13,158.7376
2018-03-14,155.9364
2018-03-15,154.0854
2018-03-16,152.7492
2018-03-19,148.0574
2018-03-20,148.6909
2018-03-21,150.1657
2018-03-22,144.603
2018-03-23,141.099
2018-03-26,144.6228
2018-03-27,142.6431
2018-03-28,140.713
2018-03-29,142.8312
2018-04-02,140.6536
2018-04-03,142.1779
2018-04-04,143.5438
2018-04-05,145.2166
2018-04-06,141.7226
2018-04-09,142.4847
2018-04-10,145.1968
2018-04-11,143.1281
2018-04-12,145.4245
2018-04-13,145.0385
2018-04-16,149.6609
2018-04-17,153.3431
2018-04-18,151.6901
2018-04-19,150.0173
2018-04-20,149.1462
2018-04-23,148.8295
2018-04-24,145.2859
2018-04-25,148.2257
2018-04-26,154.4022
2018-04-27,151.6703
2018-04-30,150.9675
2018-05-01,151.7396
2018-05-02,149.7005
2018-05-03,151.2842
2018-05-04,152.9966
2018-05-07,153.6796
2018-05-08,152.4324
2018-05-09,153.9271
2018-05-10,155.4514
2018-05-11,156.0255
2018-05-14,156.8371
2018-05-15,156.9658
2018-05-16,157.3815
2018-05-17,158.2328
2018-05-18,157.916
2018-05-21,158.8366
2018-05-22,157.5894
2018-05-23,157.0549
2018-05-24,155.8968
2018-05-25,155.4712
2018-05-29,151.7495
2018-05-30,154.8971
2018-05-31,154.6694
2018-06-01,156.1938
2018-06-04,155.9265
2018-06-05,157.8864
2018-06-06,161.4533
2018-06-07,158.9659
2018-06-08,159.0256
2018-06-11,159.7619
2018-06-12,160.528
2018-06-13,159.6624
2018-06-14,160.7369
2018-06-15,159.4534
2018-06-18,157.6724
2018-06-19,154.5283
2018-06-20,154.2398
2018-06-21,155.0855
2018-06-22,157.3441
2018-06-25,154.0209
2018-06-26,153.414
2018-06-27,154.7572
2018-06-28,155.8914
2018-06-29,157.354
2018-07-02,157.4834
2018-07-03,156.3889
2018-07-05,161.0653
2018-07-06,163.2144
2018-07-09,163.9805
2018-07-10,165.6322
2018-07-11,163.2343
2018-07-12,165.0551
2018-07-13,165.9605
2018-07-16,166.1993
2018-07-17,166.0202
2018-07-18,164.1994
2018-07-19,164.4282
2018-07-20,164.7466
2018-07-23,161.0852
2018-07-24,162.5179
2018-07-25,164.9755
2018-07-26,165.6123
2018-07-27,165.5924
2018-07-30,164.5078
2018-07-31,166.657
2018-08-01,164.6471
2018-08-02,163.095
2018-08-03,164.21
2018-08-06,157.96
2018-08-07,157.03
2018-08-08,157.05
2018-08-09,157.15
2018-08-10,154.79
2018-08-13,154.32
2018-08-14,155.34
2018-08-15,154.63
2018-08-16,154.53
2018-08-17,156.04
2018-08-20,158.29
2018-08-21,158.32
2018-08-22,155.02
2018-08-23,154.9
2018-08-24,156.21
2018-08-27,158.05
2018-08-28,158.35
2018-08-29,159.5
2018-08-30,157.89
2018-08-31,158.19
2018-09-04,156.18
2018-09-05,156.14
2018-09-06,156.67
2018-09-07,155.03
2018-09-10,155.87
2018-09-11,157.08
2018-09-12,156.6
2018-09-13,159.19
2018-09-14,156.99
2018-09-17,158.02
2018-09-18,158.17
2018-09-19,164.37
2018-09-20,166.21
2018-09-21,166.5
2018-09-24,164
2018-09-25,163.06
2018-09-26,162.58
2018-09-27,162.33
2018-09-28,160.73
2018-10-01,168.87
2018-10-02,169.03
2018-10-03,167.57
2018-10-04,165.83
2018-10-05,164.24
2018-10-08,164.31
2018-10-09,161.18
2018-10-10,158.01
2018-10-11,154.26
2018-10-12,156.24
2018-10-15,156.79
2018-10-16,160.67
2018-10-17,159.79
2018-10-18,161.36
2018-10-19,159.85
2018-10-22,166.88
2018-10-23,164.17
2018-10-24,161.23
2018-10-25,165
2018-10-26,164.94
2018-10-29,165.49
2018-10-30,164.5
