date,close
2016-08-17,43
2016-08-18,42.75
2016-08-19,43.5
2016-08-22,43.65
2016-08-23,45
2016-08-24,45.6
2016-08-25,45.4121
2016-08-26,45.75
2016-08-29,46.3
2016-08-30,45.15
2016-08-31,44.68
2016-09-01,43.5
2016-09-02,42.98
2016-09-06,45.45
2016-09-07,48
2016-09-08,50.31
2016-09-09,49.08
2016-09-12,49.4
2016-09-13,48.5
2016-09-14,48.35
2016-09-15,48.89
2016-09-16,48.47
2016-09-19,48.76
2016-09-20,48.73
2016-09-21,48.42
2016-09-22,48.03
2016-09-23,48.01
2016-09-26,47.89
2016-09-27,47.79
2016-09-28,47.86
2016-09-29,47.57
2016-09-30,47.8
2016-10-03,47.93
2016-10-04,47.86
2016-10-05,48.47
2016-10-06,48.39
2016-10-07,48.07
2016-10-10,47.52
2016-10-11,47.14
2016-10-12,47.11
2016-10-13,47.13
2016-10-14,47.24
2016-10-17,47.39
2016-10-18,47.68
2016-10-19,47.71
2016-10-20,47.7
2016-10-21,47.24
2016-10-24,47.94
2016-10-25,46.99
2016-10-26,46.72
2016-10-27,48.33
2016-10-28,48.87
2016-10-31,49.09
2016-11-01,48.47
2016-11-02,49
2016-11-03,48.77
2016-11-04,48.62
2016-11-07,49.52
2016-11-08,49.68
2016-11-09,49.37
2016-11-10,49.26
2016-11-11,49.15
2016-11-14,48.99
2016-11-15,50.08
2016-11-16,50.65
2016-11-17,51.8
2016-11-18,51.99
2016-11-21,52.44
2016-11-22,52.09
2016-11-23,51.54
2016-11-25,52.19
2016-11-28,52.14
2016-11-29,53.27
2016-11-30,53.56
2016-12-01,51.88
2016-12-02,52.75
2016-12-05,53.06
2016-12-06,53.37
2016-12-07,53.9
2016-12-08,53.92
2016-12-09,53.97
2016-12-12,53.9
2016-12-13,53.77
2016-12-14,54.21
2016-12-15,56.76
2016-12-16,56.44
2016-12-19,56.39
2016-12-20,57.05
2016-12-21,57.29
2016-12-22,55.84
2016-12-23,56.09
2016-12-27,56.05
2016-12-28,55.34
2016-12-29,55.26
2016-12-30,54.97
2017-01-03,54.57
2017-01-04,55
2017-01-05,55.27
2017-01-06,56.79
2017-01-09,56.49
2017-01-10,56.99
2017-01-11,57.58
2017-01-12,57.64
2017-01-13,58.17
2017-01-17,57.94
2017-01-18,58.57
2017-01-19,58.81
2017-01-20,59.26
2017-01-23,58.28
2017-01-24,59.77
2017-01-25,60.06
2017-01-26,59.61
2017-01-27,62.55
2017-01-30,62.44
2017-01-31,62.99
2017-02-01,63.1
2017-02-02,63.96
2017-02-03,64.35
2017-02-06,64.63
2017-02-07,64.86
2017-02-08,64.84
2017-02-09,65
2017-02-10,64.73
2017-02-13,64.83
2017-02-14,64.85
2017-02-15,65.12
2017-02-16,65.12
2017-02-17,64.59
2017-02-21,65.1
2017-02-22,64.77
2017-02-23,64.12
2017-02-24,64.24
2017-02-27,64.04
2017-02-28,63.49
2017-03-01,64.08
2017-03-02,63.47
2017-03-03,63.44
2017-03-06,62.71
2017-03-07,63.05
2017-03-08,63.52
2017-03-09,63.13
2017-03-10,63.48
2017-03-13,63.5
2017-03-14,63.49
2017-03-15,63.73
2017-03-16,64
2017-03-17,64.19
2017-03-20,64.07
2017-03-21,62.44
2017-03-22,62.98
2017-03-23,63.08
2017-03-24,63.37
2017-03-27,63.37
2017-03-28,63.57
2017-03-29,63.9
2017-03-30,63.99
2017-03-31,64.08
2017-04-03,63.85
2017-04-04,64.18
2017-04-05,64.02
2017-04-06,64.2
2017-04-07,64.87
2017-04-10,64.91
2017-04-11,65.11
2017-04-12,63.9
2017-04-13,63.92
2017-04-17,64.25
2017-04-18,64.39
2017-04-19,64.53
2017-04-20,64.9
2017-04-21,64.42
2017-04-24,66.18
2017-04-25,66.35
2017-04-26,67.06
2017-04-27,67.43
2017-04-28,67.11
2017-05-01,67.57
2017-05-02,66.93
2017-05-03,66.17
2017-05-04,66.32
2017-05-05,67.29
2017-05-08,67.63
2017-05-09,67.24
2017-05-10,66.98
2017-05-11,66.1
2017-05-12,64.95
2017-05-15,66.26
2017-05-16,66.54
2017-05-17,64.89
2017-05-18,64.66
2017-05-19,64.92
2017-05-22,67.38
2017-05-23,67.38
2017-05-24,68.07
2017-05-25,68.66
2017-05-26,68.8
2017-05-30,68.75
2017-05-31,69.39
2017-06-01,69.28
2017-06-02,68.25
2017-06-05,66.61
2017-06-06,67.13
2017-06-07,67.83
2017-06-08,65.1
2017-06-09,62.56
2017-06-12,62.24
2017-06-13,62.82
2017-06-14,62.17
2017-06-15,61.85
2017-06-16,62.12
2017-06-19,62.67
2017-06-20,62.23
2017-06-21,63.32
2017-06-22,63.56
2017-06-23,63.62
2017-06-26,63.45
2017-06-27,61.98
2017-06-28,62.7
2017-06-29,60.8
2017-06-30,61.11
2017-07-03,60.36
2017-07-05,60.8
2017-07-06,60.84
2017-07-07,61.51
2017-07-10,61.5
2017-07-11,61.52
2017-07-12,61.59
2017-07-13,61.3
2017-07-14,61.2
2017-07-17,62.91
2017-07-18,62.73
2017-07-19,63.63
2017-07-20,63.94
2017-07-21,63.63
2017-07-24,63.67
2017-07-25,63.71
2017-07-26,64.02
2017-07-27,63.53
2017-07-28,63.72
2017-07-31,64.27
2017-08-01,64.39
2017-08-02,63.85
2017-08-03,64.01
2017-08-04,64.39
2017-08-07,64.45
2017-08-08,64.45
2017-08-09,64.12
2017-08-10,63.17
2017-08-11,63.04
2017-08-14,67.74
2017-08-15,66.21
2017-08-16,67.22
2017-08-17,66.4
2017-08-18,66.81
2017-08-21,67.07
2017-08-22,68.71
2017-08-23,69.2
2017-08-24,69.92
2017-08-25,71.74
2017-08-28,72.8
2017-08-29,72.94
2017-08-30,74.23
2017-08-31,74.93
2017-09-01,74.76
2017-09-05,74.8
2017-09-06,74.68
2017-09-07,74.47
2017-09-08,74.26
2017-09-11,75.46
2017-09-12,76.25
2017-09-13,76.73
2017-09-14,77.36
2017-09-15,76.98
2017-09-18,76.85
2017-09-19,76.82
2017-09-20,76.83
2017-09-21,76.6
2017-09-22,77.01
2017-09-25,75.93
2017-09-26,76.12
2017-09-27,77.12
2017-09-28,77.15
2017-09-29,77.21
2017-10-02,77.94
2017-10-03,78.27
2017-10-04,78.22
2017-10-05,79.04
2017-10-06,79.04
2017-10-09,79.26
2017-10-10,79.08
2017-10-11,79.36
2017-10-12,80.29
2017-10-13,80.68
2017-10-16,81.1
2017-10-17,80.99
2017-10-18,81.35
2017-10-19,81.64
2017-10-20,82.24
2017-10-23,82.71
2017-10-24,83.25
2017-10-25,82.63
2017-10-26,82.97
2017-10-27,83.88
2017-10-30,83.15
2017-10-31,82.77
2017-11-01,82.4
2017-11-02,81.86
2017-11-03,80.87
2017-11-06,81.52
2017-11-07,82.48
2017-11-08,82.31
2017-11-09,81.88
2017-11-10,82.58
2017-11-13,81.81
2017-11-14,81.49
2017-11-15,80.27
2017-11-16,81.33
2017-11-17,81.49
2017-11-20,81.26
2017-11-21,82.23
2017-11-22,80.79
2017-11-24,80.95
2017-11-27,81.91
2017-11-28,82.56
2017-11-29,77.99
2017-11-30,78.24
2017-12-01,79.96
2017-12-04,74.89
2017-12-05,74.47
2017-12-06,75.06
2017-12-07,75.89
2017-12-08,77.25
2017-12-11,79.29
2017-12-12,79.25
2017-12-13,80.19
2017-12-14,79.76
2017-12-15,80.99
2017-12-18,84.77
2017-12-19,83.34
2017-12-20,83.35
2017-12-21,82.54
2017-12-22,82.08
2017-12-26,81.38
2017-12-27,81.26
2017-12-28,81.03
2017-12-29,81.28
2018-01-02,82.43
2018-01-03,83.3
2018-01-04,84.78
2018-01-05,85.4
2018-01-08,85.38
2018-01-09,84.28
2018-01-10,84.61
2018-01-11,86.83
2018-01-12,86.75
2018-01-16,86.09
2018-01-17,88.11
2018-01-18,88.39
2018-01-19,88.49
2018-01-22,88.93
2018-01-23,89.11
2018-01-24,88.37
2018-01-25,88.44
2018-01-26,82.74
2018-01-29,74.8
2018-01-30,70.08
2018-01-31,71.7
2018-02-01,70.25
2018-02-02,70.9
2018-02-05,67.58
2018-02-06,67.23
2018-02-07,66.77
2018-02-08,65.62
2018-02-09,67.3
2018-02-12,68.03
2018-02-13,68.3
2018-02-14,69.87
2018-02-15,69.03
2018-02-16,69.79
2018-02-20,69.82
2018-02-21,69.92
2018-02-22,70.56
2018-02-23,71.78
2018-02-26,72.39
2018-02-27,72.74
2018-02-28,74.29
2018-03-01,75.37
2018-03-02,73.66
2018-03-05,74
2018-03-06,75.6
2018-03-07,77.3
2018-03-08,77.42
2018-03-09,78.48
2018-03-12,77.78
2018-03-13,77.34
2018-03-14,77.82
2018-03-15,77.62
2018-03-16,77.96
2018-03-19,77.97
2018-03-20,78.24
2018-03-21,76
2018-03-22,74.46
2018-03-23,73.14
2018-03-26,75.13
2018-03-27,73.68
2018-03-28,72.1
2018-03-29,73.21
2018-04-02,72.56
2018-04-03,72.82
2018-04-04,72.97
2018-04-05,72.81
2018-04-06,71.29
2018-04-09,71.9
2018-04-10,72.79
2018-04-11,71.93
2018-04-12,72.68
2018-04-13,72.9
2018-04-16,74.35
2018-04-17,75.39
2018-04-18,75.79
2018-04-19,73.9
2018-04-20,72.67
2018-04-23,73.09
2018-04-24,72.43
2018-04-25,71.78
2018-04-26,72.97
2018-04-27,72.62
2018-04-30,71.77
2018-05-01,71.41
2018-05-02,70.7
2018-05-03,71.2
2018-05-04,72.95
2018-05-07,72.49
2018-05-08,72.01
2018-05-09,72.72
2018-05-10,74.69
2018-05-11,74.32
2018-05-14,73.66
2018-05-15,73.92
2018-05-16,74.22
2018-05-17,74.32
2018-05-18,78.81
2018-05-21,80.47
2018-05-22,80.77
2018-05-23,81.89
2018-05-24,82.67
2018-05-25,82.02
2018-05-29,80.55
2018-05-30,81.04
2018-05-31,80.66
2018-06-01,84.85
2018-06-04,85.03
2018-06-05,86.65
2018-06-06,87.35
2018-06-07,88.06
2018-06-08,88.33
2018-06-11,87.64
2018-06-12,86.71
2018-06-13,87.91
2018-06-14,87.91
2018-06-15,88.39
2018-06-18,89.57
2018-06-19,89
2018-06-20,89.2
2018-06-21,89.09
2018-06-22,88.78
2018-06-25,85.96
2018-06-26,86.46
2018-06-27,84
2018-06-28,85.27
2018-06-29,84.58
2018-07-02,92.2
2018-07-03,94.83
2018-07-05,93.85
2018-07-06,93.34
2018-07-09,93.63
2018-07-10,94.37
2018-07-11,94.09
2018-07-12,95.12
2018-07-13,94.9
2018-07-16,94.78
2018-07-17,94.86
2018-07-18,95.07
2018-07-19,94.74
2018-07-20,94.32
2018-07-23,93.62
2018-07-24,93.1
2018-07-25,93.8
2018-07-26,94.4
2018-07-27,93.67
2018-07-30,92.71
2018-07-31,92.52
2018-08-01,92.72
2018-08-02,93.04
2018-08-03,93.09
2018-08-06,93.44
2018-08-07,93.7
2018-08-08,94.15
2018-08-09,94.73
2018-08-10,94.53
2018-08-13,94
2018-08-14,94.86
2018-08-15,94.68
2018-08-16,95.58
2018-08-17,95.01
2018-08-20,95.03
2018-08-21,95.1
2018-08-22,95.73
2018-08-23,95.31
2018-08-24,95.34
2018-08-27,95.41
2018-08-28,95.26
2018-08-29,96.07
2018-08-30,96.63
2018-08-31,96.17
2018-09-04,96.15
2018-09-05,95.69
2018-09-06,95.88
2018-09-07,96.26
2018-09-10,96.85
2018-09-11,96.7
2018-09-12,97.23
2018-09-13,97.35
2018-09-14,98.65
2018-09-17,97.32
2018-09-18,96.38
2018-09-19,95.46
2018-09-20,95.96
2018-09-21,96.2
2018-09-24,96.2
2018-09-25,96.95
2018-09-26,96.61
2018-09-27,97.25
2018-09-28,97.12
2018-10-01,96.71
2018-10-02,96.76
2018-10-03,96.61
2018-10-04,96.69
2018-10-05,96.96
2018-10-08,95.55
2018-10-09,94.58
2018-10-10,92.47
2018-10-11,91.74
2018-10-12,94.5
2018-10-15,95
2018-10-16,95.66
2018-10-17,95.1
2018-10-18,94.49
2018-10-19,93.78
2018-10-22,94.71
2018-10-23,92.87
2018-10-24,89.85
2018-10-25,90.85
2018-10-26,88.47
2018-10-29,86.76
2018-10-30,88.68
2018-10-31,90.39
2018-11-01,91.16
2018-11-02,91.18
2018-11-05,91.71
2018-11-06,92.1
2018-11-07,97.86
2018-11-08,98.92
2018-11-09,98.05
2018-11-12,98.5
2018-11-13,101.57
2018-11-14,105.69
2018-11-15,105.06
2018-11-16,104.47
2018-11-19,103.3
2018-11-20,102.64
2018-11-21,102.99
2018-11-23,103.92
2018-11-26,105.63
2018-11-27,104.66
2018-11-28,106.6
2018-11-29,106
2018-11-30,105.48
2018-12-03,105.53
2018-12-04,104.46
2018-12-06,105.61
2018-12-07,104
2018-12-10,104.11
2018-12-11,104.73
2018-12-12,105.01
2018-12-13,105.5
2018-12-14,105.79
2018-12-17,105.08
2018-12-18,105.86
2018-12-19,104.85
2018-12-20,103.41
2018-12-21,102.73
2018-12-24,80.5
2018-12-26,81.13
2018-12-27,80
