date,close
2014-06-13,24.72
2014-06-16,24.67
2014-06-17,24.76
2014-06-18,24.74
2014-06-19,24.93
2014-06-20,25.05
2014-06-23,24.65
2014-06-24,24.435
2014-06-25,24.75
2014-06-26,24.82
2014-06-27,25.23
2014-06-30,25.33
2014-07-01,26.15
2014-07-02,26.15
2014-07-03,27.16
2014-07-07,26.99
2014-07-08,26.8
2014-07-09,25.15
2014-07-10,24.86
2014-07-11,24.97
2014-07-14,25.2
2014-07-15,25.12
2014-07-16,25.32
2014-07-17,25.29
2014-07-18,25.44
2014-07-21,25.22
2014-07-22,25.15
2014-07-23,25.19
2014-07-24,25.07
2014-07-25,24.93
2014-07-28,25.06
2014-07-29,25
2014-07-30,25.16
2014-07-31,24.81
2014-08-01,25.11
2014-08-04,25.04
2014-08-05,25.44
2014-08-06,25.78
2014-08-07,24.5
2014-08-08,23.21
2014-08-11,23.35
2014-08-12,23.13
2014-08-13,22.94
2014-08-14,23.14
2014-08-15,23.44
2014-08-18,23.88
2014-08-19,23.6
2014-08-20,23.47
2014-08-21,23.63
2014-08-22,23.32
2014-08-25,23.31
2014-08-26,23.64
2014-08-27,23.39
2014-08-28,23.36
2014-08-29,23.38
2014-09-02,23.52
2014-09-03,23.42
2014-09-04,23.24
2014-09-05,23.54
2014-09-08,23.99
2014-09-09,23.73
2014-09-10,23.85
2014-09-11,23.96
2014-09-12,23.8
2014-09-15,24.25
2014-09-16,24
2014-09-17,24.84
2014-09-18,25.17
2014-09-19,24.93
2014-09-22,24.97
2014-09-23,24.61
2014-09-24,24.88
2014-09-25,24.7
2014-09-26,24.93
2014-09-29,24.64
2014-09-30,24.08
2014-10-01,23.69
2014-10-02,23.69
2014-10-03,23.71
2014-10-06,23.72
2014-10-07,23.35
2014-10-08,23.59
2014-10-09,23.4
2014-10-10,23.38
2014-10-13,23.54
2014-10-14,23.43
2014-10-15,23.76
2014-10-16,24.56
2014-10-17,24.36
2014-10-20,24.17
2014-10-21,24.43
2014-10-22,23.9
2014-10-23,24.34
2014-10-24,24.45
2014-10-27,24.42
2014-10-28,25.19
2014-10-29,25.2
2014-10-30,25.29
2014-10-31,25.94
2014-11-03,25.86
2014-11-04,25.94
2014-11-05,26
2014-11-06,26.8
2014-11-07,26.75
2014-11-10,27.51
2014-11-11,26.91
2014-11-12,27.31
2014-11-13,26.74
2014-11-14,26.89
2014-11-17,26.2
2014-11-18,26.13
2014-11-19,26.17
2014-11-20,26.76
2014-11-21,26.76
2014-11-24,26.75
2014-11-25,26.97
2014-11-26,26.6
2014-11-28,25.95
2014-12-01,25.93
2014-12-02,26.32
2014-12-03,27.21
2014-12-04,27.09
2014-12-05,27.23
2014-12-08,26.28
2014-12-09,26.28
2014-12-10,26.02
2014-12-11,25.89
2014-12-12,25.59
2014-12-15,25.63
2014-12-16,25.62
2014-12-17,26.59
2014-12-18,26.8
2014-12-19,26.8
2014-12-22,26.93
2014-12-23,27.43
2014-12-24,27.5
2014-12-26,27.81
2014-12-29,27.55
2014-12-30,27.7
2014-12-31,27.4
2015-01-02,26.73
2015-01-05,26.31
2015-01-06,25.79
2015-01-07,26.015
2015-01-08,26.38
2015-01-09,25.68
2015-01-12,25.38
2015-01-13,25.15
2015-01-14,25.11
2015-01-15,24.68
2015-01-16,25.56
2015-01-20,25.15
2015-01-21,25.36
2015-01-22,25.7
2015-01-23,25.69
2015-01-26,25.52
2015-01-27,25.6
2015-01-28,25.29
2015-01-29,25.63
2015-01-30,25.03
2015-02-02,25.79
2015-02-03,26.52
2015-02-04,26.05
2015-02-05,26.67
2015-02-06,26.69
2015-02-09,26.39
2015-02-10,26.19
2015-02-11,26.04
2015-02-12,26.38
2015-02-13,26.52
2015-02-17,26.45
2015-02-18,26.5
2015-02-19,26.51
2015-02-20,26.24
2015-02-23,26.53
2015-02-24,26.74
2015-02-25,26.91
2015-02-26,27.03
2015-02-27,27.64
2015-03-02,27.83
2015-03-03,27.55
2015-03-04,27.06
2015-03-05,26.98
2015-03-06,26.47
2015-03-09,26.49
2015-03-10,26.01
2015-03-11,26.63
2015-03-12,29.1
2015-03-13,29.29
2015-03-16,29.32
2015-03-17,29.17
2015-03-18,29.69
2015-03-19,29.61
2015-03-20,29.46
2015-03-23,30.42
2015-03-24,30.16
2015-03-25,31.42
2015-03-26,31.7
2015-03-27,31.2
2015-03-30,31.91
2015-03-31,31.34
2015-04-01,31
2015-04-02,31.24
2015-04-06,30.67
2015-04-07,30.75
2015-04-08,30.95
2015-04-09,30.43
2015-04-10,30.89
2015-04-13,31.04
2015-04-14,31.15
2015-04-15,31.71
2015-04-16,30.94
2015-04-17,30.4
2015-04-20,29.7
2015-04-21,30.31
2015-04-22,30.3
2015-04-23,30.19
2015-04-24,30.54
2015-04-27,30.4
2015-04-28,30.93
2015-04-29,30.49
2015-04-30,29.32
2015-05-01,29.71
2015-05-04,29.55
2015-05-05,29.18
2015-05-06,29.49
2015-05-07,29.3
2015-05-08,30.04
2015-05-11,30.02
2015-05-12,29.47
2015-05-13,29.77
2015-05-14,30.16
2015-05-15,29.83
2015-05-18,29.98
2015-05-19,29.68
2015-05-20,29.81
2015-05-21,29.87
2015-05-22,29.4
2015-05-26,29.09
2015-05-27,29.7
2015-05-28,29.71
2015-05-29,29.6
2015-06-01,29.65
2015-06-02,29.92
2015-06-03,30.9
2015-06-04,30.5
2015-06-05,30.48
2015-06-08,29.93
2015-06-09,29.77
2015-06-10,30.38
2015-06-11,30.48
2015-06-12,30.14
2015-06-15,29.41
2015-06-16,29.31
2015-06-17,28.97
2015-06-18,29.34
2015-06-19,29.3
2015-06-22,29.39
2015-06-23,29.34
2015-06-24,29.29
2015-06-25,29.24
2015-06-26,29.23
2015-06-29,30.96
2015-06-30,30.96
2015-07-01,31.52
2015-07-02,30.61
2015-07-06,30.65
2015-07-07,30.57
2015-07-08,30.32
2015-07-09,30.38
2015-07-10,30.83
2015-07-13,31.06
2015-07-14,31.4
2015-07-15,30.86
2015-07-16,30.89
2015-07-17,31.11
2015-07-20,31.2
2015-07-21,31.37
2015-07-22,31.22
2015-07-23,30.25
2015-07-24,29.01
2015-07-27,29.04
2015-07-28,29.4
2015-07-29,29.56
2015-07-30,29.57
2015-07-31,30.04
2015-08-03,30.34
2015-08-04,30.36
2015-08-05,28.95
2015-08-06,29.8
2015-08-07,29.27
2015-08-10,29.21
2015-08-11,29.06
2015-08-12,29.24
2015-08-13,29.4
2015-08-14,29.54
2015-08-17,29.49
2015-08-18,29.19
2015-08-19,29.15
2015-08-20,28.85
2015-08-21,28.57
2015-08-24,27.2
2015-08-25,26.84
2015-08-26,27.49
2015-08-27,27.6
2015-08-28,28.25
2015-08-31,28.69
2015-09-01,28.15
2015-09-02,27.72
2015-09-03,28.26
2015-09-04,27.84
2015-09-08,27.9
2015-09-09,27.61
2015-09-10,27.49
2015-09-11,27.17
2015-09-14,27.01
2015-09-15,26.85
2015-09-16,27.14
2015-09-17,27.35
2015-09-18,26.6
2015-09-21,26.57
2015-09-22,26.01
2015-09-23,26.02
2015-09-24,25.91
2015-09-25,25.77
2015-09-28,25.95
2015-09-29,26.04
2015-09-30,26.2
2015-10-01,25.72
2015-10-02,24.28
2015-10-05,25.36
2015-10-06,25.51
2015-10-07,25.73
2015-10-08,26.67
2015-10-09,27.15
2015-10-12,27.25
2015-10-13,27.06
2015-10-14,26.57
2015-10-15,27.42
2015-10-16,23.04
2015-10-19,22.57
2015-10-20,21.94
2015-10-21,21.14
2015-10-22,21.87
2015-10-23,21.94
2015-10-26,22.01
2015-10-27,21.38
2015-10-28,21.97
2015-10-29,22.24
2015-10-30,22.5
2015-11-02,23.11
2015-11-03,22.89
2015-11-04,22.6
2015-11-05,20.25
2015-11-06,19.41
2015-11-09,19.42
2015-11-10,19.42
2015-11-11,19.88
2015-11-12,19.56
2015-11-13,19.62
2015-11-16,19.89
2015-11-17,19.5
2015-11-18,19.39
2015-11-19,19.69
2015-11-20,19.47
2015-11-23,19.71
2015-11-24,20.24
2015-11-25,20.57
2015-11-27,20.69
2015-11-30,21.2
2015-12-01,21.25
2015-12-02,21.14
2015-12-03,20.77
2015-12-04,20.71
2015-12-07,19.4
2015-12-08,18.88
2015-12-09,18.22
2015-12-10,19.69
2015-12-11,19.76
2015-12-14,19.71
2015-12-15,19.69
2015-12-16,20.01
2015-12-17,20.07
2015-12-18,20.28
2015-12-21,20.19
2015-12-22,20.35
2015-12-23,21.08
2015-12-24,20.72
2015-12-28,20.64
2015-12-29,21.18
2015-12-30,20.85
2015-12-31,20.61
2016-01-04,20.36
2016-01-05,20.08
2016-01-06,20.4
2016-01-07,19.84
2016-01-08,19.16
2016-01-11,19.27
2016-01-12,19.09
2016-01-13,18.66
2016-01-14,19
2016-01-15,18.79
2016-01-19,18.66
2016-01-20,19.46
2016-01-21,19
2016-01-22,19.38
2016-01-25,18.43
2016-01-26,18.88
2016-01-27,18.51
2016-01-28,18.73
2016-01-29,20.01
2016-02-01,19.51
2016-02-02,19.41
2016-02-03,19.36
2016-02-04,19.32
2016-02-05,18.82
2016-02-08,18.49
2016-02-09,18.22
2016-02-10,19.22
2016-02-11,20.07
2016-02-12,20.28
2016-02-16,20.81
2016-02-17,20.47
2016-02-18,20.63
2016-02-19,20.63
2016-02-22,20.8
2016-02-23,21.48
2016-02-24,21.8
2016-02-25,21.75
2016-02-26,21.75
2016-02-29,22.43
2016-03-01,22.86
2016-03-02,23.35
2016-03-03,23.29
2016-03-04,24.68
2016-03-07,25.33
2016-03-08,24.91
2016-03-09,24.88
2016-03-10,24.9
2016-03-11,25.05
2016-03-14,25.15
2016-03-15,24.74
2016-03-16,25.11
2016-03-17,25.26
2016-03-18,25.22
2016-03-21,25.19
2016-03-22,25.31
2016-03-23,24.91
2016-03-24,24.5
2016-03-28,24.94
2016-03-29,24.64
2016-03-30,25.15
2016-03-31,25.11
2016-04-01,24.85
2016-04-04,24.47
2016-04-05,24.1
2016-04-06,24.26
2016-04-07,24.13
2016-04-08,24.55
2016-04-11,24.27
2016-04-12,24.84
2016-04-13,25.2
2016-04-14,25.08
2016-04-15,25.23
2016-04-18,25.71
2016-04-19,26.3
2016-04-20,25.66
2016-04-21,25.62
2016-04-22,25.6
2016-04-25,24.7
2016-04-26,25.22
2016-04-27,25.6
2016-04-28,25.23
2016-04-29,25.51
2016-05-02,25.64
2016-05-03,25.67
2016-05-04,25.7
2016-05-05,23.33
2016-05-06,24.01
2016-05-09,24
2016-05-10,24.065
2016-05-11,24.19
2016-05-12,24.02
2016-05-13,23.44
2016-05-16,23.68
2016-05-17,23.03
2016-05-18,23.21
2016-05-19,22.83
2016-05-20,23.38
2016-05-23,23.41
2016-05-24,23.62
2016-05-25,24.03
2016-05-26,23.93
2016-05-27,23.99
2016-05-31,24.19
2016-06-01,24.32
2016-06-02,24.2
2016-06-03,24.16
2016-06-06,24.64
2016-06-07,24.56
2016-06-08,24.95
2016-06-09,24.59
2016-06-10,24.1
2016-06-13,23.69
2016-06-14,23.88
2016-06-15,24.03
2016-06-16,23.98
2016-06-17,24.27
2016-06-20,24.05
2016-06-21,23.88
2016-06-22,24.18
2016-06-23,24.88
2016-06-24,23.35
2016-06-27,22.71
2016-06-28,22.89
2016-06-29,23.37
2016-06-30,24.08
2016-07-01,24.15
2016-07-05,23.99
2016-07-06,24.05
2016-07-07,24.42
2016-07-08,24.96
2016-07-11,25.35
2016-07-12,25.55
2016-07-13,25.75
2016-07-14,25.48
2016-07-15,25.53
2016-07-18,25.4
2016-07-19,25.05
2016-07-20,25.14
2016-07-21,24.96
2016-07-22,24.65
2016-07-25,24.51
2016-07-26,24.54
2016-07-27,24.73
2016-07-28,24.79
2016-07-29,24.67
2016-08-01,24.87
2016-08-02,24.77
2016-08-03,24.9
2016-08-04,26.24
2016-08-05,27.5
2016-08-08,27.6
2016-08-09,28.18
2016-08-10,28.06
2016-08-11,28.01
2016-08-12,27.8
2016-08-15,28.35
2016-08-16,28.31
2016-08-17,28.32
2016-08-18,28.77
2016-08-19,29.02
2016-08-22,29.19
2016-08-23,29.34
2016-08-24,29.47
2016-08-25,29.38
2016-08-26,28.94
2016-08-29,28.94
2016-08-30,29.13
2016-08-31,29
2016-09-01,29.25
2016-09-02,29.52
2016-09-06,29.35
2016-09-07,29.54
2016-09-08,29.49
2016-09-09,28.39
2016-09-12,28.38
2016-09-13,27.78
2016-09-14,27.65
2016-09-15,28.24
2016-09-16,28.02
2016-09-19,28.29
2016-09-20,29
2016-09-21,29.47
2016-09-22,29.79
2016-09-23,29.29
2016-09-26,29.2
2016-09-27,29.52
2016-09-28,30.09
2016-09-29,29.63
2016-09-30,30.1
2016-10-03,30.29
2016-10-04,30.49
2016-10-05,30.49
2016-10-06,30.76
2016-10-07,30.36
2016-10-10,30.5
2016-10-11,29.96
2016-10-12,29.92
2016-10-13,29.53
2016-10-14,29.53
2016-10-17,29.61
2016-10-18,29.81
2016-10-19,29.8
2016-10-20,29.6
2016-10-21,29.65
2016-10-24,29.81
2016-10-25,29.44
2016-10-26,29.08
2016-10-27,29.2
2016-10-28,29.46
2016-10-31,29.84
2016-11-01,29.26
2016-11-02,28.475
2016-11-03,31.01
2016-11-04,30.34
2016-11-07,31.67
2016-11-08,31.37
2016-11-09,32.69
2016-11-10,34.81
2016-11-11,35.99
2016-11-14,36.28
2016-11-15,36.79
2016-11-16,37.24
2016-11-17,37.06
2016-11-18,36.84
2016-11-21,36.23
2016-11-22,37.27
2016-11-23,38.04
2016-11-25,37.8
2016-11-28,37.46
2016-11-29,38.03
2016-11-30,37.46
2016-12-01,38.32
2016-12-02,37.87
2016-12-05,38.06
2016-12-06,38.13
2016-12-07,38.71
2016-12-08,39.41
2016-12-09,39.68
2016-12-12,38.74
2016-12-13,38.36
2016-12-14,37.87
2016-12-15,38.08
2016-12-16,37.06
2016-12-19,37.93
2016-12-20,39.09
2016-12-21,38.78
2016-12-22,38.33
2016-12-23,38.77
2016-12-27,39.05
2016-12-28,38.23
2016-12-29,38.45
2016-12-30,37.68
2017-01-03,38.18
2017-01-04,39.1
2017-01-05,38.2
2017-01-06,37.86
2017-01-09,36.94
2017-01-10,37.55
2017-01-11,37.79
2017-01-12,37.16
2017-01-13,37.74
2017-01-17,36.67
2017-01-18,36.89
2017-01-19,36.84
2017-01-20,37.28
2017-01-23,36.65
2017-01-24,38.33
2017-01-25,39.95
2017-01-26,39.6
2017-01-27,39.15
2017-01-30,38.54
2017-01-31,38.47
2017-02-01,39.11
2017-02-02,38.51
2017-02-03,38.78
2017-02-06,38.77
2017-02-07,39.01
2017-02-08,38.1
2017-02-09,38.48
2017-02-10,39.2
2017-02-13,39.41
2017-02-14,39.2
2017-02-15,39.26
2017-02-16,39.59
2017-02-17,38.56
2017-02-21,39.55
2017-02-22,39.41
2017-02-23,38.35
2017-02-24,39.22
2017-02-27,39.16
2017-02-28,37.51
2017-03-01,39.43
2017-03-02,38.69
2017-03-03,38.87
2017-03-06,37.89
2017-03-07,38.06
2017-03-08,37.69
2017-03-09,37.09
2017-03-10,41.94
2017-03-13,41.51
2017-03-14,40.44
2017-03-15,41.24
2017-03-16,40.87
2017-03-17,40.68
2017-03-20,40.58
2017-03-21,39.7
2017-03-22,39.25
2017-03-23,39.52
2017-03-24,38.7
2017-03-27,39.66
2017-03-28,40.22
2017-03-29,40.57
2017-03-30,40.86
2017-03-31,41
2017-04-03,40.23
2017-04-04,40.98
2017-04-05,40.15
2017-04-06,40.81
2017-04-07,40.78
2017-04-10,40.75
2017-04-11,41.73
2017-04-12,40.48
2017-04-13,40.27
2017-04-17,40.77
2017-04-18,41.06
2017-04-19,40.83
2017-04-20,40.8
2017-04-21,41.17
2017-04-24,42.14
2017-04-25,42.64
2017-04-26,43.24
2017-04-27,43.02
2017-04-28,42.26
2017-05-01,42.43
2017-05-02,42.03
2017-05-03,41.42
2017-05-04,33.5
2017-05-05,35.2
2017-05-08,34.19
2017-05-09,33.17
2017-05-10,31.73
2017-05-11,31.5
2017-05-12,30.93
2017-05-15,29.98
2017-05-16,29.2
2017-05-17,28.09
2017-05-18,28.215
2017-05-19,28.34
2017-05-22,28.23
2017-05-23,28.57
2017-05-24,29.28
2017-05-25,29.17
2017-05-26,29.68
2017-05-30,28.75
2017-05-31,29.36
2017-06-01,29.49
2017-06-02,29.63
2017-06-05,29.46
2017-06-06,29.53
2017-06-07,30.05
2017-06-08,30.74
2017-06-09,31.27
2017-06-12,31.57
2017-06-13,31.19
2017-06-14,31.33
2017-06-15,31.19
2017-06-16,31.2
2017-06-19,30.96
2017-06-20,30.23
2017-06-21,30.46
2017-06-22,30.54
2017-06-23,30.74
2017-06-26,30.95
2017-06-27,30.865
2017-06-28,31.14
2017-06-29,30.54
2017-06-30,31.02
2017-07-03,31.31
2017-07-05,31.18
2017-07-06,30.33
2017-07-07,31.13
2017-07-10,30.48
2017-07-11,30.1
2017-07-12,30.66
2017-07-13,30.96
2017-07-14,30.63
2017-07-17,30.98
2017-07-18,30.72
2017-07-19,31.36
2017-07-20,31.58
2017-07-21,31.3
2017-07-24,31.53
2017-07-25,31.56
2017-07-26,31.62
2017-07-27,31.86
2017-07-28,31.78
2017-07-31,31.81
2017-08-01,31.97
2017-08-02,31.53
2017-08-03,26.02
2017-08-04,26.29
2017-08-07,26.47
2017-08-08,26.01
2017-08-09,25.81
2017-08-10,24.92
2017-08-11,25.14
2017-08-14,25.1
2017-08-15,24.3
2017-08-16,23.58
2017-08-17,23.19
2017-08-18,23.24
2017-08-21,23.12
2017-08-22,23.12
2017-08-23,23.43
2017-08-24,23.62
2017-08-25,23.89
2017-08-28,24.27
2017-08-29,25.06
2017-08-30,25.25
2017-08-31,25.81
2017-09-01,25.66
2017-09-05,25.76
2017-09-06,25.65
2017-09-07,24.31
2017-09-08,26.02
2017-09-11,25.95
2017-09-12,26.96
2017-09-13,26.75
2017-09-14,26.93
2017-09-15,26.91
2017-09-18,26.82
2017-09-19,26.75
2017-09-20,26.81
2017-09-21,26.77
2017-09-22,27.31
2017-09-25,27.55
2017-09-26,28.03
2017-09-27,28.97
2017-09-28,28.9
2017-09-29,29.14
2017-10-02,29.57
2017-10-03,29.72
2017-10-04,29.6
2017-10-05,30
2017-10-06,29.63
2017-10-09,29.97
2017-10-10,30.3
2017-10-11,30.24
2017-10-12,30.24
2017-10-13,30.45
2017-10-16,30.57
2017-10-17,30.53
2017-10-18,30.92
2017-10-19,30.49
2017-10-20,30.5
2017-10-23,30.45
2017-10-24,30.61
2017-10-25,30.75
2017-10-26,31.24
2017-10-27,31.84
2017-10-30,31.23
2017-10-31,31.89
2017-11-01,31.36
2017-11-02,30.16
2017-11-03,31.91
2017-11-06,33.44
2017-11-07,33.19
2017-11-08,33.23
2017-11-09,34.78
2017-11-10,33.59
2017-11-13,32.98
2017-11-14,32.47
2017-11-15,32.18
2017-11-16,33.47
2017-11-17,33.78
2017-11-20,34.53
2017-11-21,35.01
2017-11-22,34.88
2017-11-24,34.72
2017-11-27,34.89
2017-11-28,35.93
2017-11-29,36.42
2017-11-30,35.56
2017-12-01,35.19
2017-12-04,35.36
2017-12-05,34.95
2017-12-06,35.46
2017-12-07,35.63
2017-12-08,36.04
2017-12-11,36.67
2017-12-12,35.86
2017-12-13,35.68
2017-12-14,34.76
2017-12-15,35.21
2017-12-18,35.75
2017-12-19,35.4
2017-12-20,35.65
2017-12-21,35.74
2017-12-22,35.64
2017-12-26,35.77
2017-12-27,35.74
2017-12-28,35.81
2017-12-29,35.73
2018-01-02,35.75
2018-01-03,34.82
2018-01-04,35.25
2018-01-05,34.91
2018-01-08,34.62
2018-01-09,34.51
2018-01-10,33.93
2018-01-11,35.34
2018-01-12,35.77
2018-01-16,34.56
2018-01-17,35.06
2018-01-18,34.68
2018-01-19,35.24
2018-01-22,34.9
2018-01-23,34.47
2018-01-24,34.25
2018-01-25,34.47
2018-01-26,34.51
2018-01-29,34.33
2018-01-30,34.17
2018-01-31,33.88
2018-02-01,34.32
2018-02-02,33.47
2018-02-05,32.31
2018-02-06,32.89
2018-02-07,33.47
2018-02-08,33.06
2018-02-09,33.47
2018-02-12,33.25
2018-02-13,33.62
2018-02-14,33.86
2018-02-15,33.89
2018-02-16,33.86
2018-02-20,33.35
2018-02-21,33.46
2018-02-22,33.7
2018-02-23,33.54
2018-02-26,33.89
2018-02-27,33.18
2018-02-28,32.35
2018-03-01,32.47
2018-03-02,32.58
2018-03-05,32.92
2018-03-06,33.21
2018-03-07,34.51
2018-03-08,37.01
2018-03-09,36.78
2018-03-12,36.31
2018-03-13,36.45
2018-03-14,35.65
2018-03-15,35.18
2018-03-16,35.2
2018-03-19,34.93
2018-03-20,34.36
2018-03-21,34.23
2018-03-22,32.71
2018-03-23,30.14
2018-03-26,31.32
2018-03-27,30.61
2018-03-28,30.41
2018-03-29,30.82
2018-04-02,30.5
2018-04-03,30.6
2018-04-04,31.12
2018-04-05,31.39
2018-04-06,30.58
2018-04-09,30.51
2018-04-10,31.27
2018-04-11,31.35
2018-04-12,31.38
2018-04-13,30.94
2018-04-16,31.1
2018-04-17,31.39
2018-04-18,31.63
2018-04-19,31.13
2018-04-20,30.82
2018-04-23,30.94
2018-04-24,30.62
2018-04-25,30.77
2018-04-26,30.21
2018-04-27,30.29
2018-04-30,30
2018-05-01,30.52
2018-05-02,30.37
2018-05-03,35.74
2018-05-04,36.42
2018-05-07,37.37
2018-05-08,38.61
2018-05-09,38.24
2018-05-10,38.32
2018-05-11,38.14
2018-05-14,37.97
2018-05-15,38.33
2018-05-16,38.74
2018-05-17,38.43
2018-05-18,38.71
2018-05-21,39.34
2018-05-22,38.9
2018-05-23,38.36
2018-05-24,38.17
2018-05-25,38.43
2018-05-29,38.7
2018-05-30,39.45
2018-05-31,39.04
2018-06-01,39.52
2018-06-04,40.03
2018-06-05,40.35
2018-06-06,40.43
2018-06-07,39.81
2018-06-08,39.13
2018-06-11,38.53
2018-06-12,38.1
2018-06-13,37.8
2018-06-14,36.58
2018-06-15,36.49
2018-06-18,37.06
2018-06-19,37.41
2018-06-20,36.34
2018-06-21,35.98
2018-06-22,36.28
2018-06-25,36.16
2018-06-26,36.02
2018-06-27,35.52
2018-06-28,35.11
2018-06-29,35.46
2018-07-02,36.06
2018-07-03,35.97
2018-07-05,37.32
2018-07-06,38.1
2018-07-09,37.88
2018-07-10,38.28
2018-07-11,38.08
2018-07-12,38.52
2018-07-13,38.65
2018-07-16,38.02
2018-07-17,38.34
2018-07-18,37.77
2018-07-19,37.82
2018-07-20,38.36
2018-07-23,37.23
2018-07-24,36.25
2018-07-25,35.77
2018-07-26,36.89
2018-07-27,37.04
2018-07-30,36.12
2018-07-31,36.89
2018-08-01,36.79
2018-08-02,39.36
2018-08-03,35.105
2018-08-06,36.17
2018-08-07,36.22
2018-08-08,36.42
2018-08-09,36.1
2018-08-10,35.93
2018-08-13,34.72
2018-08-14,35.08
2018-08-15,33.88
2018-08-16,34.18
2018-08-17,34.8
2018-08-20,34.81
2018-08-21,34.71
2018-08-22,34.78
2018-08-23,35.12
2018-08-24,35.06
2018-08-27,34.69
2018-08-28,34.76
2018-08-29,35.17
2018-08-30,34.7
2018-08-31,34.77
2018-09-04,34.64
2018-09-05,34.54
2018-09-06,33.95
2018-09-07,33.21
2018-09-10,33.33
2018-09-11,33.01
2018-09-12,33.11
2018-09-13,32.32
2018-09-14,32.46
2018-09-17,32.03
2018-09-18,31.74
2018-09-19,31.52
2018-09-20,32.46
2018-09-21,32.76
2018-09-24,31.91
2018-09-25,31.76
2018-09-26,31.62
2018-09-27,32.05
2018-09-28,32.64
2018-10-01,32.46
2018-10-02,32.77
2018-10-03,33
2018-10-04,32.68
2018-10-05,32.83
2018-10-08,33.45
2018-10-09,33.77
2018-10-10,33.42
2018-10-11,32.61
2018-10-12,31.98
2018-10-15,32.11
2018-10-16,33.32
2018-10-17,32.44
2018-10-18,32.4
2018-10-19,32.7
2018-10-22,32.8
2018-10-23,32.26
2018-10-24,30.74
2018-10-25,31.99
2018-10-26,32.25
2018-10-29,32.82
2018-10-30,34.03
2018-10-31,33.39
2018-11-01,33.76
2018-11-02,33.12
2018-11-05,34.16
2018-11-06,34.18
2018-11-07,34.19
2018-11-08,33.87
2018-11-09,32.55
2018-11-12,31.6
2018-11-13,30.88
2018-11-14,30.45
2018-11-15,30.45
2018-11-16,30.7
2018-11-19,30.04
2018-11-20,29.64
2018-11-21,30.37
2018-11-23,30.09
2018-11-26,29.96
2018-11-27,29.88
2018-11-28,30.99
2018-11-29,30.79
2018-11-30,31.3
2018-12-03,30.72
2018-12-04,29.08
2018-12-06,29.23
2018-12-07,28.42
2018-12-10,28.53
2018-12-11,28.04
2018-12-12,28.96
2018-12-13,28.42
2018-12-14,27.88
2018-12-17,28.23
2018-12-18,28.18
2018-12-19,27.19
2018-12-20,26.84
2018-12-21,26.82
2018-12-24,26.68
2018-12-26,27.68
2018-12-27,27.54
2018-12-28,27.67
2018-12-31,28.17
2019-01-02,28.38
2019-01-03,28.01
2019-01-04,29.2
2019-01-07,30.2
2019-01-08,30.27
2019-01-09,30.3
2019-01-10,30.6
2019-01-11,30.96
2019-01-14,30.23
2019-01-15,30.36
2019-01-16,30.4
2019-01-17,30.72
2019-01-18,31.03
2019-01-22,30.67
2019-01-23,30.53
2019-01-24,30.52
2019-01-25,30.62
2019-01-28,30.19
2019-01-29,30.15
2019-01-30,30.26
2019-01-31,30.47
2019-02-01,30.23
2019-02-04,30.63
2019-02-05,30.49
2019-02-06,30.67
2019-02-07,29.72
2019-02-08,30.29
2019-02-11,30.88
2019-02-12,32.45
2019-02-13,33.51
2019-02-14,33.45
2019-02-15,34.15
2019-02-19,33.68
2019-02-20,35.07
2019-02-21,34.66
2019-02-22,34.58
2019-02-25,35.07
2019-02-26,33.9
2019-02-27,33.63
2019-02-28,33.54
2019-03-01,33.27
2019-03-04,32.82
2019-03-05,32.59
2019-03-06,30.98
2019-03-07,34.91
2019-03-08,35.39
2019-03-11,37.35
2019-03-12,36.15
2019-03-13,36.08
2019-03-14,35.91
2019-03-15,36.5
2019-03-18,36.27
2019-03-19,35.54
2019-03-20,35.46
2019-03-21,35.34
2019-03-22,33.67
2019-03-25,34.5
2019-03-26,34.35
2019-03-27,34.04
2019-03-28,34.79
2019-03-29,34.63
2019-04-01,35.42
2019-04-02,35.5
2019-04-03,35.67
2019-04-04,36.44
2019-04-05,36.33
2019-04-08,36.06
2019-04-09,35.64
2019-04-10,36.3
2019-04-11,36.44
2019-04-12,36.29
2019-04-15,36.41
2019-04-16,36.67
2019-04-17,36.77
2019-04-18,36.88
2019-04-22,36.71
2019-04-23,37.09
2019-04-24,37.21
2019-04-25,36.34
2019-04-26,36.32
2019-04-29,36.23
2019-04-30,36.15
2019-05-01,35.61
2019-05-02,36.06
2019-05-03,35.5
2019-05-06,35.03
2019-05-07,33.95
2019-05-08,33.65
2019-05-09,33.5
2019-05-10,33.54
2019-05-13,32.38
2019-05-14,32.19
2019-05-15,32.02
2019-05-16,34.21
2019-05-17,33.59
2019-05-20,33.33
2019-05-21,34.15
2019-05-22,34.04
2019-05-23,32.99
2019-05-24,32.62
2019-05-28,33.08
2019-05-29,33.31
2019-05-30,32.97
2019-05-31,32.29
2019-06-03,32.07
2019-06-04,33.62
2019-06-05,33.34
2019-06-06,33.02
2019-06-07,33.5
2019-06-10,33.72
2019-06-11,33.46
2019-06-12,33.17
2019-06-13,33.78
2019-06-14,33.85
2019-06-17,33.62
2019-06-18,34.74
2019-06-19,35.05
2019-06-20,36.55
2019-06-21,36.38
2019-06-24,35.23
2019-06-25,35.415
2019-06-26,35.59
2019-06-27,36.57
2019-06-28,37.1
2019-07-01,37.205
2019-07-02,36.605
2019-07-03,36.825
2019-07-04,36.825
2019-07-05,37.09
2019-07-08,36.945
2019-07-09,36.675
2019-07-10,36.535
2019-07-11,36.55
2019-07-12,37.25
2019-07-15,36.56
2019-07-16,36.65
2019-07-17,36.355
2019-07-18,36.33
2019-07-19,36.4
2019-07-22,36.19
2019-07-23,36.67
2019-07-24,37.56
2019-07-25,37.01
2019-07-26,37.35
2019-07-29,37.175
2019-07-30,37.58
2019-07-31,36.42
2019-08-01,31.75
2019-08-02,31.42
2019-08-05,29.89
2019-08-06,29.52
2019-08-07,28.51
2019-08-08,29.215
2019-08-09,28.515
2019-08-12,28.18
2019-08-13,28.73
2019-08-14,28.14
2019-08-15,28.275
2019-08-16,28.48
2019-08-19,28.87
2019-08-20,28.34
2019-08-21,28.73
2019-08-22,28.53
2019-08-23,27.8
2019-08-26,27.705
2019-08-27,27.21
2019-08-28,27.67
2019-08-29,28.03
2019-08-30,28.615
2019-09-02,28.63
2019-09-03,27.79
2019-09-04,27.495
2019-09-05,28.23
2019-09-06,28.01
2019-09-09,28.68
2019-09-10,29.42
2019-09-11,31.225
2019-09-12,31.89
2019-09-13,33.04
2019-09-16,33.85
2019-09-17,32.515
2019-09-18,32.315
2019-09-19,31.97
2019-09-20,32.36
2019-09-23,31.83
2019-09-24,32.22
2019-09-25,32.26
2019-09-26,32.735
2019-09-27,31.54
2019-09-30,31.225
2019-10-01,30.385
2019-10-02,30.125
2019-10-03,29.785
2019-10-04,30.555
2019-10-07,31.29
2019-10-08,30.97
2019-10-09,31.38
2019-10-10,31.38
2019-10-11,31.94
2019-10-14,30.905
2019-10-15,31.395
2019-10-16,30.32
2019-10-17,30.865
2019-10-18,31.95
2019-10-21,32.62
2019-10-22,33
2019-10-23,32.76
2019-10-24,32.725
2019-10-25,33.1
2019-10-28,32.59
2019-10-29,32.875
2019-10-30,33.34
2019-10-31,34.565
2019-11-01,34.41
2019-11-04,33.18
2019-11-05,34.91
2019-11-06,33.825
2019-11-07,33.86
2019-11-08,33.39
2019-11-11,33.52
2019-11-12,34.35
2019-11-13,34.985
2019-11-14,34.84
2019-11-15,34.61
2019-11-18,34.36
2019-11-19,34.33
2019-11-20,34.49
2019-11-21,33.39
2019-11-22,33.725
2019-11-25,34.43
