date,close
2014-06-13,2.7758
2014-06-16,2.7372
2014-06-17,2.6794
2014-06-18,2.583
2014-06-19,2.7468
2014-06-20,2.8047
2014-06-23,2.8818
2014-06-24,2.8143
2014-06-25,2.8143
2014-06-26,2.8336
2014-06-27,2.8143
2014-06-30,2.8625
2014-07-01,2.8625
2014-07-02,2.9492
2014-07-03,2.9492
2014-07-07,2.8432
2014-07-08,2.9782
2014-07-09,3.1035
2014-07-10,3.0842
2014-07-11,3.142
2014-07-14,3.036
2014-07-15,2.9492
2014-07-16,3.0071
2014-07-17,3.1613
2014-07-18,3.1613
2014-07-21,3.1709
2014-07-22,3.0842
2014-07-23,3.0649
2014-07-24,2.9878
2014-07-25,3.0938
2014-07-28,3.0745
2014-07-29,3.0649
2014-07-30,3.036
2014-07-31,2.9203
2014-08-01,2.9589
2014-08-04,2.9396
2014-08-05,2.9589
2014-08-06,3.0456
2014-08-07,3.036
2014-08-08,3.0263
2014-08-11,3.0456
2014-08-12,3.0842
2014-08-13,3.036
2014-08-14,3.0071
2014-08-15,2.93
2014-08-18,2.93
2014-08-19,2.8721
2014-08-20,2.9589
2014-08-21,2.8914
2014-08-22,2.8625
2014-08-25,2.8336
2014-08-26,2.8529
2014-08-27,2.9107
2014-08-28,2.93
2014-08-29,2.93
2014-09-02,2.8143
2014-09-03,2.8143
2014-09-04,2.689
2014-09-05,2.6987
2014-09-08,2.583
2014-09-09,2.6505
2014-09-10,2.5926
2014-09-11,2.6119
2014-09-12,2.5444
2014-09-15,2.4963
2014-09-16,2.4866
2014-09-17,2.371
2014-09-18,2.3613
2014-09-19,2.2939
2014-09-22,2.2649
2014-09-23,2.3131
2014-09-24,2.2457
2014-09-25,2.1975
2014-09-26,2.1878
2014-09-29,2.1589
2014-09-30,2.0818
2014-10-01,2.1204
2014-10-02,2.1107
2014-10-03,1.9372
2014-10-06,1.9854
2014-10-07,1.9276
2014-10-08,2.0529
2014-10-09,2.0529
2014-10-10,1.9276
2014-10-13,1.9276
2014-10-14,2.0433
2014-10-15,1.9854
2014-10-16,1.9951
2014-10-17,1.9372
2014-10-20,1.9662
2014-10-21,1.9662
2014-10-22,1.8891
2014-10-23,1.8698
2014-10-24,1.8023
2014-10-27,1.783
2014-10-28,1.783
2014-10-29,1.7156
2014-10-30,1.6385
2014-10-31,1.5614
2014-11-03,1.677
2014-11-04,1.6192
2014-11-05,1.5517
2014-11-06,1.5035
2014-11-07,1.6192
2014-11-10,1.5035
2014-11-11,1.5325
2014-11-12,1.5999
2014-11-13,1.5421
2014-11-14,1.677
2014-11-17,1.6867
2014-11-18,1.8023
2014-11-19,1.6192
2014-11-20,1.6481
2014-11-21,1.6674
2014-11-24,1.6481
2014-11-25,1.7349
2014-11-26,1.6963
2014-11-28,1.6481
2014-12-01,1.7059
2014-12-02,1.7156
2014-12-03,1.7541
2014-12-04,1.7059
2014-12-05,1.6577
2014-12-08,1.7059
2014-12-09,1.8023
2014-12-10,1.7252
2014-12-11,1.677
2014-12-12,1.6385
2014-12-15,1.6385
2014-12-16,1.6192
2014-12-17,1.7252
2014-12-18,1.7541
2014-12-19,1.7349
2014-12-22,1.677
2014-12-23,1.6867
2014-12-24,1.783
2014-12-26,1.8601
2014-12-29,1.7927
2014-12-30,1.8216
2014-12-31,1.8216
2015-01-02,1.8698
2015-01-05,2.0336
2015-01-06,2.2457
2015-01-07,2.2457
2015-01-08,2.2649
2015-01-09,2.4866
2015-01-12,2.7565
2015-01-13,2.6312
2015-01-14,2.6023
2015-01-15,2.8336
2015-01-16,2.9011
2015-01-20,2.9589
2015-01-21,3.0071
2015-01-22,2.9396
2015-01-23,2.7758
2015-01-26,2.8336
2015-01-27,3.0263
2015-01-28,2.9011
2015-01-29,2.8432
2015-01-30,2.9878
2015-02-02,2.9878
2015-02-03,2.9492
2015-02-04,2.9107
2015-02-05,2.9492
2015-02-06,2.7758
2015-02-09,2.6601
2015-02-10,2.6408
2015-02-11,2.5734
2015-02-12,2.5734
2015-02-13,2.5444
2015-02-17,2.3131
2015-02-18,2.3228
2015-02-19,2.2939
2015-02-20,2.3324
2015-02-23,2.3035
2015-02-24,2.2649
2015-02-25,2.3035
2015-02-26,2.3517
2015-02-27,2.371
2015-03-02,2.3517
2015-03-03,2.2649
2015-03-04,2.1686
2015-03-05,2.1107
2015-03-06,1.8794
2015-03-09,1.8023
2015-03-10,1.7252
2015-03-11,1.7638
2015-03-12,1.6867
2015-03-13,1.6288
2015-03-16,1.6963
2015-03-17,1.6674
2015-03-18,1.7734
2015-03-19,1.7638
2015-03-20,1.8601
2015-03-23,1.8601
2015-03-24,1.8216
2015-03-25,1.8216
2015-03-26,1.812
2015-03-27,1.7349
2015-03-30,1.6577
2015-03-31,1.677
2015-04-01,1.918
2015-04-02,1.8601
2015-04-06,1.918
2015-04-07,1.918
2015-04-08,1.8505
2015-04-09,1.7445
2015-04-10,1.8505
2015-04-13,1.783
2015-04-14,1.8216
2015-04-15,1.918
2015-04-16,1.8601
2015-04-17,1.8601
2015-04-20,1.8794
2015-04-21,1.9758
2015-04-22,1.8409
2015-04-23,1.9083
2015-04-24,1.8312
2015-04-27,1.8987
2015-04-28,1.9951
2015-04-29,1.9854
2015-04-30,1.8698
2015-05-01,1.8698
2015-05-04,1.8987
2015-05-05,1.8698
2015-05-06,1.812
2015-05-07,1.7156
2015-05-08,1.7445
2015-05-11,1.7252
2015-05-12,1.783
2015-05-13,1.7541
2015-05-14,1.6096
2015-05-15,1.6096
2015-05-18,1.5806
2015-05-19,1.5035
2015-05-20,1.5035
2015-05-21,1.4843
2015-05-22,1.4843
2015-05-26,1.4264
2015-05-27,1.359
2015-05-28,1.359
2015-05-29,1.4264
2015-06-01,1.3879
2015-06-02,1.4264
2015-06-03,1.3782
2015-06-04,1.3301
2015-06-05,1.2915
2015-06-08,1.2915
2015-06-09,1.3301
2015-06-10,1.359
2015-06-11,1.3108
2015-06-12,1.3011
2015-06-15,1.3011
2015-06-16,1.3108
2015-06-17,1.3493
2015-06-18,1.4361
2015-06-19,1.4072
2015-06-22,1.359
2015-06-23,1.2626
2015-06-24,1.2915
2015-06-25,1.3301
2015-06-26,1.3301
2015-06-29,1.359
2015-06-30,1.2915
2015-07-01,1.2722
2015-07-02,1.2433
2015-07-06,1.2915
2015-07-07,1.2433
2015-07-08,1.2048
2015-07-09,1.1662
2015-07-10,1.1373
2015-07-13,1.1566
2015-07-14,1.1566
2015-07-15,1.1566
2015-07-16,1.118
2015-07-17,1.0891
2015-07-20,0.944337
2015-07-21,1.0216
2015-07-22,1.012
2015-07-23,0.973443
2015-07-24,1.0409
2015-07-27,1.0024
2015-07-28,0.983082
2015-07-29,1.0216
2015-07-30,0.910796
2015-07-31,0.961781
2015-08-03,0.913688
2015-08-04,0.954167
2015-08-05,0.904724
2015-08-06,0.916868
2015-08-07,0.908483
2015-08-10,0.983082
2015-08-11,1.0505
2015-08-12,1.118
2015-08-13,0.94453
2015-08-14,0.946168
2015-08-17,1.0216
2015-08-18,0.963806
2015-08-19,0.973443
2015-08-20,1.0602
2015-08-21,1.0409
2015-08-24,0.947325
2015-08-25,0.880243
2015-08-26,0.811139
2015-08-27,0.871955
2015-08-28,0.88063
2015-08-31,0.889304
2015-09-01,0.814898
2015-09-02,0.77037
2015-09-03,0.736251
2015-09-04,0.739046
2015-09-08,0.709458
2015-09-09,0.704735
2015-09-10,0.682278
2015-09-11,0.663677
2015-09-14,0.718228
2015-09-15,0.755142
2015-09-16,0.818464
2015-09-17,0.860582
2015-09-18,0.769889
2015-09-21,0.713313
2015-09-22,0.62657
2015-09-23,0.612017
2015-09-24,0.645749
2015-09-25,0.639292
2015-09-28,0.582042
2015-09-29,0.596886
2015-09-30,0.581176
2015-10-01,0.55602
2015-10-02,0.587439
2015-10-05,0.616836
2015-10-06,0.603246
2015-10-07,0.616354
2015-10-08,0.645943
2015-10-09,0.74213
2015-10-12,0.734131
2015-10-13,0.694904
2015-10-14,0.813741
2015-10-15,0.800151
2015-10-16,0.772009
2015-10-19,0.730757
2015-10-20,0.763431
2015-10-21,0.741648
2015-10-22,0.73924
2015-10-23,0.714372
2015-10-26,0.697217
2015-10-27,0.72748
2015-10-28,0.680254
2015-10-29,0.652786
2015-10-30,0.651821
2015-11-02,0.682374
2015-11-03,0.68035
2015-11-04,0.642376
2015-11-05,0.652497
2015-11-06,0.644786
2015-11-09,0.674664
2015-11-10,0.665026
2015-11-11,0.627919
2015-11-12,0.588018
2015-11-13,0.587825
2015-11-16,0.587922
2015-11-17,0.520455
2015-11-18,0.58397
2015-11-19,0.575971
2015-11-20,0.510817
2015-11-23,0.539731
2015-11-24,0.587922
2015-11-25,0.560935
2015-11-27,0.542044
2015-11-30,0.587247
2015-12-01,0.587922
2015-12-02,0.633026
2015-12-03,0.634184
2015-12-04,0.703578
2015-12-07,0.684302
2015-12-08,0.703578
2015-12-09,0.771045
2015-12-10,0.835331
2015-12-11,0.898266
2015-12-14,0.771045
2015-12-15,0.785501
2015-12-16,0.806707
2015-12-17,0.732493
2015-12-18,0.800151
2015-12-21,0.866365
2015-12-22,0.853066
2015-12-23,0.973443
2015-12-24,0.992719
2015-12-28,0.918507
2015-12-29,0.914459
2015-12-30,0.899327
2015-12-31,0.895376
2016-01-04,1.0216
2016-01-05,1.1084
2016-01-06,1.2819
2016-01-07,1.3879
2016-01-08,1.2433
2016-01-11,1.2433
2016-01-12,1.3011
2016-01-13,1.4746
2016-01-14,1.4361
2016-01-15,1.5517
2016-01-19,1.4553
2016-01-20,1.6192
2016-01-21,1.6674
2016-01-22,1.5903
2016-01-25,1.7541
2016-01-26,1.8794
2016-01-27,1.918
2016-01-28,1.8505
2016-01-29,1.7252
2016-02-01,1.8023
2016-02-02,1.8794
2016-02-03,1.9758
2016-02-04,2.1589
2016-02-05,2.2553
2016-02-08,2.342
2016-02-09,2.2842
2016-02-10,2.2939
2016-02-11,2.6505
2016-02-12,2.6408
2016-02-16,2.477
2016-02-17,2.4866
2016-02-18,2.5348
2016-02-19,2.5348
2016-02-22,2.5734
2016-02-23,2.7179
2016-02-24,2.9011
2016-02-25,3.0456
2016-02-26,2.8914
2016-02-29,3.142
2016-03-01,2.9878
2016-03-02,3.142
2016-03-03,3.2384
2016-03-04,3.036
2016-03-07,3.1902
2016-03-08,3.1902
2016-03-09,3.1998
2016-03-10,3.2577
2016-03-11,3.2673
2016-03-14,3.3733
2016-03-15,3.5083
2016-03-16,3.8167
2016-03-17,3.7685
2016-03-18,3.6432
2016-03-21,3.6914
2016-03-22,3.8359
2016-03-23,3.5564
2016-03-24,3.6046
2016-03-28,3.5854
2016-03-29,3.8456
2016-03-30,3.6817
2016-03-31,3.5083
2016-04-01,3.5854
2016-04-04,3.4601
2016-04-05,3.5757
2016-04-06,3.5757
2016-04-07,3.7107
2016-04-08,3.7878
2016-04-11,4.0191
2016-04-12,3.9034
2016-04-13,3.701
2016-04-14,3.4504
2016-04-15,3.4601
2016-04-18,3.4601
2016-04-19,3.5468
2016-04-20,3.2673
2016-04-21,3.2577
2016-04-22,2.9878
2016-04-25,3.0649
2016-04-26,3.0649
2016-04-27,3.1516
2016-04-28,3.4022
2016-04-29,3.5275
2016-05-02,3.4215
2016-05-03,3.248
2016-05-04,3.0263
2016-05-05,3.2769
2016-05-06,3.5468
2016-05-09,3.1709
2016-05-10,3.2287
2016-05-11,3.3251
2016-05-12,3.0842
2016-05-13,3.1998
2016-05-16,3.3155
2016-05-17,3.2962
2016-05-18,3.1613
2016-05-19,3.1998
2016-05-20,3.1998
2016-05-23,3.2095
2016-05-24,2.8914
2016-05-25,2.9782
2016-05-26,2.9492
2016-05-27,2.8143
2016-05-31,2.9492
2016-06-01,3.0071
2016-06-02,2.9878
2016-06-03,3.3733
2016-06-06,3.4408
2016-06-07,3.383
2016-06-08,3.6143
2016-06-09,3.6528
2016-06-10,3.5179
2016-06-13,3.383
2016-06-14,3.3926
2016-06-15,3.5083
2016-06-16,3.2962
2016-06-17,3.354
2016-06-20,3.3348
2016-06-21,3.0842
2016-06-22,3.354
2016-06-23,3.2191
2016-06-24,3.489
2016-06-27,3.3444
2016-06-28,3.2384
2016-06-29,3.4697
2016-06-30,3.4793
2016-07-01,3.7492
2016-07-05,3.9516
2016-07-06,4.1636
2016-07-07,4.0962
2016-07-08,4.2986
2016-07-11,4.366
2016-07-12,4.1444
2016-07-13,4.4913
2016-07-14,4.3371
2016-07-15,4.3468
2016-07-18,4.3275
2016-07-19,4.3371
2016-07-20,3.9516
2016-07-21,4.1733
2016-07-22,4.1636
2016-07-25,3.8841
2016-07-26,4.0769
2016-07-27,4.3178
2016-07-28,4.26
2016-07-29,4.4046
2016-08-01,4.6359
2016-08-02,4.5877
2016-08-03,4.4624
2016-08-04,4.607
2016-08-05,4.3371
2016-08-08,4.3371
2016-08-09,4.3853
2016-08-10,4.4817
2016-08-11,4.3853
2016-08-12,4.3082
2016-08-15,4.2986
2016-08-16,4.154
2016-08-17,3.9516
2016-08-18,3.9805
2016-08-19,3.9516
2016-08-22,3.9034
2016-08-23,3.8552
2016-08-24,3.5854
2016-08-25,3.7878
2016-08-26,3.7299
2016-08-29,3.701
2016-08-30,3.5179
2016-08-31,3.4022
2016-09-01,3.7781
2016-09-02,3.8745
2016-09-06,3.9709
2016-09-07,3.7974
2016-09-08,3.6914
2016-09-09,3.4697
2016-09-12,3.7107
2016-09-13,3.4022
2016-09-14,3.4414
2016-09-15,3.3831
2016-09-16,3.2567
2016-09-19,3.2859
2016-09-20,3.2762
2016-09-21,3.665
2016-09-22,3.4511
2016-09-23,3.4025
2016-09-26,3.3539
2016-09-27,3.3442
2016-09-28,3.4706
2016-09-29,3.4609
2016-09-30,3.3928
2016-10-03,3.3928
2016-10-04,3.0331
2016-10-05,3.0817
2016-10-06,2.9165
2016-10-07,2.9165
2016-10-10,2.897
2016-10-11,2.7706
2016-10-12,2.829
2016-10-13,2.9067
2016-10-14,2.8581
2016-10-17,2.9359
2016-10-18,3.1401
2016-10-19,3.2081
2016-10-20,3.1109
2016-10-21,3.0914
2016-10-24,2.9553
2016-10-25,3.1012
2016-10-26,3.0428
2016-10-27,2.9942
2016-10-28,2.9845
2016-10-31,3.0817
2016-11-01,3.247
2016-11-02,3.1887
2016-11-03,3.2956
2016-11-04,3.3248
2016-11-07,3.1012
2016-11-08,3.0526
2016-11-09,3.1595
2016-11-10,2.8776
2016-11-11,2.4693
2016-11-14,2.6151
2016-11-15,2.7026
2016-11-16,2.547
2016-11-17,2.4304
2016-11-18,2.4012
2016-11-21,2.3526
2016-11-22,2.3137
2016-11-23,2.129
2016-11-25,2.2068
2016-11-28,2.3915
2016-11-29,2.2554
2016-11-30,2.2165
2016-12-01,2.2262
2016-12-02,2.2262
2016-12-05,2.129
2016-12-06,2.1679
2016-12-07,2.1582
2016-12-08,2.2165
2016-12-09,2.0221
2016-12-12,2.0026
2016-12-13,2.129
2016-12-14,1.9443
2016-12-15,1.8665
2016-12-16,1.8374
2016-12-19,1.8957
2016-12-20,1.9151
2016-12-21,1.8763
2016-12-22,1.886
2016-12-23,1.9832
2016-12-27,2.0512
2016-12-28,2.1193
2016-12-29,2.2846
2016-12-30,2.1485
2017-01-03,2.2846
2017-01-04,2.3234
2017-01-05,2.4887
2017-01-06,2.3137
2017-01-09,2.3526
2017-01-10,2.3721
2017-01-11,2.3623
2017-01-12,2.3526
2017-01-13,2.4012
2017-01-17,2.4887
2017-01-18,2.4012
2017-01-19,2.4109
2017-01-20,2.4109
2017-01-23,2.4693
2017-01-24,2.4207
2017-01-25,2.4109
2017-01-26,2.2943
2017-01-27,2.3721
2017-01-30,2.4207
2017-01-31,2.479
2017-02-01,2.5082
2017-02-02,2.5859
2017-02-03,2.5859
2017-02-06,2.7415
2017-02-07,2.6831
2017-02-08,2.722
2017-02-09,2.6345
2017-02-10,2.6734
2017-02-13,2.6151
2017-02-14,2.6929
2017-02-15,2.7706
2017-02-16,2.897
2017-02-17,2.7026
2017-02-21,2.6443
2017-02-22,2.5568
2017-02-23,2.6929
2017-02-24,2.5956
2017-02-27,2.3818
2017-02-28,2.4304
2017-03-01,2.4887
2017-03-02,2.3234
2017-03-03,2.3137
2017-03-06,2.1193
2017-03-07,2.1387
2017-03-08,2.129
2017-03-09,2.0221
2017-03-10,2.1485
2017-03-13,2.2457
2017-03-14,2.1679
2017-03-15,2.4456
2017-03-16,2.3667
2017-03-17,2.2385
2017-03-20,2.3864
2017-03-21,2.4259
2017-03-22,2.416
2017-03-23,2.3076
2017-03-24,2.3667
2017-03-27,2.4555
2017-03-28,2.347
2017-03-29,2.3667
2017-03-30,2.3076
2017-03-31,2.416
2017-04-03,2.5837
2017-04-04,2.5935
2017-04-05,2.6527
2017-04-06,2.633
2017-04-07,2.6133
2017-04-10,2.6034
2017-04-11,2.7414
2017-04-12,2.7119
2017-04-13,2.6527
2017-04-17,2.5738
2017-04-18,2.5442
2017-04-19,2.3766
2017-04-20,2.3766
2017-04-21,2.347
2017-04-24,2.2582
2017-04-25,2.1695
2017-04-26,2.2188
2017-04-27,2.1498
2017-04-28,2.1498
2017-05-01,2.0413
2017-05-02,2.1202
2017-05-03,2.1596
2017-05-04,2.0807
2017-05-05,2.13
2017-05-08,2.13
2017-05-09,2.1498
2017-05-10,2.1794
2017-05-11,2.2484
2017-05-12,2.278
2017-05-15,2.2681
2017-05-16,2.2287
2017-05-17,2.3076
2017-05-18,2.2385
2017-05-19,2.2484
2017-05-22,2.3076
2017-05-23,2.1892
2017-05-24,2.1695
2017-05-25,2.13
2017-05-26,2.1005
2017-05-30,2.0216
2017-05-31,1.9723
2017-06-01,1.8835
2017-06-02,1.9032
2017-06-05,1.8835
2017-06-06,2.0512
2017-06-07,1.9723
2017-06-08,1.9131
2017-06-09,1.8342
2017-06-12,1.8737
2017-06-13,1.8835
2017-06-14,1.775
2017-06-15,1.775
2017-06-16,1.6567
2017-06-19,1.6468
2017-06-20,1.568
2017-06-21,1.6074
2017-06-22,1.5975
2017-06-23,1.6764
2017-06-26,1.6666
2017-06-27,1.6468
2017-06-28,1.6271
2017-06-29,1.5975
2017-06-30,1.6271
2017-07-03,1.5877
2017-07-05,1.6173
2017-07-06,1.6173
2017-07-07,1.568
2017-07-10,1.637
2017-07-11,1.6666
2017-07-12,1.7159
2017-07-13,1.6567
2017-07-14,1.6961
2017-07-17,1.7257
2017-07-18,1.706
2017-07-19,1.7257
2017-07-20,1.6961
2017-07-21,1.7159
2017-07-24,1.6468
2017-07-25,1.6666
2017-07-26,1.7257
2017-07-27,1.6863
2017-07-28,1.7455
2017-07-31,1.7849
2017-08-01,1.7948
2017-08-02,1.7455
2017-08-03,1.7159
2017-08-04,1.706
2017-08-07,1.6468
2017-08-08,1.706
2017-08-09,1.7652
2017-08-10,1.7948
2017-08-11,1.8342
2017-08-14,1.7455
2017-08-15,1.7257
2017-08-16,1.6961
2017-08-17,1.7553
2017-08-18,1.8441
2017-08-21,1.8638
2017-08-22,1.7849
2017-08-23,1.8243
2017-08-24,1.8046
2017-08-25,1.775
2017-08-28,1.8539
2017-08-29,1.9525
2017-08-30,1.9427
2017-08-31,2.0314
2017-09-01,2.0019
2017-09-05,2.1399
2017-09-06,2.0413
2017-09-07,2.0807
2017-09-08,2.0413
2017-09-11,2.0019
2017-09-12,2.0019
2017-09-13,1.992
2017-09-14,2.0512
2017-09-15,2.1103
2017-09-18,1.9624
2017-09-19,1.9624
2017-09-20,1.8638
2017-09-21,1.7948
2017-09-22,1.8342
2017-09-25,1.923
2017-09-26,1.8243
2017-09-27,1.7948
2017-09-28,1.7948
2017-09-29,1.8046
2017-10-02,1.775
2017-10-03,1.8145
2017-10-04,1.8145
2017-10-05,1.8046
2017-10-06,1.8638
2017-10-09,1.8934
2017-10-10,1.8737
2017-10-11,1.8737
2017-10-12,1.87
2017-10-13,1.88
2017-10-16,1.81
2017-10-17,1.79
2017-10-18,1.76
2017-10-19,1.69
2017-10-20,1.66
2017-10-23,1.62
2017-10-24,1.62
2017-10-25,1.67
2017-10-26,1.7
2017-10-27,1.75
2017-10-30,1.78
2017-10-31,1.73
2017-11-01,1.8
2017-11-02,1.81
2017-11-03,1.77
2017-11-06,1.84
2017-11-07,1.76
2017-11-08,1.82
2017-11-09,1.83
2017-11-10,1.83
2017-11-13,1.8
2017-11-14,1.8
2017-11-15,1.82
2017-11-16,1.83
2017-11-17,1.83
2017-11-20,1.78
2017-11-21,1.76
2017-11-22,1.81
2017-11-24,1.79
2017-11-27,1.86
2017-11-28,1.82
2017-11-29,1.82
2017-11-30,1.84
2017-12-01,1.83
2017-12-04,1.83
2017-12-05,1.78
2017-12-06,1.67
2017-12-07,1.68
2017-12-08,1.73
2017-12-11,1.69
2017-12-12,1.65
2017-12-13,1.74
2017-12-14,1.76
2017-12-15,1.8
2017-12-18,1.79
2017-12-19,1.72
2017-12-20,1.78
2017-12-21,1.81
2017-12-22,1.84
2017-12-26,1.85
2017-12-27,1.88
2017-12-28,1.85
2017-12-29,1.87
2018-01-02,1.9
2018-01-03,1.9
2018-01-04,1.89
2018-01-05,1.85
2018-01-08,1.76
2018-01-09,1.76
2018-01-10,1.8
2018-01-11,1.78
2018-01-12,1.83
2018-01-16,1.77
2018-01-17,1.75
2018-01-18,1.69
2018-01-19,1.73
2018-01-22,1.71
2018-01-23,1.75
2018-01-24,1.77
2018-01-25,1.73
2018-01-26,1.73
2018-01-29,1.68
2018-01-30,1.67
2018-01-31,1.77
2018-02-01,1.73
2018-02-02,1.67
2018-02-05,1.75
2018-02-06,1.71
2018-02-07,1.71
2018-02-08,1.72
2018-02-09,1.71
2018-02-12,1.83
2018-02-13,1.86
2018-02-14,2.08
2018-02-15,2.12
2018-02-16,2.12
2018-02-20,2.06
2018-02-21,2.07
2018-02-22,2.12
2018-02-23,2.11
2018-02-26,2.16
2018-02-27,2.1
2018-02-28,2.08
2018-03-01,2.16
2018-03-02,2.15
2018-03-05,2.22
2018-03-06,2.27
2018-03-07,2.14
2018-03-08,2.29
2018-03-09,2.2
2018-03-12,2.25
2018-03-13,2.2
2018-03-14,2.14
2018-03-15,2.23
2018-03-16,2.13
2018-03-19,2.22
2018-03-20,2.24
2018-03-21,2.25
2018-03-22,2.34
2018-03-23,2.33
2018-03-26,2.5
2018-03-27,2.48
2018-03-28,2.4
2018-03-29,2.39
2018-04-02,2.48
2018-04-03,2.41
2018-04-04,2.31
2018-04-05,2.35
2018-04-06,2.43
2018-04-09,2.34
2018-04-10,2.29
2018-04-11,2.31
2018-04-12,2.13
2018-04-13,2.09
2018-04-16,2.01
2018-04-17,1.98
2018-04-18,1.98
2018-04-19,2
2018-04-20,1.97
2018-04-23,1.93
2018-04-24,1.94
2018-04-25,1.97
2018-04-26,2.05
2018-04-27,2.07
2018-04-30,2.03
2018-05-01,2.02
2018-05-02,2.05
2018-05-03,2.07
2018-05-04,2.03
2018-05-07,1.98
2018-05-08,1.99
2018-05-09,1.93
2018-05-10,1.93
2018-05-11,1.92
2018-05-14,1.9
2018-05-15,1.85
2018-05-16,1.78
2018-05-17,1.8
2018-05-18,1.78
2018-05-21,1.75
2018-05-22,1.75
2018-05-23,1.75
2018-05-24,1.79
2018-05-25,1.79
2018-05-29,1.72
2018-05-30,1.7
2018-05-31,1.7
2018-06-01,1.71
2018-06-04,1.7
2018-06-05,1.64
2018-06-06,1.65
2018-06-07,1.59
2018-06-08,1.6
2018-06-11,1.59
2018-06-12,1.58
2018-06-13,1.62
2018-06-14,1.56
2018-06-15,1.58
2018-06-18,1.56
2018-06-19,1.6
2018-06-20,1.59
2018-06-21,1.63
2018-06-22,1.6
2018-06-25,1.61
2018-06-26,1.55
2018-06-27,1.55
2018-06-28,1.52
2018-06-29,1.56
2018-07-02,1.62
2018-07-03,1.65
2018-07-05,1.66
2018-07-06,1.71
2018-07-09,1.66
2018-07-10,1.69
2018-07-11,1.66
2018-07-12,1.63
2018-07-13,1.61
2018-07-16,1.61
2018-07-17,1.61
2018-07-18,1.62
2018-07-19,1.61
2018-07-20,1.62
2018-07-23,1.65
2018-07-24,1.66
2018-07-25,1.72
2018-07-26,1.67
2018-07-27,1.68
2018-07-30,1.7
2018-07-31,1.7
2018-08-01,1.66
2018-08-02,1.66
2018-08-03,1.64
2018-08-06,1.63
2018-08-07,1.62
2018-08-08,1.67
2018-08-09,1.68
2018-08-10,1.63
2018-08-13,1.64
2018-08-14,1.62
2018-08-15,1.48
2018-08-16,1.44
2018-08-17,1.49
2018-08-20,1.54
2018-08-21,1.57
2018-08-22,1.64
2018-08-23,1.54
2018-08-24,1.6
2018-08-27,1.74
2018-08-28,1.67
2018-08-29,1.72
2018-08-30,1.65
2018-08-31,1.66
2018-09-04,1.69
2018-09-05,1.77
2018-09-06,1.77
2018-09-07,1.79
2018-09-10,1.76
2018-09-11,1.75
2018-09-12,1.78
2018-09-13,1.79
2018-09-14,1.77
2018-09-17,1.89
2018-09-18,1.87
2018-09-19,1.86
2018-09-20,1.92
2018-09-21,1.87
2018-09-24,1.85
2018-09-25,1.84
2018-09-26,1.81
2018-09-27,1.67
2018-09-28,1.66
2018-10-01,1.65
2018-10-02,1.7
2018-10-03,1.67
2018-10-04,1.67
2018-10-05,1.67
2018-10-08,1.73
2018-10-09,1.72
2018-10-10,1.76
2018-10-11,2.04
2018-10-12,2.02
2018-10-15,2.12
2018-10-16,2.07
2018-10-17,2.03
2018-10-18,2.11
2018-10-19,2.07
2018-10-22,2.07
2018-10-23,2.11
2018-10-24,2.08
2018-10-25,1.98
2018-10-26,1.96
2018-10-29,1.94
2018-10-30,2
2018-10-31,1.84
2018-11-01,1.9
2018-11-02,1.87
2018-11-05,1.83
2018-11-06,1.78
2018-11-07,1.76
2018-11-08,1.75
2018-11-09,1.67
2018-11-12,1.59
2018-11-13,1.55
2018-11-14,1.61
2018-11-15,1.69
2018-11-16,1.69
2018-11-19,1.69
2018-11-20,1.67
2018-11-21,1.68
2018-11-23,1.63
2018-11-26,1.56
2018-11-27,1.51
2018-11-28,1.56
2018-11-29,1.54
2018-11-30,1.5
2018-12-03,1.51
2018-12-04,1.6
2018-12-06,1.62
2018-12-07,1.64
2018-12-10,1.55
2018-12-11,1.6
2018-12-12,1.64
2018-12-13,1.65
2018-12-14,1.6
2018-12-17,1.67
2018-12-18,1.69
2018-12-19,1.63
2018-12-20,1.74
2018-12-21,1.71
2018-12-24,1.76
2018-12-26,1.73
2018-12-27,1.68
2018-12-28,1.67
2018-12-31,1.79
2019-01-02,1.81
2019-01-03,1.93
2019-01-04,1.87
2019-01-07,1.87
2019-01-08,1.88
2019-01-09,1.93
2019-01-10,1.85
2019-01-11,1.86
2019-01-14,1.84
2019-01-15,1.77
2019-01-16,1.77
2019-01-17,1.78
2019-01-18,1.69
2019-01-22,1.71
2019-01-23,1.73
2019-01-24,1.76
2019-01-25,1.78
2019-01-28,1.89
2019-01-29,2.04
2019-01-30,1.96
2019-01-31,1.98
2019-02-01,2.04
2019-02-04,1.99
2019-02-05,2.05
2019-02-06,2.07
2019-02-07,2.08
2019-02-08,2.14
2019-02-11,2.15
2019-02-12,2.06
2019-02-13,1.96
2019-02-14,1.95
2019-02-15,1.99
2019-02-19,2.07
2019-02-20,2.13
2019-02-21,2.14
2019-02-22,2.09
2019-02-25,2.06
2019-02-26,2.1
2019-02-27,2.12
2019-02-28,2.08
2019-03-01,2
2019-03-04,2.03
2019-03-05,1.96
2019-03-06,1.85
2019-03-07,1.89
2019-03-08,2.04
2019-03-11,2
2019-03-12,2.02
2019-03-13,2.09
2019-03-14,1.94
2019-03-15,1.98
2019-03-18,1.94
2019-03-19,1.95
2019-03-20,2.02
2019-03-21,2.07
2019-03-22,1.99
2019-03-25,2.07
2019-03-26,2.04
2019-03-27,2.02
2019-03-28,1.89
2019-03-29,1.9
2019-04-01,1.79
2019-04-02,1.8
2019-04-03,1.91
2019-04-04,1.93
2019-04-05,1.94
2019-04-08,2.03
2019-04-09,2.08
2019-04-10,1.99
2019-04-11,1.93
2019-04-12,1.92
2019-04-15,1.87
2019-04-16,1.82
2019-04-17,1.84
2019-04-18,1.82
2019-04-22,1.78
2019-04-23,1.79
2019-04-24,1.81
2019-04-25,1.82
2019-04-26,1.86
2019-04-29,1.76
2019-04-30,1.74
2019-05-01,1.72
2019-05-02,1.65
2019-05-03,1.6
2019-05-06,1.64
2019-05-07,1.75
2019-05-08,1.69
2019-05-09,1.7
2019-05-10,1.65
2019-05-13,1.66
2019-05-14,1.66
2019-05-15,1.62
2019-05-16,1.61
2019-05-17,1.63
2019-05-20,1.65
2019-05-21,1.66
2019-05-22,1.66
2019-05-23,1.65
2019-05-24,1.66
2019-05-28,1.57
2019-05-29,1.61
2019-05-30,1.66
2019-05-31,1.78
2019-06-03,1.88
2019-06-04,1.87
2019-06-05,1.87
2019-06-06,1.92
2019-06-07,1.89
2019-06-10,1.81
2019-06-11,1.83
2019-06-12,1.91
2019-06-13,1.96
2019-06-14,1.965
2019-06-17,1.99
2019-06-18,1.945
2019-06-19,2.005
2019-06-20,2.175
2019-06-21,2.165
2019-06-24,2.235
2019-06-25,2.195
2019-06-26,2.25
2019-06-27,2.265
2019-06-28,2.28
2019-07-01,2.115
2019-07-02,2.26
2019-07-03,2.245
2019-07-04,2.245
2019-07-05,2.205
2019-07-08,2.375
2019-07-09,2.345
2019-07-10,2.46
2019-07-11,2.31
2019-07-12,2.39
2019-07-15,2.35
2019-07-16,2.35
2019-07-17,2.435
2019-07-18,2.575
2019-07-19,2.56
2019-07-22,2.505
2019-07-23,2.42
2019-07-24,2.515
2019-07-25,2.485
2019-07-26,2.465
2019-07-29,2.585
2019-07-30,2.635
2019-07-31,2.45
2019-08-01,2.625
2019-08-02,2.655
2019-08-05,2.86
2019-08-06,2.895
2019-08-07,2.975
2019-08-08,2.98
2019-08-09,3.05
2019-08-12,2.975
2019-08-13,2.88
2019-08-14,2.965
2019-08-15,3.005
2019-08-16,2.96
2019-08-19,2.955
2019-08-20,3.235
2019-08-21,3.355
2019-08-22,3.335
2019-08-23,3.585
2019-08-26,3.595
2019-08-27,3.825
2019-08-28,3.755
2019-08-29,3.715
2019-08-30,3.705
2019-09-02,3.705
2019-09-03,3.665
2019-09-04,3.78
2019-09-05,3.51
2019-09-06,3.42
2019-09-09,3.31
2019-09-10,3.315
2019-09-11,3.27
2019-09-12,3.155
2019-09-13,2.985
2019-09-16,3.075
2019-09-17,3.085
2019-09-18,3.02
2019-09-19,3.1
2019-09-20,3.215
2019-09-23,3.295
2019-09-24,3.38
2019-09-25,3.145
2019-09-26,3.11
2019-09-27,2.925
2019-09-30,2.845
2019-10-01,2.895
2019-10-02,3.02
2019-10-03,2.965
2019-10-04,3.1
2019-10-07,3.045
2019-10-08,3.195
2019-10-09,3.15
2019-10-10,3.11
2019-10-11,2.915
2019-10-14,3.02
2019-10-15,2.925
2019-10-16,3.05
2019-10-17,3.14
2019-10-18,3.19
2019-10-21,3.115
2019-10-22,3.07
2019-10-23,3.145
2019-10-24,3.385
2019-10-25,3.375
2019-10-28,3.295
2019-10-29,3.275
2019-10-30,3.355
2019-10-31,3.495
2019-11-01,3.485
2019-11-04,3.385
2019-11-05,3.225
2019-11-06,3.28
2019-11-07,3.09
2019-11-08,3.135
2019-11-11,3.075
2019-11-12,3.13
2019-11-13,3.265
2019-11-14,3.325
2019-11-15,3.275
2019-11-18,3.36
2019-11-19,3.345
2019-11-20,3.345
2019-11-21,3.315
2019-11-22,3.175
2019-11-25,3.05
