date,close
2014-01-02,15.4442
2014-01-03,15.5749
2014-01-06,15.6931
2014-01-07,15.7802
2014-01-08,15.5126
2014-01-09,15.3163
2014-01-10,15.6709
2014-01-13,15.4873
2014-01-14,15.5443
2014-01-15,15.5886
2014-01-16,15.6583
2014-01-17,15.6266
2014-01-21,15.7786
2014-01-22,15.7786
2014-01-23,15.7975
2014-01-24,15.6646
2014-01-27,15.5569
2014-01-28,15.7975
2014-01-29,15.5886
2014-01-30,15.7849
2014-01-31,15.6393
2014-02-03,15.3987
2014-02-04,15.5949
2014-02-05,15.405
2014-02-06,15.367
2014-02-07,15.2594
2014-02-10,15.4493
2014-02-11,15.5316
2014-02-12,15.5
2014-02-13,15.6139
2014-02-14,15.6393
2014-02-18,15.6962
2014-02-19,15.6709
2014-02-20,15.7406
2014-02-21,15.7849
2014-02-24,15.6139
2014-02-25,15.6899
2014-02-26,15.6899
2014-02-27,15.6203
2014-02-28,15.7722
2014-03-03,15.7975
2014-03-04,15.9622
2014-03-05,15.9432
2014-03-06,15.8229
2014-03-07,15.6013
2014-03-10,15.481
2014-03-11,15.443
2014-03-12,15.6583
2014-03-13,15.5633
2014-03-14,15.6709
2014-03-17,15.6266
2014-03-18,15.5823
2014-03-19,15.462
2014-03-20,15.4746
2014-03-21,15.7912
2014-03-24,15.6836
2014-03-25,15.8292
2014-03-26,15.6583
2014-03-27,15.7279
2014-03-28,15.7342
2014-03-31,15.9558
2014-04-01,15.8989
2014-04-02,15.9179
2014-04-03,15.8799
2014-04-04,15.7912
2014-04-07,15.8482
2014-04-08,15.8609
2014-04-09,15.9305
2014-04-10,15.9305
2014-04-11,15.7849
2014-04-14,15.7786
2014-04-15,16.1331
2014-04-16,16.1838
2014-04-17,16.2788
2014-04-21,16.3801
2014-04-22,16.4624
2014-04-23,16.2757
2014-04-24,16.3465
2014-04-25,16.2885
2014-04-28,16.3594
2014-04-29,16.3014
2014-04-30,16.3851
2014-05-01,16.2757
2014-05-02,16.3722
2014-05-05,16.1855
2014-05-06,16.0761
2014-05-07,16.192
2014-05-08,16.1598
2014-05-09,16.3143
2014-05-12,16.34
2014-05-13,16.2177
2014-05-14,16.2628
2014-05-15,16.1984
2014-05-16,16.3336
2014-05-19,16.2435
2014-05-20,16.1984
2014-05-21,16.0439
2014-05-22,15.9924
2014-05-23,16.1533
2014-05-27,16.4624
2014-05-28,16.2692
2014-05-29,16.34
2014-05-30,16.4302
2014-06-02,16.3915
2014-06-03,16.398
2014-06-04,16.4302
2014-06-05,16.8165
2014-06-06,16.7907
2014-06-09,16.5525
2014-06-10,16.4752
2014-06-11,16.4495
2014-06-12,16.4559
2014-06-13,16.4624
2014-06-16,16.3529
2014-06-17,16.4752
2014-06-18,16.501
2014-06-19,16.6555
2014-06-20,16.5267
2014-06-23,16.4495
2014-06-24,16.4109
2014-06-25,16.3658
2014-06-26,16.3465
2014-06-27,16.4044
2014-06-30,16.3465
2014-07-01,16.3915
2014-07-02,16.3207
2014-07-03,16.2499
2014-07-07,16.2113
2014-07-08,16.2885
2014-07-09,16.34
2014-07-10,15.9409
2014-07-11,15.9731
2014-07-14,15.9988
2014-07-15,16.1083
2014-07-16,16.0632
2014-07-17,15.9666
2014-07-18,16.0568
2014-07-21,15.9731
2014-07-22,15.928
2014-07-23,16.1442
2014-07-24,15.2466
2014-07-25,15.358
2014-07-28,15.3645
2014-07-29,15.4366
2014-07-30,15.3187
2014-07-31,15.299
2014-08-01,15.2073
2014-08-04,15.3318
2014-08-05,15.3121
2014-08-06,15.0631
2014-08-07,15.0304
2014-08-08,15.0828
2014-08-11,15.2859
2014-08-12,15.3187
2014-08-13,15.4628
2014-08-14,15.4366
2014-08-15,15.4038
2014-08-18,15.5611
2014-08-19,15.6266
2014-08-20,15.679
2014-08-21,15.7314
2014-08-22,15.5807
2014-08-25,15.5283
2014-08-26,15.6135
2014-08-27,15.6921
2014-08-28,15.6397
2014-08-29,15.738
2014-09-02,15.6594
2014-09-03,15.6987
2014-09-04,15.6725
2014-09-05,15.7642
2014-09-08,15.7249
2014-09-09,15.5807
2014-09-10,15.4825
2014-09-11,15.607
2014-09-12,15.2531
2014-09-15,15.1352
2014-09-16,15.2138
2014-09-17,15.1483
2014-09-18,15.0304
2014-09-19,14.9976
2014-09-22,14.8076
2014-09-23,14.5521
2014-09-24,14.611
2014-09-25,14.421
2014-09-26,14.5521
2014-09-29,14.5324
2014-09-30,14.3555
2014-10-01,14.3555
2014-10-02,14.3359
2014-10-03,14.3752
2014-10-06,14.4079
2014-10-07,14.29
2014-10-08,14.5979
2014-10-09,14.5521
2014-10-10,14.5717
2014-10-13,14.7028
2014-10-14,14.9452
2014-10-15,15.0173
2014-10-16,14.9933
2014-10-17,14.9255
2014-10-20,15.1483
2014-10-21,15.0566
2014-10-22,15.1522
2014-10-23,15.2389
2014-10-24,15.2389
2014-10-27,15.319
2014-10-28,15.3457
2014-10-29,15.339
2014-10-30,15.399
2014-10-31,15.2256
2014-11-03,15.2189
2014-11-04,15.379
2014-11-05,15.4991
2014-11-06,15.5859
2014-11-07,15.4658
2014-11-10,15.5859
2014-11-11,15.419
2014-11-12,15.3123
2014-11-13,15.399
2014-11-14,15.3256
2014-11-17,15.3523
2014-11-18,15.3523
2014-11-19,15.2723
2014-11-20,15.1188
2014-11-21,15.0654
2014-11-24,15.2322
2014-11-25,15.1121
2014-11-26,15.2055
2014-11-28,15.1588
2014-12-01,15.0854
2014-12-02,15.2122
2014-12-03,15.1922
2014-12-04,15.2456
2014-12-05,15.2322
2014-12-08,15.2389
2014-12-09,15.4257
2014-12-10,15.3056
2014-12-11,15.3857
2014-12-12,15.319
2014-12-15,15.0321
2014-12-16,15.0654
2014-12-17,15.3523
2014-12-18,15.4257
2014-12-19,15.4924
2014-12-22,15.6726
2014-12-23,15.5792
2014-12-24,15.5592
2014-12-26,15.6125
2014-12-29,15.6793
2014-12-30,15.5992
2014-12-31,15.3523
2015-01-02,15.6259
2015-01-05,15.726
2015-01-06,15.6125
2015-01-07,15.6659
2015-01-08,15.6926
2015-01-09,15.6059
2015-01-12,15.4858
2015-01-13,15.2456
2015-01-14,15.339
2015-01-15,15.3323
2015-01-16,15.5458
2015-01-20,15.4457
2015-01-21,15.3302
2015-01-22,15.6293
2015-01-23,15.5681
2015-01-26,15.7653
2015-01-27,15.7517
2015-01-28,15.6973
2015-01-29,15.7857
2015-01-30,15.5001
2015-02-02,15.6157
2015-02-03,15.8468
2015-02-04,15.7585
2015-02-05,15.9488
2015-02-06,15.4661
2015-02-09,15.405
2015-02-10,15.3574
2015-02-11,15.3982
2015-02-12,15.7449
2015-02-13,15.6497
2015-02-17,15.5953
2015-02-18,15.7109
2015-02-19,15.4322
2015-02-20,15.5341
2015-02-23,15.8265
2015-02-24,15.84
2015-02-25,16.0032
2015-02-26,15.7245
2015-02-27,15.9012
2015-03-02,15.6089
2015-03-03,15.7585
2015-03-04,15.7041
2015-03-05,15.6565
2015-03-06,15.2622
2015-03-09,15.1398
2015-03-10,15.1398
2015-03-11,15.099
2015-03-12,15.3234
2015-03-13,15.269
2015-03-16,15.3166
2015-03-17,15.2894
2015-03-18,15.5409
2015-03-19,15.4865
2015-03-20,15.8332
2015-03-23,15.7789
2015-03-24,15.6157
2015-03-25,15.4457
2015-03-26,15.3506
2015-03-27,15.4322
2015-03-30,15.6633
2015-03-31,15.5341
2015-04-01,15.5409
2015-04-02,15.5817
2015-04-06,15.6973
2015-04-07,15.4797
2015-04-08,15.4186
2015-04-09,15.167
2015-04-10,15.2894
2015-04-13,15.303
2015-04-14,15.2758
2015-04-15,15.1806
2015-04-16,15.235
2015-04-17,15.1806
2015-04-20,15.2894
2015-04-21,15.1806
2015-04-22,15.2846
2015-04-23,15.2777
2015-04-24,15.2846
2015-04-27,15.3123
2015-04-28,15.2499
2015-04-29,15.0004
2015-04-30,14.4458
2015-05-01,14.1824
2015-05-04,14.0161
2015-05-05,13.5863
2015-05-06,13.5724
2015-05-07,13.7041
2015-05-08,13.822
2015-05-11,13.6626
2015-05-12,13.6903
2015-05-13,13.6002
2015-05-14,13.8012
2015-05-15,13.9052
2015-05-18,13.8359
2015-05-19,13.6487
2015-05-20,13.7873
2015-05-21,13.6626
2015-05-22,13.6002
2015-05-26,13.5724
2015-05-27,13.7111
2015-05-28,13.718
2015-05-29,13.5309
2015-06-01,13.6834
2015-06-02,13.6903
2015-06-03,13.6071
2015-06-04,13.5516
2015-06-05,13.413
2015-06-08,13.3922
2015-06-09,13.0941
2015-06-10,13.0664
2015-06-11,13.2328
2015-06-12,13.2259
2015-06-15,13.0872
2015-06-16,13.1912
2015-06-17,13.2259
2015-06-18,13.3368
2015-06-19,13.4269
2015-06-22,13.4269
2015-06-23,13.4477
2015-06-24,13.3021
2015-06-25,13.1149
2015-06-26,13.1496
2015-06-29,12.9347
2015-06-30,12.8585
2015-07-01,12.9902
2015-07-02,12.8446
2015-07-06,12.8238
2015-07-07,13.0595
2015-07-08,12.9624
2015-07-09,12.8793
2015-07-10,13.004
2015-07-13,13.108
2015-07-14,13.1357
2015-07-15,13.2189
2015-07-16,13.3576
2015-07-17,13.3229
2015-07-20,13.2328
2015-07-21,13.2189
2015-07-22,13.0771
2015-07-23,12.7296
2015-07-24,12.7509
2015-07-27,12.6516
2015-07-28,12.6232
2015-07-29,12.7438
2015-07-30,12.4388
2015-07-31,12.2474
2015-08-03,12.3112
2015-08-04,12.141
2015-08-05,11.7935
2015-08-06,11.829
2015-08-07,11.7651
2015-08-10,11.7651
2015-08-11,11.7439
2015-08-12,11.7013
2015-08-13,11.7509
2015-08-14,11.8148
2015-08-17,11.9637
2015-08-18,11.9424
2015-08-19,11.9353
2015-08-20,11.9141
2015-08-21,11.6446
2015-08-24,11.0772
2015-08-25,10.7794
2015-08-26,10.9496
2015-08-27,11.1482
2015-08-28,11.2971
2015-08-31,11.2333
2015-09-01,11.1056
2015-09-02,11.2333
2015-09-03,11.1411
2015-09-04,10.9425
2015-09-08,11.134
2015-09-09,10.8148
2015-09-10,10.8503
2015-09-11,11.056
2015-09-14,11.0631
2015-09-15,11.1127
2015-09-16,11.3467
2015-09-17,11.4744
2015-09-18,11.3609
2015-09-21,11.4673
2015-09-22,11.3893
2015-09-23,11.4744
2015-09-24,11.4318
2015-09-25,11.5169
2015-09-28,11.29
2015-09-29,11.3893
2015-09-30,11.3467
2015-10-01,11.3467
2015-10-02,11.4673
2015-10-05,11.8077
2015-10-06,11.9141
2015-10-07,12.1481
2015-10-08,12.2403
2015-10-09,12.2119
2015-10-12,12.2899
2015-10-13,12.2048
2015-10-14,12.0984
2015-10-15,12.3183
2015-10-16,12.4317
2015-10-19,12.6303
2015-10-20,12.609
2015-10-21,12.4492
2015-10-22,12.5582
2015-10-23,12.4346
2015-10-26,12.2384
2015-10-27,12.0858
2015-10-28,12.173
2015-10-29,11.9259
2015-10-30,11.8314
2015-11-02,12.0422
2015-11-03,12.0712
2015-11-04,11.8387
2015-11-05,11.9332
2015-11-06,11.7079
2015-11-09,11.4026
2015-11-10,11.4753
2015-11-11,11.5335
2015-11-12,11.3954
2015-11-13,11.221
2015-11-16,11.3954
2015-11-17,11.3663
2015-11-18,11.6715
2015-11-19,11.8096
2015-11-20,11.9768
2015-11-23,12.0131
2015-11-24,12.1512
2015-11-25,12.1585
2015-11-27,12.3038
2015-11-30,12.3038
2015-12-01,12.3038
2015-12-02,12.0276
2015-12-03,11.6497
2015-12-04,11.766
2015-12-07,11.5916
2015-12-08,11.6933
2015-12-09,11.6933
2015-12-10,11.5843
2015-12-11,11.4753
2015-12-14,11.5916
2015-12-15,11.5172
2015-12-16,11.8469
2015-12-17,11.5318
2015-12-18,11.4146
2015-12-21,11.3267
2015-12-22,11.5538
2015-12-23,11.671
2015-12-24,11.7003
2015-12-28,11.7223
2015-12-29,11.8762
2015-12-30,11.7443
2015-12-31,11.6271
2016-01-04,11.2461
2016-01-05,11.7003
2016-01-06,11.4952
2016-01-07,11.0849
2016-01-08,10.7186
2016-01-11,10.6746
2016-01-12,10.323
2016-01-13,10.1764
2016-01-14,10.1398
2016-01-15,10.0592
2016-01-19,9.9713
2016-01-20,9.7368
2016-01-21,9.7519
2016-01-22,10.1907
2016-01-25,9.9637
2016-01-26,10.3269
2016-01-27,10.1907
2016-01-28,10.2058
2016-01-29,10.3874
2016-02-01,10.2512
2016-02-02,10.1226
2016-02-03,10.3647
2016-02-04,10.4403
2016-02-05,10.5084
2016-02-08,10.1982
2016-02-09,10.0696
2016-02-10,10.168
2016-02-11,10.0621
2016-02-12,10.1377
2016-02-16,10.3496
2016-02-17,10.5236
2016-02-18,10.289
2016-02-19,10.3874
2016-02-22,10.3798
2016-02-23,10.4101
2016-02-24,10.569
2016-02-25,10.9926
2016-02-26,11.091
2016-02-29,11.2271
2016-03-01,11.7038
2016-03-02,11.5222
2016-03-03,11.8173
2016-03-04,11.908
2016-03-07,12.0291
2016-03-08,11.7113
2016-03-09,11.8551
2016-03-10,11.8551
2016-03-11,12.1955
2016-03-14,12.2182
2016-03-15,12.188
2016-03-16,12.4755
2016-03-17,12.7402
2016-03-18,12.71
2016-03-21,12.6419
2016-03-22,12.8764
2016-03-23,12.5133
2016-03-24,12.6192
2016-03-28,12.8008
2016-03-29,13.3303
2016-03-30,13.3682
2016-03-31,13.5044
2016-04-01,13.6935
2016-04-04,13.58
2016-04-05,13.4363
2016-04-06,13.5044
2016-04-07,13.4514
2016-04-08,13.4892
2016-04-11,13.5951
2016-04-12,13.7389
2016-04-13,13.7464
2016-04-14,13.8675
2016-04-15,13.9961
2016-04-18,14.1096
2016-04-19,14.3593
2016-04-20,14.0566
2016-04-21,13.8165
2016-04-22,14.0024
2016-04-25,14.1341
2016-04-26,14.3742
2016-04-27,14.4361
2016-04-28,14.6297
2016-04-29,14.653
2016-05-02,14.9705
2016-05-03,15.1099
2016-05-04,15.3345
2016-05-05,15.3345
2016-05-06,15.4042
2016-05-09,15.5823
2016-05-10,15.5591
2016-05-11,15.3965
2016-05-12,15.4274
2016-05-13,15.3577
2016-05-16,15.412
2016-05-17,15.1177
2016-05-18,14.8853
2016-05-19,14.7304
2016-05-20,14.7691
2016-05-23,14.6994
2016-05-24,15.017
2016-05-25,14.9783
2016-05-26,14.9163
2016-05-27,15.1177
2016-05-31,15.1796
2016-06-01,15.2416
2016-06-02,15.412
2016-06-03,15.4971
2016-06-06,15.5049
2016-06-07,15.4894
2016-06-08,15.7992
2016-06-09,16.0006
2016-06-10,15.8457
2016-06-13,15.412
2016-06-14,15.3345
2016-06-15,15.4584
2016-06-16,15.8069
2016-06-17,15.8302
2016-06-20,15.8379
2016-06-21,16.0006
2016-06-22,15.9386
2016-06-23,16.1632
2016-06-24,16.4652
2016-06-27,16.7131
2016-06-28,17.3404
2016-06-29,17.4023
2016-06-30,17.8593
2016-07-01,17.9212
2016-07-05,18.0606
2016-07-06,18.0994
2016-07-07,17.7896
2016-07-08,18.0606
2016-07-11,18.1768
2016-07-12,18.4324
2016-07-13,18.9048
2016-07-14,18.7886
2016-07-15,18.6725
2016-07-18,18.7383
2016-07-19,18.2465
2016-07-20,18.1203
2016-07-21,18.0098
2016-07-22,18.2228
2016-07-25,18.2386
2016-07-26,18.073
2016-07-27,17.8126
2016-07-28,18.2623
2016-07-29,18.8224
2016-08-01,18.8934
2016-08-02,18.7277
2016-08-03,18.6212
2016-08-04,18.7198
2016-08-05,18.8145
2016-08-08,18.8066
2016-08-09,18.988
2016-08-10,18.9959
2016-08-11,18.6646
2016-08-12,18.9092
2016-08-15,18.8618
2016-08-16,18.4989
2016-08-17,18.4595
2016-08-18,18.4201
2016-08-19,18.3096
2016-08-22,18.3648
2016-08-23,18.6488
2016-08-24,18.6488
2016-08-25,18.8145
2016-08-26,18.4516
2016-08-29,18.4989
2016-08-30,18.3727
2016-08-31,18.3806
2016-09-01,18.5068
2016-09-02,18.9407
2016-09-06,18.9959
2016-09-07,19.4061
2016-09-08,19.1695
2016-09-09,18.0887
2016-09-12,18.0966
2016-09-13,17.3551
2016-09-14,17.3709
2016-09-15,17.4813
2016-09-16,17.5129
2016-09-19,17.8757
2016-09-20,17.8836
2016-09-21,18.2781
2016-09-22,18.6409
2016-09-23,18.6804
2016-09-26,18.6409
2016-09-27,18.2623
2016-09-28,18.3806
2016-09-29,18.144
2016-09-30,17.8442
2016-10-03,17.5523
2016-10-04,17.079
2016-10-05,16.5031
2016-10-06,16.2743
2016-10-07,15.9825
2016-10-10,16.2586
2016-10-11,16.1087
2016-10-12,16.227
2016-10-13,16.44
2016-10-14,16.3217
2016-10-17,16.5031
2016-10-18,16.7082
2016-10-19,16.8532
2016-10-20,16.7324
2016-10-21,16.6599
2016-10-24,16.6961
2016-10-25,16.6277
2016-10-26,16.2492
2016-10-27,15.2991
2016-10-28,15.3716
2016-10-31,15.4118
2016-11-01,14.6227
2016-11-02,14.357
2016-11-03,14.3489
2016-11-04,14.663
2016-11-07,15.1139
2016-11-08,15.0978
2016-11-09,14.9367
2016-11-10,14.4939
2016-11-11,14.5905
2016-11-14,15.1703
2016-11-15,14.977
2016-11-16,14.977
2016-11-17,14.9287
2016-11-18,15.0495
2016-11-21,14.977
2016-11-22,15.4038
2016-11-23,15.2749
2016-11-25,15.3555
2016-11-28,15.2025
2016-11-29,15.3474
2016-11-30,15.13
2016-12-01,14.8965
2016-12-02,14.8723
2016-12-05,15.1058
2016-12-06,15.4038
2016-12-07,15.7903
2016-12-08,15.7983
2016-12-09,15.8627
2016-12-12,15.8708
2016-12-13,15.6373
2016-12-14,14.9206
2016-12-15,14.6952
2016-12-16,15.1219
2016-12-19,15.3071
2016-12-20,15.4762
2016-12-21,15.13
2016-12-22,15.0736
2016-12-23,15.0978
2016-12-27,15.0978
2016-12-28,14.977
2016-12-29,15.2105
2016-12-30,15.3514
2017-01-03,15.597
2017-01-04,16.056
2017-01-05,16.0157
2017-01-06,15.8708
2017-01-09,15.6775
2017-01-10,15.8386
2017-01-11,16.0318
2017-01-12,16.0399
2017-01-13,16.0479
2017-01-17,16.2814
2017-01-18,16.2734
2017-01-19,16.0348
2017-01-20,16.2569
2017-01-23,16.4873
2017-01-24,16.512
2017-01-25,16.3721
2017-01-26,16.3557
2017-01-27,16.0924
2017-01-30,15.8045
2017-01-31,15.8456
2017-02-01,15.7057
2017-02-02,15.9114
2017-02-03,16.1171
2017-02-06,16.1418
2017-02-07,16.0101
2017-02-08,16.0266
2017-02-09,16.1829
2017-02-10,16.405
2017-02-13,16.4297
2017-02-14,16.043
2017-02-15,15.9443
2017-02-16,16.0842
2017-02-17,16.1006
2017-02-21,16.3474
2017-02-22,16.6519
2017-02-23,16.8904
2017-02-24,17.129
2017-02-27,17.2771
2017-02-28,16.9563
2017-03-01,16.8904
2017-03-02,16.7424
2017-03-03,16.8493
2017-03-06,16.8575
2017-03-07,16.8164
2017-03-08,16.1006
2017-03-09,15.7715
2017-03-10,15.6975
2017-03-13,15.7962
2017-03-14,15.7633
2017-03-15,16.3721
2017-03-16,16.3721
2017-03-17,16.6354
2017-03-20,16.7506
2017-03-21,16.5696
2017-03-22,16.6272
2017-03-23,16.8987
2017-03-24,16.9151
2017-03-27,16.8987
2017-03-28,16.8822
2017-03-29,16.9316
2017-03-30,17.0468
2017-03-31,17.2195
2017-04-03,17.2771
2017-04-04,17.4417
2017-04-05,17.4581
2017-04-06,17.6309
2017-04-07,17.7296
2017-04-10,17.9271
2017-04-11,18.3055
2017-04-12,18.2479
2017-04-13,18.2726
2017-04-17,18.7004
2017-04-18,18.7169
2017-04-19,18.6079
2017-04-20,18.4821
2017-04-21,18.4821
2017-04-24,18.197
2017-04-25,18.155
2017-04-26,17.9789
2017-04-27,17.9706
2017-04-28,17.8783
2017-05-01,17.9286
2017-05-02,17.8532
2017-05-03,17.5513
2017-05-04,17.1907
2017-05-05,17.459
2017-05-08,17.5513
2017-05-09,17.4842
2017-05-10,17.6854
2017-05-11,17.7022
2017-05-12,17.8532
2017-05-15,17.9957
2017-05-16,18.0209
2017-05-17,18.2389
2017-05-18,18.415
2017-05-19,18.6079
2017-05-22,18.5911
2017-05-23,18.6582
2017-05-24,18.6204
2017-05-25,18.4485
2017-05-26,18.3479
2017-05-30,18.1047
2017-05-31,18.1131
2017-06-01,18.5072
2017-06-02,18.7756
2017-06-05,18.6163
2017-06-06,18.5911
2017-06-07,18.7085
2017-06-08,18.7085
2017-06-09,18.8427
2017-06-12,19.1529
2017-06-13,19.1446
2017-06-14,19.1781
2017-06-15,19.0523
2017-06-16,18.9349
2017-06-19,19.0607
2017-06-20,19.1949
2017-06-21,18.9936
2017-06-22,18.9768
2017-06-23,18.8846
2017-06-26,18.7169
2017-06-27,18.3605
2017-06-28,16.2096
2017-06-29,15.3542
2017-06-30,15.3542
2017-07-03,15.48
2017-07-05,15.1865
2017-07-06,14.893
2017-07-07,15.0104
2017-07-10,14.7504
2017-07-11,14.7672
2017-07-12,15.0272
2017-07-13,15.002
2017-07-14,15.1865
2017-07-17,15.3123
2017-07-18,15.2704
2017-07-19,15.3626
2017-07-20,15.3283
2017-07-21,15.0019
2017-07-24,15.0878
2017-07-25,15.0878
2017-07-26,15.3626
2017-07-27,15.5
2017-07-28,15.5172
2017-07-31,15.2252
2017-08-01,15.5687
2017-08-02,15.3197
2017-08-03,15.5859
2017-08-04,15.7576
2017-08-07,15.8435
2017-08-08,15.6975
2017-08-09,15.5515
2017-08-10,15.5773
2017-08-11,15.5687
2017-08-14,15.895
2017-08-15,15.9208
2017-08-16,15.8349
2017-08-17,15.7147
2017-08-18,15.6202
2017-08-21,15.8006
2017-08-22,15.5258
2017-08-23,15.7147
2017-08-24,15.6546
2017-08-25,15.749
2017-08-28,15.5945
2017-08-29,15.6202
2017-08-30,15.792
2017-08-31,15.9294
2017-09-01,15.895
2017-09-05,15.6717
2017-09-06,15.7061
2017-09-07,15.6632
2017-09-08,15.7748
2017-09-11,15.895
2017-09-12,15.7662
2017-09-13,15.8091
2017-09-14,15.9809
2017-09-15,16.1097
2017-09-18,15.8607
2017-09-19,15.7147
2017-09-20,15.7404
2017-09-21,15.7233
2017-09-22,15.8349
2017-09-25,16.1097
2017-09-26,16.1011
2017-09-27,16.0496
2017-09-28,15.9723
2017-09-29,16.1183
2017-10-02,16.29
2017-10-03,16.4446
2017-10-04,16.3587
2017-10-05,16.4274
2017-10-06,16.4103
2017-10-09,16.3759
2017-10-10,16.3845
2017-10-11,16.4188
2017-10-12,16.5562
2017-10-13,16.7366
2017-10-16,16.7366
2017-10-17,16.6936
2017-10-18,16.5906
2017-10-19,16.5219
2017-10-20,16.0037
2017-10-23,15.9158
2017-10-24,15.9158
2017-10-25,15.7314
2017-10-26,15.7753
2017-10-27,15.9334
2017-10-30,15.828
2017-10-31,15.9597
2017-11-01,16.1178
2017-11-02,16.3111
2017-11-03,16.1881
2017-11-06,16.3199
2017-11-07,16.5219
2017-11-08,16.5219
2017-11-09,16.478
2017-11-10,16.478
2017-11-13,16.5043
2017-11-14,16.4604
2017-11-15,16.4165
2017-11-16,16.5482
2017-11-17,16.557
2017-11-20,16.3462
2017-11-21,16.4604
2017-11-22,16.4516
2017-11-24,16.4253
2017-11-27,16.3989
2017-11-28,16.355
2017-11-29,16.3726
2017-11-30,16.3813
2017-12-01,16.5307
2017-12-04,16.478
2017-12-05,15.9861
2017-12-06,15.8807
2017-12-07,15.9026
2017-12-08,16.0651
2017-12-11,16.0564
2017-12-12,16.0915
2017-12-13,16.2496
2017-12-14,16.3813
2017-12-15,16.4955
2017-12-18,16.5175
2017-12-19,16.1618
2017-12-20,15.9422
2017-12-21,15.9685
2017-12-22,15.9597
2017-12-26,16.1618
2017-12-27,16.2232
2017-12-28,16.4077
2017-12-29,16.2847
2018-01-02,16.3462
2018-01-03,15.951
2018-01-04,15.6874
2018-01-05,15.6699
2018-01-08,15.8104
2018-01-09,15.705
2018-01-10,15.6347
2018-01-11,15.6523
2018-01-12,15.5381
2018-01-16,15.503
2018-01-17,15.7226
2018-01-18,15.4942
2018-01-19,15.6699
2018-01-22,15.828
2018-01-23,15.9334
2018-01-24,15.907
2018-01-25,16.1091
2018-01-26,16.0371
2018-01-29,15.4255
2018-01-30,15.0027
2018-01-31,15.4345
2018-02-01,15.2186
2018-02-02,14.9758
2018-02-05,14.4181
2018-02-06,14.625
2018-02-07,14.634
2018-02-08,14.4001
2018-02-09,14.7239
2018-02-12,14.499
2018-02-13,14.499
2018-02-14,14.2562
2018-02-15,14.3911
2018-02-16,14.4811
2018-02-20,14.3102
2018-02-21,13.8604
2018-02-22,14.0763
2018-02-23,14.2382
2018-02-26,13.3388
2018-02-27,12.5922
2018-02-28,12.3404
2018-03-01,12.2504
2018-03-02,12.2864
2018-03-05,12.1425
2018-03-06,12.2864
2018-03-07,12.5742
2018-03-08,12.5023
2018-03-09,12.3044
2018-03-12,12.5473
2018-03-13,12.3854
2018-03-14,12.3134
2018-03-15,12.3134
2018-03-16,12.5293
2018-03-19,12.4663
2018-03-20,12.3314
2018-03-21,12.2324
2018-03-22,12.1155
2018-03-23,11.7108
2018-03-26,11.6388
2018-03-27,11.9536
2018-03-28,12.3314
2018-03-29,12.2864
2018-04-02,11.9536
2018-04-03,12.2235
2018-04-04,11.7557
2018-04-05,11.2251
2018-04-06,11.0452
2018-04-09,10.6854
2018-04-10,11.1081
2018-04-11,11.0902
2018-04-12,10.8653
2018-04-13,11.0182
2018-04-16,11.1441
2018-04-17,11.1351
2018-04-18,11.1891
2018-04-19,11.0542
2018-04-20,11.1081
2018-04-23,11.1441
2018-04-24,11.2521
2018-04-25,11.297
2018-04-26,11.36
2018-04-27,11.6486
2018-04-30,11.63
2018-05-01,11.8163
2018-05-02,11.7604
2018-05-03,12.4215
2018-05-04,12.8871
2018-05-07,12.9616
2018-05-08,12.8684
2018-05-09,12.9336
2018-05-10,12.8498
2018-05-11,12.8778
2018-05-14,12.5984
2018-05-15,12.4122
2018-05-16,12.347
2018-05-17,12.3563
2018-05-18,12.4494
2018-05-21,12.6915
2018-05-22,12.794
2018-05-23,13.0919
2018-05-24,13.1292
2018-05-25,13.2502
2018-05-29,13.5296
2018-05-30,13.5296
2018-05-31,13.5296
2018-06-01,13.4551
2018-06-04,13.4644
2018-06-05,13.1385
2018-06-06,13.2409
2018-06-07,13.1664
2018-06-08,13.213
2018-06-11,13.3526
2018-06-12,13.4364
2018-06-13,13.185
2018-06-14,13.4085
2018-06-15,13.3433
2018-06-18,13.5947
2018-06-19,13.5854
2018-06-20,13.7623
2018-06-21,13.6692
2018-06-22,13.9951
2018-06-25,14.2465
2018-06-26,14.2093
2018-06-27,14.2931
2018-06-28,14.5166
2018-06-29,14.7587
2018-07-02,14.5073
2018-07-03,14.9263
2018-07-05,15.1684
2018-07-06,15.4012
2018-07-09,15.4477
2018-07-10,15.4012
2018-07-11,15.4943
2018-07-12,15.2987
2018-07-13,14.917
2018-07-16,14.5911
2018-07-17,14.4328
2018-07-18,14.3303
2018-07-19,14.8425
2018-07-20,14.8052
2018-07-23,14.5818
2018-07-24,14.5911
2018-07-25,14.6935
2018-07-26,14.6562
2018-07-27,14.0723
2018-07-30,14.4073
2018-07-31,14.4265
2018-08-01,14.6084
2018-08-02,15.0296
2018-08-03,15.1923
2018-08-06,15.1636
2018-08-07,15.5082
2018-08-08,15.4412
2018-08-09,15.3838
2018-08-10,15.3742
2018-08-13,15.1828
2018-08-14,15.5082
2018-08-15,15.7667
2018-08-16,15.9677
2018-08-17,16.2454
2018-08-20,16.0635
2018-08-21,16.2741
2018-08-22,16.1688
2018-08-23,16.1401
2018-08-24,16.2166
2018-08-27,16.1305
2018-08-28,16.3985
2018-08-29,16.3794
2018-08-30,16.1879
2018-08-31,16.1879
2018-09-04,15.8816
2018-09-05,16.2071
2018-09-06,16.1113
2018-09-07,15.939
2018-09-10,16.0922
2018-09-11,16.0539
2018-09-12,16.1209
2018-09-13,16.2262
2018-09-14,16.1688
2018-09-17,12.1529
2018-09-18,11.3105
2018-09-19,10.7888
2018-09-20,11.0377
2018-09-21,11.2004
2018-09-24,10.8653
2018-09-25,11.0089
2018-09-26,10.6164
2018-09-27,10.7696
2018-09-28,10.8079
2018-10-01,10.4633
2018-10-02,10.3005
2018-10-03,9.2858
2018-10-04,9.3815
2018-10-05,9.6591
2018-10-08,10.0133
2018-10-09,10.0421
2018-10-10,10.1282
2018-10-11,9.7549
2018-10-12,9.3145
2018-10-15,9.4007
2018-10-16,9.6209
2018-10-17,9.2284
2018-10-18,9.1518
2018-10-19,9.3815
2018-10-22,9.3337
2018-10-23,9.4677
2018-10-24,9.7453
2018-10-25,9.64
2018-10-26,9.06
2018-10-29,9.1
2018-10-30,9.05
2018-10-31,8.83
2018-11-01,9.37
2018-11-02,8.94
2018-11-05,9.14
2018-11-06,9.28
2018-11-07,9.25
2018-11-08,9.32
2018-11-09,9.31
2018-11-12,9.07
2018-11-13,8.87
2018-11-14,9.03
2018-11-15,8.74
2018-11-16,8.84
2018-11-19,8.86
2018-11-20,8.57
2018-11-21,8.59
2018-11-23,8.69
2018-11-26,8.37
2018-11-27,8.32
2018-11-28,8.57
2018-11-29,8.68
2018-11-30,8.8
2018-12-03,8.66
2018-12-04,8.33
2018-12-06,8.76
2018-12-07,8.57
2018-12-10,8.4
2018-12-11,8.42
2018-12-12,8.5
2018-12-13,8.09
2018-12-14,7.67
2018-12-17,7.22
2018-12-18,7.05
2018-12-19,7.04
2018-12-20,6.76
2018-12-21,6.6
2018-12-24,6.91
2018-12-26,7.21
2018-12-27,7.44
2018-12-28,7.27
2018-12-31,6.87
