date,close
2014-06-13,35.2434
2014-06-16,35.2103
2014-06-17,35.4653
2014-06-18,35.9943
2014-06-19,35.7251
2014-06-20,35.4701
2014-06-23,35.6354
2014-06-24,35.4134
2014-06-25,36.1171
2014-06-26,36.3013
2014-06-27,36.6886
2014-06-30,36.6272
2014-07-01,36.8397
2014-07-02,36.7406
2014-07-03,37.0523
2014-07-07,37.1467
2014-07-08,36.6839
2014-07-09,37.1656
2014-07-10,36.6036
2014-07-11,36.5044
2014-07-14,36.8161
2014-07-15,36.8539
2014-07-16,36.3297
2014-07-17,36.1455
2014-07-18,36.613
2014-07-21,36.2824
2014-07-22,36.3863
2014-07-23,36.5422
2014-07-24,37.1231
2014-07-25,36.7075
2014-07-28,37.0287
2014-07-29,36.887
2014-07-30,37.6002
2014-07-31,36.4288
2014-08-01,37.3395
2014-08-04,36.443
2014-08-05,36.3297
2014-08-06,36.4336
2014-08-07,36.0604
2014-08-08,36.3958
2014-08-11,36.3958
2014-08-12,36.2399
2014-08-13,36.4855
2014-08-14,36.5091
2014-08-15,36.4288
2014-08-18,37.0995
2014-08-19,37.0806
2014-08-20,37.2695
2014-08-21,37.2837
2014-08-22,37.449
2014-08-25,37.7891
2014-08-26,37.5388
2014-08-27,37.6521
2014-08-28,37.3395
2014-08-29,37.2116
2014-09-02,37.5574
2014-09-03,37.3395
2014-09-04,37.8606
2014-09-05,38.8649
2014-09-08,39.0354
2014-09-09,38.7701
2014-09-10,39.0686
2014-09-11,38.7607
2014-09-12,38.7701
2014-09-15,38.6612
2014-09-16,38.4669
2014-09-17,38.6138
2014-09-18,38.8317
2014-09-19,38.7559
2014-09-22,38.2348
2014-09-23,37.9553
2014-09-24,38.2964
2014-09-25,37.78
2014-09-26,42.3989
2014-09-29,42.2189
2014-09-30,42.2568
2014-10-01,41.5462
2014-10-02,42.3042
2014-10-03,42.7732
2014-10-06,42.2663
2014-10-07,41.7215
2014-10-08,42.0815
2014-10-09,41.3235
2014-10-10,41.3046
2014-10-13,40.4519
2014-10-14,40.3098
2014-10-15,40.3524
2014-10-16,41.2335
2014-10-17,41.2998
2014-10-20,42.1147
2014-10-21,42.939
2014-10-22,42.5694
2014-10-23,42.8111
2014-10-24,43.0621
2014-10-27,43.4127
2014-10-28,43.7964
2014-10-29,43.5595
2014-10-30,44.057
2014-10-31,44.0428
2014-11-03,44.2701
2014-11-04,44.507
2014-11-05,44.8528
2014-11-06,44.8149
2014-11-07,44.4265
2014-11-10,44.9855
2014-11-11,44.9476
2014-11-12,45.3881
2014-11-13,45.535
2014-11-14,45.2413
2014-11-17,45.5066
2014-11-18,45.7008
2014-11-19,45.9282
2014-11-20,46.094
2014-11-21,46.1509
2014-11-24,46.4019
2014-11-25,46.0893
2014-11-26,46.3309
2014-11-28,47.0367
2014-12-01,46.2788
2014-12-02,46.4446
2014-12-03,46.6625
2014-12-04,46.923
2014-12-05,47.0557
2014-12-08,46.293
2014-12-09,45.9661
2014-12-10,46.2645
2014-12-11,46.0508
2014-12-12,45.6897
2014-12-15,45.3381
2014-12-16,44.2834
2014-12-17,44.8963
2014-12-18,46.122
2014-12-19,45.0578
2014-12-22,45.5757
2014-12-23,45.5947
2014-12-24,45.7467
2014-12-26,46.0032
2014-12-29,46.2265
2014-12-30,46.027
2014-12-31,45.6802
2015-01-02,45.1481
2015-01-05,44.4212
2015-01-06,44.1599
2015-01-07,45.0721
2015-01-08,46.1125
2015-01-09,45.6042
2015-01-12,45.5424
2015-01-13,45.1386
2015-01-14,44.521
2015-01-15,44.0934
2015-01-16,44.1789
2015-01-20,44.4734
2015-01-21,44.4259
2015-01-22,45.5377
2015-01-23,45.6849
2015-01-26,45.7752
2015-01-27,44.8963
2015-01-28,44.3309
2015-01-29,45.0721
2015-01-30,43.8273
2015-02-02,43.6705
2015-02-03,44.3499
2015-02-04,43.9651
2015-02-05,44.3452
2015-02-06,43.6088
2015-02-09,43.3142
2015-02-10,44.0649
2015-02-11,43.3807
2015-02-12,43.7085
2015-02-13,43.7275
2015-02-17,43.642
2015-02-18,44.4782
2015-02-19,44.5162
2015-02-20,45.1006
2015-02-23,45.1386
2015-02-24,45.3334
2015-02-25,45.9985
2015-02-26,46.2129
2015-02-27,46.2748
2015-03-02,47.0515
2015-03-03,46.6798
2015-03-04,46.4654
2015-03-05,46.9133
2015-03-06,46.1748
2015-03-09,46.4226
2015-03-10,45.9842
2015-03-11,45.4267
2015-03-12,46.2367
2015-03-13,45.6507
2015-03-16,45.9508
2015-03-17,45.9985
2015-03-18,46.4607
2015-03-19,46.8466
2015-03-20,48.5905
2015-03-23,48.3427
2015-03-24,47.9568
2015-03-25,47.1658
2015-03-26,47.3278
2015-03-27,47.5899
2015-03-30,48.0711
2015-03-31,47.8043
2015-04-01,47.4327
2015-04-02,47.4851
2015-04-06,47.5184
2015-04-07,47.4613
2015-04-08,48.0473
2015-04-09,47.9901
2015-04-10,47.6328
2015-04-13,47.2993
2015-04-14,47.4231
2015-04-15,47.5661
2015-04-16,47.5994
2015-04-17,46.9562
2015-04-20,47.6423
2015-04-21,47.7853
2015-04-22,47.7186
2015-04-23,48.176
2015-04-24,48.0997
2015-04-27,48.095
2015-04-28,47.5804
2015-04-29,47.7281
2015-04-30,47.0944
2015-05-01,48.0187
2015-05-04,48.0426
2015-05-05,47.8472
2015-05-06,47.7519
2015-05-07,48.338
2015-05-08,48.8097
2015-05-11,48.9764
2015-05-12,48.7763
2015-05-13,48.6763
2015-05-14,49.2861
2015-05-15,50.0199
2015-05-18,49.9103
2015-05-19,49.8579
2015-05-20,49.8436
2015-05-21,49.7436
2015-05-22,49.7578
2015-05-26,49.2766
2015-05-27,49.0003
2015-05-28,48.8761
2015-05-29,48.5751
2015-06-01,48.6181
2015-06-02,48.7853
2015-06-03,48.9764
2015-06-04,48.7088
2015-06-05,48.7471
2015-06-08,48.4652
2015-06-09,48.4222
2015-06-10,49.3729
2015-06-11,49.6309
2015-06-12,49.5832
2015-06-15,49.3777
2015-06-16,49.9558
2015-06-17,50.0466
2015-06-18,50.6438
2015-06-19,50.897
2015-06-22,51.0213
2015-06-23,51.2171
2015-06-24,50.7489
2015-06-25,50.2711
2015-06-26,52.4163
2015-06-29,51.4417
2015-06-30,51.6089
2015-07-01,52.2826
2015-07-02,52.4928
2015-07-06,52.4785
2015-07-07,53.1712
2015-07-08,52.2061
2015-07-09,52.2873
2015-07-10,52.8033
2015-07-13,53.7063
2015-07-14,53.6729
2015-07-15,53.4627
2015-07-16,53.6729
2015-07-17,53.8927
2015-07-20,54.0503
2015-07-21,53.9834
2015-07-22,54.509
2015-07-23,54.466
2015-07-24,53.9834
2015-07-27,53.3814
2015-07-28,54.2128
2015-07-29,54.9055
2015-07-30,54.9485
2015-07-31,55.0489
2015-08-03,54.8625
2015-08-04,55.3116
2015-08-05,55.7799
2015-08-06,55.0011
2015-08-07,54.7097
2015-08-10,55.1158
2015-08-11,54.6858
2015-08-12,54.0169
2015-08-13,54.2749
2015-08-14,54.638
2015-08-17,54.9342
2015-08-18,54.8578
2015-08-19,54.9246
2015-08-20,53.6538
2015-08-21,51.0595
2015-08-24,49.6262
2015-08-25,49.4637
2015-08-26,51.9625
2015-08-27,53.8067
2015-08-28,53.7493
2015-08-31,53.391
2015-09-01,51.9004
2015-09-02,52.8893
2015-09-03,53.0953
2015-09-04,52.5397
2015-09-08,53.5264
2015-09-09,52.6211
2015-09-10,52.8702
2015-09-11,53.5599
2015-09-14,53.5934
2015-09-15,54.5274
2015-09-16,55.3609
2015-09-17,55.2124
2015-09-18,55.107
2015-09-21,55.8303
2015-09-22,55.5477
2015-09-23,55.289
2015-09-24,54.9825
2015-09-25,59.8729
2015-09-28,58.503
2015-09-29,57.3199
2015-09-30,58.9006
2015-10-01,59.3125
2015-10-02,59.9735
2015-10-05,59.5232
2015-10-06,59.0059
2015-10-07,58.4838
2015-10-08,59.8298
2015-10-09,59.8442
2015-10-12,60.5578
2015-10-13,60.2609
2015-10-14,60.2752
2015-10-15,61.6882
2015-10-16,62.4929
2015-10-19,63.8053
2015-10-20,63.403
2015-10-21,63.4509
2015-10-22,63.4222
2015-10-23,62.5217
2015-10-26,62.9288
2015-10-27,62.6606
2015-10-28,62.8857
2015-10-29,62.8043
2015-10-30,62.7612
2015-11-02,62.8378
2015-11-03,62.9384
2015-11-04,62.4402
2015-11-05,63.1587
2015-11-06,63.1204
2015-11-09,62.4977
2015-11-10,62.2678
2015-11-11,61.032
2015-11-12,60.3423
2015-11-13,58.3689
2015-11-16,59.1353
2015-11-17,58.7138
2015-11-18,60.2465
2015-11-19,60.2465
2015-11-20,63.5371
2015-11-23,63.4461
2015-11-24,63.4701
2015-11-25,64.246
2015-11-27,64.3418
2015-11-30,63.3599
2015-12-01,63.8532
2015-12-02,63.5371
2015-12-03,61.8463
2015-12-04,63.3838
2015-12-07,63.1105
2015-12-08,63.1584
2015-12-09,61.7869
2015-12-10,61.691
2015-12-11,60.564
2015-12-14,61.3169
2015-12-15,61.6766
2015-12-16,62.7892
2015-12-17,62.4487
2015-12-18,61.6334
2015-12-21,62.2473
2015-12-22,63.2304
2015-12-23,61.7245
2015-12-24,60.5976
2015-12-28,61.2018
2015-12-29,61.6334
2015-12-30,60.6647
2015-12-31,59.9454
2016-01-04,59.0054
2016-01-05,59.8303
2016-01-06,58.9766
2016-01-07,57.4037
2016-01-08,56.4637
2016-01-11,57.1159
2016-01-12,57.49
2016-01-13,56.3774
2016-01-14,56.1185
2016-01-15,55.2073
2016-01-19,55.9362
2016-01-20,56.6268
2016-01-21,58.0847
2016-01-22,58.3916
2016-01-25,58.2189
2016-01-26,58.6122
2016-01-27,57.1447
2016-01-28,58.6985
2016-01-29,59.4754
2016-02-01,60.5784
2016-02-02,59.9933
2016-02-03,59.9358
2016-02-04,57.7106
2016-02-05,54.8332
2016-02-08,52.7903
2016-02-09,53.4041
2016-02-10,55.0634
2016-02-11,53.7111
2016-02-12,54.1139
2016-02-16,55.4279
2016-02-17,55.7924
2016-02-18,56.2048
2016-02-19,56.8858
2016-02-22,57.7106
2016-02-23,57.749
2016-02-24,57.9312
2016-02-25,59.8303
2016-02-26,60.0413
2016-02-29,59.0726
2016-03-01,60.3482
2016-03-02,59.6768
2016-03-03,59.1095
2016-03-04,58.9076
2016-03-07,56.9747
2016-03-08,57.5132
2016-03-09,56.0901
2016-03-10,56.619
2016-03-11,57.7729
2016-03-14,58.4748
2016-03-15,59.0422
2016-03-16,59.4845
2016-03-17,60.7538
2016-03-18,60.5711
2016-03-21,62.2347
2016-03-22,62.4078
2016-03-23,60.0422
2016-03-24,59.2826
2016-03-28,58.9845
2016-03-29,59.1287
2016-03-30,59.6576
2016-03-31,59.1095
2016-04-01,59.2249
2016-04-04,57.6671
2016-04-05,57.3786
2016-04-06,57.994
2016-04-07,57.9844
2016-04-08,57.1382
2016-04-11,55.6958
2016-04-12,56.3016
2016-04-13,57.2921
2016-04-14,57.2055
2016-04-15,57.2151
2016-04-18,57.2825
2016-04-19,57.2728
2016-04-20,57.3305
2016-04-21,57.7729
2016-04-22,57.1478
2016-04-25,56.9363
2016-04-26,57.2536
2016-04-27,56.994
2016-04-28,56.292
2016-04-29,56.6767
2016-05-02,57.3017
2016-05-03,57.2344
2016-05-04,56.8401
2016-05-05,55.9555
2016-05-06,56.1862
2016-05-09,56.4651
2016-05-10,56.9267
2016-05-11,54.8208
2016-05-12,55.7631
2016-05-13,55.1092
2016-05-16,54.9458
2016-05-17,54.9073
2016-05-18,53.9649
2016-05-19,54.8496
2016-05-20,54.3111
2016-05-23,53.8399
2016-05-24,54.4169
2016-05-25,53.8399
2016-05-26,53.6957
2016-05-27,54.0323
2016-05-31,53.0995
2016-06-01,52.8211
2016-06-02,52.5896
2016-06-03,51.548
2016-06-06,52.3678
2016-06-07,51.6445
2016-06-08,52.1942
2016-06-09,52.985
2016-06-10,53.149
2016-06-13,52.9561
2016-06-14,52.1942
2016-06-15,52.3774
2016-06-16,51.5673
2016-06-17,51.7988
2016-06-20,52.4257
2016-06-21,52.8211
2016-06-22,52.6282
2016-06-23,52.1942
2016-06-24,50.7186
2016-06-27,50.0436
2016-06-28,51.2009
2016-06-29,53.1683
2016-06-30,53.2358
2016-07-01,53.6312
2016-07-05,53.2358
2016-07-06,53.8144
2016-07-07,53.9302
2016-07-08,54.7017
2016-07-11,54.8078
2016-07-12,55.994
2016-07-13,55.9265
2016-07-14,56.4087
2016-07-15,55.8108
2016-07-18,55.6854
2016-07-19,55.7047
2016-07-20,55.7047
2016-07-21,54.9621
2016-07-22,54.7113
2016-07-25,55.1067
2016-07-26,54.3641
2016-07-27,53.8048
2016-07-28,53.4769
2016-07-29,53.5251
2016-08-01,53.4383
2016-08-02,52.9657
2016-08-03,52.8018
2016-08-04,52.8404
2016-08-05,53.8626
2016-08-08,53.988
2016-08-09,53.7855
2016-08-10,53.1683
2016-08-11,54.7113
2016-08-12,54.4413
2016-08-15,54.7499
2016-08-16,54.856
2016-08-17,54.8367
2016-08-18,55.1743
2016-08-19,56.8041
2016-08-22,56.5727
2016-08-23,57.4985
2016-08-24,58.0771
2016-08-25,57.132
2016-08-26,56.9006
2016-08-29,56.5437
2016-08-30,55.9361
2016-08-31,55.5894
2016-09-01,56.6145
2016-09-02,56.1116
2016-09-06,55.5217
2016-09-07,55.8215
2016-09-08,54.3225
2016-09-09,53.5101
2016-09-12,54.1678
2016-09-13,53.5488
2016-09-14,53.3167
2016-09-15,53.6455
2016-09-16,53.3651
2016-09-19,53.1426
2016-09-20,53.0652
2016-09-21,53.5198
2016-09-22,53.5875
2016-09-23,53.336
2016-09-26,52.6107
2016-09-27,53.5198
2016-09-28,51.4985
2016-09-29,50.4444
2016-09-30,50.9183
2016-10-03,50.9376
2016-10-04,50.425
2016-10-05,50.4057
2016-10-06,50.3187
2016-10-07,50.0866
2016-10-10,50.0866
2016-10-11,50.1156
2016-10-12,50.7152
2016-10-13,50.3187
2016-10-14,49.9221
2016-10-17,49.3516
2016-10-18,49.5353
2016-10-19,50.0962
2016-10-20,50.1833
2016-10-21,50.0672
2016-10-24,50.1639
2016-10-25,49.3709
2016-10-26,50.2606
2016-10-27,50.1833
2016-10-28,50.309
2016-10-31,48.5295
2016-11-01,47.9879
2016-11-02,48.0846
2016-11-03,48.0943
2016-11-04,48.3167
2016-11-07,49.2355
2016-11-08,49.3999
2016-11-09,49.4386
2016-11-10,48.7326
2016-11-11,49.1001
2016-11-14,48.5585
2016-11-15,48.4812
2016-11-16,49.0131
2016-11-17,49.8931
2016-11-18,49.4193
2016-11-21,49.5933
2016-11-22,50.0092
2016-11-23,49.6514
2016-11-25,49.8254
2016-11-28,49.3322
2016-11-29,48.9647
2016-11-30,48.4231
2016-12-01,49.1608
2016-12-02,48.9764
2016-12-05,50.3255
2016-12-06,49.0831
2016-12-07,50.5681
2016-12-08,50.0343
2016-12-09,50.1993
2016-12-12,50.0246
2016-12-13,50.7623
2016-12-14,50.2673
2016-12-15,49.782
2016-12-16,49.4228
2016-12-19,49.3549
2016-12-20,50.2673
2016-12-21,50.7623
2016-12-22,50.607
2016-12-23,50.3837
2016-12-27,49.782
2016-12-28,49.5199
2016-12-29,49.5587
2016-12-30,49.3355
2017-01-03,50.4517
2017-01-04,51.5096
2017-01-05,51.4999
2017-01-06,52.3249
2017-01-09,51.8105
2017-01-10,51.5485
2017-01-11,51.1408
2017-01-12,50.8593
2017-01-13,51.364
2017-01-17,52.0726
2017-01-18,51.7038
2017-01-19,51.3737
2017-01-20,51.6358
2017-01-23,51.6746
2017-01-24,51.8785
2017-01-25,52.2764
2017-01-26,52.0726
2017-01-27,51.6261
2017-01-30,51.5193
2017-01-31,51.3446
2017-02-01,51.4611
2017-02-02,51.2476
2017-02-03,50.8205
2017-02-06,51.2476
2017-02-07,51.2573
2017-02-08,52.2958
2017-02-09,53.6838
2017-02-10,54.567
2017-02-13,54.4408
2017-02-14,54.7903
2017-02-15,54.9747
2017-02-16,54.635
2017-02-17,55.0814
2017-02-21,55.6735
2017-02-22,56.5276
2017-02-23,55.7026
2017-02-24,56.1588
2017-02-27,55.9938
2017-02-28,55.4794
2017-03-01,56.2461
2017-03-02,56.2754
2017-03-03,55.2044
2017-03-06,55.2725
2017-03-07,55.0583
2017-03-08,55.0194
2017-03-09,54.8733
2017-03-10,54.9415
2017-03-13,55.1752
2017-03-14,55.7691
2017-03-15,56.139
2017-03-16,56.0806
2017-03-17,56.2754
2017-03-20,57.1321
2017-03-21,56.4798
2017-03-22,52.4977
2017-03-23,53.9094
2017-03-24,54.8733
2017-03-27,54.4547
2017-03-28,55.1265
2017-03-29,55.1849
2017-03-30,54.5618
2017-03-31,54.26
2017-04-03,54.0944
2017-04-04,53.5882
2017-04-05,53.5297
2017-04-06,53.6855
2017-04-07,53.6563
2017-04-10,53.4518
2017-04-11,53.4713
2017-04-12,54.1042
2017-04-13,53.8802
2017-04-17,54.7565
2017-04-18,54.6299
2017-04-19,54.3865
2017-04-20,54.9123
2017-04-21,54.3768
2017-04-24,54.0068
2017-04-25,53.9873
2017-04-26,53.705
2017-04-27,54.0068
2017-04-28,53.9484
2017-05-01,53.5395
2017-05-02,53.6174
2017-05-03,53.0916
2017-05-04,53.0332
2017-05-05,52.5269
2017-05-08,52.8677
2017-05-09,53.4421
2017-05-10,53.1208
2017-05-11,52.8093
2017-05-12,52.7703
2017-05-15,52.3517
2017-05-16,51.3878
2017-05-17,50.4336
2017-05-18,50.3168
2017-05-19,50.4044
2017-05-22,50.2097
2017-05-23,50.8231
2017-05-24,50.6381
2017-05-25,50.9691
2017-05-26,51.2028
2017-05-30,51.5241
2017-05-31,51.5922
2017-06-01,51.094
2017-06-02,51.7583
2017-06-05,51.7876
2017-06-06,51.2698
2017-06-07,52.0026
2017-06-08,51.9732
2017-06-09,52.2272
2017-06-12,52.7841
2017-06-13,53.0576
2017-06-14,53.3996
2017-06-15,51.6802
2017-06-16,49.9217
2017-06-19,50.8205
2017-06-20,50.3711
2017-06-21,51.3773
2017-06-22,51.1917
2017-06-23,51.6313
2017-06-26,52.0514
2017-06-27,51.729
2017-06-28,52.1296
2017-06-29,51.9439
2017-06-30,57.6395
2017-07-03,57.2976
2017-07-05,56.2327
2017-07-06,55.8419
2017-07-07,56.643
2017-07-10,57.3757
2017-07-11,56.8384
2017-07-12,56.8775
2017-07-13,56.6039
2017-07-14,56.6626
2017-07-17,56.4574
2017-07-18,56.3206
2017-07-19,56.4379
2017-07-20,57.7372
2017-07-21,58.5676
2017-07-24,57.5907
2017-07-25,58.0205
2017-07-26,57.0143
2017-07-27,56.8091
2017-07-28,57.3171
2017-07-31,57.6883
2017-08-01,58.4601
2017-08-02,58.4113
2017-08-03,58.7532
2017-08-04,58.382
2017-08-07,58.4113
2017-08-08,58.0889
2017-08-09,58.5187
2017-08-10,57.7079
2017-08-11,57.6102
2017-08-14,58.4015
2017-08-15,57.2096
2017-08-16,57.1901
2017-08-17,56.135
2017-08-18,53.6829
2017-08-21,52.3738
2017-08-22,52.8818
2017-08-23,52.3738
2017-08-24,52.5985
2017-08-25,52.6571
2017-08-28,52.491
2017-08-29,51.5141
2017-08-30,51.348
2017-08-31,51.7695
2017-09-01,52.3087
2017-09-05,51.9656
2017-09-06,51.7205
2017-09-07,51.3578
2017-09-08,51.1716
2017-09-11,51.9852
2017-09-12,52.3479
2017-09-13,52.4656
2017-09-14,52.6714
2017-09-15,52.8087
2017-09-18,52.446
2017-09-19,52.2793
2017-09-20,52.5048
2017-09-21,52.1421
2017-09-22,52.1911
2017-09-25,52.1813
2017-09-26,52.642
2017-09-27,51.6323
2017-09-28,51.5931
2017-09-29,50.8285
2017-10-02,50.8481
2017-10-03,50.4559
2017-10-04,51.0539
2017-10-05,51.152
2017-10-06,51.3872
2017-10-09,50.505
2017-10-10,50.5148
2017-10-11,50.0246
2017-10-12,49.8286
2017-10-13,49.9756
2017-10-16,50.3579
2017-10-17,50.9755
2017-10-18,51.2696
2017-10-19,51.6519
2017-10-20,52.0146
2017-10-23,52.6028
2017-10-24,52.3675
2017-10-25,53.8576
2017-10-26,55.6907
2017-10-27,54.8575
2017-10-30,54.1811
2017-10-31,53.9066
2017-11-01,53.985
2017-11-02,54.034
2017-11-03,54.6124
2017-11-06,54.9359
2017-11-07,54.0634
2017-11-08,54.6614
2017-11-09,55.0241
2017-11-10,54.9849
2017-11-13,54.8085
2017-11-14,54.8771
2017-11-15,55.5143
2017-11-16,56.1025
2017-11-17,58.0238
2017-11-20,58.0827
2017-11-21,58.2199
2017-11-22,57.9062
2017-11-24,58.1513
2017-11-27,58.4552
2017-11-28,58.4062
2017-11-29,59.1708
2017-11-30,59.2296
2017-12-01,58.8952
2017-12-04,59.1116
2017-12-05,59.4263
2017-12-06,58.7378
2017-12-07,59.6034
2017-12-08,60.2918
2017-12-11,60.8918
2017-12-12,61.1475
2017-12-13,63.2425
2017-12-14,63.4687
2017-12-15,63.7244
2017-12-18,63.7441
2017-12-19,63.1835
2017-12-20,62.5442
2017-12-21,63.7048
2017-12-22,62.2491
2017-12-26,62.6032
2017-12-27,61.9147
2017-12-28,61.9147
2017-12-29,61.5213
2018-01-02,62.4458
2018-01-03,62.436
2018-01-04,62.3966
2018-01-05,62.9278
2018-01-08,63.4884
2018-01-09,63.036
2018-01-10,63.1638
2018-01-11,63.2327
2018-01-12,63.6064
2018-01-16,62.377
2018-01-17,62.7606
2018-01-18,63.0556
2018-01-19,66.1046
2018-01-22,65.2981
2018-01-23,66.0358
2018-01-24,66.8817
2018-01-25,66.5964
2018-01-26,66.921
2018-01-29,66.4686
2018-01-30,66.2227
2018-01-31,67.098
2018-02-01,66.5374
2018-02-02,66.1145
2018-02-05,63.331
2018-02-06,64.1474
2018-02-07,64.5506
2018-02-08,61.4623
2018-02-09,64.4129
2018-02-12,64.8949
2018-02-13,64.7867
2018-02-14,66.8423
2018-02-15,67.1669
2018-02-16,67.1767
2018-02-20,66.38
2018-02-21,65.9473
2018-02-22,66.026
2018-02-23,67.039
2018-02-26,68.5045
2018-02-27,66.9112
2018-02-28,65.9276
2018-03-01,65.2293
2018-03-02,65.0024
2018-03-05,64.1737
2018-03-06,64.3612
2018-03-07,63.3056
2018-03-08,64.2329
2018-03-09,65.4069
2018-03-12,65.9199
2018-03-13,65.2786
2018-03-14,65.3082
2018-03-15,65.4957
2018-03-16,65.0221
2018-03-19,64.8248
2018-03-20,65.9001
2018-03-21,65.4562
2018-03-22,63.5522
2018-03-23,63.7594
2018-03-26,65.0123
2018-03-27,65.2786
2018-03-28,64.5585
2018-03-29,65.545
2018-04-02,63.2562
2018-04-03,65.8015
2018-04-04,67.4983
2018-04-05,68.6526
2018-04-06,66.64
2018-04-09,66.275
2018-04-10,66.0974
2018-04-11,65.9297
2018-04-12,66.8571
2018-04-13,66.3441
2018-04-16,66.1566
2018-04-17,66.6006
2018-04-18,65.3082
2018-04-19,64.8446
2018-04-20,65.1997
2018-04-23,65.9791
2018-04-24,66.0679
2018-04-25,65.7719
2018-04-26,67.1333
2018-04-27,68.623
2018-04-30,67.4687
2018-05-01,67.1826
2018-05-02,67.3405
2018-05-03,65.9988
2018-05-04,67.1826
2018-05-07,68.4059
2018-05-08,67.5378
2018-05-09,67.0347
2018-05-10,67.0051
2018-05-11,67.5082
2018-05-14,67.9127
2018-05-15,68.5638
2018-05-16,70.379
2018-05-17,69.9844
2018-05-18,70.3593
2018-05-21,70.4184
2018-05-22,70.3494
2018-05-23,70.379
2018-05-24,71.2077
2018-05-25,71.2767
2018-05-29,69.9646
2018-05-30,71.257
2018-05-31,70.8328
2018-06-01,71.9804
2018-06-04,73.0389
2018-06-05,73.2566
2018-06-06,73.9491
2018-06-07,73.959
2018-06-08,74.0975
2018-06-11,73.7908
2018-06-12,73.494
2018-06-13,73.3159
2018-06-14,73.8996
2018-06-15,75.0274
2018-06-18,74.7999
2018-06-19,73.4643
2018-06-20,73.9194
2018-06-21,73.1478
2018-06-22,72.6432
2018-06-25,71.5748
2018-06-26,71.7825
2018-06-27,70.5855
2018-06-28,70.9318
2018-06-29,78.8262
2018-07-02,77.5105
2018-07-03,75.4627
2018-07-05,75.7298
2018-07-06,75.6605
2018-07-09,76.452
2018-07-10,76.7389
2018-07-11,76.5311
2018-07-12,76.541
2018-07-13,76.5509
2018-07-16,76.9169
2018-07-17,76.6399
2018-07-18,75.7694
2018-07-19,76.1255
2018-07-20,76.1354
2018-07-23,75.7694
2018-07-24,74.7207
2018-07-25,76.3333
2018-07-26,77.3126
2018-07-27,76.0661
2018-07-30,75.1461
2018-07-31,76.0859
2018-08-01,76.7092
2018-08-02,77.8073
2018-08-03,77.8963
2018-08-06,78.6581
2018-08-07,79.6671
2018-08-08,79.6375
2018-08-09,80.3893
2018-08-10,79.865
2018-08-13,79.2912
2018-08-14,79.2813
2018-08-15,78.7174
2018-08-16,79.1923
2018-08-17,78.8955
2018-08-20,81.2995
2018-08-21,82.0612
2018-08-22,81.7545
2018-08-23,82.0216
2018-08-24,81.5666
2018-08-27,81.7644
2018-08-28,81.6952
2018-08-29,81.9029
2018-08-30,80.5278
2018-08-31,81.5195
2018-09-04,78.9411
2018-09-05,79.2584
2018-09-06,79.7344
2018-09-07,79.6353
2018-09-10,81.4204
2018-09-11,81.946
2018-09-12,82.3129
2018-09-13,82.779
2018-09-14,82.7989
2018-09-17,82.5708
2018-09-18,84.5542
2018-09-19,83.7311
2018-09-20,84.6633
2018-09-21,84.8418
2018-09-24,83.5724
2018-09-25,84.0881
2018-09-26,83.0071
2018-09-27,83.8402
2018-09-28,84.0187
2018-10-01,83.7608
2018-10-02,82.0848
2018-10-03,81.8171
2018-10-04,79.5163
2018-10-05,79.4568
2018-10-08,79.5658
2018-10-09,79.7543
2018-10-10,74.3196
2018-10-11,73.8932
2018-10-12,75.2816
2018-10-15,74.3692
2018-10-16,76.8386
2018-10-17,75.8469
2018-10-18,74.9742
2018-10-19,73.5957
2018-10-22,74.28
2018-10-23,72.7428
2018-10-24,71.523
2018-10-25,72.4949
2018-10-26,71.4734
2018-10-29,71.5924
2018-10-30,73.8932
2018-10-31,74.4188
2018-11-01,76.1543
2018-11-02,75.9461
2018-11-05,76.8882
2018-11-06,75.9361
2018-11-07,77.3246
2018-11-08,77.1361
2018-11-09,75.7279
2018-11-12,74.4783
2018-11-13,74.5775
2018-11-14,74.5775
2018-11-15,73.7147
2018-11-16,74.1213
2018-11-19,71.9197
2018-11-20,70.5313
2018-11-21,71.7709
2018-11-23,70.8982
2018-11-26,72.1081
2018-11-27,71.4932
2018-11-28,74.042
2018-11-29,73.7246
2018-11-30,74.7192
2018-12-03,77.5242
2018-12-04,75.3857
2018-12-06,75.137
2018-12-07,72.9487
2018-12-10,72.1232
2018-12-11,73.1775
2018-12-12,73.9235
2018-12-13,72.5409
2018-12-14,72.1431
2018-12-17,69.5271
2018-12-18,70.7704
2018-12-19,68.6021
2018-12-20,67.1697
2018-12-21,71.9839
2018-12-24,67.7367
2018-12-26,72.6205
2018-12-27,73.277
2018-12-28,72.9487
2018-12-31,73.7445
2019-01-02,73.6649
2019-01-03,72.3619
2019-01-04,74.2518
2019-01-07,75.316
2019-01-08,76.3207
2019-01-09,76.1814
2019-01-10,76.0123
2019-01-11,75.6343
2019-01-14,75.6841
2019-01-15,77.4645
2019-01-16,77.2656
2019-01-17,78.7079
2019-01-18,80.0208
2019-01-22,80.3192
2019-01-23,80.0705
2019-01-24,80.0109
2019-01-25,80.18
2019-01-28,79.8915
2019-01-29,79.792
2019-01-30,80.8464
2019-01-31,81.4432
2019-02-01,81.0752
2019-02-04,81.5526
2019-02-05,82.418
2019-02-06,82.2688
2019-02-07,81.9505
2019-02-08,81.9206
2019-02-11,83.2336
2019-02-12,84.2581
2019-02-13,84.9444
2019-02-14,84.2282
2019-02-15,84.9245
2019-02-19,84.1188
2019-02-20,84.3874
2019-02-21,83.5021
2019-02-22,84.3078
2019-02-25,84.7156
2019-02-26,85.3423
2019-02-27,85.7103
2019-02-28,85.2726
2019-03-01,86.918
2019-03-04,85.4023
2019-03-05,85.2028
2019-03-06,84.8937
2019-03-07,85.0233
2019-03-08,84.5646
2019-03-11,85.5818
2019-03-12,85.1928
2019-03-13,85.6915
2019-03-14,86.6288
2019-03-15,86.559
2019-03-18,87.5762
2019-03-19,87.4466
2019-03-20,86.4493
2019-03-21,87.7657
2019-03-22,81.9618
2019-03-25,82.1015
2019-03-26,83.1485
2019-03-27,82.8593
2019-03-28,83.8067
2019-03-29,83.9762
2019-04-01,84.9934
2019-04-02,84.1358
2019-04-03,84.2355
2019-04-04,85.0433
2019-04-05,85.1629
2019-04-08,84.4948
2019-04-09,84.046
2019-04-10,84.6444
2019-04-11,84.764
2019-04-12,86.0006
2019-04-15,86.589
2019-04-16,87.5563
2019-04-17,88.4837
2019-04-18,88.9524
2019-04-22,87.1175
2019-04-23,87.1873
2019-04-24,88.1446
2019-04-25,87.3169
2019-04-26,88.0649
2019-04-29,88.015
2019-04-30,87.5862
2019-05-01,85.6615
2019-05-02,85.0333
2019-05-03,85.4621
2019-05-06,83.338
2019-05-07,82.3109
2019-05-08,82.5402
2019-05-09,82.7496
2019-05-10,83.717
2019-05-13,82.3009
2019-05-14,83.4377
2019-05-15,83.7768
2019-05-16,84.046
2019-05-17,84.3352
2019-05-20,82.62
2019-05-21,83.4078
2019-05-22,82.969
2019-05-23,82.4106
2019-05-24,81.9319
2019-05-28,80.9746
2019-05-29,78.6511
2019-05-30,79.04
2019-05-31,77.14
2019-06-03,77.96
2019-06-04,81.62
2019-06-05,82.72
2019-06-06,82.45
2019-06-07,83.41
2019-06-10,82.58
2019-06-11,83.26
2019-06-12,82.63
2019-06-13,83.56
2019-06-14,83.61
2019-06-17,82.29
2019-06-18,84.295
2019-06-19,83.445
2019-06-20,85.2
2019-06-21,85.56
2019-06-24,84.41
2019-06-25,82.705
2019-06-26,82.61
2019-06-27,83.665
2019-06-28,83.6
2019-07-01,85.325
2019-07-02,84.73
2019-07-03,86.17
2019-07-04,86.17
2019-07-05,86.685
2019-07-08,88.42
2019-07-09,88.08
2019-07-10,87.73
2019-07-11,88.07
2019-07-12,88.99
2019-07-15,89.545
2019-07-16,88.63
2019-07-17,87.56
2019-07-18,87.4
2019-07-19,86.62
2019-07-22,85.975
2019-07-23,86.625
2019-07-24,86.61
2019-07-25,87.14
2019-07-26,87.575
2019-07-29,87.64
2019-07-30,87.14
2019-07-31,86.04
2019-08-01,83
2019-08-02,81.09
2019-08-05,79.16
2019-08-06,81.255
2019-08-07,81.24
2019-08-08,82.945
2019-08-09,82.07
2019-08-12,81.7
2019-08-13,83.28
2019-08-14,81.12
2019-08-15,79.61
2019-08-16,80.36
2019-08-19,81.19
2019-08-20,80.505
2019-08-21,82.66
2019-08-22,83.44
2019-08-23,80.105
2019-08-26,82.07
2019-08-27,82.1
2019-08-28,83.505
2019-08-29,85.37
2019-08-30,84.49
2019-09-02,84.48
2019-09-03,84.725
2019-09-04,86.19
2019-09-05,88.42
2019-09-06,88.53
2019-09-09,88.66
2019-09-10,86.695
2019-09-11,86.65
2019-09-12,87.735
2019-09-13,87.405
2019-09-16,87.235
2019-09-17,87.525
2019-09-18,88
2019-09-19,87.765
2019-09-20,86.855
2019-09-23,87.57
2019-09-24,87.335
2019-09-25,90.835
2019-09-26,92.18
2019-09-27,92.205
2019-09-30,93.945
2019-10-01,92.285
2019-10-02,91.51
2019-10-03,92.075
2019-10-04,93.11
2019-10-07,93.25
2019-10-08,91.76
2019-10-09,92.5
2019-10-10,93.2
2019-10-11,94.08
2019-10-14,94.9
2019-10-15,94.81
2019-10-16,94.995
2019-10-17,95.575
2019-10-18,96.225
2019-10-21,96.21
2019-10-22,95.715
2019-10-23,92.375
2019-10-24,91.595
2019-10-25,91.03
2019-10-28,90.79
2019-10-29,89.225
2019-10-30,90.235
2019-10-31,89.325
2019-11-01,89.15
2019-11-04,89.78
2019-11-05,89.775
2019-11-06,89.55
2019-11-07,90.305
2019-11-08,89.7
2019-11-11,90.055
2019-11-12,89.6
2019-11-13,91.32
2019-11-14,91.35
2019-11-15,92.875
2019-11-18,94.135
2019-11-19,93.48
2019-11-20,92.935
2019-11-21,92.095
2019-11-22,93.275
2019-11-25,92.985
