date,close
2014-06-13,53.83
2014-06-16,53.57
2014-06-17,54.59
2014-06-18,54.98
2014-06-19,54.71
2014-06-20,54.07
2014-06-23,53.92
2014-06-24,53.21
2014-06-25,53.89
2014-06-26,53.81
2014-06-27,53.65
2014-06-30,53.95
2014-07-01,53.83
2014-07-02,53.4
2014-07-03,54.31
2014-07-07,53.32
2014-07-08,52.5
2014-07-09,53.11
2014-07-10,52.25
2014-07-11,52.3
2014-07-14,52.29
2014-07-15,53.55
2014-07-16,53.25
2014-07-17,51.53
2014-07-18,52.31
2014-07-21,52.39
2014-07-22,52.35
2014-07-23,52.8
2014-07-24,54.16
2014-07-25,53.6
2014-07-28,52.87
2014-07-29,52.49
2014-07-30,52.9
2014-07-31,52.05
2014-08-01,50.96
2014-08-04,50.9
2014-08-05,50.37
2014-08-06,50.3
2014-08-07,50.72
2014-08-08,50.93
2014-08-11,51.46
2014-08-12,51.01
2014-08-13,51.61
2014-08-14,51.99
2014-08-15,51.42
2014-08-18,52.84
2014-08-19,52.88
2014-08-20,53.07
2014-08-21,53.98
2014-08-22,54.28
2014-08-25,54.28
2014-08-26,55.1
2014-08-27,54.62
2014-08-28,53.89
2014-08-29,53.98
2014-09-02,54.86
2014-09-03,55.23
2014-09-04,54.8
2014-09-05,54.79
2014-09-08,55.37
2014-09-09,54.93
2014-09-10,55.84
2014-09-11,56.62
2014-09-12,56.89
2014-09-15,56.24
2014-09-16,55.5
2014-09-17,55.88
2014-09-18,58.23
2014-09-19,58.19
2014-09-22,58.1
2014-09-23,57.72
2014-09-24,57.99
2014-09-25,56.85
2014-09-26,56.88
2014-09-29,57.06
2014-09-30,57.68
2014-10-01,57.14
2014-10-02,57.56
2014-10-03,57.87
2014-10-06,57.12
2014-10-07,56.56
2014-10-08,57.19
2014-10-09,56.21
2014-10-10,55.22
2014-10-13,55.19
2014-10-14,55.06
2014-10-15,52.57
2014-10-16,54.12
2014-10-17,54.69
2014-10-20,54.68
2014-10-21,56.93
2014-10-22,56.22
2014-10-23,57.3
2014-10-24,57.04
2014-10-27,57.52
2014-10-28,59.71
2014-10-29,59.96
2014-10-30,60.75
2014-10-31,61.15
2014-11-03,60
2014-11-04,59.31
2014-11-05,60.3
2014-11-06,61.35
2014-11-07,61.57
2014-11-10,61.6
2014-11-11,60.97
2014-11-12,61.74
2014-11-13,59.31
2014-11-14,59.14
2014-11-17,58.69
2014-11-18,58.59
2014-11-19,57.83
2014-11-20,58.3
2014-11-21,57.16
2014-11-24,58.06
2014-11-25,58.24
2014-11-26,58.15
2014-11-28,55.13
2014-12-01,53.14
2014-12-02,54.55
2014-12-03,55.27
2014-12-04,54.95
2014-12-05,55.61
2014-12-08,54.44
2014-12-09,56.16
2014-12-10,54.04
2014-12-11,54.08
2014-12-12,52.84
2014-12-15,52.51
2014-12-16,52.5
2014-12-17,52.72
2014-12-18,54.1
2014-12-19,53.885
2014-12-22,54.45
2014-12-23,55.46
2014-12-24,55.36
2014-12-26,55.3
2014-12-29,55.37
2014-12-30,54.99
2014-12-31,54.33
2015-01-02,53.34
2015-01-05,50.89
2015-01-06,49.49
2015-01-07,48.96
2015-01-08,49.22
2015-01-09,47.05
2015-01-12,46.44
2015-01-13,46.01
2015-01-14,44.98
2015-01-15,44.24
2015-01-16,45.46
2015-01-20,45.77
2015-01-21,45.02
2015-01-22,43.04
2015-01-23,43.29
2015-01-26,43.43
2015-01-27,43.06
2015-01-28,41.48
2015-01-29,41.95
2015-01-30,40.85
2015-02-02,42.25
2015-02-03,44.58
2015-02-04,44.78
2015-02-05,46.53
2015-02-06,48.07
2015-02-09,47.31
2015-02-10,46.66
2015-02-11,46.44
2015-02-12,47.7
2015-02-13,48.51
2015-02-17,48.76
2015-02-18,47.28
2015-02-19,46.63
2015-02-20,46.99
2015-02-23,46.57
2015-02-24,46.54
2015-02-25,46.5
2015-02-26,46.94
2015-02-27,46.43
2015-03-02,47.09
2015-03-03,47.3
2015-03-04,47.39
2015-03-05,47.98
2015-03-06,49.1
2015-03-09,49.5
2015-03-10,48.96
2015-03-11,49.63
2015-03-12,51.21
2015-03-13,50.83
2015-03-16,49.59
2015-03-17,49.33
2015-03-18,49.38
2015-03-19,48.63
2015-03-20,49.54
2015-03-23,49.21
2015-03-24,49.53
2015-03-25,48.23
2015-03-26,48.57
2015-03-27,47.95
2015-03-30,49.08
2015-03-31,48.65
2015-04-01,48.27
2015-04-02,48.29
2015-04-06,48.54
2015-04-07,48.67
2015-04-08,48.69
2015-04-09,49.75
2015-04-10,48.98
2015-04-13,50.21
2015-04-14,49.74
2015-04-15,51.23
2015-04-16,51.08
2015-04-17,50.54
2015-04-20,50.81
2015-04-21,50.76
2015-04-22,51.17
2015-04-23,52.22
2015-04-24,51.61
2015-04-27,51.07
2015-04-28,51.87
2015-04-29,52.83
2015-04-30,52.66
2015-05-01,52.14
2015-05-04,53.57
2015-05-05,53.41
2015-05-06,54.61
2015-05-07,53.28
2015-05-08,53.56
2015-05-11,53.17
2015-05-12,54.31
2015-05-13,54.55
2015-05-14,55.325
2015-05-15,54.1
2015-05-18,55.21
2015-05-19,55.16
2015-05-20,54.78
2015-05-21,54.47
2015-05-22,54.61
2015-05-26,53.86
2015-05-27,54.23
2015-05-28,54.57
2015-05-29,54.4
2015-06-01,54.29
2015-06-02,55.07
2015-06-03,56.425
2015-06-04,55.92
2015-06-05,57.12
2015-06-08,57.74
2015-06-09,58.72
2015-06-10,61.24
2015-06-11,59.63
2015-06-12,59.91
2015-06-15,59.69
2015-06-16,60.6
2015-06-17,59.29
2015-06-18,59.485
2015-06-19,59.76
2015-06-22,60.63
2015-06-23,61.84
2015-06-24,61.185
2015-06-25,62.48
2015-06-26,63.28
2015-06-29,61.81
2015-06-30,62.24
2015-07-01,62.87
2015-07-02,62.34
2015-07-06,60.38
2015-07-07,58.68
2015-07-08,58.57
2015-07-09,60.51
2015-07-10,61
2015-07-13,61.36
2015-07-14,60.71
2015-07-15,60.68
2015-07-16,60.47
2015-07-17,57.81
2015-07-20,58.93
2015-07-21,59.47
2015-07-22,60.71
2015-07-23,59.56
2015-07-24,58.86
2015-07-27,57.66
2015-07-28,58.63
2015-07-29,59.23
2015-07-30,59.37
2015-07-31,58.94
2015-08-03,58.23
2015-08-04,59.11
2015-08-05,59.17
2015-08-06,58.67
2015-08-07,58.02
2015-08-10,59.21
2015-08-11,57.75
2015-08-12,56.23
2015-08-13,56.81
2015-08-14,57.23
2015-08-17,55.96
2015-08-18,55.71
2015-08-19,54.43
2015-08-20,51.94
2015-08-21,51.46
2015-08-24,49.04
2015-08-25,48.21
2015-08-26,50.04
2015-08-27,52.03
2015-08-28,53.06
2015-08-31,53.86
2015-09-01,51.28
2015-09-02,51.97
2015-09-03,52.41
2015-09-04,51.39
2015-09-08,53.12
2015-09-09,52.76
2015-09-10,53.42
2015-09-11,51.99
2015-09-14,52.08
2015-09-15,53.82
2015-09-16,55.2
2015-09-17,52.8
2015-09-18,51.34
2015-09-21,52.51
2015-09-22,51.76
2015-09-23,52.01
2015-09-24,52.33
2015-09-25,52.94
2015-09-28,52.12
2015-09-29,51.83
2015-09-30,52.42
2015-10-01,52.47
2015-10-02,51.61
2015-10-05,53.33
2015-10-06,53.8
2015-10-07,54.99
2015-10-08,55.87
2015-10-09,54.47
2015-10-12,54.52
2015-10-13,53.94
2015-10-14,52.04
2015-10-15,53.02
2015-10-16,52.78
2015-10-19,52.36
2015-10-20,53.56
2015-10-21,51.87
2015-10-22,53.12
2015-10-23,54.9
2015-10-26,54.67
2015-10-27,53.6
2015-10-28,56.53
2015-10-29,55.97
2015-10-30,55.2
2015-11-02,56.9
2015-11-03,56.94
2015-11-04,57.38
2015-11-05,58.52
2015-11-06,61.1
2015-11-09,60.82
2015-11-10,60.24
2015-11-11,59.09
2015-11-12,57.56
2015-11-13,56.58
2015-11-16,57.77
2015-11-17,57.78
2015-11-18,59.26
2015-11-19,58.54
2015-11-20,59.15
2015-11-23,60.09
2015-11-24,60.03
2015-11-25,59.85
2015-11-27,59.53
2015-11-30,59.28
2015-12-01,59.36
2015-12-02,57.54
2015-12-03,56.32
2015-12-04,57
2015-12-07,54.41
2015-12-08,52.18
2015-12-09,50.95
2015-12-10,50.5
2015-12-11,49.52
2015-12-14,48.88
2015-12-15,50.25
2015-12-16,50.26
2015-12-17,48.08
2015-12-18,47.77
2015-12-21,48.42
2015-12-22,49
2015-12-23,49.83
2015-12-24,50.14
2015-12-28,49.65
2015-12-29,50.54
2015-12-30,49.71
2015-12-31,49.42
2016-01-04,48.19
2016-01-05,47.59
2016-01-06,47.39
2016-01-07,45.87
2016-01-08,44.47
2016-01-11,44.43
2016-01-12,43.38
2016-01-13,41.18
2016-01-14,41
2016-01-15,39.83
2016-01-19,38.67
2016-01-20,37.58
2016-01-21,33.7
2016-01-22,33.46
2016-01-25,32.3
2016-01-26,33
2016-01-27,34.99
2016-01-28,36.34
2016-01-29,35.7
2016-02-01,34.85
2016-02-02,33.92
2016-02-03,34.7
2016-02-04,35.3
2016-02-05,33.78
2016-02-08,32.58
2016-02-09,32.42
2016-02-10,31.73
2016-02-11,30.89
2016-02-12,32.73
2016-02-16,33.97
2016-02-17,33.89
2016-02-18,32.77
2016-02-19,32.95
2016-02-22,34.33
2016-02-23,32.5
2016-02-24,31.33
2016-02-25,31.9
2016-02-26,33.35
2016-02-29,32.33
2016-03-01,34.26
2016-03-02,35.88
2016-03-03,37.91
2016-03-04,38.59
2016-03-07,38.94
2016-03-08,36.85
2016-03-09,36.65
2016-03-10,37.3
2016-03-11,38.96
2016-03-14,37.59
2016-03-15,36.8
2016-03-16,36.53
2016-03-17,38.59
2016-03-18,40.44
2016-03-21,40.34
2016-03-22,39.99
2016-03-23,38.86
2016-03-24,38.69
2016-03-28,37.9
2016-03-29,37.74
2016-03-30,38.61
2016-03-31,38.38
2016-04-01,36.55
2016-04-04,36.3
2016-04-05,35.73
2016-04-06,36.51
2016-04-07,34.95
2016-04-08,35.15
2016-04-11,36.21
2016-04-12,37.78
2016-04-13,40.1
2016-04-14,40.75
2016-04-15,40.8
2016-04-18,41.19
2016-04-19,41.89
2016-04-20,43.96
2016-04-21,44.37
2016-04-22,45.07
2016-04-25,44.37
2016-04-26,45.86
2016-04-27,46.39
2016-04-28,45.81
2016-04-29,45.82
2016-05-02,45.51
2016-05-03,43.81
2016-05-04,42.82
2016-05-05,42.24
2016-05-06,42.36
2016-05-09,42.26
2016-05-10,43.31
2016-05-11,43.99
2016-05-12,43.59
2016-05-13,42.23
2016-05-16,43.73
2016-05-17,43.97
2016-05-18,46.75
2016-05-19,45.6
2016-05-20,47.09
2016-05-23,47.67
2016-05-24,49.21
2016-05-25,50.59
2016-05-26,50.28
2016-05-27,51.07
2016-05-31,51.24
2016-06-01,50.85
2016-06-02,50.75
2016-06-03,49.62
2016-06-06,50.4
2016-06-07,49.96
2016-06-08,49.89
2016-06-09,49.32
2016-06-10,48.68
2016-06-13,48.5
2016-06-14,46.98
2016-06-15,47.38
2016-06-16,46.02
2016-06-17,47.19
2016-06-20,48.13
2016-06-21,48.06
2016-06-22,48.08
2016-06-23,50.28
2016-06-24,44.95
2016-06-27,41.63
2016-06-28,43.24
2016-06-29,45.65
2016-06-30,46.76
2016-07-01,45.43
2016-07-05,43.46
2016-07-06,44.33
2016-07-07,44.97
2016-07-08,46.17
2016-07-11,47.24
2016-07-12,48.82
2016-07-13,48.98
2016-07-14,49.74
2016-07-15,50.11
2016-07-18,49.85
2016-07-19,50.07
2016-07-20,50.18
2016-07-21,48.93
2016-07-22,49.19
2016-07-25,48.97
2016-07-26,49.58
2016-07-27,49.84
2016-07-28,49.96
2016-07-29,48.54
2016-08-01,47.38
2016-08-02,46.28
2016-08-03,47.05
2016-08-04,47.84
2016-08-05,50.08
2016-08-08,49.92
2016-08-09,50.02
2016-08-10,48.96
2016-08-11,49.44
2016-08-12,49.13
2016-08-15,50.24
2016-08-16,50.42
2016-08-17,50.78
2016-08-18,51.17
2016-08-19,50.7
2016-08-22,50.86
2016-08-23,51
2016-08-24,50.86
2016-08-25,51.39
2016-08-26,51.8
2016-08-29,52.47
2016-08-30,52.94
2016-08-31,52.52
2016-09-01,52.49
2016-09-02,53.5
2016-09-06,51.98
2016-09-07,52.53
2016-09-08,52.85
2016-09-09,52.73
2016-09-12,52.5
2016-09-13,51.51
2016-09-14,51.04
2016-09-15,52.04
2016-09-16,51.79
2016-09-19,51.86
2016-09-20,52.09
2016-09-21,52.81
2016-09-22,54.04
2016-09-23,54.34
2016-09-26,52.56
2016-09-27,53.03
2016-09-28,54.33
2016-09-29,53.25
2016-09-30,54.92
2016-10-03,55.03
2016-10-04,55.6
2016-10-05,57.62
2016-10-06,57.47
2016-10-07,57.04
2016-10-10,57.25
2016-10-11,57
2016-10-12,56.55
2016-10-13,54.95
2016-10-14,55.45
2016-10-17,55.25
2016-10-18,56.3
2016-10-19,57.35
2016-10-20,57.25
2016-10-21,59.5
2016-10-24,59.65
2016-10-25,58.9
2016-10-26,58.55
2016-10-27,59.05
2016-10-28,58.9
2016-10-31,59.3
2016-11-01,58.8
2016-11-02,56.8
2016-11-03,57.25
2016-11-04,57.45
2016-11-07,59.05
2016-11-08,58.6
2016-11-09,63.45
2016-11-10,66.75
2016-11-11,68.15
2016-11-14,69
2016-11-15,70.75
2016-11-16,70.75
2016-11-17,71.8
2016-11-18,72.55
2016-11-21,73.45
2016-11-22,75.35
2016-11-23,75.35
2016-11-25,75.5
2016-11-28,73.15
2016-11-29,71.3
2016-11-30,72.75
2016-12-01,74
2016-12-02,73.45
2016-12-05,74.15
2016-12-06,74.6
2016-12-07,75.15
2016-12-08,77.65
2016-12-09,78.5
2016-12-12,76.95
2016-12-13,77.5
2016-12-14,77.2
2016-12-15,77.9
2016-12-16,77.15
2016-12-19,78.1
2016-12-20,81.2
2016-12-21,79.45
2016-12-22,78.75
2016-12-23,79.4
2016-12-27,80.25
2016-12-28,79.25
2016-12-29,78.55
2016-12-30,78.4
2017-01-03,78.3
2017-01-04,80.2
2017-01-05,77.9
2017-01-06,78.05
2017-01-09,77.75
2017-01-10,80.35
2017-01-11,81.65
2017-01-12,78.55
2017-01-13,79.75
2017-01-17,76.75
2017-01-18,78.35
2017-01-19,77.05
2017-01-20,77.95
2017-01-23,77.45
2017-01-24,77.95
2017-01-25,79.1
2017-01-26,84.5
2017-01-27,84.15
2017-01-30,82.5
2017-01-31,82.5
2017-02-01,83.8
2017-02-02,83.25
2017-02-03,86.1
2017-02-06,85
2017-02-07,84.8
2017-02-08,83.3
2017-02-09,84.1
2017-02-10,85.1
2017-02-13,86.8
2017-02-14,88.4
2017-02-15,87.7
2017-02-16,87.5
2017-02-17,87.9
2017-02-21,88.3
2017-02-22,89
2017-02-23,89.35
2017-02-24,89.05
2017-02-27,90.55
2017-02-28,89.15
2017-03-01,92.15
2017-03-02,88.75
2017-03-03,90.2
2017-03-06,90.3
2017-03-07,89.7
2017-03-08,88.05
2017-03-09,87.25
2017-03-10,86.45
2017-03-13,87.2
2017-03-14,85.9
2017-03-15,85.7
2017-03-16,87
2017-03-17,86.95
2017-03-20,84.45
2017-03-21,79.15
2017-03-22,79.4
2017-03-23,79.95
2017-03-24,80.25
2017-03-27,80.05
2017-03-28,80.75
2017-03-29,80.6
2017-03-30,83.4
2017-03-31,83.45
2017-04-03,82.35
2017-04-04,82.05
2017-04-05,80.35
2017-04-06,82.95
2017-04-07,82.65
2017-04-10,82.3
2017-04-11,83.35
2017-04-12,80.9
2017-04-13,77.85
2017-04-17,79.5
2017-04-18,78.8
2017-04-19,78.75
2017-04-20,73.825
2017-04-21,74.65
2017-04-24,76.5
2017-04-25,77.3
2017-04-26,78.7
2017-04-27,76.7
2017-04-28,76.1
2017-05-01,77.7
2017-05-02,76.2
2017-05-03,76.95
2017-05-04,75.95
2017-05-05,76.1
2017-05-08,78.75
2017-05-09,77.25
2017-05-10,77.65
2017-05-11,75.95
2017-05-12,75.55
2017-05-15,76.55
2017-05-16,77.6
2017-05-17,73.2
2017-05-18,74.9
2017-05-19,75.35
2017-05-22,75.9
2017-05-23,76.95
2017-05-24,76.65
2017-05-25,76.2
2017-05-26,75.2
2017-05-30,75
2017-05-31,73.4
2017-06-01,75.4
2017-06-02,74.5
2017-06-05,74.2
2017-06-06,73.4
2017-06-07,73.95
2017-06-08,76.45
2017-06-09,79.4
2017-06-12,78.55
2017-06-13,78.6
2017-06-14,78.25
2017-06-15,77.85
2017-06-16,77.75
2017-06-19,78.05
2017-06-20,75.8
2017-06-21,74.05
2017-06-22,73.9
2017-06-23,73.25
2017-06-26,73.7
2017-06-27,74.2
2017-06-28,75.3
2017-06-29,77.4
2017-06-30,77.4
2017-07-03,80.05
2017-07-05,79.9
2017-07-06,78
2017-07-07,78.05
2017-07-10,77.35
2017-07-11,77.55
2017-07-12,77.85
2017-07-13,78.7
2017-07-14,79
2017-07-17,78.25
2017-07-18,78
2017-07-19,77.95
2017-07-20,81.5
2017-07-21,80.25
2017-07-24,81.05
2017-07-25,81.85
2017-07-26,78.95
2017-07-27,79
2017-07-28,78.6
2017-07-31,78.35
2017-08-01,79.1
2017-08-02,79.8
2017-08-03,79.45
2017-08-04,80.05
2017-08-07,78.8
2017-08-08,79.05
2017-08-09,77.95
2017-08-10,74.9
2017-08-11,74.7
2017-08-14,75.9
2017-08-15,75.15
2017-08-16,74.55
2017-08-17,72.4
2017-08-18,72.6
2017-08-21,72.45
2017-08-22,73.5
2017-08-23,73.15
2017-08-24,74
2017-08-25,74.75
2017-08-28,73.7
2017-08-29,73.4
2017-08-30,73.65
2017-08-31,74.25
2017-09-01,75.25
2017-09-05,72.35
2017-09-06,72.2
2017-09-07,69.95
2017-09-08,70.95
2017-09-11,75
2017-09-12,77.2
2017-09-13,78.3
2017-09-14,77.35
2017-09-15,77.35
2017-09-18,79.95
2017-09-19,80.4
2017-09-20,82.05
2017-09-21,82.2
2017-09-22,82
2017-09-25,82.4
2017-09-26,82.9
2017-09-27,85.65
2017-09-28,85.55
2017-09-29,85.8
2017-10-02,86.9
2017-10-03,86.65
2017-10-04,84.6
2017-10-05,85.8
2017-10-06,85.6
2017-10-09,85.65
2017-10-10,86.35
2017-10-11,85.2
2017-10-12,84.15
2017-10-13,84
2017-10-16,85.2
2017-10-17,83.9
2017-10-18,84.2
2017-10-19,87
2017-10-20,88
2017-10-23,86.9
2017-10-24,88
2017-10-25,86.85
2017-10-26,87.55
2017-10-27,87.85
2017-10-30,86.55
2017-10-31,86.05
2017-11-01,85
2017-11-02,86.2
2017-11-03,85.95
2017-11-06,85.5
2017-11-07,82.15
2017-11-08,82.05
2017-11-09,80.4
2017-11-10,80.95
2017-11-13,81.7
2017-11-14,81.1
2017-11-15,80.75
2017-11-16,81.05
2017-11-17,81.75
2017-11-20,82.9
2017-11-21,83.4
2017-11-22,82.65
2017-11-24,81.8
2017-11-27,82.25
2017-11-28,86.95
2017-11-29,90.8
2017-11-30,90.35
2017-12-01,90.9
2017-12-04,90.25
2017-12-05,87.75
2017-12-06,88.25
2017-12-07,89.85
2017-12-08,90.2
2017-12-11,89.2
2017-12-12,90.35
2017-12-13,89.55
2017-12-14,88.6
2017-12-15,92
2017-12-18,92.6
2017-12-19,91.9
2017-12-20,91.1
2017-12-21,93.55
2017-12-22,92.75
2017-12-26,91.35
2017-12-27,90.3
2017-12-28,90.7
2017-12-29,88.9
2018-01-02,90.75
2018-01-03,91.45
2018-01-04,91.8
2018-01-05,92.95
2018-01-08,92.75
2018-01-09,94.85
2018-01-10,96.05
2018-01-11,98.05
2018-01-12,98.6
2018-01-16,99
2018-01-17,97.95
2018-01-18,97.8
2018-01-19,99.95
2018-01-22,100.05
2018-01-23,99.9
2018-01-24,98.95
2018-01-25,99.65
2018-01-26,98.8
2018-01-29,97.9
2018-01-30,95.55
2018-01-31,94.8
2018-02-01,95.8
2018-02-02,94.65
2018-02-05,89.7
2018-02-06,92
2018-02-07,92.15
2018-02-08,87.65
2018-02-09,89.75
2018-02-12,90.25
2018-02-13,90.05
2018-02-14,92.25
2018-02-15,92.95
2018-02-16,93.65
2018-02-20,93.1
2018-02-21,94
2018-02-22,91.75
2018-02-23,93.1
2018-02-26,94.05
2018-02-27,92.35
2018-02-28,90.2
2018-03-01,91.05
2018-03-02,91.75
2018-03-05,91.85
2018-03-06,94.1
2018-03-07,94.4
2018-03-08,92.85
2018-03-09,94.4
2018-03-12,95.85
2018-03-13,95.15
2018-03-14,93.55
2018-03-15,94.15
2018-03-16,95.05
2018-03-19,94.4
2018-03-20,94.35
2018-03-21,95
2018-03-22,91.15
2018-03-23,88
2018-03-26,90.5
2018-03-27,87.8
2018-03-28,88.45
2018-03-29,89.9
2018-04-02,89.2
2018-04-03,91.05
2018-04-04,93
2018-04-05,93.65
2018-04-06,90.7
2018-04-09,90.55
2018-04-10,92.45
2018-04-11,91.85
2018-04-12,93.5
2018-04-13,91.85
2018-04-16,92.1
2018-04-17,90.05
2018-04-18,89.85
2018-04-19,96.75
2018-04-20,96.15
2018-04-23,97.05
2018-04-24,97.5
2018-04-25,97.85
2018-04-26,97.45
2018-04-27,99.5
2018-04-30,98.65
2018-05-01,98.75
2018-05-02,98.6
2018-05-03,96.5
2018-05-04,98.15
2018-05-07,99.5
2018-05-08,100.45
2018-05-09,101
2018-05-10,101.85
2018-05-11,102.1
2018-05-14,101.95
2018-05-15,101.5
2018-05-16,101.2
2018-05-17,100.55
2018-05-18,99.1
2018-05-21,101.55
2018-05-22,100.4
2018-05-23,99.85
2018-05-24,99.15
2018-05-25,98.25
2018-05-29,96.3
2018-05-30,97.4
2018-05-31,96.35
2018-06-01,97.7
2018-06-04,99.05
2018-06-05,98.15
2018-06-06,101
2018-06-07,101.05
2018-06-08,102.35
2018-06-11,100.9
2018-06-12,101
2018-06-13,100.65
2018-06-14,100.05
2018-06-15,99.6
2018-06-18,95.6
2018-06-19,94.75
2018-06-20,94.45
2018-06-21,95.3
2018-06-22,94.9
2018-06-25,94.1
2018-06-26,94.05
2018-06-27,92.3
2018-06-28,92.2
2018-06-29,91.5
2018-07-02,91.7
2018-07-03,91.2
2018-07-05,90.95
2018-07-06,91.55
2018-07-09,94.4
2018-07-10,92.85
2018-07-11,92.75
2018-07-12,91.75
2018-07-13,91.2
2018-07-16,91.65
2018-07-17,91.9
2018-07-18,93.7
2018-07-19,96.2
2018-07-20,96.45
2018-07-23,95.5
2018-07-24,93.65
2018-07-25,92.05
2018-07-26,91.8
2018-07-27,91.75
2018-07-30,91.65
2018-07-31,90.8
2018-08-01,91.3
2018-08-02,92.1
2018-08-03,90.9
2018-08-06,91.15
2018-08-07,91.35
2018-08-08,92.3
2018-08-09,92.15
2018-08-10,91.6
2018-08-13,90.95
2018-08-14,91.25
2018-08-15,90.45
2018-08-16,91.9
2018-08-17,92.8
2018-08-20,93
2018-08-21,94.2
2018-08-22,94.05
2018-08-23,93
2018-08-24,92.6
2018-08-27,92.8
2018-08-28,92.55
2018-08-29,89.6
2018-08-30,87.95
2018-08-31,88.9
2018-09-04,89.7
2018-09-05,90.4
2018-09-06,89.65
2018-09-07,89.95
2018-09-10,89.05
2018-09-11,89
2018-09-12,87.6
2018-09-13,86.7
2018-09-14,87
2018-09-17,86.35
2018-09-18,85.95
2018-09-19,87.85
2018-09-20,88.65
2018-09-21,88.5
2018-09-24,86.5
2018-09-25,87.5
2018-09-26,84.2
2018-09-27,82.85
2018-09-28,82.65
2018-10-01,81.1
2018-10-02,80.4
2018-10-03,82.57
2018-10-04,82.81
2018-10-05,81.62
2018-10-08,82.99
2018-10-09,82.19
2018-10-10,81.45
2018-10-11,78.43
2018-10-12,76.3
2018-10-15,76.49
2018-10-16,76.23
2018-10-17,77.15
2018-10-18,67.28
2018-10-19,66.83
2018-10-22,64.05
2018-10-23,64.66
2018-10-24,62.15
2018-10-25,64.48
2018-10-26,63.65
2018-10-29,64.83
2018-10-30,64.61
2018-10-31,65.23
2018-11-01,66.27
2018-11-02,65.39
2018-11-05,65.49
2018-11-06,63.2
2018-11-07,63.7
2018-11-08,63.43
2018-11-09,62.82
2018-11-12,61.42
2018-11-13,61
2018-11-14,59.82
2018-11-15,60.69
2018-11-16,60.24
2018-11-19,60.55
2018-11-20,57.89
2018-11-21,58.34
2018-11-23,58.34
2018-11-26,59.08
2018-11-27,58.57
2018-11-28,58.7
2018-11-29,58.94
2018-11-30,59.66
2018-12-03,60.49
2018-12-04,55.65
2018-12-06,55.84
2018-12-07,55.47
2018-12-10,54.96
2018-12-11,54.4
2018-12-12,55.41
2018-12-13,53.02
2018-12-14,51.72
2018-12-17,52.3
2018-12-18,50.91
2018-12-19,49.78
2018-12-20,49.94
2018-12-21,49.82
2018-12-24,48.49
2018-12-26,51.15
2018-12-27,50.68
2018-12-28,51
2018-12-31,51.09
2019-01-02,51.61
2019-01-03,51.84
2019-01-04,53.2
2019-01-07,53.12
2019-01-08,53.51
2019-01-09,53.83
2019-01-10,53.83
2019-01-11,54.2
2019-01-14,54.31
2019-01-15,54.77
2019-01-16,56.47
2019-01-17,56.85
2019-01-18,58.56
2019-01-22,57.98
2019-01-23,58.31
2019-01-24,57.67
2019-01-25,60.02
2019-01-28,61.07
2019-01-29,60.95
2019-01-30,59.91
2019-01-31,58.27
2019-02-01,59.28
2019-02-04,60.32
2019-02-05,59.46
2019-02-06,59.11
2019-02-07,59.77
2019-02-08,57.92
2019-02-11,58.6
2019-02-12,59.74
2019-02-13,59.85
2019-02-14,58.9
2019-02-15,60.32
2019-02-19,60.94
2019-02-20,61.87
2019-02-21,61.27
2019-02-22,61.52
2019-02-25,61.61
2019-02-26,60.52
2019-02-27,60.95
2019-02-28,61.03
2019-03-01,61.95
2019-03-04,61.16
2019-03-05,61.72
2019-03-06,60.14
2019-03-07,59
2019-03-08,59.11
2019-03-11,59.26
2019-03-12,59.27
2019-03-13,59.36
2019-03-14,58.58
2019-03-15,58.57
2019-03-18,59.82
2019-03-19,58.81
2019-03-20,55.77
2019-03-21,55.13
2019-03-22,53.14
2019-03-25,52.67
2019-03-26,54.34
2019-03-27,53.89
2019-03-28,54.62
2019-03-29,54.59
2019-04-01,56.63
2019-04-02,56.7
2019-04-03,56.72
2019-04-04,58.27
2019-04-05,59.15
2019-04-08,59.12
2019-04-09,57.43
2019-04-10,58.28
2019-04-11,58.2
2019-04-12,59.22
2019-04-15,57.98
2019-04-16,58.71
2019-04-17,58.49
2019-04-18,62.63
2019-04-22,62.65
2019-04-23,64.24
2019-04-24,64.01
2019-04-25,63.83
2019-04-26,64.2
2019-04-29,65.64
2019-04-30,64.73
2019-05-01,64.19
2019-05-02,65.3
2019-05-03,66.13
2019-05-06,66.19
2019-05-07,65.15
2019-05-08,64.39
2019-05-09,64.38
2019-05-10,64.24
2019-05-13,60.92
2019-05-14,61.83
2019-05-15,60.79
2019-05-16,61.71
2019-05-17,60.65
2019-05-20,60.71
2019-05-21,62.04
2019-05-22,60.67
2019-05-23,58.71
2019-05-24,61.14
2019-05-28,60.18
2019-05-29,60.73
2019-05-30,58.89
2019-05-31,57.3
2019-06-03,58.37
2019-06-04,61.06
2019-06-05,60.55
2019-06-06,59.86
2019-06-07,58.71
2019-06-10,59.31
2019-06-11,59.5
2019-06-12,59.28
2019-06-13,59.34
2019-06-14,60.34
2019-06-17,59.29
2019-06-18,60.68
2019-06-19,59.42
2019-06-20,59.175
2019-06-21,59.82
2019-06-24,59.46
2019-06-25,59.3
2019-06-26,60.52
2019-06-27,60.905
2019-06-28,61.36
2019-07-01,61.215
2019-07-02,59.705
2019-07-03,60.46
2019-07-04,60.46
2019-07-05,61.15
2019-07-08,60.745
2019-07-09,61
2019-07-10,59.58
2019-07-11,59.655
2019-07-12,61.21
2019-07-15,59.095
2019-07-16,59.5
2019-07-17,58.71
2019-07-18,56.725
2019-07-19,58.92
2019-07-22,58.935
2019-07-23,60.05
2019-07-24,62.09
2019-07-25,60.625
2019-07-26,62.115
2019-07-29,61.62
2019-07-30,62.695
2019-07-31,63.045
2019-08-01,58.93
2019-08-02,58.77
2019-08-05,55.53
2019-08-06,56.24
2019-08-07,55.65
2019-08-08,56.64
2019-08-09,56.06
2019-08-12,54.325
2019-08-13,55.42
2019-08-14,53.82
2019-08-15,52.895
2019-08-16,55.56
2019-08-19,56.66
2019-08-20,55.505
2019-08-21,55.63
2019-08-22,55.74
2019-08-23,53.17
2019-08-26,53.37
2019-08-27,52.275
2019-08-28,53.24
2019-08-29,53.9
2019-08-30,53.94
2019-09-02,53.92
2019-09-03,51.51
2019-09-04,51.285
2019-09-05,52.93
2019-09-06,52.035
2019-09-09,53.835
2019-09-10,55.4
2019-09-11,57.04
2019-09-12,56.45
2019-09-13,57.47
2019-09-16,58.47
2019-09-17,56.21
2019-09-18,56.935
2019-09-19,55.96
2019-09-20,55.81
2019-09-23,56.19
2019-09-24,54.655
2019-09-25,56.615
2019-09-26,54.66
2019-09-27,54.75
2019-09-30,54.59
2019-10-01,52.85
2019-10-02,52.53
2019-10-03,52.16
2019-10-04,52.57
2019-10-07,52.35
2019-10-08,50.86
2019-10-09,51.54
2019-10-10,52.265
2019-10-11,53.85
2019-10-14,53.885
2019-10-15,55.18
2019-10-16,54.58
2019-10-17,55.8
2019-10-18,55.695
2019-10-21,55.02
2019-10-22,55.5
2019-10-23,55.995
2019-10-24,55.33
2019-10-25,56.155
2019-10-28,56.16
2019-10-29,56.42
2019-10-30,55.51
2019-10-31,53.94
2019-11-01,55.49
2019-11-04,58.72
2019-11-05,59.11
2019-11-06,58.325
2019-11-07,59.09
2019-11-08,59.54
2019-11-11,58.98
2019-11-12,59.26
2019-11-13,58.17
2019-11-14,58.225
2019-11-15,58.15
2019-11-18,57.27
2019-11-19,57.6
2019-11-20,57.16
2019-11-21,57.18
2019-11-22,57.445
2019-11-25,58.235
