date,close
2015-04-16,18.2998
2015-04-17,18.6959
2015-04-20,18.9434
2015-04-21,18.4401
2015-04-22,17.9946
2015-04-23,18.6464
2015-04-24,18.2792
2015-04-27,17.5325
2015-04-28,17.8873
2015-04-29,17.582
2015-04-30,17.648
2015-05-01,17.6563
2015-05-04,17.45
2015-05-05,17.9781
2015-05-06,18.2668
2015-05-07,18.4731
2015-05-08,18.3989
2015-05-11,18.5804
2015-05-12,18.4154
2015-05-13,18.0193
2015-05-14,18.1266
2015-05-15,18.3576
2015-05-18,18.1843
2015-05-19,18.3328
2015-05-20,18.3906
2015-05-21,18.1761
2015-05-22,18.2421
2015-05-26,18.2668
2015-05-27,18.4896
2015-05-28,18.2421
2015-05-29,18.0647
2015-06-01,18.0771
2015-06-02,18.3081
2015-06-03,19.0754
2015-06-04,18.7701
2015-06-05,19.1084
2015-06-08,19.3229
2015-06-09,19.0837
2015-06-10,19.3642
2015-06-11,19.2322
2015-06-12,19.1579
2015-06-15,19.3642
2015-06-16,19.983
2015-06-17,19.884
2015-06-18,19.5622
2015-06-19,19.1167
2015-06-22,19.2487
2015-06-23,19.1084
2015-06-24,19.1992
2015-06-25,18.8279
2015-06-26,18.6794
2015-06-29,19.1332
2015-06-30,19.3724
2015-07-01,19.3477
2015-07-02,19.3229
2015-07-06,19.8097
2015-07-07,19.6447
2015-07-08,20.0407
2015-07-09,19.785
2015-07-10,19.7354
2015-07-13,19.884
2015-07-14,19.7437
2015-07-15,19.8345
2015-07-16,19.851
2015-07-17,19.7685
2015-07-20,19.5539
2015-07-21,19.2652
2015-07-22,19.4632
2015-07-23,19.1002
2015-07-24,19.3147
2015-07-27,19.6282
2015-07-28,19.5127
2015-07-29,19.5952
2015-07-30,19.4467
2015-07-31,19.3889
2015-08-03,19.3064
2015-08-04,19.1909
2015-08-05,17.1283
2015-08-06,16.691
2015-08-07,17.318
2015-08-10,17.4583
2015-08-11,17.2273
2015-08-12,17.3675
2015-08-13,17.1118
2015-08-14,17.4088
2015-08-17,17.3263
2015-08-18,17.2438
2015-08-19,17.5903
2015-08-20,17.4088
2015-08-21,17.0788
2015-08-24,17.5985
2015-08-25,18.1843
2015-08-26,18.8279
2015-08-27,18.9434
2015-08-28,18.7516
2015-08-31,19.6271
2015-09-01,19.7522
2015-09-02,19.3103
2015-09-03,19.3686
2015-09-04,19.4103
2015-09-08,19.6604
2015-09-09,19.377
2015-09-10,19.5187
2015-09-11,19.5187
2015-09-14,19.4186
2015-09-15,19.6688
2015-09-16,19.8022
2015-09-17,19.7855
2015-09-18,19.8105
2015-09-21,19.6354
2015-09-22,19.527
2015-09-23,19.4853
2015-09-24,19.6521
2015-09-25,19.5104
2015-09-28,19.6354
2015-09-29,19.1435
2015-09-30,19.1101
2015-10-01,19.1852
2015-10-02,19.1602
2015-10-05,19.0935
2015-10-06,19.0851
2015-10-07,19.4437
2015-10-08,19.3519
2015-10-09,19.5604
2015-10-12,19.9689
2015-10-13,20.6776
2015-10-14,20.4775
2015-10-15,20.8277
2015-10-16,20.686
2015-10-19,20.5943
2015-10-20,20.6776
2015-10-21,20.2858
2015-10-22,20.4525
2015-10-23,20.8944
2015-10-26,21.0612
2015-10-27,20.6443
2015-10-28,20.8611
2015-10-29,20.2858
2015-10-30,20.1774
2015-11-02,20.4525
2015-11-03,20.9278
2015-11-04,19.3353
2015-11-05,19.8939
2015-11-06,20.0773
2015-11-09,19.4437
2015-11-10,19.3103
2015-11-11,19.2602
2015-11-12,18.4681
2015-11-13,18.4681
2015-11-16,18.4932
2015-11-17,18.2764
2015-11-18,18.0012
2015-11-19,18.2597
2015-11-20,18.5015
2015-11-23,18.3347
2015-11-24,18.3514
2015-11-25,18.3264
2015-11-27,18.4444
2015-11-30,18.7563
2015-12-01,18.5962
2015-12-02,18.5709
2015-12-03,18.5119
2015-12-04,18.8322
2015-12-07,18.4023
2015-12-08,18.259
2015-12-09,18.1157
2015-12-10,17.9892
2015-12-11,17.9302
2015-12-14,17.9386
2015-12-15,18.3854
2015-12-16,18.7142
2015-12-17,18.3854
2015-12-18,18.2843
2015-12-21,18.4528
2015-12-22,18.5877
2015-12-23,18.8406
2015-12-24,18.7226
2015-12-28,18.79
2015-12-29,19.1778
2015-12-30,18.9755
2015-12-31,19.0851
2016-01-04,18.7395
2016-01-05,18.9333
2016-01-06,18.8153
2016-01-07,18.9165
2016-01-08,18.6805
2016-01-11,19.0682
2016-01-12,19.0176
2016-01-13,18.377
2016-01-14,18.4613
2016-01-15,18.7985
2016-01-19,18.7732
2016-01-20,19.1441
2016-01-21,18.7647
2016-01-22,18.9671
2016-01-25,19.0682
2016-01-26,19.3548
2016-01-27,19.0598
2016-01-28,18.9671
2016-01-29,19.1357
2016-02-01,19.1019
2016-02-02,20.0461
2016-02-03,19.7932
2016-02-04,18.2674
2016-02-05,17.7195
2016-02-08,17.7616
2016-02-09,17.7026
2016-02-10,16.6573
2016-02-11,17.0198
2016-02-12,17.239
2016-02-16,17.534
2016-02-17,17.9555
2016-02-18,17.8459
2016-02-19,17.7785
2016-02-22,18.0398
2016-02-23,17.7616
2016-02-24,17.8459
2016-02-25,18.3938
2016-02-26,18.4791
2016-02-29,19.0161
2016-03-01,18.3768
2016-03-02,18.4109
2016-03-03,19.0501
2016-03-04,18.8712
2016-03-07,18.9223
2016-03-08,18.7348
2016-03-09,19.4422
2016-03-10,19.1269
2016-03-11,19.7832
2016-03-14,19.6297
2016-03-15,19.3911
2016-03-16,19.4337
2016-03-17,20.0218
2016-03-18,20.3713
2016-03-21,20.0048
2016-03-22,19.7576
2016-03-23,19.0331
2016-03-24,19.0331
2016-03-28,18.7433
2016-03-29,18.8115
2016-03-30,18.8626
2016-03-31,18.8456
2016-04-01,18.8882
2016-04-04,18.6069
2016-04-05,17.9847
2016-04-06,18.1893
2016-04-07,18.3342
2016-04-08,18.1978
2016-04-11,18.1978
2016-04-12,18.1211
2016-04-13,18.087
2016-04-14,17.908
2016-04-15,17.8739
2016-04-18,17.9762
2016-04-19,18.1893
2016-04-20,18.2063
2016-04-21,18.3768
2016-04-22,18.462
2016-04-25,18.2745
2016-04-26,18.2745
2016-04-27,18.2575
2016-04-28,17.8398
2016-04-29,17.7716
2016-05-02,18.104
2016-05-03,17.3625
2016-05-04,16.5016
2016-05-05,15.9731
2016-05-06,16.1095
2016-05-09,16.1607
2016-05-10,16.0243
2016-05-11,15.5896
2016-05-12,15.2572
2016-05-13,15.1549
2016-05-16,15.2998
2016-05-17,14.8139
2016-05-18,14.8566
2016-05-19,14.652
2016-05-20,14.831
2016-05-23,14.7543
2016-05-24,15.0952
2016-05-25,14.8821
2016-05-26,14.9588
2016-05-27,15.1662
2016-05-31,15.3909
2016-06-01,15.5465
2016-06-02,15.6761
2016-06-03,15.6847
2016-06-06,15.6934
2016-06-07,15.7193
2016-06-08,15.4773
2016-06-09,15.2613
2016-06-10,15.3477
2016-06-13,15.1317
2016-06-14,15.3218
2016-06-15,15.3736
2016-06-16,15.4169
2016-06-17,15.0539
2016-06-20,15.149
2016-06-21,15.3304
2016-06-22,15.2959
2016-06-23,15.2699
2016-06-24,15.3218
2016-06-27,14.9588
2016-06-28,15.1749
2016-06-29,15.4773
2016-06-30,15.5551
2016-07-01,15.365
2016-07-05,15.5033
2016-07-06,15.2613
2016-07-07,15.2181
2016-07-08,15.3823
2016-07-11,15.5551
2016-07-12,15.3996
2016-07-13,15.1576
2016-07-14,15.002
2016-07-15,15.002
2016-07-18,15.0539
2016-07-19,15.0971
2016-07-20,15.1749
2016-07-21,15.0539
2016-07-22,15.1057
2016-07-25,14.9416
2016-07-26,14.8983
2016-07-27,15.0193
2016-07-28,14.8465
2016-07-29,14.8638
2016-08-01,14.8206
2016-08-02,14.4663
2016-08-03,14.1292
2016-08-04,13.8008
2016-08-05,14.5959
2016-08-08,14.8465
2016-08-09,14.4403
2016-08-10,14.2675
2016-08-11,14.2156
2016-08-12,14.1897
2016-08-15,14.4749
2016-08-16,14.7601
2016-08-17,14.3885
2016-08-18,14.4403
2016-08-19,14.5786
2016-08-22,14.57
2016-08-23,14.5872
2016-08-24,14.7514
2016-08-25,14.9416
2016-08-26,15.0366
2016-08-29,14.5181
2016-08-30,14.7022
2016-08-31,14.2989
2016-09-01,14.4304
2016-09-02,14.2639
2016-09-06,14.3866
2016-09-07,14.4217
2016-09-08,14.7724
2016-09-09,14.825
2016-09-12,14.9915
2016-09-13,14.86
2016-09-14,14.597
2016-09-15,14.825
2016-09-16,14.8688
2016-09-19,14.6146
2016-09-20,14.5882
2016-09-21,14.4918
2016-09-22,14.2025
2016-09-23,14.1061
2016-09-26,13.5187
2016-09-27,13.58
2016-09-28,13.431
2016-09-29,13.1592
2016-09-30,13.1242
2016-10-03,13.0803
2016-10-04,13.0453
2016-10-05,13.1154
2016-10-06,13.0365
2016-10-07,12.8261
2016-10-10,12.7735
2016-10-11,12.5806
2016-10-12,12.3176
2016-10-13,11.9494
2016-10-14,12.1598
2016-10-17,11.8793
2016-10-18,11.9669
2016-10-19,11.9669
2016-10-20,11.6162
2016-10-21,11.8793
2016-10-24,11.9231
2016-10-25,11.8793
2016-10-26,11.7477
2016-10-27,11.5286
2016-10-28,11.6162
2016-10-31,11.2217
2016-11-01,11.0464
2016-11-02,11.0464
2016-11-03,11.0026
2016-11-04,11.5286
2016-11-07,11.7039
2016-11-08,11.4409
2016-11-09,12.2738
2016-11-10,12.1423
2016-11-11,12.1423
2016-11-14,12.1861
2016-11-15,12.1423
2016-11-16,12.0984
2016-11-17,12.0984
2016-11-18,12.0984
2016-11-21,11.7039
2016-11-22,11.7477
2016-11-23,11.7916
2016-11-25,11.7916
2016-11-28,11.9231
2016-11-29,12.405
2016-11-30,12.3604
2016-12-01,12.9405
2016-12-02,12.4943
2016-12-05,12.4943
2016-12-06,12.8512
2016-12-07,13.119
2016-12-08,13.4313
2016-12-09,13.8775
2016-12-12,14.1899
2016-12-13,14.3238
2016-12-14,14.1453
2016-12-15,14.2345
2016-12-16,14.4576
2016-12-19,13.8775
2016-12-20,14.0114
2016-12-21,14.1007
2016-12-22,13.8329
2016-12-23,14.1007
2016-12-27,14.056
2016-12-28,14.2791
2016-12-29,14.2345
2016-12-30,14.2345
2017-01-03,14.3238
2017-01-04,14.8146
2017-01-05,14.413
2017-01-06,14.7254
2017-01-09,14.3238
2017-01-10,14.3238
2017-01-11,14.5469
2017-01-12,14.3684
2017-01-13,14.3238
2017-01-17,14.3684
2017-01-18,14.1899
2017-01-19,14.4576
2017-01-20,14.6361
2017-01-23,15.3501
2017-01-24,16.0194
2017-01-25,16.0194
2017-01-26,15.9748
2017-01-27,15.8409
2017-01-30,15.9302
2017-01-31,15.6624
2017-02-01,15.8409
2017-02-02,16.421
2017-02-03,16.5549
2017-02-06,16.5103
2017-02-07,16.5995
2017-02-08,16.7334
2017-02-09,16.778
2017-02-10,16.6441
2017-02-13,16.778
2017-02-14,16.8672
2017-02-15,16.5549
2017-02-16,16.7334
2017-02-17,16.778
2017-02-21,16.6888
2017-02-22,16.6888
2017-02-23,16.1087
2017-02-24,15.6624
2017-02-27,15.8344
2017-02-28,15.6986
2017-03-01,16.1058
2017-03-02,15.7439
2017-03-03,15.8796
2017-03-06,15.7439
2017-03-07,15.6081
2017-03-08,15.4724
2017-03-09,15.2915
2017-03-10,15.2915
2017-03-13,15.02
2017-03-14,15.2462
2017-03-15,15.1557
2017-03-16,15.0653
2017-03-17,14.9295
2017-03-20,14.8843
2017-03-21,14.7486
2017-03-22,14.8843
2017-03-23,14.9748
2017-03-24,15.201
2017-03-27,15.4724
2017-03-28,15.1557
2017-03-29,15.1105
2017-03-30,15.2915
2017-03-31,15.3819
2017-04-03,15.2915
2017-04-04,14.7938
2017-04-05,14.4319
2017-04-06,14.2057
2017-04-07,14.1152
2017-04-10,14.07
2017-04-11,13.708
2017-04-12,13.889
2017-04-13,14.1152
2017-04-17,13.9795
2017-04-18,13.7985
2017-04-19,13.5271
2017-04-20,14.8843
2017-04-21,14.5224
2017-04-24,14.3414
2017-04-25,14.5676
2017-04-26,14.2509
2017-04-27,14.2057
2017-04-28,13.9342
2017-05-01,13.7985
2017-05-02,13.9342
2017-05-03,13.9342
2017-05-04,13.5723
2017-05-05,13.5723
2017-05-08,13.7985
2017-05-09,13.889
2017-05-10,13.9795
2017-05-11,13.889
2017-05-12,14.07
2017-05-15,14.1152
2017-05-16,14.0247
2017-05-17,14.1604
2017-05-18,14.1604
2017-05-19,14.07
2017-05-22,14.4319
2017-05-23,14.5676
2017-05-24,14.9748
2017-05-25,14.7938
2017-05-26,14.7033
2017-05-30,14.8319
2017-05-31,14.9697
2017-06-01,15.3829
2017-06-02,15.337
2017-06-05,15.2452
2017-06-06,15.2911
2017-06-07,15.5666
2017-06-08,15.6584
2017-06-09,15.934
2017-06-12,15.7503
2017-06-13,16.0717
2017-06-14,16.1636
2017-06-15,16.0258
2017-06-16,15.7044
2017-06-19,15.7962
2017-06-20,16.1636
2017-06-21,15.9799
2017-06-22,16.1176
2017-06-23,16.1176
2017-06-26,16.485
2017-06-27,16.4391
2017-06-28,16.7605
2017-06-29,16.5309
2017-06-30,16.2095
2017-07-03,16.1636
2017-07-05,16.0258
2017-07-06,16.1636
2017-07-07,16.1176
2017-07-10,16.0717
2017-07-11,16.1176
2017-07-12,15.4748
2017-07-13,15.337
2017-07-14,15.0156
2017-07-17,15.0156
2017-07-18,15.0615
2017-07-19,14.9237
2017-07-20,15.0615
2017-07-21,15.0615
2017-07-24,15.1074
2017-07-25,15.2452
2017-07-26,15.0615
2017-07-27,14.9697
2017-07-28,14.8778
2017-07-31,15.1992
2017-08-01,15.0156
2017-08-02,14.7401
2017-08-03,14.6941
2017-08-04,14.8319
2017-08-07,14.786
2017-08-08,14.2349
2017-08-09,14.9237
2017-08-10,15.1533
2017-08-11,15.4288
2017-08-14,15.6125
2017-08-15,15.888
2017-08-16,15.8421
2017-08-17,15.7044
2017-08-18,15.5207
2017-08-21,15.4748
2017-08-22,15.6125
2017-08-23,16.0258
2017-08-24,16.2554
2017-08-25,16.4391
2017-08-28,16.3472
2017-08-29,16.3472
2017-08-30,16.4776
2017-08-31,16.7103
2017-09-01,16.5241
2017-09-05,16.3379
2017-09-06,16.0586
2017-09-07,15.8725
2017-09-08,15.8725
2017-09-11,15.7794
2017-09-12,15.8259
2017-09-13,15.6397
2017-09-14,15.7328
2017-09-15,15.5466
2017-09-18,15.7794
2017-09-19,15.8725
2017-09-20,16.1517
2017-09-21,15.9655
2017-09-22,15.6863
2017-09-25,15.1277
2017-09-26,15.407
2017-09-27,15.5466
2017-09-28,15.0346
2017-09-29,15.0812
2017-10-02,15.1742
2017-10-03,15.2673
2017-10-04,15.6397
2017-10-05,15.7794
2017-10-06,15.6863
2017-10-09,15.6397
2017-10-10,15.5466
2017-10-11,15.5001
2017-10-12,15.6863
2017-10-13,15.8725
2017-10-16,15.2673
2017-10-17,14.7088
2017-10-18,13.5451
2017-10-19,13.3589
2017-10-20,13.4055
2017-10-23,13.7313
2017-10-24,13.4986
2017-10-25,13.6848
2017-10-26,13.7313
2017-10-27,13.2658
2017-10-30,13.2658
2017-10-31,13.1727
2017-11-01,13.2193
2017-11-02,12.8935
2017-11-03,12.5211
2017-11-06,12.428
2017-11-07,14.5691
2017-11-08,14.8484
2017-11-09,15.3139
2017-11-10,15.3604
2017-11-13,15.1277
2017-11-14,14.8484
2017-11-15,15.0812
2017-11-16,14.5691
2017-11-17,14.5691
2017-11-20,14.7088
2017-11-21,14.5226
2017-11-22,14.1968
2017-11-24,14.3364
2017-11-27,14.4295
2017-11-28,14.383
2017-11-29,14.8019
2017-11-30,15.4068
2017-12-01,16.4465
2017-12-04,16.0212
2017-12-05,15.6904
2017-12-06,15.3123
2017-12-07,15.8794
2017-12-08,15.9267
2017-12-11,16.4465
2017-12-12,16.6828
2017-12-13,16.8246
2017-12-14,16.9191
2017-12-15,17.2027
2017-12-18,16.7773
2017-12-19,17.0136
2017-12-20,16.9664
2017-12-21,17.1554
2017-12-22,17.0136
2017-12-26,17.1554
2017-12-27,17.2972
2017-12-28,17.2972
2017-12-29,17.2972
2018-01-02,17.3445
2018-01-03,17.6753
2018-01-04,17.5335
2018-01-05,17.628
2018-01-08,17.5335
2018-01-09,17.439
2018-01-10,17.628
2018-01-11,17.7698
2018-01-12,17.9588
2018-01-16,17.7225
2018-01-17,17.7698
2018-01-18,17.6753
2018-01-19,17.7225
2018-01-22,17.7225
2018-01-23,17.9116
2018-01-24,18.1951
2018-01-25,18.1951
2018-01-26,18.1951
2018-01-29,18.3842
2018-01-30,18.1479
2018-01-31,18.0534
2018-02-01,18.6677
2018-02-02,18.3369
2018-02-05,18.3842
2018-02-06,19.6129
2018-02-07,18.9513
2018-02-08,25.0479
2018-02-09,26.4184
2018-02-12,25.8985
2018-02-13,26.8437
2018-02-14,26.891
2018-02-15,26.3239
2018-02-16,26.7965
2018-02-20,28.6869
2018-02-21,27.6472
2018-02-22,27.0564
2018-02-23,27.4581
2018-02-26,27.5527
2018-02-27,27.8362
2018-02-28,28.3032
2018-03-01,28.0173
2018-03-02,28.6843
2018-03-05,30.5426
2018-03-06,30.352
2018-03-07,31.0191
2018-03-08,31.3527
2018-03-09,31.6385
2018-03-12,31.305
2018-03-13,31.4003
2018-03-14,31.8768
2018-03-15,31.4479
2018-03-16,30.9238
2018-03-19,31.3527
2018-03-20,31.9721
2018-03-21,31.2097
2018-03-22,30.8762
2018-03-23,30.8285
2018-03-26,31.2574
2018-03-27,32.115
2018-03-28,30.9953
2018-03-29,31.4479
2018-04-02,31.9721
2018-04-03,31.9244
2018-04-04,32.5439
2018-04-05,34.4498
2018-04-06,34.021
2018-04-09,34.3545
2018-04-10,34.021
2018-04-11,33.7827
2018-04-12,34.3069
2018-04-13,33.9257
2018-04-16,34.5927
2018-04-17,35.0216
2018-04-18,34.688
2018-04-19,35.3075
2018-04-20,35.641
2018-04-23,34.9739
2018-04-24,33.4968
2018-04-25,33.5445
2018-04-26,33.9257
2018-04-27,34.021
2018-04-30,34.3069
2018-05-01,34.3545
2018-05-02,34.5451
2018-05-03,34.2592
2018-05-04,32.4486
2018-05-07,32.5439
2018-05-08,31.7815
2018-05-09,29.9708
2018-05-10,28.1602
2018-05-11,27.8267
2018-05-14,28.3985
2018-05-15,29.2085
2018-05-16,28.8749
2018-05-17,28.8273
2018-05-18,28.3508
2018-05-21,28.3985
2018-05-22,27.7314
2018-05-23,27.8267
2018-05-24,28.3032
2018-05-25,28.5414
2018-05-29,29.6373
2018-05-30,29.9232
2018-05-31,29.8176
2018-06-01,29.6255
2018-06-04,29.6255
2018-06-05,29.4334
2018-06-06,29.4334
2018-06-07,29.7695
2018-06-08,29.7695
2018-06-11,28.9053
2018-06-12,28.9533
2018-06-13,28.8092
2018-06-14,29.0973
2018-06-15,28.9533
2018-06-18,28.9053
2018-06-19,28.5211
2018-06-20,28.4731
2018-06-21,28.5692
2018-06-22,28.6172
2018-06-25,28.6652
2018-06-26,27.5608
2018-06-27,26.0243
2018-06-28,25.4962
2018-06-29,25.4962
2018-07-02,25.4482
2018-07-03,25.5922
2018-07-05,25.2081
2018-07-06,25.5442
2018-07-09,25.3041
2018-07-10,25.3281
2018-07-11,25.6882
2018-07-12,25.064
2018-07-13,24.7759
2018-07-16,24.968
2018-07-17,25.4482
2018-07-18,25.4962
2018-07-19,25.3041
2018-07-20,25.112
2018-07-23,25.5442
2018-07-24,24.5359
2018-07-25,24.872
2018-07-26,24.6319
2018-07-27,20.5506
2018-07-30,19.8544
2018-07-31,19.3502
2018-08-01,19.3502
2018-08-02,19.8304
2018-08-03,19.3022
2018-08-06,19.1101
2018-08-07,19.5903
2018-08-08,19.6383
2018-08-09,20.0224
2018-08-10,20.2625
2018-08-13,19.9264
2018-08-14,20.2625
2018-08-15,20.6946
2018-08-16,20.5986
2018-08-17,20.9827
2018-08-20,21.0788
2018-08-21,20.8867
2018-08-22,21.3668
2018-08-23,21.3188
2018-08-24,21.4629
2018-08-27,21.6549
2018-08-28,21.2708
2018-08-29,20.9347
2018-08-30,21.4105
2018-08-31,21.1677
2018-09-04,20.9735
2018-09-05,21.0706
2018-09-06,20.8279
2018-09-07,21.2163
2018-09-10,21.1677
2018-09-11,20.925
2018-09-12,20.3424
2018-09-13,20.7793
2018-09-14,21.2163
2018-09-17,21.1677
2018-09-18,21.3619
2018-09-19,21.6047
2018-09-20,21.7018
2018-09-21,21.3134
2018-09-24,20.8279
2018-09-25,20.5851
2018-09-26,20.3909
2018-09-27,20.3909
2018-09-28,19.8569
2018-10-01,19.5462
2018-10-02,19.7015
2018-10-03,20.0511
2018-10-04,22.0902
2018-10-05,21.8086
2018-10-08,21.7698
2018-10-09,21.0706
2018-10-10,21.8474
2018-10-11,22.2261
2018-10-12,22.3524
2018-10-15,21.9154
2018-10-16,21.1969
2018-10-17,21.2163
2018-10-18,21.7989
2018-10-19,22.0902
2018-10-22,21.5464
2018-10-23,22.1679
2018-10-24,21.7503
2018-10-25,22.0999
2018-10-26,22.1387
2018-10-29,22.2456
2018-10-30,23.0418
2018-10-31,23.0321
2018-11-01,22.3524
2018-11-02,22.8087
2018-11-05,23.702
2018-11-06,23.9254
2018-11-07,24.8478
2018-11-08,24.2944
2018-11-09,23.7991
2018-11-12,23.7506
2018-11-13,24.1973
2018-11-14,24.139
2018-11-15,24.8867
2018-11-16,25.6732
2018-11-19,25.6246
2018-11-20,25.6926
2018-11-21,24.8867
2018-11-23,24.741
2018-11-26,24.9741
2018-11-27,25.2362
2018-11-28,25.2168
2018-11-29,25.0404
2018-11-30,24.668
2018-12-03,24.8248
2018-12-04,24.5308
2018-12-06,25.3344
2018-12-07,25.0502
2018-12-10,25.207
2018-12-11,25.0894
2018-12-12,25.2854
2018-12-13,25.2952
2018-12-14,24.962
2018-12-17,24.3053
2018-12-18,23.2371
2018-12-19,23.3057
2018-12-20,23.5115
2018-12-21,23.3547
2018-12-24,23.6487
2018-12-26,24.4328
2018-12-27,25.2462
2018-12-28,25.2658
2018-12-31,25.2462
2019-01-02,25.4716
2019-01-03,26.1772
2019-01-04,26.8143
2019-01-07,26.3047
2019-01-08,26.4811
2019-01-09,26.8143
2019-01-10,26.1282
2019-01-11,25.893
2019-01-14,25.599
2019-01-15,25.4618
2019-01-16,26.0694
2019-01-17,25.7656
2019-01-18,26.3635
2019-01-22,26.1478
2019-01-23,25.9028
2019-01-24,25.5794
2019-01-25,25.3736
2019-01-28,25.2266
2019-01-29,25.2364
2019-01-30,24.8052
2019-01-31,25.0404
2019-02-01,24.7366
2019-02-04,25.0404
2019-02-05,25.0894
2019-02-06,25.2168
2019-02-07,26.4223
2019-02-08,26.3439
2019-02-11,25.5696
2019-02-12,25.8538
2019-02-13,25.746
2019-02-14,25.207
2019-02-15,24.766
2019-02-19,25.4226
2019-02-20,25.0502
2019-02-21,24.913
2019-02-22,25.207
2019-02-25,24.5798
2019-02-26,24.6484
2019-02-27,24.7562
2019-02-28,24.8749
2019-03-01,25.3202
2019-03-04,25.2509
2019-03-05,25.241
2019-03-06,24.9244
2019-03-07,24.964
2019-03-08,24.7166
2019-03-11,24.9343
2019-03-12,25.0926
2019-03-13,24.9936
2019-03-14,24.9244
2019-03-15,24.6968
2019-03-18,24.6671
2019-03-19,24.4989
2019-03-20,24.0537
2019-03-21,23.5391
2019-03-22,24.1328
2019-03-25,24.1922
2019-03-26,23.8261
2019-03-27,23.5985
2019-03-28,23.6579
2019-03-29,23.4996
2019-04-01,24.4
2019-04-02,25.2212
2019-04-03,24.964
2019-04-04,25.2311
2019-04-05,25.2707
2019-04-08,24.4
2019-04-09,24.8749
2019-04-10,24.9244
2019-04-11,24.3703
2019-04-12,24.4099
2019-04-15,23.8953
2019-04-16,24.1625
2019-04-17,24.1922
2019-04-18,24.9541
2019-04-22,25.0233
2019-04-23,24.6671
2019-04-24,24.8551
2019-04-25,24.6671
2019-04-26,24.4791
2019-04-29,24.5385
2019-04-30,24.3208
2019-05-01,24.1031
2019-05-02,23.7469
2019-05-03,22.9949
2019-05-06,23.8459
2019-05-07,23.8558
2019-05-08,24.1031
2019-05-09,24.4989
2019-05-10,24.0734
2019-05-13,24.588
2019-05-14,24.0438
2019-05-15,23.4303
2019-05-16,23.549
2019-05-17,23.3017
2019-05-20,23.5095
2019-05-21,23.4699
2019-05-22,23.1236
2019-05-23,23.3709
2019-05-24,23.3215
2019-05-28,22.5398
2019-05-29,22.9554
2019-05-30,22.52
2019-05-31,23.02
2019-06-03,22.96
2019-06-04,22.57
2019-06-05,22.42
2019-06-06,22.19
2019-06-07,22.07
2019-06-10,22.03
2019-06-11,21.76
2019-06-12,21.6
2019-06-13,21.51
2019-06-14,21.6
2019-06-17,21.685
2019-06-18,21.59
2019-06-19,21.68
2019-06-20,21.52
2019-06-21,21.48
2019-06-24,20.86
2019-06-25,20.995
2019-06-26,21.015
2019-06-27,21.28
2019-06-28,21.77
2019-07-01,21.675
2019-07-02,21.655
2019-07-03,21.68
2019-07-04,21.68
2019-07-05,22.33
2019-07-08,22.425
2019-07-09,22.35
2019-07-10,21.44
2019-07-11,21.755
2019-07-12,21.85
2019-07-15,21.49
2019-07-16,21.625
2019-07-17,21.86
2019-07-18,21.985
2019-07-19,22
2019-07-22,21.985
2019-07-23,21.76
2019-07-24,21.695
2019-07-25,21.495
2019-07-26,21.44
2019-07-29,21.68
2019-07-30,21.535
2019-07-31,21.685
2019-08-01,22.16
2019-08-02,22.295
2019-08-05,22.53
2019-08-06,22.16
2019-08-07,21.91
2019-08-08,18.035
2019-08-09,18.13
2019-08-12,18.15
2019-08-13,17.995
2019-08-14,18.26
2019-08-15,18.72
2019-08-16,18.165
2019-08-19,18.335
2019-08-20,18.16
2019-08-21,17.975
2019-08-22,18.17
2019-08-23,18.205
2019-08-26,17.96
2019-08-27,17.81
2019-08-28,18.015
2019-08-29,18.345
2019-08-30,18.805
2019-09-02,18.805
2019-09-03,18.875
2019-09-04,18.58
2019-09-05,19.155
2019-09-06,19.395
2019-09-09,19.51
2019-09-10,19.935
2019-09-11,20.445
2019-09-12,20.465
2019-09-13,20.12
2019-09-16,20.695
2019-09-17,20.235
2019-09-18,20.19
2019-09-19,19.635
2019-09-20,19.2
2019-09-23,19.225
2019-09-24,18.005
2019-09-25,17.595
2019-09-26,16.795
2019-09-27,16.73
2019-09-30,16.37
2019-10-01,15.71
2019-10-02,15.785
2019-10-03,15.755
2019-10-04,16.22
2019-10-07,16.33
2019-10-08,16.19
2019-10-09,16.235
2019-10-10,16.455
2019-10-11,16.72
2019-10-14,16.445
2019-10-15,16.575
2019-10-16,16.565
2019-10-17,16.85
2019-10-18,17.095
2019-10-21,17.005
2019-10-22,16.925
2019-10-23,17.045
2019-10-24,16.765
2019-10-25,16.955
2019-10-28,17.215
2019-10-29,16.84
2019-10-30,16.775
2019-10-31,16.96
2019-11-01,16.72
2019-11-04,16.92
2019-11-05,16.455
2019-11-06,16.345
2019-11-07,16.045
2019-11-08,16.235
2019-11-11,16.335
2019-11-12,16.215
2019-11-13,16.255
2019-11-14,16.455
2019-11-15,16.68
2019-11-18,16.505
2019-11-19,16.625
2019-11-20,16.63
2019-11-21,16.73
2019-11-22,16.675
2019-11-25,16.78
