date,close
2014-06-13,18.4
2014-06-16,18.91
2014-06-17,19.65
2014-06-18,19.18
2014-06-19,18.43
2014-06-20,18.56
2014-06-23,19.14
2014-06-24,19.93
2014-06-25,20.89
2014-06-26,20.62
2014-06-27,21.86
2014-06-30,22.56
2014-07-01,23.58
2014-07-02,22.95
2014-07-03,22
2014-07-07,20.62
2014-07-08,20.21
2014-07-09,19.97
2014-07-10,19.7
2014-07-11,19.96
2014-07-14,19.96
2014-07-15,19.24
2014-07-16,19.39
2014-07-17,19.43
2014-07-18,19.91
2014-07-21,19.7
2014-07-22,19.71
2014-07-23,20.32
2014-07-24,20.03
2014-07-25,19.22
2014-07-28,19.31
2014-07-29,19.9
2014-07-30,19.95
2014-07-31,20
2014-08-01,18.93
2014-08-04,18.74
2014-08-05,18.72
2014-08-06,18.502
2014-08-07,18.26
2014-08-08,18.3
2014-08-11,18.37
2014-08-12,18.21
2014-08-13,19.03
2014-08-14,19.08
2014-08-15,18.93
2014-08-18,19.1
2014-08-19,19.3
2014-08-20,19.48
2014-08-21,19.03
2014-08-22,19.1
2014-08-25,19.62
2014-08-26,19.54
2014-08-27,20.36
2014-08-28,20.17
2014-08-29,20.65
2014-09-02,21.69
2014-09-03,21.96
2014-09-04,22.49
2014-09-05,22.55
2014-09-08,23.03
2014-09-09,24.03
2014-09-10,23.13
2014-09-11,23.48
2014-09-12,23.06
2014-09-15,21.18
2014-09-16,21.21
2014-09-17,21.78
2014-09-18,21.19
2014-09-19,21
2014-09-22,20.04
2014-09-23,20
2014-09-24,20.58
2014-09-25,19.99
2014-09-26,20.12
2014-09-29,20.24
2014-09-30,20.61
2014-10-01,20.75
2014-10-02,21.05
2014-10-03,21.6
2014-10-06,21.5
2014-10-07,21.39
2014-10-08,20.98
2014-10-09,20.77
2014-10-10,20.45
2014-10-13,21.37
2014-10-14,20.53
2014-10-15,20.05
2014-10-16,20.22
2014-10-17,20.33
2014-10-20,19.68
2014-10-21,19.72
2014-10-22,20.24
2014-10-23,20.77
2014-10-24,21.38
2014-10-27,22.09
2014-10-28,22.51
2014-10-29,22.88
2014-10-30,23.88
2014-10-31,23.61
2014-11-03,24.74
2014-11-04,24.74
2014-11-05,24.82
2014-11-06,24.6
2014-11-07,23.61
2014-11-10,24.65
2014-11-11,25.44
2014-11-12,26.12
2014-11-13,25
2014-11-14,25.08
2014-11-17,24.77
2014-11-18,24.76
2014-11-19,24.06
2014-11-20,24.52
2014-11-21,24.52
2014-11-24,24.73
2014-11-25,24.67
2014-11-26,24.78
2014-11-28,24.29
2014-12-01,24.33
2014-12-02,23.92
2014-12-03,24.64
2014-12-04,24.82
2014-12-05,24.86
2014-12-08,24.31
2014-12-09,25.04
2014-12-10,25.05
2014-12-11,24.74
2014-12-12,24.87
2014-12-15,24.94
2014-12-16,24.18
2014-12-17,25.52
2014-12-18,29.27
2014-12-19,29.36
2014-12-22,30.05
2014-12-23,30.08
2014-12-24,29.99
2014-12-26,30.01
2014-12-29,30.25
2014-12-30,31.46
2014-12-31,31.37
2015-01-02,31.23
2015-01-05,30.89
2015-01-06,31.81
2015-01-07,30.99
2015-01-08,31.55
2015-01-09,31.57
2015-01-12,31.65
2015-01-13,31.62
2015-01-14,31.45
2015-01-15,31.26
2015-01-16,31.72
2015-01-20,31.55
2015-01-21,31.5
2015-01-22,31.485
2015-01-23,31.36
2015-01-26,31.98
2015-01-27,32.005
2015-01-28,32
2015-01-29,31.6
2015-01-30,30.6
2015-02-02,29.85
2015-02-03,30.2
2015-02-04,30.11
2015-02-05,31.09
2015-02-06,30.6
2015-02-09,29.78
2015-02-10,30.85
2015-02-11,30.95
2015-02-12,31.21
2015-02-13,33.53
2015-02-17,33.45
2015-02-18,33.98
2015-02-19,33.98
2015-02-20,33.34
2015-02-23,33.26
2015-02-24,33.86
2015-02-25,33.95
2015-02-26,33.83
2015-02-27,33.25
2015-03-02,33.62
2015-03-03,33.34
2015-03-04,33.81
2015-03-05,33.73
2015-03-06,33.66
2015-03-09,34
2015-03-10,33.92
2015-03-11,37.34
2015-03-12,33.1
2015-03-13,32.49
2015-03-16,33.6
2015-03-17,33.94
2015-03-18,33.52
2015-03-19,32.15
2015-03-20,32.05
2015-03-23,31.48
2015-03-24,31.6
2015-03-25,32.07
2015-03-26,32
2015-03-27,31.89
2015-03-30,32.65
2015-03-31,31.99
2015-04-01,33.87
2015-04-02,33.73
2015-04-06,34.95
2015-04-07,34.31
2015-04-08,35.21
2015-04-09,34.56
2015-04-10,34.75
2015-04-13,34.66
2015-04-14,34.54
2015-04-15,35.36
2015-04-16,36.71
2015-04-17,36.18
2015-04-20,36.46
2015-04-21,36.43
2015-04-22,36.39
2015-04-23,37.02
2015-04-24,37.13
2015-04-27,37.6
2015-04-28,37.78
2015-04-29,38
2015-04-30,36.74
2015-05-01,35.16
2015-05-04,36.33
2015-05-05,35.69
2015-05-06,36.28
2015-05-07,36.22
2015-05-08,36
2015-05-11,36.76
2015-05-12,37.49
2015-05-13,38.56
2015-05-14,38.42
2015-05-15,38.54
2015-05-18,37
2015-05-19,37.36
2015-05-20,37.8
2015-05-21,37.56
2015-05-22,36.96
2015-05-26,36.73
2015-05-27,37.73
2015-05-28,37.34
2015-05-29,37.38
2015-06-01,37.94
2015-06-02,37.83
2015-06-03,38.01
2015-06-04,39.26
2015-06-05,39.81
2015-06-08,39.94
2015-06-09,39.31
2015-06-10,40.08
2015-06-11,40.7
2015-06-12,40.99
2015-06-15,42.03
2015-06-16,43.23
2015-06-17,43.8
2015-06-18,44.67
2015-06-19,44.91
2015-06-22,45.58
2015-06-23,44.48
2015-06-24,43.91
2015-06-25,44.97
2015-06-26,44.34
2015-06-29,43.13
2015-06-30,44.6
2015-07-01,43.26
2015-07-02,42.41
2015-07-06,44.08
2015-07-07,43.97
2015-07-08,42.84
2015-07-09,42.85
2015-07-10,43.74
2015-07-13,43.65
2015-07-14,44.12
2015-07-15,42.38
2015-07-16,42.96
2015-07-17,42.7
2015-07-20,42.99
2015-07-21,42.75
2015-07-22,43.22
2015-07-23,43.44
2015-07-24,42.91
2015-07-27,42.21
2015-07-28,42.57
2015-07-29,41.8
2015-07-30,43.15
2015-07-31,44.46
2015-08-03,44.83
2015-08-04,43.65
2015-08-05,43.9
2015-08-06,42.75
2015-08-07,43.39
2015-08-10,43.25
2015-08-11,42.6
2015-08-12,48.89
2015-08-13,51.36
2015-08-14,51.74
2015-08-17,49.99
2015-08-18,50.28
2015-08-19,50.92
2015-08-20,49.42
2015-08-21,49.98
2015-08-24,46.66
2015-08-25,45.85
2015-08-26,47.04
2015-08-27,47.41
2015-08-28,49.78
2015-08-31,49.29
2015-09-01,49.25
2015-09-02,50.73
2015-09-03,51.99
2015-09-04,51.14
2015-09-08,52.47
2015-09-09,52.73
2015-09-10,54.14
2015-09-11,54.58
2015-09-14,54.7
2015-09-15,53.89
2015-09-16,54.85
2015-09-17,54.81
2015-09-18,54.84
2015-09-21,53.49
2015-09-22,53.35
2015-09-23,54.39
2015-09-24,53.66
2015-09-25,50.2
2015-09-28,46.55
2015-09-29,46.98
2015-09-30,48.55
2015-10-01,47.25
2015-10-02,48.61
2015-10-05,50.58
2015-10-06,46.76
2015-10-07,44.42
2015-10-08,43.62
2015-10-09,44.46
2015-10-12,44.47
2015-10-13,44
2015-10-14,43.21
2015-10-15,44.81
2015-10-16,45.11
2015-10-19,45.64
2015-10-20,45.48
2015-10-21,42.55
2015-10-22,39.78
2015-10-23,41.76
2015-10-26,40.63
2015-10-27,41.91
2015-10-28,43.34
2015-10-29,41.71
2015-10-30,42.74
2015-11-02,44.98
2015-11-03,45.89
2015-11-04,46.19
2015-11-05,46.74
2015-11-06,47.09
2015-11-09,46.32
2015-11-10,46.53
2015-11-11,45.5
2015-11-12,44.36
2015-11-13,43.84
2015-11-16,44.42
2015-11-17,42.31
2015-11-18,39.11
2015-11-19,35
2015-11-20,36.6
2015-11-23,37.1
2015-11-24,36.49
2015-11-25,37.8
2015-11-27,38
2015-11-30,38.25
2015-12-01,38.92
2015-12-02,39.84
2015-12-03,38.41
2015-12-04,40.18
2015-12-07,39.73
2015-12-08,40.89
2015-12-09,40.73
2015-12-10,40.87
2015-12-11,40.55
2015-12-14,40.35
2015-12-15,40.87
2015-12-16,40.73
2015-12-17,41.21
2015-12-18,40.76
2015-12-21,40.06
2015-12-22,40.7
2015-12-23,41.38
2015-12-24,41.6
2015-12-28,40.31
2015-12-29,41.34
2015-12-30,40.99
2015-12-31,40.09
2016-01-04,39.57
2016-01-05,39.3
2016-01-06,39.39
2016-01-07,39
2016-01-08,38.04
2016-01-11,36.9
2016-01-12,36.57
2016-01-13,35.43
2016-01-14,36.71
2016-01-15,35.92
2016-01-19,35.62
2016-01-20,36.11
2016-01-21,36.15
2016-01-22,36.33
2016-01-25,37.31
2016-01-26,36.87
2016-01-27,35.51
2016-01-28,31.96
2016-01-29,33.24
2016-02-01,34.24
2016-02-02,32.91
2016-02-03,34
2016-02-04,33.03
2016-02-05,30.81
2016-02-08,29.54
2016-02-09,29.56
2016-02-10,29.67
2016-02-11,29.48
2016-02-12,30.12
2016-02-16,31.74
2016-02-17,32.5
2016-02-18,32.82
2016-02-19,32.86
2016-02-22,33.41
2016-02-23,32.66
2016-02-24,32.77
2016-02-25,33.42
2016-02-26,34.24
2016-02-29,34.18
2016-03-01,33.22
2016-03-02,32.88
2016-03-03,32.99
2016-03-04,33.06
2016-03-07,34.01
2016-03-08,33.02
2016-03-09,33.32
2016-03-10,33.04
2016-03-11,34.28
2016-03-14,35.34
2016-03-15,41.35
2016-03-16,41.53
2016-03-17,40.02
2016-03-18,41.24
2016-03-21,41.56
2016-03-22,41.11
2016-03-23,41.07
2016-03-24,40.38
2016-03-28,40.59
2016-03-29,41.85
2016-03-30,42.01
2016-03-31,44.98
2016-04-01,44.96
2016-04-04,44.7
2016-04-05,44.72
2016-04-06,46.66
2016-04-07,46.21
2016-04-08,46.8
2016-04-11,45.98
2016-04-12,46.78
2016-04-13,50.22
2016-04-14,48.96
2016-04-15,48.9
2016-04-18,49.61
2016-04-19,48.59
2016-04-20,48.93
2016-04-21,49.36
2016-04-22,49.64
2016-04-25,49.54
2016-04-26,49.67
2016-04-27,50.15
2016-04-28,49.44
2016-04-29,48.86
2016-05-02,49.96
2016-05-03,48.94
2016-05-04,48.21
2016-05-05,48.54
2016-05-06,48.27
2016-05-09,49
2016-05-10,45.1
2016-05-11,44.91
2016-05-12,44.19
2016-05-13,43.63
2016-05-16,44.51
2016-05-17,44.46
2016-05-18,44.98
2016-05-19,44.74
2016-05-20,45.6
2016-05-23,45.5
2016-05-24,47.31
2016-05-25,47.95
2016-05-26,47.75
2016-05-27,47.64
2016-05-31,47.74
2016-06-01,48.86
2016-06-02,49.33
2016-06-03,49.22
2016-06-06,49.33
2016-06-07,50.75
2016-06-08,50.42
2016-06-09,50.23
2016-06-10,49.46
2016-06-13,49.22
2016-06-14,48.6
2016-06-15,48.71
2016-06-16,48.55
2016-06-17,46.84
2016-06-20,46.96
2016-06-21,45.75
2016-06-22,44.89
2016-06-23,47.45
2016-06-24,46.22
2016-06-27,46.28
2016-06-28,47.87
2016-06-29,49.19
2016-06-30,50.11
2016-07-01,50.18
2016-07-05,49.71
2016-07-06,51.11
2016-07-07,52.4
2016-07-08,51.91
2016-07-11,51.82
2016-07-12,51.48
2016-07-13,51.75
2016-07-14,51.35
2016-07-15,50.68
2016-07-18,50.34
2016-07-19,50.13
2016-07-20,51.56
2016-07-21,50.92
2016-07-22,50.93
2016-07-25,50.29
2016-07-26,51.07
2016-07-27,51.87
2016-07-28,52.74
2016-07-29,53.74
2016-08-01,53
2016-08-02,52.74
2016-08-03,53.38
2016-08-04,53.78
2016-08-05,53.84
2016-08-08,54.78
2016-08-09,58.35
2016-08-10,57.07
2016-08-11,56.72
2016-08-12,56.87
2016-08-15,57.62
2016-08-16,56.71
2016-08-17,56.12
2016-08-18,56.74
2016-08-19,57.02
2016-08-22,56.67
2016-08-23,58.1
2016-08-24,57.54
2016-08-25,57.67
2016-08-26,57.51
2016-08-29,58.35
2016-08-30,58.46
2016-08-31,58.02
2016-09-01,57.95
2016-09-02,58.11
2016-09-06,58.75
2016-09-07,59.61
2016-09-08,59.6
2016-09-09,58
2016-09-12,58.99
2016-09-13,57.03
2016-09-14,57.62
2016-09-15,59.36
2016-09-16,60.21
2016-09-19,59.74
2016-09-20,59.73
2016-09-21,60.2
2016-09-22,60.79
2016-09-23,61.04
2016-09-26,59.18
2016-09-27,59.5
2016-09-28,59.5
2016-09-29,59
2016-09-30,59.9
2016-10-03,59.45
2016-10-04,59.42
2016-10-05,60.67
2016-10-06,61.03
2016-10-07,60.82
2016-10-10,60.99
2016-10-11,59.63
2016-10-12,59.05
2016-10-13,57.34
2016-10-14,56.18
2016-10-17,56.37
2016-10-18,57.77
2016-10-19,57.46
2016-10-20,58.76
2016-10-21,58.52
2016-10-24,58.85
2016-10-25,57.83
2016-10-26,53.83
2016-10-27,51.72
2016-10-28,53.44
2016-10-31,53.67
2016-11-01,52.36
2016-11-02,50.9
2016-11-03,50.25
2016-11-04,57.54
2016-11-07,58.97
2016-11-08,58.95
2016-11-09,59.32
2016-11-10,60.71
2016-11-11,63.59
2016-11-14,62.8
2016-11-15,64.08
2016-11-16,64.91
2016-11-17,67.34
2016-11-18,66.74
2016-11-21,65.63
2016-11-22,64.99
2016-11-23,66.08
2016-11-25,66.86
2016-11-28,65.55
2016-11-29,65.15
2016-11-30,64.43
2016-12-01,60.53
2016-12-02,62.27
2016-12-05,63.54
2016-12-06,64.8
2016-12-07,64.93
2016-12-08,65.38
2016-12-09,65.05
2016-12-12,64.83
2016-12-13,65.49
2016-12-14,65.32
2016-12-15,66.49
2016-12-16,65.91
2016-12-19,65.43
2016-12-20,65.31
2016-12-21,65.56
2016-12-22,67.66
2016-12-23,67.87
2016-12-27,67.53
2016-12-28,66.9
2016-12-29,66.97
2016-12-30,67.17
2017-01-03,65.55
2017-01-04,66.75
2017-01-05,65.84
2017-01-06,65.31
2017-01-09,65.38
2017-01-10,66.32
2017-01-11,65.82
2017-01-12,64.95
2017-01-13,65.2
2017-01-17,64.21
2017-01-18,63.93
2017-01-19,63.18
2017-01-20,63.56
2017-01-23,63.57
2017-01-24,64.1
2017-01-25,66.22
2017-01-26,64.71
2017-01-27,65.08
2017-01-30,63.55
2017-01-31,64.37
2017-02-01,63.99
2017-02-02,64.57
2017-02-03,65.48
2017-02-06,65.81
2017-02-07,66.41
2017-02-08,66.6
2017-02-09,67.58
2017-02-10,67.76
2017-02-13,67.81
2017-02-14,68.39
2017-02-15,69.21
2017-02-16,68.79
2017-02-17,69.36
2017-02-21,69.38
2017-02-22,69.06
2017-02-23,68.76
2017-02-24,69.22
2017-02-27,69.11
2017-02-28,68.62
2017-03-01,73.8
2017-03-02,72.78
2017-03-03,73.26
2017-03-06,71.96
2017-03-07,71.27
2017-03-08,70.2
2017-03-09,70.49
2017-03-10,71.43
2017-03-13,75.61
2017-03-14,73.63
2017-03-15,74.95
2017-03-16,74.92
2017-03-17,76.13
2017-03-20,76.44
2017-03-21,74.79
2017-03-22,74.63
2017-03-23,75.14
2017-03-24,76.91
2017-03-27,75.9
2017-03-28,76.98
2017-03-29,76.7
2017-03-30,77.01
2017-03-31,77.56
2017-04-03,78.32
2017-04-04,76.72
2017-04-05,74.93
2017-04-06,75.91
2017-04-07,76.86
2017-04-10,75.64
2017-04-11,76.82
2017-04-12,76.02
2017-04-13,75.21
2017-04-17,76.77
2017-04-18,75.68
2017-04-19,77.09
2017-04-20,78.67
2017-04-21,79.18
2017-04-24,80.92
2017-04-25,81.18
2017-04-26,82.3
2017-04-27,83.6
2017-04-28,82.89
2017-05-01,84.51
2017-05-02,84.72
2017-05-03,83.73
2017-05-04,83.83
2017-05-05,83.52
2017-05-08,84.21
2017-05-09,83.77
2017-05-10,84.38
2017-05-11,83.3
2017-05-12,82.01
2017-05-15,81.87
2017-05-16,82.26
2017-05-17,81.08
2017-05-18,81.7
2017-05-19,84.15
2017-05-22,84.03
2017-05-23,85.27
2017-05-24,86.76
2017-05-25,88.95
2017-05-26,87.93
2017-05-30,88.89
2017-05-31,88.64
2017-06-01,89.58
2017-06-02,91.28
2017-06-05,90.48
2017-06-06,90.71
2017-06-07,91.11
2017-06-08,94.23
2017-06-09,90.88
2017-06-12,88.61
2017-06-13,91.47
2017-06-14,92.36
2017-06-15,91.84
2017-06-16,92.31
2017-06-19,93.77
2017-06-20,94.44
2017-06-21,95.95
2017-06-22,96.23
2017-06-23,94.13
2017-06-26,95.52
2017-06-27,91.8
2017-06-28,94.37
2017-06-29,93.94
2017-06-30,95.42
2017-07-03,93.95
2017-07-05,95.35
2017-07-06,93.64
2017-07-07,94.86
2017-07-10,94.18
2017-07-11,94.06
2017-07-12,94.95
2017-07-13,94.22
2017-07-14,95.08
2017-07-17,94.6
2017-07-18,94.42
2017-07-19,96.18
2017-07-20,96.75
2017-07-21,95.22
2017-07-24,95.96
2017-07-25,96.44
2017-07-26,95.69
2017-07-27,94.27
2017-07-28,93.97
2017-07-31,94.38
2017-08-01,96.37
2017-08-02,96.5
2017-08-03,98.19
2017-08-04,91.08
2017-08-07,91.81
2017-08-08,92.76
2017-08-09,93.48
2017-08-10,91.43
2017-08-11,91.52
2017-08-14,92.2
2017-08-15,91.95
2017-08-16,93.44
2017-08-17,93.09
2017-08-18,93.96
2017-08-21,93.93
2017-08-22,95.38
2017-08-23,94.01
2017-08-24,93.51
2017-08-25,92.91
2017-08-28,93.72
2017-08-29,94.13
2017-08-30,95.19
2017-08-31,95.8
2017-09-01,96.81
2017-09-05,97.33
2017-09-06,98.38
2017-09-07,100.79
2017-09-08,103.05
2017-09-11,104.36
2017-09-12,104.49
2017-09-13,103.9
2017-09-14,103.59
2017-09-15,100.87
2017-09-18,102.49
2017-09-19,103.48
2017-09-20,103.58
2017-09-21,102.87
2017-09-22,101.75
2017-09-25,100.8
2017-09-26,99.91
2017-09-27,99.94
2017-09-28,95.89
2017-09-29,95.1
2017-10-02,94.44
2017-10-03,93.48
2017-10-04,93.4
2017-10-05,93.54
2017-10-06,94.68
2017-10-09,96.5
2017-10-10,93.69
2017-10-11,93.66
2017-10-12,94.78
2017-10-13,94.38
2017-10-16,94.18
2017-10-17,93.59
2017-10-18,94.78
2017-10-19,94.65
2017-10-20,96.65
2017-10-23,98.04
2017-10-24,95.95
2017-10-25,94.39
2017-10-26,94.89
2017-10-27,98.25
2017-10-30,97.27
2017-10-31,98.93
2017-11-01,98.01
2017-11-02,98
2017-11-03,101.17
2017-11-06,101.14
2017-11-07,101.65
2017-11-08,117.38
2017-11-09,119.72
2017-11-10,114.19
2017-11-13,117.37
2017-11-14,119.24
2017-11-15,118.31
2017-11-16,120.21
2017-11-17,118.26
2017-11-20,121.64
2017-11-21,123.44
2017-11-22,123.35
2017-11-24,124.39
2017-11-27,125.33
2017-11-28,126.46
2017-11-29,127.92
2017-11-30,128.74
2017-12-01,122.99
2017-12-04,119.1
2017-12-05,118.31
2017-12-06,117.43
2017-12-07,116.29
2017-12-08,118.21
2017-12-11,117.29
2017-12-12,118.65
2017-12-13,121.22
2017-12-14,119.49
2017-12-15,122.12
2017-12-18,120.18
2017-12-19,120.09
2017-12-20,121.86
2017-12-21,120.43
2017-12-22,120.94
2017-12-26,120.99
2017-12-27,120.9
2017-12-28,121.3
2017-12-29,119.08
2018-01-02,119.17
2018-01-03,118.59
2018-01-04,119.4
2018-01-05,119.85
2018-01-08,114.25
2018-01-09,117.75
2018-01-10,114.22
2018-01-11,115.17
2018-01-12,115.59
2018-01-16,116.15
2018-01-17,115.95
2018-01-18,114.99
2018-01-19,118.12
2018-01-22,120.33
2018-01-23,120.65
2018-01-24,120.89
2018-01-25,123.89
2018-01-26,125.75
2018-01-29,126.01
2018-01-30,126.24
2018-01-31,121.84
2018-02-01,122.2
2018-02-02,120.41
2018-02-05,117.68
2018-02-06,118.95
2018-02-07,119.37
2018-02-08,115.33
2018-02-09,116.68
2018-02-12,117.41
2018-02-13,117.9
2018-02-14,119.33
2018-02-15,120.87
2018-02-16,124.46
2018-02-20,126.84
2018-02-21,129.36
2018-02-22,129.49
2018-02-23,131.15
2018-02-26,133.22
2018-02-27,130.28
2018-02-28,120.82
2018-03-01,118.33
2018-03-02,122
2018-03-05,120.78
2018-03-06,124.03
2018-03-07,125.3
2018-03-08,124.66
2018-03-09,125.46
2018-03-12,126.37
2018-03-13,127.35
2018-03-14,128.11
2018-03-15,128
2018-03-16,129.09
2018-03-19,125.02
2018-03-20,126
2018-03-21,125.46
2018-03-22,123.68
2018-03-23,121.6
2018-03-26,125.68
2018-03-27,121.16
2018-03-28,119.77
2018-03-29,122.84
2018-04-02,123.8
2018-04-03,127.48
2018-04-04,127.98
2018-04-05,130.4
2018-04-06,128
2018-04-09,131.2
2018-04-10,133.15
2018-04-11,133.82
2018-04-12,137.39
2018-04-13,138.92
2018-04-16,139.43
2018-04-17,143.32
2018-04-18,142.02
2018-04-19,141.23
2018-04-20,141.08
2018-04-23,142.26
2018-04-24,138.49
2018-04-25,137.93
2018-04-26,141.79
2018-04-27,143.11
2018-04-30,140.58
2018-05-01,173.17
2018-05-02,163.46
2018-05-03,163.14
2018-05-04,169.94
2018-05-07,170.99
2018-05-08,172.09
2018-05-09,181.63
2018-05-10,181.99
2018-05-11,184.04
2018-05-14,181.22
2018-05-15,178
2018-05-16,182.15
2018-05-17,182.99
2018-05-18,187.76
2018-05-21,177.06
2018-05-22,172.6
2018-05-23,172.67
2018-05-24,171.45
2018-05-25,174.33
2018-05-29,176.48
2018-05-30,181.35
2018-05-31,182.69
2018-06-01,185.46
2018-06-04,185.92
2018-06-05,191.88
2018-06-06,191.49
2018-06-07,181.49
2018-06-08,181.31
2018-06-11,181.43
2018-06-12,183.49
2018-06-13,184.63
2018-06-14,186
2018-06-15,183.59
2018-06-18,190
2018-06-19,189.14
2018-06-20,192.48
2018-06-21,188.15
2018-06-22,186.06
2018-06-25,182.74
2018-06-26,187.09
2018-06-27,182.07
2018-06-28,185.94
2018-06-29,186.33
2018-07-02,189.55
2018-07-03,189.1
2018-07-05,193.65
2018-07-06,191.86
2018-07-09,201.88
2018-07-10,201.15
2018-07-11,202.2
2018-07-12,201.96
2018-07-13,198.5
2018-07-16,202.41
2018-07-17,210.32
2018-07-18,213.16
2018-07-19,213.49
2018-07-20,209.72
2018-07-23,210.37
2018-07-24,202.39
2018-07-25,207.86
2018-07-26,204.65
2018-07-27,198.83
2018-07-30,194.92
2018-07-31,199.25
2018-08-01,201.94
2018-08-02,212.12
2018-08-03,211.53
2018-08-06,213.69
2018-08-07,213.26
2018-08-08,230.08
2018-08-09,228.72
2018-08-10,227.09
2018-08-13,226.25
2018-08-14,231.24
2018-08-15,228.66
2018-08-16,233.01
2018-08-17,232.65
2018-08-20,231.57
2018-08-21,233.67
2018-08-22,238.43
2018-08-23,241.38
2018-08-24,246.04
2018-08-27,248.92
2018-08-28,252.16
2018-08-29,257.1
2018-08-30,261.61
2018-08-31,264.91
2018-09-04,264.94
2018-09-05,263.79
2018-09-06,259.31
2018-09-07,263.85
2018-09-10,267.72
2018-09-11,273.23
2018-09-12,274.76
2018-09-13,278.07
2018-09-14,282.92
2018-09-17,263.45
2018-09-18,263.88
2018-09-19,255.98
2018-09-20,254
2018-09-21,254.7
2018-09-24,252.96
2018-09-25,258.66
2018-09-26,243.66
2018-09-27,245.55
2018-09-28,244.12
2018-10-01,239.74
2018-10-02,237.15
2018-10-03,230.91
2018-10-04,216.95
2018-10-05,215.81
2018-10-08,209.43
2018-10-09,205.2
2018-10-10,196.1
2018-10-11,198.5
2018-10-12,201.42
2018-10-15,201.69
2018-10-16,211.98
2018-10-17,212.35
2018-10-18,204.66
2018-10-19,195.38
2018-10-22,202.88
2018-10-23,199.38
2018-10-24,192.35
2018-10-25,190.97
2018-10-26,187.12
2018-10-29,185.04
2018-10-30,191.16
2018-10-31,189.57
2018-11-01,197.54
2018-11-02,194.3
2018-11-05,191.98
2018-11-06,193.3
2018-11-07,155.86
2018-11-08,148.81
2018-11-09,148.51
2018-11-12,139.93
2018-11-13,137.97
2018-11-14,132.31
2018-11-15,139.01
2018-11-16,141.75
2018-11-19,137.45
2018-11-20,141.57
2018-11-21,138.09
2018-11-23,138.83
2018-11-26,141.91
2018-11-27,142.37
2018-11-28,141.24
2018-11-29,144.08
2018-11-30,147.36
2018-12-03,150.01
2018-12-04,143.58
2018-12-06,144.32
2018-12-07,138.92
2018-12-10,139.82
2018-12-11,137.67
2018-12-12,136.43
2018-12-13,133.03
2018-12-14,130.79
2018-12-17,126.03
2018-12-18,128.52
2018-12-19,120.1
2018-12-20,115.58
2018-12-21,115.29
2018-12-24,112.83
2018-12-26,123.07
2018-12-27,122.81
2018-12-28,122.48
2018-12-31,124.17
2019-01-02,123.22
2019-01-03,121.13
2019-01-04,127.9
2019-01-07,136.14
2019-01-08,133.19
2019-01-09,136.59
2019-01-10,141.36
2019-01-11,135.81
2019-01-14,139.71
2019-01-15,145.2
2019-01-16,146.16
2019-01-17,148.54
2019-01-18,150.13
2019-01-22,145.99
2019-01-23,143.03
2019-01-24,147.23
2019-01-25,149.92
2019-01-28,145.71
2019-01-29,146.17
2019-01-30,149.8
2019-01-31,151.21
2019-02-01,152.23
2019-02-04,151.33
2019-02-05,144.07
2019-02-06,144.07
2019-02-07,139.74
2019-02-08,136.72
2019-02-11,142.2
2019-02-12,138.05
2019-02-13,136.1
2019-02-14,138.25
2019-02-15,141.89
2019-02-19,139.44
2019-02-20,140.51
2019-02-21,138.99
2019-02-22,143.33
2019-02-25,144.43
2019-02-26,140.06
2019-02-27,106.28
2019-02-28,107.46
2019-03-01,106.97
2019-03-04,102.99
2019-03-05,102.6
2019-03-06,98.51
2019-03-07,97.23
2019-03-08,93.95
2019-03-11,96.28
2019-03-12,95.84
2019-03-13,97.44
2019-03-14,96.38
2019-03-15,95.12
2019-03-18,95.71
2019-03-19,96.11
2019-03-20,93.27
2019-03-21,94.68
2019-03-22,90.12
2019-03-25,91.78
2019-03-26,92.64
2019-03-27,92.54
2019-03-28,93.75
2019-03-29,95.37
2019-04-01,91.25
2019-04-02,90.18
2019-04-03,90.2
2019-04-04,92.42
2019-04-05,93.37
2019-04-08,92.94
2019-04-09,89.49
2019-04-10,89.57
2019-04-11,88.01
2019-04-12,84.83
2019-04-15,83.14
2019-04-16,82.27
2019-04-17,79.91
2019-04-18,78.69
2019-04-22,78.86
2019-04-23,84.04
2019-04-24,83.4
2019-04-25,82.95
2019-04-26,86.22
2019-04-29,87
2019-04-30,87.3
2019-05-01,85.85
2019-05-02,88.11
2019-05-03,91.68
2019-05-06,95.15
2019-05-07,91.14
2019-05-08,67.79
2019-05-09,72.24
2019-05-10,74.04
2019-05-13,73.18
2019-05-14,73.37
2019-05-15,74.85
2019-05-16,74.95
2019-05-17,71.4
2019-05-20,69.95
2019-05-21,68.99
2019-05-22,68.06
2019-05-23,66.11
2019-05-24,66
2019-05-28,64.97
2019-05-29,63.62
2019-05-30,64.68
2019-05-31,64.47
2019-06-03,63.35
2019-06-04,65.05
2019-06-05,63.19
2019-06-06,64.9
2019-06-07,66.24
2019-06-10,64.61
2019-06-11,66.09
2019-06-12,67.39
2019-06-13,67.8
2019-06-14,68.07
2019-06-17,71.165
2019-06-18,71.14
2019-06-19,70.76
2019-06-20,71.82
2019-06-21,71.495
2019-06-24,71
2019-06-25,68.425
2019-06-26,64.315
2019-06-27,65.525
2019-06-28,66.675
2019-07-01,66.645
2019-07-02,64.83
2019-07-03,65.285
2019-07-04,65.285
2019-07-05,66.06
2019-07-08,63.85
2019-07-09,63.03
2019-07-10,63.655
2019-07-11,62.275
2019-07-12,62.685
2019-07-15,62.805
2019-07-16,62.12
2019-07-17,59.895
2019-07-18,59.7
2019-07-19,58.72
2019-07-22,58.19
2019-07-23,57.31
2019-07-24,60.51
2019-07-25,60.27
2019-07-26,61.305
2019-07-29,59.715
2019-07-30,63.095
2019-07-31,61.5
2019-08-01,60.55
2019-08-02,58.78
2019-08-05,58.235
2019-08-06,55.18
2019-08-07,42.18
2019-08-08,46.55
2019-08-09,45.01
2019-08-12,45.03
2019-08-13,46
2019-08-14,43.04
2019-08-15,43.02
2019-08-16,42.17
2019-08-19,42.56
2019-08-20,41.81
2019-08-21,43.265
2019-08-22,44.92
2019-08-23,44.43
2019-08-26,46.26
2019-08-27,45.52
2019-08-28,45.84
2019-08-29,45.825
2019-08-30,46.43
2019-09-02,46.43
2019-09-03,44.26
2019-09-04,42.58
2019-09-05,43.93
2019-09-06,43.61
2019-09-09,42.76
2019-09-10,46.7
2019-09-11,47.9
2019-09-12,47.26
2019-09-13,48.395
2019-09-16,51.43
2019-09-17,50.28
2019-09-18,48.45
2019-09-19,49.1
2019-09-20,48.695
2019-09-23,47.405
2019-09-24,48
2019-09-25,48.4
2019-09-26,47.39
2019-09-27,47.76
2019-09-30,47.885
2019-10-01,45.98
2019-10-02,45.99
2019-10-03,47.42
2019-10-04,47.81
2019-10-07,47.98
2019-10-08,46.71
2019-10-09,47.62
2019-10-10,46.07
2019-10-11,48.79
2019-10-14,47.785
2019-10-15,49.245
2019-10-16,48.88
2019-10-17,49.39
2019-10-18,49.04
2019-10-21,49.47
2019-10-22,50.78
2019-10-23,51.9
2019-10-24,51.67
2019-10-25,52.485
2019-10-28,54.35
2019-10-29,53.995
2019-10-30,54.215
2019-10-31,54.45
2019-11-01,56.07
2019-11-04,57.76
2019-11-05,59.475
2019-11-06,67.64
2019-11-07,68.76
2019-11-08,69.04
2019-11-11,67.51
2019-11-12,69.06
2019-11-13,70.095
2019-11-14,69.795
2019-11-15,71.37
2019-11-18,69.395
2019-11-19,71.415
2019-11-20,70.42
2019-11-21,70.55
2019-11-22,73.055
2019-11-25,76.205
