date,close
2014-06-13,43.42
2014-06-16,44.07
2014-06-17,44.06
2014-06-18,44.28
2014-06-19,43.98
2014-06-20,43.57
2014-06-23,42.83
2014-06-24,42.19
2014-06-25,41.97
2014-06-26,41.38
2014-06-27,40.51
2014-06-30,40.2
2014-07-01,40.33
2014-07-02,39.99
2014-07-03,40.55
2014-07-07,40.82
2014-07-08,40.23
2014-07-09,40.48
2014-07-10,40.81
2014-07-11,41.24
2014-07-14,42.05
2014-07-15,41.49
2014-07-16,41.78
2014-07-17,41.74
2014-07-18,42.37
2014-07-21,42.22
2014-07-22,43.06
2014-07-23,42.7
2014-07-24,43.38
2014-07-25,42.63
2014-07-28,42.37
2014-07-29,42.85
2014-07-30,42.78
2014-07-31,42.16
2014-08-01,42.21
2014-08-04,43.54
2014-08-05,43.36
2014-08-06,43.05
2014-08-07,41.62
2014-08-08,42.48
2014-08-11,42.69
2014-08-12,42.27
2014-08-13,42.45
2014-08-14,42.87
2014-08-15,42.87
2014-08-18,43.33
2014-08-19,43.23
2014-08-20,43.32
2014-08-21,43.43
2014-08-22,43.51
2014-08-25,43.9
2014-08-26,44.5
2014-08-27,44.84
2014-08-28,45.32
2014-08-29,45.67
2014-09-02,45.84
2014-09-03,45.8
2014-09-04,44.6
2014-09-05,44.53
2014-09-08,44.87
2014-09-09,45.46
2014-09-10,44.64
2014-09-11,44.88
2014-09-12,44.86
2014-09-15,45.04
2014-09-16,45.03
2014-09-17,44.23
2014-09-18,44.71
2014-09-19,43.57
2014-09-22,43.22
2014-09-23,42.65
2014-09-24,43.22
2014-09-25,41.76
2014-09-26,42.25
2014-09-29,41.9
2014-09-30,41.92
2014-10-01,41.59
2014-10-02,41.84
2014-10-03,41.96
2014-10-06,42.23
2014-10-07,41.29
2014-10-08,41.95
2014-10-09,41.15
2014-10-10,40.01
2014-10-13,39.9
2014-10-14,41.32
2014-10-15,41.18
2014-10-16,41
2014-10-17,42.29
2014-10-20,40.7
2014-10-21,41.3
2014-10-22,40.04
2014-10-23,39.87
2014-10-24,40.69
2014-10-27,40.63
2014-10-28,41.38
2014-10-29,40.72
2014-10-30,41.4
2014-10-31,42.32
2014-11-03,41.82
2014-11-04,41.72
2014-11-05,41.06
2014-11-06,42.68
2014-11-07,42.71
2014-11-10,43.53
2014-11-11,43.71
2014-11-12,44.58
2014-11-13,44.6
2014-11-14,44.25
2014-11-17,44.81
2014-11-18,44.73
2014-11-19,44.77
2014-11-20,44.46
2014-11-21,44.57
2014-11-24,45.15
2014-11-25,44.92
2014-11-26,44.86
2014-11-28,45.14
2014-12-01,44.43
2014-12-02,44.58
2014-12-03,45.11
2014-12-04,44.43
2014-12-05,44.54
2014-12-08,43.4
2014-12-09,43.48
2014-12-10,42.52
2014-12-11,42.6
2014-12-12,41.53
2014-12-15,41.64
2014-12-16,40.87
2014-12-17,41.28
2014-12-18,42.99
2014-12-19,44.29
2014-12-22,44.22
2014-12-23,44.81
2014-12-24,45.22
2014-12-26,44.97
2014-12-29,44.94
2014-12-30,44.61
2014-12-31,43.68
2015-01-02,44
2015-01-05,43.07
2015-01-06,42.63
2015-01-07,42.78
2015-01-08,43.33
2015-01-09,43.43
2015-01-12,42.63
2015-01-13,42.83
2015-01-14,42.65
2015-01-15,41.95
2015-01-16,42.93
2015-01-20,43.32
2015-01-21,43.29
2015-01-22,44.25
2015-01-23,43.35
2015-01-26,44.36
2015-01-27,45.22
2015-01-28,44.58
2015-01-29,45
2015-01-30,44.56
2015-02-02,45.53
2015-02-03,46.69
2015-02-04,46.98
2015-02-05,42.19
2015-02-06,41.63
2015-02-09,42.5
2015-02-10,43.63
2015-02-11,43.83
2015-02-12,46.02
2015-02-13,45.73
2015-02-17,45.08
2015-02-18,45.16
2015-02-19,45.17
2015-02-20,45.29
2015-02-23,44.63
2015-02-24,44.73
2015-02-25,43.95
2015-02-26,43.96
2015-02-27,44.52
2015-03-02,44.96
2015-03-03,44.05
2015-03-04,44.64
2015-03-05,44.03
2015-03-06,42.89
2015-03-09,42.85
2015-03-10,42.18
2015-03-11,42.24
2015-03-12,42.34
2015-03-13,42.14
2015-03-16,42.19
2015-03-17,42.74
2015-03-18,42.73
2015-03-19,42.73
2015-03-20,43.95
2015-03-23,44.23
2015-03-24,43.7
2015-03-25,42.67
2015-03-26,42.62
2015-03-27,42.71
2015-03-30,43.57
2015-03-31,44.14
2015-04-01,44.01
2015-04-02,43.97
2015-04-06,44.72
2015-04-07,45.4
2015-04-08,45.62
2015-04-09,45.89
2015-04-10,44.86
2015-04-13,44.14
2015-04-14,43.59
2015-04-15,43.72
2015-04-16,43.74
2015-04-17,43.1
2015-04-20,43.15
2015-04-21,43.45
2015-04-22,43.72
2015-04-23,44.45
2015-04-24,43.98
2015-04-27,43.86
2015-04-28,44.22
2015-04-29,44.22
2015-04-30,43.99
2015-05-01,45.01
2015-05-04,45.28
2015-05-05,44.54
2015-05-06,44.94
2015-05-07,41.8
2015-05-08,40.86
2015-05-11,40.11
2015-05-12,40.01
2015-05-13,40.64
2015-05-14,40.82
2015-05-15,40.22
2015-05-18,40.46
2015-05-19,40.29
2015-05-20,40.23
2015-05-21,39.93
2015-05-22,39.57
2015-05-26,38.7
2015-05-27,38.83
2015-05-28,38.73
2015-05-29,38.94
2015-06-01,38.62
2015-06-02,39.25
2015-06-03,40
2015-06-04,39.12
2015-06-05,39.17
2015-06-08,38.87
2015-06-09,38.77
2015-06-10,39.04
2015-06-11,38.56
2015-06-12,38.57
2015-06-15,37.5
2015-06-16,38.25
2015-06-17,38.65
2015-06-18,39.02
2015-06-19,38.36
2015-06-22,38.56
2015-06-23,38.07
2015-06-24,37.6
2015-06-25,37.52
2015-06-26,37.3
2015-06-29,36.95
2015-06-30,37
2015-07-01,36.2
2015-07-02,36.02
2015-07-06,35.62
2015-07-07,35.91
2015-07-08,35.41
2015-07-09,35.56
2015-07-10,35.93
2015-07-13,36.3
2015-07-14,36.31
2015-07-15,35.99
2015-07-16,35.76
2015-07-17,35.62
2015-07-20,36.85
2015-07-21,36.63
2015-07-22,36.61
2015-07-23,36.71
2015-07-24,35.87
2015-07-27,35.74
2015-07-28,36.15
2015-07-29,36.38
2015-07-30,36.6
2015-07-31,37.11
2015-08-03,36.53
2015-08-04,35.99
2015-08-05,36.27
2015-08-06,30.43
2015-08-07,30
2015-08-10,30.9
2015-08-11,30.25
2015-08-12,30.52
2015-08-13,30.54
2015-08-14,30.53
2015-08-17,30.63
2015-08-18,30.41
2015-08-19,29.88
2015-08-20,29.63
2015-08-21,30.18
2015-08-24,28.99
2015-08-25,27.7
2015-08-26,29.05
2015-08-27,29.75
2015-08-28,29.49
2015-08-31,29.23
2015-09-01,28.54
2015-09-02,28.73
2015-09-03,28.46
2015-09-04,28.42
2015-09-08,29.44
2015-09-09,29.32
2015-09-10,29.41
2015-09-11,29.59
2015-09-14,29.39
2015-09-15,29.8
2015-09-16,30.04
2015-09-17,29.56
2015-09-18,29.11
2015-09-21,28.81
2015-09-22,28.23
2015-09-23,28.35
2015-09-24,28.43
2015-09-25,28.84
2015-09-28,28.2
2015-09-29,29.2
2015-09-30,28.96
2015-10-01,28.12
2015-10-02,29.02
2015-10-05,29.2
2015-10-06,29.49
2015-10-07,29.93
2015-10-08,29.76
2015-10-09,29.47
2015-10-12,28.58
2015-10-13,28.37
2015-10-14,28.42
2015-10-15,28.62
2015-10-16,28.58
2015-10-19,28.86
2015-10-20,28.96
2015-10-21,28
2015-10-22,28.15
2015-10-23,28.28
2015-10-26,28.14
2015-10-27,27.79
2015-10-28,28.69
2015-10-29,28.08
2015-10-30,28.11
2015-11-02,29.1
2015-11-03,29.42
2015-11-04,29.79
2015-11-05,25.58
2015-11-06,28.83
2015-11-09,27.67
2015-11-10,27.66
2015-11-11,27
2015-11-12,26.58
2015-11-13,26.12
2015-11-16,26.37
2015-11-17,26.53
2015-11-18,28.19
2015-11-19,28.42
2015-11-20,28.45
2015-11-23,29.65
2015-11-24,29.88
2015-11-25,29.89
2015-11-27,29.8
2015-11-30,29.91
2015-12-01,30.63
2015-12-02,30.03
2015-12-03,29.44
2015-12-04,29.69
2015-12-07,28.77
2015-12-08,28.14
2015-12-09,28.15
2015-12-10,28.64
2015-12-11,27.07
2015-12-14,26.88
2015-12-15,26.93
2015-12-16,27.56
2015-12-17,26.82
2015-12-18,26.19
2015-12-21,26.31
2015-12-22,26.94
2015-12-23,27.2
2015-12-24,27.22
2015-12-28,26.81
2015-12-29,27.07
2015-12-30,26.82
2015-12-31,26.42
2016-01-04,26.25
2016-01-05,25.52
2016-01-06,24.48
2016-01-07,23.66
2016-01-08,23.47
2016-01-11,22.89
2016-01-12,23.05
2016-01-13,22.69
2016-01-14,23.15
2016-01-15,22.96
2016-01-19,22.69
2016-01-20,23.28
2016-01-21,23.4
2016-01-22,23.37
2016-01-25,22.76
2016-01-26,22.94
2016-01-27,22.96
2016-01-28,23.15
2016-01-29,24.34
2016-02-01,24.33
2016-02-02,23.27
2016-02-03,23.69
2016-02-04,25.58
2016-02-05,23.54
2016-02-08,23.12
2016-02-09,22.6
2016-02-10,23.24
2016-02-11,22.62
2016-02-12,23.07
2016-02-16,23.64
2016-02-17,24.75
2016-02-18,25.06
2016-02-19,25.08
2016-02-22,25.06
2016-02-23,24.53
2016-02-24,24.69
2016-02-25,25.13
2016-02-26,25.11
2016-02-29,24.95
2016-03-01,25.47
2016-03-02,25.53
2016-03-03,26.43
2016-03-04,26.8
2016-03-07,27.48
2016-03-08,26.81
2016-03-09,26.57
2016-03-10,26.11
2016-03-11,26.73
2016-03-14,26.18
2016-03-15,25.88
2016-03-16,26.16
2016-03-17,26.45
2016-03-18,26.76
2016-03-21,26.74
2016-03-22,26.73
2016-03-23,25.89
2016-03-24,25.85
2016-03-28,26.19
2016-03-29,26.49
2016-03-30,26.11
2016-03-31,26.24
2016-04-01,25.65
2016-04-04,25.34
2016-04-05,25.16
2016-04-06,25.61
2016-04-07,25.18
2016-04-08,24.94
2016-04-11,24.72
2016-04-12,24.49
2016-04-13,25.28
2016-04-14,25.19
2016-04-15,24.69
2016-04-18,24.79
2016-04-19,25.12
2016-04-20,25.5
2016-04-21,25.8
2016-04-22,26.61
2016-04-25,26.32
2016-04-26,26.04
2016-04-27,26.2
2016-04-28,25.9
2016-04-29,25.3
2016-05-02,25.33
2016-05-03,25.04
2016-05-04,24.4
2016-05-05,26.27
2016-05-06,28.14
2016-05-09,27.2
2016-05-10,27.75
2016-05-11,27.53
2016-05-12,27.31
2016-05-13,26.41
2016-05-16,26.54
2016-05-17,26.15
2016-05-18,26
2016-05-19,25.85
2016-05-20,26.44
2016-05-23,26.62
2016-05-24,26.55
2016-05-25,27.57
2016-05-26,27.71
2016-05-27,27.94
2016-05-31,28.34
2016-06-01,28.58
2016-06-02,28.96
2016-06-03,28.31
2016-06-06,28.65
2016-06-07,28.74
2016-06-08,29.05
2016-06-09,28.64
2016-06-10,27.85
2016-06-13,27.5
2016-06-14,27.3
2016-06-15,27.06
2016-06-16,27.23
2016-06-17,27.67
2016-06-20,28.19
2016-06-21,28.2
2016-06-22,27.85
2016-06-23,28.56
2016-06-24,26.08
2016-06-27,24.44
2016-06-28,24.87
2016-06-29,24.94
2016-06-30,25.07
2016-07-01,25.25
2016-07-05,24.78
2016-07-06,25.12
2016-07-07,25.23
2016-07-08,25.94
2016-07-11,26.04
2016-07-12,27.12
2016-07-13,27.09
2016-07-14,27.31
2016-07-15,27.18
2016-07-18,27.35
2016-07-19,27.23
2016-07-20,28.3
2016-07-21,28.03
2016-07-22,28.21
2016-07-25,28.31
2016-07-26,28.55
2016-07-27,28.5
2016-07-28,28.69
2016-07-29,28.38
2016-08-01,28.39
2016-08-02,29.42
2016-08-03,30.65
2016-08-04,31.26
2016-08-05,31.55
2016-08-08,31.9
2016-08-09,31.62
2016-08-10,31.27
2016-08-11,31.54
2016-08-12,31.36
2016-08-15,31.8
2016-08-16,31.43
2016-08-17,31.35
2016-08-18,31.54
2016-08-19,31.67
2016-08-22,31.68
2016-08-23,31.98
2016-08-24,31.56
2016-08-25,31.75
2016-08-26,32.29
2016-08-29,32.62
2016-08-30,32.59
2016-08-31,31.73
2016-09-01,31.47
2016-09-02,31.75
2016-09-06,31.23
2016-09-07,31.22
2016-09-08,31.11
2016-09-09,29.79
2016-09-12,30.37
2016-09-13,29.46
2016-09-14,29.57
2016-09-15,30.03
2016-09-16,29.63
2016-09-19,30.07
2016-09-20,29.88
2016-09-21,30.34
2016-09-22,30.56
2016-09-23,30.72
2016-09-26,30.48
2016-09-27,30.4
2016-09-28,30.96
2016-09-29,30.11
2016-09-30,31
2016-10-03,29.44
2016-10-04,29.55
2016-10-05,30.16
2016-10-06,30.36
2016-10-07,30.29
2016-10-10,30.63
2016-10-11,29.79
2016-10-12,30
2016-10-13,29.31
2016-10-14,29.52
2016-10-17,29.29
2016-10-18,29.5
2016-10-19,30.09
2016-10-20,29.69
2016-10-21,29.34
2016-10-24,29.83
2016-10-25,29.8
2016-10-26,30.09
2016-10-27,27.66
2016-10-28,26.95
2016-10-31,26.96
2016-11-01,27.1
2016-11-02,26.73
2016-11-03,26.53
2016-11-04,26.42
2016-11-07,27.11
2016-11-08,27.5
2016-11-09,28.02
2016-11-10,28.42
2016-11-11,28.61
2016-11-14,29.04
2016-11-15,29.04
2016-11-16,28.39
2016-11-17,28.02
2016-11-18,27.07
2016-11-21,27.45
2016-11-22,27.42
2016-11-23,27.35
2016-11-25,27.35
2016-11-28,27.54
2016-11-29,27.2
2016-11-30,26.85
2016-12-01,26.42
2016-12-02,26.45
2016-12-05,27.23
2016-12-06,27.41
2016-12-07,27.89
2016-12-08,28.75
2016-12-09,28.6
2016-12-12,28.29
2016-12-13,28.62
2016-12-14,28.54
2016-12-15,28.15
2016-12-16,28.23
2016-12-19,28.04
2016-12-20,27.57
2016-12-21,27.32
2016-12-22,26.7
2016-12-23,26.97
2016-12-27,27.33
2016-12-28,27.09
2016-12-29,27.25
2016-12-30,27.17
2017-01-03,27.58
2017-01-04,28.64
2017-01-05,28.34
2017-01-06,28.75
2017-01-09,28.53
2017-01-10,28.31
2017-01-11,28.47
2017-01-12,28.45
2017-01-13,28.51
2017-01-17,28.2
2017-01-18,28.72
2017-01-19,28.42
2017-01-20,28.47
2017-01-23,28.4
2017-01-24,28.64
2017-01-25,29.16
2017-01-26,28.92
2017-01-27,29.12
2017-01-30,29.03
2017-01-31,29.36
2017-02-01,29.53
2017-02-02,29.77
2017-02-03,30.2
2017-02-06,29.92
2017-02-07,29.94
2017-02-08,30.17
2017-02-09,32.74
2017-02-10,31.68
2017-02-13,31.87
2017-02-14,31.56
2017-02-15,31.59
2017-02-16,31.07
2017-02-17,31.07
2017-02-21,31.73
2017-02-22,31.4
2017-02-23,31.36
2017-02-24,31.28
2017-02-27,31.36
2017-02-28,31.1
2017-03-01,31.43
2017-03-02,31.09
2017-03-03,31.46
2017-03-06,31.26
2017-03-07,31.09
2017-03-08,31
2017-03-09,31.11
2017-03-10,31.38
2017-03-13,30.99
2017-03-14,30.97
2017-03-15,31.07
2017-03-16,31.2
2017-03-17,30.76
2017-03-20,30.94
2017-03-21,30.27
2017-03-22,30.38
2017-03-23,30.44
2017-03-24,30.3
2017-03-27,30.41
2017-03-28,30.8
2017-03-29,31.02
2017-03-30,31.27
2017-03-31,31.12
2017-04-03,30.46
2017-04-04,30.38
2017-04-05,30.08
2017-04-06,30.24
2017-04-07,30.29
2017-04-10,30.41
2017-04-11,30.44
2017-04-12,30.31
2017-04-13,30.44
2017-04-17,31.04
2017-04-18,30.97
2017-04-19,31.32
2017-04-20,31.94
2017-04-21,31.06
2017-04-24,31.41
2017-04-25,31.57
2017-04-26,32
2017-04-27,29.37
2017-04-28,29.18
2017-05-01,29.04
2017-05-02,29.12
2017-05-03,29.11
2017-05-04,29.05
2017-05-05,29.4
2017-05-08,29.16
2017-05-09,29.1
2017-05-10,29
2017-05-11,28.57
2017-05-12,28.87
2017-05-15,29.27
2017-05-16,29.26
2017-05-17,28.21
2017-05-18,28.04
2017-05-19,28.56
2017-05-22,28.95
2017-05-23,28.77
2017-05-24,28.38
2017-05-25,28.85
2017-05-26,28.6
2017-05-30,28.15
2017-05-31,27.26
2017-06-01,27.69
2017-06-02,27.4
2017-06-05,27.32
2017-06-06,27.74
2017-06-07,27.76
2017-06-08,27.8
2017-06-09,27.93
2017-06-12,28.04
2017-06-13,28.41
2017-06-14,28.45
2017-06-15,28.38
2017-06-16,28.3
2017-06-19,28.66
2017-06-20,28.45
2017-06-21,29
2017-06-22,29.2
2017-06-23,29.76
2017-06-26,29.7
2017-06-27,29.6
2017-06-28,30.04
2017-06-29,29.86
2017-06-30,29.49
2017-07-03,29.61
2017-07-05,29.28
2017-07-06,28.43
2017-07-07,28.38
2017-07-10,28.59
2017-07-11,28.74
2017-07-12,28.9
2017-07-13,29.27
2017-07-14,29.55
2017-07-17,29.47
2017-07-18,29.39
2017-07-19,29.4
2017-07-20,29.5
2017-07-21,29.12
2017-07-24,29.25
2017-07-25,29.7
2017-07-26,29.38
2017-07-27,31.88
2017-07-28,31.5
2017-07-31,31.82
2017-08-01,32.47
2017-08-02,32.35
2017-08-03,32.22
2017-08-04,31.91
2017-08-07,31.65
2017-08-08,31.65
2017-08-09,31.54
2017-08-10,30.85
2017-08-11,30.83
2017-08-14,31.09
2017-08-15,31
2017-08-16,30.93
2017-08-17,30.28
2017-08-18,30.08
2017-08-21,30.14
2017-08-22,30.42
2017-08-23,30.51
2017-08-24,30.8
2017-08-25,30.84
2017-08-28,31.04
2017-08-29,30.98
2017-08-30,31.22
2017-08-31,31.92
2017-09-01,32.19
2017-09-05,31.71
2017-09-06,31.05
2017-09-07,30.66
2017-09-08,30.74
2017-09-11,31.79
2017-09-12,31.94
2017-09-13,31.61
2017-09-14,32.06
2017-09-15,32.63
2017-09-18,33.05
2017-09-19,32.98
2017-09-20,33.2
2017-09-21,32.88
2017-09-22,32.97
2017-09-25,32.85
2017-09-26,33.22
2017-09-27,33.6
2017-09-28,33.76
2017-09-29,33.79
2017-10-02,33.95
2017-10-03,34.1
2017-10-04,33.72
2017-10-05,33.67
2017-10-06,33.42
2017-10-09,33.16
2017-10-10,33.07
2017-10-11,32.69
2017-10-12,32.63
2017-10-13,33.21
2017-10-16,32.97
2017-10-17,32.11
2017-10-18,32.22
2017-10-19,32.31
2017-10-20,32.54
2017-10-23,32.2
2017-10-24,32.56
2017-10-25,32.56
2017-10-26,32.57
2017-10-27,33.51
2017-10-30,33.87
2017-10-31,33.45
2017-11-01,33.29
2017-11-02,37.06
2017-11-03,36.09
2017-11-06,35.53
2017-11-07,34.62
2017-11-08,35.64
2017-11-09,35.26
2017-11-10,35.35
2017-11-13,35.83
2017-11-14,35.77
2017-11-15,35.42
2017-11-16,35.85
2017-11-17,35.83
2017-11-20,36.15
2017-11-21,36.39
2017-11-22,36.41
2017-11-24,36.76
2017-11-27,36.61
2017-11-28,36.96
2017-11-29,37.66
2017-11-30,38.01
2017-12-01,37.73
2017-12-04,37.98
2017-12-05,38.52
2017-12-06,37.38
2017-12-07,37.53
2017-12-08,38.15
2017-12-11,38.4
2017-12-12,38.54
2017-12-13,38.91
2017-12-14,38.71
2017-12-15,38.57
2017-12-18,39.2
2017-12-19,38.97
2017-12-20,38.89
2017-12-21,38.66
2017-12-22,38.53
2017-12-26,38.68
2017-12-27,38.79
2017-12-28,38.48
2017-12-29,38.46
2018-01-02,38.49
2018-01-03,38.68
2018-01-04,38.65
2018-01-05,38.83
2018-01-08,38.82
2018-01-09,38.4
2018-01-10,37.99
2018-01-11,38.18
2018-01-12,38.32
2018-01-16,37.77
2018-01-17,38.81
2018-01-18,38.81
2018-01-19,39.09
2018-01-22,38.85
2018-01-23,39.83
2018-01-24,39.9
2018-01-25,40.19
2018-01-26,40.86
2018-01-29,41.22
2018-01-30,40.89
2018-01-31,40.5
2018-02-01,41.37
2018-02-02,40.8
2018-02-05,40.34
2018-02-06,39.75
2018-02-07,40.1
2018-02-08,37.3
2018-02-09,35
2018-02-12,35.93
2018-02-13,36.22
2018-02-14,36.69
2018-02-15,37.02
2018-02-16,36.71
2018-02-20,36.76
2018-02-21,36.46
2018-02-22,36.61
2018-02-23,37.2
2018-02-26,37.3
2018-02-27,36.84
2018-02-28,36.82
2018-03-01,38.13
2018-03-02,39.18
2018-03-05,41.65
2018-03-06,41.94
2018-03-07,41.59
2018-03-08,41.75
2018-03-09,42.4
2018-03-12,42.59
2018-03-13,42.3
2018-03-14,42.45
2018-03-15,42.36
2018-03-16,42.01
2018-03-19,42.45
2018-03-20,42.14
2018-03-21,41.94
2018-03-22,40.71
2018-03-23,39.9
2018-03-26,40.73
2018-03-27,39.57
2018-03-28,38.75
2018-03-29,39.67
2018-04-02,39.15
2018-04-03,39.58
2018-04-04,39.85
2018-04-05,39.92
2018-04-06,39.37
2018-04-09,39.26
2018-04-10,39.92
2018-04-11,40.09
2018-04-12,40.46
2018-04-13,40.07
2018-04-16,40.91
2018-04-17,41.51
2018-04-18,41.6
2018-04-19,41.41
2018-04-20,40.93
2018-04-23,40.61
2018-04-24,40.25
2018-04-25,40.13
2018-04-26,40.76
2018-04-27,40.93
2018-04-30,40.92
2018-05-01,41
2018-05-02,40.81
2018-05-03,40
2018-05-04,38.06
2018-05-07,38.46
2018-05-08,39.25
2018-05-09,39.48
2018-05-10,39.59
2018-05-11,39.48
2018-05-14,37.99
2018-05-15,38
2018-05-16,38.02
2018-05-17,38.86
2018-05-18,38.69
2018-05-21,38.49
2018-05-22,38.3
2018-05-23,38.39
2018-05-24,38.8
2018-05-25,38.77
2018-05-29,38.67
2018-05-30,39.65
2018-05-31,39.87
2018-06-01,39.7
2018-06-04,40.76
2018-06-05,41.65
2018-06-06,42.63
2018-06-07,41.08
2018-06-08,40.72
2018-06-11,41
2018-06-12,41
2018-06-13,41.9
2018-06-14,42.25
2018-06-15,43.26
2018-06-18,44
2018-06-19,43.46
2018-06-20,43.34
2018-06-21,42.68
2018-06-22,41.08
2018-06-25,39.91
2018-06-26,40.25
2018-06-27,39.55
2018-06-28,39.84
2018-06-29,40.15
2018-07-02,41.01
2018-07-03,41.01
2018-07-05,41.31
2018-07-06,41.84
2018-07-09,42.38
2018-07-10,42.28
2018-07-11,42.11
2018-07-12,43.19
2018-07-13,43.01
2018-07-16,43
2018-07-17,43.33
2018-07-18,43.02
2018-07-19,42.97
2018-07-20,41.36
2018-07-23,42.39
2018-07-24,40.86
2018-07-25,41.03
2018-07-26,41.1
2018-07-27,40.29
2018-07-30,37.98
2018-07-31,38.29
2018-08-01,38.01
2018-08-02,38.66
2018-08-03,38.13
2018-08-06,39.14
2018-08-07,39.71
2018-08-08,40.46
2018-08-09,40.61
2018-08-10,40.63
2018-08-13,40.6
2018-08-14,40.93
2018-08-15,40.51
2018-08-16,40.25
2018-08-17,40.59
2018-08-20,41.03
2018-08-21,40.73
2018-08-22,40.59
2018-08-23,40.4
2018-08-24,40.9
2018-08-27,41.23
2018-08-28,41.28
2018-08-29,41.41
2018-08-30,41.31
2018-08-31,41.47
2018-09-04,40.99
2018-09-05,39.08
2018-09-06,38.93
2018-09-07,38.78
2018-09-10,39.03
2018-09-11,38.92
2018-09-12,39.6
2018-09-13,39.91
2018-09-14,39.86
2018-09-17,37.96
2018-09-18,38.07
2018-09-19,38.9
2018-09-20,39.31
2018-09-21,38.72
2018-09-24,38.43
2018-09-25,38.52
2018-09-26,38.33
2018-09-27,37.88
2018-09-28,37.71
2018-10-01,37.44
2018-10-02,37.36
2018-10-03,37.5
2018-10-04,37.19
2018-10-05,36.77
2018-10-08,36.04
2018-10-09,35.69
2018-10-10,34.5
2018-10-11,34.13
2018-10-12,34.99
2018-10-15,34.72
2018-10-16,35.49
2018-10-17,35.31
2018-10-18,35.45
2018-10-19,35.2
2018-10-22,35.99
2018-10-23,35.83
2018-10-24,34.64
2018-10-25,35.75
2018-10-26,35.07
2018-10-29,34.59
2018-10-30,35.41
2018-10-31,36.4
2018-11-01,36.62
2018-11-02,35.77
2018-11-05,36.22
2018-11-06,36.43
2018-11-07,38.5
2018-11-08,38.16
2018-11-09,37.66
2018-11-12,37.64
2018-11-13,37.75
2018-11-14,37.4
2018-11-15,37.84
2018-11-16,37.73
2018-11-19,35.87
2018-11-20,35.75
2018-11-21,36.02
2018-11-23,36.34
2018-11-26,36.81
2018-11-27,36.76
2018-11-28,37.91
2018-11-29,37.8
2018-11-30,37.63
2018-12-03,38.26
2018-12-04,37.58
2018-12-06,37.7
2018-12-07,36.78
2018-12-10,36.69
2018-12-11,37.34
2018-12-12,38
2018-12-13,37.49
2018-12-14,37.42
2018-12-17,36.68
2018-12-18,36.44
2018-12-19,36.57
2018-12-20,36.59
2018-12-21,35.89
2018-12-24,35.44
2018-12-26,36.76
2018-12-27,37.31
2018-12-28,37.44
2018-12-31,38.36
2019-01-02,37.75
2019-01-03,36.99
2019-01-04,38.41
2019-01-07,39.17
2019-01-08,39.92
2019-01-09,39.99
2019-01-10,40.04
2019-01-11,40.11
2019-01-14,40.09
2019-01-15,41.72
2019-01-16,42.86
2019-01-17,43.32
2019-01-18,43.98
2019-01-22,43.36
2019-01-23,43.59
2019-01-24,44.02
2019-01-25,44.33
2019-01-28,44.15
2019-01-29,43.96
2019-01-30,44.26
2019-01-31,44.38
2019-02-01,45
2019-02-04,45.86
2019-02-05,46.22
2019-02-06,46.74
2019-02-07,46
2019-02-08,45.86
2019-02-11,46.28
2019-02-12,46.35
2019-02-13,46.31
2019-02-14,46.07
2019-02-15,46.45
2019-02-19,46.26
2019-02-20,46.43
2019-02-21,46.51
2019-02-22,46.89
2019-02-25,46.97
2019-02-26,47.26
2019-02-27,48.34
2019-02-28,48.37
2019-03-01,49.28
2019-03-04,48.23
2019-03-05,48.3
2019-03-06,47.77
2019-03-07,47.55
2019-03-08,47.46
2019-03-11,47.9
2019-03-12,48.03
2019-03-13,48.09
2019-03-14,47.94
2019-03-15,47.94
2019-03-18,47.75
2019-03-19,48.32
2019-03-20,45.38
2019-03-21,45.87
2019-03-22,43.89
2019-03-25,43.76
2019-03-26,44.36
2019-03-27,43.79
2019-03-28,43.71
2019-03-29,43.65
2019-04-01,43.63
2019-04-02,43.75
2019-04-03,44
2019-04-04,43.23
2019-04-05,43.8
2019-04-08,43.86
2019-04-09,43.49
2019-04-10,43.98
2019-04-11,43.81
2019-04-12,44.02
2019-04-15,43.99
2019-04-16,44.31
2019-04-17,44.42
2019-04-18,44.99
2019-04-22,45.11
2019-04-23,45.61
2019-04-24,45.47
2019-04-25,45.12
2019-04-26,45.75
2019-04-29,46.02
2019-04-30,45.47
2019-05-01,44.29
2019-05-02,43.72
2019-05-03,39.33
2019-05-06,39.79
2019-05-07,37.89
2019-05-08,38.57
2019-05-09,37.71
2019-05-10,38.1
2019-05-13,36.33
2019-05-14,36.86
2019-05-15,36.79
2019-05-16,36.94
2019-05-17,36.05
2019-05-20,35.41
2019-05-21,35.74
2019-05-22,35.35
2019-05-23,34.68
2019-05-24,34.41
2019-05-28,34.41
2019-05-29,34.27
2019-05-30,35.05
2019-05-31,34.34
2019-06-03,34.62
2019-06-04,35.32
2019-06-05,35.91
2019-06-06,36.21
2019-06-07,35.99
2019-06-10,35.97
2019-06-11,35.56
2019-06-12,36.05
2019-06-13,36.22
2019-06-14,35.54
2019-06-17,34.39
2019-06-18,34.69
2019-06-19,34.955
2019-06-20,34.685
2019-06-21,34.53
2019-06-24,34.695
2019-06-25,34.56
2019-06-26,34.98
2019-06-27,35.51
2019-06-28,35.81
2019-07-01,36.72
2019-07-02,36.87
2019-07-03,37.35
2019-07-04,37.35
2019-07-05,37.17
2019-07-08,36.45
2019-07-09,36.64
2019-07-10,36.635
2019-07-11,36.135
2019-07-12,36.63
2019-07-15,36.235
2019-07-16,36.035
2019-07-17,35.78
2019-07-18,35.515
2019-07-19,35.16
2019-07-22,34.5
2019-07-23,35.26
2019-07-24,36.675
2019-07-25,36.56
2019-07-26,36.54
2019-07-29,36.67
2019-07-30,37.26
2019-07-31,36.705
2019-08-01,35.64
2019-08-02,33.02
2019-08-05,33.145
2019-08-06,33.495
2019-08-07,34.045
2019-08-08,35.395
2019-08-09,35.74
2019-08-12,33.655
2019-08-13,33.83
2019-08-14,32.74
2019-08-15,32.805
2019-08-16,33.3
2019-08-19,33.305
2019-08-20,31.82
2019-08-21,31.825
2019-08-22,32.255
2019-08-23,31.22
2019-08-26,31
2019-08-27,30.24
2019-08-28,29.79
2019-08-29,30.5
2019-08-30,30.88
2019-09-02,30.865
2019-09-03,29.94
2019-09-04,30.34
2019-09-05,31.51
2019-09-06,32.31
2019-09-09,33.285
2019-09-10,34.31
2019-09-11,34.015
2019-09-12,33.325
2019-09-13,32.875
2019-09-16,33.125
2019-09-17,32.285
2019-09-18,32.1
2019-09-19,31.855
2019-09-20,31.665
2019-09-23,31.795
2019-09-24,30.875
2019-09-25,31.605
2019-09-26,31.68
2019-09-27,30.915
2019-09-30,30.995
2019-10-01,30.045
2019-10-02,29.69
2019-10-03,29.615
2019-10-04,29.805
2019-10-07,29.665
2019-10-08,28.655
2019-10-09,28.795
2019-10-10,28.88
2019-10-11,29.64
2019-10-14,29.6
2019-10-15,30.2
2019-10-16,29.65
2019-10-17,29.05
2019-10-18,28.56
2019-10-21,28.86
2019-10-22,28.25
2019-10-23,28.63
2019-10-24,28.82
2019-10-25,29.34
2019-10-28,30.05
2019-10-29,30.56
2019-10-30,30.425
2019-10-31,29.9
2019-11-01,30.255
2019-11-04,30.725
2019-11-05,30.465
2019-11-06,30.275
2019-11-07,31.215
2019-11-08,25.58
2019-11-11,26.425
2019-11-12,25.915
2019-11-13,25.235
2019-11-14,26.525
2019-11-15,26.63
2019-11-18,26.315
2019-11-19,26.895
2019-11-20,27.195
2019-11-21,25.935
2019-11-22,26.715
2019-11-25,26.83
