date,close
2014-06-13,43.6818
2014-06-16,43.5945
2014-06-17,44.2714
2014-06-18,45.4361
2014-06-19,45.3488
2014-06-20,45.3415
2014-06-23,45.6254
2014-06-24,45.2032
2014-06-25,45.2396
2014-06-26,45.0139
2014-06-27,45.1377
2014-06-30,45.5598
2014-07-01,46.3824
2014-07-02,46.1203
2014-07-03,46.7609
2014-07-07,46.0839
2014-07-08,45.8219
2014-07-09,44.5265
2014-07-10,43.458
2014-07-11,43.0042
2014-07-14,42.6163
2014-07-15,42.9749
2014-07-16,43.0115
2014-07-17,42.1992
2014-07-18,42.609
2014-07-21,42.0967
2014-07-22,42.609
2014-07-23,42.5066
2014-07-24,42.8213
2014-07-25,42.3675
2014-07-28,42.3455
2014-07-29,40.5525
2014-07-30,40.15
2014-07-31,38.635
2014-08-01,38.6716
2014-08-04,38.9717
2014-08-05,37.7934
2014-08-06,38.2837
2014-08-07,37.8665
2014-08-08,38.3862
2014-08-11,38.5179
2014-08-12,38.1812
2014-08-13,38.474
2014-08-14,38.7814
2014-08-15,38.7448
2014-08-18,39.3376
2014-08-19,40.2524
2014-08-20,40.1426
2014-08-21,40.5671
2014-08-22,40.45
2014-08-25,40.8013
2014-08-26,40.816
2014-08-27,40.0768
2014-08-28,40.0255
2014-08-29,39.8865
2014-09-02,40.8306
2014-09-03,41.3502
2014-09-04,41.7527
2014-09-05,41.804
2014-09-08,41.4234
2014-09-09,40.4793
2014-09-10,39.7621
2014-09-11,39.6157
2014-09-12,39.2937
2014-09-15,39.2205
2014-09-16,39.4547
2014-09-17,39.5718
2014-09-18,39.623
2014-09-19,39.1912
2014-09-22,38.4813
2014-09-23,38.0642
2014-09-24,39.1473
2014-09-25,38.3935
2014-09-26,38.6057
2014-09-29,38.452
2014-09-30,37.83
2014-10-01,36.82
2014-10-02,37.0835
2014-10-03,36.7029
2014-10-06,36.5346
2014-10-07,35.6051
2014-10-08,36.4674
2014-10-09,34.7133
2014-10-10,33.5562
2014-10-13,32.8118
2014-10-14,32.9592
2014-10-15,32.6718
2014-10-16,33.5267
2014-10-17,33.9026
2014-10-20,34.2859
2014-10-21,35.3324
2014-10-22,34.249
2014-10-23,34.846
2014-10-24,34.8976
2014-10-27,34.8091
2014-10-28,34.2121
2014-10-29,35.2366
2014-10-30,35.2145
2014-10-31,35.185
2014-11-03,34.6544
2014-11-04,34.6765
2014-11-05,35.6125
2014-11-06,35.4209
2014-11-07,35.7599
2014-11-10,35.6346
2014-11-11,35.4356
2014-11-12,35.2145
2014-11-13,35.524
2014-11-14,35.4872
2014-11-17,35.3693
2014-11-18,35.7894
2014-11-19,36.1505
2014-11-20,36.0105
2014-11-21,36.4011
2014-11-24,36.7327
2014-11-25,36.5632
2014-11-26,36.3053
2014-11-28,35.4356
2014-12-01,34.9639
2014-12-02,34.6838
2014-12-03,35.3693
2014-12-04,35.1408
2014-12-05,35.3471
2014-12-08,35.0597
2014-12-09,34.7502
2014-12-10,33.8142
2014-12-11,33.6962
2014-12-12,32.4507
2014-12-15,32.5391
2014-12-16,32.318
2014-12-17,33.3277
2014-12-18,34.986
2014-12-19,36.0842
2014-12-22,36.0694
2014-12-23,36.5116
2014-12-24,36.3863
2014-12-26,36.6001
2014-12-29,36.6664
2014-12-30,36.4748
2014-12-31,36.718
2015-01-02,36.4379
2015-01-05,35.2956
2015-01-06,34.5659
2015-01-07,34.7723
2015-01-08,34.4971
2015-01-09,34.4227
2015-01-12,33.5301
2015-01-13,33.1285
2015-01-14,32.2359
2015-01-15,31.2244
2015-01-16,31.4847
2015-01-20,30.9492
2015-01-21,31.7079
2015-01-22,32.7343
2015-01-23,32.3401
2015-01-26,33.6715
2015-01-27,33.7682
2015-01-28,33.5599
2015-01-29,33.374
2015-01-30,33.2549
2015-02-02,33.8351
2015-02-03,33.664
2015-02-04,33.426
2015-02-05,34.6384
2015-02-06,35.345
2015-02-09,35.8731
2015-02-10,36.178
2015-02-11,37.0632
2015-02-12,37.0334
2015-02-13,37.145
2015-02-17,37.2417
2015-02-18,37.2045
2015-02-19,38.2235
2015-02-20,37.9706
2015-02-23,37.7623
2015-02-24,38.0822
2015-02-25,37.6656
2015-02-26,37.2417
2015-02-27,36.788
2015-03-02,36.8549
2015-03-03,36.8921
2015-03-04,36.7805
2015-03-05,37.2194
2015-03-06,36.8921
2015-03-09,36.7285
2015-03-10,35.8136
2015-03-11,36.0367
2015-03-12,36.6764
2015-03-13,36.1185
2015-03-16,36.6541
2015-03-17,36.4012
2015-03-18,36.3789
2015-03-19,36.6466
2015-03-20,37.6061
2015-03-23,37.4202
2015-03-24,37.0632
2015-03-25,37.1078
2015-03-26,37.2565
2015-03-27,36.8921
2015-03-30,37.0855
2015-03-31,36.8475
2015-04-01,36.9144
2015-04-02,37.3235
2015-04-06,36.9218
2015-04-07,36.8028
2015-04-08,37.3806
2015-04-09,36.8103
2015-04-10,35.97
2015-04-13,36.0075
2015-04-14,36.2101
2015-04-15,37.6657
2015-04-16,36.9904
2015-04-17,36.3901
2015-04-20,36.9679
2015-04-21,37.223
2015-04-22,37.358
2015-04-23,37.6957
2015-04-24,37.6732
2015-04-27,37.6282
2015-04-28,38.2134
2015-04-29,37.3956
2015-04-30,37.0054
2015-05-01,36.7653
2015-05-04,36.5702
2015-05-05,35.8424
2015-05-06,35.2197
2015-05-07,35.2797
2015-05-08,35.4973
2015-05-11,35.2047
2015-05-12,35.0621
2015-05-13,35.5648
2015-05-14,35.8874
2015-05-15,36.1726
2015-05-18,36.5252
2015-05-19,36.3676
2015-05-20,36.6603
2015-05-21,37.0204
2015-05-22,36.9454
2015-05-26,36.1651
2015-05-27,36.3451
2015-05-28,36.0825
2015-05-29,35.8499
2015-06-01,35.925
2015-06-02,36.0525
2015-06-03,36.5027
2015-06-04,35.6173
2015-06-05,35.9775
2015-06-08,36.0075
2015-06-09,36.6152
2015-06-10,36.8929
2015-06-11,37.1405
2015-06-12,36.6528
2015-06-15,36.6678
2015-06-16,37.2905
2015-06-17,37.0129
2015-06-18,36.9154
2015-06-19,36.9979
2015-06-22,37.4031
2015-06-23,36.9454
2015-06-24,36.8403
2015-06-25,36.3976
2015-06-26,36.6753
2015-06-29,35.3547
2015-06-30,35.4973
2015-07-01,35.1146
2015-07-02,34.9045
2015-07-06,34.6869
2015-07-07,34.9495
2015-07-08,33.8466
2015-07-09,33.589
2015-07-10,34.1117
2015-07-13,34.6193
2015-07-14,34.5132
2015-07-15,34.3011
2015-07-16,34.2632
2015-07-17,34.1496
2015-07-20,34.2178
2015-07-21,34.2026
2015-07-22,33.9678
2015-07-23,33.5663
2015-07-24,32.9148
2015-07-27,32.8391
2015-07-28,33.2103
2015-07-29,33.0057
2015-07-30,33.4905
2015-07-31,34.0208
2015-08-03,33.9602
2015-08-04,33.839
2015-08-05,33.8996
2015-08-06,33.6345
2015-08-07,33.4754
2015-08-10,34.2632
2015-08-11,33.4602
2015-08-12,33.1345
2015-08-13,33.1875
2015-08-14,33.4072
2015-08-17,33.5511
2015-08-18,33.4375
2015-08-19,32.733
2015-08-20,31.6043
2015-08-21,30.2937
2015-08-24,28.006
2015-08-25,28.4151
2015-08-26,29.1726
2015-08-27,29.9074
2015-08-28,29.665
2015-08-31,29.5968
2015-09-01,27.8545
2015-09-02,28.1272
2015-09-03,28.2257
2015-09-04,27.7712
2015-09-08,28.6651
2015-09-09,28.756
2015-09-10,28.7257
2015-09-11,28.3317
2015-09-14,28.0363
2015-09-15,28.6878
2015-09-16,29.0741
2015-09-17,29.0287
2015-09-18,27.6651
2015-09-21,27.5894
2015-09-22,26.9152
2015-09-23,26.8242
2015-09-24,26.4758
2015-09-25,26.2561
2015-09-28,25.5819
2015-09-29,26.0213
2015-09-30,26.3394
2015-10-01,26.0364
2015-10-02,26.5515
2015-10-05,27.0136
2015-10-06,26.5061
2015-10-07,26.8359
2015-10-08,26.8435
2015-10-09,26.5214
2015-10-12,26.4524
2015-10-13,25.5704
2015-10-14,25.417
2015-10-15,25.9002
2015-10-16,26.1456
2015-10-19,25.3326
2015-10-20,26.0612
2015-10-21,25.7238
2015-10-22,26.5521
2015-10-23,26.7515
2015-10-26,26.7899
2015-10-27,27.3191
2015-10-28,28.132
2015-10-29,27.8866
2015-10-30,28.3314
2015-11-02,28.8836
2015-11-03,29.3438
2015-11-04,29.2364
2015-11-05,29.3208
2015-11-06,29.2978
2015-11-09,28.7072
2015-11-10,28.6306
2015-11-11,28.132
2015-11-12,27.296
2015-11-13,27.0276
2015-11-16,27.7946
2015-11-17,27.5031
2015-11-18,28.3468
2015-11-19,28.7456
2015-11-20,28.945
2015-11-23,29.0064
2015-11-24,28.7379
2015-11-25,29.06
2015-11-27,28.8836
2015-11-30,28.6842
2015-12-01,28.6689
2015-12-02,27.9633
2015-12-03,27.2577
2015-12-04,27.4418
2015-12-07,26.7515
2015-12-08,25.8772
2015-12-09,25.302
2015-12-10,25.3173
2015-12-11,24.0288
2015-12-14,22.2188
2015-12-15,22.2571
2015-12-16,22.4949
2015-12-17,22.4949
2015-12-18,21.7049
2015-12-21,22.1267
2015-12-22,22.1191
2015-12-23,22.886
2015-12-24,22.6023
2015-12-28,22.5332
2015-12-29,22.6406
2015-12-30,21.912
2015-12-31,21.981
2016-01-04,21.6896
2016-01-05,21.5208
2016-01-06,20.5468
2016-01-07,19.4231
2016-01-08,19.0876
2016-01-11,18.8769
2016-01-12,19.3685
2016-01-13,18.2057
2016-01-14,19.3373
2016-01-15,19.0095
2016-01-19,19.4699
2016-01-20,19.3373
2016-01-21,19.4387
2016-01-22,20.1176
2016-01-25,19.8367
2016-01-26,20.2503
2016-01-27,20.5312
2016-01-28,20.3361
2016-01-29,21.413
2016-02-01,20.6795
2016-02-02,17.7063
2016-02-03,17.1367
2016-02-04,17.8078
2016-02-05,17.2927
2016-02-08,16.208
2016-02-09,16.4109
2016-02-10,16.9416
2016-02-11,16.6684
2016-02-12,17.441
2016-02-16,18.5023
2016-02-17,18.4789
2016-02-18,18.0419
2016-02-19,17.3005
2016-02-22,17.7765
2016-02-23,17.1054
2016-02-24,17.5346
2016-02-25,18.0341
2016-02-26,18.2136
2016-02-29,18.276
2016-03-01,19.1812
2016-03-02,19.7899
2016-03-03,19.9303
2016-03-04,20.4844
2016-03-07,20.8434
2016-03-08,19.7118
2016-03-09,19.6104
2016-03-10,19.1032
2016-03-11,20.1722
2016-03-14,20.4454
2016-03-15,19.0954
2016-03-16,19.8211
2016-03-17,20.1254
2016-03-18,19.3685
2016-03-21,18.7832
2016-03-22,18.4789
2016-03-23,18.4711
2016-03-24,17.917
2016-03-28,17.5112
2016-03-29,18.0419
2016-03-30,18.4477
2016-03-31,18.3696
2016-04-01,18.4945
2016-04-04,17.8468
2016-04-05,17.5502
2016-04-06,17.5659
2016-04-07,16.7231
2016-04-08,16.684
2016-04-11,17.0352
2016-04-12,17.4098
2016-04-13,18.0497
2016-04-14,17.8984
2016-04-15,17.8427
2016-04-18,17.7312
2016-04-19,18.0656
2016-04-20,18.5274
2016-04-21,18.4478
2016-04-22,18.615
2016-04-25,18.5354
2016-04-26,17.142
2016-04-27,17.1102
2016-04-28,16.4971
2016-04-29,16.1946
2016-05-02,16.1229
2016-05-03,15.6372
2016-05-04,15.1754
2016-05-05,15.0242
2016-05-06,15.4063
2016-05-09,15.4222
2016-05-10,15.9398
2016-05-11,15.5974
2016-05-12,15.7328
2016-05-13,15.0401
2016-05-16,15.2152
2016-05-17,15.4621
2016-05-18,15.6054
2016-05-19,15.3665
2016-05-20,15.7407
2016-05-23,15.9637
2016-05-24,16.4255
2016-05-25,16.8952
2016-05-26,16.9509
2016-05-27,17.1102
2016-05-31,17.0146
2016-06-01,16.7917
2016-06-02,16.8235
2016-06-03,17.1261
2016-06-06,17.4048
2016-06-07,17.1739
2016-06-08,16.728
2016-06-09,16.0592
2016-06-10,15.3824
2016-06-13,15.0878
2016-06-14,15.048
2016-06-15,15.048
2016-06-16,14.6499
2016-06-17,14.7136
2016-06-20,14.9525
2016-06-21,14.4748
2016-06-22,14.5544
2016-06-23,15.1436
2016-06-24,13.8458
2016-06-27,13.0177
2016-06-28,12.9063
2016-06-29,13.3999
2016-06-30,13.7104
2016-07-01,13.5353
2016-07-05,13.1451
2016-07-06,13.2884
2016-07-07,13.0756
2016-07-08,13.5914
2016-07-11,13.9598
2016-07-12,14.7376
2016-07-13,14.7786
2016-07-14,14.8359
2016-07-15,14.9997
2016-07-18,15.016
2016-07-19,14.7295
2016-07-20,15.1716
2016-07-21,15.3108
2016-07-22,15.2535
2016-07-25,15.2698
2016-07-26,15.0324
2016-07-27,15.1716
2016-07-28,14.7376
2016-07-29,14.9505
2016-08-01,15.0406
2016-08-02,14.7376
2016-08-03,15.2617
2016-08-04,15.2125
2016-08-05,15.9494
2016-08-08,15.7693
2016-08-09,15.6137
2016-08-10,15.6055
2016-08-11,15.7283
2016-08-12,15.5155
2016-08-15,15.7447
2016-08-16,15.3272
2016-08-17,15.2207
2016-08-18,15.4172
2016-08-19,15.3681
2016-08-22,15.1307
2016-08-23,15.409
2016-08-24,15.2453
2016-08-25,15.2371
2016-08-26,15.188
2016-08-29,15.1552
2016-08-30,15.2617
2016-08-31,15.2289
2016-09-01,14.7704
2016-09-02,15.1225
2016-09-06,15.0324
2016-09-07,15.2944
2016-09-08,15.3927
2016-09-09,14.7786
2016-09-12,15.2862
2016-09-13,14.754
2016-09-14,14.5903
2016-09-15,14.8523
2016-09-16,14.664
2016-09-19,14.7622
2016-09-20,14.2873
2016-09-21,14.4756
2016-09-22,14.6885
2016-09-23,14.5248
2016-09-26,14.1973
2016-09-27,14.2628
2016-09-28,14.6312
2016-09-29,14.4101
2016-09-30,14.8686
2016-10-03,15.0324
2016-10-04,14.885
2016-10-05,15.3353
2016-10-06,14.9073
2016-10-07,14.8821
2016-10-10,14.9241
2016-10-11,14.7478
2016-10-12,14.9492
2016-10-13,14.8485
2016-10-14,14.6471
2016-10-17,14.1686
2016-10-18,14.3113
2016-10-19,14.4792
2016-10-20,14.5128
2016-10-21,14.6219
2016-10-24,15.05
2016-10-25,14.2022
2016-10-26,14.1267
2016-10-27,13.4635
2016-10-28,13.4468
2016-10-31,13.1949
2016-11-01,12.9683
2016-11-02,13.0858
2016-11-03,12.9263
2016-11-04,13.0523
2016-11-07,13.4132
2016-11-08,13.1782
2016-11-09,15.1003
2016-11-10,15.562
2016-11-11,15.6879
2016-11-14,16.4181
2016-11-15,16.4181
2016-11-16,16.0656
2016-11-17,15.8474
2016-11-18,16.0572
2016-11-21,16.5608
2016-11-22,16.6196
2016-11-23,16.7287
2016-11-25,16.7791
2016-11-28,16.5021
2016-11-29,16.2167
2016-11-30,16.393
2016-12-01,16.3846
2016-12-02,15.8977
2016-12-05,16.2083
2016-12-06,16.8378
2016-12-07,17.8367
2016-12-08,18.4494
2016-12-09,18.0801
2016-12-12,17.3079
2016-12-13,17.2323
2016-12-14,16.9805
2016-12-15,17.0309
2016-12-16,17.0393
2016-12-19,17.1904
2016-12-20,17.4841
2016-12-21,17.1148
2016-12-22,16.7287
2016-12-23,16.5524
2016-12-27,16.7287
2016-12-28,16.3762
2016-12-29,16.2838
2016-12-30,16.3762
2017-01-03,16.7791
2017-01-04,17.3247
2017-01-05,17.1232
2017-01-06,17.0645
2017-01-09,16.6436
2017-01-10,16.5406
2017-01-11,16.5921
2017-01-12,16.4289
2017-01-13,16.2142
2017-01-17,15.845
2017-01-18,16.1198
2017-01-19,15.7763
2017-01-20,16.0511
2017-01-23,15.8621
2017-01-24,16.0768
2017-01-25,16.283
2017-01-26,15.3984
2017-01-27,15.1923
2017-01-30,15.4327
2017-01-31,15.5014
2017-02-01,15.1579
2017-02-02,15.0978
2017-02-03,15.3726
2017-02-06,15.2438
2017-02-07,15.1665
2017-02-08,15.2953
2017-02-09,15.6732
2017-02-10,15.8965
2017-02-13,15.7848
2017-02-14,15.656
2017-02-15,15.948
2017-02-16,15.9137
2017-02-17,15.9051
2017-02-21,16.4375
2017-02-22,16.4289
2017-02-23,16.3602
2017-02-24,16.3946
2017-02-27,16.5578
2017-02-28,16.5234
2017-03-01,16.6608
2017-03-02,16.5578
2017-03-03,16.0167
2017-03-06,15.6646
2017-03-07,15.5616
2017-03-08,15.5444
2017-03-09,15.3898
2017-03-10,15.364
2017-03-13,15.5616
2017-03-14,15.5014
2017-03-15,15.8621
2017-03-16,15.7848
2017-03-17,14.78
2017-03-20,14.5396
2017-03-21,14.1961
2017-03-22,14.2819
2017-03-23,14.3678
2017-03-24,14.1703
2017-03-27,14.2819
2017-03-28,14.5739
2017-03-29,14.4365
2017-03-30,14.5997
2017-03-31,14.5997
2017-04-03,14.5052
2017-04-04,14.4279
2017-04-05,14.3163
2017-04-06,14.6254
2017-04-07,14.696
2017-04-10,14.6342
2017-04-11,14.7314
2017-04-12,14.7844
2017-04-13,14.6607
2017-04-17,15.0846
2017-04-18,15.1995
2017-04-19,15.226
2017-04-20,15.4997
2017-04-21,15.4732
2017-04-24,15.9502
2017-04-25,15.8265
2017-04-26,15.694
2017-04-27,15.7647
2017-04-28,15.8883
2017-05-01,15.7029
2017-05-02,15.2171
2017-05-03,14.9963
2017-05-04,14.7932
2017-05-05,14.8815
2017-05-08,14.9168
2017-05-09,15.4909
2017-05-10,15.6675
2017-05-11,15.0846
2017-05-12,15.0758
2017-05-15,15.0317
2017-05-16,15.1641
2017-05-17,14.6077
2017-05-18,14.6607
2017-05-19,15.014
2017-05-22,14.9168
2017-05-23,14.8374
2017-05-24,14.7402
2017-05-25,14.7049
2017-05-26,14.7755
2017-05-30,14.5371
2017-05-31,14.7844
2017-06-01,15.3054
2017-06-02,15.0758
2017-06-05,15.3054
2017-06-06,15.12
2017-06-07,15.0317
2017-06-08,15.5704
2017-06-09,16.0208
2017-06-12,16.4536
2017-06-13,16.4271
2017-06-14,16.8068
2017-06-15,16.5419
2017-06-16,16.5154
2017-06-19,16.8157
2017-06-20,16.7097
2017-06-21,16.6214
2017-06-22,17.2749
2017-06-23,16.9393
2017-06-26,16.8952
2017-06-27,16.957
2017-06-28,17.2043
2017-06-29,16.9393
2017-06-30,16.6744
2017-07-03,16.9305
2017-07-05,17.1601
2017-07-06,17.0983
2017-07-07,17.632
2017-07-10,17.8582
2017-07-11,17.9125
2017-07-12,18.1567
2017-07-13,18.2382
2017-07-14,18.3648
2017-07-17,18.6362
2017-07-18,18.6453
2017-07-19,18.8081
2017-07-20,18.8443
2017-07-21,18.5277
2017-07-24,18.6905
2017-07-25,19.0433
2017-07-26,19.0071
2017-07-27,18.3105
2017-07-28,18.3286
2017-07-31,18.6995
2017-08-01,17.5687
2017-08-02,17.5687
2017-08-03,17.813
2017-08-04,17.7225
2017-08-07,18.0301
2017-08-08,17.7677
2017-08-09,17.3787
2017-08-10,16.9716
2017-08-11,16.9445
2017-08-14,16.9535
2017-08-15,17.0259
2017-08-16,16.7455
2017-08-17,16.3474
2017-08-18,16.3655
2017-08-21,16.1755
2017-08-22,16.7002
2017-08-23,16.5736
2017-08-24,16.5012
2017-08-25,16.6459
2017-08-28,16.5917
2017-08-29,16.5736
2017-08-30,16.6459
2017-08-31,16.8359
2017-09-01,17.0892
2017-09-05,16.4198
2017-09-06,16.4017
2017-09-07,16.3836
2017-09-08,16.6098
2017-09-11,16.8812
2017-09-12,16.7907
2017-09-13,16.7636
2017-09-14,16.5102
2017-09-15,16.3836
2017-09-18,16.5374
2017-09-19,16.5736
2017-09-20,16.6459
2017-09-21,16.4831
2017-09-22,16.9354
2017-09-25,17.1978
2017-09-26,17.1978
2017-09-27,17.7858
2017-09-28,17.9939
2017-09-29,18.1567
2017-10-02,18.3558
2017-10-03,18.3105
2017-10-04,18.4281
2017-10-05,18.1386
2017-10-06,18.0663
2017-10-09,18.401
2017-10-10,18.4473
2017-10-11,18.725
2017-10-12,18.7898
2017-10-13,18.9008
2017-10-16,18.8638
2017-10-17,18.4843
2017-10-18,18.8731
2017-10-19,18.8268
2017-10-20,19.0582
2017-10-23,18.7342
2017-10-24,18.4658
2017-10-25,18.5213
2017-10-26,18.4103
2017-10-27,18.4658
2017-10-30,17.5865
2017-10-31,17.2995
2017-11-01,17.4662
2017-11-02,17.8642
2017-11-03,17.9012
2017-11-06,18.0308
2017-11-07,17.8734
2017-11-08,17.9845
2017-11-09,17.8271
2017-11-10,17.9475
2017-11-13,17.679
2017-11-14,17.5124
2017-11-15,17.2995
2017-11-16,17.5957
2017-11-17,17.4014
2017-11-20,17.4199
2017-11-21,17.7716
2017-11-22,17.9012
2017-11-24,17.7809
2017-11-27,17.8086
2017-11-28,18.1048
2017-11-29,18.3825
2017-11-30,18.7898
2017-12-01,19.2988
2017-12-04,19.6598
2017-12-05,19.5302
2017-12-06,19.6876
2017-12-07,19.8635
2017-12-08,20.0116
2017-12-11,19.4099
2017-12-12,19.4932
2017-12-13,19.5858
2017-12-14,19.6691
2017-12-15,20.1226
2017-12-18,20.7706
2017-12-19,20.9557
2017-12-20,20.8816
2017-12-21,20.6873
2017-12-22,20.8168
2017-12-26,21.0112
2017-12-27,20.7613
2017-12-28,20.8168
2017-12-29,20.678
2018-01-02,20.1782
2018-01-03,20.1226
2018-01-04,20.1967
2018-01-05,20.2337
2018-01-08,20.354
2018-01-09,20.3355
2018-01-10,20.7568
2018-01-11,21.2062
2018-01-12,21.6088
2018-01-16,21.3935
2018-01-17,21.9178
2018-01-18,21.2811
2018-01-19,21.5058
2018-01-22,21.459
2018-01-23,21.2999
2018-01-24,21.0939
2018-01-25,20.8505
2018-01-26,21.5152
2018-01-29,21.7025
2018-01-30,21.1594
2018-01-31,21.5339
2018-02-01,21.8991
2018-02-02,20.3823
2018-02-05,19.6333
2018-02-06,20.0453
2018-02-07,20.0734
2018-02-08,19.0997
2018-02-09,18.9873
2018-02-12,19.2026
2018-02-13,19.0997
2018-02-14,19.4929
2018-02-15,19.5116
2018-02-16,19.8487
2018-02-20,19.5397
2018-02-21,19.4554
2018-02-22,19.2776
2018-02-23,19.3431
2018-02-26,19.6989
2018-02-27,19.0248
2018-02-28,18.7252
2018-03-01,18.5847
2018-03-02,18.772
2018-03-05,18.7813
2018-03-06,18.8843
2018-03-07,18.772
2018-03-08,18.8001
2018-03-09,19.2869
2018-03-12,18.7907
2018-03-13,18.5566
2018-03-14,17.6672
2018-03-15,18.3132
2018-03-16,18.7907
2018-03-19,18.6034
2018-03-20,18.5473
2018-03-21,19.0997
2018-03-22,18.4911
2018-03-23,18.0979
2018-03-26,18.669
2018-03-27,18.4911
2018-03-28,18.4817
2018-03-29,18.9218
2018-04-02,18.2196
2018-04-03,18.5941
2018-04-04,19.0435
2018-04-05,18.5566
2018-04-06,18.0698
2018-04-09,18.0034
2018-04-10,18.4587
2018-04-11,18.3069
2018-04-12,19.5685
2018-04-13,18.9045
2018-04-16,19.0657
2018-04-17,19.6633
2018-04-18,19.6538
2018-04-19,19.521
2018-04-20,19.2555
2018-04-23,19.3029
2018-04-24,19.2744
2018-04-25,19.2175
2018-04-26,19.1985
2018-04-27,19.1796
2018-04-30,19.1985
2018-05-01,17.5576
2018-05-02,17.0359
2018-05-03,16.9505
2018-05-04,17.3678
2018-05-07,17.6524
2018-05-08,17.6998
2018-05-09,17.918
2018-05-10,17.8706
2018-05-11,17.8895
2018-05-14,17.8326
2018-05-15,17.9749
2018-05-16,18.231
2018-05-17,18.4966
2018-05-18,18.6579
2018-05-21,18.8286
2018-05-22,18.7717
2018-05-23,18.6104
2018-05-24,18.5915
2018-05-25,18.544
2018-05-29,18.1267
2018-05-30,18.601
2018-05-31,18.4018
2018-06-01,18.6579
2018-06-04,18.8096
2018-06-05,18.8096
2018-06-06,19.0373
2018-06-07,19.1511
2018-06-08,19.1511
2018-06-11,19.1891
2018-06-12,18.895
2018-06-13,18.3164
2018-06-14,18.3828
2018-06-15,18.4018
2018-06-18,18.4302
2018-06-19,18.4682
2018-06-20,18.2879
2018-06-21,17.7852
2018-06-22,17.8421
2018-06-25,17.6145
2018-06-26,17.3773
2018-06-27,17.0453
2018-06-28,16.9884
2018-06-29,17.0453
2018-07-02,17.6145
2018-07-03,17.7757
2018-07-05,18.0982
2018-07-06,18.0508
2018-07-09,18.5346
2018-07-10,18.5538
2018-07-11,18.3232
2018-07-12,17.9292
2018-07-13,17.6314
2018-07-16,18.0734
2018-07-17,18.1118
2018-07-18,18.1983
2018-07-19,18.2463
2018-07-20,18.304
2018-07-23,18.5922
2018-07-24,18.6787
2018-07-25,18.2655
2018-07-26,18.4961
2018-07-27,18.1598
2018-07-30,18.5922
2018-07-31,19.8989
2018-08-01,19.3897
2018-08-02,19.332
2018-08-03,19.4858
2018-08-06,20.0142
2018-08-07,20.2641
2018-08-08,20.0046
2018-08-09,19.7548
2018-08-10,19.4473
2018-08-13,19.4185
2018-08-14,19.6683
2018-08-15,19.3128
2018-08-16,19.774
2018-08-17,19.8413
2018-08-20,19.9086
2018-08-21,20.2256
2018-08-22,20.2448
2018-08-23,19.6876
2018-08-24,19.7644
2018-08-27,19.7836
2018-08-28,19.6203
2018-08-29,19.5915
2018-08-30,19.3417
2018-08-31,19.236
2018-09-04,19.0918
2018-09-05,19.505
2018-09-06,19.3801
2018-09-07,19.2744
2018-09-10,19.6491
2018-09-11,19.7068
2018-09-12,19.6107
2018-09-13,19.4666
2018-09-14,19.9086
2018-09-17,19.774
2018-09-18,19.8221
2018-09-19,20.4466
2018-09-20,20.437
2018-09-21,20.3505
2018-09-24,20.5139
2018-09-25,20.6292
2018-09-26,20.5907
2018-09-27,20.5043
2018-09-28,20.3505
2018-10-01,19.7548
2018-10-02,19.8029
2018-10-03,19.9374
2018-10-04,20.1584
2018-10-05,20.1968
2018-10-08,20.1103
2018-10-09,20.1392
2018-10-10,19.7307
2018-10-11,19.2153
2018-10-12,19.157
2018-10-15,19.6432
2018-10-16,20.0322
2018-10-17,20.4989
2018-10-18,19.5265
2018-10-19,19.614
2018-10-22,19.9155
2018-10-23,19.6529
2018-10-24,18.875
2018-10-25,19.2542
2018-10-26,19.5265
2018-10-29,19.8669
2018-10-30,19.2251
2018-10-31,18.5443
2018-11-01,18.661
2018-11-02,18.6416
2018-11-05,18.9041
2018-11-06,19.0208
2018-11-07,19.6724
2018-11-08,19.7502
2018-11-09,19.3028
2018-11-12,19.0403
2018-11-13,19.2056
2018-11-14,18.5054
2018-11-15,18.7097
2018-11-16,19.0986
2018-11-19,19.1181
2018-11-20,18.9917
2018-11-21,19.1278
2018-11-23,19.1473
2018-11-26,19.4973
2018-11-27,19.2251
2018-11-28,19.6432
2018-11-29,19.5265
2018-11-30,19.7988
2018-12-03,20.0419
2018-12-04,19.0208
2018-12-06,18.5735
2018-12-07,18.4082
2018-12-10,17.9512
2018-12-11,17.8442
2018-12-12,18.2623
2018-12-13,18.0873
2018-12-14,17.6886
2018-12-17,17.5233
2018-12-18,17.5622
2018-12-19,16.8037
2018-12-20,16.8815
2018-12-21,16.7453
2018-12-24,16.0744
2018-12-26,17.0176
2018-12-27,17.3094
2018-12-28,17.3288
2018-12-31,17.5816
2019-01-02,17.5622
2019-01-03,17.2996
2019-01-04,17.4649
2019-01-07,17.2996
2019-01-08,17.2607
2019-01-09,17.3385
2019-01-10,17.5259
2019-01-11,16.7369
2019-01-14,16.5199
2019-01-15,16.944
2019-01-16,17.3484
2019-01-17,17.2695
2019-01-18,17.6048
2019-01-22,17.2793
2019-01-23,17.1413
2019-01-24,17.1906
2019-01-25,17.3484
2019-01-28,17.2991
2019-01-29,17.0131
2019-01-30,16.5988
2019-01-31,16.8848
2019-02-01,17.0525
2019-02-04,17.0032
2019-02-05,16.944
2019-02-06,17.2004
2019-02-07,17.161
2019-02-08,16.658
2019-02-11,17.5259
2019-02-12,17.1807
2019-02-13,17.2991
2019-02-14,17.1314
2019-02-15,17.5062
2019-02-19,17.5752
2019-02-20,17.8514
2019-02-21,17.664
2019-02-22,17.9007
2019-02-25,18.0092
2019-02-26,17.9303
2019-02-27,18.1275
2019-02-28,18.2557
2019-03-01,18.1966
2019-03-04,18.1177
2019-03-05,18.0092
2019-03-06,17.7034
2019-03-07,17.3089
2019-03-08,17.3484
2019-03-11,17.8514
2019-03-12,17.4963
2019-03-13,17.5062
2019-03-14,17.4569
2019-03-15,17.4371
2019-03-18,17.6443
2019-03-19,17.3089
2019-03-20,17.2399
2019-03-21,17.4963
2019-03-22,16.727
2019-03-25,16.7369
2019-03-26,17.0131
2019-03-27,17.0624
2019-03-28,17.092
2019-03-29,17.0525
2019-04-01,17.5358
2019-04-02,17.1906
2019-04-03,16.9736
2019-04-04,17.5062
2019-04-05,17.9796
2019-04-08,17.95
2019-04-09,17.42
2019-04-10,18.02
2019-04-11,18.18
2019-04-12,18.6
2019-04-15,18.48
2019-04-16,18.73
2019-04-17,18.85
2019-04-18,18.54
2019-04-22,18.35
2019-04-23,18.7
2019-04-24,18.64
2019-04-25,18.34
2019-04-26,18.49
2019-04-29,18.28
2019-04-30,18.73
2019-05-01,18.6
2019-05-02,18.49
2019-05-03,19.13
2019-05-06,18.58
2019-05-07,18.16
2019-05-08,18.1
2019-05-09,17.83
2019-05-10,17.66
2019-05-13,16.93
2019-05-14,17.19
2019-05-15,17.22
2019-05-16,17.24
2019-05-17,17
2019-05-20,16.9
2019-05-21,17.3
2019-05-22,17.12
2019-05-23,16.84
2019-05-24,16.97
2019-05-28,16.75
2019-05-29,16.68
2019-05-30,16.53
2019-05-31,16.15
2019-06-03,16.22
2019-06-04,16.81
2019-06-05,16.61
2019-06-06,16.63
2019-06-07,16.56
2019-06-10,16.74
2019-06-11,16.97
2019-06-12,16.93
2019-06-13,17.045
2019-06-14,16.945
2019-06-17,16.63
2019-06-18,16.915
2019-06-19,16.69
2019-06-20,16.46
2019-06-21,16.36
2019-06-24,16.18
2019-06-25,16.24
2019-06-26,16.195
2019-06-27,16.56
2019-06-28,16.555
2019-07-01,16.69
2019-07-02,16.415
2019-07-03,16.76
2019-07-04,16.76
2019-07-05,16.82
2019-07-08,16.555
2019-07-09,16.54
2019-07-10,16.57
2019-07-11,16.485
2019-07-12,16.83
2019-07-15,16.92
2019-07-16,17.095
2019-07-17,16.88
2019-07-18,17.11
2019-07-19,16.895
2019-07-22,17.08
2019-07-23,17.28
2019-07-24,17.45
2019-07-25,17.32
2019-07-26,17.425
2019-07-29,17.56
2019-07-30,17.57
2019-07-31,17.45
2019-08-01,17.03
2019-08-02,16.98
2019-08-05,16.255
2019-08-06,16.815
2019-08-07,16.68
2019-08-08,16.835
2019-08-09,16.475
2019-08-12,15.715
2019-08-13,15.875
2019-08-14,15.35
2019-08-15,15.255
2019-08-16,15.62
2019-08-19,15.93
2019-08-20,15.675
2019-08-21,15.77
2019-08-22,15.96
2019-08-23,15.385
2019-08-26,15.29
2019-08-27,15.205
2019-08-28,15.545
2019-08-29,16.05
2019-08-30,16.17
2019-09-02,16.165
2019-09-03,15.945
2019-09-04,16.15
2019-09-05,16.695
2019-09-06,16.785
2019-09-09,17.505
2019-09-10,17.965
2019-09-11,18.295
2019-09-12,18.055
2019-09-13,17.845
2019-09-16,17.745
2019-09-17,17.625
2019-09-18,17.485
2019-09-19,17.46
2019-09-20,17.225
2019-09-23,17.19
2019-09-24,17.125
2019-09-25,17.43
2019-09-26,17.41
2019-09-27,17.405
2019-09-30,17.16
2019-10-01,16.635
2019-10-02,16.285
2019-10-03,16.16
2019-10-04,16.155
2019-10-07,15.985
2019-10-08,15.29
2019-10-09,15.44
2019-10-10,15
2019-10-11,15.475
2019-10-14,15.285
2019-10-15,15.415
2019-10-16,15.26
2019-10-17,15.485
2019-10-18,15.41
2019-10-21,15.635
2019-10-22,15.375
2019-10-23,15.925
2019-10-24,15.625
2019-10-25,15.85
2019-10-28,16.125
2019-10-29,16.805
2019-10-30,16.805
2019-10-31,16.55
2019-11-01,16.735
2019-11-04,17.225
2019-11-05,17.525
2019-11-06,17.285
2019-11-07,17.425
2019-11-08,17.135
2019-11-11,16.75
2019-11-12,16.395
2019-11-13,16.165
2019-11-14,16.265
2019-11-15,16.365
2019-11-18,16.355
2019-11-19,16.405
2019-11-20,16.08
2019-11-21,16.035
2019-11-22,16.08
2019-11-25,16.405
