date,close
2014-06-13,39.2369
2014-06-16,39.2055
2014-06-17,38.8681
2014-06-18,39.1192
2014-06-19,39.3624
2014-06-20,39.1898
2014-06-23,39.2683
2014-06-24,38.2638
2014-06-25,39.1099
2014-06-26,39.6043
2014-06-27,39.6521
2014-06-30,39.2694
2014-07-01,39.4687
2014-07-02,39.8674
2014-07-03,39.8993
2014-07-07,39.9073
2014-07-08,39.7717
2014-07-09,39.6601
2014-07-10,39.5325
2014-07-11,39.8674
2014-07-14,40.0269
2014-07-15,39.8435
2014-07-16,40.0588
2014-07-17,39.6441
2014-07-18,40.1305
2014-07-21,40.0428
2014-07-22,40.3378
2014-07-23,40.7285
2014-07-24,40.6966
2014-07-25,40.5451
2014-07-28,40.6568
2014-07-29,40.7206
2014-07-30,40.7684
2014-07-31,40.3777
2014-08-01,40.2421
2014-08-04,40.3857
2014-08-05,39.8993
2014-08-06,40.0428
2014-08-07,39.6601
2014-08-08,39.6601
2014-08-11,39.7877
2014-08-12,39.979
2014-08-13,40.2581
2014-08-14,40.4813
2014-08-15,40.4335
2014-08-18,40.6647
2014-08-19,40.8481
2014-08-20,41.0714
2014-08-21,40.9358
2014-08-22,40.8481
2014-08-25,40.9438
2014-08-26,40.9358
2014-08-27,41.0475
2014-08-28,40.9039
2014-08-29,40.7604
2014-09-02,40.8162
2014-09-03,41.2548
2014-09-04,41.1591
2014-09-05,41.0794
2014-09-08,40.5611
2014-09-09,40.3857
2014-09-10,40.3219
2014-09-11,39.8833
2014-09-12,39.5245
2014-09-15,39.07
2014-09-16,39.3252
2014-09-17,38.5199
2014-09-18,38.6945
2014-09-19,38.4242
2014-09-22,37.9059
2014-09-23,37.9856
2014-09-24,38.2488
2014-09-25,37.3159
2014-09-26,37.3876
2014-09-29,36.6381
2014-09-30,36.7338
2014-10-01,36.6302
2014-10-02,36.7817
2014-10-03,36.8135
2014-10-06,37.1325
2014-10-07,36.7976
2014-10-08,37.4674
2014-10-09,36.9092
2014-10-10,36.072
2014-10-13,36.3431
2014-10-14,36.5265
2014-10-15,36.8215
2014-10-16,36.8534
2014-10-17,37.2361
2014-10-20,37.4833
2014-10-21,37.7305
2014-10-22,37.6109
2014-10-23,37.8581
2014-10-24,38.0893
2014-10-27,37.9298
2014-10-28,38.5358
2014-10-29,38.0654
2014-10-30,38.3205
2014-10-31,38.7511
2014-11-03,38.169
2014-11-04,38.3205
2014-11-05,37.9936
2014-11-06,37.874
2014-11-07,38.2009
2014-11-10,38.3046
2014-11-11,38.4242
2014-11-12,38.3126
2014-11-13,38.3205
2014-11-14,38.7033
2014-11-17,38.193
2014-11-18,38.0893
2014-11-19,37.4594
2014-11-20,37.268
2014-11-21,37.7624
2014-11-24,37.5551
2014-11-25,37.4036
2014-11-26,37.7943
2014-11-28,37.1165
2014-12-01,36.4388
2014-12-02,36.7099
2014-12-03,36.7418
2014-12-04,36.7338
2014-12-05,36.6461
2014-12-08,36.2873
2014-12-09,36.0401
2014-12-10,35.6973
2014-12-11,35.6973
2014-12-12,35.3145
2014-12-15,34.9238
2014-12-16,34.7883
2014-12-17,34.9862
2014-12-18,35.4691
2014-12-19,35.8293
2014-12-22,36.1568
2014-12-23,35.8293
2014-12-24,35.9357
2014-12-26,36.1486
2014-12-29,36.4924
2014-12-30,36.255
2014-12-31,35.9767
2015-01-02,35.8866
2015-01-05,35.5592
2015-01-06,35.2972
2015-01-07,35.6902
2015-01-08,36.0831
2015-01-09,36.2959
2015-01-12,36.034
2015-01-13,36.2059
2015-01-14,35.8866
2015-01-15,36.1158
2015-01-16,36.3941
2015-01-20,35.9767
2015-01-21,36.345
2015-01-22,36.4678
2015-01-23,36.2468
2015-01-26,36.4105
2015-01-27,36.5006
2015-01-28,36.2304
2015-01-29,36.4678
2015-01-30,36.1404
2015-02-02,36.8198
2015-02-03,37.2782
2015-02-04,37.1309
2015-02-05,37.5402
2015-02-06,37.3191
2015-02-09,37.2209
2015-02-10,37.311
2015-02-11,36.9426
2015-02-12,37.0654
2015-02-13,37.5893
2015-02-17,37.7202
2015-02-18,37.8758
2015-02-19,37.7366
2015-02-20,37.9167
2015-02-23,37.7448
2015-02-24,38.0313
2015-02-25,38.1214
2015-02-26,37.8103
2015-02-27,37.9495
2015-03-02,38.0231
2015-03-03,38.0395
2015-03-04,37.8349
2015-03-05,37.5893
2015-03-06,37.1063
2015-03-09,37.0899
2015-03-10,36.2959
2015-03-11,36.2714
2015-03-12,36.959
2015-03-13,36.3778
2015-03-16,36.738
2015-03-17,36.5333
2015-03-18,37.3928
2015-03-19,37.2373
2015-03-20,37.9576
2015-03-23,38.1705
2015-03-24,38.2196
2015-03-25,37.9576
2015-03-26,37.8185
2015-03-27,37.6793
2015-03-30,37.5156
2015-03-31,37.1309
2015-04-01,37.3273
2015-04-02,37.4501
2015-04-06,37.7039
2015-04-07,37.8267
2015-04-08,38.4733
2015-04-09,38.9317
2015-04-10,38.8908
2015-04-13,38.4652
2015-04-14,38.6862
2015-04-15,38.7517
2015-04-16,39.0382
2015-04-17,38.416
2015-04-20,38.3178
2015-04-21,38.3587
2015-04-22,38.457
2015-04-23,38.6534
2015-04-24,39.3329
2015-04-27,39.472
2015-04-28,39.8895
2015-04-29,39.2756
2015-04-30,38.7353
2015-05-01,38.9645
2015-05-04,39.0463
2015-05-05,38.809
2015-05-06,38.2605
2015-05-07,37.9413
2015-05-08,38.3424
2015-05-11,37.753
2015-05-12,38.2769
2015-05-13,38.6944
2015-05-14,38.9563
2015-05-15,39.251
2015-05-18,38.6944
2015-05-19,38.2523
2015-05-20,38.0804
2015-05-21,38.3997
2015-05-22,38.3424
2015-05-26,38.2687
2015-05-27,38.1705
2015-05-28,37.6466
2015-05-29,37.6793
2015-06-01,37.4174
2015-06-02,37.4992
2015-06-03,37.5402
2015-06-04,36.7707
2015-06-05,36.5006
2015-06-08,36.5006
2015-06-09,36.3205
2015-06-10,36.8116
2015-06-11,37.0408
2015-06-12,36.918
2015-06-15,36.8444
2015-06-16,37.0408
2015-06-17,37.2373
2015-06-18,37.3437
2015-06-19,37.3601
2015-06-22,37.491
2015-06-23,37.8021
2015-06-24,37.5811
2015-06-25,37.4074
2015-06-26,36.839
2015-06-29,35.9111
2015-06-30,36.2789
2015-07-01,36.538
2015-07-02,36.7805
2015-07-06,35.7857
2015-07-07,35.677
2015-07-08,34.5402
2015-07-09,35.1086
2015-07-10,35.6603
2015-07-13,35.8442
2015-07-14,36.0783
2015-07-15,35.9529
2015-07-16,36.304
2015-07-17,36.2956
2015-07-20,36.3959
2015-07-21,36.4377
2015-07-22,35.9027
2015-07-23,35.6603
2015-07-24,35.2257
2015-07-27,34.9665
2015-07-28,35.6269
2015-07-29,35.8024
2015-07-30,35.6603
2015-07-31,35.7941
2015-08-03,35.4096
2015-08-04,35.8359
2015-08-05,35.769
2015-08-06,35.1003
2015-08-07,35
2015-08-10,35.443
2015-08-11,34.3897
2015-08-12,34.0888
2015-08-13,34.047
2015-08-14,34.0888
2015-08-17,34.0386
2015-08-18,33.604
2015-08-19,33.5538
2015-08-20,32.6928
2015-08-21,31.9321
2015-08-24,29.6919
2015-08-25,31.1631
2015-08-26,31.9321
2015-08-27,32.5591
2015-08-28,32.2999
2015-08-31,31.6228
2015-09-01,30.4275
2015-09-02,30.9541
2015-09-03,30.7368
2015-09-04,30.0931
2015-09-08,31.464
2015-09-09,31.4975
2015-09-10,31.5142
2015-09-11,31.4975
2015-09-14,31.5225
2015-09-15,31.5476
2015-09-16,32.325
2015-09-17,31.9906
2015-09-18,31.8151
2015-09-21,31.7064
2015-09-22,31.2467
2015-09-23,30.7368
2015-09-24,30.9457
2015-09-25,30.7786
2015-09-28,30.3021
2015-09-29,30.0262
2015-09-30,30.6448
2015-10-01,30.8371
2015-10-02,31.2885
2015-10-05,32.0492
2015-10-06,32.0408
2015-10-07,32.6427
2015-10-08,33.0773
2015-10-09,33.2529
2015-10-12,33.2445
2015-10-13,32.6594
2015-10-14,32.9185
2015-10-15,33.629
2015-10-16,33.5956
2015-10-19,33.2863
2015-10-20,33.1526
2015-10-21,32.9185
2015-10-22,33.5872
2015-10-23,34.0386
2015-10-26,33.8297
2015-10-27,33.5371
2015-10-28,33.3532
2015-10-29,32.6761
2015-10-30,32.6594
2015-11-02,32.6092
2015-11-03,33.1024
2015-11-04,33.0021
2015-11-05,32.7179
2015-11-06,32.4504
2015-11-09,31.8151
2015-11-10,31.7231
2015-11-11,31.9656
2015-11-12,32.0241
2015-11-13,31.5476
2015-11-16,31.8485
2015-11-17,31.9656
2015-11-18,32.2665
2015-11-19,32.86
2015-11-20,33.1275
2015-11-23,32.8767
2015-11-24,33.069
2015-11-25,32.7764
2015-11-27,32.3417
2015-11-30,32.5089
2015-12-01,33.2362
2015-12-02,32.9352
2015-12-03,32.8182
2015-12-04,33.0105
2015-12-07,32.5423
2015-12-08,32.0074
2015-12-09,31.9906
2015-12-10,32.0074
2015-12-11,31.255
2015-12-14,31.3386
2015-12-15,31.3971
2015-12-16,32.1411
2015-12-17,31.6061
2015-12-18,31.7733
2015-12-21,32.1137
2015-12-22,32.3108
2015-12-23,32.7992
2015-12-24,32.7735
2015-12-28,32.6278
2015-12-29,33.2961
2015-12-30,33.1505
2015-12-31,32.8934
2016-01-04,32.3536
2016-01-05,32.1823
2016-01-06,31.3683
2016-01-07,30.2287
2016-01-08,29.826
2016-01-11,29.9117
2016-01-12,30.0488
2016-01-13,29.5775
2016-01-14,30.0488
2016-01-15,28.7121
2016-01-19,29.2348
2016-01-20,28.7807
2016-01-21,29.0977
2016-01-22,29.5947
2016-01-25,29.2348
2016-01-26,29.7317
2016-01-27,29.3633
2016-01-28,29.7746
2016-01-29,30.3144
2016-02-01,30.2544
2016-02-02,29.4233
2016-02-03,29.6975
2016-02-04,30.0573
2016-02-05,29.5689
2016-02-08,29.4576
2016-02-09,28.952
2016-02-10,29.0034
2016-02-11,28.9092
2016-02-12,29.329
2016-02-16,29.9117
2016-02-17,30.323
2016-02-18,30.2972
2016-02-19,30.3144
2016-02-22,31.1369
2016-02-23,30.58
2016-02-24,30.3658
2016-02-25,30.3915
2016-02-26,30.1173
2016-02-29,30.1259
2016-03-01,30.9741
2016-03-02,31.6939
2016-03-03,32.148
2016-03-04,32.8249
2016-03-07,32.9363
2016-03-08,32.3279
2016-03-09,32.9106
2016-03-10,32.7049
2016-03-11,33.5446
2016-03-14,33.2447
2016-03-15,32.7392
2016-03-16,33.3989
2016-03-17,34.0159
2016-03-18,33.9473
2016-03-21,33.8788
2016-03-22,33.8445
2016-03-23,33.2447
2016-03-24,33.1762
2016-03-28,33.2104
2016-03-29,33.3133
2016-03-30,33.656
2016-03-31,33.6046
2016-04-01,33.3732
2016-04-04,32.962
2016-04-05,32.2508
2016-04-06,32.8677
2016-04-07,32.2251
2016-04-08,32.525
2016-04-11,32.6021
2016-04-12,33.339
2016-04-13,33.8873
2016-04-14,34.1358
2016-04-15,34.2643
2016-04-18,34.6156
2016-04-19,35.0955
2016-04-20,35.0612
2016-04-21,34.8555
2016-04-22,34.7699
2016-04-25,34.7442
2016-04-26,34.8727
2016-04-27,34.3243
2016-04-28,34.3243
2016-04-29,34.2301
2016-05-02,34.4186
2016-05-03,33.8788
2016-05-04,33.3989
2016-05-05,33.4675
2016-05-06,33.3561
2016-05-09,33.2019
2016-05-10,33.8017
2016-05-11,33.5275
2016-05-12,33.4246
2016-05-13,32.9705
2016-05-16,33.4504
2016-05-17,33.3818
2016-05-18,33.0477
2016-05-19,32.8334
2016-05-20,33.0477
2016-05-23,32.8591
2016-05-24,33.0648
2016-05-25,33.3647
2016-05-26,33.4589
2016-05-27,33.4932
2016-05-31,33.4846
2016-06-01,33.4589
2016-06-02,33.3475
2016-06-03,33.8445
2016-06-06,34.2215
2016-06-07,34.4785
2016-06-08,34.6413
2016-06-09,34.2729
2016-06-10,33.6217
2016-06-13,33.2104
2016-06-14,32.962
2016-06-15,32.9791
2016-06-16,32.782
2016-06-17,32.9534
2016-06-20,33.6731
2016-06-21,33.7941
2016-06-22,33.8987
2016-06-23,34.7265
2016-06-24,32.9314
2016-06-27,32.243
2016-06-28,33.0708
2016-06-29,33.585
2016-06-30,34.1601
2016-07-01,34.256
2016-07-05,33.6895
2016-07-06,33.9945
2016-07-07,33.8115
2016-07-08,34.4913
2016-07-11,34.7788
2016-07-12,35.3714
2016-07-13,35.2843
2016-07-14,35.6764
2016-07-15,35.5718
2016-07-18,35.781
2016-07-19,35.3627
2016-07-20,35.6938
2016-07-21,35.6851
2016-07-22,35.7113
2016-07-25,35.7374
2016-07-26,36.1034
2016-07-27,36.0685
2016-07-28,36.1034
2016-07-29,36.3648
2016-08-01,36.0685
2016-08-02,35.9727
2016-08-03,35.8594
2016-08-04,35.9553
2016-08-05,36.2603
2016-08-08,36.4868
2016-08-09,36.6001
2016-08-10,36.5304
2016-08-11,36.7744
2016-08-12,36.4084
2016-08-15,36.635
2016-08-16,36.5391
2016-08-17,36.4868
2016-08-18,36.513
2016-08-19,36.2515
2016-08-22,36.2254
2016-08-23,36.4171
2016-08-24,36.391
2016-08-25,36.3997
2016-08-26,36.0511
2016-08-29,35.9901
2016-08-30,35.8245
2016-08-31,35.4934
2016-09-01,35.7548
2016-09-02,35.9378
2016-09-06,36.574
2016-09-07,36.5914
2016-09-08,36.4171
2016-09-09,35.5544
2016-09-12,35.7984
2016-09-13,34.7265
2016-09-14,34.9357
2016-09-15,35.5631
2016-09-16,35.5021
2016-09-19,35.5805
2016-09-20,35.7374
2016-09-21,36.391
2016-09-22,36.5653
2016-09-23,36.3735
2016-09-26,36.269
2016-09-27,36.6001
2016-09-28,36.9748
2016-09-29,36.5827
2016-09-30,36.8441
2016-10-03,36.8703
2016-10-04,36.6524
2016-10-05,36.9051
2016-10-06,36.879
2016-10-07,36.7134
2016-10-10,36.9835
2016-10-11,36.1644
2016-10-12,36.3474
2016-10-13,36.1905
2016-10-14,36.2603
2016-10-17,36.1644
2016-10-18,36.574
2016-10-19,36.7395
2016-10-20,36.4955
2016-10-21,36.3387
2016-10-24,36.452
2016-10-25,36.6437
2016-10-26,36.2951
2016-10-27,35.7635
2016-10-28,35.6241
2016-10-31,35.7548
2016-11-01,35.7461
2016-11-02,35.3975
2016-11-03,35.4585
2016-11-04,35.1187
2016-11-07,35.8768
2016-11-08,36.1644
2016-11-09,35.7897
2016-11-10,35.6677
2016-11-11,35.4673
2016-11-14,35.3714
2016-11-15,35.5805
2016-11-16,34.9967
2016-11-17,35.1884
2016-11-18,35.0403
2016-11-21,35.2581
2016-11-22,35.5805
2016-11-23,35.7635
2016-11-25,36.0685
2016-11-28,35.964
2016-11-29,36.0337
2016-11-30,35.7723
2016-12-01,35.9553
2016-12-02,35.8855
2016-12-05,35.9727
2016-12-06,36.025
2016-12-07,36.4955
2016-12-08,36.4345
2016-12-09,36.3997
2016-12-12,36.2951
2016-12-13,36.513
2016-12-14,35.8333
2016-12-15,35.5718
2016-12-16,35.3191
2016-12-19,35.1361
2016-12-20,35.415
2016-12-21,35.3491
2016-12-22,35.2778
2016-12-23,35.0995
2016-12-27,35.1619
2016-12-28,35.2243
2016-12-29,35.456
2016-12-30,35.2689
2017-01-03,35.8393
2017-01-04,36.2404
2017-01-05,36.7039
2017-01-06,36.5345
2017-01-09,36.8643
2017-01-10,37.1139
2017-01-11,37.4704
2017-01-12,37.4525
2017-01-13,37.4347
2017-01-17,37.4169
2017-01-18,37.2475
2017-01-19,37.3812
2017-01-20,37.3991
2017-01-23,37.3723
2017-01-24,37.6486
2017-01-25,37.7734
2017-01-26,37.6219
2017-01-27,37.7289
2017-01-30,37.5239
2017-01-31,37.6219
2017-02-01,37.7734
2017-02-02,37.9695
2017-02-03,38.023
2017-02-06,37.7467
2017-02-07,37.711
2017-02-08,37.9339
2017-02-09,38.0497
2017-02-10,38.433
2017-02-13,38.5399
2017-02-14,38.5399
2017-02-15,38.9945
2017-02-16,38.8697
2017-02-17,38.9143
2017-02-21,39.0212
2017-02-22,39.1549
2017-02-23,39.2173
2017-02-24,38.8162
2017-02-27,38.8786
2017-02-28,38.7182
2017-03-01,39.1906
2017-03-02,38.6736
2017-03-03,38.7271
2017-03-06,38.6291
2017-03-07,38.7271
2017-03-08,38.5399
2017-03-09,38.4686
2017-03-10,38.9143
2017-03-13,38.9589
2017-03-14,38.6915
2017-03-15,39.6719
2017-03-16,39.5382
2017-03-17,39.6273
2017-03-20,39.7541
2017-03-21,39.2352
2017-03-22,39.1817
2017-03-23,39.1549
2017-03-24,39.3332
2017-03-27,39.3065
2017-03-28,39.7521
2017-03-29,40.073
2017-03-30,40.1086
2017-03-31,39.8323
2017-04-03,39.8502
2017-04-04,39.7521
2017-04-05,39.7788
2017-04-06,39.7254
2017-04-07,39.5649
2017-04-10,39.7075
2017-04-11,39.8323
2017-04-12,39.7878
2017-04-13,39.663
2017-04-17,39.8858
2017-04-18,39.3599
2017-04-19,38.9945
2017-04-20,39.4758
2017-04-21,39.4312
2017-04-24,39.7967
2017-04-25,39.9393
2017-04-26,39.8145
2017-04-27,39.8591
2017-04-28,39.9482
2017-05-01,40.2958
2017-05-02,40.3047
2017-05-03,39.7521
2017-05-04,39.6006
2017-05-05,39.6719
2017-05-08,39.458
2017-05-09,39.3421
2017-05-10,39.6362
2017-05-11,39.6452
2017-05-12,39.556
2017-05-15,39.7967
2017-05-16,39.8591
2017-05-17,39.1015
2017-05-18,39.1549
2017-05-19,39.458
2017-05-22,39.6808
2017-05-23,39.6719
2017-05-24,39.7967
2017-05-25,39.7788
2017-05-26,39.5917
2017-05-30,39.5025
2017-05-31,39.4223
2017-06-01,39.556
2017-06-02,39.9482
2017-06-05,39.8591
2017-06-06,39.7075
2017-06-07,39.7343
2017-06-08,39.9036
2017-06-09,39.868
2017-06-12,39.7432
2017-06-13,40.3671
2017-06-14,40.5275
2017-06-15,40.2512
2017-06-16,40.3047
2017-06-19,40.5543
2017-06-20,39.9526
2017-06-21,39.6807
2017-06-22,39.8166
2017-06-23,39.9164
2017-06-26,40.0795
2017-06-27,39.9254
2017-06-28,40.5055
2017-06-29,40.5236
2017-06-30,40.3152
2017-07-03,40.0886
2017-07-05,40.2154
2017-07-06,39.8166
2017-07-07,39.9345
2017-07-10,40.0976
2017-07-11,40.1883
2017-07-12,40.3786
2017-07-13,40.7955
2017-07-14,41.3122
2017-07-17,41.1581
2017-07-18,41.294
2017-07-19,41.8288
2017-07-20,41.8016
2017-07-21,41.5297
2017-07-24,41.6384
2017-07-25,41.9104
2017-07-26,42.2004
2017-07-27,42.1098
2017-07-28,41.9466
2017-07-31,42.0916
2017-08-01,42.0644
2017-08-02,42.2638
2017-08-03,42.1279
2017-08-04,42.0644
2017-08-07,42.1098
2017-08-08,41.9919
2017-08-09,42.0101
2017-08-10,41.439
2017-08-11,41.4662
2017-08-14,41.72
2017-08-15,41.5025
2017-08-16,42.2548
2017-08-17,41.6203
2017-08-18,41.8288
2017-08-21,41.8288
2017-08-22,42.1188
2017-08-23,41.9738
2017-08-24,41.9013
2017-08-25,42.146
2017-08-28,42.0826
2017-08-29,41.8922
2017-08-30,41.8107
2017-08-31,42.2638
2017-09-01,42.5176
2017-09-05,42.1279
2017-09-06,42.3182
2017-09-07,42.4451
2017-09-08,42.4179
2017-09-11,42.7442
2017-09-12,42.8892
2017-09-13,42.5629
2017-09-14,42.5539
2017-09-15,42.5357
2017-09-18,42.5901
2017-09-19,42.717
2017-09-20,42.6264
2017-09-21,42.1641
2017-09-22,42.3363
2017-09-25,42.0191
2017-09-26,41.8378
2017-09-27,41.7835
2017-09-28,41.7472
2017-09-29,41.9104
2017-10-02,42.1007
2017-10-03,42.0372
2017-10-04,41.9013
2017-10-05,41.9557
2017-10-06,41.9104
2017-10-09,41.8832
2017-10-10,42.2276
2017-10-11,42.1732
2017-10-12,42.3998
2017-10-13,42.9074
2017-10-16,42.9708
2017-10-17,43.0886
2017-10-18,43.0977
2017-10-19,43.0342
2017-10-20,42.9527
2017-10-23,42.708
2017-10-24,42.6808
2017-10-25,42.2729
2017-10-26,42.3363
2017-10-27,42.5629
2017-10-30,42.3907
2017-10-31,42.3273
2017-11-01,42.6354
2017-11-02,42.8802
2017-11-03,42.6808
2017-11-06,42.7805
2017-11-07,42.7986
2017-11-08,43.2246
2017-11-09,43.2246
2017-11-10,43.279
2017-11-13,43.2336
2017-11-14,42.8802
2017-11-15,42.6626
2017-11-16,42.9164
2017-11-17,42.6445
2017-11-20,42.8077
2017-11-21,43.2608
2017-11-22,43.4149
2017-11-24,43.5056
2017-11-27,43.279
2017-11-28,43.4784
2017-11-29,43.1702
2017-11-30,43.0796
2017-12-01,43.143
2017-12-04,42.8258
2017-12-05,42.7895
2017-12-06,42.5448
2017-12-07,42.5086
2017-12-08,42.7351
2017-12-11,42.9255
2017-12-12,43.0705
2017-12-13,43.6324
2017-12-14,43.3243
2017-12-15,43.3515
2017-12-18,43.6959
2017-12-19,44.6364
2017-12-20,44.6937
2017-12-21,44.9895
2017-12-22,45.1422
2017-12-26,45.19
2017-12-27,45.3713
2017-12-28,45.5813
2017-12-29,45.6194
2018-01-02,46.0585
2018-01-03,46.3352
2018-01-04,46.4975
2018-01-05,46.7742
2018-01-08,46.6597
2018-01-09,46.717
2018-01-10,46.4307
2018-01-11,46.7074
2018-01-12,46.9556
2018-01-16,46.717
2018-01-17,47.0892
2018-01-18,46.9269
2018-01-19,47.1369
2018-01-22,47.261
2018-01-23,47.4041
2018-01-24,47.6618
2018-01-25,47.4328
2018-01-26,48.0149
2018-01-29,47.5473
2018-01-30,47.1942
2018-01-31,47.2801
2018-02-01,47.3755
2018-02-02,46.5166
2018-02-05,45.0277
2018-02-06,45.4381
2018-02-07,44.5505
2018-02-08,43.5103
2018-02-09,43.787
2018-02-12,44.331
2018-02-13,44.6937
2018-02-14,45.3713
2018-02-15,45.8867
2018-02-16,45.6003
2018-02-20,45.4667
2018-02-21,45.4286
2018-02-22,45.6003
2018-02-23,46.1062
2018-02-26,46.5929
2018-02-27,45.963
2018-02-28,45.524
2018-03-01,45.3045
2018-03-02,45.3808
2018-03-05,45.2949
2018-03-06,45.6099
2018-03-07,45.3331
2018-03-08,45.5431
2018-03-09,46.3543
2018-03-12,46.4784
2018-03-13,45.9726
2018-03-14,46.0394
2018-03-15,45.734
2018-03-16,45.6003
2018-03-19,45.3331
2018-03-20,45.3045
2018-03-21,45.6003
2018-03-22,44.4837
2018-03-23,43.8347
2018-03-26,44.7032
2018-03-27,44.0256
2018-03-28,43.8825
2018-03-29,44.3406
2018-04-02,43.7011
2018-04-03,44.1401
2018-04-04,44.2451
2018-04-05,44.3119
2018-04-06,43.9015
2018-04-09,44.2833
2018-04-10,45.0086
2018-04-11,45.0277
2018-04-12,45.0945
2018-04-13,45.1232
2018-04-16,45.0468
2018-04-17,45.085
2018-04-18,45.4286
2018-04-19,45.1327
2018-04-20,44.7509
2018-04-23,44.7128
2018-04-24,44.7414
2018-04-25,44.646
2018-04-26,44.8273
2018-04-27,45.0182
2018-04-30,44.98
2018-05-01,45.1327
2018-05-02,45.3045
2018-05-03,45.4667
2018-05-04,45.4572
2018-05-07,45.1518
2018-05-08,45.1995
2018-05-09,45.3236
2018-05-10,45.858
2018-05-11,46.068
2018-05-14,46.1921
2018-05-15,45.6481
2018-05-16,45.9344
2018-05-17,45.7626
2018-05-18,45.5335
2018-05-21,46.1539
2018-05-22,46.0203
2018-05-23,45.6576
2018-05-24,45.6767
2018-05-25,45.5335
2018-05-29,45.0277
2018-05-30,45.5717
2018-05-31,45.3618
2018-06-01,45.4858
2018-06-04,45.8294
2018-06-05,45.8199
2018-06-06,46.2875
2018-06-07,45.9821
2018-06-08,45.858
2018-06-11,45.9916
2018-06-12,45.5622
2018-06-13,45.2854
2018-06-14,44.9227
2018-06-15,44.8941
2018-06-18,44.9323
2018-06-19,44.541
2018-06-20,44.7549
2018-06-21,44.5993
2018-06-22,45.1049
2018-06-25,44.3854
2018-06-26,44.5701
2018-06-27,44.0743
2018-06-28,44.5604
2018-06-29,44.7354
2018-07-02,44.1618
2018-07-03,44.2979
2018-07-05,44.6285
2018-07-06,45.0952
2018-07-09,45.5133
2018-07-10,45.4355
2018-07-11,44.4924
2018-07-12,45.1632
2018-07-13,45.0563
2018-07-16,44.8813
2018-07-17,44.7938
2018-07-18,44.8716
2018-07-19,44.609
2018-07-20,45.1146
2018-07-23,44.8813
2018-07-24,45.2702
2018-07-25,45.6202
2018-07-26,45.2216
2018-07-27,45.3383
2018-07-30,45.3091
2018-07-31,45.5813
2018-08-01,45.0466
2018-08-02,44.716
2018-08-03,44.784
2018-08-06,44.8813
2018-08-07,45.2507
2018-08-08,45.3674
2018-08-09,45.348
2018-08-10,44.6285
2018-08-13,44.3368
2018-08-14,44.5507
2018-08-15,44.2396
2018-08-16,44.6479
2018-08-17,45.1146
2018-08-20,45.2119
2018-08-21,45.0466
2018-08-22,45.0174
2018-08-23,44.3951
2018-08-24,44.609
2018-08-27,45.1243
2018-08-28,45.1146
2018-08-29,45.5619
2018-08-30,44.9688
2018-08-31,44.716
2018-09-04,44.3562
2018-09-05,43.7729
2018-09-06,43.2964
2018-09-07,42.7131
2018-09-10,42.7519
2018-09-11,42.8006
2018-09-12,43.2867
2018-09-13,43.559
2018-09-14,43.5006
2018-09-17,43.4423
2018-09-18,43.9187
2018-09-19,44.2104
2018-09-20,44.4243
2018-09-21,44.4632
2018-09-24,44.2493
2018-09-25,44.3562
2018-09-26,44.3465
2018-09-27,44.2687
2018-09-28,44.1618
2018-10-01,44.1812
2018-10-02,43.5881
2018-10-03,43.3159
2018-10-04,42.8492
2018-10-05,42.6936
2018-10-08,42.4214
2018-10-09,42.2658
2018-10-10,41.3518
2018-10-11,40.7782
2018-10-12,41.1282
2018-10-15,41.0699
2018-10-16,41.4977
2018-10-17,41.381
2018-10-18,41.0213
2018-10-19,41.3421
2018-10-22,41.4199
2018-10-23,40.8073
2018-10-24,39.8837
2018-10-25,40.0684
2018-10-26,39.767
2018-10-29,39.5823
2018-10-30,40.2531
2018-10-31,40.5254
2018-11-01,41.4004
2018-11-02,41.556
2018-11-05,41.5852
2018-11-06,41.7699
2018-11-07,42.4505
2018-11-08,42.013
2018-11-09,41.5949
2018-11-12,41.3421
2018-11-13,41.5949
2018-11-14,41.3227
2018-11-15,41.8185
2018-11-16,41.9449
2018-11-19,41.4004
2018-11-20,40.5545
2018-11-21,41.2741
2018-11-23,41.1963
2018-11-26,41.838
2018-11-27,41.8185
2018-11-28,42.47
2018-11-29,42.1394
2018-11-30,41.9158
2018-12-03,42.7811
2018-12-04,41.8769
2018-12-06,41.5268
2018-12-07,41.1671
2018-12-10,40.7296
2018-12-11,41.0018
2018-12-12,41.4491
2018-12-13,41.556
2018-12-14,41.0504
2018-12-17,40.9532
2018-12-18,40.92
2018-12-19,40.45
2018-12-20,40.25
2018-12-21,39.62
2018-12-24,39.46
2018-12-26,40.56
2018-12-27,40.48
2018-12-28,40.79
2018-12-31,40.7
2019-01-02,40.36
2019-01-03,39.96
2019-01-04,41.37
2019-01-07,41.47
2019-01-08,41.88
2019-01-09,42.49
2019-01-10,42.73
2019-01-11,42.63
2019-01-14,42.42
2019-01-15,42.76
2019-01-16,43.02
2019-01-17,43.19
2019-01-18,43.41
2019-01-22,42.51
2019-01-23,42.76
2019-01-24,42.89
2019-01-25,43.57
2019-01-28,43.3
2019-01-29,43.32
2019-01-30,43.91
2019-01-31,43.9
2019-02-01,43.64
2019-02-04,43.99
2019-02-05,44.67
2019-02-06,44.21
2019-02-07,44
2019-02-08,44.18
2019-02-11,44.15
2019-02-12,44.38
2019-02-13,44.4
2019-02-14,44.45
2019-02-15,44.81
2019-02-19,45.14
2019-02-20,45.2
2019-02-21,45.14
2019-02-22,45.53
2019-02-25,45.69
2019-02-26,45.66
2019-02-27,45.46
2019-02-28,45.38
2019-03-01,45.63
2019-03-04,45.57
2019-03-05,45.57
2019-03-06,45.54
2019-03-07,45.21
2019-03-08,45.04
2019-03-11,45.5
2019-03-12,45.44
2019-03-13,45.51
2019-03-14,45.39
2019-03-15,45.58
2019-03-18,45.84
2019-03-19,45.79
2019-03-20,45.64
2019-03-21,45.86
2019-03-22,45.1
2019-03-25,45.32
2019-03-26,45.45
2019-03-27,45.21
2019-03-28,45.55
2019-03-29,45.9
2019-04-01,46.62
2019-04-02,46.68
2019-04-03,46.93
2019-04-04,46.8
2019-04-05,46.71
2019-04-08,46.8
2019-04-09,46.57
2019-04-10,46.9
2019-04-11,46.58
2019-04-12,46.99
2019-04-15,46.76
2019-04-16,46.93
2019-04-17,46.9
2019-04-18,46.88
2019-04-22,46.76
2019-04-23,47.03
2019-04-24,46.74
2019-04-25,46.8
2019-04-26,46.97
2019-04-29,47.02
2019-04-30,46.73
2019-05-01,46.6
2019-05-02,46.74
2019-05-03,47.18
2019-05-06,46.29
2019-05-07,45.82
2019-05-08,45.82
2019-05-09,45.58
2019-05-10,46.11
2019-05-13,45.01
2019-05-14,45.2
2019-05-15,45.46
2019-05-16,45.63
2019-05-17,45.2
2019-05-20,45.64
2019-05-21,45.96
2019-05-22,45.96
2019-05-23,45.65
2019-05-24,45.76
2019-05-28,45.61
2019-05-29,45.54
2019-05-30,45.35
2019-05-31,45.16
2019-06-03,45.08
2019-06-04,45.6
2019-06-05,45.43
2019-06-06,45.79
2019-06-07,46.27
2019-06-10,46.47
2019-06-11,46.85
2019-06-12,46.23
2019-06-13,46.28
2019-06-14,45.96
2019-06-17,45.15
2019-06-18,46.04
2019-06-19,46.415
2019-06-20,47
2019-06-21,46.845
2019-06-24,46.96
2019-06-25,46.745
2019-06-26,46.95
2019-06-27,47.315
2019-06-28,47.175
2019-07-01,47.3
2019-07-02,47.45
2019-07-03,47.925
2019-07-04,47.925
2019-07-05,47.635
2019-07-08,47.31
2019-07-09,47.05
2019-07-10,47.24
2019-07-11,47.44
2019-07-12,47.47
2019-07-15,47.5
2019-07-16,47.44
2019-07-17,47.465
2019-07-18,47.695
2019-07-19,47.815
2019-07-22,47.65
2019-07-23,47.83
2019-07-24,47.78
2019-07-25,47.48
2019-07-26,47.38
2019-07-29,47.275
2019-07-30,46.945
2019-07-31,46.46
2019-08-01,45.825
2019-08-02,45.595
2019-08-05,43.88
2019-08-06,43.915
2019-08-07,44.045
2019-08-08,44.625
2019-08-09,44.255
2019-08-12,43.53
2019-08-13,44.045
2019-08-14,43.02
2019-08-15,43.185
2019-08-16,43.825
2019-08-19,44.24
2019-08-20,44.29
2019-08-21,44.385
2019-08-22,44.06
2019-08-23,43.41
2019-08-26,43.53
2019-08-27,43.58
2019-08-28,43.66
2019-08-29,44.02
2019-08-30,44.075
2019-09-02,44.075
2019-09-03,43.78
2019-09-04,44.765
2019-09-05,45.12
2019-09-06,45.41
2019-09-09,45.465
2019-09-10,45.52
2019-09-11,45.795
2019-09-12,45.9
2019-09-13,46.12
2019-09-16,45.85
2019-09-17,45.92
2019-09-18,45.47
2019-09-19,45.435
2019-09-20,45.21
2019-09-23,45.17
2019-09-24,45
2019-09-25,44.88
2019-09-26,44.73
2019-09-27,44.62
2019-09-30,44.7
2019-10-01,44.2
2019-10-02,43.68
2019-10-03,44
2019-10-04,43.98
2019-10-07,44.01
2019-10-08,43.74
2019-10-09,43.83
2019-10-10,44.045
2019-10-11,44.93
2019-10-14,44.56
2019-10-15,44.995
2019-10-16,45.225
2019-10-17,45.29
2019-10-18,45.145
2019-10-21,45.495
2019-10-22,45.57
2019-10-23,45.59
2019-10-24,45.705
2019-10-25,45.92
2019-10-28,46.195
2019-10-29,46.01
2019-10-30,45.86
2019-10-31,45.845
2019-11-01,46.5
2019-11-04,46.59
2019-11-05,46.68
2019-11-06,46.55
2019-11-07,46.99
2019-11-08,46.715
2019-11-11,46.645
2019-11-12,46.445
2019-11-13,45.895
2019-11-14,45.78
2019-11-15,46.09
2019-11-18,46.145
2019-11-19,46.36
2019-11-20,45.795
2019-11-21,45.68
2019-11-22,45.77
2019-11-25,46.25
