date,close
2013-09-13,27.6006
2013-09-16,27.8448
2013-09-17,27.9715
2013-09-18,28.5233
2013-09-19,28.3967
2013-09-20,28.4419
2013-09-23,28.2519
2013-09-24,27.9172
2013-09-25,27.9715
2013-09-26,28.0077
2013-09-27,28.0439
2013-09-30,27.881
2013-10-01,28.0258
2013-10-02,28.2791
2013-10-03,27.9263
2013-10-04,28.1796
2013-10-07,28.1434
2013-10-08,27.682
2013-10-09,27.6639
2013-10-10,28.2972
2013-10-11,28.3153
2013-10-14,28.451
2013-10-15,28.1162
2013-10-16,28.7495
2013-10-17,29.0118
2013-10-18,29.0209
2013-10-21,28.8309
2013-10-22,29.0752
2013-10-23,28.6952
2013-10-24,28.9033
2013-10-25,28.659
2013-10-28,28.5505
2013-10-29,28.5414
2013-10-30,28.1705
2013-10-31,27.6549
2013-11-01,27.4287
2013-11-04,27.6006
2013-11-05,27.7091
2013-11-06,27.8901
2013-11-07,27.8268
2013-11-08,28.27
2013-11-11,28.4329
2013-11-12,27.9444
2013-11-13,28.0891
2013-11-14,28.3514
2013-11-15,28.3967
2013-11-18,28.4238
2013-11-19,28.2248
2013-11-20,27.9715
2013-11-21,28.3153
2013-11-22,28.5414
2013-11-25,28.6409
2013-11-26,29.0933
2013-11-27,29.039
2013-11-29,28.9395
2013-12-02,28.2067
2013-12-03,27.9172
2013-12-04,27.7453
2013-12-05,27.5373
2013-12-06,27.8177
2013-12-09,27.9896
2013-12-10,27.7906
2013-12-11,27.2998
2013-12-12,27.1817
2013-12-13,26.9454
2013-12-16,27.1544
2013-12-17,27.3089
2013-12-18,27.7996
2013-12-19,27.936
2013-12-20,28.2631
2013-12-23,28.4812
2013-12-24,28.663
2013-12-26,28.8084
2013-12-27,28.7993
2013-12-30,28.9811
2013-12-31,28.9356
2014-01-02,28.3994
2014-01-03,27.9996
2014-01-06,27.5997
2014-01-07,27.5997
2014-01-08,27.6179
2014-01-09,27.627
2014-01-10,27.6452
2014-01-13,27.1362
2014-01-14,27.3816
2014-01-15,27.218
2014-01-16,27.2453
2014-01-17,27.2089
2014-01-21,27.4634
2014-01-22,27.5725
2014-01-23,27.0363
2014-01-24,26.182
2014-01-27,26.0003
2014-01-28,26.8
2014-01-29,26.2275
2014-01-30,26.6001
2014-01-31,26.1184
2014-02-03,25.4459
2014-02-04,25.5004
2014-02-05,25.4095
2014-02-06,25.9548
2014-02-07,26.2365
2014-02-10,26.3365
2014-02-11,26.6455
2014-02-12,26.3547
2014-02-13,26.2456
2014-02-14,26.5637
2014-02-18,26.7273
2014-02-19,26.4365
2014-02-20,26.6273
2014-02-21,26.7545
2014-02-24,27.0181
2014-02-25,26.8727
2014-02-26,27.0999
2014-02-27,27.218
2014-02-28,27.627
2014-03-03,27.3634
2014-03-04,27.5997
2014-03-05,27.6088
2014-03-06,27.8905
2014-03-07,27.8996
2014-03-10,27.936
2014-03-11,27.6633
2014-03-12,27.6816
2014-03-13,27.3344
2014-03-14,27.3801
2014-03-17,27.6816
2014-03-18,27.8278
2014-03-19,27.6725
2014-03-20,27.7912
2014-03-21,27.91
2014-03-24,27.8369
2014-03-25,27.9465
2014-03-26,27.8186
2014-03-27,27.6176
2014-03-28,27.9739
2014-03-31,28.5495
2014-04-01,28.3028
2014-04-02,28.3851
2014-04-03,28.6957
2014-04-04,28.513
2014-04-07,28.2115
2014-04-08,28.3211
2014-04-09,28.4399
2014-04-10,28.0196
2014-04-11,28.2754
2014-04-14,28.3759
2014-04-15,28.6226
2014-04-16,28.4947
2014-04-17,28.5312
2014-04-21,28.4581
2014-04-22,28.4855
2014-04-23,28.7322
2014-04-24,28.8236
2014-04-25,28.6774
2014-04-28,28.6591
2014-04-29,28.8327
2014-04-30,28.6409
2014-05-01,29.0063
2014-05-02,29.0794
2014-05-05,29.1799
2014-05-06,29.0611
2014-05-07,29.2164
2014-05-08,29.3535
2014-05-09,29.2712
2014-05-12,29.5636
2014-05-13,29.7554
2014-05-14,29.4448
2014-05-15,29.1981
2014-05-16,29.3078
2014-05-19,29.4448
2014-05-20,29.4814
2014-05-21,29.5544
2014-05-22,29.6458
2014-05-23,29.6641
2014-05-27,29.6458
2014-05-28,29.5453
2014-05-29,29.5636
2014-05-30,29.6549
2014-06-02,29.6823
2014-06-03,29.5819
2014-06-04,30.2944
2014-06-05,30.2122
2014-06-06,30.3949
2014-06-09,30.2762
2014-06-10,30.2944
2014-06-11,30.0833
2014-06-12,29.9823
2014-06-13,30.12
2014-06-16,29.9364
2014-06-17,30.0099
2014-06-18,30.0925
2014-06-19,30.1843
2014-06-20,30.1108
2014-06-23,30.1567
2014-06-24,30.0558
2014-06-25,30.0007
2014-06-26,29.8722
2014-06-27,29.8905
2014-06-30,30.0466
2014-07-01,30.3403
2014-07-02,30.1935
2014-07-03,30.4413
2014-07-07,30.5239
2014-07-08,30.3128
2014-07-09,30.6525
2014-07-10,30.5882
2014-07-11,31.0656
2014-07-14,31.2125
2014-07-15,31.3593
2014-07-16,31.3961
2014-07-17,30.9738
2014-07-18,30.9738
2014-07-21,30.781
2014-07-22,30.781
2014-07-23,30.9738
2014-07-24,30.8177
2014-07-25,30.3403
2014-07-28,30.3036
2014-07-29,30.7534
2014-07-30,30.1935
2014-07-31,29.5968
2014-08-01,29.7161
2014-08-04,29.7161
2014-08-05,29.505
2014-08-06,29.4866
2014-08-07,29.3672
2014-08-08,29.5325
2014-08-11,29.505
2014-08-12,29.5968
2014-08-13,29.5968
2014-08-14,30.1292
2014-08-15,30.2577
2014-08-18,30.5239
2014-08-19,30.6066
2014-08-20,30.6616
2014-08-21,30.9738
2014-08-22,30.8728
2014-08-25,31.1482
2014-08-26,31.1666
2014-08-27,31.3593
2014-08-28,31.2767
2014-08-29,31.3777
2014-09-02,31.3961
2014-09-03,31.3043
2014-09-04,31.1849
2014-09-05,31.2584
2014-09-08,31.1849
2014-09-09,30.9462
2014-09-10,31.0105
2014-09-11,31.0843
2014-09-12,30.8353
2014-09-15,30.9367
2014-09-16,30.9828
2014-09-17,30.9459
2014-09-18,31.3979
2014-09-19,31.3979
2014-09-22,31.1489
2014-09-23,30.6877
2014-09-24,31.1581
2014-09-25,30.7246
2014-09-26,30.8076
2014-09-29,30.66
2014-09-30,30.5954
2014-10-01,30.5862
2014-10-02,30.6323
2014-10-03,30.9921
2014-10-06,30.743
2014-10-07,30.3187
2014-10-08,30.6231
2014-10-09,30.0236
2014-10-10,29.9313
2014-10-13,29.5162
2014-10-14,29.7007
2014-10-15,29.3594
2014-10-16,29.6177
2014-10-17,29.7376
2014-10-20,29.9221
2014-10-21,30.0881
2014-10-22,30.0789
2014-10-23,29.959
2014-10-24,30.208
2014-10-27,30.5493
2014-10-28,30.8445
2014-10-29,30.8076
2014-10-30,31.9513
2014-10-31,31.2503
2014-11-03,31.2319
2014-11-04,31.4901
2014-11-05,31.73
2014-11-06,31.6746
2014-11-07,31.6931
2014-11-10,31.7945
2014-11-11,31.8499
2014-11-12,31.9513
2014-11-13,31.9329
2014-11-14,31.8775
2014-11-17,31.979
2014-11-18,32.1266
2014-11-19,32.2465
2014-11-20,32.4125
2014-11-21,32.6616
2014-11-24,32.7999
2014-11-25,32.7723
2014-11-26,32.8184
2014-11-28,32.763
2014-12-01,32.6247
2014-12-02,32.6431
2014-12-03,32.9106
2014-12-04,32.9936
2014-12-05,32.9844
2014-12-08,33.4825
2014-12-09,33.1689
2014-12-10,32.68
2014-12-11,32.6893
2014-12-12,32.1797
2014-12-15,32.1519
2014-12-16,32.4391
2014-12-17,31.1882
2014-12-18,30.725
2014-12-19,31.0771
2014-12-22,31.494
2014-12-23,31.8461
2014-12-24,31.7442
2014-12-26,31.7257
2014-12-29,31.9666
2014-12-30,32.1982
2014-12-31,31.8461
2015-01-02,31.9202
2015-01-05,32.1148
2015-01-06,32.2723
2015-01-07,32.2909
2015-01-08,32.819
2015-01-09,33.2452
2015-01-12,32.9302
2015-01-13,32.9673
2015-01-14,32.6708
2015-01-15,32.4762
2015-01-16,32.9209
2015-01-20,32.3835
2015-01-21,32.3001
2015-01-22,33.1711
2015-01-23,32.8283
2015-01-26,33.0229
2015-01-27,33.0506
2015-01-28,32.4113
2015-01-29,32.4391
2015-01-30,31.9573
2015-02-02,32.6244
2015-02-03,32.5596
2015-02-04,32.9951
2015-02-05,33.3657
2015-02-06,33.1711
2015-02-09,33.0784
2015-02-10,33.1248
2015-02-11,33.097
2015-02-12,33.1804
2015-02-13,33.1155
2015-02-17,33.0599
2015-02-18,32.9395
2015-02-19,32.6893
2015-02-20,32.7541
2015-02-23,32.6522
2015-02-24,33.0692
2015-02-25,33.0414
2015-02-26,33.2545
2015-02-27,33.5417
2015-03-02,33.8568
2015-03-03,33.5603
2015-03-04,33.9587
2015-03-05,34.0143
2015-03-06,33.968
2015-03-09,33.7548
2015-03-10,33.0506
2015-03-11,33.1251
2015-03-12,33.6929
2015-03-13,33.6836
2015-03-16,34.2327
2015-03-17,34.2792
2015-03-18,34.3723
2015-03-19,34.1117
2015-03-20,34.4561
2015-03-23,34.5119
2015-03-24,34.6236
2015-03-25,34.4375
2015-03-26,34.2792
2015-03-27,34.3537
2015-03-30,34.7446
2015-03-31,34.2513
2015-04-01,34.3351
2015-04-02,34.5119
2015-04-06,34.7167
2015-04-07,34.7539
2015-04-08,35.0611
2015-04-09,35.2938
2015-04-10,35.2379
2015-04-13,35.3403
2015-04-14,35.3961
2015-04-15,35.3682
2015-04-16,35.1914
2015-04-17,34.7167
2015-04-20,34.9401
2015-04-21,34.6981
2015-04-22,34.5399
2015-04-23,35.1076
2015-04-24,35.1728
2015-04-27,35.1914
2015-04-28,34.8191
2015-04-29,34.4468
2015-04-30,34.5119
2015-05-01,34.4282
2015-05-04,34.6702
2015-05-05,34.2885
2015-05-06,34.0372
2015-05-07,34.1582
2015-05-08,34.4189
2015-05-11,34.242
2015-05-12,34.2885
2015-05-13,34.363
2015-05-14,34.6981
2015-05-15,34.8377
2015-05-18,34.9587
2015-05-19,35.0145
2015-05-20,35.1541
2015-05-21,34.847
2015-05-22,35.1448
2015-05-26,35.2751
2015-05-27,35.1821
2015-05-28,35.0145
2015-05-29,35.0704
2015-06-01,35.0145
2015-06-02,34.8005
2015-06-03,35.0797
2015-06-04,34.7446
2015-06-05,34.4747
2015-06-08,34.2513
2015-06-09,34.3351
2015-06-10,35.0611
2015-06-11,35.3695
2015-06-12,35.1171
2015-06-15,34.9208
2015-06-16,35.3975
2015-06-17,35.4817
2015-06-18,36.0518
2015-06-19,35.8462
2015-06-22,35.9958
2015-06-23,35.7527
2015-06-24,35.4069
2015-06-25,35.1358
2015-06-26,35.22
2015-06-29,34.6404
2015-06-30,34.7713
2015-07-01,35.491
2015-07-02,35.2854
2015-07-06,35.2386
2015-07-07,35.3789
2015-07-08,34.9208
2015-07-09,34.9395
2015-07-10,35.4817
2015-07-13,35.6499
2015-07-14,35.8743
2015-07-15,35.7995
2015-07-16,35.7434
2015-07-17,35.5751
2015-07-20,35.463
2015-07-21,35.2947
2015-07-22,35.3228
2015-07-23,35.3041
2015-07-24,35.3134
2015-07-27,35.4069
2015-07-28,35.3975
2015-07-29,35.4817
2015-07-30,35.8929
2015-07-31,35.5378
2015-08-03,35.6967
2015-08-04,36.1453
2015-08-05,36.3229
2015-08-06,36.3136
2015-08-07,36.4257
2015-08-10,36.7622
2015-08-11,37.1081
2015-08-12,37.0239
2015-08-13,37.1174
2015-08-14,37.5567
2015-08-17,37.6969
2015-08-18,37.6502
2015-08-19,37.1268
2015-08-20,36.5472
2015-08-21,35.6686
2015-08-24,34.3881
2015-08-25,34.2479
2015-08-26,34.7806
2015-08-27,35.6873
2015-08-28,35.2013
2015-08-31,34.8554
2015-09-01,33.93
2015-09-02,34.6685
2015-09-03,34.8648
2015-09-04,34.1637
2015-09-08,34.7526
2015-09-09,34.4161
2015-09-10,34.4068
2015-09-11,34.7639
2015-09-14,34.7921
2015-09-15,35.309
2015-09-16,35.4969
2015-09-17,35.4593
2015-09-18,34.8954
2015-09-21,35.1586
2015-09-22,34.5947
2015-09-23,34.6323
2015-09-24,34.341
2015-09-25,34.5195
2015-09-28,33.8429
2015-09-29,34.059
2015-09-30,34.1342
2015-10-01,33.8335
2015-10-02,34.106
2015-10-05,34.1436
2015-10-06,33.8898
2015-10-07,34.4067
2015-10-08,34.8391
2015-10-09,34.7639
2015-10-12,34.9048
2015-10-13,34.5007
2015-10-14,33.918
2015-10-15,34.3598
2015-10-16,34.5947
2015-10-19,35.074
2015-10-20,35.8165
2015-10-21,35.8823
2015-10-22,36.5589
2015-10-23,36.5495
2015-10-26,36.3898
2015-10-27,35.8259
2015-10-28,36.1736
2015-10-29,36.0138
2015-10-30,35.7883
2015-11-02,35.9105
2015-11-03,35.8447
2015-11-04,35.4217
2015-11-05,35.309
2015-11-06,35.3372
2015-11-09,35.1116
2015-11-10,35.2902
2015-11-11,35.4123
2015-11-12,34.9048
2015-11-13,34.5477
2015-11-16,34.98
2015-11-17,34.6887
2015-11-18,35.1492
2015-11-19,35.7883
2015-11-20,36.0796
2015-11-23,35.9105
2015-11-24,35.8823
2015-11-25,35.5627
2015-11-27,35.7319
2015-11-30,35.8823
2015-12-01,36.4274
2015-12-02,36.2864
2015-12-03,35.9856
2015-12-04,36.7845
2015-12-07,36.7845
2015-12-08,36.6153
2015-12-09,36.136
2015-12-10,35.8917
2015-12-11,35.3531
2015-12-14,35.6082
2015-12-15,36.1562
2015-12-16,36.3262
2015-12-17,36.2696
2015-12-18,35.5799
2015-12-21,35.8066
2015-12-22,36.9403
2015-12-23,37.2805
2015-12-24,37.6395
2015-12-28,37.6584
2015-12-29,38.178
2015-12-30,37.6206
2015-12-31,37.0159
2016-01-04,36.0995
2016-01-05,36.1751
2016-01-06,35.8633
2016-01-07,35.1169
2016-01-08,34.4367
2016-01-11,34.0966
2016-01-12,33.9454
2016-01-13,33.0951
2016-01-14,33.5014
2016-01-15,33.5392
2016-01-19,33.4258
2016-01-20,32.9534
2016-01-21,33.0574
2016-01-22,33.3597
2016-01-25,32.8212
2016-01-26,32.9912
2016-01-27,32.7078
2016-01-28,33.2463
2016-01-29,34.2572
2016-02-01,34.3422
2016-02-02,33.7281
2016-02-03,33.6526
2016-02-04,32.7172
2016-02-05,32.9156
2016-02-08,32.8023
2016-02-09,32.8401
2016-02-10,31.867
2016-02-11,31.3662
2016-02-12,32.67
2016-02-16,32.7361
2016-02-17,32.3299
2016-02-18,32.1976
2016-02-19,32.3866
2016-02-22,32.3866
2016-02-23,32.4149
2016-02-24,32.4716
2016-02-25,32.7361
2016-02-26,32.7267
2016-02-29,32.4811
2016-03-01,33.5959
2016-03-02,33.936
2016-03-03,33.8699
2016-03-04,33.3691
2016-03-07,33.4258
2016-03-08,33.3124
2016-03-09,33.2841
2016-03-10,33.1896
2016-03-11,34.0163
2016-03-14,33.7882
2016-03-15,34.1018
2016-03-16,33.9403
2016-03-17,34.4914
2016-03-18,34.9379
2016-03-21,34.995
2016-03-22,35.071
2016-03-23,35.204
2016-03-24,34.7859
2016-03-28,35.0615
2016-03-29,35.033
2016-03-30,35.052
2016-03-31,34.9664
2016-04-01,35.3085
2016-04-04,34.9569
2016-04-05,34.2823
2016-04-06,34.1208
2016-04-07,33.6647
2016-04-08,33.9403
2016-04-11,34.0733
2016-04-12,34.5199
2016-04-13,34.6434
2016-04-14,34.5959
2016-04-15,34.5579
2016-04-18,34.7194
2016-04-19,34.8524
2016-04-20,34.9189
2016-04-21,33.7977
2016-04-22,34.1018
2016-04-25,33.9783
2016-04-26,34.1303
2016-04-27,34.0733
2016-04-28,31.1087
2016-04-29,31.0992
2016-05-02,30.6432
2016-05-03,30.8807
2016-05-04,30.7857
2016-05-05,31.4698
2016-05-06,31.4603
2016-05-09,31.6883
2016-05-10,32.325
2016-05-11,32.0114
2016-05-12,32.0304
2016-05-13,32.4675
2016-05-16,32.3915
2016-05-17,32.2109
2016-05-18,32.5625
2016-05-19,32.363
2016-05-20,32.7335
2016-05-23,32.496
2016-05-24,32.8666
2016-05-25,32.7335
2016-05-26,32.515
2016-05-27,32.762
2016-05-31,32.6385
2016-06-01,32.5245
2016-06-02,32.2489
2016-06-03,31.9164
2016-06-06,32.0589
2016-06-07,31.7264
2016-06-08,31.4983
2016-06-09,31.9069
2016-06-10,32.0209
2016-06-13,31.3327
2016-06-14,31.1702
2016-06-15,30.8643
2016-06-16,30.9217
2016-06-17,30.8643
2016-06-20,30.9982
2016-06-21,31.1415
2016-06-22,31.3231
2016-06-23,31.8106
2016-06-24,29.8703
2016-06-27,29.3159
2016-06-28,30.3386
2016-06-29,30.7974
2016-06-30,31.8393
2016-07-01,31.6481
2016-07-05,30.7879
2016-07-06,31.1511
2016-07-07,31.1798
2016-07-08,31.5526
2016-07-11,31.4092
2016-07-12,31.543
2016-07-13,31.715
2016-07-14,31.1989
2016-07-15,30.979
2016-07-18,30.7592
2016-07-19,30.9982
2016-07-20,31.3136
2016-07-21,31.1224
2016-07-22,31.3709
2016-07-25,31.4283
2016-07-26,31.3614
2016-07-27,31.5048
2016-07-28,33.5694
2016-07-29,33.0819
2016-08-01,32.5753
2016-08-02,32.3077
2016-08-03,32.4606
2016-08-04,32.3172
2016-08-05,32.3746
2016-08-08,32.4224
2016-08-09,32.2121
2016-08-10,32.0974
2016-08-11,31.7055
2016-08-12,31.868
2016-08-15,32.1834
2016-08-16,32.0687
2016-08-17,31.9349
2016-08-18,32.04
2016-08-19,32.0878
2016-08-22,32.3363
2016-08-23,32.1356
2016-08-24,31.9922
2016-08-25,32.2216
2016-08-26,32.0209
2016-08-29,32.3555
2016-08-30,32.6327
2016-08-31,32.7187
2016-09-01,32.8143
2016-09-02,33.2157
2016-09-06,33.6363
2016-09-07,33.8561
2016-09-08,33.665
2016-09-09,32.776
2016-09-12,32.69
2016-09-13,32.4785
2016-09-14,32.392
2016-09-15,32.5554
2016-09-16,32.1612
2016-09-19,32.2766
2016-09-20,32.315
2016-09-21,32.9881
2016-09-22,33.3534
2016-09-23,32.9015
2016-09-26,32.5746
2016-09-27,32.44
2016-09-28,32.8342
2016-09-29,32.3439
2016-09-30,32.3343
2016-10-03,31.9978
2016-10-04,32.2093
2016-10-05,32.3535
2016-10-06,31.9304
2016-10-07,32.6804
2016-10-10,33.065
2016-10-11,32.7669
2016-10-12,32.8727
2016-10-13,32.8535
2016-10-14,33.0842
2016-10-17,33.1034
2016-10-18,33.0746
2016-10-19,33.0746
2016-10-20,32.3247
2016-10-21,32.2093
2016-10-24,32.4112
2016-10-25,32.7477
2016-10-26,32.4112
2016-10-27,32.3631
2016-10-28,32.9304
2016-10-31,33.363
2016-11-01,33.1515
2016-11-02,33.0938
2016-11-03,33.3246
2016-11-04,33.2284
2016-11-07,33.9399
2016-11-08,34.7956
2016-11-09,35.7571
2016-11-10,36.6128
2016-11-11,36.6609
2016-11-14,36.8436
2016-11-15,36.4109
2016-11-16,35.9109
2016-11-17,35.8052
2016-11-18,35.9879
2016-11-21,35.9206
2016-11-22,35.6417
2016-11-23,35.584
2016-11-25,35.8821
2016-11-28,35.5648
2016-11-29,35.0841
2016-11-30,34.7379
2016-12-01,34.488
2016-12-02,34.7091
2016-12-05,34.8052
2016-12-06,34.786
2016-12-07,34.9975
2016-12-08,35.2956
2016-12-09,35.6225
2016-12-12,35.9975
2016-12-13,35.9781
2016-12-14,35.2048
2016-12-15,35.2242
2016-12-16,35.1952
2016-12-19,35.8331
2016-12-20,36.0361
2016-12-21,36.2778
2016-12-22,36.4131
2016-12-23,36.7225
2016-12-27,36.7611
2016-12-28,36.4421
2016-12-29,36.0168
2016-12-30,36.0168
2017-01-03,36.4711
2017-01-04,36.5968
2017-01-05,36.1811
2017-01-06,36.1425
2017-01-09,35.5335
2017-01-10,35.7075
2017-01-11,35.6688
2017-01-12,35.6882
2017-01-13,36.0168
2017-01-17,35.8525
2017-01-18,36.1715
2017-01-19,36.0845
2017-01-20,36.0168
2017-01-23,36.0651
2017-01-24,36.4808
2017-01-25,36.6548
2017-01-26,36.7031
2017-01-27,36.5485
2017-01-30,36.1715
2017-01-31,36.3165
2017-02-01,36.6645
2017-02-02,37.6408
2017-02-03,37.3604
2017-02-06,37.6214
2017-02-07,37.6408
2017-02-08,37.8534
2017-02-09,38.1434
2017-02-10,38.5204
2017-02-13,38.8007
2017-02-14,38.9167
2017-02-15,39.0714
2017-02-16,39.284
2017-02-17,39.5837
2017-02-21,39.5837
2017-02-22,39.8157
2017-02-23,39.7577
2017-02-24,39.748
2017-02-27,39.284
2017-02-28,39.139
2017-03-01,39.748
2017-03-02,39.255
2017-03-03,39.0134
2017-03-06,38.5687
2017-03-07,38.791
2017-03-08,38.9747
2017-03-09,38.994
2017-03-10,39.1004
2017-03-13,38.731
2017-03-14,39.0129
2017-03-15,39.0032
2017-03-16,38.8185
2017-03-17,39.0809
2017-03-20,39.149
2017-03-21,38.7991
2017-03-22,38.9837
2017-03-23,38.8282
2017-03-24,38.7116
2017-03-27,38.8768
2017-03-28,39.285
2017-03-29,39.1198
2017-03-30,39.0129
2017-03-31,38.7408
2017-04-03,38.2937
2017-04-04,38.6047
2017-04-05,38.2742
2017-04-06,38.6825
2017-04-07,38.7019
2017-04-10,38.974
2017-04-11,39.3725
2017-04-12,39.2073
2017-04-13,38.8866
2017-04-17,39.528
2017-04-18,39.2462
2017-04-19,39.2559
2017-04-20,39.2267
2017-04-21,39.2753
2017-04-24,39.8488
2017-04-25,40.4611
2017-04-26,40.7526
2017-04-27,41.7051
2017-04-28,40.6749
2017-05-01,41.0442
2017-05-02,40.811
2017-05-03,41.0928
2017-05-04,41.3066
2017-05-05,41.1803
2017-05-08,40.7235
2017-05-09,40.8207
2017-05-10,40.7624
2017-05-11,40.6652
2017-05-12,40.6846
2017-05-15,40.7429
2017-05-16,40.8304
2017-05-17,40.6166
2017-05-18,41.0734
2017-05-19,40.2861
2017-05-22,40.7138
2017-05-23,41.1706
2017-05-24,41.4621
2017-05-25,42.1425
2017-05-26,42.0842
2017-05-30,42.1814
2017-05-31,42.4632
2017-06-01,42.3952
2017-06-02,42.0647
2017-06-05,41.5788
2017-06-06,41.3358
2017-06-07,41.3066
2017-06-08,41.0345
2017-06-09,41.3747
2017-06-12,40.9859
2017-06-13,41.3963
2017-06-14,41.8261
2017-06-15,42.4807
2017-06-16,43.0279
2017-06-19,43.0865
2017-06-20,43.1842
2017-06-21,42.9986
2017-06-22,42.2756
2017-06-23,42.4124
2017-06-26,42.6175
2017-06-27,42.9888
2017-06-28,43.1549
2017-06-29,43.1256
2017-06-30,42.7934
2017-07-03,43.4871
2017-07-05,43.233
2017-07-06,43.3601
2017-07-07,43.917
2017-07-10,43.9756
2017-07-11,43.8486
2017-07-12,44.1612
2017-07-13,43.9951
2017-07-14,44.1319
2017-07-17,44.2394
2017-07-18,44.6986
2017-07-19,45.021
2017-07-20,45.2164
2017-07-21,45.3434
2017-07-24,45.5877
2017-07-25,45.2946
2017-07-26,44.9233
2017-07-27,41.8945
2017-07-28,42.4026
2017-07-31,43.3796
2017-08-01,43.4773
2017-08-02,43.4773
2017-08-03,43.2819
2017-08-04,43.2526
2017-08-07,43.448
2017-08-08,43.2624
2017-08-09,43.6434
2017-08-10,43.4773
2017-08-11,43.3894
2017-08-14,43.6727
2017-08-15,43.6922
2017-08-16,43.5945
2017-08-17,42.9497
2017-08-18,42.7836
2017-08-21,42.7934
2017-08-22,42.9888
2017-08-23,42.344
2017-08-24,41.5428
2017-08-25,42.0215
2017-08-28,40.8882
2017-08-29,40.8296
2017-08-30,40.3508
2017-08-31,40.0187
2017-09-01,39.6865
2017-09-05,37.3905
2017-09-06,37.5663
2017-09-07,35.6416
2017-09-08,37.7227
2017-09-11,39.6181
2017-09-12,39.5204
2017-09-13,39.706
2017-09-14,38.5468
2017-09-15,38.6745
2017-09-18,38.4781
2017-09-19,38.3406
2017-09-20,38.3406
2017-09-21,38.9398
2017-09-22,38.4977
2017-09-25,38.7138
2017-09-26,37.5547
2017-09-27,37.3189
2017-09-28,38.4191
2017-09-29,38.7531
2017-10-02,38.9103
2017-10-03,39.0969
2017-10-04,38.4584
2017-10-05,38.8415
2017-10-06,38.871
2017-10-09,38.6254
2017-10-10,38.9692
2017-10-11,38.6549
2017-10-12,39.9516
2017-10-13,40.7767
2017-10-16,40.9044
2017-10-17,41.2777
2017-10-18,40.6097
2017-10-19,41.71
2017-10-20,41.7591
2017-10-23,41.4644
2017-10-24,41.5724
2017-10-25,40.7571
2017-10-26,40.1284
2017-10-27,40.0793
2017-10-30,40.5312
2017-10-31,39.7551
2017-11-01,39.6274
2017-11-02,38.7826
2017-11-03,39.3327
2017-11-06,38.9889
2017-11-07,39.205
2017-11-08,38.8317
2017-11-09,39.4309
2017-11-10,39.0085
2017-11-13,38.704
2017-11-14,38.3111
2017-11-15,38.537
2017-11-16,37.9869
2017-11-17,37.9476
2017-11-20,38.036
2017-11-21,37.6234
2017-11-22,37.5743
2017-11-24,37.4073
2017-11-27,38.1637
2017-11-28,38.3406
2017-11-29,38.8415
2017-11-30,38.1343
2017-12-01,37.7708
2017-12-04,37.2698
2017-12-05,36.6608
2017-12-06,36.7885
2017-12-07,36.0812
2017-12-08,36.2187
2017-12-11,36.1696
2017-12-12,36.3759
2017-12-13,35.4623
2017-12-14,34.7013
2017-12-15,35.828
2017-12-18,35.0966
2017-12-19,34.9088
2017-12-20,34.7803
2017-12-21,34.6518
2017-12-22,34.7606
2017-12-26,34.8298
2017-12-27,34.7902
2017-12-28,34.9582
2017-12-29,34.7507
2018-01-02,33.624
2018-01-03,34.0292
2018-01-04,34.8298
2018-01-05,34.2466
2018-01-08,34.0588
2018-01-09,33.8117
2018-01-10,33.8315
2018-01-11,34.8594
2018-01-12,35.0768
2018-01-16,34.8298
2018-01-17,34.9187
2018-01-18,34.721
2018-01-19,35.0373
2018-01-22,35.571
2018-01-23,36.3518
2018-01-24,36.4309
2018-01-25,36.4507
2018-01-26,36.2431
2018-01-29,36.1838
2018-01-30,36.1937
2018-01-31,36.4111
2018-02-01,36.3617
2018-02-02,37.8047
2018-02-05,37.2413
2018-02-06,36.9053
2018-02-07,41.5111
2018-02-08,40.7797
2018-02-09,41.3727
2018-02-12,41.1157
2018-02-13,41.4122
2018-02-14,42.9936
2018-02-15,42.618
2018-02-16,43.2901
2018-02-20,42.4994
2018-02-21,42.7959
2018-02-22,42.5983
2018-02-23,42.9442
2018-02-26,42.618
2018-02-27,42.193
2018-02-28,41.8174
2018-03-01,42.2326
2018-03-02,42.7959
2018-03-05,55.269
2018-03-06,55.2591
2018-03-07,55.101
2018-03-08,55.1504
2018-03-09,55.0219
2018-03-12,54.9132
2018-03-13,54.9527
2018-03-14,55.0222
2018-03-15,54.9924
2018-03-16,54.9031
2018-03-19,55.0123
2018-03-20,54.9329
2018-03-21,54.9627
2018-03-22,54.923
2018-03-23,54.9031
2018-03-26,54.9726
2018-03-27,54.9825
2018-03-28,54.923
2018-03-29,54.8337
2018-04-02,54.6749
2018-04-03,55.0619
2018-04-04,54.8337
2018-04-05,55.171
2018-04-06,54.923
2018-04-09,54.8237
2018-04-10,54.9627
2018-04-11,54.9329
2018-04-12,54.9627
2018-04-13,55.0718
2018-04-16,55.0718
2018-04-17,55.2405
2018-04-18,55.3497
2018-04-19,55.181
2018-04-20,55.1214
2018-04-23,55.0123
2018-04-24,54.9527
2018-04-25,54.9726
2018-04-26,55.2802
2018-04-27,55.3695
2018-04-30,55.1611
2018-05-01,55.3794
2018-05-02,55.2207
2018-05-03,55.0718
2018-05-04,55.1115
2018-05-07,54.6253
2018-05-08,54.7047
2018-05-09,54.6551
2018-05-10,54.407
2018-05-11,54.5062
2018-05-14,54.5657
2018-05-15,54.794
2018-05-16,54.8734
2018-05-17,54.9031
2018-05-18,55.0321
2018-05-21,55.3298
2018-05-22,55.31
2018-05-23,55.3397
2018-05-24,55.2405
2018-05-25,55.2107
2018-05-29,54.8932
2018-05-30,55.1611
2018-05-31,55.1512
2018-06-01,55.5084
2018-06-04,55.5084
2018-06-05,55.5283
2018-06-06,55.7466
2018-06-07,55.8656
2018-06-08,55.8656
2018-06-11,55.9649
2018-06-12,55.8756
2018-06-13,55.8359
2018-06-14,55.9853
2018-06-15,55.9654
2018-06-18,55.9853
2018-06-19,55.9754
2018-06-20,55.9953
2018-06-21,55.9853
2018-06-22,55.9355
2018-06-25,55.8957
2018-06-26,55.8757
2018-06-27,55.7263
2018-06-28,55.8558
2018-06-29,55.7363
2018-07-02,55.796
2018-07-03,55.7861
2018-07-05,55.9156
2018-07-06,56.1945
2018-07-09,56.1447
2018-07-10,56.1248
2018-07-11,56.0949
2018-07-12,56.1547
2018-07-13,56.1447
2018-07-16,56.2144
2018-07-17,56.2742
2018-07-18,56.2543
2018-07-19,56.075
2018-07-20,56.0451
2018-07-23,55.7761
2018-07-24,55.9156
2018-07-25,55.8957
2018-07-26,55.9754
2018-07-27,55.9953
2018-07-30,56.0351
2018-07-31,56.0152
2018-08-01,56.1646
2018-08-02,56.1148
2018-08-03,56.055
2018-08-06,55.9953
2018-08-07,56.1646
2018-08-08,56.1248
2018-08-09,56.2045
2018-08-10,56.1646
2018-08-13,56.1248
2018-08-14,56.1447
2018-08-15,56.1746
2018-08-16,56.6328
2018-08-17,56.7225
2018-08-20,56.7424
2018-08-21,56.862
2018-08-22,56.7823
2018-08-23,56.7325
2018-08-24,56.8221
2018-08-27,56.8719
2018-08-28,56.9118
2018-08-29,56.842
2018-08-30,56.9018
2018-08-31,57.1708
2018-09-04,57.101
2018-09-05,57.1508
2018-09-06,56.9516
2018-09-07,56.9616
2018-09-10,56.7823
2018-09-11,57.37
