date,close
2014-06-13,21.8838
2014-06-16,21.6594
2014-06-17,21.7997
2014-06-18,22.2018
2014-06-19,22.95
2014-06-20,23.2492
2014-06-23,23.5579
2014-06-24,23.0903
2014-06-25,23.268
2014-06-26,23.4456
2014-06-27,23.5579
2014-06-30,23.7917
2014-07-01,23.455
2014-07-02,23.7169
2014-07-03,23.5579
2014-07-07,23.1277
2014-07-08,23.1931
2014-07-09,23.8758
2014-07-10,23.7917
2014-07-11,24.2499
2014-07-14,23.6794
2014-07-15,23.0903
2014-07-16,23.5859
2014-07-17,23.773
2014-07-18,23.773
2014-07-21,23.7169
2014-07-22,23.7636
2014-07-23,23.5579
2014-07-24,23.1744
2014-07-25,23.5205
2014-07-28,23.9787
2014-07-29,23.8852
2014-07-30,23.9319
2014-07-31,23.296
2014-08-01,23.5672
2014-08-04,23.9694
2014-08-05,24.1096
2014-08-06,24.3902
2014-08-07,24.4837
2014-08-08,24.6801
2014-08-11,24.811
2014-08-12,25.3067
2014-08-13,25.3161
2014-08-14,25.2974
2014-08-15,25.1477
2014-08-18,25.0823
2014-08-19,25.0916
2014-08-20,24.9981
2014-08-21,24.8859
2014-08-22,24.6801
2014-08-25,24.2967
2014-08-26,24.783
2014-08-27,24.8017
2014-08-28,25.1197
2014-08-29,25.3348
2014-09-02,24.6988
2014-09-03,24.6053
2014-09-04,23.9413
2014-09-05,24.2873
2014-09-08,23.6514
2014-09-09,23.9088
2014-09-10,23.7497
2014-09-11,23.9556
2014-09-12,23.5625
2014-09-15,23.422
2014-09-16,23.4408
2014-09-17,23.0944
2014-09-18,22.9259
2014-09-19,22.6638
2014-09-22,22.1489
2014-09-23,22.4578
2014-09-24,22.3174
2014-09-25,22.3829
2014-09-26,22.2893
2014-09-29,21.9804
2014-09-30,21.5779
2014-10-01,21.5404
2014-10-02,21.7932
2014-10-03,21.2502
2014-10-06,21.6715
2014-10-07,21.1098
2014-10-08,22.1302
2014-10-09,21.0162
2014-10-10,20.7915
2014-10-13,21.0817
2014-10-14,21.3344
2014-10-15,21.2502
2014-10-16,21.2689
2014-10-17,20.9694
2014-10-20,21.3906
2014-10-21,21.4374
2014-10-22,21.1472
2014-10-23,20.5949
2014-10-24,20.5481
2014-10-27,20.2485
2014-10-28,20.4545
2014-10-29,19.4809
2014-10-30,19.0316
2014-10-31,17.5618
2014-11-03,17.8988
2014-11-04,17.4682
2014-11-05,16.6912
2014-11-06,17.0376
2014-11-07,17.9644
2014-11-10,16.9065
2014-11-11,17.5057
2014-11-12,17.281
2014-11-13,17.075
2014-11-14,17.9269
2014-11-17,18.0112
2014-11-18,18.629
2014-11-19,17.8895
2014-11-20,18.3295
2014-11-21,18.4324
2014-11-24,17.9456
2014-11-25,18.4512
2014-11-26,18.2827
2014-11-28,17.2248
2014-12-01,18.4044
2014-12-02,17.955
2014-12-03,18.4002
2014-12-04,18.0628
2014-12-05,17.8378
2014-12-08,17.8847
2014-12-09,18.7564
2014-12-10,18.2315
2014-12-11,18.344
2014-12-12,17.8566
2014-12-15,16.7974
2014-12-16,16.6661
2014-12-17,17.341
2014-12-18,18.1753
2014-12-19,17.9222
2014-12-22,17.0223
2014-12-23,16.9099
2014-12-24,17.4067
2014-12-26,17.6691
2014-12-29,17.4254
2014-12-30,18.0534
2014-12-31,17.716
2015-01-02,18.1284
2015-01-05,18.2409
2015-01-06,19.0002
2015-01-07,18.8314
2015-01-08,18.7283
2015-01-09,19.422
2015-01-12,19.8625
2015-01-13,19.0845
2015-01-14,18.5221
2015-01-15,20.1625
2015-01-16,20.8936
2015-01-20,22.0934
2015-01-21,22.7964
2015-01-22,22.7683
2015-01-23,22.6371
2015-01-26,22.9558
2015-01-27,23.5651
2015-01-28,22.7402
2015-01-29,22.6558
2015-01-30,23.5744
2015-02-02,23.5369
2015-02-03,23.0776
2015-02-04,23.2651
2015-02-05,23.2651
2015-02-06,22.5434
2015-02-09,23.0683
2015-02-10,22.8808
2015-02-11,22.6277
2015-02-12,22.9745
2015-02-13,23.2276
2015-02-17,22.6746
2015-02-18,23.1901
2015-02-19,22.9277
2015-02-20,23.9775
2015-02-23,24.3337
2015-02-24,24.1931
2015-02-25,24.4181
2015-02-26,24.6618
2015-02-27,24.6805
2015-03-02,24.2681
2015-03-03,24.015
2015-03-04,23.6119
2015-03-05,23.715
2015-03-06,21.8403
2015-03-09,21.0155
2015-03-10,20.429
2015-03-11,20.87
2015-03-12,20.9169
2015-03-13,20.9263
2015-03-16,20.9263
2015-03-17,20.7574
2015-03-18,21.4612
2015-03-19,21.4143
2015-03-20,21.5363
2015-03-23,21.7146
2015-03-24,21.4518
2015-03-25,21.0952
2015-03-26,20.7949
2015-03-27,20.8606
2015-03-30,20.6636
2015-03-31,20.3727
2015-04-01,21.3204
2015-04-02,20.9639
2015-04-06,21.1891
2015-04-07,20.8043
2015-04-08,20.7199
2015-04-09,20.8606
2015-04-10,20.9545
2015-04-13,21.1797
2015-04-14,21.4143
2015-04-15,22.0993
2015-04-16,22.165
2015-04-17,22.1181
2015-04-20,22.0712
2015-04-21,22.0618
2015-04-22,21.3674
2015-04-23,22.0055
2015-04-24,23.4412
2015-04-27,24.0136
2015-04-28,24.7268
2015-04-29,24.8488
2015-04-30,24.8582
2015-05-01,24.8582
2015-05-04,24.4453
2015-05-05,24.3515
2015-05-06,24.07
2015-05-07,24.2295
2015-05-08,24.4359
2015-05-11,24.7362
2015-05-12,25.0083
2015-05-13,25.6277
2015-05-14,25.5245
2015-05-15,25.9843
2015-05-18,25.8529
2015-05-19,25.3837
2015-05-20,25.9561
2015-05-21,25.3368
2015-05-22,25.3462
2015-05-26,24.9145
2015-05-27,25.3649
2015-05-28,25.7778
2015-05-29,25.562
2015-06-01,25.4963
2015-06-02,25.2899
2015-06-03,24.755
2015-06-04,25.1491
2015-06-05,24.3139
2015-06-08,24.2482
2015-06-09,22.9285
2015-06-10,22.2616
2015-06-11,22.224
2015-06-12,22.1207
2015-06-15,22.5716
2015-06-16,22.487
2015-06-17,23.0412
2015-06-18,23.4827
2015-06-19,23.1539
2015-06-22,22.4964
2015-06-23,22.6655
2015-06-24,22.6561
2015-06-25,22.487
2015-06-26,22.3837
2015-06-29,22.1019
2015-06-30,21.9422
2015-07-01,21.7262
2015-07-02,22.2334
2015-07-06,22.4119
2015-07-07,21.0499
2015-07-08,21.1532
2015-07-09,21.219
2015-07-10,21.1532
2015-07-13,21.1344
2015-07-14,20.8057
2015-07-15,20.4769
2015-07-16,20.0824
2015-07-17,19.4343
2015-07-20,17.0578
2015-07-21,17.6026
2015-07-22,17.396
2015-07-23,16.5318
2015-07-24,16.7197
2015-07-27,16.1749
2015-07-28,16.5694
2015-07-29,16.5976
2015-07-30,16.2406
2015-07-31,16.1279
2015-08-03,15.4234
2015-08-04,15.4047
2015-08-05,15.3577
2015-08-06,15.3671
2015-08-07,15.1604
2015-08-10,15.9213
2015-08-11,15.9964
2015-08-12,17.039
2015-08-13,16.4285
2015-08-14,16.297
2015-08-17,16.7666
2015-08-18,16.4755
2015-08-19,16.8418
2015-08-20,17.4242
2015-08-21,17.039
2015-08-24,15.8649
2015-08-25,15.1886
2015-08-26,14.8505
2015-08-27,15.6864
2015-08-28,16.1279
2015-08-31,16.034
2015-09-01,15.7146
2015-09-02,15.2262
2015-09-03,15.2074
2015-09-04,14.7471
2015-09-08,15.0153
2015-09-09,14.6954
2015-09-10,14.6389
2015-09-11,15.2787
2015-09-14,14.9494
2015-09-15,15.0247
2015-09-16,15.9372
2015-09-17,16.2195
2015-09-18,15.9749
2015-09-21,15.6456
2015-09-22,14.6672
2015-09-23,14.6295
2015-09-24,15.7867
2015-09-25,15.608
2015-09-28,15.0717
2015-09-29,14.8835
2015-09-30,15.1188
2015-10-01,14.9024
2015-10-02,16.0596
2015-10-05,16.8875
2015-10-06,17.2638
2015-10-07,17.8189
2015-10-08,17.5554
2015-10-09,17.8095
2015-10-12,17.3579
2015-10-13,17.2826
2015-10-14,18.3175
2015-10-15,18.1576
2015-10-16,17.8659
2015-10-19,17.4519
2015-10-20,17.7248
2015-10-21,17.3296
2015-10-22,17.9035
2015-10-23,18.3928
2015-10-26,17.6871
2015-10-27,17.6589
2015-10-28,18.0164
2015-10-29,18.7126
2015-10-30,18.3081
2015-11-02,18.468
2015-11-03,18.0823
2015-11-04,17.8847
2015-11-05,16.4641
2015-11-06,16.5017
2015-11-09,16.8028
2015-11-10,16.4265
2015-11-11,16.7369
2015-11-12,16.3042
2015-11-13,16.4641
2015-11-16,16.5864
2015-11-17,15.8808
2015-11-18,16.5864
2015-11-19,16.9815
2015-11-20,16.6334
2015-11-23,16.5205
2015-11-24,16.9345
2015-11-25,16.8498
2015-11-27,16.3606
2015-11-30,17.3202
2015-12-01,17.3014
2015-12-02,16.7934
2015-12-03,17.6213
2015-12-04,19.2489
2015-12-07,18.5809
2015-12-08,18.2328
2015-12-09,18.4636
2015-12-10,18.3035
2015-12-11,18.0209
2015-12-14,17.2861
2015-12-15,17.3332
2015-12-16,17.9738
2015-12-17,16.589
2015-12-18,16.6832
2015-12-21,16.6267
2015-12-22,16.768
2015-12-23,17.0883
2015-12-24,17.4651
2015-12-28,16.8716
2015-12-29,16.9846
2015-12-30,16.7397
2015-12-31,16.947
2016-01-04,17.3709
2016-01-05,17.352
2016-01-06,17.4839
2016-01-07,17.7665
2016-01-08,16.9658
2016-01-11,16.0238
2016-01-12,16.0238
2016-01-13,16.4665
2016-01-14,16.2687
2016-01-15,16.6738
2016-01-19,15.3644
2016-01-20,15.5999
2016-01-21,15.7223
2016-01-22,15.7129
2016-01-25,16.6455
2016-01-26,17.4274
2016-01-27,18.3129
2016-01-28,18.3977
2016-01-29,18.8027
2016-02-01,19.3585
2016-02-02,18.9064
2016-02-03,21.0447
2016-02-04,22.0245
2016-02-05,22.9947
2016-02-08,23.7295
2016-02-09,22.8911
2016-02-10,22.9005
2016-02-11,23.5882
2016-02-12,24.2853
2016-02-16,23.136
2016-02-17,23.3998
2016-02-18,23.6165
2016-02-19,23.3998
2016-02-22,23.6636
2016-02-23,23.9179
2016-02-24,24.0969
2016-02-25,24.3512
2016-02-26,23.8802
2016-02-29,24.3324
2016-03-01,23.9179
2016-03-02,24.7186
2016-03-03,25.265
2016-03-04,24.5962
2016-03-07,24.9918
2016-03-08,24.4119
2016-03-09,24.6476
2016-03-10,25.7886
2016-03-11,25.1568
2016-03-14,24.6382
2016-03-15,24.8645
2016-03-16,25.9771
2016-03-17,25.8923
2016-03-18,26.2034
2016-03-21,26.2034
2016-03-22,25.8263
2016-03-23,23.5539
2016-03-24,23.9499
2016-03-28,24.2328
2016-03-29,25.4114
2016-03-30,25.2228
2016-03-31,25.0625
2016-04-01,25.1002
2016-04-04,24.7985
2016-04-05,25.7414
2016-04-06,26.1563
2016-04-07,26.3637
2016-04-08,27.4387
2016-04-11,29.3339
2016-04-12,28.8813
2016-04-13,27.797
2016-04-14,27.0426
2016-04-15,27.6932
2016-04-18,27.7781
2016-04-19,29.1453
2016-04-20,28.7116
2016-04-21,30.3522
2016-04-22,29.4471
2016-04-25,29.3339
2016-04-26,30.1448
2016-04-27,30.2674
2016-04-28,31.1066
2016-04-29,32.9735
2016-05-02,32.3795
2016-05-03,31.8986
2016-05-04,30.5031
2016-05-05,30.984
2016-05-06,32.1815
2016-05-09,30.0128
2016-05-10,31.1443
2016-05-11,31.9458
2016-05-12,31.314
2016-05-13,32.1249
2016-05-16,33.3978
2016-05-17,33.5204
2016-05-18,31.6063
2016-05-19,32.1909
2016-05-20,31.8043
2016-05-23,31.8986
2016-05-24,29.9279
2016-05-25,30.5314
2016-05-26,30.5974
2016-05-27,30.1354
2016-05-31,30.5597
2016-06-01,30.7954
2016-06-02,30.5031
2016-06-03,33.379
2016-06-06,33.4073
2016-06-07,32.978
2016-06-08,33.3837
2016-06-09,33.8744
2016-06-10,33.7706
2016-06-13,33.8649
2016-06-14,33.1667
2016-06-15,34.1952
2016-06-16,33.6007
2016-06-17,33.6385
2016-06-20,33.3365
2016-06-21,32.8647
2016-06-22,33.7045
2016-06-23,33.3931
2016-06-24,35.0916
2016-06-27,35.5634
2016-06-28,35.0727
2016-06-29,35.5634
2016-06-30,36.9127
2016-07-01,38.0638
2016-07-05,38.1016
2016-07-06,39.0829
2016-07-07,38.6488
2016-07-08,38.8187
2016-07-11,38.7432
2016-07-12,37.7053
2016-07-13,38.5734
2016-07-14,39.2716
2016-07-15,38.998
2016-07-18,39.281
2016-07-19,39.0546
2016-07-20,37.0731
2016-07-21,38.2337
2016-07-22,38.9414
2016-07-25,37.8657
2016-07-26,38.8093
2016-07-27,39.9321
2016-07-28,40.2624
2016-07-29,41.5173
2016-08-01,41.6683
2016-08-02,43.2724
2016-08-03,42.4798
2016-08-04,42.376
2016-08-05,41.9231
2016-08-08,42.1306
2016-08-09,42.4609
2016-08-10,42.9987
2016-08-11,42.8666
2016-08-12,42.6213
2016-08-15,42.3854
2016-08-16,41.791
2016-08-17,41.5173
2016-08-18,41.9231
2016-08-19,41.6777
2016-08-22,40.8757
2016-08-23,40.7153
2016-08-24,37.6015
2016-08-25,37.894
2016-08-26,37.677
2016-08-29,38.6017
2016-08-30,36.422
2016-08-31,36.0823
2016-09-01,37.2052
2016-09-02,38.2337
2016-09-06,39.6302
2016-09-07,39.7151
2016-09-08,39.2433
2016-09-09,37.0825
2016-09-12,38.0827
2016-09-13,36.8411
2016-09-14,36.4446
2016-09-15,37.0111
2016-09-16,36.1236
2016-09-19,36.2841
2016-09-20,36.0197
2016-09-21,38.7389
2016-09-22,38.4934
2016-09-23,37.351
2016-09-26,37.0677
2016-09-27,36.3313
2016-09-28,37.0205
2016-09-29,36.8694
2016-09-30,37.096
2016-10-03,35.9725
2016-10-04,32.3375
2016-10-05,32.6585
2016-10-06,32.1486
2016-10-07,32.0731
2016-10-10,32.1581
2016-10-11,31.9598
2016-10-12,32.5924
2016-10-13,32.8662
2016-10-14,32.3186
2016-10-17,33.0739
2016-10-18,34.1503
2016-10-19,34.915
2016-10-20,34.9434
2016-10-21,34.3202
2016-10-24,33.8387
2016-10-25,34.5468
2016-10-26,34.1597
2016-10-27,32.8473
2016-10-28,33.4044
2016-10-31,34.9717
2016-11-01,35.8309
2016-11-02,35.1039
2016-11-03,35.642
2016-11-04,35.6892
2016-11-07,34.4524
2016-11-08,34.0464
2016-11-09,34.9717
2016-11-10,32.7435
2016-11-11,29.826
2016-11-14,30.7796
2016-11-15,32.0165
2016-11-16,31.8748
2016-11-17,30.874
2016-11-18,30.8646
2016-11-21,31.2234
2016-11-22,31.3461
2016-11-23,29.741
2016-11-25,30.1376
2016-11-28,31.5821
2016-11-29,31.6766
2016-11-30,30.6285
2016-12-01,30.468
2016-12-02,31.7049
2016-12-05,31.6105
2016-12-06,31.2228
2016-12-07,31.7901
2016-12-08,32.0265
2016-12-09,31.0053
2016-12-12,30.8256
2016-12-13,32.0265
2016-12-14,29.9557
2016-12-15,29.2276
2016-12-16,29.9368
2016-12-19,30.0503
2016-12-20,29.9368
2016-12-21,29.8328
2016-12-22,29.7288
2016-12-23,30.6933
2016-12-27,30.8162
2016-12-28,30.9958
2016-12-29,33.3503
2016-12-30,32.2156
2017-01-03,32.7451
2017-01-04,33.0572
2017-01-05,34.5796
2017-01-06,33.4921
2017-01-09,33.4354
2017-01-10,33.1707
2017-01-11,32.4993
2017-01-12,32.5939
2017-01-13,32.6506
2017-01-17,33.2274
2017-01-18,33.3409
2017-01-19,33.0288
2017-01-20,33.1328
2017-01-23,33.9271
2017-01-24,34.0784
2017-01-25,33.0477
2017-01-26,32.3291
2017-01-27,32.5087
2017-01-30,33.0666
2017-01-31,34.3053
2017-02-01,33.9177
2017-02-02,34.6836
2017-02-03,34.7592
2017-02-06,35.875
2017-02-07,35.2887
2017-02-08,35.7899
2017-02-09,35.1753
2017-02-10,35.6008
2017-02-13,35.3455
2017-02-14,35.0712
2017-02-15,35.0145
2017-02-16,35.5251
2017-02-17,34.9956
2017-02-21,35.4022
2017-02-22,34.0406
2017-02-23,33.9082
2017-02-24,34.1162
2017-02-27,32.1211
2017-02-28,32.3764
2017-03-01,32.5466
2017-03-02,31.7712
2017-03-03,32.2156
2017-03-06,31.2133
2017-03-07,31.2323
2017-03-08,31.147
2017-03-09,30.8724
2017-03-10,31.1944
2017-03-13,31.2701
2017-03-14,30.683
2017-03-15,32.2929
2017-03-16,31.0713
2017-03-17,31.0997
2017-03-20,31.7815
2017-03-21,32.2266
2017-03-22,32.0467
2017-03-23,31.8384
2017-03-24,31.7058
2017-03-27,32.113
2017-03-28,31.2512
2017-03-29,31.4311
2017-03-30,31.1849
2017-03-31,31.2133
2017-04-03,32.094
2017-04-04,32.3781
2017-04-05,32.4918
2017-04-06,32.3592
2017-04-07,32.4918
2017-04-10,32.7759
2017-04-11,33.2683
2017-04-12,33.221
2017-04-13,32.6717
2017-04-17,32.7569
2017-04-18,32.5013
2017-04-19,31.7436
2017-04-20,31.8857
2017-04-21,32.3213
2017-04-24,31.9236
2017-04-25,31.147
2017-04-26,31.2323
2017-04-27,31.166
2017-04-28,32.0183
2017-05-01,30.9482
2017-05-02,31.2607
2017-05-03,30.9576
2017-05-04,30.5694
2017-05-05,30.9955
2017-05-08,30.9482
2017-05-09,31.0239
2017-05-10,31.2039
2017-05-11,31.7058
2017-05-12,31.9615
2017-05-15,32.0751
2017-05-16,31.9615
2017-05-17,32.4444
2017-05-18,31.5448
2017-05-19,31.8478
2017-05-22,31.8952
2017-05-23,31.2986
2017-05-24,31.8762
2017-05-25,31.6584
2017-05-26,32.3024
2017-05-30,32.1698
2017-05-31,32.3403
2017-06-01,32.2172
2017-06-02,32.2266
2017-06-05,32.0467
2017-06-06,33.5736
2017-06-07,33.678
2017-06-08,33.2132
2017-06-09,32.5304
2017-06-12,32.6063
2017-06-13,32.7011
2017-06-14,31.9803
2017-06-15,31.3354
2017-06-16,31.1457
2017-06-19,31.1837
2017-06-20,31.1457
2017-06-21,31.4397
2017-06-22,31.7717
2017-06-23,32.0657
2017-06-26,32.0277
2017-06-27,31.3639
2017-06-28,31.3354
2017-06-29,30.5672
2017-06-30,30.7189
2017-07-03,30.2447
2017-07-05,30.994
2017-07-06,30.6146
2017-07-07,30.3775
2017-07-10,30.8517
2017-07-11,31.25
2017-07-12,31.4587
2017-07-13,31.2406
2017-07-14,31.582
2017-07-17,31.9898
2017-07-18,31.9708
2017-07-19,32.1321
2017-07-20,32.17
2017-07-21,32.6158
2017-07-24,32.151
2017-07-25,34.3703
2017-07-26,35.0532
2017-07-27,34.56
2017-07-28,35.148
2017-07-31,35.2523
2017-08-01,35.0721
2017-08-02,34.9678
2017-08-03,34.7022
2017-08-04,34.2849
2017-08-07,34.3039
2017-08-08,33.8961
2017-08-09,34.2375
2017-08-10,34.56
2017-08-11,34.6453
2017-08-14,34.1617
2017-08-15,33.9246
2017-08-16,34.266
2017-08-17,34.1901
2017-08-18,33.9815
2017-08-21,34.7212
2017-08-22,34.6169
2017-08-23,35.0721
2017-08-24,34.9204
2017-08-25,35.0816
2017-08-28,36.324
2017-08-29,36.0774
2017-08-30,36.0964
2017-08-31,36.362
2017-09-01,36.6655
2017-09-05,36.7508
2017-09-06,36.3999
2017-09-07,37.557
2017-09-08,37.2819
2017-09-11,36.2482
2017-09-12,36.3714
2017-09-13,35.9961
2017-09-14,36.1672
2017-09-15,35.9676
2017-09-18,35.9011
2017-09-19,36.1957
2017-09-20,35.7585
2017-09-21,35.5685
2017-09-22,36.0056
2017-09-25,36.7088
2017-09-26,36.0816
2017-09-27,35.3594
2017-09-28,35.749
2017-09-29,35.6445
2017-10-02,35.9961
2017-10-03,36.3287
2017-10-04,36.1862
2017-10-05,36.0626
2017-10-06,36.1672
2017-10-09,36.3762
2017-10-10,36.0151
2017-10-11,36.1862
2017-10-12,36.4807
2017-10-13,36.6708
2017-10-16,36.1006
2017-10-17,36.4427
2017-10-18,35.9771
2017-10-19,35.9581
2017-10-20,35.9106
2017-10-23,35.5115
2017-10-24,35.2834
2017-10-25,34.9413
2017-10-26,34.0291
2017-10-27,34.0195
2017-10-30,34.4282
2017-10-31,34.3616
2017-11-01,33.915
2017-11-02,34.6657
2017-11-03,34.2476
2017-11-06,34.5612
2017-11-07,34.2476
2017-11-08,34.5042
2017-11-09,34.0956
2017-11-10,33.7535
2017-11-13,33.934
2017-11-14,34.4757
2017-11-15,34.2856
2017-11-16,34.2951
2017-11-17,34.4092
2017-11-20,34.5232
2017-11-21,34.5612
2017-11-22,34.8843
2017-11-24,34.8558
2017-11-27,35.2549
2017-11-28,35.2929
2017-11-29,34.7798
2017-11-30,35.1504
2017-12-01,35.3404
2017-12-04,35.0078
2017-12-05,34.3997
2017-12-06,34.0481
2017-12-07,34.2052
2017-12-08,33.71
2017-12-11,33.0148
2017-12-12,32.9387
2017-12-13,34.0433
2017-12-14,34.1861
2017-12-15,34.1576
2017-12-18,34.9003
2017-12-19,34.6146
2017-12-20,34.8622
2017-12-21,34.9765
2017-12-22,35.1574
2017-12-26,35.7764
2017-12-27,35.805
2017-12-28,35.7193
2017-12-29,35.7288
2018-01-02,36.3382
2018-01-03,36.0335
2018-01-04,36.4335
2018-01-05,36.5668
2018-01-08,36.5287
2018-01-09,36.2906
2018-01-10,36.5096
2018-01-11,36.9858
2018-01-12,37.8904
2018-01-16,38.0904
2018-01-17,37.5666
2018-01-18,37.3667
2018-01-19,37.5857
2018-01-22,37.7666
2018-01-23,38.3951
2018-01-24,39.5854
2018-01-25,38.8236
2018-01-26,39.0903
2018-01-29,38.1666
2018-01-30,38.1856
2018-01-31,38.576
2018-02-01,38.4332
2018-02-02,37.1096
2018-02-05,35.9954
2018-02-06,35.8335
2018-02-07,35.2622
2018-02-08,34.8622
2018-02-09,35.0051
2018-02-12,35.1479
2018-02-13,35.2527
2018-02-14,37.1381
2018-02-15,37.5286
2018-02-16,37.2429
2018-02-20,36.5573
2018-02-21,36.3382
2018-02-22,35.8335
2018-02-23,36.8429
2018-02-26,37.4429
2018-02-27,36.6049
2018-02-28,36.3763
2018-03-01,36.2906
2018-03-02,36.1192
2018-03-05,36.4525
2018-03-06,36.9953
2018-03-07,36.03
2018-03-08,35.9918
2018-03-09,36.0396
2018-03-12,36.2976
2018-03-13,36.527
2018-03-14,36.4983
2018-03-15,35.6573
2018-03-16,35.7338
2018-03-19,35.8102
2018-03-20,35.6478
2018-03-21,36.527
2018-03-22,35.944
2018-03-23,37.0431
2018-03-26,38.123
2018-03-27,37.3011
2018-03-28,36.6895
2018-03-29,37.3394
2018-04-02,37.5305
2018-04-03,37.11
2018-04-04,37.2629
2018-04-05,37.5305
2018-04-06,37.5496
2018-04-09,36.8711
2018-04-10,37.7216
2018-04-11,38.8398
2018-04-12,38.6104
2018-04-13,39.7573
2018-04-16,39.5853
2018-04-17,39.547
2018-04-18,39.2699
2018-04-19,40.0822
2018-04-20,39.5184
2018-04-23,39.2412
2018-04-24,39.2317
2018-04-25,38.7251
2018-04-26,38.9641
2018-04-27,38.8589
2018-04-30,37.5496
2018-05-01,37.4827
2018-05-02,37.454
2018-05-03,38.0466
2018-05-04,37.8937
2018-05-07,38.1039
2018-05-08,38.2091
2018-05-09,38.1899
2018-05-10,38.6296
2018-05-11,38.6009
2018-05-14,38.6009
2018-05-15,37.7599
2018-05-16,37.9319
2018-05-17,37.6165
2018-05-18,37.4254
2018-05-21,37.6261
2018-05-22,37.0718
2018-05-23,37.8363
2018-05-24,38.1995
2018-05-25,37.693
2018-05-29,37.2056
2018-05-30,37.454
2018-05-31,37.2056
2018-06-01,36.9284
2018-06-04,36.5557
2018-06-05,36.8424
2018-06-06,37.0822
2018-06-07,37.0055
2018-06-08,36.8136
2018-06-11,36.9959
2018-06-12,37.2069
2018-06-13,37.1206
2018-06-14,37.5618
2018-06-15,36.8328
2018-06-18,36.8616
2018-06-19,36.7849
2018-06-20,36.4012
2018-06-21,35.5091
2018-06-22,35.9312
2018-06-25,35.4804
2018-06-26,35.653
2018-06-27,35.4708
2018-06-28,35.49
2018-06-29,36.171
2018-07-02,36.0175
2018-07-03,36.1038
2018-07-05,36.8616
2018-07-06,36.2861
2018-07-09,36.2477
2018-07-10,36.3628
2018-07-11,35.5571
2018-07-12,35.6146
2018-07-13,35.3365
2018-07-16,35.0104
2018-07-17,35.4324
2018-07-18,35.6626
2018-07-19,35.4995
2018-07-20,35.5091
2018-07-23,35.0775
2018-07-24,35.6146
2018-07-25,35.9408
2018-07-26,36.2669
2018-07-27,35.3844
2018-07-30,35.231
2018-07-31,35.183
2018-08-01,34.9528
2018-08-02,34.7514
2018-08-03,34.972
2018-08-06,34.7322
2018-08-07,34.5979
2018-08-08,34.6842
2018-08-09,34.2526
2018-08-10,34.1471
2018-08-13,33.2359
2018-08-14,32.5548
2018-08-15,30.5022
2018-08-16,30.3103
2018-08-17,30.7516
2018-08-20,30.5885
2018-08-21,30.6461
2018-08-22,31.001
2018-08-23,30.3679
2018-08-24,30.7228
2018-08-27,30.9338
2018-08-28,30.5405
2018-08-29,30.4446
2018-08-30,29.7828
2018-08-31,29.7636
2018-09-04,28.862
2018-09-05,28.9003
2018-09-06,29.0058
2018-09-07,28.9003
2018-09-10,28.5263
2018-09-11,28.4207
2018-09-12,29.0664
2018-09-13,29.1243
2018-09-14,29.2785
2018-09-17,29.529
2018-09-18,29.7314
2018-09-19,30.3771
2018-09-20,30.3579
2018-09-21,30.4157
2018-09-24,29.9627
2018-09-25,30.1169
2018-09-26,28.787
2018-09-27,28.893
2018-09-28,29.105
2018-10-01,29.2496
2018-10-02,30.0398
2018-10-03,29.3748
2018-10-04,29.2688
2018-10-05,29.4712
2018-10-08,29.4134
2018-10-09,29.0183
2018-10-10,29.4519
2018-10-11,31.5336
2018-10-12,30.8783
2018-10-15,31.4758
2018-10-16,31.1192
2018-10-17,30.9457
2018-10-18,31.1963
2018-10-19,31.0228
2018-10-22,30.8108
2018-10-23,31.2349
2018-10-24,30.6084
2018-10-25,28.5268
2018-10-26,28.9122
2018-10-29,29.6447
2018-10-30,29.876
2018-10-31,29.7989
2018-11-01,30.8976
2018-11-02,31.2445
2018-11-05,31.2156
2018-11-06,31.1385
2018-11-07,31.3216
2018-11-08,31.2445
2018-11-09,30.859
2018-11-12,30.3868
2018-11-13,30.2711
2018-11-14,31.2252
2018-11-15,31.6685
2018-11-16,32.1119
2018-11-19,31.6011
2018-11-20,31.7071
2018-11-21,32.3721
2018-11-23,31.2831
2018-11-26,31.2927
2018-11-27,30.8012
2018-11-28,31.5047
2018-11-29,31.1674
2018-11-30,31.1674
2018-12-03,32.0155
2018-12-04,32.5648
2018-12-06,31.6067
2018-12-07,32.3132
2018-12-10,32.4487
2018-12-11,32.2648
2018-12-12,32.981
2018-12-13,32.9422
2018-12-14,32.2358
2018-12-17,32.5261
2018-12-18,33.0584
2018-12-19,31.0551
2018-12-20,32.9906
2018-12-21,32.4487
2018-12-24,33.4648
2018-12-26,33.4164
2018-12-27,33.8616
2018-12-28,33.3584
2018-12-31,33.5326
2019-01-02,33.3681
2019-01-03,33.2713
2019-01-04,33.2713
2019-01-07,32.8745
2019-01-08,32.9713
2019-01-09,33.2616
2019-01-10,33.6971
2019-01-11,33.7552
2019-01-14,30.7551
2019-01-15,30.0196
2019-01-16,30.5422
2019-01-17,30.6003
2019-01-18,30.7455
2019-01-22,31.0648
2019-01-23,31.1616
2019-01-24,31.1422
2019-01-25,32.0906
2019-01-28,31.8487
2019-01-29,32.4584
2019-01-30,32.6229
2019-01-31,33.01
2019-02-01,32.7487
2019-02-04,33.0584
2019-02-05,33.0197
2019-02-06,32.8842
2019-02-07,32.6422
2019-02-08,32.7487
2019-02-11,32.5648
2019-02-12,32.3132
2019-02-13,32.1584
2019-02-14,32.0422
2019-02-15,32.168
2019-02-19,33.4164
2019-02-20,34.2487
2019-02-21,34.2681
2019-02-22,35.3036
2019-02-25,34.9358
2019-02-26,33.8229
2019-02-27,32.9229
2019-02-28,33.0197
2019-03-01,32.7293
2019-03-04,33.339
2019-03-05,33.3874
2019-03-06,32.2019
2019-03-07,32.2797
2019-03-08,32.7558
2019-03-11,32.5032
2019-03-12,33.5429
2019-03-13,33.436
2019-03-14,32.474
2019-03-15,32.2019
2019-03-18,32.0659
2019-03-19,32.338
2019-03-20,32.9113
2019-03-21,33.3583
2019-03-22,33.5234
2019-03-25,33.9121
2019-03-26,34.5534
2019-03-27,34.6992
2019-03-28,34.5632
2019-03-29,34.7575
2019-04-01,34.602
2019-04-02,34.8158
2019-04-03,34.9324
2019-04-04,35.4474
2019-04-05,35.4668
2019-04-08,35.6223
2019-04-09,35.564
2019-04-10,35.2433
2019-04-11,34.9518
2019-04-12,35.2239
2019-04-15,35.1462
2019-04-16,34.6482
2019-04-17,34.0407
2019-04-18,32.9054
2019-04-22,32.4174
2019-04-23,32.2381
2019-04-24,32.0688
2019-04-25,31.5011
2019-04-26,31.3318
2019-04-29,30.6347
2019-04-30,30.9334
2019-05-01,30.1964
2019-05-02,29.9773
2019-05-03,30.0969
2019-05-06,29.818
2019-05-07,30.5948
2019-05-08,30.0769
2019-05-09,29.808
2019-05-10,30.0271
2019-05-13,30.784
2019-05-14,30.7044
2019-05-15,30.5649
2019-05-16,30.4255
2019-05-17,30.794
2019-05-20,31.043
2019-05-21,31.2123
2019-05-22,31.1924
2019-05-23,31.5111
2019-05-24,31.7899
2019-05-28,31.5409
2019-05-29,31.4712
2019-05-30,31.9592
2019-05-31,32.9552
2019-06-03,33.493
2019-06-04,34.22
2019-06-05,34.49
2019-06-06,35.31
2019-06-07,35.67
2019-06-10,35.29
2019-06-11,34.92
2019-06-12,35.47
2019-06-13,35.53
2019-06-14,36.01
2019-06-17,36.19
2019-06-18,36
2019-06-19,36.365
2019-06-20,37.425
2019-06-21,37.72
2019-06-24,38.325
2019-06-25,38.435
2019-06-26,38.255
2019-06-27,38.08
2019-06-28,38.28
2019-07-01,37.73
2019-07-02,38.495
2019-07-03,38.77
2019-07-04,38.77
2019-07-05,38.475
2019-07-08,38.365
2019-07-09,38.635
2019-07-10,38.95
2019-07-11,39.18
2019-07-12,39.365
2019-07-15,39.07
2019-07-16,38.715
2019-07-17,39.05
2019-07-18,39.685
2019-07-19,39.27
2019-07-22,39.835
2019-07-23,39.575
2019-07-24,39.33
2019-07-25,38.34
2019-07-26,37.19
2019-07-29,37.72
2019-07-30,37.7
2019-07-31,36.525
2019-08-01,37.19
2019-08-02,36.915
2019-08-05,37.425
2019-08-06,37.975
2019-08-07,39.355
2019-08-08,39.27
2019-08-09,39.09
2019-08-12,38.52
2019-08-13,37.63
2019-08-14,38.09
2019-08-15,38.545
2019-08-16,38.635
2019-08-19,38.135
2019-08-20,38.515
2019-08-21,38.555
2019-08-22,38.535
2019-08-23,39.26
2019-08-26,39.38
2019-08-27,40.7
2019-08-28,40.845
2019-08-29,40.135
2019-08-30,39.78
2019-09-02,39.855
2019-09-03,40.44
2019-09-04,40.965
2019-09-05,39.315
2019-09-06,38.7
2019-09-09,38.105
2019-09-10,38.08
2019-09-11,38.675
2019-09-12,38.715
2019-09-13,38.605
2019-09-16,38.43
2019-09-17,39.57
2019-09-18,38.965
2019-09-19,39.375
2019-09-20,39.88
2019-09-23,39.93
2019-09-24,40.35
2019-09-25,39.585
2019-09-26,39.485
2019-09-27,38.405
2019-09-30,37.93
2019-10-01,37.625
2019-10-02,37.845
2019-10-03,38.1
2019-10-04,38.305
2019-10-07,38.27
2019-10-08,38.955
2019-10-09,38.81
2019-10-10,38.88
2019-10-11,37.59
2019-10-14,38.06
2019-10-15,37.865
2019-10-16,37.805
2019-10-17,38.32
2019-10-18,38.435
2019-10-21,37.94
2019-10-22,37.83
2019-10-23,38.425
2019-10-24,39.08
2019-10-25,39.105
2019-10-28,38.83
2019-10-29,38.86
2019-10-30,39
2019-10-31,39.665
2019-11-01,39.53
2019-11-04,38.89
2019-11-05,37.545
2019-11-06,37.635
2019-11-07,37.02
2019-11-08,36.545
2019-11-11,36.765
2019-11-12,36.87
2019-11-13,37.395
2019-11-14,37.51
2019-11-15,37.57
2019-11-18,38.025
2019-11-19,38.335
2019-11-20,38.505
2019-11-21,38.235
2019-11-22,38.055
2019-11-25,37.705
