date,close
2014-06-13,6.2033
2014-06-16,6.1431
2014-06-17,6.0905
2014-06-18,5.9401
2014-06-19,5.9777
2014-06-20,5.9852
2014-06-23,6.0153
2014-06-24,5.9476
2014-06-25,5.9101
2014-06-26,5.9702
2014-06-27,5.9627
2014-06-30,5.8574
2014-07-01,6.0379
2014-07-02,5.9777
2014-07-03,5.895
2014-07-07,5.9702
2014-07-08,5.88
2014-07-09,5.9326
2014-07-10,5.8649
2014-07-11,5.7973
2014-07-14,5.7326
2014-07-15,5.6093
2014-07-16,5.6318
2014-07-17,5.6544
2014-07-18,5.5341
2014-07-21,5.5266
2014-07-22,5.6168
2014-07-23,5.7521
2014-07-24,5.7897
2014-07-25,5.6995
2014-07-28,5.7822
2014-07-29,5.8875
2014-07-30,5.8273
2014-07-31,5.8273
2014-08-01,5.8649
2014-08-04,5.7822
2014-08-05,5.9025
2014-08-06,5.9101
2014-08-07,5.88
2014-08-08,5.9627
2014-08-11,5.9928
2014-08-12,5.9852
2014-08-13,5.9326
2014-08-14,5.9251
2014-08-15,5.9251
2014-08-18,6.0078
2014-08-19,5.9627
2014-08-20,5.8349
2014-08-21,5.9326
2014-08-22,5.9251
2014-08-25,5.9326
2014-08-26,5.8574
2014-08-27,5.7973
2014-08-28,5.8424
2014-08-29,5.9476
2014-09-02,6.0228
2014-09-03,5.9476
2014-09-04,5.9702
2014-09-05,5.9401
2014-09-08,5.9627
2014-09-09,5.9702
2014-09-10,5.9626
2014-09-11,5.9322
2014-09-12,5.9018
2014-09-15,5.8107
2014-09-16,5.7044
2014-09-17,5.5904
2014-09-18,5.6208
2014-09-19,5.4537
2014-09-22,5.6436
2014-09-23,5.6436
2014-09-24,5.6968
2014-09-25,5.7347
2014-09-26,5.7119
2014-09-29,5.674
2014-09-30,5.6588
2014-10-01,5.5676
2014-10-02,5.674
2014-10-03,5.7044
2014-10-06,5.7727
2014-10-07,5.7499
2014-10-08,5.7423
2014-10-09,5.7044
2014-10-10,5.6398
2014-10-13,5.5297
2014-10-14,5.5107
2014-10-15,5.5297
2014-10-16,5.5069
2014-10-17,5.7195
2014-10-20,5.6664
2014-10-21,5.7271
2014-10-22,5.7955
2014-10-23,5.6664
2014-10-24,5.5448
2014-10-27,5.56
2014-10-28,5.3929
2014-10-29,5.5676
2014-10-30,5.5828
2014-10-31,5.4461
2014-11-03,5.4841
2014-11-04,5.4841
2014-11-05,5.5221
2014-11-06,5.5676
2014-11-07,5.4537
2014-11-10,5.4689
2014-11-11,5.4689
2014-11-12,5.4461
2014-11-13,5.6056
2014-11-14,5.4309
2014-11-17,5.4841
2014-11-18,5.6952
2014-11-19,5.4651
2014-11-20,5.5676
2014-11-21,5.4613
2014-11-24,5.4993
2014-11-25,5.6056
2014-11-26,5.6208
2014-11-28,5.5145
2014-12-01,5.4841
2014-12-02,5.6436
2014-12-03,5.6664
2014-12-04,5.7879
2014-12-05,5.7879
2014-12-08,5.6816
2014-12-09,5.4917
2014-12-10,5.5915
2014-12-11,5.7298
2014-12-12,5.7912
2014-12-15,5.5762
2014-12-16,5.6146
2014-12-17,5.7682
2014-12-18,5.7759
2014-12-19,5.6819
2014-12-22,5.8181
2014-12-23,5.7912
2014-12-24,5.9448
2014-12-26,5.9141
2014-12-29,5.9141
2014-12-30,5.8373
2014-12-31,5.9694
2015-01-02,5.9909
2015-01-05,6.0293
2015-01-06,5.9756
2015-01-07,6.1445
2015-01-08,6.1522
2015-01-09,6.1808
2015-01-12,6.2597
2015-01-13,6.2213
2015-01-14,6.0132
2015-01-15,6.0677
2015-01-16,6.0984
2015-01-20,6.2137
2015-01-21,6.1791
2015-01-22,6.1577
2015-01-23,6.1445
2015-01-26,6.1522
2015-01-27,6.1829
2015-01-28,6.1138
2015-01-29,6.1675
2015-01-30,6.0923
2015-02-02,6.229
2015-02-03,6.1829
2015-02-04,6.1728
2015-02-05,6.2213
2015-02-06,6.2597
2015-02-09,6.2444
2015-02-10,6.2822
2015-02-11,6.5593
2015-02-12,6.6207
2015-02-13,6.5977
2015-02-17,6.3596
2015-02-18,6.3826
2015-02-19,6.3519
2015-02-20,6.3895
2015-02-23,6.421
2015-02-24,6.421
2015-02-25,6.3519
2015-02-26,6.3673
2015-02-27,6.4487
2015-03-02,6.4825
2015-03-03,6.4442
2015-03-04,6.4364
2015-03-05,6.421
2015-03-06,6.4057
2015-03-09,6.421
2015-03-10,6.3596
2015-03-11,6.1735
2015-03-12,6.0804
2015-03-13,6.1424
2015-03-16,5.9873
2015-03-17,6.0339
2015-03-18,6.0183
2015-03-19,6.0106
2015-03-20,6.0649
2015-03-23,6.0649
2015-03-24,6.0571
2015-03-25,6.0881
2015-03-26,6.0494
2015-03-27,5.9718
2015-03-30,6.0571
2015-03-31,6.0029
2015-04-01,6.1967
2015-04-02,6.2975
2015-04-06,6.2433
2015-04-07,6.3906
2015-04-08,6.6776
2015-04-09,6.5923
2015-04-10,6.5923
2015-04-13,6.5767
2015-04-14,6.5845
2015-04-15,6.4914
2015-04-16,6.4449
2015-04-17,6.4449
2015-04-20,6.4139
2015-04-21,6.22
2015-04-22,6.2975
2015-04-23,6.2433
2015-04-24,6.2588
2015-04-27,6.2588
2015-04-28,6.2278
2015-04-29,6.2355
2015-04-30,6.22
2015-05-01,6.2355
2015-05-04,6.3282
2015-05-05,6.251
2015-05-06,6.2394
2015-05-07,6.2274
2015-05-08,6.282
2015-05-11,6.2557
2015-05-12,6.282
2015-05-13,6.1114
2015-05-14,6.2433
2015-05-15,6.2355
2015-05-18,6.3518
2015-05-19,6.1735
2015-05-20,6.2084
2015-05-21,6.2045
2015-05-22,6.2277
2015-05-26,6.2045
2015-05-27,6.2045
2015-05-28,6.2045
2015-05-29,6.2184
2015-06-01,6.22
2015-06-02,6.1766
2015-06-03,6.1657
2015-06-04,6.2045
2015-06-05,6.2425
2015-06-08,6.2433
2015-06-09,6.2355
2015-06-10,6.2903
2015-06-11,6.5253
2015-06-12,6.5645
2015-06-15,6.3687
2015-06-16,6.3021
2015-06-17,6.2825
2015-06-18,6.4078
2015-06-19,6.0867
2015-06-22,6.3373
2015-06-23,6.3021
2015-06-24,6.2907
2015-06-25,6.3843
2015-06-26,6.306
2015-06-29,6.353
2015-06-30,6.2668
2015-07-01,6.2198
2015-07-02,6.306
2015-07-06,6.3452
2015-07-07,6.3452
2015-07-08,6.3021
2015-07-09,6.306
2015-07-10,6.306
2015-07-13,6.3217
2015-07-14,6.2747
2015-07-15,6.3373
2015-07-16,6.3373
2015-07-17,6.3452
2015-07-20,6.353
2015-07-21,6.3452
2015-07-22,6.3373
2015-07-23,6.3138
2015-07-24,6.3259
2015-07-27,6.3138
2015-07-28,6.3138
2015-07-29,6.3373
2015-07-30,6.353
2015-07-31,6.3059
2015-08-03,6.2903
2015-08-04,6.306
2015-08-05,6.3349
2015-08-06,6.3138
2015-08-07,6.3373
2015-08-10,6.3138
2015-08-11,6.3295
2015-08-12,6.4235
2015-08-13,6.4392
2015-08-14,6.3608
2015-08-17,6.3452
2015-08-18,6.3922
2015-08-19,6.3452
2015-08-20,6.3295
2015-08-21,6.2982
2015-08-24,6.2042
2015-08-25,6.1728
2015-08-26,6.2668
2015-08-27,6.3452
2015-08-28,6.3217
2015-08-31,6.3295
2015-09-01,6.353
2015-09-02,6.2433
2015-09-03,6.2747
2015-09-04,6.3452
2015-09-08,6.4157
2015-09-09,6.384
2015-09-10,6.471
2015-09-11,6.3999
2015-09-14,6.4157
2015-09-15,6.4315
2015-09-16,6.3919
2015-09-17,6.4394
2015-09-18,6.4473
2015-09-21,6.4527
2015-09-22,6.4078
2015-09-23,6.2654
2015-09-24,6.2416
2015-09-25,6.3761
2015-09-28,6.3524
2015-09-29,6.4635
2015-09-30,6.4869
2015-10-01,6.3999
2015-10-02,6.3999
2015-10-05,6.4869
2015-10-06,6.4078
2015-10-07,6.4948
2015-10-08,6.5264
2015-10-09,6.5264
2015-10-12,6.5185
2015-10-13,6.5502
2015-10-14,6.594
2015-10-15,6.9536
2015-10-16,6.8982
2015-10-19,6.7005
2015-10-20,6.7234
2015-10-21,6.5264
2015-10-22,6.5581
2015-10-23,6.566
2015-10-26,6.5739
2015-10-27,6.5739
2015-10-28,6.6609
2015-10-29,6.7163
2015-10-30,6.6134
2015-11-02,6.6688
2015-11-03,6.7242
2015-11-04,6.7005
2015-11-05,6.6411
2015-11-06,6.5818
2015-11-09,6.6846
2015-11-10,6.5502
2015-11-11,6.6372
2015-11-12,6.6277
2015-11-13,6.6688
2015-11-16,6.6846
2015-11-17,6.7163
2015-11-18,6.7163
2015-11-19,6.7005
2015-11-20,6.7164
2015-11-23,6.7558
2015-11-24,6.7479
2015-11-25,6.8112
2015-11-27,6.7084
2015-11-30,7.0011
2015-12-01,6.7717
2015-12-02,6.7005
2015-12-03,6.5699
2015-12-04,6.7005
2015-12-07,6.6609
2015-12-08,6.653
2015-12-09,6.7329
2015-12-10,6.7648
2015-12-11,6.8047
2015-12-14,6.629
2015-12-15,6.621
2015-12-16,6.4453
2015-12-17,6.3894
2015-12-18,6.3495
2015-12-21,6.3176
2015-12-22,6.3415
2015-12-23,6.4334
2015-12-24,6.5092
2015-12-28,6.6051
2015-12-29,6.637
2015-12-30,6.7808
2015-12-31,6.7808
2016-01-04,6.7329
2016-01-05,6.677
2016-01-06,6.7009
2016-01-07,6.661
2016-01-08,6.8047
2016-01-11,6.7808
2016-01-12,6.7648
2016-01-13,6.621
2016-01-14,6.6131
2016-01-15,6.5492
2016-01-19,6.3974
2016-01-20,6.2856
2016-01-21,6.4933
2016-01-22,6.5731
2016-01-25,6.5651
2016-01-26,6.6051
2016-01-27,6.7488
2016-01-28,6.7568
2016-01-29,6.7888
2016-02-01,6.7648
2016-02-02,6.7808
2016-02-03,6.7808
2016-02-04,6.7217
2016-02-05,6.7408
2016-02-08,6.5731
2016-02-09,6.4613
2016-02-10,6.4214
2016-02-11,6.5319
2016-02-12,6.5763
2016-02-16,6.661
2016-02-17,6.629
2016-02-18,6.4453
2016-02-19,6.5811
2016-02-22,6.5012
2016-02-23,6.5572
2016-02-24,6.7728
2016-02-25,6.8318
2016-02-26,6.8168
2016-02-29,6.7408
2016-03-01,6.8607
2016-03-02,6.8741
2016-03-03,7.0044
2016-03-04,6.8527
2016-03-07,7.0284
2016-03-08,6.9565
2016-03-09,7.0324
2016-03-10,7.0364
2016-03-11,7.0683
2016-03-14,7.1562
2016-03-15,7.2201
2016-03-16,7.5746
2016-03-17,7.5166
2016-03-18,7.4586
2016-03-21,7.5456
2016-03-22,7.5746
2016-03-23,7.5249
2016-03-24,7.4668
2016-03-28,7.8729
2016-03-29,7.7735
2016-03-30,7.7735
2016-03-31,7.6657
2016-04-01,7.7735
2016-04-04,7.7652
2016-04-05,8.0818
2016-04-06,7.7403
2016-04-07,7.6575
2016-04-08,7.8149
2016-04-11,7.6823
2016-04-12,7.7569
2016-04-13,7.7569
2016-04-14,7.7238
2016-04-15,7.7155
2016-04-18,7.7486
2016-04-19,7.7486
2016-04-20,7.6657
2016-04-21,7.6989
2016-04-22,7.616
2016-04-25,7.674
2016-04-26,7.7153
2016-04-27,7.6251
2016-04-28,7.5746
2016-04-29,7.6098
2016-05-02,7.5746
2016-05-03,7.5497
2016-05-04,7.7155
2016-05-05,7.6307
2016-05-06,7.7403
2016-05-09,7.616
2016-05-10,7.8563
2016-05-11,7.8315
2016-05-12,7.7072
2016-05-13,7.6989
2016-05-16,7.6906
2016-05-17,7.6326
2016-05-18,7.674
2016-05-19,7.7486
2016-05-20,7.6492
2016-05-23,7.6077
2016-05-24,7.674
2016-05-25,7.558
2016-05-26,7.6822
2016-05-27,7.8646
2016-05-31,7.8066
2016-06-01,7.8812
2016-06-02,7.8646
2016-06-03,7.9475
2016-06-06,7.9558
2016-06-07,7.9475
2016-06-08,7.9529
2016-06-09,7.9558
2016-06-10,7.9061
2016-06-13,7.9392
2016-06-14,7.8563
2016-06-15,7.9399
2016-06-16,7.8563
2016-06-17,8.0486
2016-06-20,7.9399
2016-06-21,8.1907
2016-06-22,8.1489
2016-06-23,8.1154
2016-06-24,8.1238
2016-06-27,7.9734
2016-06-28,8.0904
2016-06-29,7.7226
2016-06-30,7.9065
2016-07-01,8.1739
2016-07-05,8.1238
2016-07-06,8.0987
2016-07-07,8.0987
2016-07-08,8.0904
2016-07-11,8.2074
2016-07-12,8.3077
2016-07-13,8.2742
2016-07-14,8.3578
2016-07-15,8.3996
2016-07-18,8.4549
2016-07-19,8.4832
2016-07-20,8.3996
2016-07-21,8.291
2016-07-22,8.3244
2016-07-25,8.3912
2016-07-26,8.3495
2016-07-27,8.4163
2016-07-28,8.3912
2016-07-29,8.4584
2016-08-01,8.4999
2016-08-02,8.4414
2016-08-03,8.408
2016-08-04,8.433
2016-08-05,8.4247
2016-08-08,8.3745
2016-08-09,8.4581
2016-08-10,8.4247
2016-08-11,8.3954
2016-08-12,8.3495
2016-08-15,8.2993
2016-08-16,8.291
2016-08-17,8.2659
2016-08-18,8.2325
2016-08-19,8.2575
2016-08-22,8.308
2016-08-23,8.3327
2016-08-24,8.3411
2016-08-25,8.3495
2016-08-26,8.3829
2016-08-29,8.3465
2016-08-30,8.3368
2016-08-31,8.3829
2016-09-01,8.3662
2016-09-02,8.3745
2016-09-06,8.3662
2016-09-07,8.3662
2016-09-08,8.408
2016-09-09,8.4748
2016-09-12,8.3829
2016-09-13,8.3996
2016-09-14,8.3912
2016-09-15,8.1974
2016-09-16,8.1974
2016-09-19,8.1384
2016-09-20,8.1469
2016-09-21,8.189
2016-09-22,8.189
2016-09-23,8.1974
2016-09-26,8.2395
2016-09-27,8.1806
2016-09-28,8.2227
2016-09-29,8.5323
2016-09-30,8.5934
2016-10-03,8.4614
2016-10-04,8.5555
2016-10-05,8.4333
2016-10-06,8.5934
2016-10-07,8.5765
2016-10-10,8.4417
2016-10-11,8.5597
2016-10-12,8.5765
2016-10-13,8.5513
2016-10-14,8.5934
2016-10-17,8.5428
2016-10-18,8.6102
2016-10-19,8.6187
2016-10-20,8.6102
2016-10-21,8.6271
2016-10-24,8.5641
2016-10-25,8.3491
2016-10-26,8.2564
2016-10-27,8.202
2016-10-28,8.1047
2016-10-31,8.13
2016-11-01,8.13
2016-11-02,8.0837
2016-11-03,8.0879
2016-11-04,8.0458
2016-11-07,8.0879
2016-11-08,8.0458
2016-11-09,7.9194
2016-11-10,8.13
2016-11-11,8.2985
2016-11-14,8.2985
2016-11-15,8.2579
2016-11-16,7.9412
2016-11-17,7.3718
2016-11-18,7.2875
2016-11-21,6.7399
2016-11-22,6.445
2016-11-23,6.7399
2016-11-25,6.9084
2016-11-28,6.6135
2016-11-29,6.7399
2016-11-30,6.6557
2016-12-01,6.4872
2016-12-02,6.6978
2016-12-05,6.7399
2016-12-06,6.6557
2016-12-07,6.6978
2016-12-08,7.0769
2016-12-09,6.9927
2016-12-12,6.9084
2016-12-13,7.1148
2016-12-14,6.9641
2016-12-15,6.9195
2016-12-16,6.7855
2016-12-19,6.7855
2016-12-20,6.7855
2016-12-21,6.8748
2016-12-22,6.8748
2016-12-23,6.8748
2016-12-27,6.9195
2016-12-28,6.9864
2016-12-29,6.8748
2016-12-30,6.9195
2017-01-03,7.0088
2017-01-04,6.9641
2017-01-05,7.1873
2017-01-06,6.8302
2017-01-09,6.8748
2017-01-10,6.9641
2017-01-11,6.9195
2017-01-12,6.9195
2017-01-13,7.0088
2017-01-17,6.9195
2017-01-18,6.8302
2017-01-19,6.9195
2017-01-20,6.9641
2017-01-23,6.7855
2017-01-24,6.8748
2017-01-25,6.9195
2017-01-26,6.9641
2017-01-27,6.8302
2017-01-30,6.7409
2017-01-31,6.8302
2017-02-01,6.6739
2017-02-02,6.6516
2017-02-03,6.6963
2017-02-06,6.5623
2017-02-07,6.6516
2017-02-08,6.5623
2017-02-09,6.6516
2017-02-10,6.7409
2017-02-13,6.473
2017-02-14,6.473
2017-02-15,6.6963
2017-02-16,6.5177
2017-02-17,6.473
2017-02-21,6.5177
2017-02-22,6.6963
2017-02-23,6.8302
2017-02-24,6.8748
2017-02-27,7.232
2017-02-28,7.0534
2017-03-01,6.8748
2017-03-02,6.8748
2017-03-03,6.7855
2017-03-06,6.8302
2017-03-07,6.8748
2017-03-08,6.9195
2017-03-09,6.8748
2017-03-10,7.0088
2017-03-13,7.098
2017-03-14,7.098
2017-03-15,7.1702
2017-03-16,7.1702
2017-03-17,7.1251
2017-03-20,7.1251
2017-03-21,7.08
2017-03-22,6.9447
2017-03-23,7.1702
2017-03-24,7.3055
2017-03-27,7.531
2017-03-28,7.8015
2017-03-29,7.3957
2017-03-30,7.4408
2017-03-31,7.4182
2017-04-03,7.3055
2017-04-04,7.0349
2017-04-05,7.0349
2017-04-06,7.0349
2017-04-07,6.9898
2017-04-10,6.9898
2017-04-11,7.2153
2017-04-12,7.1251
2017-04-13,7.0349
2017-04-17,6.9447
2017-04-18,6.8996
2017-04-19,6.7643
2017-04-20,6.8094
2017-04-21,7.1702
2017-04-24,7.0349
2017-04-25,6.8996
2017-04-26,6.9898
2017-04-27,7.0349
2017-04-28,7.0349
2017-05-01,6.8094
2017-05-02,6.8545
2017-05-03,6.8545
2017-05-04,6.8545
2017-05-05,7.08
2017-05-08,7.0349
2017-05-09,7.1702
2017-05-10,7.0997
2017-05-11,7.1702
2017-05-12,7.1251
2017-05-15,7.0349
2017-05-16,6.9447
2017-05-17,6.8094
2017-05-18,6.832
2017-05-19,6.8545
2017-05-22,6.9447
2017-05-23,6.9402
2017-05-24,6.9447
2017-05-25,6.8996
2017-05-26,6.9447
2017-05-30,6.8996
2017-05-31,6.8094
2017-06-01,6.8094
2017-06-02,6.8545
2017-06-05,6.8545
2017-06-06,6.8094
2017-06-07,7.0349
2017-06-08,6.9898
2017-06-09,7.08
2017-06-12,7.1251
2017-06-13,7.1702
2017-06-14,6.4687
2017-06-15,6.5142
2017-06-16,6.5142
2017-06-19,6.4231
2017-06-20,6.1042
2017-06-21,6.1042
2017-06-22,6.1498
2017-06-23,6.1953
2017-06-26,6.1498
2017-06-27,6.1042
2017-06-28,6.1498
2017-06-29,6.1042
2017-06-30,6.332
2017-07-03,6.5142
2017-07-05,6.332
2017-07-06,6.0587
2017-07-07,5.922
2017-07-10,5.922
2017-07-11,5.7398
2017-07-12,5.512
2017-07-13,5.2843
2017-07-14,4.9654
2017-07-17,5.2387
2017-07-18,5.2387
2017-07-19,5.1931
2017-07-20,5.2843
2017-07-21,5.2387
2017-07-24,5.102
2017-07-25,5.1476
2017-07-26,5.1931
2017-07-27,5.0565
2017-07-28,5.102
2017-07-31,4.9198
2017-08-01,5.1931
2017-08-02,5.0565
2017-08-03,5.0565
2017-08-04,5.0565
2017-08-07,5.102
2017-08-08,5.0109
2017-08-09,5.0109
2017-08-10,5.102
2017-08-11,5.102
2017-08-14,5.4209
2017-08-15,5.8765
2017-08-16,5.7854
2017-08-17,5.6487
2017-08-18,5.7398
2017-08-21,5.6942
2017-08-22,5.6942
2017-08-23,5.6487
2017-08-24,5.7398
2017-08-25,5.9676
2017-08-28,5.9676
2017-08-29,6.0359
2017-08-30,5.9676
2017-08-31,6.0587
2017-09-01,5.9676
2017-09-05,6.0131
2017-09-06,6.0587
2017-09-07,5.922
2017-09-08,5.9676
2017-09-11,5.9676
2017-09-12,6.0131
2017-09-13,6.0131
2017-09-14,6.0869
2017-09-15,6.0408
2017-09-18,5.9486
2017-09-19,5.9486
2017-09-20,5.9486
2017-09-21,5.9486
2017-09-22,5.9486
2017-09-25,5.7641
2017-09-26,5.9947
2017-09-27,6.0408
2017-09-28,5.9486
2017-09-29,5.9947
2017-10-02,5.9024
2017-10-03,5.9486
2017-10-04,6.0408
2017-10-05,5.9486
2017-10-06,6.0408
2017-10-09,6.0177
2017-10-10,6.0869
2017-10-11,5.9486
2017-10-12,5.8563
2017-10-13,5.9947
2017-10-16,5.8102
2017-10-17,5.8102
2017-10-18,5.9486
2017-10-19,5.9024
2017-10-20,6.0869
2017-10-23,5.8102
2017-10-24,5.8563
2017-10-25,5.8102
2017-10-26,5.5566
2017-10-27,5.718
2017-10-30,5.6719
2017-10-31,5.6027
2017-11-01,5.6258
2017-11-02,5.6258
2017-11-03,5.6258
2017-11-06,5.6719
2017-11-07,5.5241
2017-11-08,5.4874
2017-11-09,5.5797
2017-11-10,5.5797
2017-11-13,5.4874
2017-11-14,5.4413
2017-11-15,5.303
2017-11-16,5.3491
2017-11-17,5.4874
2017-11-20,5.4874
2017-11-21,5.4874
2017-11-22,5.5797
2017-11-24,5.6258
2017-11-27,5.8148
2017-11-28,6.0408
2017-11-29,5.9024
2017-11-30,5.9486
2017-12-01,5.9947
2017-12-04,5.9024
2017-12-05,5.8563
2017-12-06,5.8102
2017-12-07,5.7872
2017-12-08,5.8978
2017-12-11,5.9024
2017-12-12,5.9486
2017-12-13,6.1238
2017-12-14,6.0258
2017-12-15,5.9277
2017-12-18,6.0678
2017-12-19,6.0678
2017-12-20,6.0678
2017-12-21,6.1145
2017-12-22,6.0211
2017-12-26,6.1145
2017-12-27,6.1611
2017-12-28,5.9744
2017-12-29,6.0211
2018-01-02,6.1611
2018-01-03,6.6746
2018-01-04,6.7212
2018-01-05,6.7446
2018-01-08,6.7679
2018-01-09,6.6746
2018-01-10,6.6746
2018-01-11,6.6746
2018-01-12,6.6746
2018-01-16,6.6746
2018-01-17,6.8146
2018-01-18,6.7212
2018-01-19,6.7632
2018-01-22,6.8146
2018-01-23,6.9079
2018-01-24,6.9546
2018-01-25,6.8613
2018-01-26,6.9079
2018-01-29,6.8846
2018-01-30,6.7679
2018-01-31,6.6279
2018-02-01,6.7212
2018-02-02,6.7035
2018-02-05,6.6746
2018-02-06,6.5812
2018-02-07,6.7212
2018-02-08,6.0911
2018-02-09,5.9821
2018-02-12,6.0678
2018-02-13,6.2078
2018-02-14,6.1145
2018-02-15,6.0911
2018-02-16,6.1611
2018-02-20,6.0678
2018-02-21,6.0678
2018-02-22,6.0048
2018-02-23,6.0211
2018-02-26,5.9277
2018-02-27,6.0678
2018-02-28,6.0678
2018-03-01,5.9277
2018-03-02,6.0211
2018-03-05,6.0211
2018-03-06,5.9744
2018-03-07,5.8811
2018-03-08,5.9044
2018-03-09,5.8811
2018-03-12,5.8811
2018-03-13,5.8344
2018-03-14,5.8344
2018-03-15,5.8155
2018-03-16,5.8155
2018-03-19,5.7682
2018-03-20,5.7209
2018-03-21,5.7209
2018-03-22,5.6736
2018-03-23,5.6736
2018-03-26,5.6736
2018-03-27,5.5791
2018-03-28,5.5791
2018-03-29,5.5791
2018-04-02,5.5318
2018-04-03,5.5791
2018-04-04,5.5791
2018-04-05,5.5791
2018-04-06,5.6216
2018-04-09,5.5271
2018-04-10,5.5791
2018-04-11,5.5791
2018-04-12,5.5791
2018-04-13,5.5318
2018-04-16,5.4845
2018-04-17,5.4609
2018-04-18,5.4372
2018-04-19,5.4372
2018-04-20,5.4372
2018-04-23,5.39
2018-04-24,5.4845
2018-04-25,5.5507
2018-04-26,5.5791
2018-04-27,5.7209
2018-04-30,5.5791
2018-05-01,5.6264
2018-05-02,5.5318
2018-05-03,5.4845
2018-05-04,5.5791
2018-05-07,5.6216
2018-05-08,5.6264
2018-05-09,5.5791
2018-05-10,5.5318
2018-05-11,5.5318
2018-05-14,5.5791
2018-05-15,5.6475
2018-05-16,5.6264
2018-05-17,5.6264
2018-05-18,5.6264
2018-05-21,5.7162
2018-05-22,5.6736
2018-05-23,5.6642
2018-05-24,5.6736
2018-05-25,5.6264
2018-05-29,5.5318
2018-05-30,5.6736
2018-05-31,5.4798
2018-06-01,5.4845
2018-06-04,5.39
2018-06-05,5.2954
2018-06-06,5.2481
2018-06-07,5.2008
2018-06-08,5.2008
2018-06-11,5.2481
2018-06-12,5.3427
2018-06-13,5.5791
2018-06-14,5.512
2018-06-15,5.512
2018-06-18,5.512
2018-06-19,5.512
2018-06-20,5.5599
2018-06-21,5.4161
2018-06-22,5.3682
2018-06-25,5.2723
2018-06-26,5.3203
2018-06-27,5.3565
2018-06-28,5.3682
2018-06-29,5.4641
2018-07-02,5.3682
2018-07-03,5.3571
2018-07-05,5.3682
2018-07-06,5.3203
2018-07-09,5.2723
2018-07-10,5.1285
2018-07-11,5.1765
2018-07-12,5.1765
2018-07-13,5.2244
2018-07-16,5.1765
2018-07-17,5.1285
2018-07-18,5.1285
2018-07-19,5.1285
2018-07-20,5.1525
2018-07-23,5.1285
2018-07-24,5.0806
2018-07-25,4.9847
2018-07-26,5.0161
2018-07-27,5.0327
2018-07-30,5.2244
2018-07-31,5.0806
2018-08-01,5.1765
2018-08-02,5.1765
2018-08-03,5.1285
2018-08-06,5.1525
2018-08-07,5.1004
2018-08-08,5.2071
2018-08-09,5.501
2018-08-10,5.6558
2018-08-13,5.5695
2018-08-14,5.512
2018-08-15,5.6078
2018-08-16,5.6558
2018-08-17,5.5599
2018-08-20,5.6078
2018-08-21,5.5599
2018-08-22,5.5216
2018-08-23,5.523
2018-08-24,5.4641
2018-08-27,5.4641
2018-08-28,5.2244
2018-08-29,5.343
2018-08-30,5.4641
2018-08-31,5.6078
2018-09-04,5.6078
2018-09-05,5.7468
2018-09-06,5.7948
2018-09-07,5.7996
2018-09-10,5.7996
2018-09-11,5.7996
2018-09-12,5.8475
2018-09-13,5.9252
2018-09-14,5.8281
2018-09-17,5.7309
2018-09-18,5.5852
2018-09-19,5.5367
2018-09-20,5.7309
2018-09-21,5.7795
2018-09-24,5.6824
2018-09-25,5.5367
2018-09-26,5.5852
2018-09-27,5.4881
2018-09-28,5.5367
2018-10-01,5.5367
2018-10-02,5.4492
2018-10-03,5.4201
2018-10-04,5.2647
2018-10-05,5.2453
2018-10-08,5.2453
2018-10-09,5.1287
2018-10-10,5.1287
2018-10-11,5.0801
2018-10-12,5.1481
2018-10-15,5.1578
2018-10-16,5.3618
2018-10-17,5.1774
2018-10-18,5.1676
2018-10-19,5.1578
2018-10-22,5.1578
2018-10-23,5.1481
2018-10-24,5.0991
2018-10-25,5.0898
2018-10-26,5.051
2018-10-29,5.1287
2018-10-30,5.0976
2018-10-31,5.1093
2018-11-01,5.1773
2018-11-02,5.1481
2018-11-05,5.051
2018-11-06,5.0801
2018-11-07,5.0121
2018-11-08,5.7309
2018-11-09,5.7596
2018-11-12,5.6532
2018-11-13,5.6241
2018-11-14,5.513
2018-11-15,5.7892
2018-11-16,5.6921
2018-11-19,5.7406
2018-11-20,5.7018
2018-11-21,5.7795
2018-11-23,5.5075
2018-11-26,5.5367
2018-11-27,5.7009
2018-11-28,5.8183
2018-11-29,5.8042
2018-11-30,5.6144
2018-12-03,5.8572
2018-12-04,5.6532
2018-12-06,5.5367
2018-12-07,5.6241
2018-12-10,5.5658
2018-12-11,5.6629
2018-12-12,5.6435
2018-12-13,5.5943
2018-12-14,5.7912
2018-12-17,5.8109
2018-12-18,5.7617
2018-12-19,5.6103
2018-12-20,5.3973
2018-12-21,5.3579
2018-12-24,5.3973
2018-12-26,5.3185
2018-12-27,5.3086
2018-12-28,5.3903
2018-12-31,5.3185
2019-01-02,5.8405
2019-01-03,5.7912
2019-01-04,5.8996
2019-01-07,5.8503
2019-01-08,5.8389
2019-01-09,5.8675
2019-01-10,5.7223
2019-01-11,5.7322
2019-01-14,5.5943
2019-01-15,5.4958
2019-01-16,5.5943
2019-01-17,5.6041
2019-01-18,5.7741
2019-01-22,5.8011
2019-01-23,5.7806
2019-01-24,5.6928
2019-01-25,5.6805
2019-01-28,5.7817
2019-01-29,5.7826
2019-01-30,5.8096
2019-01-31,5.7568
2019-02-01,5.8011
2019-02-04,5.8011
2019-02-05,5.6632
2019-02-06,5.7617
2019-02-07,5.417
2019-02-08,5.4761
2019-02-11,5.5352
2019-02-12,5.5056
2019-02-13,5.545
2019-02-14,5.614
2019-02-15,5.5549
2019-02-19,5.4393
2019-02-20,5.4367
2019-02-21,5.5746
2019-02-22,5.4662
2019-02-25,5.4268
2019-02-26,5.3776
2019-02-27,5.3677
2019-02-28,5.3677
2019-03-01,5.3284
2019-03-04,5.2988
2019-03-05,5.3195
2019-03-06,5.1511
2019-03-07,5.1905
2019-03-08,5.2268
2019-03-11,5.3677
2019-03-12,5.1609
2019-03-13,5.22
2019-03-14,5.2
2019-03-15,5.2
2019-03-18,5.2266
2019-03-19,5.19
2019-03-20,5.165
2019-03-21,5.14
2019-03-22,5.1595
2019-03-25,5.16
2019-03-26,5.22
2019-03-27,5.175
2019-03-28,5.1531
2019-03-29,5.16
2019-04-01,5.15
2019-04-02,5.17
2019-04-03,5.22
2019-04-04,5.2
2019-04-05,5.15
2019-04-08,5.12
2019-04-09,5.0256
2019-04-10,4.79
2019-04-11,4.915
2019-04-12,4.9
2019-04-15,5
2019-04-16,4.98
2019-04-17,4.79
2019-04-18,4.9202
2019-04-22,4.97
2019-04-23,5.05
2019-04-24,5.07
2019-04-25,5.1
2019-04-26,5.13
2019-04-29,5.2
2019-04-30,5.2
2019-05-01,5.2
2019-05-02,5.2
2019-05-03,5.2
2019-05-06,5.23
2019-05-07,5.2
2019-05-08,5.2605
2019-05-09,5.2
2019-05-10,5.3899
2019-05-13,5.23
2019-05-14,4.51
2019-05-15,4.73
2019-05-16,4.8484
2019-05-17,4.76
2019-05-20,4.83
2019-05-21,4.76
2019-05-22,4.8
2019-05-23,4.8599
2019-05-24,4.9
2019-05-28,4.8999
2019-05-29,5.0595
2019-05-30,5.06
2019-05-31,5.03
2019-06-03,5
2019-06-04,5.05
2019-06-05,4.95
2019-06-06,5
2019-06-07,4.89
2019-06-10,4.82
2019-06-11,4.68
2019-06-12,4.8
2019-06-13,4.8
2019-06-14,4.48
2019-06-17,4.48
2019-06-18,4.48
2019-06-19,4.48
2019-06-20,4.5
2019-06-21,4.5
2019-06-24,4.5
2019-06-25,4.5
2019-06-26,4.5
2019-06-27,4.455
2019-06-28,4.455
2019-07-01,4.51
2019-07-02,4.51
2019-07-03,4.51
2019-07-04,4.51
2019-07-05,4.51
2019-07-08,4.45
2019-07-09,4.41
2019-07-10,4.485
2019-07-11,4.485
2019-07-12,4.485
2019-07-15,4.485
2019-07-16,4.52
2019-07-17,4.55
2019-07-18,4.55
2019-07-19,4.54
2019-07-22,4.615
2019-07-23,4.615
2019-07-24,4.615
2019-07-25,4.59
2019-07-26,4.59
2019-07-29,4.62
2019-07-30,4.62
2019-07-31,4.705
2019-08-01,4.725
2019-08-02,4.725
2019-08-05,4.725
2019-08-06,4.72
2019-08-07,4.72
2019-08-08,4.72
2019-08-09,4.72
2019-08-12,4.865
2019-08-13,4.865
2019-08-14,5.1
2019-08-15,5.25
2019-08-16,5.25
2019-08-19,5.26
2019-08-20,5.26
2019-08-21,5.26
2019-08-22,5.26
2019-08-23,5.26
2019-08-26,5.25
2019-08-27,5.26
2019-08-28,5.3
2019-08-29,5.3
2019-08-30,5.3
2019-09-02,5.3
2019-09-03,5.3
2019-09-04,5.38
2019-09-05,5.38
2019-09-06,5.38
2019-09-09,5.425
2019-09-10,5.41
2019-09-11,5.31
2019-09-12,5.27
2019-09-13,5.26
2019-09-16,5.36
2019-09-17,5.42
2019-09-18,5.32
2019-09-19,5.32
2019-09-20,5.3
2019-09-23,5.425
2019-09-24,5.47
2019-09-25,5.41
2019-09-26,5.52
2019-09-27,5.95
2019-09-30,6.09
2019-10-01,6.03
2019-10-02,6.04
2019-10-03,6.02
2019-10-04,6.01
2019-10-07,6.09
2019-10-08,6.27
2019-10-09,6.39
2019-10-10,6.405
2019-10-11,6.405
2019-10-14,6.61
2019-10-15,6.61
2019-10-16,6.61
2019-10-17,6.61
2019-10-18,6.44
2019-10-21,6.44
2019-10-22,6.345
2019-10-23,6.25
2019-10-24,6.25
2019-10-25,6.3
2019-10-28,6.3
2019-10-29,5.86
2019-10-30,5.8
2019-10-31,6.01
2019-11-01,6.5
2019-11-04,7.005
2019-11-05,7.185
2019-11-06,7.2
2019-11-07,7.05
2019-11-08,7.085
2019-11-11,7.22
2019-11-12,7.37
2019-11-13,7.77
2019-11-14,7.43
2019-11-15,7.41
2019-11-18,7.46
2019-11-19,7.1
2019-11-20,6.61
2019-11-21,6.5
2019-11-22,6.89
2019-11-25,6.63
