date,close
2013-03-28,9.82
2013-04-01,9.74
2013-04-02,9.79
2013-04-03,9.32
2013-04-04,9.37
2013-04-05,9.24
2013-04-08,9.49
2013-04-09,9.41
2013-04-10,9.72
2013-04-11,10.43
2013-04-12,9.97
2013-04-15,8.96
2013-04-16,9.52
2013-04-17,8.99
2013-04-18,9.1
2013-04-19,8.74
2013-04-22,9.23
2013-04-23,9.79
2013-04-24,9.9
2013-04-25,9.27
2013-04-26,9.31
2013-04-29,9.44
2013-04-30,9.5
2013-05-01,9.17
2013-05-02,9.72
2013-05-03,9.9
2013-05-06,9.99
2013-05-07,10
2013-05-08,9.95
2013-05-09,7.9
2013-05-10,7.22
2013-05-13,7.42
2013-05-14,7.42
2013-05-15,7.39
2013-05-16,7.18
2013-05-17,6.99
2013-05-20,7.11
2013-05-21,6.85
2013-05-22,6.74
2013-05-23,6.8
2013-05-24,6.78
2013-05-28,6.73
2013-05-29,6.61
2013-05-30,6.73
2013-05-31,6.73
2013-06-03,6.64
2013-06-04,6.66
2013-06-05,6.43
2013-06-06,6.71
2013-06-07,6.94
2013-06-10,7.08
2013-06-11,6.99
2013-06-12,6.98
2013-06-13,6.89
2013-06-14,6.79
2013-06-17,6.85
2013-06-18,6.9
2013-06-19,6.75
2013-06-20,6.43
2013-06-21,6.56
2013-06-24,6.37
2013-06-25,6.4
2013-06-26,6.37
2013-06-27,6.19
2013-06-28,6.14
2013-07-01,6.26
2013-07-02,6.51
2013-07-03,6.39
2013-07-05,6.52
2013-07-08,6.5
2013-07-09,7.31
2013-07-10,7.35
2013-07-11,7.2
2013-07-12,7
2013-07-15,6.87
2013-07-16,6.99
2013-07-17,6.97
2013-07-18,6.95
2013-07-19,7.14
2013-07-22,8.14
2013-07-23,7.56
2013-07-24,7.43
2013-07-25,7.53
2013-07-26,7.36
2013-07-29,7.12
2013-07-30,7.23
2013-07-31,7.18
2013-08-01,7.29
2013-08-02,7.34
2013-08-05,7.68
2013-08-06,7.45
2013-08-07,7.24
2013-08-08,7.44
2013-08-09,8.9
2013-08-12,9.18
2013-08-13,9.41
2013-08-14,9.39
2013-08-15,9.48
2013-08-16,9.47
2013-08-19,9.32
2013-08-20,9.39
2013-08-21,9.33
2013-08-22,9.59
2013-08-23,9.71
2013-08-26,9.72
2013-08-27,9.27
2013-08-28,9.54
2013-08-29,9.29
2013-08-30,9.11
2013-09-03,9.11
2013-09-04,9.23
2013-09-05,9.41
2013-09-06,9.6
2013-09-09,9.72
2013-09-10,9.55
2013-09-11,9.68
2013-09-12,9.28
2013-09-13,9.34
2013-09-16,8.99
2013-09-17,9.26
2013-09-18,9.2
2013-09-19,9.61
2013-09-20,9.45
2013-09-23,9.45
2013-09-24,9.45
2013-09-25,9.5
2013-09-26,9.52
2013-09-27,9.21
2013-09-30,9.18
2013-10-01,9.38
2013-10-02,9.35
2013-10-03,9.24
2013-10-04,9.4
2013-10-07,9.26
2013-10-08,8.86
2013-10-09,8.64
2013-10-10,9.29
2013-10-11,9.53
2013-10-14,9.23
2013-10-15,9.21
2013-10-16,9.59
2013-10-17,9.68
2013-10-18,9.98
2013-10-21,10.01
2013-10-22,9.85
2013-10-23,9.81
2013-10-24,10.04
2013-10-25,9.96
2013-10-28,10.09
2013-10-29,10.15
2013-10-30,9.95
2013-10-31,9.76
2013-11-01,9.73
2013-11-04,9.96
2013-11-05,10.08
2013-11-06,9.65
2013-11-07,8.44
2013-11-08,8.89
2013-11-11,8.5
2013-11-12,8.58
2013-11-13,9.04
2013-11-14,8.77
2013-11-15,9.36
2013-11-18,9
2013-11-19,8.73
2013-11-20,8.67
2013-11-21,8.67
2013-11-22,8.66
2013-11-25,8.71
2013-11-26,8.67
2013-11-27,8.73
2013-11-29,8.77
2013-12-02,8.17
2013-12-03,8.3
2013-12-04,8.12
2013-12-05,8.16
2013-12-06,8.14
2013-12-09,8
2013-12-10,8.36
2013-12-11,8.15
2013-12-12,8.47
2013-12-13,8.45
2013-12-16,8.65
2013-12-17,8.75
2013-12-18,8.99
2013-12-19,8.83
2013-12-20,8.73
2013-12-23,8.93
2013-12-24,9.1
2013-12-26,9.1
2013-12-27,9.37
2013-12-30,9.21
2013-12-31,9.42
2014-01-02,9.25
2014-01-03,9.38
2014-01-06,9.2
2014-01-07,9.35
2014-01-08,9.26
2014-01-09,9.34
2014-01-10,9.35
2014-01-13,9.25
2014-01-14,9.23
2014-01-15,9.17
2014-01-16,9.08
2014-01-17,8.9
2014-01-21,9.07
2014-01-22,9.18
2014-01-23,9.01
2014-01-24,8.65
2014-01-27,8.39
2014-01-28,8.44
2014-01-29,8.35
2014-01-30,8.43
2014-01-31,8.35
2014-02-03,8.02
2014-02-04,7.97
2014-02-05,7.89
2014-02-06,8.01
2014-02-07,8.01
2014-02-10,8
2014-02-11,8.15
2014-02-12,8.16
2014-02-13,8.34
2014-02-14,8.44
2014-02-18,8.72
2014-02-19,8.53
2014-02-20,8.68
2014-02-21,8.73
2014-02-24,8.71
2014-02-25,8.94
2014-02-26,8.79
2014-02-27,8.74
2014-02-28,9.88
2014-03-03,10.05
2014-03-04,10.87
2014-03-05,10.63
2014-03-06,10.66
2014-03-07,10.47
2014-03-10,10.4
2014-03-11,10.13
2014-03-12,10.27
2014-03-13,10.56
2014-03-14,10.92
2014-03-17,11.03
2014-03-18,11.28
2014-03-19,11.6
2014-03-20,11.9
2014-03-21,12.11
2014-03-24,11.77
2014-03-25,11.65
2014-03-26,11.36
2014-03-27,11.73
2014-03-28,12.07
2014-03-31,12.62
2014-04-01,12.84
2014-04-02,12.74
2014-04-03,12.7
2014-04-04,12.15
2014-04-07,11.93
2014-04-08,12.06
2014-04-09,12.13
2014-04-10,12.13
2014-04-11,12.09
2014-04-14,11.6
2014-04-15,11.63
2014-04-16,11.57
2014-04-17,11.93
2014-04-21,11.73
2014-04-22,11.7
2014-04-23,11.65
2014-04-24,11.75
2014-04-25,11.37
2014-04-28,10.99
2014-04-29,11.51
2014-04-30,11.11
2014-05-01,10.96
2014-05-02,10.86
2014-05-05,10.83
2014-05-06,10.64
2014-05-07,10.87
2014-05-08,10.81
2014-05-09,10.75
2014-05-12,11.1
2014-05-13,11.11
2014-05-14,10.96
2014-05-15,10.72
2014-05-16,10.67
2014-05-19,10.97
2014-05-20,11.17
2014-05-21,11.21
2014-05-22,11.26
2014-05-23,11.51
2014-05-27,11.72
2014-05-28,12.08
2014-05-29,11.95
2014-05-30,12.16
2014-06-02,12.02
2014-06-03,11.86
2014-06-04,11.94
2014-06-05,12.34
2014-06-06,12.72
2014-06-09,12.94
2014-06-10,12.9
2014-06-11,13.07
2014-06-12,13.39
2014-06-13,13.5
2014-06-16,13.59
2014-06-17,13.29
2014-06-18,13.29
2014-06-19,12.89
2014-06-20,12.95
2014-06-23,12.7
2014-06-24,12.25
2014-06-25,12.36
2014-06-26,12.42
2014-06-27,12.12
2014-06-30,12.35
2014-07-01,12.51
2014-07-02,12.53
2014-07-03,12.59
2014-07-07,12.26
2014-07-08,12.21
2014-07-09,12.16
2014-07-10,11.85
2014-07-11,12.07
2014-07-14,12.24
2014-07-15,12.05
2014-07-16,11.95
2014-07-17,11.99
2014-07-18,11.98
2014-07-21,11.84
2014-07-22,12.13
2014-07-23,12.07
2014-07-24,12.13
2014-07-25,12.15
2014-07-28,12
2014-07-29,11.86
2014-07-30,12.01
2014-07-31,11.59
2014-08-01,11.58
2014-08-04,11.69
2014-08-05,10.63
2014-08-06,10.65
2014-08-07,10.34
2014-08-08,10.64
2014-08-11,10.77
2014-08-12,10.65
2014-08-13,10.73
2014-08-14,10.75
2014-08-15,10.74
2014-08-18,10.91
2014-08-19,10.98
2014-08-20,10.76
2014-08-21,10.76
2014-08-22,10.69
2014-08-25,11.28
2014-08-26,11.11
2014-08-27,11.04
2014-08-28,10.71
2014-08-29,10.94
2014-09-02,10.82
2014-09-03,10.6
2014-09-04,10.45
2014-09-05,10.44
2014-09-08,10.4
2014-09-09,10.16
2014-09-10,10.3
2014-09-11,10.17
2014-09-12,10
2014-09-15,9.99
2014-09-16,10.08
2014-09-17,9.93
2014-09-18,10.01
2014-09-19,9.71
2014-09-22,9.37
2014-09-23,9.21
2014-09-24,9.08
2014-09-25,8.75
2014-09-26,8.83
2014-09-29,8.7
2014-09-30,8.33
2014-10-01,8.23
2014-10-02,8.18
2014-10-03,8.07
2014-10-06,7.75
2014-10-07,7.68
2014-10-08,7.89
2014-10-09,7.41
2014-10-10,7.06
2014-10-13,6.9
2014-10-14,6.73
2014-10-15,6.84
2014-10-16,7.34
2014-10-17,7.12
2014-10-20,7.46
2014-10-21,7.65
2014-10-22,4.9
2014-10-23,5.19
2014-10-24,5.55
2014-10-27,5.39
2014-10-28,5.48
2014-10-29,5.55
2014-10-30,4.57
2014-10-31,5.87
2014-11-03,5.62
2014-11-04,5.44
2014-11-05,5.74
2014-11-06,5.63
2014-11-07,5.62
2014-11-10,5.39
2014-11-11,5.25
2014-11-12,5.26
2014-11-13,4.57
2014-11-14,4.71
2014-11-17,4.7
2014-11-18,4.78
2014-11-19,4.91
2014-11-20,5.16
2014-11-21,5.06
2014-11-24,4.96
2014-11-25,4.71
2014-11-26,4.82
2014-11-28,4.55
2014-12-01,4.12
2014-12-02,4.29
2014-12-03,4.42
2014-12-04,4.98
2014-12-05,4.66
2014-12-08,4.25
2014-12-09,4.53
2014-12-10,4.14
2014-12-11,4.31
2014-12-12,4.26
2014-12-15,4.01
2014-12-16,5
2014-12-17,5.36
2014-12-18,5.45
2014-12-19,5.83
2014-12-22,5.7
2014-12-23,6.2
2014-12-24,6.07
2014-12-26,6.17
2014-12-29,6.24
2014-12-30,6.19
2014-12-31,6.27
2015-01-02,6.29
2015-01-05,5.39
2015-01-06,5.4
2015-01-07,5.29
2015-01-08,5.42
2015-01-09,5.38
2015-01-12,5.32
2015-01-13,5.32
2015-01-14,5.37
2015-01-15,5.27
2015-01-16,5.34
2015-01-20,5.17
2015-01-21,5.4
2015-01-22,5.45
2015-01-23,5.55
2015-01-26,5.36
2015-01-27,5.8
2015-01-28,5.46
2015-01-29,5.66
2015-01-30,5.58
2015-02-02,5.75
2015-02-03,5.75
2015-02-04,5.71
2015-02-05,6.25
2015-02-06,6.23
2015-02-09,6.6
2015-02-10,6.3
2015-02-11,6.27
2015-02-12,6.41
2015-02-13,6.69
2015-02-17,6.93
2015-02-18,6.7
2015-02-19,6.71
2015-02-20,6.56
2015-02-23,6.61
2015-02-24,6.67
2015-02-25,6.68
2015-02-26,6.72
2015-02-27,6.34
2015-03-02,6.29
2015-03-03,6.49
2015-03-04,6.34
2015-03-05,6.45
2015-03-06,6.1
2015-03-09,6.05
2015-03-10,5.75
2015-03-11,5.79
2015-03-12,5.89
2015-03-13,5.6
2015-03-16,5.53
2015-03-17,5.48
2015-03-18,2.69
2015-03-19,3.1
2015-03-20,3.07
2015-03-23,2.99
2015-03-24,3.2
2015-03-25,3.17
2015-03-26,3.42
2015-03-27,3.29
2015-03-30,3.42
2015-03-31,3.31
2015-04-01,2.96
2015-04-02,3.05
2015-04-06,3.11
2015-04-07,2.86
2015-04-08,2.81
2015-04-09,2.64
2015-04-10,2.63
2015-04-13,2.68
2015-04-14,2.65
2015-04-15,2.78
2015-04-16,2.81
2015-04-17,2.71
2015-04-20,2.63
2015-04-21,2.76
2015-04-22,2.82
2015-04-23,2.76
2015-04-24,2.61
2015-04-27,2.51
2015-04-28,2.63
2015-04-29,2.55
2015-04-30,2.5
2015-05-01,2.49
2015-05-04,2.59
2015-05-05,2.51
2015-05-06,2.57
2015-05-07,2.5
2015-05-08,2.48
2015-05-11,2.44
2015-05-12,2.48
2015-05-13,2.51
2015-05-14,2.35
2015-05-15,2.23
2015-05-18,2.17
2015-05-19,2.01
2015-05-20,2.12
2015-05-21,2.2
2015-05-22,2.17
2015-05-26,2
2015-05-27,1.98
2015-05-28,1.92
2015-05-29,1.86
2015-06-01,1.68
2015-06-02,1.6
2015-06-03,1.7
2015-06-04,1.77
2015-06-05,1.88
2015-06-08,1.84
2015-06-09,1.9
2015-06-10,1.94
2015-06-11,1.91
2015-06-12,1.81
2015-06-15,1.85
2015-06-16,1.82
2015-06-17,1.79
2015-06-18,1.77
2015-06-19,1.62
2015-06-22,1.58
2015-06-23,1.47
2015-06-24,1.31
2015-06-25,1.32
2015-06-26,1.36
2015-06-29,1.31
2015-06-30,1.28
2015-07-01,1.16
2015-07-02,1.31
2015-07-06,1.23
2015-07-07,1.17
2015-07-08,1.08
2015-07-09,1.03
2015-07-10,1.01
2015-07-13,1.07
2015-07-14,1.08
2015-07-15,1.04
2015-07-16,0.9057
2015-07-17,0.86
2015-07-20,0.837
2015-07-21,0.8101
2015-07-22,0.86
2015-07-23,0.87
2015-07-24,0.8142
2015-07-27,0.7948
2015-07-28,0.84
2015-07-29,0.83
2015-07-30,0.85
2015-07-31,0.81
2015-08-03,0.8277
2015-08-04,0.8
2015-08-05,0.81
2015-08-06,0.91
2015-08-07,0.8298
2015-08-10,0.7765
2015-08-11,0.75
2015-08-12,0.7534
2015-08-13,0.7645
2015-08-14,0.7992
2015-08-17,0.7535
2015-08-18,0.725
2015-08-19,0.725
2015-08-20,0.738
2015-08-21,0.7515
2015-08-24,0.85
2015-08-25,0.8111
2015-08-26,0.7891
2015-08-27,0.8251
2015-08-28,0.8
2015-08-31,0.9005
2015-09-01,1.02
2015-09-02,0.95
2015-09-03,1.06
2015-09-04,1.16
2015-09-08,1.63
2015-09-09,1.57
2015-09-10,1.565
2015-09-11,1.46
2015-09-14,1.36
2015-09-15,1.3
2015-09-16,1.47
2015-09-17,1.41
2015-09-18,1.53
2015-09-21,1.54
2015-09-22,1.66
2015-09-23,1.48
2015-09-24,1.49
2015-09-25,1.45
2015-09-28,1.33
2015-09-29,1.3
2015-09-30,1.26
2015-10-01,1.33
2015-10-02,1.42
2015-10-05,1.86
2015-10-06,2.33
2015-10-07,2.45
2015-10-08,2.57
2015-10-09,2.78
2015-10-12,2.51
2015-10-13,2.4
2015-10-14,2.59
2015-10-15,2.46
2015-10-16,2.48
2015-10-19,2.27
2015-10-20,2.28
2015-10-21,2.16
2015-10-22,2.16
2015-10-23,2.07
2015-10-26,1.96
2015-10-27,1.97
2015-10-28,2.01
2015-10-29,1.94
2015-10-30,2
2015-11-02,2.08
2015-11-03,2.15
2015-11-04,2.29
2015-11-05,2.31
2015-11-06,2.35
2015-11-09,2.38
2015-11-10,2.37
2015-11-11,2.18
2015-11-12,2.13
2015-11-13,2.47
2015-11-16,2.47
2015-11-17,2.45
2015-11-18,2.53
2015-11-19,2.69
2015-11-20,2.58
2015-11-23,2.58
2015-11-24,2.85
2015-11-25,2.8
2015-11-27,2.79
2015-11-30,2.97
2015-12-01,3.19
2015-12-02,3.17
2015-12-03,3.01
2015-12-04,2.78
2015-12-07,2.62
2015-12-08,2.4
2015-12-09,2.47
2015-12-10,2.4
2015-12-11,2.35
2015-12-14,2.33
2015-12-15,2.36
2015-12-16,2.41
2015-12-17,2.49
2015-12-18,2.47
2015-12-21,2.4
2015-12-22,2.59
2015-12-23,2.84
2015-12-24,2.67
2015-12-28,2.51
2015-12-29,2.7
2015-12-30,2.66
2015-12-31,2.69
2016-01-04,3.04
2016-01-05,3.01
2016-01-06,2.78
2016-01-07,2.6
2016-01-08,2.58
2016-01-11,2.4
2016-01-12,2.22
2016-01-13,2.05
2016-01-14,2.17
2016-01-15,2.09
2016-01-19,1.94
2016-01-20,1.86
2016-01-21,1.96
2016-01-22,2.13
2016-01-25,1.92
2016-01-26,1.99
2016-01-27,1.93
2016-01-28,1.95
2016-01-29,1.94
2016-02-01,1.88
2016-02-02,1.7
2016-02-03,1.7
2016-02-04,1.79
2016-02-05,1.71
2016-02-08,1.6
2016-02-09,1.54
2016-02-10,1.4
2016-02-11,1.34
2016-02-12,1.32
2016-02-16,1.18
2016-02-17,1.48
2016-02-18,1.43
2016-02-19,1.42
2016-02-22,1.44
2016-02-23,1.35
2016-02-24,1.37
2016-02-25,1.27
2016-02-26,1.33
2016-02-29,1.31
2016-03-01,1.38
2016-03-02,1.66
2016-03-03,1.82
2016-03-04,1.86
2016-03-07,1.86
2016-03-08,1.7
2016-03-09,1.76
2016-03-10,1.94
2016-03-11,2.22
2016-03-14,2.21
2016-03-15,2.1
2016-03-16,2.12
2016-03-17,2.1
2016-03-18,1.77
2016-03-21,2.12
2016-03-22,2.08
2016-03-23,2.02
2016-03-24,2.08
2016-03-28,2.04
2016-03-29,2.12
2016-03-30,2.1
2016-03-31,2.13
2016-04-01,2.07
2016-04-04,2.06
2016-04-05,2.06
2016-04-06,2.07
2016-04-07,2.02
2016-04-08,2.12
2016-04-11,2.07
2016-04-12,2.13
2016-04-13,2.2
2016-04-14,2.16
2016-04-15,2.47
2016-04-18,2.31
2016-04-19,2.41
2016-04-20,2.51
2016-04-21,2.57
2016-04-22,2.49
2016-04-25,2.54
2016-04-26,2.59
2016-04-27,3.17
2016-04-28,3.19
2016-04-29,3.2
2016-05-02,3.26
2016-05-03,2.91
2016-05-04,2.91
2016-05-05,2.83
2016-05-06,3
2016-05-09,2.84
2016-05-10,3.04
2016-05-11,3.11
2016-05-12,2.9
2016-05-13,2.92
2016-05-16,3.11
2016-05-17,3.2
2016-05-18,3.01
2016-05-19,3.09
2016-05-20,3.07
2016-05-23,3.07
2016-05-24,3.14
2016-05-25,3.1
2016-05-26,3.01
2016-05-27,3.02
2016-05-31,3.24
2016-06-01,3.16
2016-06-02,2.93
2016-06-03,2.84
2016-06-06,2.99
2016-06-07,3.02
2016-06-08,3.1
2016-06-09,3.02
2016-06-10,2.94
2016-06-13,2.75
2016-06-14,2.95
2016-06-15,2.89
2016-06-16,2.79
2016-06-17,2.78
2016-06-20,2.85
2016-06-21,2.9
2016-06-22,2.82
2016-06-23,3.01
2016-06-24,2.95
2016-06-27,2.5
2016-06-28,2.49
2016-06-29,2.44
2016-06-30,2.53
2016-07-01,2.59
2016-07-05,2.63
2016-07-06,2.52
2016-07-07,2.49
2016-07-08,2.64
2016-07-11,2.62
2016-07-12,2.77
2016-07-13,2.61
2016-07-14,2.55
2016-07-15,2.61
2016-07-18,2.58
2016-07-19,2.49
2016-07-20,2.43
2016-07-21,2.33
2016-07-22,2.32
2016-07-25,2.22
2016-07-26,2.21
2016-07-27,2.19
2016-07-28,2.14
2016-07-29,2.05
2016-08-01,1.8
2016-08-02,1.5
2016-08-03,1.62
2016-08-04,1.68
2016-08-05,1.68
2016-08-08,1.9
2016-08-09,1.85
2016-08-10,1.84
2016-08-11,1.79
2016-08-12,1.79
2016-08-15,1.9
2016-08-16,1.95
2016-08-17,1.93
2016-08-18,2.07
2016-08-19,2.02
2016-08-22,1.94
2016-08-23,2.01
2016-08-24,1.96
2016-08-25,1.96
2016-08-26,1.95
2016-08-29,1.95
2016-08-30,1.96
2016-08-31,1.94
2016-09-01,1.89
2016-09-02,1.9
2016-09-06,1.99
2016-09-07,2.08
2016-09-08,2.12
2016-09-09,1.91
2016-09-12,1.96
2016-09-13,1.85
2016-09-14,1.79
2016-09-15,1.82
2016-09-16,1.75
2016-09-19,1.8
2016-09-20,1.77
2016-09-21,1.79
2016-09-22,1.83
2016-09-23,1.82
2016-09-26,1.8
2016-09-27,1.76
2016-09-28,1.87
2016-09-29,1.95
2016-09-30,1.88
2016-10-03,1.89
2016-10-04,1.87
2016-10-05,1.91
2016-10-06,1.9
2016-10-07,1.86
2016-10-10,1.93
2016-10-11,1.85
2016-10-12,1.86
2016-10-13,1.79
2016-10-14,1.76
2016-10-17,1.74
2016-10-18,1.77
2016-10-19,1.86
2016-10-20,1.92
2016-10-21,1.83
2016-10-24,1.84
2016-10-25,1.8
2016-10-26,1.74
2016-10-27,1.72
2016-10-28,1.68
2016-10-31,1.52
2016-11-01,1.52
2016-11-02,1.47
2016-11-03,1.51
2016-11-04,1.53
2016-11-07,1.59
2016-11-08,1.56
2016-11-09,1.98
2016-11-10,2.07
2016-11-11,2.09
2016-11-14,2.21
2016-11-15,2.19
2016-11-16,2.22
2016-11-17,2.2
2016-11-18,2.26
2016-11-21,2.45
2016-11-22,2.37
2016-11-23,2.67
2016-11-25,2.62
2016-11-28,2.57
2016-11-29,2.51
2016-11-30,2.59
2016-12-01,2.64
2016-12-02,2.6
2016-12-05,2.77
2016-12-06,2.89
2016-12-07,2.85
2016-12-08,2.96
2016-12-09,2.97
2016-12-12,2.99
2016-12-13,3
2016-12-14,2.89
2016-12-15,3.02
2016-12-16,3.12
2016-12-19,3.07
2016-12-20,3.27
2016-12-21,3.29
2016-12-22,3.21
2016-12-23,3.1
2016-12-27,3.19
2016-12-28,3.13
2016-12-29,3.12
2016-12-30,3.24
2017-01-03,3.09
2017-01-04,3.16
2017-01-05,3.12
2017-01-06,2.94
2017-01-09,2.9
2017-01-10,2.94
2017-01-11,2.97
2017-01-12,2.88
2017-01-13,2.9
2017-01-17,2.88
2017-01-18,2.88
2017-01-19,2.76
2017-01-20,2.85
2017-01-23,2.86
2017-01-24,3.08
2017-01-25,3.74
2017-01-26,3.35
2017-01-27,3.27
2017-01-30,3.08
2017-01-31,3.03
2017-02-01,3.08
2017-02-02,3.02
2017-02-03,3.23
2017-02-06,3.11
2017-02-07,3.01
2017-02-08,2.95
2017-02-09,3.04
2017-02-10,3.07
2017-02-13,3.12
2017-02-14,3.12
2017-02-15,3.09
2017-02-16,3.03
2017-02-17,3.03
2017-02-21,3.06
2017-02-22,3.05
2017-02-23,2.97
2017-02-24,3.03
2017-02-27,3.01
2017-02-28,3
2017-03-01,3.15
2017-03-02,3
2017-03-03,2.96
2017-03-06,2.88
2017-03-07,2.86
2017-03-08,2.52
2017-03-09,2.38
2017-03-10,2.55
2017-03-13,2.54
2017-03-14,2.55
2017-03-15,2.55
2017-03-16,2.7
2017-03-17,2.83
2017-03-20,2.73
2017-03-21,2.59
2017-03-22,2.51
2017-03-23,2.66
2017-03-24,2.6
2017-03-27,2.61
2017-03-28,2.64
2017-03-29,2.78
2017-03-30,2.67
2017-03-31,2.74
2017-04-03,2.77
2017-04-04,2.86
2017-04-05,2.63
2017-04-06,2.68
2017-04-07,2.69
2017-04-10,2.69
2017-04-11,2.66
2017-04-12,2.57
2017-04-13,2.5
2017-04-17,2.7
2017-04-18,2.68
2017-04-19,2.67
2017-04-20,2.73
2017-04-21,2.61
2017-04-24,2.75
2017-04-25,2.96
2017-04-26,3
2017-04-27,2.89
2017-04-28,2.75
2017-05-01,2.75
2017-05-02,2.7
2017-05-03,2.68
2017-05-04,2.66
2017-05-05,2.64
2017-05-08,2.6
2017-05-09,2.64
2017-05-10,2.67
2017-05-11,2.62
2017-05-12,2.58
2017-05-15,2.6
2017-05-16,2.58
2017-05-17,2.41
2017-05-18,2.37
2017-05-19,2.41
2017-05-22,2.43
2017-05-23,2.52
2017-05-24,2.54
2017-05-25,2.42
2017-05-26,2.42
2017-05-30,2.38
2017-05-31,2.31
2017-06-01,2.47
2017-06-02,2.43
2017-06-05,2.42
2017-06-06,2.4
2017-06-07,2.36
2017-06-08,2.44
2017-06-09,2.49
2017-06-12,2.49
2017-06-13,2.45
2017-06-14,2.37
2017-06-15,2.33
2017-06-16,2.4
2017-06-19,2.42
2017-06-20,2.33
2017-06-21,2.22
2017-06-22,2.13
2017-06-23,2.38
2017-06-26,2.39
2017-06-27,2.5
2017-06-28,2.58
2017-06-29,2.51
2017-06-30,2.47
2017-07-03,2.76
2017-07-05,2.49
2017-07-06,2.44
2017-07-07,2.48
2017-07-10,2.53
2017-07-11,2.4
2017-07-12,2.41
2017-07-13,2.19
2017-07-14,2.16
2017-07-17,2.19
2017-07-18,2.11
2017-07-19,2.05
2017-07-20,2.11
2017-07-21,2.08
2017-07-24,2.07
2017-07-25,2.08
2017-07-26,2.06
2017-07-27,2.05
2017-07-28,2.06
2017-07-31,2.04
2017-08-01,2.12
2017-08-02,2.15
2017-08-03,2.16
2017-08-04,2.19
2017-08-07,2.19
2017-08-08,2.2
2017-08-09,2.2
2017-08-10,2.17
2017-08-11,2.16
2017-08-14,2.19
2017-08-15,2.18
2017-08-16,2.18
2017-08-17,2.16
2017-08-18,2.19
2017-08-21,2.16
2017-08-22,2.16
2017-08-23,2.16
2017-08-24,2.19
2017-08-25,2.19
2017-08-28,2.2
2017-08-29,2.2
2017-08-30,2.2
2017-08-31,2.2
2017-09-01,2.24
2017-09-05,2.37
2017-09-06,2.42
2017-09-07,2.58
2017-09-08,2.53
2017-09-11,2.6
2017-09-12,2.6
2017-09-13,2.62
2017-09-14,2.77
2017-09-15,2.83
2017-09-18,2.92
2017-09-19,2.96
2017-09-20,2.94
2017-09-21,3
2017-09-22,3.02
2017-09-25,3.03
2017-09-26,3.15
2017-09-27,3.29
2017-09-28,3.24
2017-09-29,3.22
2017-10-02,3.17
2017-10-03,3.26
2017-10-04,3.28
2017-10-05,3.15
2017-10-06,3.11
2017-10-09,3.13
2017-10-10,3.16
2017-10-11,3.23
2017-10-12,3.19
2017-10-13,3.21
2017-10-16,3.29
2017-10-17,3.18
2017-10-18,3.13
2017-10-19,3.15
2017-10-20,3.17
2017-10-23,3.01
2017-10-24,3.06
2017-10-25,3.09
2017-10-26,3.11
2017-10-27,3.01
2017-10-30,3
2017-10-31,3.06
2017-11-01,3.01
2017-11-02,3.09
2017-11-03,2.97
2017-11-06,2.98
2017-11-07,2.8
2017-11-08,2.78
2017-11-09,1.51
2017-11-10,1.47
2017-11-13,1.37
2017-11-14,1.14
2017-11-15,1.15
2017-11-16,1.14
2017-11-17,1.14
2017-11-20,1.16
2017-11-21,1.22
2017-11-22,1.31
2017-11-24,1.34
2017-11-27,1.32
2017-11-28,1.35
2017-11-29,1.43
2017-11-30,1.32
2017-12-01,1.33
2017-12-04,1.3
2017-12-05,1.25
2017-12-06,1.21
2017-12-07,1.24
2017-12-08,1.22
2017-12-11,1.25
2017-12-12,1.29
2017-12-13,1.25
2017-12-14,1.21
2017-12-15,1.23
2017-12-18,1.27
2017-12-19,1.25
2017-12-20,1.25
2017-12-21,1.33
2017-12-22,1.37
2017-12-26,1.37
2017-12-27,1.37
2017-12-28,1.41
2017-12-29,1.42
2018-01-02,1.38
2018-01-03,1.33
2018-01-04,1.37
2018-01-05,1.38
2018-01-08,1.29
2018-01-09,1.26
2018-01-10,1.25
2018-01-11,1.26
2018-01-12,1.3
2018-01-16,1.26
2018-01-17,1.27
2018-01-18,1.26
2018-01-19,1.27
2018-01-22,1.28
2018-01-23,1.27
2018-01-24,1.23
2018-01-25,1.22
2018-01-26,1.18
2018-01-29,1.18
2018-01-30,1.13
2018-01-31,1.11
2018-02-01,1.12
2018-02-02,1.05
2018-02-05,0.9565
2018-02-06,0.9752
2018-02-07,1.02
2018-02-08,0.9713
2018-02-09,0.9465
2018-02-12,1
2018-02-13,1
2018-02-14,0.9942
2018-02-15,0.9834
2018-02-16,0.98
2018-02-20,0.9706
2018-02-21,0.9662
2018-02-22,0.9802
2018-02-23,0.9885
2018-02-26,0.9891
2018-02-27,0.98
2018-02-28,0.9482
2018-03-01,0.9011
2018-03-02,0.8229
2018-03-05,0.9401
2018-03-06,0.92
2018-03-07,0.94
2018-03-08,0.925
2018-03-09,0.88
2018-03-12,0.915
2018-03-13,0.875
2018-03-14,0.84
2018-03-15,0.8256
2018-03-16,0.86
2018-03-19,0.8399
2018-03-20,0.1888
2018-03-21,0.24
2018-03-22,0.2163
2018-03-23,0.19
2018-03-26,0.155
