date,close
2014-06-13,32.1685
2014-06-16,32.0772
2014-06-17,31.9444
2014-06-18,32.1436
2014-06-19,32.7659
2014-06-20,32.5252
2014-06-23,31.7453
2014-06-24,31.4549
2014-06-25,30.8077
2014-06-26,30.6335
2014-06-27,30.5837
2014-06-30,30.9737
2014-07-01,31.2392
2014-07-02,31.1313
2014-07-03,31.04
2014-07-07,30.3928
2014-07-08,29.6295
2014-07-09,29.4304
2014-07-10,29.3972
2014-07-11,29.6461
2014-07-14,29.9116
2014-07-15,29.2063
2014-07-16,29.4909
2014-07-17,29.131
2014-07-18,29.7168
2014-07-21,29.6164
2014-07-22,29.7754
2014-07-23,29.8507
2014-07-24,29.675
2014-07-25,29.4741
2014-07-28,29.1729
2014-07-29,29.2984
2014-07-30,29.1645
2014-07-31,28.2858
2014-08-01,28.2105
2014-08-04,28.403
2014-08-05,28.3193
2014-08-06,28.7963
2014-08-07,28.7963
2014-08-08,28.6624
2014-08-11,28.9637
2014-08-12,28.8883
2014-08-13,29.5913
2014-08-14,29.675
2014-08-15,29.4407
2014-08-18,29.5662
2014-08-19,29.5076
2014-08-20,28.9971
2014-08-21,29.5997
2014-08-22,29.3821
2014-08-25,30.8047
2014-08-26,31.5663
2014-08-27,31.5495
2014-08-28,31.7755
2014-08-29,31.8341
2014-09-02,31.809
2014-09-03,31.8424
2014-09-04,32.1019
2014-09-05,32.7212
2014-09-08,32.7128
2014-09-09,32.4282
2014-09-10,32.6124
2014-09-11,32.9136
2014-09-12,32.6124
2014-09-15,32.4199
2014-09-16,32.763
2014-09-17,32.4701
2014-09-18,32.7463
2014-09-19,32.5036
2014-09-22,32.0266
2014-09-23,31.5914
2014-09-24,32.0684
2014-09-25,31.6583
2014-09-26,32.378
2014-09-29,31.5244
2014-09-30,31.0893
2014-10-01,31.0642
2014-10-02,31.3571
2014-10-03,30.5621
2014-10-06,30.516
2014-10-07,30.3696
2014-10-08,31.173
2014-10-09,30.3277
2014-10-10,29.3905
2014-10-13,29.2315
2014-10-14,29.2231
2014-10-15,29.1896
2014-10-16,29.449
2014-10-17,29.2566
2014-10-20,29.7921
2014-10-21,30.3528
2014-10-22,29.8043
2014-10-23,30.606
2014-10-24,30.741
2014-10-27,30.741
2014-10-28,31.703
2014-10-29,31.762
2014-10-30,31.6523
2014-10-31,32.1249
2014-11-03,31.9899
2014-11-04,32.1586
2014-11-05,32.4371
2014-11-06,32.6565
2014-11-07,32.4034
2014-11-10,32.9012
2014-11-11,33.1206
2014-11-12,33.2978
2014-11-13,32.9181
2014-11-14,33.1206
2014-11-17,32.9265
2014-11-18,33.34
2014-11-19,32.5384
2014-11-20,32.6481
2014-11-21,32.3105
2014-11-24,33.0869
2014-11-25,33.6269
2014-11-26,33.4835
2014-11-28,33.4919
2014-12-01,33.6016
2014-12-02,33.6691
2014-12-03,33.7957
2014-12-04,33.6016
2014-12-05,33.9054
2014-12-08,32.7409
2014-12-09,32.8675
2014-12-10,29.8128
2014-12-11,27.6104
2014-12-12,26.2096
2014-12-15,26.0915
2014-12-16,25.5092
2014-12-17,26.0324
2014-12-18,26.7581
2014-12-19,26.3784
2014-12-22,26.6737
2014-12-23,27.1716
2014-12-24,27.1378
2014-12-26,27.5766
2014-12-29,27.1209
2014-12-30,26.7581
2014-12-31,26.5978
2015-01-02,26.6653
2015-01-05,27.1547
2015-01-06,26.6484
2015-01-07,26.8509
2015-01-08,26.9015
2015-01-09,26.7581
2015-01-12,27.1884
2015-01-13,28.2179
2015-01-14,27.69
2015-01-15,27.1876
2015-01-16,27.3494
2015-01-20,27.1876
2015-01-21,27.0003
2015-01-22,28.7629
2015-01-23,28.4989
2015-01-26,28.7458
2015-01-27,28.6607
2015-01-28,28.7373
2015-01-29,29.41
2015-01-30,28.1328
2015-02-02,28.7118
2015-02-03,29.9464
2015-02-04,28.9842
2015-02-05,29.3589
2015-02-06,29.3248
2015-02-09,29.3419
2015-02-10,29.3248
2015-02-11,29.2056
2015-02-12,29.4866
2015-02-13,30.023
2015-02-17,30.5424
2015-02-18,30.4318
2015-02-19,30.023
2015-02-20,30.3551
2015-02-23,30.1082
2015-02-24,30.6702
2015-02-25,30.6531
2015-02-26,30.2785
2015-02-27,30.4318
2015-03-02,30.2104
2015-03-03,30.2189
2015-03-04,30.0997
2015-03-05,29.7676
2015-03-06,28.9502
2015-03-09,29.1545
2015-03-10,26.3106
2015-03-11,27.0088
2015-03-12,22.8536
2015-03-13,23.4496
2015-03-16,23.356
2015-03-17,23.7221
2015-03-18,24.3948
2015-03-19,24.2671
2015-03-20,24.4544
2015-03-23,24.829
2015-03-24,24.9568
2015-03-25,24.1223
2015-03-26,24.3863
2015-03-27,24.5225
2015-03-30,24.7694
2015-03-31,24.6502
2015-04-01,25.5869
2015-04-02,25.7316
2015-04-06,25.8338
2015-04-07,25.936
2015-04-08,25.9615
2015-04-09,26.2425
2015-04-10,26.9492
2015-04-13,26.7278
2015-04-14,26.9322
2015-04-15,26.9748
2015-04-16,26.9748
2015-04-17,26.3191
2015-04-20,26.4911
2015-04-21,26.5255
2015-04-22,26.6287
2015-04-23,26.7061
2015-04-24,26.835
2015-04-27,26.2589
2015-04-28,26.4481
2015-04-29,25.7774
2015-04-30,24.8488
2015-05-01,25.3217
2015-05-04,25.1412
2015-05-05,24.823
2015-05-06,24.7629
2015-05-07,24.8316
2015-05-08,25.167
2015-05-11,25.167
2015-05-12,25.3733
2015-05-13,25.6141
2015-05-14,26.1902
2015-05-15,26.749
2015-05-18,27.2048
2015-05-19,27.4541
2015-05-20,27.1532
2015-05-21,26.7576
2015-05-22,26.4825
2015-05-26,25.6829
2015-05-27,25.8118
2015-05-28,25.7774
2015-05-29,25.829
2015-06-01,25.6829
2015-06-02,25.915
2015-06-03,25.6657
2015-06-04,25.6227
2015-06-05,25.5711
2015-06-08,25.3905
2015-06-09,25.3819
2015-06-10,25.7946
2015-06-11,25.8118
2015-06-12,25.786
2015-06-15,25.5453
2015-06-16,25.4937
2015-06-17,25.2702
2015-06-18,25.5883
2015-06-19,25.6657
2015-06-22,26.173
2015-06-23,26.2074
2015-06-24,25.9408
2015-06-25,26.2847
2015-06-26,26.1988
2015-06-29,25.2616
2015-06-30,24.9778
2015-07-01,25.0466
2015-07-02,25.2959
2015-07-06,24.9778
2015-07-07,24.7371
2015-07-08,24.2986
2015-07-09,24.1094
2015-07-10,26.1042
2015-07-13,26.3363
2015-07-14,26.4825
2015-07-15,26.0049
2015-07-16,26.031
2015-07-17,25.6403
2015-07-20,25.6663
2015-07-21,25.4145
2015-07-22,25.293
2015-07-23,24.6938
2015-07-24,24.581
2015-07-27,24.3899
2015-07-28,24.3118
2015-07-29,24.1468
2015-07-30,24.1381
2015-07-31,25.0151
2015-08-03,24.3813
2015-08-04,24.6157
2015-08-05,24.7807
2015-08-06,24.7459
2015-08-07,24.4247
2015-08-10,25.1193
2015-08-11,24.7807
2015-08-12,24.5549
2015-08-13,24.2771
2015-08-14,24.5289
2015-08-17,24.6417
2015-08-18,24.0166
2015-08-19,23.6866
2015-08-20,23.1657
2015-08-21,23.0007
2015-08-24,22.5492
2015-08-25,22.1151
2015-08-26,22.0716
2015-08-27,21.9588
2015-08-28,22.089
2015-08-31,23.1657
2015-09-01,22.3495
2015-09-02,22.3669
2015-09-03,22.7923
2015-09-04,22.4276
2015-09-08,22.8531
2015-09-09,22.6621
2015-09-10,22.9052
2015-09-11,22.7402
2015-09-14,22.2974
2015-09-15,22.827
2015-09-16,23.5651
2015-09-17,23.3393
2015-09-18,23.0094
2015-09-21,23.1136
2015-09-22,22.636
2015-09-23,22.6708
2015-09-24,22.7663
2015-09-25,22.9399
2015-09-28,22.7663
2015-09-29,18.4943
2015-09-30,17.8952
2015-10-01,17.8171
2015-10-02,18.6767
2015-10-05,20.0225
2015-10-06,19.6752
2015-10-07,19.9704
2015-10-08,20.5782
2015-10-09,20.2656
2015-10-12,20.0659
2015-10-13,20.5435
2015-10-14,20.0051
2015-10-15,20.533
2015-10-16,20.7881
2015-10-19,20.6649
2015-10-20,20.9289
2015-10-21,20.5418
2015-10-22,21.1224
2015-10-23,21.3423
2015-10-26,20.8937
2015-10-27,20.6385
2015-10-28,21.9933
2015-10-29,21.4391
2015-10-30,21.2544
2015-11-02,22.1869
2015-11-03,22.5212
2015-11-04,22.2133
2015-11-05,22.1517
2015-11-06,21.7118
2015-11-09,21.5887
2015-11-10,21.5095
2015-11-11,21.3687
2015-11-12,20.621
2015-11-13,20.2339
2015-11-16,20.2691
2015-11-17,20.0315
2015-11-18,20.2339
2015-11-19,19.7588
2015-11-20,19.6444
2015-11-23,18.5712
2015-11-24,19.2222
2015-11-25,19.9436
2015-11-27,19.8204
2015-11-30,19.3805
2015-12-01,19.3365
2015-12-02,19.2046
2015-12-03,19.011
2015-12-04,19.1254
2015-12-07,18.8967
2015-12-08,18.3073
2015-12-09,18.3864
2015-12-10,17.2692
2015-12-11,17.3835
2015-12-14,17.4099
2015-12-15,17.5507
2015-12-16,17.7618
2015-12-17,17.8762
2015-12-18,17.2956
2015-12-21,17.3747
2015-12-22,18.1929
2015-12-23,18.2809
2015-12-24,18.1489
2015-12-28,18.0433
2015-12-29,18.0433
2015-12-30,17.7442
2015-12-31,17.6738
2016-01-04,17.4451
2016-01-05,17.4275
2016-01-06,17.1812
2016-01-07,16.6094
2016-01-08,16.8381
2016-01-11,16.6885
2016-01-12,16.5214
2016-01-13,17.0936
2016-01-14,17.2008
2016-01-15,16.6466
2016-01-19,16.3068
2016-01-20,16.3068
2016-01-21,16.4052
2016-01-22,16.7449
2016-01-25,16.3158
2016-01-26,16.7449
2016-01-27,16.6197
2016-01-28,16.7538
2016-01-29,17.4512
2016-02-01,17.0489
2016-02-02,16.5482
2016-02-03,16.6644
2016-02-04,16.6466
2016-02-05,16.28
2016-02-08,16.5214
2016-02-09,16.4856
2016-02-10,16.6108
2016-02-11,16.7896
2016-02-12,17.1472
2016-02-16,18.0949
2016-02-17,17.5137
2016-02-18,17.3707
2016-02-19,17.8803
2016-02-22,17.4869
2016-02-23,17.7551
2016-02-24,18.0859
2016-02-25,18.077
2016-02-26,18.3184
2016-02-29,18.372
2016-03-01,18.9531
2016-03-02,19.123
2016-03-03,19.2928
2016-03-04,19.2928
2016-03-07,19.6773
2016-03-08,19.2481
2016-03-09,19.2213
2016-03-10,19.2571
2016-03-11,20.7054
2016-03-14,20.7501
2016-03-15,21.358
2016-03-16,21.0719
2016-03-17,21.4563
2016-03-18,22.3593
2016-03-21,21.9034
2016-03-22,21.215
2016-03-23,20.5087
2016-03-24,20.5802
2016-03-28,20.3925
2016-03-29,20.9289
2016-03-30,21.1166
2016-03-31,20.8931
2016-04-01,21.0093
2016-04-04,20.4551
2016-04-05,20.1868
2016-04-06,20.3835
2016-04-07,19.6951
2016-04-08,20.0974
2016-04-11,20.464
2016-04-12,20.3031
2016-04-13,20.4551
2016-04-14,20.4908
2016-04-15,20.3031
2016-04-18,20.3484
2016-04-19,20.3937
2016-04-20,20.3484
2016-04-21,20.4752
2016-04-22,20.9463
2016-04-25,20.7289
2016-04-26,21.9429
2016-04-27,22.3234
2016-04-28,22.0879
2016-04-29,21.9248
2016-05-02,21.8614
2016-05-03,21.6892
2016-05-04,21.5624
2016-05-05,20.8285
2016-05-06,20.6564
2016-05-09,20.4208
2016-05-10,20.7017
2016-05-11,20.6564
2016-05-12,20.5477
2016-05-13,20.3484
2016-05-16,20.4843
2016-05-17,20.2668
2016-05-18,20.6292
2016-05-19,20.4843
2016-05-20,20.7561
2016-05-23,20.6564
2016-05-24,21.2634
2016-05-25,21.0097
2016-05-26,21.1185
2016-05-27,21.1003
2016-05-31,20.8738
2016-06-01,21.0822
2016-06-02,21.0641
2016-06-03,21.055
2016-06-06,21.0007
2016-06-07,20.6111
2016-06-08,20.3302
2016-06-09,18.3914
2016-06-10,18.1559
2016-06-13,16.3077
2016-06-14,15.3473
2016-06-15,14.8944
2016-06-16,14.5954
2016-06-17,12.5297
2016-06-20,12.5569
2016-06-21,12.5479
2016-06-22,12.3214
2016-06-23,12.2579
2016-06-24,11.1436
2016-06-27,10.2738
2016-06-28,10.6362
2016-06-29,11.2251
2016-06-30,11.6328
2016-07-01,11.6419
2016-07-05,11.1526
2016-07-06,11.2614
2016-07-07,11.6419
2016-07-08,11.8865
2016-07-11,12.1311
2016-07-12,12.3304
2016-07-13,12.3032
2016-07-14,12.1087
2016-07-15,12.3218
2016-07-18,12.2754
2016-07-19,12.1735
2016-07-20,12.4607
2016-07-21,12.5163
2016-07-22,12.7109
2016-07-25,12.5349
2016-07-26,12.5904
2016-07-27,12.7294
2016-07-28,12.6923
2016-07-29,12.1087
2016-08-01,12.4422
2016-08-02,11.8678
2016-08-03,11.9234
2016-08-04,11.8956
2016-08-05,12.2199
2016-08-08,12.1828
2016-08-09,12.1828
2016-08-10,12.3218
2016-08-11,12.3218
2016-08-12,12.2847
2016-08-15,12.3774
2016-08-16,12.2106
2016-08-17,12.0624
2016-08-18,12.0716
2016-08-19,11.8956
2016-08-22,11.8863
2016-08-23,12.155
2016-08-24,11.9697
2016-08-25,11.84
2016-08-26,11.5621
2016-08-29,11.9975
2016-08-30,12.1643
2016-08-31,11.9419
2016-09-01,11.7844
2016-09-02,11.9234
2016-09-06,11.979
2016-09-07,12.155
2016-09-08,12.2662
2016-09-09,11.8122
2016-09-12,11.979
2016-09-13,11.8493
2016-09-14,11.8678
2016-09-15,12.1828
2016-09-16,12.2199
2016-09-19,12.3681
2016-09-20,12.294
2016-09-21,12.3959
2016-09-22,12.5071
2016-09-23,12.2477
2016-09-26,12.1272
2016-09-27,12.0809
2016-09-28,12.2384
2016-09-29,12.1643
2016-09-30,11.8678
2016-10-03,11.5713
2016-10-04,11.2564
2016-10-05,11.701
2016-10-06,11.7288
2016-10-07,10.858
2016-10-10,10.8487
2016-10-11,10.5337
2016-10-12,10.2651
2016-10-13,9.9408
2016-10-14,9.9593
2016-10-17,9.9037
2016-10-18,10.0798
2016-10-19,9.9559
2016-10-20,9.8606
2016-10-21,9.8416
2016-10-24,9.8702
2016-10-25,10.0798
2016-10-26,10.0512
2016-10-27,9.7177
2016-10-28,9.5177
2016-10-31,9.9083
2016-11-01,9.5558
2016-11-02,9.2033
2016-11-03,9.1366
2016-11-04,9.0699
2016-11-07,9.2795
2016-11-08,9.1652
2016-11-09,9.9273
2016-11-10,10.1274
2016-11-11,10.3656
2016-11-14,10.6609
2016-11-15,10.6228
2016-11-16,10.4799
2016-11-17,10.699
2016-11-18,10.861
2016-11-21,10.9277
2016-11-22,11.023
2016-11-23,11.0801
2016-11-25,11.023
2016-11-28,11.0039
2016-11-29,10.861
2016-11-30,10.9563
2016-12-01,11.1278
2016-12-02,11.0039
2016-12-05,11.223
2016-12-06,11.4136
2016-12-07,12.1472
2016-12-08,10.0512
2016-12-09,10.5561
2016-12-12,10.8705
2016-12-13,10.9372
2016-12-14,10.6895
2016-12-15,10.8896
2016-12-16,10.9658
2016-12-19,11.4231
2016-12-20,11.8899
2016-12-21,11.4136
2016-12-22,11.1087
2016-12-23,11.1373
2016-12-27,11.0992
2016-12-28,11.2421
2016-12-29,11.5184
2016-12-30,11.2897
2017-01-03,11.3088
2017-01-04,11.8613
2017-01-05,11.4993
2017-01-06,11.3755
2017-01-09,11.0325
2017-01-10,11.023
2017-01-11,11.0896
2017-01-12,10.7943
2017-01-13,10.9289
2017-01-17,10.5059
2017-01-18,10.3618
2017-01-19,10.4387
2017-01-20,10.4194
2017-01-23,10.2368
2017-01-24,10.4483
2017-01-25,10.5732
2017-01-26,10.4963
2017-01-27,10.4194
2017-01-30,10.2464
2017-01-31,10.3137
2017-02-01,10.429
2017-02-02,10.3906
2017-02-03,10.6597
2017-02-06,10.6405
2017-02-07,10.4963
2017-02-08,10.2945
2017-02-09,10.2656
2017-02-10,10.3714
2017-02-13,10.554
2017-02-14,10.6117
2017-02-15,10.7174
2017-02-16,11.2076
2017-02-17,11.1692
2017-02-21,11.6017
2017-02-22,11.198
2017-02-23,10.8135
2017-02-24,11.0731
2017-02-27,11.323
2017-02-28,10.9673
2017-03-01,11.0538
2017-03-02,11.2461
2017-03-03,10.9865
2017-03-06,10.7559
2017-03-07,10.6117
2017-03-08,10.6982
2017-03-09,13.2454
2017-03-10,13.7933
2017-03-13,13.6395
2017-03-14,13.8125
2017-03-15,14.0047
2017-03-16,14.4565
2017-03-17,14.3315
2017-03-20,14.3123
2017-03-21,14.1777
2017-03-22,14.072
2017-03-23,14.1585
2017-03-24,13.9855
2017-03-27,14.1105
2017-03-28,13.9567
2017-03-29,14.0432
2017-03-30,14.418
2017-03-31,14.1681
2017-04-03,13.8605
2017-04-04,13.4761
2017-04-05,13.1493
2017-04-06,13.1204
2017-04-07,12.7936
2017-04-10,13.0531
2017-04-11,13.0531
2017-04-12,12.8321
2017-04-13,12.7359
2017-04-17,12.8909
2017-04-18,13.0749
2017-04-19,13.1911
2017-04-20,13.4042
2017-04-21,13.6463
2017-04-24,13.7529
2017-04-25,13.9272
2017-04-26,14.1015
2017-04-27,13.7722
2017-04-28,13.5689
2017-05-01,13.9563
2017-05-02,13.8788
2017-05-03,13.8981
2017-05-04,13.7238
2017-05-05,13.8207
2017-05-08,14.1887
2017-05-09,13.9369
2017-05-10,13.9853
2017-05-11,13.8788
2017-05-12,13.4623
2017-05-15,13.6754
2017-05-16,14.0918
2017-05-17,13.472
2017-05-18,13.3267
2017-05-19,13.5398
2017-05-22,13.7432
2017-05-23,13.8303
2017-05-24,13.8061
2017-05-25,13.7722
2017-05-26,13.9756
2017-05-30,13.9175
2017-05-31,13.9756
2017-06-01,14.4793
2017-06-02,14.5277
2017-06-05,14.9151
2017-06-06,14.673
2017-06-07,14.5277
2017-06-08,17.2298
2017-06-09,17.6075
2017-06-12,18.1983
2017-06-13,18.3146
2017-06-14,18.7988
2017-06-15,18.731
2017-06-16,18.4114
2017-06-19,18.5179
2017-06-20,18.3049
2017-06-21,18.2758
2017-06-22,18.179
2017-06-23,18.2661
2017-06-26,18.6826
2017-06-27,18.7213
2017-06-28,18.8085
2017-06-29,18.5567
2017-06-30,18.3727
2017-07-03,18.5083
2017-07-05,18.6535
2017-07-06,18.2468
2017-07-07,18.1305
2017-07-10,17.995
2017-07-11,18.3146
2017-07-12,18.1305
2017-07-13,18.374
2017-07-14,18.1305
2017-07-17,18.189
2017-07-18,18.0916
2017-07-19,18.3253
2017-07-20,18.2474
2017-07-21,18.1987
2017-07-24,18.1208
2017-07-25,18.4519
2017-07-26,18.0137
2017-07-27,17.8287
2017-07-28,17.6047
2017-07-31,17.5268
2017-08-01,17.9845
2017-08-02,17.6534
2017-08-03,17.3516
2017-08-04,17.5171
2017-08-07,17.6534
2017-08-08,17.6632
2017-08-09,17.7605
2017-08-10,17.7411
2017-08-11,17.7703
2017-08-14,18.8121
2017-08-15,18.6271
2017-08-16,18.5979
2017-08-17,18.5979
2017-08-18,18.335
2017-08-21,18.0234
2017-08-22,18.3642
2017-08-23,18.2863
2017-08-24,18.4519
2017-08-25,18.7148
2017-08-28,18.8998
2017-08-29,18.8608
2017-08-30,18.8706
2017-08-31,19.0556
2017-09-01,19.0264
2017-09-05,18.9679
2017-09-06,19.1432
2017-09-07,19.1627
2017-09-08,19.3769
2017-09-11,19.8151
2017-09-12,20.1559
2017-09-13,19.9611
2017-09-14,19.9222
2017-09-15,19.7469
2017-09-18,20.1169
2017-09-19,19.9124
2017-09-20,20.1169
2017-09-21,20.3506
2017-09-22,20.0488
2017-09-25,20.1559
2017-09-26,19.8151
2017-09-27,20.7596
2017-09-28,17.1471
2017-09-29,19.9903
2017-10-02,18.9582
2017-10-03,19.5522
2017-10-04,19.9222
2017-10-05,20.1656
2017-10-06,20.078
2017-10-09,20.9738
2017-10-10,22.0643
2017-10-11,22.0936
2017-10-12,21.743
2017-10-13,21.5288
2017-10-16,21.261
2017-10-17,21.0703
2017-10-18,21.1485
2017-10-19,20.6301
2017-10-20,20.9333
2017-10-23,21.1877
2017-10-24,21.2268
2017-10-25,21.1779
2017-10-26,20.9138
2017-10-27,21.0116
2017-10-30,20.6399
2017-10-31,21.0409
2017-11-01,21.0507
2017-11-02,20.6008
2017-11-03,20.1997
2017-11-06,20.1312
2017-11-07,19.9258
2017-11-08,19.828
2017-11-09,19.4367
2017-11-10,19.1432
2017-11-13,19.065
2017-11-14,19.29
2017-11-15,19.5345
2017-11-16,20.229
2017-11-17,20.1214
2017-11-20,20.2388
2017-11-21,20.6008
2017-11-22,20.5812
2017-11-24,20.5029
2017-11-27,20.7475
2017-11-28,21.2561
2017-11-29,20.6105
2017-11-30,21.1975
2017-12-01,20.6986
2017-12-04,20.2388
2017-12-05,20.3073
2017-12-06,20.8453
2017-12-07,21.5887
2017-12-08,20.3073
2017-12-11,20.1801
2017-12-12,20.4149
2017-12-13,21.5203
2017-12-14,21.5692
2017-12-15,22.6452
2017-12-18,22.6354
2017-12-19,22.1561
2017-12-20,21.9018
2017-12-21,21.8822
2017-12-22,21.9409
2017-12-26,21.7844
2017-12-27,21.7648
2017-12-28,21.7061
2017-12-29,21.6376
2018-01-02,22.0094
2018-01-03,21.5203
2018-01-04,21.5007
2018-01-05,21.3833
2018-01-08,20.8844
2018-01-09,20.9627
2018-01-10,20.679
2018-01-11,21.3051
2018-01-12,21.5007
2018-01-16,21.029
2018-01-17,21.314
2018-01-18,21.2256
2018-01-19,21.5302
2018-01-22,21.2649
2018-01-23,20.9308
2018-01-24,20.7735
2018-01-25,21.3337
2018-01-26,21.3631
2018-01-29,21.0585
2018-01-30,21.314
2018-01-31,21.255
2018-02-01,21.9036
2018-02-02,21.6874
2018-02-05,21.3828
2018-02-06,21.4614
2018-02-07,21.4417
2018-02-08,20.9897
2018-02-09,20.803
2018-02-12,21.1666
2018-02-13,21.314
2018-02-14,21.2747
2018-02-15,21.5695
2018-02-16,21.5007
2018-02-20,21.5105
2018-02-21,22.9747
2018-02-22,22.3163
2018-02-23,22.1296
2018-02-26,22.5915
2018-02-27,22.2967
2018-02-28,21.7169
2018-03-01,22.4244
2018-03-02,22.8273
2018-03-05,23.6036
2018-03-06,23.5545
2018-03-07,23.8493
2018-03-08,29.5094
2018-03-09,30.1187
2018-03-12,30.2071
2018-03-13,29.932
2018-03-14,29.362
2018-03-15,29.7256
2018-03-16,29.5389
2018-03-19,29.7354
2018-03-20,29.6961
2018-03-21,29.5782
2018-03-22,28.6742
2018-03-23,28.4973
2018-03-26,29.2539
2018-03-27,28.7233
2018-03-28,28.7331
2018-03-29,29.3718
2018-04-02,29.6765
2018-04-03,29.8828
2018-04-04,29.5192
2018-04-05,30.0008
2018-04-06,29.195
2018-04-09,28.7331
2018-04-10,30.0597
2018-04-11,30.1776
2018-04-12,30.1973
2018-04-13,30.6395
2018-04-16,31.1308
2018-04-17,32.1758
2018-04-18,31.6434
2018-04-19,31.3773
2018-04-20,30.7365
2018-04-23,30.5788
2018-04-24,30.5197
2018-04-25,30.2732
2018-04-26,30.1451
2018-04-27,30.1056
2018-04-30,30.1549
2018-05-01,29.9578
2018-05-02,29.6719
2018-05-03,29.1297
2018-05-04,29.6127
2018-05-07,29.9676
2018-05-08,30.0465
2018-05-09,30.1746
2018-05-10,30.2633
2018-05-11,30.0268
2018-05-14,29.5733
2018-05-15,29.8986
2018-05-16,30.8252
2018-05-17,30.6675
2018-05-18,30.5197
2018-05-21,30.7168
2018-05-22,30.3718
2018-05-23,30.6478
2018-05-24,30.3028
2018-05-25,30.4408
2018-05-29,30.5887
2018-05-30,30.7168
2018-05-31,30.8548
2018-06-01,31.6632
2018-06-04,32.0082
2018-06-05,32.6292
2018-06-06,31.9293
2018-06-07,31.9786
2018-06-08,31.3576
2018-06-11,31.1703
2018-06-12,31.3477
2018-06-13,31.8899
2018-06-14,32.0377
2018-06-15,32.1265
2018-06-18,32.1955
2018-06-19,31.8504
2018-06-20,31.5941
2018-06-21,31.2294
2018-06-22,31.2787
2018-06-25,31.3477
2018-06-26,31.6533
2018-06-27,31.4167
2018-06-28,31.604
2018-06-29,31.4266
2018-07-02,31.5449
2018-07-03,31.7223
2018-07-05,31.8307
2018-07-06,32.2349
2018-07-09,32.2842
2018-07-10,32.7869
2018-07-11,33.3587
2018-07-12,34.098
2018-07-13,34.7209
2018-07-16,34.1376
2018-07-17,33.8311
2018-07-18,34.0288
2018-07-19,33.6729
2018-07-20,33.495
2018-07-23,33.0896
2018-07-24,32.6151
2018-07-25,33.317
2018-07-26,33.8509
2018-07-27,33.0649
2018-07-30,32.6546
2018-07-31,33.2181
2018-08-01,33.317
2018-08-02,33.9893
2018-08-03,33.4356
2018-08-06,34.276
2018-08-07,34.098
2018-08-08,34.276
2018-08-09,34.1573
2018-08-10,34.1376
2018-08-13,34.2364
2018-08-14,34.3551
2018-08-15,34.187
2018-08-16,34.3551
2018-08-17,35.2745
2018-08-20,35.1361
2018-08-21,35.1361
2018-08-22,35.3536
2018-08-23,35.6601
2018-08-24,36.1049
2018-08-27,35.8875
2018-08-28,35.492
2018-08-29,35.5513
2018-08-30,35.4426
2018-08-31,35.4426
2018-09-04,35.146
2018-09-05,34.6022
2018-09-06,34.622
2018-09-07,34.0585
2018-09-10,34.2562
2018-09-11,33.8113
2018-09-12,32.971
2018-09-13,33.3664
2018-09-14,32.8425
2018-09-17,32.2987
2018-09-18,32.447
2018-09-19,32.5162
2018-09-20,32.4569
2018-09-21,32.9413
2018-09-24,33.574
2018-09-25,34.3353
2018-09-26,36.0852
2018-09-27,32.3234
2018-09-28,35.8578
2018-10-01,35.1262
2018-10-02,34.1672
2018-10-03,33.8509
2018-10-04,33.9596
2018-10-05,33.1786
2018-10-08,32.5854
2018-10-09,32.8128
2018-10-10,31.577
2018-10-11,31.3694
2018-10-12,31.5572
2018-10-15,31.5276
2018-10-16,32.5987
2018-10-17,32.7573
2018-10-18,31.8251
2018-10-19,31.4284
2018-10-22,31.111
2018-10-23,30.0895
2018-10-24,28.9193
2018-10-25,29.0978
2018-10-26,27.8978
2018-10-29,27.2829
2018-10-30,27.7094
2018-10-31,27.6895
2018-11-01,27.5903
2018-11-02,28.0565
2018-11-05,27.4614
2018-11-06,27.5507
2018-11-07,28.473
2018-11-08,28.4234
2018-11-09,27.9573
2018-11-12,26.8565
2018-11-13,26.6184
2018-11-14,25.9242
2018-11-15,26.2515
2018-11-16,25.9441
2018-11-19,25.9936
2018-11-20,25.0812
2018-11-21,25.2796
2018-11-23,25.5275
2018-11-26,25.8052
2018-11-27,24.992
2018-11-28,25.3193
2018-11-29,25.0019
2018-11-30,25.3292
2018-12-03,25.8746
2018-12-04,24.8035
2018-12-06,25.1903
2018-12-07,28.2052
2018-12-10,25.4978
2018-12-11,25.1804
2018-12-12,25.8845
2018-12-13,25.7159
2018-12-14,25.4184
2018-12-17,24.8234
2018-12-18,25.7358
2018-12-19,25.2994
2018-12-20,24.9027
2018-12-21,23.9308
2018-12-24,22.8002
2018-12-26,23.6531
2018-12-27,23.7622
2018-12-28,23.7424
2018-12-31,24.1391
2019-01-02,23.8812
2019-01-03,23.7424
2019-01-04,24.1391
2019-01-07,24.2184
2019-01-08,24.5358
2019-01-09,24.8135
2019-01-10,24.873
2019-01-11,24.7341
2019-01-14,24.6845
2019-01-15,24.8339
2019-01-16,24.9733
2019-01-17,25.053
2019-01-18,25.5409
2019-01-22,25.2322
2019-01-23,24.8737
2019-01-24,24.9733
2019-01-25,25.4612
2019-01-28,24.8737
2019-01-29,24.8638
2019-01-30,24.8638
2019-01-31,24.8638
2019-02-01,24.7542
2019-02-04,25.2919
2019-02-05,25.6803
2019-02-06,25.7102
2019-02-07,25.043
2019-02-08,25.2422
2019-02-11,25.6405
2019-02-12,26.2777
2019-02-13,26.3474
2019-02-14,26.8354
2019-02-15,27.0843
2019-02-19,26.8154
2019-02-20,26.7159
2019-02-21,27.0345
2019-02-22,26.925
2019-02-25,26.8652
2019-02-26,26.5565
2019-02-27,26.4669
2019-02-28,26.3873
2019-03-01,26.7457
2019-03-04,26.5864
2019-03-05,26.2777
2019-03-06,26.1483
2019-03-07,23.639
2019-03-08,23.5593
2019-03-11,22.3545
2019-03-12,22.5337
2019-03-13,22.9221
2019-03-14,22.1852
2019-03-15,22.5138
2019-03-18,22.3147
2019-03-19,21.8865
2019-03-20,22.1155
2019-03-21,22.1155
2019-03-22,21.0799
2019-03-25,21.4285
2019-03-26,21.4583
2019-03-27,21.4085
2019-03-28,22.5935
2019-03-29,23.1212
2019-04-01,23.4996
2019-04-02,23.2905
2019-04-03,23.0117
2019-04-04,22.9918
2019-04-05,23.0814
2019-04-08,23.4498
2019-04-09,23.1411
2019-04-10,23.4299
2019-04-11,23.6788
2019-04-12,23.6788
2019-04-15,23.41
2019-04-16,23.69
2019-04-17,23.75
2019-04-18,23.65
2019-04-22,23.27
2019-04-23,23.66
2019-04-24,23.64
2019-04-25,22.86
2019-04-26,22.89
2019-04-29,24.19
2019-04-30,23.53
2019-05-01,23.3
2019-05-02,23.8
2019-05-03,24.31
2019-05-06,23.97
2019-05-07,23.4
2019-05-08,23.22
2019-05-09,23.24
2019-05-10,23.09
2019-05-13,22.04
2019-05-14,22.31
2019-05-15,22.17
2019-05-16,22.55
2019-05-17,21.76
2019-05-20,22.14
2019-05-21,22.29
2019-05-22,22.16
2019-05-23,21.82
2019-05-24,22.14
2019-05-28,22.06
2019-05-29,21.83
2019-05-30,21.7
2019-05-31,21.15
2019-06-03,21.91
2019-06-04,22.58
2019-06-05,22.73
2019-06-06,26.54
2019-06-07,27.21
2019-06-10,26.5
2019-06-11,26.52
2019-06-12,26.26
2019-06-13,26.98
2019-06-14,27.14
2019-06-17,27.18
2019-06-18,28.25
2019-06-19,28.165
2019-06-20,28.455
2019-06-21,27.705
2019-06-24,28.11
2019-06-25,27.51
2019-06-26,28.185
2019-06-27,27.55
2019-06-28,27.92
2019-07-01,28.45
2019-07-02,28.455
2019-07-03,28.43
2019-07-04,28.43
2019-07-05,28.005
2019-07-08,27.44
2019-07-09,27.685
2019-07-10,27.835
2019-07-11,27.795
2019-07-12,28.19
2019-07-15,28.07
2019-07-16,28.095
2019-07-17,27.83
2019-07-18,27.26
2019-07-19,27.175
2019-07-22,27.05
2019-07-23,27.46
2019-07-24,28.41
2019-07-25,28.22
2019-07-26,29.035
2019-07-29,29.215
2019-07-30,29.46
2019-07-31,29.8
2019-08-01,29.555
2019-08-02,28.74
2019-08-05,28.07
2019-08-06,27.53
2019-08-07,27.63
2019-08-08,28.535
2019-08-09,27.955
2019-08-12,28.125
2019-08-13,28.235
2019-08-14,27.61
2019-08-15,26.92
2019-08-16,27.485
2019-08-19,27.65
2019-08-20,27.275
2019-08-21,27.705
2019-08-22,27.6
2019-08-23,26.69
2019-08-26,26.975
2019-08-27,26.795
2019-08-28,27.005
2019-08-29,26.65
2019-08-30,26.74
2019-09-02,26.75
2019-09-03,26.52
2019-09-04,26.705
2019-09-05,27.255
2019-09-06,27.57
2019-09-09,27.61
2019-09-10,28.65
2019-09-11,29.835
2019-09-12,30.475
2019-09-13,29.88
2019-09-16,29.59
2019-09-17,29.525
2019-09-18,29.4
2019-09-19,29.39
2019-09-20,29.77
2019-09-23,29.775
2019-09-24,29.685
2019-09-25,34.96
2019-09-26,34.01
2019-09-27,33.49
2019-09-30,32.515
2019-10-01,31.53
2019-10-02,31.25
2019-10-03,30.455
2019-10-04,31.07
2019-10-07,31.71
2019-10-08,30.94
2019-10-09,30.95
2019-10-10,30.79
2019-10-11,31.275
2019-10-14,30.965
2019-10-15,31.43
2019-10-16,31.495
2019-10-17,32.16
2019-10-18,32.29
2019-10-21,32.11
2019-10-22,32.15
2019-10-23,31.925
2019-10-24,31.785
2019-10-25,31.95
2019-10-28,33.005
2019-10-29,33.28
2019-10-30,34.58
2019-10-31,34.955
2019-11-01,35.48
2019-11-04,35.25
2019-11-05,35.23
2019-11-06,34.635
2019-11-07,34.74
2019-11-08,35.31
2019-11-11,35.97
2019-11-12,36.69
2019-11-13,36.13
2019-11-14,36.02
2019-11-15,35.98
2019-11-18,36.345
2019-11-19,36.285
2019-11-20,35.81
2019-11-21,36.025
2019-11-22,36.32
2019-11-25,36.81
