date,close
2014-06-13,4.84
2014-06-16,4.89
2014-06-17,4.85
2014-06-18,5.08
2014-06-19,5.44
2014-06-20,5.16
2014-06-23,5.41
2014-06-24,5.19
2014-06-25,5.34
2014-06-26,5.36
2014-06-27,5.28
2014-06-30,5.46
2014-07-01,5.26
2014-07-02,5.36
2014-07-03,5.05
2014-07-07,5.34
2014-07-08,5.55
2014-07-09,5.78
2014-07-10,5.81
2014-07-11,6.21
2014-07-14,6.04
2014-07-15,5.66
2014-07-16,5.7
2014-07-17,6.12
2014-07-18,5.94
2014-07-21,6.15
2014-07-22,5.97
2014-07-23,5.83
2014-07-24,5.69
2014-07-25,5.93
2014-07-28,6.08
2014-07-29,6.05
2014-07-30,6.06
2014-07-31,5.89
2014-08-01,5.92
2014-08-04,5.77
2014-08-05,5.89
2014-08-06,6.21
2014-08-07,6.26
2014-08-08,6.13
2014-08-11,6.25
2014-08-12,5.88
2014-08-13,5.91
2014-08-14,5.72
2014-08-15,5.71
2014-08-18,5.74
2014-08-19,5.67
2014-08-20,5.62
2014-08-21,5.42
2014-08-22,5.43
2014-08-25,5.28
2014-08-26,5.59
2014-08-27,5.57
2014-08-28,5.61
2014-08-29,5.57
2014-09-02,5.27
2014-09-03,5.33
2014-09-04,5.03
2014-09-05,5.14
2014-09-08,4.87
2014-09-09,5.01
2014-09-10,4.92
2014-09-11,5.05
2014-09-12,4.87
2014-09-15,5.04
2014-09-16,5.31
2014-09-17,5.03
2014-09-18,4.94
2014-09-19,4.71
2014-09-22,4.43
2014-09-23,4.68
2014-09-24,4.5
2014-09-25,4.67
2014-09-26,4.54
2014-09-29,4.48
2014-09-30,4.37
2014-10-01,4.42
2014-10-02,4.42
2014-10-03,4.16
2014-10-06,4.29
2014-10-07,4.13
2014-10-08,4.54
2014-10-09,4.4
2014-10-10,4.28
2014-10-13,4.27
2014-10-14,4.3
2014-10-15,4.38
2014-10-16,4.34
2014-10-17,4.08
2014-10-20,4.22
2014-10-21,4.15
2014-10-22,3.85
2014-10-23,3.84
2014-10-24,3.79
2014-10-27,3.6
2014-10-28,3.68
2014-10-29,3.47
2014-10-30,3.15
2014-10-31,3.04
2014-11-03,3.14
2014-11-04,2.95
2014-11-05,2.67
2014-11-06,2.83
2014-11-07,2.95
2014-11-10,2.61
2014-11-11,2.84
2014-11-12,2.68
2014-11-13,2.56
2014-11-14,2.76
2014-11-17,2.87
2014-11-18,3.16
2014-11-19,2.87
2014-11-20,3.03
2014-11-21,2.98
2014-11-24,2.95
2014-11-25,3.06
2014-11-26,2.92
2014-11-28,2.61
2014-12-01,2.81
2014-12-02,2.57
2014-12-03,2.75
2014-12-04,2.57
2014-12-05,2.51
2014-12-08,2.44
2014-12-09,2.52
2014-12-10,2.39
2014-12-11,2.28
2014-12-12,2.24
2014-12-15,1.86
2014-12-16,1.85
2014-12-17,2.04
2014-12-18,2.18
2014-12-19,2.23
2014-12-22,1.96
2014-12-23,1.95
2014-12-24,2.05
2014-12-26,2.17
2014-12-29,2.04
2014-12-30,2.18
2014-12-31,2.16
2015-01-02,2.28
2015-01-05,2.39
2015-01-06,2.49
2015-01-07,2.38
2015-01-08,2.29
2015-01-09,2.4
2015-01-12,2.62
2015-01-13,2.55
2015-01-14,2.44
2015-01-15,2.55
2015-01-16,2.71
2015-01-20,2.94
2015-01-21,3.01
2015-01-22,2.93
2015-01-23,2.82
2015-01-26,2.85
2015-01-27,3.02
2015-01-28,2.8
2015-01-29,2.63
2015-01-30,2.74
2015-02-02,2.76
2015-02-03,2.61
2015-02-04,2.65
2015-02-05,2.7
2015-02-06,2.55
2015-02-09,2.52
2015-02-10,2.45
2015-02-11,2.38
2015-02-12,2.4
2015-02-13,2.48
2015-02-17,2.35
2015-02-18,2.41
2015-02-19,2.33
2015-02-20,2.25
2015-02-23,2.25
2015-02-24,2.23
2015-02-25,2.32
2015-02-26,2.3
2015-02-27,2.36
2015-03-02,2.27
2015-03-03,2.2
2015-03-04,2.15
2015-03-05,2.05
2015-03-06,1.96
2015-03-09,1.82
2015-03-10,1.68
2015-03-11,1.81
2015-03-12,1.69
2015-03-13,1.69
2015-03-16,1.75
2015-03-17,1.67
2015-03-18,1.88
2015-03-19,2.06
2015-03-20,2.06
2015-03-23,2.16
2015-03-24,2.21
2015-03-25,2.15
2015-03-26,2.07
2015-03-27,2.02
2015-03-30,1.95
2015-03-31,1.9
2015-04-01,2.06
2015-04-02,2.01
2015-04-06,2.1
2015-04-07,2.09
2015-04-08,1.97
2015-04-09,1.92
2015-04-10,1.97
2015-04-13,1.93
2015-04-14,1.98
2015-04-15,2.02
2015-04-16,1.98
2015-04-17,1.94
2015-04-20,1.93
2015-04-21,1.95
2015-04-22,1.86
2015-04-23,1.96
2015-04-24,1.9
2015-04-27,2.03
2015-04-28,2.15
2015-04-29,2.12
2015-04-30,2.02
2015-05-01,2.03
2015-05-04,2.07
2015-05-05,2.04
2015-05-06,1.96
2015-05-07,2.04
2015-05-08,2.03
2015-05-11,2.06
2015-05-12,2.16
2015-05-13,2.21
2015-05-14,2.27
2015-05-15,2.29
2015-05-18,2.34
2015-05-19,2.2
2015-05-20,2.26
2015-05-21,2.18
2015-05-22,2.15
2015-05-26,2.02
2015-05-27,2
2015-05-28,2.06
2015-05-29,1.97
2015-06-01,2
2015-06-02,2.06
2015-06-03,2.04
2015-06-04,2
2015-06-05,1.99
2015-06-08,2.05
2015-06-09,2.05
2015-06-10,2.05
2015-06-11,2.14
2015-06-12,2.17
2015-06-15,2.14
2015-06-16,2.06
2015-06-17,2.11
2015-06-18,2.11
2015-06-19,2.19
2015-06-22,2.04
2015-06-23,2.02
2015-06-24,2.03
2015-06-25,2.05
2015-06-26,2.03
2015-06-29,2.02
2015-06-30,1.99
2015-07-01,1.9
2015-07-02,1.92
2015-07-06,2.02
2015-07-07,1.89
2015-07-08,1.82
2015-07-09,1.8
2015-07-10,1.76
2015-07-13,1.84
2015-07-14,1.85
2015-07-15,1.72
2015-07-16,1.73
2015-07-17,1.61
2015-07-20,1.44
2015-07-21,1.42
2015-07-22,1.42
2015-07-23,1.32
2015-07-24,1.44
2015-07-27,1.34
2015-07-28,1.34
2015-07-29,1.33
2015-07-30,1.35
2015-07-31,1.37
2015-08-03,1.35
2015-08-04,1.36
2015-08-05,1.25
2015-08-06,1.35
2015-08-07,1.37
2015-08-10,1.55
2015-08-11,1.63
2015-08-12,1.9
2015-08-13,1.77
2015-08-14,1.74
2015-08-17,1.84
2015-08-18,1.72
2015-08-19,1.8
2015-08-20,1.78
2015-08-21,1.65
2015-08-24,1.48
2015-08-25,1.49
2015-08-26,1.4
2015-08-27,1.52
2015-08-28,1.68
2015-08-31,1.69
2015-09-01,1.69
2015-09-02,1.63
2015-09-03,1.57
2015-09-04,1.57
2015-09-08,1.59
2015-09-09,1.51
2015-09-10,1.45
2015-09-11,1.53
2015-09-14,1.56
2015-09-15,1.5
2015-09-16,1.61
2015-09-17,1.64
2015-09-18,1.6
2015-09-21,1.62
2015-09-22,1.56
2015-09-23,1.52
2015-09-24,1.64
2015-09-25,1.62
2015-09-28,1.54
2015-09-29,1.52
2015-09-30,1.55
2015-10-01,1.62
2015-10-02,1.68
2015-10-05,1.72
2015-10-06,1.77
2015-10-07,1.78
2015-10-08,1.74
2015-10-09,1.81
2015-10-12,1.75
2015-10-13,1.74
2015-10-14,1.89
2015-10-15,1.92
2015-10-16,1.84
2015-10-19,1.73
2015-10-20,1.82
2015-10-21,1.74
2015-10-22,1.76
2015-10-23,1.79
2015-10-26,1.77
2015-10-27,1.74
2015-10-28,1.74
2015-10-29,1.66
2015-10-30,1.65
2015-11-02,1.56
2015-11-03,1.56
2015-11-04,1.52
2015-11-05,1.48
2015-11-06,1.44
2015-11-09,1.51
2015-11-10,1.46
2015-11-11,1.5
2015-11-12,1.47
2015-11-13,1.49
2015-11-16,1.55
2015-11-17,1.41
2015-11-18,1.42
2015-11-19,1.46
2015-11-20,1.37
2015-11-23,1.38
2015-11-24,1.45
2015-11-25,1.46
2015-11-27,1.38
2015-11-30,1.42
2015-12-01,1.48
2015-12-02,1.44
2015-12-03,1.51
2015-12-04,1.46
2015-12-07,1.39
2015-12-08,1.4
2015-12-09,1.42
2015-12-10,1.44
2015-12-11,1.41
2015-12-14,1.38
2015-12-15,1.4
2015-12-16,1.45
2015-12-17,1.37
2015-12-18,1.43
2015-12-21,1.42
2015-12-22,1.42
2015-12-23,1.44
2015-12-24,1.45
2015-12-28,1.41
2015-12-29,1.4
2015-12-30,1.39
2015-12-31,1.42
2016-01-04,1.44
2016-01-05,1.44
2016-01-06,1.46
2016-01-07,1.44
2016-01-08,1.41
2016-01-11,1.35
2016-01-12,1.26
2016-01-13,1.21
2016-01-14,1.16
2016-01-15,1.1
2016-01-19,1.01
2016-01-20,1.04
2016-01-21,1.05
2016-01-22,1.08
2016-01-25,1.1
2016-01-26,1.25
2016-01-27,1.27
2016-01-28,1.24
2016-01-29,1.24
2016-02-01,1.26
2016-02-02,1.18
2016-02-03,1.23
2016-02-04,1.27
2016-02-05,1.35
2016-02-08,1.58
2016-02-09,1.47
2016-02-10,1.47
2016-02-11,1.68
2016-02-12,1.71
2016-02-16,1.6
2016-02-17,1.62
2016-02-18,1.75
2016-02-19,1.77
2016-02-22,1.64
2016-02-23,1.61
2016-02-24,1.68
2016-02-25,1.69
2016-02-26,1.66
2016-02-29,1.68
2016-03-01,1.59
2016-03-02,1.72
2016-03-03,1.88
2016-03-04,2.1
2016-03-07,2.27
2016-03-08,2.23
2016-03-09,2.3
2016-03-10,2.73
2016-03-11,2.56
2016-03-14,2.58
2016-03-15,2.41
2016-03-16,2.66
2016-03-17,2.6
2016-03-18,2.63
2016-03-21,2.63
2016-03-22,2.62
2016-03-23,2.43
2016-03-24,2.43
2016-03-28,2.37
2016-03-29,2.57
2016-03-30,2.5
2016-03-31,2.46
2016-04-01,2.48
2016-04-04,2.41
2016-04-05,2.51
2016-04-06,2.5
2016-04-07,2.67
2016-04-08,2.8
2016-04-11,3.03
2016-04-12,2.97
2016-04-13,2.99
2016-04-14,2.9
2016-04-15,3.05
2016-04-18,3.07
2016-04-19,3.82
2016-04-20,3.72
2016-04-21,3.93
2016-04-22,3.78
2016-04-25,3.68
2016-04-26,3.79
2016-04-27,3.87
2016-04-28,3.99
2016-04-29,4.15
2016-05-02,3.95
2016-05-03,3.83
2016-05-04,3.54
2016-05-05,3.87
2016-05-06,3.9
2016-05-09,3.59
2016-05-10,3.72
2016-05-11,3.7
2016-05-12,3.71
2016-05-13,3.67
2016-05-16,3.71
2016-05-17,3.8
2016-05-18,3.44
2016-05-19,3.36
2016-05-20,3.53
2016-05-23,3.5
2016-05-24,3.14
2016-05-25,3.29
2016-05-26,3.26
2016-05-27,3.05
2016-05-31,3.1
2016-06-01,3.06
2016-06-02,3.11
2016-06-03,3.46
2016-06-06,3.47
2016-06-07,3.48
2016-06-08,3.65
2016-06-09,3.7
2016-06-10,3.62
2016-06-13,3.64
2016-06-14,3.51
2016-06-15,3.76
2016-06-16,3.62
2016-06-17,3.66
2016-06-20,3.79
2016-06-21,3.65
2016-06-22,3.64
2016-06-23,3.6
2016-06-24,3.78
2016-06-27,3.77
2016-06-28,3.82
2016-06-29,3.89
2016-06-30,3.95
2016-07-01,4.07
2016-07-05,4.29
2016-07-06,4.67
2016-07-07,4.38
2016-07-08,4.7
2016-07-11,5
2016-07-12,4.67
2016-07-13,4.9
2016-07-14,4.9
2016-07-15,4.86
2016-07-18,4.8
2016-07-19,4.67
2016-07-20,4.17
2016-07-21,4.44
2016-07-22,4.47
2016-07-25,4.25
2016-07-26,4.41
2016-07-27,4.73
2016-07-28,4.76
2016-07-29,4.85
2016-08-01,5
2016-08-02,5.11
2016-08-03,5.03
2016-08-04,5.24
2016-08-05,5.04
2016-08-08,5.25
2016-08-09,5.33
2016-08-10,5.68
2016-08-11,5.59
2016-08-12,5.54
2016-08-15,5.67
2016-08-16,5.73
2016-08-17,5.65
2016-08-18,5.83
2016-08-19,5.57
2016-08-22,5.25
2016-08-23,5.21
2016-08-24,4.6
2016-08-25,4.7
2016-08-26,4.71
2016-08-29,4.79
2016-08-30,4.44
2016-08-31,4.32
2016-09-01,4.55
2016-09-02,4.96
2016-09-06,5.49
2016-09-07,5.62
2016-09-08,5.54
2016-09-09,4.96
2016-09-12,5.41
2016-09-13,4.96
2016-09-14,5.01
2016-09-15,5.03
2016-09-16,4.88
2016-09-19,5.03
2016-09-20,5.05
2016-09-21,5.59
2016-09-22,5.47
2016-09-23,5.23
2016-09-26,5.04
2016-09-27,4.97
2016-09-28,5.17
2016-09-29,5.17
2016-09-30,5.13
2016-10-03,5.03
2016-10-04,4.46
2016-10-05,4.36
2016-10-06,4.09
2016-10-07,4.21
2016-10-10,4.3
2016-10-11,4.04
2016-10-12,4.13
2016-10-13,4.14
2016-10-14,4.03
2016-10-17,4.28
2016-10-18,4.56
2016-10-19,4.68
2016-10-20,4.6
2016-10-21,4.58
2016-10-24,4.38
2016-10-25,4.53
2016-10-26,4.34
2016-10-27,4.22
2016-10-28,4.23
2016-10-31,4.4
2016-11-01,4.6
2016-11-02,4.52
2016-11-03,4.9
2016-11-04,4.85
2016-11-07,4.69
2016-11-08,4.52
2016-11-09,4.74
2016-11-10,4.34
2016-11-11,3.74
2016-11-14,3.8
2016-11-15,4.09
2016-11-16,3.91
2016-11-17,3.74
2016-11-18,3.76
2016-11-21,3.89
2016-11-22,3.94
2016-11-23,3.73
2016-11-25,3.65
2016-11-28,3.91
2016-11-29,3.87
2016-11-30,3.8
2016-12-01,3.72
2016-12-02,3.92
2016-12-05,4.04
2016-12-06,3.91
2016-12-07,3.98
2016-12-08,3.88
2016-12-09,3.61
2016-12-12,3.58
2016-12-13,3.88
2016-12-14,3.62
2016-12-15,3.36
2016-12-16,3.32
2016-12-19,3.36
2016-12-20,3.35
2016-12-21,3.23
2016-12-22,3.13
2016-12-23,3.25
2016-12-27,3.44
2016-12-28,3.45
2016-12-29,3.9
2016-12-30,3.52
2017-01-03,3.81
2017-01-04,3.87
2017-01-05,4.32
2017-01-06,4.02
2017-01-09,4.03
2017-01-10,4.1
2017-01-11,4.04
2017-01-12,4
2017-01-13,4.03
2017-01-17,4.19
2017-01-18,4.04
2017-01-19,4.02
2017-01-20,4.11
2017-01-23,4.18
2017-01-24,4.06
2017-01-25,4.08
2017-01-26,3.92
2017-01-27,4.11
2017-01-30,4.05
2017-01-31,4.23
2017-02-01,4.27
2017-02-02,4.34
2017-02-03,4.37
2017-02-06,4.75
2017-02-07,4.71
2017-02-08,4.85
2017-02-09,4.66
2017-02-10,4.8
2017-02-13,4.69
2017-02-14,4.74
2017-02-15,4.67
2017-02-16,4.8
2017-02-17,4.73
2017-02-21,4.74
2017-02-22,4.7
2017-02-23,4.74
2017-02-24,4.6
2017-02-27,4.15
2017-02-28,4.34
2017-03-01,4.39
2017-03-02,3.3
2017-03-03,3.31
2017-03-06,3.03
2017-03-07,3
2017-03-08,2.93
2017-03-09,2.84
2017-03-10,3.12
2017-03-13,3.33
2017-03-14,3.03
2017-03-15,3.43
2017-03-16,3.28
2017-03-17,3.12
2017-03-20,3.21
2017-03-21,3.27
2017-03-22,3.13
2017-03-23,3.12
2017-03-24,3.08
2017-03-27,3.18
2017-03-28,3.09
2017-03-29,3.17
2017-03-30,3.15
2017-03-31,3.18
2017-04-03,3.37
2017-04-04,3.73
2017-04-05,3.52
2017-04-06,3.58
2017-04-07,3.43
2017-04-10,3.37
2017-04-11,3.42
2017-04-12,3.45
2017-04-13,3.32
2017-04-17,3.23
2017-04-18,3.2
2017-04-19,3.09
2017-04-20,3.09
2017-04-21,3.11
2017-04-24,3.02
2017-04-25,2.9
2017-04-26,2.97
2017-04-27,2.94
2017-04-28,3.08
2017-05-01,2.89
2017-05-02,2.92
2017-05-03,3.16
2017-05-04,2.88
2017-05-05,2.88
2017-05-08,2.88
2017-05-09,2.87
2017-05-10,2.91
2017-05-11,3.11
2017-05-12,3.17
2017-05-15,3.25
2017-05-16,3.3
2017-05-17,3.28
2017-05-18,3.17
2017-05-19,3.12
2017-05-22,3.13
2017-05-23,2.96
2017-05-24,2.99
2017-05-25,2.93
2017-05-26,2.93
2017-05-30,2.92
2017-05-31,2.91
2017-06-01,2.9
2017-06-02,2.91
2017-06-05,2.93
2017-06-06,3.1
2017-06-07,3.05
2017-06-08,3.04
2017-06-09,2.97
2017-06-12,3.06
2017-06-13,3.12
2017-06-14,2.9
2017-06-15,2.9
2017-06-16,2.91
2017-06-19,2.86
2017-06-20,2.86
2017-06-21,2.86
2017-06-22,3.04
2017-06-23,3.17
2017-06-26,3.15
2017-06-27,3.15
2017-06-28,3.21
2017-06-29,3.13
2017-06-30,3.05
2017-07-03,2.92
2017-07-05,2.96
2017-07-06,2.89
2017-07-07,2.8
2017-07-10,2.97
2017-07-11,2.98
2017-07-12,2.94
2017-07-13,2.87
2017-07-14,2.92
2017-07-17,2.99
2017-07-18,3.02
2017-07-19,3.02
2017-07-20,3.03
2017-07-21,3.06
2017-07-24,2.97
2017-07-25,2.97
2017-07-26,3.07
2017-07-27,2.97
2017-07-28,3.09
2017-07-31,3.05
2017-08-01,3.01
2017-08-02,2.89
2017-08-03,2.43
2017-08-04,2.29
2017-08-07,2.21
2017-08-08,2.21
2017-08-09,2.09
2017-08-10,2.26
2017-08-11,2.16
2017-08-14,2.22
2017-08-15,2.14
2017-08-16,2.25
2017-08-17,2.23
2017-08-18,2.22
2017-08-21,2.2
2017-08-22,2.16
2017-08-23,2.17
2017-08-24,2.23
2017-08-25,2.29
2017-08-28,2.49
2017-08-29,2.38
2017-08-30,2.32
2017-08-31,2.49
2017-09-01,2.48
2017-09-05,2.62
2017-09-06,2.57
2017-09-07,2.64
2017-09-08,2.58
2017-09-11,2.46
2017-09-12,2.58
2017-09-13,2.51
2017-09-14,2.53
2017-09-15,2.47
2017-09-18,2.38
2017-09-19,2.37
2017-09-20,2.42
2017-09-21,2.34
2017-09-22,2.42
2017-09-25,2.43
2017-09-26,2.38
2017-09-27,2.42
2017-09-28,2.41
2017-09-29,2.38
2017-10-02,2.42
2017-10-03,2.45
2017-10-04,2.51
2017-10-05,2.49
2017-10-06,2.59
2017-10-09,2.7
2017-10-10,2.56
2017-10-11,2.57
2017-10-12,2.53
2017-10-13,2.51
2017-10-16,2.42
2017-10-17,2.36
2017-10-18,2.33
2017-10-19,2.34
2017-10-20,2.3
2017-10-23,2.3
2017-10-24,2.3
2017-10-25,2.24
2017-10-26,2.13
2017-10-27,2.16
2017-10-30,2.17
2017-10-31,2.08
2017-11-01,1.98
2017-11-02,2.18
2017-11-03,2.07
2017-11-06,2.21
2017-11-07,2.15
2017-11-08,2.15
2017-11-09,2.14
2017-11-10,2.15
2017-11-13,2.1
2017-11-14,2.05
2017-11-15,2.06
2017-11-16,2.07
2017-11-17,2.14
2017-11-20,2.07
2017-11-21,2.08
2017-11-22,2.14
2017-11-24,2.09
2017-11-27,2.13
2017-11-28,2.12
2017-11-29,2.11
2017-11-30,2.1
2017-12-01,2.14
2017-12-04,2.11
2017-12-05,2.09
2017-12-06,2.04
2017-12-07,2
2017-12-08,2.04
2017-12-11,2.05
2017-12-12,2.08
2017-12-13,2.29
2017-12-14,2.25
2017-12-15,2.36
2017-12-18,2.39
2017-12-19,2.41
2017-12-20,2.48
2017-12-21,2.45
2017-12-22,2.47
2017-12-26,2.51
2017-12-27,2.43
2017-12-28,2.46
2017-12-29,2.39
2018-01-02,2.6
2018-01-03,2.51
2018-01-04,2.54
2018-01-05,2.47
2018-01-08,2.39
2018-01-09,2.35
2018-01-10,2.45
2018-01-11,2.5
2018-01-12,2.63
2018-01-16,2.6
2018-01-17,2.53
2018-01-18,2.38
2018-01-19,2.39
2018-01-22,2.42
2018-01-23,2.46
2018-01-24,2.54
2018-01-25,2.49
2018-01-26,2.47
2018-01-29,2.35
2018-01-30,2.33
2018-01-31,2.39
2018-02-01,2.38
2018-02-02,2.24
2018-02-05,2.26
2018-02-06,2.25
2018-02-07,2.19
2018-02-08,2.15
2018-02-09,2.11
2018-02-12,2.23
2018-02-13,2.21
2018-02-14,2.4
2018-02-15,2.4
2018-02-16,2.29
2018-02-20,2.2
2018-02-21,2.21
2018-02-22,2.21
2018-02-23,2.26
2018-02-26,2.33
2018-02-27,2.22
2018-02-28,2.2
2018-03-01,2.29
2018-03-02,2.36
2018-03-05,2.37
2018-03-06,2.44
2018-03-07,2.44
2018-03-08,2.4
2018-03-09,2.46
2018-03-12,2.48
2018-03-13,2.48
2018-03-14,2.48
2018-03-15,2.43
2018-03-16,2.39
2018-03-19,2.38
2018-03-20,2.33
2018-03-21,2.49
2018-03-22,2.47
2018-03-23,2.51
2018-03-26,2.52
2018-03-27,2.45
2018-03-28,2.38
2018-03-29,2.43
2018-04-02,2.44
2018-04-03,2.39
2018-04-04,2.43
2018-04-05,2.45
2018-04-06,2.42
2018-04-09,2.59
2018-04-10,2.69
2018-04-11,2.71
2018-04-12,2.71
2018-04-13,2.81
2018-04-16,2.82
2018-04-17,2.96
2018-04-18,3.09
2018-04-19,3.16
2018-04-20,3.06
2018-04-23,2.94
2018-04-24,3.05
2018-04-25,3
2018-04-26,3.04
2018-04-27,3.04
2018-04-30,3
2018-05-01,2.99
2018-05-02,3.04
2018-05-03,2.94
2018-05-04,2.86
2018-05-07,2.81
2018-05-08,2.84
2018-05-09,2.84
2018-05-10,2.95
2018-05-11,2.92
2018-05-14,2.88
2018-05-15,2.8
2018-05-16,2.83
2018-05-17,2.85
2018-05-18,2.87
2018-05-21,2.9
2018-05-22,2.86
2018-05-23,2.93
2018-05-24,2.94
2018-05-25,2.85
2018-05-29,2.84
2018-05-30,2.84
2018-05-31,2.81
2018-06-01,2.81
2018-06-04,2.73
2018-06-05,2.77
2018-06-06,2.85
2018-06-07,2.85
2018-06-08,2.81
2018-06-11,2.87
2018-06-12,3
2018-06-13,3.24
2018-06-14,3.31
2018-06-15,3.2
2018-06-18,3.23
2018-06-19,3.16
2018-06-20,3.15
2018-06-21,3.16
2018-06-22,3.21
2018-06-25,3.12
2018-06-26,3.16
2018-06-27,3.11
2018-06-28,3.04
2018-06-29,3.12
2018-07-02,3.13
2018-07-03,3.26
2018-07-05,3.22
2018-07-06,3.23
2018-07-09,3.31
2018-07-10,3.13
2018-07-11,2.97
2018-07-12,2.97
2018-07-13,2.94
2018-07-16,2.9
2018-07-17,2.87
2018-07-18,2.88
2018-07-19,2.87
2018-07-20,2.97
2018-07-23,2.91
2018-07-24,2.91
2018-07-25,2.97
2018-07-26,2.92
2018-07-27,2.91
2018-07-30,2.9
2018-07-31,2.93
2018-08-01,2.87
2018-08-02,2.53
2018-08-03,2.58
2018-08-06,2.54
2018-08-07,2.52
2018-08-08,2.41
2018-08-09,2.44
2018-08-10,2.52
2018-08-13,2.31
2018-08-14,2.32
2018-08-15,2.21
2018-08-16,2.09
2018-08-17,2.2
2018-08-20,2.24
2018-08-21,2.27
2018-08-22,2.26
2018-08-23,2.2
2018-08-24,2.33
2018-08-27,2.38
2018-08-28,2.32
2018-08-29,2.29
2018-08-30,2.29
2018-08-31,2.24
2018-09-04,2.19
2018-09-05,2.15
2018-09-06,2.16
2018-09-07,2.18
2018-09-10,2.14
2018-09-11,2.16
2018-09-12,2.24
2018-09-13,2.23
2018-09-14,2.21
2018-09-17,2.28
2018-09-18,2.27
2018-09-19,2.3
2018-09-20,2.33
2018-09-21,2.29
2018-09-24,2.3
2018-09-25,2.29
2018-09-26,2.24
2018-09-27,2.25
2018-09-28,2.31
2018-10-01,2.23
2018-10-02,2.35
2018-10-03,2.28
2018-10-04,2.33
2018-10-05,2.29
2018-10-08,2.32
2018-10-09,2.24
2018-10-10,2.28
2018-10-11,2.48
2018-10-12,2.41
2018-10-15,2.47
2018-10-16,2.41
2018-10-17,2.43
2018-10-18,2.41
2018-10-19,2.35
2018-10-22,2.3
2018-10-23,2.29
2018-10-24,2.22
2018-10-25,2.09
2018-10-26,2.13
2018-10-29,2.08
2018-10-30,2.06
2018-10-31,1.97
2018-11-01,2.13
2018-11-02,2.12
2018-11-05,2.14
2018-11-06,2.1
2018-11-07,2.08
2018-11-08,2.04
2018-11-09,2.01
2018-11-12,1.89
2018-11-13,1.79
2018-11-14,1.93
2018-11-15,1.98
2018-11-16,2.01
2018-11-19,2
2018-11-20,1.93
2018-11-21,2.03
2018-11-23,1.93
2018-11-26,1.83
2018-11-27,1.81
2018-11-28,1.86
2018-11-29,1.91
2018-11-30,1.85
2018-12-03,1.9
2018-12-04,1.85
2018-12-06,1.84
2018-12-07,1.97
2018-12-10,1.91
2018-12-11,1.9
2018-12-12,2.11
2018-12-13,2
2018-12-14,2.01
2018-12-17,2.09
2018-12-18,2.15
2018-12-19,1.95
2018-12-20,2.08
2018-12-21,2.01
2018-12-24,2.05
2018-12-26,2.09
2018-12-27,2.12
2018-12-28,2.15
2018-12-31,2.15
2019-01-02,2.2
2019-01-03,2.27
2019-01-04,2.27
2019-01-07,2.2
2019-01-08,2.24
2019-01-09,2.27
2019-01-10,2.23
2019-01-11,2.2
2019-01-14,2.19
2019-01-15,2.08
2019-01-16,2.02
2019-01-17,2.02
2019-01-18,1.95
2019-01-22,2
2019-01-23,1.97
2019-01-24,1.95
2019-01-25,2.06
2019-01-28,2.02
2019-01-29,2.12
2019-01-30,2.16
2019-01-31,2.22
2019-02-01,2.24
2019-02-04,2.27
2019-02-05,2.27
2019-02-06,2.27
2019-02-07,2.21
2019-02-08,2.24
2019-02-11,2.27
2019-02-12,2.22
2019-02-13,2.19
2019-02-14,2.23
2019-02-15,2.31
2019-02-19,2.46
2019-02-20,2.49
2019-02-21,2.47
2019-02-22,2.5
2019-02-25,2.54
2019-02-26,2.7
2019-02-27,2.61
2019-02-28,2.57
2019-03-01,2.43
2019-03-04,2.4
2019-03-05,2.53
2019-03-06,2.59
2019-03-07,2.52
2019-03-08,2.74
2019-03-11,2.67
2019-03-12,2.7
2019-03-13,2.7
2019-03-14,2.58
2019-03-15,2.6
2019-03-18,2.57
2019-03-19,2.68
2019-03-20,2.71
2019-03-21,2.8
2019-03-22,2.77
2019-03-25,2.82
2019-03-26,2.8
2019-03-27,2.69
2019-03-28,2.53
2019-03-29,2.52
2019-04-01,2.42
2019-04-02,2.41
2019-04-03,2.41
2019-04-04,2.49
2019-04-05,2.49
2019-04-08,2.53
2019-04-09,2.56
2019-04-10,2.5
2019-04-11,2.32
2019-04-12,2.3
2019-04-15,2.36
2019-04-16,2.26
2019-04-17,2.27
2019-04-18,2.2
2019-04-22,2.11
2019-04-23,2.09
2019-04-24,2.17
2019-04-25,2.14
2019-04-26,2.25
2019-04-29,2.17
2019-04-30,2.2
2019-05-01,2.13
2019-05-02,2.09
2019-05-03,2.13
2019-05-06,2.04
2019-05-07,2.08
2019-05-08,1.96
2019-05-09,1.89
2019-05-10,1.86
2019-05-13,1.96
2019-05-14,1.86
2019-05-15,1.85
2019-05-16,1.8
2019-05-17,1.81
2019-05-20,1.8
2019-05-21,1.78
2019-05-22,1.73
2019-05-23,1.71
2019-05-24,1.74
2019-05-28,1.69
2019-05-29,1.7
2019-05-30,1.73
2019-05-31,1.79
2019-06-03,1.92
2019-06-04,1.86
2019-06-05,1.87
2019-06-06,1.88
2019-06-07,1.87
2019-06-10,1.77
2019-06-11,1.82
2019-06-12,1.82
2019-06-13,1.845
2019-06-14,1.81
2019-06-17,1.875
2019-06-18,1.865
2019-06-19,1.9
2019-06-20,1.995
2019-06-21,2.06
2019-06-24,2.105
2019-06-25,2.105
2019-06-26,2.06
2019-06-27,2.045
2019-06-28,2.05
2019-07-01,1.965
2019-07-02,2.045
2019-07-03,2.055
2019-07-04,2.055
2019-07-05,1.99
2019-07-08,1.955
2019-07-09,2
2019-07-10,1.865
2019-07-11,1.795
2019-07-12,1.765
2019-07-15,1.855
2019-07-16,2.03
2019-07-17,2.185
2019-07-18,2.395
2019-07-19,2.355
2019-07-22,2.425
2019-07-23,2.385
2019-07-24,2.565
2019-07-25,2.375
2019-07-26,2.395
2019-07-29,2.405
2019-07-30,2.43
2019-07-31,2.295
2019-08-01,2.445
2019-08-02,2.365
2019-08-05,2.55
2019-08-06,2.545
2019-08-07,2.625
2019-08-08,2.605
2019-08-09,2.605
2019-08-12,2.665
2019-08-13,2.455
2019-08-14,2.555
2019-08-15,2.555
2019-08-16,2.415
2019-08-19,2.385
2019-08-20,2.515
2019-08-21,2.445
2019-08-22,2.445
2019-08-23,2.565
2019-08-26,2.51
2019-08-27,2.65
2019-08-28,2.655
2019-08-29,2.525
2019-08-30,2.625
2019-09-02,2.64
2019-09-03,3.05
2019-09-04,3.025
2019-09-05,2.77
2019-09-06,2.685
2019-09-09,2.515
2019-09-10,2.51
2019-09-11,2.535
2019-09-12,2.475
2019-09-13,2.365
2019-09-16,2.42
2019-09-17,2.485
2019-09-18,2.395
2019-09-19,2.415
2019-09-20,2.48
2019-09-23,2.735
2019-09-24,2.75
2019-09-25,2.635
2019-09-26,2.535
2019-09-27,2.44
2019-09-30,2.22
2019-10-01,2.285
2019-10-02,2.355
2019-10-03,2.365
2019-10-04,2.425
2019-10-07,2.365
2019-10-08,2.44
2019-10-09,2.375
2019-10-10,2.155
2019-10-11,2.09
2019-10-14,2.1
2019-10-15,2.045
2019-10-16,2.145
2019-10-17,2.24
2019-10-18,2.255
2019-10-21,2.23
2019-10-22,2.22
2019-10-23,2.255
2019-10-24,2.395
2019-10-25,2.415
2019-10-28,2.345
2019-10-29,2.375
2019-10-30,2.395
2019-10-31,2.485
2019-11-01,2.585
2019-11-04,2.525
2019-11-05,2.26
2019-11-06,2.295
2019-11-07,2.25
2019-11-08,2.185
2019-11-11,2.275
2019-11-12,2.335
2019-11-13,2.315
2019-11-14,2.365
2019-11-15,2.335
2019-11-18,2.415
2019-11-19,2.335
2019-11-20,2.355
2019-11-21,2.125
2019-11-22,2.125
2019-11-25,1.975
