date,close
2017-06-29,10
2017-06-30,9.34
2017-07-03,9.67
2017-07-05,8.84
2017-07-06,8.06
2017-07-07,7.73
2017-07-10,8.14
2017-07-11,7.14
2017-07-12,7.56
2017-07-13,7.4
2017-07-14,7.36
2017-07-17,6.59
2017-07-18,6.36
2017-07-19,6.65
2017-07-20,6.52
2017-07-21,6.55
2017-07-24,7.41
2017-07-25,7.5
2017-07-26,6.75
2017-07-27,6.72
2017-07-28,6.74
2017-07-31,6.61
2017-08-01,6.37
2017-08-02,6.2
2017-08-03,6.22
2017-08-04,5.83
2017-08-07,5.85
2017-08-08,5.81
2017-08-09,6.24
2017-08-10,5.14
2017-08-11,5.12
2017-08-14,5.36
2017-08-15,5.65
2017-08-16,5.5
2017-08-17,5.39
2017-08-18,5.31
2017-08-21,5.24
2017-08-22,5.25
2017-08-23,5.47
2017-08-24,5.48
2017-08-25,5.39
2017-08-28,5.38
2017-08-29,5.17
2017-08-30,5.33
2017-08-31,5.24
2017-09-01,5.22
2017-09-05,5.22
2017-09-06,5.47
2017-09-07,5.34
2017-09-08,5.38
2017-09-11,5.41
2017-09-12,5.37
2017-09-13,5.39
2017-09-14,5.65
2017-09-15,6.06
2017-09-18,5.67
2017-09-19,5.51
2017-09-20,5.22
2017-09-21,5.23
2017-09-22,5.19
2017-09-25,5.54
2017-09-26,5.8
2017-09-27,5.8
2017-09-28,5.59
2017-09-29,5.45
2017-10-02,5.44
2017-10-03,5.34
2017-10-04,5.34
2017-10-05,5.32
2017-10-06,5.25
2017-10-09,5.15
2017-10-10,5.09
2017-10-11,5.09
2017-10-12,5.08
2017-10-13,5.16
2017-10-16,5.25
2017-10-17,5.38
2017-10-18,5.3
2017-10-19,5.17
2017-10-20,5.08
2017-10-23,5.15
2017-10-24,5.08
2017-10-25,5.01
2017-10-26,5.03
2017-10-27,5.13
2017-10-30,5.01
2017-10-31,4.77
2017-11-01,4.67
2017-11-02,3.8
2017-11-03,3.79
2017-11-06,3.88
2017-11-07,3.05
2017-11-08,3.19
2017-11-09,3.09
2017-11-10,3.17
2017-11-13,3.06
2017-11-14,3.06
2017-11-15,3.09
2017-11-16,3.08
2017-11-17,3.04
2017-11-20,3.01
2017-11-21,2.99
2017-11-22,2.97
2017-11-24,3.13
2017-11-27,3.07
2017-11-28,3.05
2017-11-29,2.99
2017-11-30,2.99
2017-12-01,3.23
2017-12-04,3.76
2017-12-05,3.76
2017-12-06,3.74
2017-12-07,3.78
2017-12-08,3.84
2017-12-11,3.85
2017-12-12,3.98
2017-12-13,3.97
2017-12-14,4.21
2017-12-15,4.22
2017-12-18,4.3
2017-12-19,4.45
2017-12-20,4.41
2017-12-21,4.04
2017-12-22,4.04
2017-12-26,4.14
2017-12-27,4.21
2017-12-28,4.29
2017-12-29,4.03
2018-01-02,4.13
2018-01-03,4.1
2018-01-04,3.99
2018-01-05,3.91
2018-01-08,3.71
2018-01-09,3.48
2018-01-10,3.4
2018-01-11,3.53
2018-01-12,3.41
2018-01-16,3.18
2018-01-17,3.16
2018-01-18,3.2
2018-01-19,3.06
2018-01-22,3.21
2018-01-23,3.2
2018-01-24,3.08
2018-01-25,3.05
2018-01-26,3.09
2018-01-29,3.12
2018-01-30,3.05
2018-01-31,2.99
2018-02-01,3.02
2018-02-02,3.04
2018-02-05,3.08
2018-02-06,3.12
2018-02-07,3.2
2018-02-08,3.7
2018-02-09,3.26
2018-02-12,3.35
2018-02-13,3.35
2018-02-14,3.47
2018-02-15,3.31
2018-02-16,3.56
2018-02-20,3.39
2018-02-21,3.27
2018-02-22,3.31
2018-02-23,3.1
2018-02-26,2.97
2018-02-27,2.78
2018-02-28,2.79
2018-03-01,2.71
2018-03-02,2.74
2018-03-05,2.6
2018-03-06,2.55
2018-03-07,2.49
2018-03-08,2.07
2018-03-09,2.29
2018-03-12,2.07
2018-03-13,2.15
2018-03-14,2.16
2018-03-15,2.19
2018-03-16,2.15
2018-03-19,2.17
2018-03-20,2.07
2018-03-21,2.15
2018-03-22,2.05
2018-03-23,2.04
2018-03-26,1.96
2018-03-27,1.99
2018-03-28,1.88
2018-03-29,2
2018-04-02,1.87
2018-04-03,1.8
2018-04-04,1.85
2018-04-05,1.86
2018-04-06,1.77
2018-04-09,1.85
2018-04-10,1.84
2018-04-11,1.81
2018-04-12,1.82
2018-04-13,1.93
2018-04-16,2.04
2018-04-17,1.98
2018-04-18,2.06
2018-04-19,2
2018-04-20,2
2018-04-23,1.98
2018-04-24,1.93
2018-04-25,1.97
2018-04-26,2.26
2018-04-27,2.09
2018-04-30,2.09
2018-05-01,2.1
2018-05-02,2.1
2018-05-03,2.3
2018-05-04,2.44
2018-05-07,2.55
2018-05-08,2.84
2018-05-09,2.67
2018-05-10,2.46
2018-05-11,2.44
2018-05-14,2.51
2018-05-15,2.55
2018-05-16,2.62
2018-05-17,2.77
2018-05-18,2.81
2018-05-21,3
2018-05-22,3.19
2018-05-23,2.97
2018-05-24,3.08
2018-05-25,3.05
2018-05-29,2.94
2018-05-30,3.03
2018-05-31,3.07
2018-06-01,3.19
2018-06-04,3.38
2018-06-05,3.38
2018-06-06,3.25
2018-06-07,3.19
2018-06-08,3.2
2018-06-11,3.2
2018-06-12,3.06
2018-06-13,3.05
2018-06-14,3.1
2018-06-15,3.03
2018-06-18,3.21
2018-06-19,3.28
2018-06-20,3.38
2018-06-21,3.3
2018-06-22,3.33
2018-06-25,3.26
2018-06-26,3.18
2018-06-27,3.25
2018-06-28,3.22
2018-06-29,3.35
2018-07-02,3.31
2018-07-03,3.28
2018-07-05,3.53
2018-07-06,3.35
2018-07-09,3.44
2018-07-10,3.81
2018-07-11,3.67
2018-07-12,3.92
2018-07-13,3.89
2018-07-16,3.74
2018-07-17,3.58
2018-07-18,3.55
2018-07-19,3.4
2018-07-20,3.11
2018-07-23,3.18
2018-07-24,2.94
2018-07-25,3.1
2018-07-26,3.08
2018-07-27,2.76
2018-07-30,2.46
2018-07-31,2.37
2018-08-01,2.42
2018-08-02,1.83
2018-08-03,2.16
2018-08-06,2.06
2018-08-07,2.14
2018-08-08,2.28
2018-08-09,2.24
2018-08-10,2.16
2018-08-13,2.13
2018-08-14,2.08
2018-08-15,2.03
2018-08-16,2.11
2018-08-17,2.19
2018-08-20,2.22
2018-08-21,2.27
2018-08-22,2.29
2018-08-23,2.3
2018-08-24,2.23
2018-08-27,2.14
2018-08-28,2.13
2018-08-29,2.1
2018-08-30,2.01
2018-08-31,2.02
2018-09-04,1.97
2018-09-05,1.85
2018-09-06,1.8
2018-09-07,1.82
2018-09-10,1.91
2018-09-11,1.84
2018-09-12,1.83
2018-09-13,1.87
2018-09-14,1.83
2018-09-17,1.78
2018-09-18,1.75
2018-09-19,1.68
2018-09-20,1.87
2018-09-21,1.79
2018-09-24,1.67
2018-09-25,1.82
2018-09-26,1.77
2018-09-27,1.7
2018-09-28,1.72
2018-10-01,1.6
2018-10-02,1.47
2018-10-03,1.39
2018-10-04,1.52
2018-10-05,1.52
2018-10-08,1.47
2018-10-09,1.38
2018-10-10,1.34
2018-10-11,1.3
2018-10-12,1.34
2018-10-15,1.35
2018-10-16,1.35
2018-10-17,1.31
2018-10-18,1.27
2018-10-19,1.23
2018-10-22,1.11
2018-10-23,1.18
2018-10-24,1.11
2018-10-25,1.16
2018-10-26,1.14
2018-10-29,1.27
2018-10-30,1.33
2018-10-31,1.42
2018-11-01,1.39
2018-11-02,1.41
2018-11-05,1.5
2018-11-06,1.33
2018-11-07,1.23
2018-11-08,1.24
2018-11-09,1.23
2018-11-12,1.25
2018-11-13,1.22
2018-11-14,1.17
2018-11-15,1.19
2018-11-16,1.17
2018-11-19,1.14
2018-11-20,1.08
2018-11-21,1.06
2018-11-23,1.09
2018-11-26,1.1
2018-11-27,1.07
2018-11-28,1.15
2018-11-29,1.19
2018-11-30,1.17
2018-12-03,1.15
2018-12-04,1.12
2018-12-06,1.1
2018-12-07,1.06
2018-12-10,1.04
2018-12-11,1.08
2018-12-12,1.03
2018-12-13,1.04
2018-12-14,1.05
2018-12-17,1.01
2018-12-18,0.8972
2018-12-19,0.7804
2018-12-20,0.77
2018-12-21,0.6592
2018-12-24,0.69
2018-12-26,0.785
2018-12-27,0.92
2018-12-28,1.12
2018-12-31,1.02
2019-01-02,1.08
2019-01-03,1.02
2019-01-04,0.99
2019-01-07,0.9449
2019-01-08,0.9505
2019-01-09,1.03
2019-01-10,1.05
2019-01-11,1.07
2019-01-14,1.04
2019-01-15,1.51
2019-01-16,1.43
2019-01-17,1.28
2019-01-18,1.4
2019-01-22,1.38
2019-01-23,1.34
2019-01-24,1.36
2019-01-25,1.42
2019-01-28,1.44
2019-01-29,1.5
2019-01-30,1.42
2019-01-31,1.4
2019-02-01,1.37
2019-02-04,1.38
2019-02-05,1.4
2019-02-06,1.4
2019-02-07,1.36
2019-02-08,1.42
2019-02-11,1.52
2019-02-12,1.59
2019-02-13,1.58
2019-02-14,1.52
2019-02-15,1.49
2019-02-19,1.54
2019-02-20,1.52
2019-02-21,1.49
2019-02-22,1.46
2019-02-25,1.38
2019-02-26,1.29
2019-02-27,1.06
2019-02-28,1.07
2019-03-01,1.08
2019-03-04,0.939
2019-03-05,1.01
2019-03-06,0.99
2019-03-07,0.9984
2019-03-08,0.96
2019-03-11,1.01
2019-03-12,0.9848
2019-03-13,1.02
2019-03-14,0.9893
2019-03-15,1.04
2019-03-18,1.03
2019-03-19,1.05
2019-03-20,1.03
2019-03-21,1.02
2019-03-22,0.9514
2019-03-25,0.8958
2019-03-26,0.969
2019-03-27,0.9365
2019-03-28,0.9696
2019-03-29,0.98
2019-04-01,0.9855
2019-04-02,0.9689
2019-04-03,1.04
2019-04-04,1.02
2019-04-05,1.08
2019-04-08,1.14
2019-04-09,1.15
2019-04-10,1.11
2019-04-11,1.09
2019-04-12,1.1
2019-04-15,1.04
2019-04-16,1
2019-04-17,1.01
2019-04-18,1
2019-04-22,1
2019-04-23,0.9724
2019-04-24,0.9917
2019-04-25,1
2019-04-26,1.05
2019-04-29,1.04
2019-04-30,1.03
2019-05-01,1.05
2019-05-02,1.01
2019-05-03,1
2019-05-06,0.985
2019-05-07,0.925
2019-05-08,0.9218
2019-05-09,0.8812
2019-05-10,0.8219
2019-05-13,0.7867
2019-05-14,0.7981
2019-05-15,0.76
2019-05-16,0.754
2019-05-17,0.7473
2019-05-20,0.6851
2019-05-21,0.768
2019-05-22,0.7269
2019-05-23,0.7292
2019-05-24,0.7425
2019-05-28,0.725
2019-05-29,0.7036
2019-05-30,0.703
2019-05-31,0.6945
2019-06-03,0.685
2019-06-04,0.6943
2019-06-05,0.6812
2019-06-06,0.665
2019-06-07,0.65
2019-06-10,0.6061
2019-06-11,0.6003
2019-06-12,0.643
2019-06-13,0.6627
2019-06-14,0.55
2019-06-17,8.285
2019-06-18,7.18
2019-06-19,7.54
2019-06-20,6.98
2019-06-21,6.885
2019-06-24,6.645
2019-06-25,6.67
2019-06-26,6.395
2019-06-27,7.01
2019-06-28,6.825
2019-07-01,6.94
2019-07-02,6.82
2019-07-03,6.98
2019-07-04,6.98
2019-07-05,7.38
2019-07-08,7.29
2019-07-09,7.17
2019-07-10,7.1
2019-07-11,7.16
2019-07-12,7.72
2019-07-15,7.73
2019-07-16,10.32
2019-07-17,9.73
2019-07-18,8.415
2019-07-19,8.39
2019-07-22,9.03
2019-07-23,9.41
2019-07-24,9.06
2019-07-25,9.775
2019-07-26,9.73
2019-07-29,9.32
2019-07-30,8.75
2019-07-31,8.775
2019-08-01,8.61
2019-08-02,7.785
2019-08-05,7.905
2019-08-06,8.535
2019-08-07,9.05
2019-08-08,8.61
2019-08-09,8.27
2019-08-12,8.11
2019-08-13,8.115
2019-08-14,7.74
2019-08-15,7.48
2019-08-16,7.5
2019-08-19,7.16
2019-08-20,7.05
2019-08-21,7.11
2019-08-22,7.11
2019-08-23,7.17
2019-08-26,7.2
2019-08-27,6.735
2019-08-28,6.79
2019-08-29,6.89
2019-08-30,6.805
2019-09-02,6.785
2019-09-03,7.03
2019-09-04,7.23
2019-09-05,7.48
2019-09-06,7.355
2019-09-09,7.6
2019-09-10,7.88
2019-09-11,8.14
2019-09-12,8.36
2019-09-13,8.72
2019-09-16,9.52
2019-09-17,10.34
2019-09-18,9.31
2019-09-19,9.38
2019-09-20,9.45
2019-09-23,9.255
2019-09-24,9
2019-09-25,8.59
2019-09-26,8.65
2019-09-27,8.51
2019-09-30,8.425
2019-10-01,8.39
2019-10-02,8.55
2019-10-03,8.85
2019-10-04,9.02
2019-10-07,9.23
2019-10-08,9.07
2019-10-09,9.17
2019-10-10,8.53
2019-10-11,8.35
2019-10-14,8.015
2019-10-15,8.18
2019-10-16,7.44
2019-10-17,8.09
2019-10-18,7.54
2019-10-21,7.23
2019-10-22,7.43
2019-10-23,7.46
2019-10-24,7.3
2019-10-25,7.44
2019-10-28,7.475
2019-10-29,7.13
2019-10-30,7.155
2019-10-31,7.05
2019-11-01,8.18
2019-11-04,8.69
2019-11-05,8.63
2019-11-06,8.45
2019-11-07,7.925
2019-11-08,7.71
2019-11-11,7.59
2019-11-12,7.24
2019-11-13,7.3
2019-11-14,7.205
2019-11-15,7.41
2019-11-18,7.565
2019-11-19,7.87
2019-11-20,7.56
2019-11-21,7.155
2019-11-22,7.02
2019-11-25,6.955
