date,close
2015-05-21,10.44
2015-05-22,11.08
2015-05-26,12.78
2015-05-27,12.24
2015-05-28,11.88
2015-05-29,12.22
2015-06-01,11.49
2015-06-02,11.34
2015-06-03,10.91
2015-06-04,10.76
2015-06-05,10.96
2015-06-08,11.85
2015-06-09,11.37
2015-06-10,11.59
2015-06-11,11.85
2015-06-12,12.48
2015-06-15,11.84
2015-06-16,11.93
2015-06-17,11.89
2015-06-18,12.09
2015-06-19,11.77
2015-06-22,11.62
2015-06-23,11.75
2015-06-24,11.71
2015-06-25,11.44
2015-06-26,11.06
2015-06-29,10.12
2015-06-30,10.77
2015-07-01,10.31
2015-07-02,10.23
2015-07-06,9.55
2015-07-07,7.425
2015-07-08,7.16
2015-07-09,8.13
2015-07-10,8.33
2015-07-13,8.15
2015-07-14,8.09
2015-07-15,7.67
2015-07-16,7.47
2015-07-17,7.67
2015-07-20,7.36
2015-07-21,7.75
2015-07-22,8.97
2015-07-23,8.68
2015-07-24,8.13
2015-07-27,8.79
2015-07-28,8.37
2015-07-29,8.53
2015-07-30,8.35
2015-07-31,8.31
2015-08-03,8.38
2015-08-04,8.4
2015-08-05,8.41
2015-08-06,8.19
2015-08-07,8.28
2015-08-10,8.55
2015-08-11,8.24
2015-08-12,8.09
2015-08-13,7.7
2015-08-14,7.73
2015-08-17,7.74
2015-08-18,7.87
2015-08-19,6.9
2015-08-20,6.02
2015-08-21,5.65
2015-08-24,4.69
2015-08-25,4.66
2015-08-26,4.69
2015-08-27,5.18
2015-08-28,5.28
2015-08-31,5.12
2015-09-01,4.89
2015-09-02,4.94
2015-09-03,5.28
2015-09-04,5.15
2015-09-08,5.34
2015-09-09,5.1
2015-09-10,5.11
2015-09-11,5.09
2015-09-14,4.99
2015-09-15,5.08
2015-09-16,5.29
2015-09-17,5.35
2015-09-18,5.43
2015-09-21,5.15
2015-09-22,5.19
2015-09-23,4.96
2015-09-24,5.11
2015-09-25,5.03
2015-09-28,4.8
2015-09-29,4.8
2015-09-30,4.82
2015-10-01,4.64
2015-10-02,5.25
2015-10-05,5.22
2015-10-06,5.29
2015-10-07,5.82
2015-10-08,5.72
2015-10-09,5.49
2015-10-12,5.51
2015-10-13,5.66
2015-10-14,5.42
2015-10-15,5.8
2015-10-16,5.94
2015-10-19,5.82
2015-10-20,6.1
2015-10-21,5.94
2015-10-22,6.13
2015-10-23,6.53
2015-10-26,7.54
2015-10-27,7.33
2015-10-28,7.82
2015-10-29,8.3
2015-10-30,8.64
2015-11-02,8.35
2015-11-03,8.09
2015-11-04,7.85
2015-11-05,7.45
2015-11-06,7.3
2015-11-09,7.31
2015-11-10,6.93
2015-11-11,6.82
2015-11-12,7
2015-11-13,6.13
2015-11-16,6.35
2015-11-17,6.69
2015-11-18,6.78
2015-11-19,6.87
2015-11-20,7.6
2015-11-23,7.97
2015-11-24,8.88
2015-11-25,9.5
2015-11-27,8.79
2015-11-30,7.81
2015-12-01,8.19
2015-12-02,8.11
2015-12-03,7.78
2015-12-04,7.91
2015-12-07,7.66
2015-12-08,8.11
2015-12-09,8.05
2015-12-10,8.43
2015-12-11,8.05
2015-12-14,8.05
2015-12-15,8.43
2015-12-16,8.63
2015-12-17,8.57
2015-12-18,8.86
2015-12-21,8.72
2015-12-22,8.82
2015-12-23,8.41
2015-12-24,8.56
2015-12-28,8.37
2015-12-29,8.16
2015-12-30,8.21
2015-12-31,8.21
2016-01-04,7.47
2016-01-05,7.55
2016-01-06,7.52
2016-01-07,6.77
2016-01-08,6.75
2016-01-11,6.51
2016-01-12,6.72
2016-01-13,6.53
2016-01-14,6.94
2016-01-15,6.53
2016-01-19,6.46
2016-01-20,6.14
2016-01-21,6.47
2016-01-22,6.73
2016-01-25,6.7
2016-01-26,6.4
2016-01-27,6.25
2016-01-28,6.49
2016-01-29,6.6
2016-02-01,6.475
2016-02-02,6.36
2016-02-03,6.23
2016-02-04,6.03
2016-02-05,5.96
2016-02-08,5.35
2016-02-09,5.36
2016-02-10,5.42
2016-02-11,5.08
2016-02-12,4.91
2016-02-16,5.17
2016-02-17,5.4
2016-02-18,5.67
2016-02-19,5.66
2016-02-22,6.01
2016-02-23,6.02
2016-02-24,5.68
2016-02-25,5.78
2016-02-26,6.02
2016-02-29,5.9
2016-03-01,5.9
2016-03-02,5.67
2016-03-03,5.39
2016-03-04,5.89
2016-03-07,5.95
2016-03-08,5.8
2016-03-09,5.95
2016-03-10,5.72
2016-03-11,5.88
2016-03-14,5.88
2016-03-15,5.69
2016-03-16,5.75
2016-03-17,5.78
2016-03-18,5.85
2016-03-21,6.07
2016-03-22,6.02
2016-03-23,5.84
2016-03-24,5.84
2016-03-28,5.68
2016-03-29,5.7
2016-03-30,5.89
2016-03-31,5.84
2016-04-01,5.75
2016-04-04,5.8
2016-04-05,5.63
2016-04-06,6.16
2016-04-07,6.16
2016-04-08,6.28
2016-04-11,6.15
2016-04-12,6.2
2016-04-13,6.39
2016-04-14,6.38
2016-04-15,6.48
2016-04-18,6.41
2016-04-19,6.37
2016-04-20,6.32
2016-04-21,6.29
2016-04-22,6.2
2016-04-25,5.83
2016-04-26,6.08
2016-04-27,5.9
2016-04-28,5.98
2016-04-29,5.78
2016-05-02,5.72
2016-05-03,5.69
2016-05-04,5.76
2016-05-05,5.68
2016-05-06,5.69
2016-05-09,5.44
2016-05-10,5.78
2016-05-11,5.59
2016-05-12,5.47
2016-05-13,5.55
2016-05-16,5.49
2016-05-17,5.42
2016-05-18,5.66
2016-05-19,5.57
2016-05-20,5.73
2016-05-23,5.89
2016-05-24,5.91
2016-05-25,5.75
2016-05-26,5.94
2016-05-27,6.04
2016-05-31,6.42
2016-06-01,6.15
2016-06-02,6.3
2016-06-03,6.16
2016-06-06,6.68
2016-06-07,6.85
2016-06-08,7.15
2016-06-09,6.83
2016-06-10,6.59
2016-06-13,7.17
2016-06-14,6.89
2016-06-15,7.02
2016-06-16,6.95
2016-06-17,6.83
2016-06-20,6.92
2016-06-21,6.93
2016-06-22,6.89
2016-06-23,6.98
2016-06-24,6.39
2016-06-27,6.16
2016-06-28,6.33
2016-06-29,6.41
2016-06-30,6.49
2016-07-01,6.65
2016-07-05,6.32
2016-07-06,6.4
2016-07-07,6.75
2016-07-08,6.77
2016-07-11,7
2016-07-12,6.99
2016-07-13,6.9
2016-07-14,7
2016-07-15,6.93
2016-07-18,7.26
2016-07-19,7.49
2016-07-20,7.49
2016-07-21,7.09
2016-07-22,7.2
2016-07-25,7.14
2016-07-26,7.28
2016-07-27,7.34
2016-07-28,7.29
2016-07-29,7.07
2016-08-01,7.42
2016-08-02,8.59
2016-08-03,8.37
2016-08-04,7.88
2016-08-05,8.21
2016-08-08,7.82
2016-08-09,8.15
2016-08-10,8.61
2016-08-11,9.43
2016-08-12,9.43
2016-08-15,9.9
2016-08-16,9.6
2016-08-17,9.57
2016-08-18,9.34
2016-08-19,9.51
2016-08-22,9.5
2016-08-23,10.48
2016-08-24,10.2
2016-08-25,11.58
2016-08-26,11.22
2016-08-29,12.65
2016-08-30,13.43
2016-08-31,13.19
2016-09-01,13.45
2016-09-02,14.61
2016-09-06,14.17
2016-09-07,13.95
2016-09-08,13.82
2016-09-09,13.15
2016-09-12,13.67
2016-09-13,13.41
2016-09-14,14.08
2016-09-15,14.43
2016-09-16,15.63
2016-09-19,15.21
2016-09-20,14.98
2016-09-21,15.4
2016-09-22,15.49
2016-09-23,15.41
2016-09-26,14.99
2016-09-27,15.23
2016-09-28,15.365
2016-09-29,15.31
2016-09-30,15.09
2016-10-03,16.15
2016-10-04,16.42
2016-10-05,17.19
2016-10-06,17.2
2016-10-07,17.08
2016-10-10,18.5
2016-10-11,17.12
2016-10-12,17.11
2016-10-13,15.435
2016-10-14,14.955
2016-10-17,15.04
2016-10-18,15.11
2016-10-19,15.16
2016-10-20,14.92
2016-10-21,15.15
2016-10-24,15.12
2016-10-25,15.05
2016-10-26,14.93
2016-10-27,14.48
2016-10-28,14.32
2016-10-31,13.24
2016-11-01,13.26
2016-11-02,12.92
2016-11-03,13
2016-11-04,13.49
2016-11-07,14.43
2016-11-08,14.95
2016-11-09,14.81
2016-11-10,14.39
2016-11-11,15.13
2016-11-14,15.88
2016-11-15,16.69
2016-11-16,16.05
2016-11-17,16.02
2016-11-18,15.61
2016-11-21,15.98
2016-11-22,15.99
2016-11-23,16.2
2016-11-25,16.01
2016-11-28,15.26
2016-11-29,15.35
2016-11-30,15.09
2016-12-01,14.125
2016-12-02,14.18
2016-12-05,13.58
2016-12-06,12.88
2016-12-07,12.97
2016-12-08,12.52
2016-12-09,12.23
2016-12-12,11.83
2016-12-13,12.02
2016-12-14,12.25
2016-12-15,12.36
2016-12-16,12.76
2016-12-19,12.39
2016-12-20,12.35
2016-12-21,12.25
2016-12-22,12.07
2016-12-23,11.93
2016-12-27,11.6
2016-12-28,11.42
2016-12-29,11.17
2016-12-30,12.07
2017-01-03,11.4
2017-01-04,11.3
2017-01-05,11.6
2017-01-06,11.68
2017-01-09,11.68
2017-01-10,13.13
2017-01-11,13.61
2017-01-12,13.8
2017-01-13,13.94
2017-01-17,13.41
2017-01-18,13.36
2017-01-19,13.58
2017-01-20,13.63
2017-01-23,13.56
2017-01-24,13.9
2017-01-25,13.92
2017-01-26,13.32
2017-01-27,13.4
2017-01-30,13.17
2017-01-31,13.11
2017-02-01,13.2
2017-02-02,13.14
2017-02-03,13.57
2017-02-06,14.25
2017-02-07,14.38
2017-02-08,14.45
2017-02-09,14.93
2017-02-10,15.01
2017-02-13,15.2
2017-02-14,15.38
2017-02-15,15.34
2017-02-16,15.45
2017-02-17,14.95
2017-02-21,15.89
2017-02-22,15.42
2017-02-23,14.18
2017-02-24,14.48
2017-02-27,14.35
2017-02-28,14.38
2017-03-01,14.54
2017-03-02,14.37
2017-03-03,14.04
2017-03-06,14.08
2017-03-07,14.75
2017-03-08,15.49
2017-03-09,15.47
2017-03-10,15.23
2017-03-13,15.41
2017-03-14,15.25
2017-03-15,15.61
2017-03-16,15.5
2017-03-17,15.19
2017-03-20,15.13
2017-03-21,14.1
2017-03-22,14.33
2017-03-23,14.83
2017-03-24,14.97
2017-03-27,14.93
2017-03-28,15
2017-03-29,14.89
2017-03-30,14.68
2017-03-31,14.94
2017-04-03,15.39
2017-04-04,14.91
2017-04-05,15.2
2017-04-06,14.98
2017-04-07,15.56
2017-04-10,16.86
2017-04-11,16.71
2017-04-12,15.81
2017-04-13,14.98
2017-04-17,14.6
2017-04-18,14.74
2017-04-19,15
2017-04-20,14.86
2017-04-21,14.96
2017-04-24,14.95
2017-04-25,15.21
2017-04-26,14.99
2017-04-27,15.04
2017-04-28,15.27
2017-05-01,16.34
2017-05-02,16.23
2017-05-03,15.78
2017-05-04,15.7
2017-05-05,17.66
2017-05-08,17.64
2017-05-09,19.29
2017-05-10,19.63
2017-05-11,21
2017-05-12,19.98
2017-05-15,19.86
2017-05-16,22.78
2017-05-17,20.01
2017-05-18,21.88
2017-05-19,21.69
2017-05-22,21.2
2017-05-23,20.78
2017-05-24,21.14
2017-05-25,20.96
2017-05-26,21.12
2017-05-30,21.06
2017-05-31,20.55
2017-06-01,20.62
2017-06-02,20.89
2017-06-05,20.53
2017-06-06,20.96
2017-06-07,22.78
2017-06-08,23.43
2017-06-09,21.46
2017-06-12,20.9
2017-06-13,20.26
2017-06-14,20.23
2017-06-15,19.82
2017-06-16,20.49
2017-06-19,21.24
2017-06-20,20.71
2017-06-21,21.56
2017-06-22,21.94
2017-06-23,23.05
2017-06-26,22.67
2017-06-27,22.18
2017-06-28,22.38
2017-06-29,21.9
2017-06-30,22.17
2017-07-03,22.53
2017-07-05,24.56
2017-07-06,24.78
2017-07-07,25.12
2017-07-10,26.69
2017-07-11,27.2
2017-07-12,27.93
2017-07-13,29.02
2017-07-14,29.5
2017-07-17,29.2
2017-07-18,29.26
2017-07-19,29.51
2017-07-20,29.89
2017-07-21,32.38
2017-07-24,34.18
2017-07-25,32.21
2017-07-26,32.85
2017-07-27,34.89
2017-07-28,33.69
2017-07-31,32.46
2017-08-01,32.49
2017-08-02,30.6
2017-08-03,31.57
2017-08-04,32.02
2017-08-07,33.03
2017-08-08,33.13
2017-08-09,33.97
2017-08-10,32.5
2017-08-11,32.75
2017-08-14,32.45
2017-08-15,31.23
2017-08-16,35.48
2017-08-17,33.5
2017-08-18,33.98
2017-08-21,34.6
2017-08-22,26.23
2017-08-23,28.9
2017-08-24,28.81
2017-08-25,26.58
2017-08-28,26.92
2017-08-29,26.56
2017-08-30,26.8
2017-08-31,27.19
2017-09-01,28.87
2017-09-05,29.52
2017-09-06,28.92
2017-09-07,31.12
2017-09-08,31.56
2017-09-11,32.15
2017-09-12,34.9
2017-09-13,37.35
2017-09-14,36.46
2017-09-15,37.7
2017-09-18,40.09
2017-09-19,38.14
2017-09-20,38.27
2017-09-21,37.82
2017-09-22,37.73
2017-09-25,36.055
2017-09-26,35.21
2017-09-27,34.86
2017-09-28,33.43
2017-09-29,32.76
2017-10-02,35.97
2017-10-03,36.04
2017-10-04,34.1
2017-10-05,34.36
2017-10-06,34.17
2017-10-09,33.63
2017-10-10,33.96
2017-10-11,33.9
2017-10-12,34.23
2017-10-13,36.19
2017-10-16,36.69
2017-10-17,35.22
2017-10-18,34.86
2017-10-19,33.69
2017-10-20,33.87
2017-10-23,33.25
2017-10-24,31.73
2017-10-25,30.45
2017-10-26,30.16
2017-10-27,31.52
2017-10-30,31.26
2017-10-31,31.39
2017-11-01,31.55
2017-11-02,31.97
2017-11-03,31.22
2017-11-06,32.41
2017-11-07,32.495
2017-11-08,32.85
2017-11-09,32.33
2017-11-10,32.86
2017-11-13,34.63
2017-11-14,34.39
2017-11-15,34.13
2017-11-16,35.8
2017-11-17,35.5
2017-11-20,36.16
2017-11-21,35.54
2017-11-22,29.51
2017-11-24,30.63
2017-11-27,29.52
2017-11-28,29
2017-11-29,28
2017-11-30,28.35
2017-12-01,27.44
2017-12-04,27.58
2017-12-05,28.28
2017-12-06,28.27
2017-12-07,28.22
2017-12-08,29.76
2017-12-11,32.03
2017-12-12,30.5
2017-12-13,31.88
2017-12-14,31.67
2017-12-15,32.16
2017-12-18,32.26
2017-12-19,32.55
2017-12-20,31.84
2017-12-21,31.68
2017-12-22,30.56
2017-12-26,31.76
2017-12-27,32.83
2017-12-28,32.29
2017-12-29,31.56
2018-01-02,33.66
2018-01-03,34.37
2018-01-04,35.11
2018-01-05,36.03
2018-01-08,36.93
2018-01-09,34.86
2018-01-10,35.29
2018-01-11,35.8
2018-01-12,36.87
2018-01-16,35.67
2018-01-17,36.93
2018-01-18,36.75
2018-01-19,36.55
2018-01-22,36.2
2018-01-23,36.8
2018-01-24,36.94
2018-01-25,38.33
2018-01-26,39.64
2018-01-29,39.22
2018-01-30,38.17
2018-01-31,38.95
2018-02-01,38.31
2018-02-02,35.27
2018-02-05,34.79
2018-02-06,34.47
2018-02-07,33.76
2018-02-08,32.43
2018-02-09,34.15
2018-02-12,34.59
2018-02-13,34.49
2018-02-14,37.18
2018-02-15,37.61
2018-02-16,35.46
2018-02-20,35.93
2018-02-21,36.61
2018-02-22,35.65
2018-02-23,36.55
2018-02-26,36.37
2018-02-27,35.41
2018-02-28,35.16
2018-03-01,33.75
2018-03-02,35.68
2018-03-05,36.77
2018-03-06,48.21
2018-03-07,44.14
2018-03-08,47.78
2018-03-09,47.88
2018-03-12,47.98
2018-03-13,46.46
2018-03-14,46.18
2018-03-15,48.11
2018-03-16,48.59
2018-03-19,48.02
2018-03-20,51.3
2018-03-21,50.48
2018-03-22,45.45
2018-03-23,44.77
2018-03-26,48.08
2018-03-27,44.79
2018-03-28,43.73
2018-03-29,45.88
2018-04-02,44.55
2018-04-03,44.14
2018-04-04,44.69
2018-04-05,45.13
2018-04-06,46.28
2018-04-09,48.97
2018-04-10,48.15
2018-04-11,48
2018-04-12,49.29
2018-04-13,46.04
2018-04-16,46.06
2018-04-17,48.78
2018-04-18,47.92
2018-04-19,47.75
2018-04-20,46.98
2018-04-23,45.52
2018-04-24,44.88
2018-04-25,43.54
2018-04-26,43.69
2018-04-27,43.76
2018-04-30,45.99
2018-05-01,46.75
2018-05-02,46.53
2018-05-03,46.74
2018-05-04,46.25
2018-05-07,48.57
2018-05-08,49.5
2018-05-09,48.94
2018-05-10,50.62
2018-05-11,49.78
2018-05-14,48.04
2018-05-15,45.18
2018-05-16,45.06
2018-05-17,53.51
2018-05-18,54.85
2018-05-21,52.73
2018-05-22,53.12
2018-05-23,56.67
2018-05-24,58.5
2018-05-25,58.05
2018-05-29,57.62
2018-05-30,59.86
2018-05-31,61.31
2018-06-01,61.77
2018-06-04,62.49
2018-06-05,63.25
2018-06-06,62.85
2018-06-07,61.99
2018-06-08,62.04
2018-06-11,64.4
2018-06-12,66.33
2018-06-13,64.76
2018-06-14,64.38
2018-06-15,62.83
2018-06-18,63.06
2018-06-19,60.96
2018-06-20,64.23
2018-06-21,61.95
2018-06-22,60.82
2018-06-25,54.76
2018-06-26,56.37
2018-06-27,52.1
2018-06-28,54.55
2018-06-29,54.7
2018-07-02,55.75
2018-07-03,55.87
2018-07-05,55.1
2018-07-06,55.44
2018-07-09,57.81
2018-07-10,57.89
2018-07-11,57.61
2018-07-12,61.16
2018-07-13,60.68
2018-07-16,62.12
2018-07-17,62.03
2018-07-18,62.18
2018-07-19,61.79
2018-07-20,61.94
2018-07-23,63.59
2018-07-24,61.01
2018-07-25,63.57
2018-07-26,64.22
2018-07-27,61.95
2018-07-30,57.71
2018-07-31,57.85
2018-08-01,57.73
2018-08-02,57.06
2018-08-03,54.81
2018-08-06,56.15
2018-08-07,58.04
2018-08-08,56.87
2018-08-09,56.53
2018-08-10,55.31
2018-08-13,52.72
2018-08-14,49.64
2018-08-15,48.16
2018-08-16,49.68
2018-08-17,50.7
2018-08-20,51.68
2018-08-21,54.71
2018-08-22,55.41
2018-08-23,54.04
2018-08-24,53.66
2018-08-27,56.9
2018-08-28,57.03
2018-08-29,56.96
2018-08-30,53.86
2018-08-31,53.39
2018-09-04,52.31
2018-09-05,50.29
2018-09-06,49.15
2018-09-07,49.27
2018-09-10,46.34
2018-09-11,45.33
2018-09-12,45.71
2018-09-13,47.85
2018-09-14,45.97
2018-09-17,44.59
2018-09-18,44.41
2018-09-19,46.5
2018-09-20,48.22
2018-09-21,48.59
2018-09-24,46.71
2018-09-25,47.33
2018-09-26,47.99
2018-09-27,47.54
2018-09-28,48.58
2018-10-01,47.01
2018-10-02,44.88
2018-10-03,44.53
2018-10-04,42.32
2018-10-05,41.25
2018-10-08,39.53
2018-10-09,39.2
2018-10-10,36.31
2018-10-11,36.88
2018-10-12,40.18
2018-10-15,40
2018-10-16,41.44
2018-10-17,40.86
2018-10-18,39.47
2018-10-19,39.67
2018-10-22,41.61
2018-10-23,41.25
2018-10-24,39.26
2018-10-25,40.88
2018-10-26,39.79
2018-10-29,38.1
2018-10-30,38.15
2018-10-31,39.81
2018-11-01,44.92
2018-11-02,45.28
2018-11-05,44.08
2018-11-06,44.58
2018-11-07,46.16
2018-11-08,43.09
2018-11-09,40.19
2018-11-12,31.88
2018-11-13,33.46
2018-11-14,32.49
2018-11-15,32.71
2018-11-16,32.75
2018-11-19,31.08
2018-11-20,30.13
2018-11-21,32.44
2018-11-23,32.57
2018-11-26,33.53
2018-11-27,34.03
2018-11-28,34.23
2018-11-29,33.92
2018-11-30,35.27
2018-12-03,36.45
2018-12-04,36.4
2018-12-06,35.23
2018-12-07,33.54
2018-12-10,33.94
2018-12-11,34.9
2018-12-12,36.56
2018-12-13,36.87
2018-12-14,36.15
2018-12-17,33.1
2018-12-18,32.47
2018-12-19,30.24
2018-12-20,29.41
2018-12-21,28.23
2018-12-24,29.23
2018-12-26,30.03
2018-12-27,30.33
2018-12-28,30.53
2018-12-31,29.21
2019-01-02,29.79
2019-01-03,28.37
2019-01-04,30.32
2019-01-07,31.53
2019-01-08,32.03
2019-01-09,33
2019-01-10,31.81
2019-01-11,31.52
2019-01-14,29.71
2019-01-15,30.3
2019-01-16,30.82
2019-01-17,31.33
2019-01-18,33.29
2019-01-22,32.41
2019-01-23,32.42
2019-01-24,32.89
2019-01-25,34.44
2019-01-28,34.3
2019-01-29,33.74
2019-01-30,34.41
2019-01-31,35.8
2019-02-01,35.2
2019-02-04,35.9
2019-02-05,36.2
2019-02-06,36.37
2019-02-07,34.11
2019-02-08,34.04
2019-02-11,34.13
2019-02-12,34.58
2019-02-13,34.97
2019-02-14,34.84
2019-02-15,33.14
2019-02-19,33.96
2019-02-20,35.64
2019-02-21,34.58
2019-02-22,36.98
2019-02-25,38.51
2019-02-26,38.52
2019-02-27,37.79
2019-02-28,37.45
2019-03-01,37.06
2019-03-04,38.6
2019-03-05,39.44
2019-03-06,38.89
2019-03-07,34.94
2019-03-08,34.41
2019-03-11,35.03
2019-03-12,35.23
2019-03-13,35.93
2019-03-14,35.95
2019-03-15,37.27
2019-03-18,38.29
2019-03-19,38.98
2019-03-20,36.81
2019-03-21,37.99
2019-03-22,36.65
2019-03-25,36.92
2019-03-26,37.83
2019-03-27,37.82
2019-03-28,39.13
2019-03-29,41.54
2019-04-01,42
2019-04-02,42
2019-04-03,44.25
2019-04-04,41.05
2019-04-05,42.85
2019-04-08,42.48
2019-04-09,42.86
2019-04-10,42.87
2019-04-11,41.86
2019-04-12,41.75
2019-04-15,40.4
2019-04-16,40.96
2019-04-17,41.66
2019-04-18,41.77
2019-04-22,43.48
2019-04-23,44.61
2019-04-24,44.5
2019-04-25,44.59
2019-04-26,45.26
2019-04-29,47.53
2019-04-30,48.5
2019-05-01,47.91
2019-05-02,47.63
2019-05-03,48.95
2019-05-06,46.13
2019-05-07,43.45
2019-05-08,43.15
2019-05-09,42.79
2019-05-10,42.35
2019-05-13,39.17
2019-05-14,41.19
2019-05-15,41.69
2019-05-16,41.63
2019-05-17,39.64
2019-05-20,37.59
2019-05-21,38.5
2019-05-22,38.28
2019-05-23,36.61
2019-05-24,36.63
2019-05-28,37.93
2019-05-29,38.83
2019-05-30,39.49
2019-05-31,39.23
2019-06-03,37.71
2019-06-04,40.5
2019-06-05,40
2019-06-06,39.98
2019-06-07,42.04
2019-06-10,42.51
2019-06-11,43.09
2019-06-12,43.59
2019-06-13,44.96
2019-06-14,44.5
2019-06-17,44.885
2019-06-18,47.46
2019-06-19,48.855
2019-06-20,50.52
2019-06-21,49.53
2019-06-24,48.75
2019-06-25,46.95
2019-06-26,48.21
2019-06-27,49.73
2019-06-28,49.7
2019-07-01,53.48
2019-07-02,54.685
2019-07-03,54.65
2019-07-04,54.65
2019-07-05,54.24
2019-07-08,53
2019-07-09,53.65
2019-07-10,53.09
2019-07-11,53.16
2019-07-12,53.05
2019-07-15,53.635
2019-07-16,53.295
2019-07-17,49.98
2019-07-18,50.04
2019-07-19,51.24
2019-07-22,51.635
2019-07-23,52.685
2019-07-24,53.7
2019-07-25,49.5
2019-07-26,49.99
2019-07-29,48.7
2019-07-30,49.05
2019-07-31,49.715
2019-08-01,46.005
2019-08-02,45.34
2019-08-05,41.69
2019-08-06,42.54
2019-08-07,41.94
2019-08-08,43.585
2019-08-09,43.85
2019-08-12,44.04
2019-08-13,47.125
2019-08-14,44.89
2019-08-15,45.31
2019-08-16,46.86
2019-08-19,49.35
2019-08-20,50.21
2019-08-21,43.72
2019-08-22,42.39
2019-08-23,40.48
2019-08-26,40.93
2019-08-27,42.12
2019-08-28,42.8
2019-08-29,45.04
2019-08-30,45.79
2019-09-02,45.8
2019-09-03,44.6
2019-09-04,45.735
2019-09-05,47.175
2019-09-06,48.495
2019-09-09,48.24
2019-09-10,45.85
2019-09-11,46.625
2019-09-12,46.94
2019-09-13,47.945
2019-09-16,48.42
2019-09-17,47.79
2019-09-18,47.9
2019-09-19,47.975
2019-09-20,46.915
2019-09-23,45.33
2019-09-24,42.13
2019-09-25,43.78
2019-09-26,43.92
2019-09-27,42.5
2019-09-30,42.75
2019-10-01,42.95
2019-10-02,42.15
2019-10-03,43.79
2019-10-04,43.96
2019-10-07,43.96
2019-10-08,40.62
2019-10-09,42.105
2019-10-10,43.58
2019-10-11,45.145
2019-10-14,44.7
2019-10-15,45.535
2019-10-16,44.67
2019-10-17,42.04
2019-10-18,41.2
2019-10-21,41.58
2019-10-22,41.08
2019-10-23,41.215
2019-10-24,41.41
2019-10-25,43.41
2019-10-28,44.49
2019-10-29,43.95
2019-10-30,43.89
2019-10-31,43.54
2019-11-01,43.685
2019-11-04,44.62
2019-11-05,42.5
2019-11-06,41.935
2019-11-07,42.47
2019-11-08,42.47
2019-11-11,43.445
2019-11-12,44.51
2019-11-13,43.55
2019-11-14,43.45
2019-11-15,44.485
2019-11-18,43.54
2019-11-19,43.795
2019-11-20,43.495
2019-11-21,35.87
2019-11-22,35.71
2019-11-25,36.34
