date,close
2014-06-13,49.4356
2014-06-16,49.5646
2014-06-17,48.95
2014-06-18,48.8513
2014-06-19,48.912
2014-06-20,50.3386
2014-06-23,50.8546
2014-06-24,50.938
2014-06-25,51.6133
2014-06-26,51.3098
2014-06-27,51.2339
2014-06-30,51.6589
2014-07-01,51.8182
2014-07-02,51.4085
2014-07-03,51.3022
2014-07-07,50.331
2014-07-08,50.6724
2014-07-09,50.8697
2014-07-10,50.5966
2014-07-11,50.6041
2014-07-14,50.5966
2014-07-15,50.3917
2014-07-16,50.718
2014-07-17,50.0882
2014-07-18,50.4448
2014-07-21,50.3158
2014-07-22,50.8242
2014-07-23,50.9608
2014-07-24,51.4236
2014-07-25,50.7104
2014-07-28,50.1489
2014-07-29,50.7104
2014-07-30,50.1489
2014-07-31,49.3183
2014-08-01,49.4561
2014-08-04,49.4561
2014-08-05,48.7672
2014-08-06,47.8334
2014-08-07,47.4812
2014-08-08,48.4916
2014-08-11,48.239
2014-08-12,48.6218
2014-08-13,49.6169
2014-08-14,50.1144
2014-08-15,50.8646
2014-08-18,50.8263
2014-08-19,51.4386
2014-08-20,51.8597
2014-08-21,51.7908
2014-08-22,51.6683
2014-08-25,52.051
2014-08-26,52.3878
2014-08-27,52.7476
2014-08-28,53.2911
2014-08-29,53.735
2014-09-02,53.758
2014-09-03,54.2326
2014-09-04,53.9417
2014-09-05,54.3015
2014-09-08,54.3321
2014-09-09,53.6585
2014-09-10,53.1762
2014-09-11,53.0691
2014-09-12,51.7601
2014-09-15,51.5764
2014-09-16,52.1658
2014-09-17,52.3419
2014-09-18,52.4644
2014-09-19,52.3648
2014-09-22,51.4922
2014-09-23,50.8722
2014-09-24,50.8186
2014-09-25,50.2445
2014-09-26,50.6502
2014-09-29,50.5737
2014-09-30,50.1756
2014-10-01,49.5403
2014-10-02,49.0275
2014-10-03,49.1806
2014-10-06,49.0657
2014-10-07,47.9252
2014-10-08,48.0094
2014-10-09,45.0088
2014-10-10,44.6491
2014-10-13,42.2149
2014-10-14,41.1126
2014-10-15,41.702
2014-10-16,43.2779
2014-10-17,43.9066
2014-10-20,44.9323
2014-10-21,46.777
2014-10-22,45.7513
2014-10-23,46.2795
2014-10-24,46.7005
2014-10-27,46.2412
2014-10-28,45.8355
2014-10-29,45.4451
2014-10-30,43.6426
2014-10-31,45.5596
2014-11-03,45.1345
2014-11-04,43.6736
2014-11-05,43.6736
2014-11-06,43.2484
2014-11-07,44.261
2014-11-10,43.4339
2014-11-11,43.4803
2014-11-12,43.6426
2014-11-13,43.0165
2014-11-14,43.2252
2014-11-17,43.3566
2014-11-18,43.6581
2014-11-19,43.9286
2014-11-20,44.3306
2014-11-21,45.1577
2014-11-24,44.864
2014-11-25,44.6862
2014-11-26,44.4156
2014-11-28,41.8648
2014-12-01,40.1565
2014-12-02,40.5739
2014-12-03,41.1382
2014-12-04,41.0377
2014-12-05,40.5816
2014-12-08,37.366
2014-12-09,37.4279
2014-12-10,34.5137
2014-12-11,35.3022
2014-12-12,34.676
2014-12-15,34.2586
2014-12-16,34.2432
2014-12-17,36.709
2014-12-18,38.0462
2014-12-19,38.2936
2014-12-22,38.4791
2014-12-23,38.9429
2014-12-24,39.198
2014-12-26,38.541
2014-12-29,38.8115
2014-12-30,38.6183
2014-12-31,38.4868
2015-01-02,38.5873
2015-01-05,36.3766
2015-01-06,34.8616
2015-01-07,34.6065
2015-01-08,34.9852
2015-01-09,33.7948
2015-01-12,31.7696
2015-01-13,31.0971
2015-01-14,32.7127
2015-01-15,32.6972
2015-01-16,33.1533
2015-01-20,33.7716
2015-01-21,35.0703
2015-01-22,34.3978
2015-01-23,34.0576
2015-01-26,34.8074
2015-01-27,34.5446
2015-01-28,33.0441
2015-01-29,33.718
2015-01-30,34.5015
2015-02-02,35.4105
2015-02-03,36.6564
2015-02-04,35.6299
2015-02-05,37.0012
2015-02-06,36.7348
2015-02-09,36.2019
2015-02-10,36.1471
2015-02-11,35.7866
2015-02-12,37.0482
2015-02-13,37.0796
2015-02-17,38.012
2015-02-18,37.7848
2015-02-19,37.2206
2015-02-20,37.3538
2015-02-23,37.1579
2015-02-24,35.34
2015-02-25,35.5672
2015-02-26,34.4545
2015-02-27,34.6818
2015-03-02,34.5329
2015-03-03,35.4418
2015-03-04,35.2851
2015-03-05,36.0374
2015-03-06,36.9307
2015-03-09,36.821
2015-03-10,36.3351
2015-03-11,36.1314
2015-03-12,36.3116
2015-03-13,35.1598
2015-03-16,35.3635
2015-03-17,35.8728
2015-03-18,37.1658
2015-03-19,36.3743
2015-03-20,37.1187
2015-03-23,38.0982
2015-03-24,36.7896
2015-03-25,36.8758
2015-03-26,36.9542
2015-03-27,36.868
2015-03-30,37.6437
2015-03-31,37.8005
2015-04-01,37.8788
2015-04-02,37.6673
2015-04-06,38.2941
2015-04-07,37.965
2015-04-08,37.3538
2015-04-09,37.6751
2015-04-10,37.8083
2015-04-13,37.3381
2015-04-14,38.5527
2015-04-15,40.018
2015-04-16,39.446
2015-04-17,38.8191
2015-04-20,38.4979
2015-04-21,37.6594
2015-04-22,38.349
2015-04-23,38.5997
2015-04-24,38.5762
2015-04-27,38.059
2015-04-28,38.2772
2015-04-29,38.555
2015-04-30,38.1662
2015-05-01,38.6105
2015-05-04,38.182
2015-05-05,38.0471
2015-05-06,35.5794
2015-05-07,34.8494
2015-05-08,35.508
2015-05-11,34.421
2015-05-12,34.4051
2015-05-13,35.3176
2015-05-14,35.4207
2015-05-15,36.2539
2015-05-18,36.3808
2015-05-19,35.7937
2015-05-20,35.8254
2015-05-21,35.7778
2015-05-22,35.0319
2015-05-26,34.6352
2015-05-27,34.1988
2015-05-28,33.4926
2015-05-29,33.2625
2015-06-01,32.7785
2015-06-02,32.9848
2015-06-03,32.2865
2015-06-04,31.5406
2015-06-05,31.6517
2015-06-08,31.3105
2015-06-09,31.2947
2015-06-10,31.1994
2015-06-11,31.2471
2015-06-12,30.8106
2015-06-15,30.9614
2015-06-16,30.9059
2015-06-17,31.1122
2015-06-18,31.1598
2015-06-19,30.9773
2015-06-22,32.3659
2015-06-23,32.2468
2015-06-24,32.0247
2015-06-25,31.1915
2015-06-26,31.6755
2015-06-29,31.0328
2015-06-30,31.3264
2015-07-01,30.7868
2015-07-02,31.1201
2015-07-06,30.0965
2015-07-07,31.0407
2015-07-08,30.5567
2015-07-09,31.0566
2015-07-10,31.374
2015-07-13,32.6912
2015-07-14,32.8499
2015-07-15,32.2389
2015-07-16,32.5166
2015-07-17,32.0485
2015-07-20,31.0169
2015-07-21,31.3264
2015-07-22,30.3901
2015-07-23,30.6837
2015-07-24,29.8981
2015-07-27,30.0489
2015-07-28,30.7551
2015-07-29,31.739
2015-07-30,30.5426
2015-07-31,30.4459
2015-08-03,29.463
2015-08-04,28.754
2015-08-05,28.0531
2015-08-06,28.4479
2015-08-07,27.6503
2015-08-10,28.7621
2015-08-11,29.036
2015-08-12,30.4217
2015-08-13,29.2777
2015-08-14,29.2294
2015-08-17,29.4791
2015-08-18,28.6976
2015-08-19,28.1901
2015-08-20,28.1014
2015-08-21,27.4972
2015-08-24,25.9181
2015-08-25,25.483
2015-08-26,26.2323
2015-08-27,27.7792
2015-08-28,28.7057
2015-08-31,29.0118
2015-09-01,28.1498
2015-09-02,28.4721
2015-09-03,28.7379
2015-09-04,28.5204
2015-09-08,29.3502
2015-09-09,28.8749
2015-09-10,29.1327
2015-09-11,28.3512
2015-09-14,27.7953
2015-09-15,28.0773
2015-09-16,29.0602
2015-09-17,29.2294
2015-09-18,28.7943
2015-09-21,29.3986
2015-09-22,29.5758
2015-09-23,28.464
2015-09-24,28.0612
2015-09-25,28.3512
2015-09-28,26.5868
2015-09-29,24.8627
2015-09-30,25.9423
2015-10-01,26.4096
2015-10-02,27.8759
2015-10-05,29.7611
2015-10-06,30.4862
2015-10-07,31.316
2015-10-08,31.5013
2015-10-09,31.8881
2015-10-12,31.2596
2015-10-13,30.7198
2015-10-14,30.462
2015-10-15,31.1066
2015-10-16,31.2838
2015-10-19,30.881
2015-10-20,30.7198
2015-10-21,30.1317
2015-10-22,29.5516
2015-10-23,29.1891
2015-10-26,27.8759
2015-10-27,26.8043
2015-10-28,27.1024
2015-10-29,27.3117
2015-10-30,27.8369
2015-11-02,28.2308
2015-11-03,27.96
2015-11-04,27.5415
2015-11-05,25.7442
2015-11-06,25.933
2015-11-09,25.2765
2015-11-10,25.26
2015-11-11,24.2096
2015-11-12,23.1591
2015-11-13,23.3807
2015-11-16,24.3901
2015-11-17,23.3561
2015-11-18,24.0455
2015-11-19,23.7828
2015-11-20,23.471
2015-11-23,23.8731
2015-11-24,24.8497
2015-11-25,24.9564
2015-11-27,24.1768
2015-11-30,24.1932
2015-12-01,23.9716
2015-12-02,22.1497
2015-12-03,21.9856
2015-12-04,20.3525
2015-12-07,17.7428
2015-12-08,17.6115
2015-12-09,18.2187
2015-12-10,18.3008
2015-12-11,16.6677
2015-12-14,16.9057
2015-12-15,17.513
2015-12-16,17.1355
2015-12-17,16.2984
2015-12-18,15.5352
2015-12-21,17.9315
2015-12-22,18.9738
2015-12-23,19.9339
2015-12-24,19.7944
2015-12-28,19.7944
2015-12-29,19.737
2015-12-30,19.2364
2015-12-31,20.2376
2016-01-04,20.8038
2016-01-05,20.8203
2016-01-06,19.8765
2016-01-07,18.6947
2016-01-08,18.9163
2016-01-11,18.5552
2016-01-12,17.9315
2016-01-13,17.2093
2016-01-14,18.6947
2016-01-15,18.0054
2016-01-19,17.0616
2016-01-20,16.4461
2016-01-21,18.5634
2016-01-22,20.5987
2016-01-25,19.3841
2016-01-26,19.9421
2016-01-27,18.982
2016-01-28,20.1581
2016-01-29,21.0011
2016-02-01,19.7618
2016-02-02,19.492
2016-02-03,20.7735
2016-02-04,21.4901
2016-02-05,21.5323
2016-02-08,19.5258
2016-02-09,17.3928
2016-02-10,17.6288
2016-02-11,16.5412
2016-02-12,17.0134
2016-02-16,17.73
2016-02-17,18.3201
2016-02-18,17.8649
2016-02-19,17.4181
2016-02-22,18.0419
2016-02-23,17.9661
2016-02-24,18.1431
2016-02-25,18.0166
2016-02-26,19.3993
2016-02-29,20.2339
2016-03-01,20.4026
2016-03-02,21.5576
2016-03-03,22.426
2016-03-04,22.2236
2016-03-07,23.2943
2016-03-08,22.1056
2016-03-09,22.3164
2016-03-10,23.1257
2016-03-11,23.8676
2016-03-14,23.758
2016-03-15,23.3702
2016-03-16,24.8793
2016-03-17,25.4779
2016-03-18,25.9838
2016-03-21,25.0311
2016-03-22,25.4695
2016-03-23,23.9772
2016-03-24,24.1796
2016-03-28,23.8845
2016-03-29,23.9941
2016-03-30,24.4831
2016-03-31,25.1744
2016-04-01,24.2217
2016-04-04,23.9182
2016-04-05,23.9688
2016-04-06,24.6348
2016-04-07,24.4072
2016-04-08,25.284
2016-04-11,25.3346
2016-04-12,27.2737
2016-04-13,26.8606
2016-04-14,26.751
2016-04-15,26.7004
2016-04-18,27.1135
2016-04-19,28.9935
2016-04-20,29.3392
2016-04-21,29.3476
2016-04-22,30.1907
2016-04-25,29.8282
2016-04-26,30.5532
2016-04-27,31.253
2016-04-28,30.4857
2016-04-29,30.9915
2016-05-02,30.8458
2016-05-03,30.6829
2016-05-04,32.7233
2016-05-05,33.4005
2016-05-06,34.095
2016-05-09,33.6406
2016-05-10,34.3607
2016-05-11,34.3522
2016-05-12,34.5408
2016-05-13,35.1837
2016-05-16,35.8439
2016-05-17,36.0239
2016-05-18,34.4036
2016-05-19,35.6124
2016-05-20,36.041
2016-05-23,35.7238
2016-05-24,35.7496
2016-05-25,36.9241
2016-05-26,36.4954
2016-05-27,36.6326
2016-05-31,37.0784
2016-06-01,37.5242
2016-06-02,37.4899
2016-06-03,37.7471
2016-06-06,38.6644
2016-06-07,39.2302
2016-06-08,39.1445
2016-06-09,39.8903
2016-06-10,38.7415
2016-06-13,38.5615
2016-06-14,39.1616
2016-06-15,38.5958
2016-06-16,38.4929
2016-06-17,39.0673
2016-06-20,39.4703
2016-06-21,40.1304
2016-06-22,39.7789
2016-06-23,40.1732
2016-06-24,39.2816
2016-06-27,38.2529
2016-06-28,39.3417
2016-06-29,40.5762
2016-06-30,40.6791
2016-07-01,40.7819
2016-07-05,40.4047
2016-07-06,40.6448
2016-07-07,40.2847
2016-07-08,40.6019
2016-07-11,40.6705
2016-07-12,41.5964
2016-07-13,40.5847
2016-07-14,40.7133
2016-07-15,41.2534
2016-07-18,40.8934
2016-07-19,40.7305
2016-07-20,40.499
2016-07-21,39.676
2016-07-22,39.4788
2016-07-25,38.9473
2016-07-26,38.853
2016-07-27,37.6871
2016-07-28,37.7899
2016-07-29,38.3986
2016-08-01,36.8555
2016-08-02,37.6699
2016-08-03,39.3074
2016-08-04,39.1031
2016-08-05,39.0249
2016-08-08,39.6071
2016-08-09,39.3291
2016-08-10,39.0945
2016-08-11,40.0677
2016-08-12,40.7107
2016-08-15,40.6412
2016-08-16,40.9367
2016-08-17,41.6666
2016-08-18,43.1177
2016-08-19,43.1959
2016-08-22,41.7709
2016-08-23,41.9533
2016-08-24,40.9453
2016-08-25,40.8584
2016-08-26,40.8237
2016-08-29,41.1539
2016-08-30,40.9801
2016-08-31,40.7455
2016-09-01,41.0235
2016-09-02,41.936
2016-09-06,42.8049
2016-09-07,43.3784
2016-09-08,44.3169
2016-09-09,42.4139
2016-09-12,42.8397
2016-09-13,40.7976
2016-09-14,40.5804
2016-09-15,40.6933
2016-09-16,40.0416
2016-09-19,41.18
2016-09-20,40.8584
2016-09-21,42.5268
2016-09-22,43.1351
2016-09-23,42.2488
2016-09-26,42.44
2016-09-27,42.4052
2016-09-28,44.5255
2016-09-29,44.2648
2016-09-30,44.6558
2016-10-03,44.4125
2016-10-04,43.0482
2016-10-05,43.083
2016-10-06,43.1612
2016-10-07,42.8918
2016-10-10,43.7521
2016-10-11,43.2915
2016-10-12,43.6304
2016-10-13,43.2742
2016-10-14,43.5609
2016-10-17,42.97
2016-10-18,43.474
2016-10-19,44.3517
2016-10-20,44.2387
2016-10-21,43.9954
2016-10-24,43.7695
2016-10-25,42.7267
2016-10-26,42.7788
2016-10-27,42.6864
2016-10-28,42.3961
2016-10-31,42.616
2016-11-01,42.7304
2016-11-02,40.9969
2016-11-03,40.8649
2016-11-04,41.0497
2016-11-07,42.3081
2016-11-08,43.5576
2016-11-09,43.4608
2016-11-10,43.1616
2016-11-11,42.1673
2016-11-14,42.0705
2016-11-15,43.936
2016-11-16,43.7248
2016-11-17,43.848
2016-11-18,44.3671
2016-11-21,46.391
2016-11-22,47.0422
2016-11-23,47.4734
2016-11-25,47.2974
2016-11-28,46.479
2016-11-29,46.1446
2016-11-30,48.3357
2016-12-01,47.8869
2016-12-02,48.1245
2016-12-05,49.6468
2016-12-06,49.3829
2016-12-07,50.2364
2016-12-08,50.958
2016-12-09,50.166
2016-12-12,50.342
2016-12-13,50.8348
2016-12-14,50.474
2016-12-15,50.7908
2016-12-16,51.4068
2016-12-19,51.1252
2016-12-20,51.6267
2016-12-21,51.5123
2016-12-22,50.958
2016-12-23,51.6443
2016-12-27,51.9435
2016-12-28,50.7468
2016-12-29,51.0196
2016-12-30,50.518
2017-01-03,51.6971
2017-01-04,51.5651
2017-01-05,51.7675
2017-01-06,50.9492
2017-01-09,50.5796
2017-01-10,49.3389
2017-01-11,50.386
2017-01-12,49.7788
2017-01-13,49.5501
2017-01-17,49.5501
2017-01-18,49.77
2017-01-19,49.2421
2017-01-20,49.7964
2017-01-23,49.1805
2017-01-24,49.5237
2017-01-25,48.8813
2017-01-26,48.8768
2017-01-27,48.859
2017-01-30,47.8447
2017-01-31,49.037
2017-02-01,48.0493
2017-02-02,49.4374
2017-02-03,50.2293
2017-02-06,49.215
2017-02-07,48.3785
2017-02-08,48.4052
2017-02-09,49.0459
2017-02-10,49.215
2017-02-13,48.9569
2017-02-14,48.8946
2017-02-15,48.4853
2017-02-16,48.076
2017-02-17,47.729
2017-02-21,48.2451
2017-02-22,47.6222
2017-02-23,48.6188
2017-02-24,47.3019
2017-02-27,47.4709
2017-02-28,48.0938
2017-03-01,49.2861
2017-03-02,49.1616
2017-03-03,50.2026
2017-03-06,50.3717
2017-03-07,50.345
2017-03-08,48.7345
2017-03-09,48.5031
2017-03-10,48.343
2017-03-13,48.0315
2017-03-14,46.4477
2017-03-15,47.729
2017-03-16,47.3731
2017-03-17,46.9994
2017-03-20,47.3731
2017-03-21,46.5189
2017-03-22,46.8926
2017-03-23,46.4922
2017-03-24,47.2485
2017-03-27,47.2396
2017-03-28,47.2129
2017-03-29,48.6989
2017-03-30,48.8679
2017-03-31,49.3306
2017-04-03,49.215
2017-04-04,49.7755
2017-04-05,49.7666
2017-04-06,50.1226
2017-04-07,49.998
2017-04-10,49.7666
2017-04-11,49.5798
2017-04-12,49.2328
2017-04-13,48.601
2017-04-17,48.4141
2017-04-18,48.779
2017-04-19,47.9781
2017-04-20,47.8625
2017-04-21,47.6311
2017-04-24,47.9336
2017-04-25,48.6989
2017-04-26,48.4942
2017-04-27,47.7067
2017-04-28,47.3468
2017-05-01,47.7157
2017-05-02,47.0678
2017-05-03,46.9238
2017-05-04,44.4039
2017-05-05,45.5738
2017-05-08,45.9338
2017-05-09,45.4298
2017-05-10,46.0058
2017-05-11,46.1408
2017-05-12,45.8978
2017-05-15,46.1498
2017-05-16,45.7988
2017-05-17,44.7729
2017-05-18,44.8359
2017-05-19,46.2848
2017-05-22,46.4918
2017-05-23,47.0048
2017-05-24,47.4997
2017-05-25,46.4918
2017-05-26,46.5188
2017-05-30,44.8629
2017-05-31,44.7099
2017-06-01,45.4028
2017-06-02,44.5929
2017-06-05,44.3859
2017-06-06,44.9979
2017-06-07,43.9809
2017-06-08,43.6389
2017-06-09,44.5029
2017-06-12,44.9889
2017-06-13,45.1869
2017-06-14,44.8089
2017-06-15,44.0799
2017-06-16,45.8708
2017-06-19,45.1869
2017-06-20,42.748
2017-06-21,42.667
2017-06-22,43.009
2017-06-23,44.2689
2017-06-26,45.4838
2017-06-27,45.6098
2017-06-28,45.8078
2017-06-29,46.3658
2017-06-30,46.9418
2017-07-03,46.8248
2017-07-05,45.6728
2017-07-06,47.3378
2017-07-07,46.5188
2017-07-10,45.8978
2017-07-11,45.7898
2017-07-12,46.8428
2017-07-13,47.2118
2017-07-14,47.8417
2017-07-17,48.2107
2017-07-18,48.2107
2017-07-19,48.9487
2017-07-20,49.3087
2017-07-21,49.0027
2017-07-24,49.3897
2017-07-25,50.1996
2017-07-26,50.0286
2017-07-27,50.9556
2017-07-28,50.8116
2017-07-31,50.9106
2017-08-01,48.8318
2017-08-02,49.8216
2017-08-03,49.1238
2017-08-04,48.8318
2017-08-07,48.4122
2017-08-08,47.9379
2017-08-09,48.1294
2017-08-10,47.6277
2017-08-11,47.8101
2017-08-14,47.728
2017-08-15,46.4783
2017-08-16,46.1681
2017-08-17,45.9401
2017-08-18,46.46
2017-08-21,46.4965
2017-08-22,48.248
2017-08-23,48.6585
2017-08-24,48.7771
2017-08-25,48.9504
2017-08-28,48.3028
2017-08-29,48.5491
2017-08-30,49.2697
2017-08-31,49.4066
2017-09-01,49.8353
2017-09-05,50.036
2017-09-06,51.3952
2017-09-07,51.5138
2017-09-08,51.2858
2017-09-11,51.5594
2017-09-12,51.1672
2017-09-13,51.5229
2017-09-14,51.8878
2017-09-15,51.2675
2017-09-18,51.1763
2017-09-19,51.1854
2017-09-20,51.1672
2017-09-21,50.2276
2017-09-22,49.8992
2017-09-25,50.6289
2017-09-26,50.3735
2017-09-27,50.6746
2017-09-28,50.556
2017-09-29,50.5468
2017-10-02,50.9391
2017-10-03,51.2584
2017-10-04,51.3587
2017-10-05,51.7236
2017-10-06,51.2584
2017-10-09,51.1489
2017-10-10,51.1033
2017-10-11,51.4317
2017-10-12,51.4591
2017-10-13,51.5138
2017-10-16,51.3131
2017-10-17,51.4682
2017-10-18,50.5104
2017-10-19,50.9117
2017-10-20,51.0851
2017-10-23,50.2184
2017-10-24,51.0303
2017-10-25,49.0097
2017-10-26,48.7406
2017-10-27,49.3336
2017-10-30,49.2971
2017-10-31,49.5069
2017-11-01,49.7441
2017-11-02,48.6676
2017-11-03,48.7093
2017-11-06,48.848
2017-11-07,49.1903
2017-11-08,49.1256
2017-11-09,49.0238
2017-11-10,48.478
2017-11-13,48.3022
2017-11-14,47.5343
2017-11-15,47.0255
2017-11-16,46.859
2017-11-17,46.8775
2017-11-20,47.0255
2017-11-21,46.4426
2017-11-22,46.7942
2017-11-24,47.2198
2017-11-27,46.2761
2017-11-28,46.3131
2017-11-29,46.6554
2017-11-30,48.0154
2017-12-01,48.2097
2017-12-04,48.3762
2017-12-05,48.4225
2017-12-06,47.9229
2017-12-07,48.4872
2017-12-08,49.0423
2017-12-11,49.4031
2017-12-12,49.4031
2017-12-13,49.2366
2017-12-14,48.7925
2017-12-15,48.2559
2017-12-18,48.4317
2017-12-19,47.9784
2017-12-20,47.6546
2017-12-21,48.3114
2017-12-22,49.2273
2017-12-26,49.2736
2017-12-27,49.1903
2017-12-28,49.4864
2017-12-29,49.4494
2018-01-02,50.5596
2018-01-03,51.3829
2018-01-04,51.9935
2018-01-05,51.864
2018-01-08,52.4006
2018-01-09,52.2618
2018-01-10,52.4931
2018-01-11,53.9919
2018-01-12,54.2787
2018-01-16,54.3989
2018-01-17,54.9633
2018-01-18,53.7883
2018-01-19,53.9549
2018-01-22,55.3981
2018-01-23,55.9532
2018-01-24,56.166
2018-01-25,56.0457
2018-01-26,56.3643
2018-01-29,55.7458
2018-01-30,55.0337
2018-01-31,55.1555
2018-02-01,55.9801
2018-02-02,54.1153
2018-02-05,52.0632
2018-02-06,52.869
2018-02-07,53.019
2018-02-08,50.9762
2018-02-09,50.9106
2018-02-12,52.9909
2018-02-13,53.2626
2018-02-14,53.853
2018-02-15,54.1622
2018-02-16,53.3282
2018-02-20,53.4313
2018-02-21,52.5692
2018-02-22,53.5812
2018-02-23,54.3683
2018-02-26,53.853
2018-02-27,53.4125
2018-02-28,52.7847
2018-03-01,52.9534
2018-03-02,53.4875
2018-03-05,53.3282
2018-03-06,53.4313
2018-03-07,53.1408
2018-03-08,53.0377
2018-03-09,53.703
2018-03-12,53.9654
2018-03-13,54.1247
2018-03-14,53.5625
2018-03-15,53.0752
2018-03-16,54.1716
2018-03-19,52.9159
2018-03-20,54.0123
2018-03-21,54.7807
2018-03-22,53.7218
2018-03-23,53.1783
2018-03-26,53.4313
2018-03-27,53.3751
2018-03-28,52.1288
2018-03-29,53.3376
2018-04-02,52.6067
2018-04-03,53.0377
2018-04-04,52.9628
2018-04-05,53.8248
2018-04-06,53.1221
2018-04-09,53.1783
2018-04-10,54.6401
2018-04-11,54.9306
2018-04-12,54.6495
2018-04-13,54.8275
2018-04-16,55.9895
2018-04-17,55.9145
2018-04-18,56.0644
2018-04-19,55.9801
2018-04-20,55.7927
2018-04-23,56.1862
2018-04-24,55.6521
2018-04-25,55.8489
2018-04-26,56.3455
2018-04-27,56.8631
2018-04-30,57.1859
2018-05-01,57.4423
2018-05-02,59.4175
2018-05-03,59.6739
2018-05-04,60.2532
2018-05-07,60.842
2018-05-08,60.7185
2018-05-09,61.4497
2018-05-10,62.01
2018-05-11,62.5038
2018-05-14,63.235
2018-05-15,63.311
2018-05-16,63.292
2018-05-17,63.1685
2018-05-18,62.9311
2018-05-21,63.14
2018-05-22,62.7317
2018-05-23,63.3679
2018-05-24,63.0356
2018-05-25,62.5703
2018-05-29,62.9596
2018-05-30,64.7924
2018-05-31,64.7259
2018-06-01,65.0583
2018-06-04,64.8588
2018-06-05,65.1152
2018-06-06,64.2511
2018-06-07,65.0962
2018-06-08,65.0013
2018-06-11,65.5426
2018-06-12,65.7515
2018-06-13,65.4001
2018-06-14,65.8464
2018-06-15,64.365
2018-06-18,65.0678
2018-06-19,65.3242
2018-06-20,66.5397
2018-06-21,65.3147
2018-06-22,66.4637
2018-06-25,65.2387
2018-06-26,66.2073
2018-06-27,66.2358
2018-06-28,66.4067
2018-06-29,66.3118
2018-07-02,65.4761
2018-07-03,65.8369
2018-07-05,66.6916
2018-07-06,67.6222
2018-07-09,67.7172
2018-07-10,67.6317
2018-07-11,66.7676
2018-07-12,67.2899
2018-07-13,67.8027
2018-07-16,66.4827
2018-07-17,66.7866
2018-07-18,66.5966
2018-07-19,66.891
2018-07-20,66.4067
2018-07-23,66.6156
2018-07-24,66.834
2018-07-25,67.3184
2018-07-26,67.6982
2018-07-27,66.5871
2018-07-30,67.024
2018-07-31,66.891
2018-08-01,64.6879
2018-08-02,65.0488
2018-08-03,64.8902
2018-08-06,65.563
2018-08-07,65.5919
2018-08-08,65.9475
2018-08-09,66.0725
2018-08-10,66.2262
2018-08-13,65.3996
2018-08-14,65.8898
2018-08-15,64.3519
2018-08-16,64.5442
2018-08-17,64.8998
2018-08-20,65.2074
2018-08-21,64.8517
2018-08-22,65.5726
2018-08-23,64.6114
2018-08-24,64.871
2018-08-27,65.1785
2018-08-28,64.7076
2018-08-29,64.0924
2018-08-30,63.8713
2018-08-31,63.3523
2018-09-04,63.1504
2018-09-05,63.5157
2018-09-06,63.4484
2018-09-07,63.285
2018-09-10,62.0547
2018-09-11,62.4968
2018-09-12,62.5833
2018-09-13,63.4003
2018-09-14,63.8136
2018-09-17,65.3323
2018-09-18,66.4569
2018-09-19,66.8222
2018-09-20,65.9475
2018-09-21,66.4281
2018-09-24,65.2362
2018-09-25,65.7745
2018-09-26,65.7553
2018-09-27,65.5342
2018-09-28,65.1593
2018-10-01,66.2743
2018-10-02,65.2458
2018-10-03,65.7745
2018-10-04,65.8225
2018-10-05,65.9475
2018-10-08,65.7456
2018-10-09,66.0532
2018-10-10,64.6979
2018-10-11,62.6891
2018-10-12,62.4968
2018-10-15,62.295
2018-10-16,64.8421
2018-10-17,64.4192
2018-10-18,64.3231
2018-10-19,65.1593
2018-10-22,64.3808
2018-10-23,63.3427
2018-10-24,61.1704
2018-10-25,62.1027
2018-10-26,60.882
2018-10-29,60.7763
2018-10-30,60.8147
2018-10-31,63.0543
2018-11-01,62.295
2018-11-02,60.9069
2018-11-05,62.2901
2018-11-06,62.0368
2018-11-07,62.4069
2018-11-08,62.3095
2018-11-09,61.4524
2018-11-12,60.7706
2018-11-13,59.4264
2018-11-14,58.803
2018-11-15,59.7673
2018-11-16,60.5855
2018-11-19,60.6634
2018-11-20,58.7738
2018-11-21,59.4069
2018-11-23,57.566
2018-11-26,57.9848
2018-11-27,58.1991
2018-11-28,58.9491
2018-11-29,59.7478
2018-11-30,59.8355
2018-12-03,61.1212
2018-12-04,59.027
2018-12-06,57.8289
2018-12-07,58.4329
2018-12-10,57.6244
2018-12-11,57.4491
2018-12-12,58.1601
2018-12-13,59.855
2018-12-14,58.6277
2018-12-17,57.0789
2018-12-18,55.0042
2018-12-19,54.4393
2018-12-20,53.1048
2018-12-21,52.5009
2018-12-24,49.4717
2018-12-26,52.3061
2018-12-27,51.936
2018-12-28,51.6048
2018-12-31,52.5496
2019-01-02,52.9977
2019-01-03,52.8711
2019-01-04,55.1795
2019-01-07,56.1439
2019-01-08,57.3419
2019-01-09,58.1796
2019-01-10,58.4816
2019-01-11,58.2478
2019-01-14,57.8289
2019-01-15,59.3777
2019-01-16,59.5822
2019-01-17,60.2933
2019-01-18,61.5498
2019-01-22,60.9556
2019-01-23,60.9264
2019-01-24,61.0238
2019-01-25,61.6657
2019-01-28,61.5176
2019-01-29,62.8114
2019-01-30,63.4039
2019-01-31,63.4138
2019-02-01,64.352
2019-02-04,65.1717
2019-02-05,65.389
2019-02-06,64.9545
2019-02-07,64.3323
2019-02-08,64.2138
2019-02-11,64.2434
2019-02-12,64.4014
2019-02-13,65.2606
2019-02-14,65.8532
2019-02-15,66.8704
2019-02-19,67.7296
2019-02-20,67.2753
2019-02-21,66.9593
2019-02-22,67.0284
2019-02-25,66.8111
2019-02-26,63.4928
2019-02-27,64.3421
2019-02-28,63.4632
2019-03-01,65.0532
2019-03-04,65.0828
2019-03-05,65.1322
2019-03-06,64.6187
2019-03-07,65.073
2019-03-08,64.7668
2019-03-11,65.468
2019-03-12,65.9223
2019-03-13,66.4754
2019-03-14,66.2877
2019-03-15,66.0211
2019-03-18,67.5222
2019-03-19,67.463
2019-03-20,67.9469
2019-03-21,68.9839
2019-03-22,68.1543
2019-03-25,68.4209
2019-03-26,68.4308
2019-03-27,67.9864
2019-03-28,68.5197
2019-03-29,68.974
2019-04-01,69.4777
2019-04-02,69.3394
2019-04-03,68.4604
2019-04-04,68.6184
2019-04-05,69.6653
2019-04-08,69.6456
2019-04-09,69.0036
2019-04-10,68.9444
2019-04-11,69.1715
2019-04-12,69.7246
2019-04-15,69.2209
2019-04-16,69.369
2019-04-17,68.8653
2019-04-18,68.2827
2019-04-22,69.0629
2019-04-23,69.0036
2019-04-24,69.1616
2019-04-25,68.895
2019-04-26,68.73
2019-04-29,68.62
2019-04-30,67.93
2019-05-01,67.58
2019-05-02,66.85
2019-05-03,66.89
2019-05-06,66.22
2019-05-07,66.33
2019-05-08,66.02
2019-05-09,66.04
2019-05-10,67.22
2019-05-13,66.49
2019-05-14,66.97
2019-05-15,67.25
2019-05-16,68.1
2019-05-17,68.17
2019-05-20,67.04
2019-05-21,67.97
2019-05-22,66.91
2019-05-23,65.33
2019-05-24,65.66
2019-05-28,64.26
2019-05-29,63.84
2019-05-30,64.13
2019-05-31,63.62
2019-06-03,63.78
2019-06-04,65.1
2019-06-05,65.25
2019-06-06,65.98
2019-06-07,65.99
2019-06-10,65.82
2019-06-11,65.72
2019-06-12,64.45
2019-06-13,64.905
2019-06-14,64.39
2019-06-17,65.06
2019-06-18,65.61
2019-06-19,66.29
2019-06-20,67.76
2019-06-21,68.865
2019-06-24,67.34
2019-06-25,66.8
2019-06-26,67.38
2019-06-27,67.4
2019-06-28,68.67
2019-07-01,69.69
2019-07-02,69.375
2019-07-03,70.19
2019-07-04,70.19
2019-07-05,70.17
2019-07-08,69.705
2019-07-09,69.91
2019-07-10,70.4
2019-07-11,70.97
2019-07-12,71.32
2019-07-15,70.86
2019-07-16,70.235
2019-07-17,69.64
2019-07-18,69.14
2019-07-19,68.605
2019-07-22,69.13
2019-07-23,68.455
2019-07-24,68.47
2019-07-25,68.53
2019-07-26,68.525
2019-07-29,66.77
2019-07-30,67.15
2019-07-31,69.995
2019-08-01,70.96
2019-08-02,71.075
2019-08-05,67.76
2019-08-06,68.02
2019-08-07,66.95
2019-08-08,68.89
2019-08-09,69.035
2019-08-12,69.235
2019-08-13,69.65
2019-08-14,67.735
2019-08-15,68.04
2019-08-16,69.42
2019-08-19,70.99
2019-08-20,71.125
2019-08-21,71.17
2019-08-22,70.295
2019-08-23,67.22
2019-08-26,68.16
2019-08-27,68.33
2019-08-28,69.52
2019-08-29,70.85
2019-08-30,71.48
2019-09-02,71.275
2019-09-03,70.715
2019-09-04,71.02
2019-09-05,70.98
2019-09-06,71.73
2019-09-09,73.68
2019-09-10,73.385
2019-09-11,73.9
2019-09-12,73.91
2019-09-13,74.375
2019-09-16,75.84
2019-09-17,76.17
2019-09-18,76.51
2019-09-19,75.06
2019-09-20,75.83
2019-09-23,74.9
2019-09-24,74.14
2019-09-25,73.66
2019-09-26,73.52
2019-09-27,73.355
2019-09-30,73.7
2019-10-01,72.73
2019-10-02,71.66
2019-10-03,71.915
2019-10-04,72.115
2019-10-07,70.835
2019-10-08,68.1
2019-10-09,68.645
2019-10-10,69.03
2019-10-11,69.62
2019-10-14,69.12
2019-10-15,69.71
2019-10-16,68.45
2019-10-17,68.675
2019-10-18,69.25
2019-10-21,69.46
2019-10-22,70.265
2019-10-23,70.86
2019-10-24,71.23
2019-10-25,71.56
2019-10-28,71.345
2019-10-29,71.35
2019-10-30,70.08
2019-10-31,69.76
2019-11-01,70.275
2019-11-04,71.95
2019-11-05,71.74
2019-11-06,70.595
2019-11-07,69.625
2019-11-08,70.435
2019-11-11,69.79
2019-11-12,70.155
2019-11-13,70.785
2019-11-14,70.09
2019-11-15,71.245
2019-11-18,70.685
2019-11-19,69.755
2019-11-20,70.785
2019-11-21,71.39
2019-11-22,71.6
2019-11-25,71.97
