date,close
2014-06-13,43.2535
2014-06-16,42.9288
2014-06-17,43.6736
2014-06-18,43.9123
2014-06-19,43.7404
2014-06-20,43.7213
2014-06-23,43.5972
2014-06-24,43.1866
2014-06-25,43.7213
2014-06-26,43.8455
2014-06-27,43.7213
2014-06-30,43.9219
2014-07-01,44.6093
2014-07-02,44.0937
2014-07-03,44.8767
2014-07-07,44.6093
2014-07-08,44.151
2014-07-09,44.1128
2014-07-10,43.559
2014-07-11,43.6354
2014-07-14,43.8168
2014-07-15,44.9817
2014-07-16,44.8289
2014-07-17,44.1128
2014-07-18,44.5616
2014-07-21,44.2369
2014-07-22,44.0842
2014-07-23,44.4757
2014-07-24,44.8958
2014-07-25,44.6284
2014-07-28,43.9982
2014-07-29,44.0555
2014-07-30,44.6189
2014-07-31,44.2369
2014-08-01,43.5017
2014-08-04,43.4444
2014-08-05,43.3105
2014-08-06,43.2148
2014-08-07,42.6598
2014-08-08,42.8129
2014-08-11,43.4827
2014-08-12,43.5689
2014-08-13,44.0377
2014-08-14,43.6645
2014-08-15,43.2626
2014-08-18,44.0952
2014-08-19,43.8272
2014-08-20,43.3009
2014-08-21,44.2387
2014-08-22,44.277
2014-08-25,44.4971
2014-08-26,45.1286
2014-08-27,44.6693
2014-08-28,44.4109
2014-08-29,44.5641
2014-09-02,45.0712
2014-09-03,45.2626
2014-09-04,45.2148
2014-09-05,45.0808
2014-09-08,45.2818
2014-09-09,44.7841
2014-09-10,45.3392
2014-09-11,45.655
2014-09-12,45.7985
2014-09-15,45.4062
2014-09-16,45.2148
2014-09-17,45.3583
2014-09-18,45.9994
2014-09-19,45.387
2014-09-22,44.6693
2014-09-23,44.0377
2014-09-24,44.1239
2014-09-25,43.4732
2014-09-26,43.3201
2014-09-29,43.2148
2014-09-30,42.7459
2014-10-01,42.6885
2014-10-02,43.1
2014-10-03,43.4445
2014-10-06,43.1095
2014-10-07,42.344
2014-10-08,43.2339
2014-10-09,41.9421
2014-10-10,41.9038
2014-10-13,42.0186
2014-10-14,42.3823
2014-10-15,41.1383
2014-10-16,42.1622
2014-10-17,41.9325
2014-10-20,41.5497
2014-10-21,42.3823
2014-10-22,41.8942
2014-10-23,42.1813
2014-10-24,42.143
2014-10-27,42.2674
2014-10-28,43.8177
2014-10-29,43.7507
2014-10-30,43.8846
2014-10-31,44.3248
2014-11-03,44.3631
2014-11-04,44.248
2014-11-05,44.2001
2014-11-06,44.6412
2014-11-07,44.7467
2014-11-10,44.9577
2014-11-11,44.6796
2014-11-12,45.0152
2014-11-13,44.622
2014-11-14,44.4398
2014-11-17,44.0275
2014-11-18,43.6247
2014-11-19,43.126
2014-11-20,43.4425
2014-11-21,42.9534
2014-11-24,43.5192
2014-11-25,43.711
2014-11-26,43.8548
2014-11-28,42.8575
2014-12-01,42.0136
2014-12-02,42.4643
2014-12-03,43.1356
2014-12-04,42.8095
2014-12-05,43.3657
2014-12-08,43.4425
2014-12-09,44.0562
2014-12-10,42.6369
2014-12-11,43.2027
2014-12-12,42.6369
2014-12-15,42.004
2014-12-16,42.3972
2014-12-17,43.4712
2014-12-18,44.1617
2014-12-19,44.1138
2014-12-22,44.4974
2014-12-23,44.7659
2014-12-24,44.6796
2014-12-26,44.9097
2014-12-29,45.1974
2014-12-30,45.3509
2014-12-31,44.8426
2015-01-02,44.5165
2015-01-05,43.6439
2015-01-06,42.5602
2015-01-07,42.9342
2015-01-08,43.2794
2015-01-09,42.4739
2015-01-12,42.2341
2015-01-13,42.1286
2015-01-14,41.3614
2015-01-15,40.8915
2015-01-16,41.9464
2015-01-20,41.3423
2015-01-21,41.0737
2015-01-22,43.2315
2015-01-23,42.5794
2015-01-26,42.9726
2015-01-27,42.4163
2015-01-28,41.3519
2015-01-29,42.167
2015-01-30,41.6875
2015-02-02,42.8575
2015-02-03,43.7131
2015-02-04,43.5977
2015-02-05,44.8379
2015-02-06,45.2032
2015-02-09,44.6744
2015-02-10,44.9725
2015-02-11,44.809
2015-02-12,45.8377
2015-02-13,45.953
2015-02-17,46.4241
2015-02-18,45.2224
2015-02-19,45.2128
2015-02-20,45.8473
2015-02-23,45.8857
2015-02-24,45.9819
2015-02-25,45.5973
2015-02-26,45.6839
2015-02-27,45.2705
2015-03-02,45.5685
2015-03-03,45.4627
2015-03-04,45.1167
2015-03-05,45.0782
2015-03-06,45.232
2015-03-09,45.5781
2015-03-10,44.6937
2015-03-11,45.3666
2015-03-12,46.8087
2015-03-13,46.5683
2015-03-16,46.1549
2015-03-17,46.0588
2015-03-18,45.7608
2015-03-19,45.6262
2015-03-20,46.03
2015-03-23,45.8473
2015-03-24,45.8281
2015-03-25,45.0686
2015-03-26,45.2993
2015-03-27,45.0397
2015-03-30,45.5589
2015-03-31,45.8377
2015-04-01,46.0107
2015-04-02,46.1453
2015-04-06,45.8954
2015-04-07,46.1549
2015-04-08,46.2222
2015-04-09,46.0492
2015-04-10,46.03
2015-04-13,46.5683
2015-04-14,46.3568
2015-04-15,46.8856
2015-04-16,47.3951
2015-04-17,46.7606
2015-04-20,47.1547
2015-04-21,46.9432
2015-04-22,47.1355
2015-04-23,47.0874
2015-04-24,46.7414
2015-04-27,46.7798
2015-04-28,47.3662
2015-04-29,47.3278
2015-04-30,46.8567
2015-05-01,47.2317
2015-05-04,47.2893
2015-05-05,47.0388
2015-05-06,47.2893
2015-05-07,47.1833
2015-05-08,47.3953
2015-05-11,47.6266
2015-05-12,47.7711
2015-05-13,48.2817
2015-05-14,48.7442
2015-05-15,48.1276
2015-05-18,49.0333
2015-05-19,49.6114
2015-05-20,49.0237
2015-05-21,48.8406
2015-05-22,48.5034
2015-05-26,48.1372
2015-05-27,48.6286
2015-05-28,48.8791
2015-05-29,48.2721
2015-06-01,48.0312
2015-06-02,48.7153
2015-06-03,49.3994
2015-06-04,48.5901
2015-06-05,49.8234
2015-06-08,50.1799
2015-06-09,50.5364
2015-06-10,51.1434
2015-06-11,51.2686
2015-06-12,51.2108
2015-06-15,50.8351
2015-06-16,51.4421
2015-06-17,50.257
2015-06-18,50.6424
2015-06-19,50.4497
2015-06-22,50.9892
2015-06-23,51.4903
2015-06-24,51.4132
2015-06-25,51.6637
2015-06-26,52.0009
2015-06-29,50.9314
2015-06-30,51.4324
2015-07-01,51.8949
2015-07-02,51.047
2015-07-06,50.9218
2015-07-07,50.151
2015-07-08,49.9197
2015-07-09,50.4015
2015-07-10,51.0663
2015-07-13,51.3072
2015-07-14,51.5962
2015-07-15,51.9527
2015-07-16,53.1957
2015-07-17,52.9452
2015-07-20,53.2728
2015-07-21,52.7043
2015-07-22,53.292
2015-07-23,52.5501
2015-07-24,52.1358
2015-07-27,51.5384
2015-07-28,51.5481
2015-07-29,51.8178
2015-07-30,52.2033
2015-07-31,51.9527
2015-08-03,52.0973
2015-08-04,51.8945
2015-08-05,52.2421
2015-08-06,52.0007
2015-08-07,51.7014
2015-08-10,52.2807
2015-08-11,51.5566
2015-08-12,50.8711
2015-08-13,51.5662
2015-08-14,52.1166
2015-08-17,52.4448
2015-08-18,52.6958
2015-08-19,51.9041
2015-08-20,50.8228
2015-08-21,50.3787
2015-08-24,48.3126
2015-08-25,47.1443
2015-08-26,48.4284
2015-08-27,48.9884
2015-08-28,48.7374
2015-08-31,49.2394
2015-09-01,47.8009
2015-09-02,48.7374
2015-09-03,49.2974
2015-09-04,48.9884
2015-09-08,50.5428
2015-09-09,50.3787
2015-09-10,50.9676
2015-09-11,51.1993
2015-09-14,51.4793
2015-09-15,52.1069
2015-09-16,51.991
2015-09-17,50.7456
2015-09-18,49.4711
2015-09-21,49.9732
2015-09-22,49.7415
2015-09-23,49.9925
2015-09-24,50.2918
2015-09-25,51.0545
2015-09-28,50.5814
2015-09-29,50.8614
2015-09-30,51.5855
2015-10-01,51.3538
2015-10-02,50.2532
2015-10-05,51.5952
2015-10-06,51.6724
2015-10-07,52.2421
2015-10-08,52.4062
2015-10-09,51.7207
2015-10-12,52.3772
2015-10-13,52.5993
2015-10-14,50.7745
2015-10-15,47.9553
2015-10-16,47.0285
2015-10-19,47.2023
2015-10-20,47.6947
2015-10-21,47.0092
2015-10-22,47.656
2015-10-23,48.3319
2015-10-26,47.8202
2015-10-27,47.7816
2015-10-28,49.7415
2015-10-29,49.6739
2015-10-30,48.747
2015-11-02,49.7897
2015-11-03,50.1759
2015-11-04,50.089
2015-11-05,50.6201
2015-11-06,51.7497
2015-11-09,51.2756
2015-11-10,51.0628
2015-11-11,50.4339
2015-11-12,49.3794
2015-11-13,48.6925
2015-11-16,49.0021
2015-11-17,49.3987
2015-11-18,50.163
2015-11-19,49.8051
2015-11-20,50.2211
2015-11-23,50.1533
2015-11-24,50.5016
2015-11-25,50.7435
2015-11-27,50.8015
2015-11-30,50.9176
2015-12-01,50.995
2015-12-02,50.1146
2015-12-03,49.5438
2015-12-04,50.5887
2015-12-07,49.5342
2015-12-08,48.9634
2015-12-09,47.4154
2015-12-10,47.5992
2015-12-11,46.535
2015-12-14,46.5447
2015-12-15,47.696
2015-12-16,48.5087
2015-12-17,47.696
2015-12-18,47.3187
2015-12-21,46.9801
2015-12-22,47.1542
2015-12-23,47.5896
2015-12-24,47.667
2015-12-28,47.667
2015-12-29,48.2378
2015-12-30,47.5702
2015-12-31,46.9414
2016-01-04,45.732
2016-01-05,45.9836
2016-01-06,45.732
2016-01-07,44.9
2016-01-08,43.8552
2016-01-11,43.9325
2016-01-12,44.039
2016-01-13,42.82
2016-01-14,42.9941
2016-01-15,42.1911
2016-01-19,40.1401
2016-01-20,38.863
2016-01-21,37.9826
2016-01-22,39.3468
2016-01-25,37.9149
2016-01-26,38.863
2016-01-27,38.6986
2016-01-28,39.3758
2016-01-29,40.7206
2016-02-01,40.4497
2016-02-02,39.0372
2016-02-03,38.8147
2016-02-04,39.637
2016-02-05,38.7469
2016-02-08,38.3696
2016-02-09,38.6802
2016-02-10,38.2726
2016-02-11,37.4381
2016-02-12,39.5923
2016-02-16,40.3298
2016-02-17,40.1067
2016-02-18,39.408
2016-02-19,39.6603
2016-02-22,40.5919
2016-02-23,40.2716
2016-02-24,40.9606
2016-02-25,41.1838
2016-02-26,41.7855
2016-02-29,41.242
2016-03-01,42.979
2016-03-02,43.3284
2016-03-03,43.8912
2016-03-04,44.0562
2016-03-07,44.2988
2016-03-08,43.0567
2016-03-09,42.7461
2016-03-10,42.8529
2016-03-11,43.5807
2016-03-14,43.1343
2016-03-15,42.5521
2016-03-16,41.8243
2016-03-17,42.2027
2016-03-18,42.6006
2016-03-21,42.9208
2016-03-22,42.7364
2016-03-23,42.193
2016-03-24,42.3483
2016-03-28,42.2124
2016-03-29,42.5035
2016-03-30,42.9208
2016-03-31,43.0276
2016-04-01,43.047
2016-04-04,42.9499
2016-04-05,41.7563
2016-04-06,42.193
2016-04-07,41.1935
2016-04-08,41.5429
2016-04-11,41.931
2016-04-12,42.9402
2016-04-13,45.0169
2016-04-14,45.5991
2016-04-15,45.6768
2016-04-18,46.3852
2016-04-19,49.471
2016-04-20,49.9174
2016-04-21,50.1794
2016-04-22,50.5482
2016-04-25,50.4705
2016-04-26,50.9654
2016-04-27,51.014
2016-04-28,50.5385
2016-04-29,50.4802
2016-05-02,50.325
2016-05-03,49.2964
2016-05-04,48.8112
2016-05-05,48.423
2016-05-06,49.0538
2016-05-09,48.8597
2016-05-10,49.56
2016-05-11,49.453
2016-05-12,49.1223
2016-05-13,47.9648
2016-05-16,48.4414
2016-05-17,47.7508
2016-05-18,49.9588
2016-05-19,49.1126
2016-05-20,50.0366
2016-05-23,49.7546
2016-05-24,50.9607
2016-05-25,51.5444
2016-05-26,51.0288
2016-05-27,51.6805
2016-05-31,51.8167
2016-06-01,52.021
2016-06-02,52.2836
2016-06-03,51.3304
2016-06-06,52.2253
2016-06-07,51.914
2016-06-08,52.3128
2016-06-09,50.8926
2016-06-10,50.1826
2016-06-13,49.5892
2016-06-14,48.6457
2016-06-15,48.8888
2016-06-16,48.1204
2016-06-17,48.2079
2016-06-20,49.0737
2016-06-21,49.56
2016-06-22,49.6476
2016-06-23,51.2039
2016-06-24,48.0718
2016-06-27,45.601
2016-06-28,47.4103
2016-06-29,48.7916
2016-06-30,49.6087
2016-07-01,48.8986
2016-07-05,47.7799
2016-07-06,48.3441
2016-07-07,48.704
2016-07-08,49.2779
2016-07-11,50.1047
2016-07-12,51.4179
2016-07-13,51.2234
2016-07-14,51.6903
2016-07-15,51.8556
2016-07-18,51.7778
2016-07-19,51.5346
2016-07-20,51.2331
2016-07-21,51.3012
2016-07-22,52.0599
2016-07-25,51.5541
2016-07-26,51.6124
2016-07-27,51.6805
2016-07-28,51.8264
2016-07-29,51.3595
2016-08-01,51.1066
2016-08-02,50.9218
2016-08-03,51.4471
2016-08-04,51.6514
2016-08-05,53.2077
2016-08-08,52.7894
2016-08-09,52.8284
2016-08-10,51.9218
2016-08-11,52.302
2016-08-12,52.068
2016-08-15,52.5652
2016-08-16,52.302
2016-08-17,52.4287
2016-08-18,52.7309
2016-08-19,52.7602
2016-08-22,52.8772
2016-08-23,53.0721
2016-08-24,53.2671
2016-08-25,53.6766
2016-08-26,53.7643
2016-08-29,54.0665
2016-08-30,54.1445
2016-08-31,54.1835
2016-09-01,53.6376
2016-09-02,54.086
2016-09-06,53.1209
2016-09-07,53.813
2016-09-08,53.852
2016-09-09,54.2712
2016-09-12,54.4077
2016-09-13,53.9593
2016-09-14,53.5498
2016-09-15,53.9398
2016-09-16,53.4523
2016-09-19,53.2574
2016-09-20,53.0624
2016-09-21,53.5693
2016-09-22,54.0958
2016-09-23,53.9593
2016-09-26,53.0137
2016-09-27,53.1891
2016-09-28,53.8423
2016-09-29,53.0234
2016-09-30,54.1738
2016-10-03,54.1153
2016-10-04,53.969
2016-10-05,54.4175
2016-10-06,54.437
2016-10-07,54.6222
2016-10-10,54.8562
2016-10-11,54.3687
2016-10-12,54.164
2016-10-13,52.6237
2016-10-14,52.8089
2016-10-17,52.7699
2016-10-18,53.1404
2016-10-19,53.891
2016-10-20,53.2574
2016-10-21,53.2379
2016-10-24,53.6961
2016-10-25,52.8869
2016-10-26,52.6237
2016-10-27,52.575
2016-10-28,52.5555
2016-10-31,52.5945
2016-11-01,52.107
2016-11-02,50.6837
2016-11-03,50.6447
2016-11-04,50.5862
2016-11-07,52.5067
2016-11-08,52.5849
2016-11-09,55.4379
2016-11-10,58.5351
2016-11-11,60.0593
2016-11-14,61.1438
2016-11-15,61.9939
2016-11-16,61.8278
2016-11-17,61.945
2016-11-18,62.8439
2016-11-21,62.9221
2016-11-22,63.7721
2016-11-23,64.2509
2016-11-25,64.6612
2016-11-28,63.1566
2016-11-29,63.6256
2016-11-30,64.329
2016-12-01,67.4361
2016-12-02,66.3906
2016-12-05,66.4981
2016-12-06,67.866
2016-12-07,67.5826
2016-12-08,69.4976
2016-12-09,68.8919
2016-12-12,67.055
2016-12-13,68.4326
2016-12-14,68.7258
2016-12-15,70.0155
2016-12-16,69.693
2016-12-19,70.1327
2016-12-20,70.973
2016-12-21,70.5528
2016-12-22,70.6799
2016-12-23,70.9437
2016-12-27,71.8523
2016-12-28,71.1195
2016-12-29,70.8069
2016-12-30,70.9046
2017-01-03,70.6701
2017-01-04,72.0087
2017-01-05,70.377
2017-01-06,70.2793
2017-01-09,68.843
2017-01-10,69.5856
2017-01-11,69.8103
2017-01-12,67.6608
2017-01-13,68.4717
2017-01-17,66.6251
2017-01-18,67.5533
2017-01-19,66.6544
2017-01-20,69.0873
2017-01-23,68.5499
2017-01-24,70.0448
2017-01-25,70.8557
2017-01-26,71.1684
2017-01-27,70.1229
2017-01-30,69.7224
2017-01-31,69.9568
2017-02-01,69.9959
2017-02-02,68.7844
2017-02-03,70.9827
2017-02-06,70.2109
2017-02-07,70.0934
2017-02-08,69.6626
2017-02-09,70.8961
2017-02-10,71.2486
2017-02-13,71.9045
2017-02-14,73.4512
2017-02-15,73.8722
2017-02-16,74.0092
2017-02-17,73.7547
2017-02-21,74.0777
2017-02-22,73.7743
2017-02-23,73.9799
2017-02-24,73.4023
2017-02-27,72.9324
2017-02-28,72.1492
2017-03-01,74.2442
2017-03-02,72.5506
2017-03-03,72.7072
2017-03-06,72.1884
2017-03-07,71.7282
2017-03-08,70.6024
2017-03-09,70.7591
2017-03-10,70.3577
2017-03-13,70.7003
2017-03-14,70.7395
2017-03-15,70.2109
2017-03-16,71.043
2017-03-17,71.2486
2017-03-20,70.3283
2017-03-21,65.9524
2017-03-22,65.6783
2017-03-23,66.3244
2017-03-24,66.9411
2017-03-27,65.8937
2017-03-28,66.7943
2017-03-29,66.716
2017-03-30,68.9284
2017-03-31,67.6656
2017-04-03,66.8041
2017-04-04,66.7062
2017-04-05,65.7174
2017-04-06,67.1957
2017-04-07,66.6279
2017-04-10,66.0699
2017-04-11,66.7258
2017-04-12,65.2769
2017-04-13,63.7693
2017-04-17,64.6993
2017-04-18,64.4937
2017-04-19,65.5412
2017-04-20,68.2627
2017-04-21,68.7718
2017-04-24,71.1702
2017-04-25,70.8276
2017-04-26,71.4052
2017-04-27,70.5927
2017-04-28,69.369
2017-05-01,70.5143
2017-05-02,69.3983
2017-05-03,70.5046
2017-05-04,70.994
2017-05-05,71.1605
2017-05-08,71.2486
2017-05-09,70.3756
2017-05-10,70.4345
2017-05-11,69.5125
2017-05-12,69.2673
2017-05-15,70.7091
2017-05-16,71.2486
2017-05-17,67.5018
2017-05-18,67.7372
2017-05-19,67.6685
2017-05-22,67.6783
2017-05-23,69.2869
2017-05-24,69.4536
2017-05-25,69.8852
2017-05-26,69.434
2017-05-30,68.6199
2017-05-31,67.4429
2017-06-01,69.846
2017-06-02,69.5615
2017-06-05,69.5812
2017-06-06,69.4634
2017-06-07,70.3953
2017-06-08,72.8081
2017-06-09,76.7315
2017-06-12,75.6035
2017-06-13,75.8782
2017-06-14,75.4172
2017-06-15,75.6035
2017-06-16,75.3289
2017-06-19,75.0346
2017-06-20,74.1813
2017-06-21,73.1907
2017-06-22,72.3766
2017-06-23,71.7488
2017-06-26,72.3373
2017-06-27,72.1608
2017-06-28,73.4261
2017-06-29,75.5545
2017-06-30,74.9758
2017-07-03,76.7904
2017-07-05,76.6334
2017-07-06,75.7801
2017-07-07,76.9081
2017-07-10,76.0645
2017-07-11,75.8193
2017-07-12,75.7507
2017-07-13,76.0645
2017-07-14,75.0445
2017-07-17,75.0248
2017-07-18,75.015
2017-07-19,76.8198
2017-07-20,76.1038
2017-07-21,74.9268
2017-07-24,75.476
2017-07-25,76.4274
2017-07-26,74.2794
2017-07-27,74.1225
2017-07-28,73.5143
2017-07-31,73.8674
2017-08-01,74.2598
2017-08-02,73.8576
2017-08-03,73.2397
2017-08-04,73.9067
2017-08-07,73.4457
2017-08-08,74.3891
2017-08-09,73.2393
2017-08-10,71.7358
2017-08-11,70.9399
2017-08-14,72.9052
2017-08-15,72.4237
2017-08-16,72.3254
2017-08-17,69.6919
2017-08-18,70.1537
2017-08-21,69.6919
2017-08-22,70.763
2017-08-23,71.0971
2017-08-24,71.2543
2017-08-25,71.7948
2017-08-28,71.3329
2017-08-29,71.0971
2017-08-30,71.4312
2017-08-31,71.5491
2017-09-01,71.9422
2017-09-05,69.6427
2017-09-06,69.2693
2017-09-07,66.8421
2017-09-08,67.1762
2017-09-11,68.9254
2017-09-12,70.7237
2017-09-13,70.7433
2017-09-14,69.23
2017-09-15,69.4855
2017-09-18,70.8318
2017-09-19,71.4607
2017-09-20,72.4335
2017-09-21,72.4335
2017-09-22,72.6301
2017-09-25,73.0526
2017-09-26,73.8584
2017-09-27,76.4331
2017-09-28,76.6099
2017-09-29,76.9539
2017-10-02,77.9366
2017-10-03,77.6516
2017-10-04,76.0989
2017-10-05,76.6099
2017-10-06,76.5903
2017-10-09,76.7279
2017-10-10,77.6025
2017-10-11,77.0325
2017-10-12,76.1677
2017-10-13,75.9712
2017-10-16,76.8753
2017-10-17,76.6492
2017-10-18,77.1406
2017-10-19,78.2215
2017-10-20,80.01
2017-10-23,78.0643
2017-10-24,78.9094
2017-10-25,78.2609
2017-10-26,79.0863
2017-10-27,79.9904
2017-10-30,78.6146
2017-10-31,79.8823
2017-11-01,78.8898
2017-11-02,79.5285
2017-11-03,79.3516
2017-11-06,79.106
2017-11-07,76.9244
2017-11-08,76.7373
2017-11-09,75.7332
2017-11-10,75.8218
2017-11-13,76.6881
2017-11-14,77.1409
2017-11-15,77.072
2017-11-16,77.013
2017-11-17,77.2492
2017-11-20,78.3715
2017-11-21,78.4995
2017-11-22,77.771
2017-11-24,77.2591
2017-11-27,77.7119
2017-11-28,81.0787
2017-11-29,84.2782
2017-11-30,82.5455
2017-12-01,82.2699
2017-12-04,85.1149
2017-12-05,82.2404
2017-12-06,81.6103
2017-12-07,82.2797
2017-12-08,81.4823
2017-12-11,80.7735
2017-12-12,80.5274
2017-12-13,79.9565
2017-12-14,78.9129
2017-12-15,81.6989
2017-12-18,82.4274
2017-12-19,82.0927
2017-12-20,81.8269
2017-12-21,82.8015
2017-12-22,82.5357
2017-12-26,81.886
2017-12-27,81.5906
2017-12-28,81.9746
2017-12-29,81.0886
2018-01-02,81.0197
2018-01-03,80.8129
2018-01-04,81.2165
2018-01-05,81.9942
2018-01-08,82.516
2018-01-09,84.0813
2018-01-10,85.2528
2018-01-11,86.0994
2018-01-12,86.1289
2018-01-16,85.9123
2018-01-17,86.3455
2018-01-18,85.4989
2018-01-19,86.4439
2018-01-22,86.1388
2018-01-23,86.6704
2018-01-24,86.7097
2018-01-25,86.1486
2018-01-26,86.5916
2018-01-29,85.5973
2018-01-30,84.7212
2018-01-31,84.5636
2018-02-01,85.3807
2018-02-02,85.3118
2018-02-05,80.7538
2018-02-06,81.3937
2018-02-07,81.6207
2018-02-08,79.0454
2018-02-09,80.7425
2018-02-12,80.8017
2018-02-13,81.9266
2018-02-14,84.3736
2018-02-15,84.1763
2018-02-16,85.2715
2018-02-20,84.5611
2018-02-21,85.5281
2018-02-22,83.8408
2018-02-23,85.0248
2018-02-26,85.4886
2018-02-27,84.1467
2018-02-28,83.3869
2018-03-01,83.3968
2018-03-02,83.9493
2018-03-05,84.8867
2018-03-06,86.8404
2018-03-07,89.0407
2018-03-08,88.7546
2018-03-09,90.1952
2018-03-12,88.9223
2018-03-13,89.1394
2018-03-14,88.6263
2018-03-15,89.3269
2018-03-16,90.0965
2018-03-19,88.2316
2018-03-20,87.4324
2018-03-21,87.2351
2018-03-22,84.0776
2018-03-23,80.9102
2018-03-26,83.821
2018-03-27,82.1634
2018-03-28,83.2586
2018-03-29,84.9064
2018-04-02,83.3869
2018-04-03,85.0939
2018-04-04,86.5937
2018-04-05,87.5508
2018-04-06,84.8472
2018-04-09,85.0643
2018-04-10,87.2055
2018-04-11,86.9193
2018-04-12,88.8237
2018-04-13,86.6332
2018-04-16,87.9554
2018-04-17,87.5311
2018-04-18,87.7284
2018-04-19,89.6328
2018-04-20,89.8104
2018-04-23,90.7971
2018-04-24,90.6688
2018-04-25,90.8859
2018-04-26,90.1163
2018-04-27,90.1656
2018-04-30,88.2612
2018-05-01,89.8301
2018-05-02,89.4848
2018-05-03,88.5474
2018-05-04,89.3368
2018-05-07,90.3333
2018-05-08,91.5075
2018-05-09,92.1008
2018-05-10,92.0711
2018-05-11,91.903
2018-05-14,91.4383
2018-05-15,92.0217
2018-05-16,93.2279
2018-05-17,93.6828
2018-05-18,92.9906
2018-05-21,96.4611
2018-05-22,95.7196
2018-05-23,94.2365
2018-05-24,93.1983
2018-05-25,93.0302
2018-05-29,90.855
2018-05-30,92.3381
2018-05-31,91.0725
2018-06-01,92.1304
2018-06-04,92.8819
2018-06-05,92.6149
2018-06-06,94.9286
2018-06-07,95.4526
2018-06-08,96.0063
2018-06-11,94.8198
2018-06-12,93.8311
2018-06-13,94.1277
2018-06-14,93.2774
2018-06-15,93.0401
2018-06-18,92.2392
2018-06-19,92.9017
2018-06-20,92.7138
2018-06-21,92.4172
2018-06-22,90.0244
2018-06-25,89.1148
2018-06-26,89.6487
2018-06-27,87.345
2018-06-28,86.643
2018-06-29,86.0695
2018-07-02,87.1868
2018-07-03,87.3351
2018-07-05,86.9692
2018-07-06,87.4241
2018-07-09,88.9962
2018-07-10,87.7306
2018-07-11,87.1373
2018-07-12,86.5441
2018-07-13,85.763
2018-07-16,87.1077
2018-07-17,87.3845
2018-07-18,89.8168
2018-07-19,90.2815
2018-07-20,89.3323
2018-07-23,90.9835
2018-07-24,89.2137
2018-07-25,87.3351
2018-07-26,87.9184
2018-07-27,87.0978
2018-07-30,87.0385
2018-07-31,86.7418
2018-08-01,87.78
2018-08-02,88.4128
2018-08-03,87.9876
2018-08-06,88.3139
2018-08-07,88.1953
2018-08-08,89.1168
2018-08-09,88.4331
2018-08-10,88.4033
2018-08-13,87.9674
2018-08-14,89.3546
2018-08-15,88.0764
2018-08-16,89.5329
2018-08-17,89.5825
2018-08-20,89.9094
2018-08-21,91.257
2018-08-22,90.8012
2018-08-23,89.6915
2018-08-24,89.0276
2018-08-27,88.5123
2018-08-28,87.9872
2018-08-29,87.7296
2018-08-30,86.9171
2018-08-31,87.7395
2018-09-04,88.3736
2018-09-05,88.3934
2018-09-06,88.1457
2018-09-07,88.6907
2018-09-10,88.5916
2018-09-11,89.4735
2018-09-12,87.4224
2018-09-13,86.9171
2018-09-14,87.7593
2018-09-17,86.9171
2018-09-18,86.7883
2018-09-19,88.116
2018-09-20,89.9193
2018-09-21,89.4933
2018-09-24,88.2547
2018-09-25,87.898
2018-09-26,86.3127
2018-09-27,84.3805
2018-09-28,84.1625
2018-10-01,83.4788
2018-10-02,84.1328
2018-10-03,86.7387
2018-10-04,86.6793
2018-10-05,85.6488
2018-10-08,86.4514
2018-10-09,86.4613
2018-10-10,85.7082
2018-10-11,82.2799
2018-10-12,80.7144
2018-10-15,81.6755
2018-10-16,82.8447
2018-10-17,83.0528
2018-10-18,79.0002
2018-10-19,78.3562
2018-10-22,75.6908
2018-10-23,75.3935
2018-10-24,71.6283
2018-10-25,73.4713
2018-10-26,72.5498
2018-10-29,74.9576
2018-10-30,74.4126
2018-10-31,75.4431
2018-11-01,76.4339
2018-11-02,76.5925
2018-11-05,76.5627
2018-11-06,77.1473
2018-11-07,77.2764
2018-11-08,77.9717
2018-11-09,77.5645
2018-11-12,76.9983
2018-11-13,77.8476
2018-11-14,76.3229
2018-11-15,77.6141
2018-11-16,77.2764
2018-11-19,76.7897
2018-11-20,74.7535
2018-11-21,75.6177
2018-11-23,75.3197
2018-11-26,76.7202
2018-11-27,76.5414
2018-11-28,77.1076
2018-11-29,76.1242
2018-11-30,76.8295
2018-12-03,76.601
2018-12-04,72.6875
2018-12-06,71.7241
2018-12-07,71.3665
2018-12-10,70.3633
2018-12-11,69.2905
2018-12-12,70.1348
2018-12-13,67.8106
2018-12-14,66.9961
2018-12-17,67.7907
2018-12-18,67.2146
2018-12-19,65.3969
2018-12-20,65.4069
2018-12-21,64.2249
2018-12-24,62.4469
2018-12-26,65.5161
2018-12-27,65.089
2018-12-28,65.2777
2018-12-31,66.0425
2019-01-02,67.4828
2019-01-03,66.6385
2019-01-04,68.5853
2019-01-07,68.8436
2019-01-08,69.5985
2019-01-09,69.6978
2019-01-10,70.1348
2019-01-11,70.1845
2019-01-14,70.3831
2019-01-15,70.2937
2019-01-16,72.1909
2019-01-17,73.0451
2019-01-18,73.9589
2019-01-22,73.1742
2019-01-23,70.1845
2019-01-24,71.8532
2019-01-25,72.1214
2019-01-28,72.9855
2019-01-29,72.3597
2019-01-30,71.5751
2019-01-31,70.6613
2019-02-01,70.8599
2019-02-04,71.8929
2019-02-05,71.8631
2019-02-06,71.9628
2019-02-07,73.0591
2019-02-08,71.285
2019-02-11,71.9727
2019-02-12,72.7203
2019-02-13,72.6904
2019-02-14,72.4711
2019-02-15,74.0459
2019-02-19,74.1655
2019-02-20,75.3914
2019-02-21,74.2353
2019-02-22,74.1256
2019-02-25,74.0259
2019-02-26,73.2286
2019-02-27,74.2253
2019-02-28,73.4279
2019-03-01,73.1787
2019-03-04,72.5309
2019-03-05,72.6006
2019-03-06,71.4046
2019-03-07,70.4876
2019-03-08,70.6072
2019-03-11,71.2252
2019-03-12,70.9959
2019-03-13,71.7634
2019-03-14,72.2717
2019-03-15,72.2219
2019-03-18,73.6472
2019-03-19,71.3149
2019-03-20,68.9128
2019-03-21,67.348
2019-03-22,64.0887
2019-03-25,64.2482
2019-03-26,65.4642
2019-03-27,65.7831
2019-03-28,67.8663
2019-03-29,67.1088
2019-04-01,69.9793
2019-04-02,70.0889
2019-04-03,70.2683
2019-04-04,71.1554
2019-04-05,72.4711
2019-04-08,72.8
2019-04-09,71.7634
2019-04-10,72.4113
2019-04-11,73.2684
2019-04-12,74.8831
2019-04-15,74.1256
2019-04-16,76.2387
2019-04-17,77.2852
2019-04-18,74.9429
2019-04-22,75.1323
2019-04-23,76.5277
2019-04-24,76.0393
2019-04-25,75.4712
2019-04-26,76.3084
2019-04-29,76.9264
2019-04-30,75.9496
2019-05-01,75.2519
2019-05-02,75.9496
2019-05-03,76.8965
2019-05-06,76.8466
2019-05-07,75.82
2019-05-08,74.8
2019-05-09,74.49
2019-05-10,74.62
2019-05-13,71.5
2019-05-14,73.35
2019-05-15,72.24
2019-05-16,73.16
2019-05-17,72.41
2019-05-20,72.38
2019-05-21,72.74
2019-05-22,71.89
2019-05-23,70.05
2019-05-24,71.13
2019-05-28,70.3
2019-05-29,71.02
2019-05-30,69.45
2019-05-31,67.74
2019-06-03,69.26
2019-06-04,72.51
2019-06-05,72.07
2019-06-06,71.77
2019-06-07,72.08
2019-06-10,72.98
2019-06-11,72.83
2019-06-12,72.35
2019-06-13,71.89
2019-06-14,72.14
2019-06-17,72.08
2019-06-18,72.265
2019-06-19,71.775
2019-06-20,72.085
2019-06-21,71.715
2019-06-24,71.085
2019-06-25,71.33
2019-06-26,71.69
2019-06-27,72.08
2019-06-28,73.11
2019-07-01,73.45
2019-07-02,72.49
2019-07-03,72.47
2019-07-04,72.47
2019-07-05,73.1
2019-07-08,71.21
2019-07-09,71.62
2019-07-10,70.87
2019-07-11,71.21
2019-07-12,72.21
2019-07-15,69.97
2019-07-16,64.96
2019-07-17,65.69
2019-07-18,66
2019-07-19,66.82
2019-07-22,66.27
2019-07-23,68.215
2019-07-24,70.6
2019-07-25,70.64
2019-07-26,71.7
2019-07-29,70.92
2019-07-30,71.51
2019-07-31,71.56
2019-08-01,69.11
2019-08-02,68.61
2019-08-05,66.195
2019-08-06,66.57
2019-08-07,65.675
2019-08-08,66.45
2019-08-09,66.25
2019-08-12,64.03
2019-08-13,64.405
2019-08-14,61.095
2019-08-15,60.35
2019-08-16,61.81
2019-08-19,62.82
2019-08-20,62.44
2019-08-21,63.365
2019-08-22,63.945
2019-08-23,61.59
2019-08-26,61.83
2019-08-27,60.91
2019-08-28,61.4
2019-08-29,62.63
2019-08-30,62.755
2019-09-02,62.755
2019-09-03,60.59
2019-09-04,61.66
2019-09-05,62.83
2019-09-06,62.51
2019-09-09,64.07
2019-09-10,66.005
2019-09-11,66.29
2019-09-12,65.565
2019-09-13,66.77
2019-09-16,66.79
2019-09-17,65.87
2019-09-18,66.17
2019-09-19,65.89
2019-09-20,65.61
2019-09-23,64.965
2019-09-24,64.25
2019-09-25,65.605
2019-09-26,64.44
2019-09-27,64.555
2019-09-30,64.595
2019-10-01,62.77
2019-10-02,62
2019-10-03,61.865
2019-10-04,62.82
2019-10-07,62.7
2019-10-08,60.64
2019-10-09,61.23
2019-10-10,62.21
2019-10-11,63.395
2019-10-14,63.55
2019-10-15,64.98
2019-10-16,64.605
2019-10-17,63.325
2019-10-18,64.77
2019-10-21,64.935
2019-10-22,65.44
2019-10-23,65.48
2019-10-24,64.49
2019-10-25,65.84
2019-10-28,66.54
2019-10-29,66.265
2019-10-30,65.51
2019-10-31,63.73
2019-11-01,65.41
2019-11-04,67.11
2019-11-05,68.345
2019-11-06,67.56
2019-11-07,68.06
2019-11-08,67.33
2019-11-11,66.32
2019-11-12,66.975
2019-11-13,66.41
2019-11-14,66.39
2019-11-15,66.02
2019-11-18,66.03
2019-11-19,66.58
2019-11-20,65.99
2019-11-21,66.53
2019-11-22,66.945
2019-11-25,67.13
