date,close
2014-04-28,14.18
2014-04-29,14.21
2014-04-30,14.02
2014-05-01,14.2
2014-05-02,13.76
2014-05-05,14.34
2014-05-06,13.01
2014-05-07,12.54
2014-05-08,12.62
2014-05-09,12.53
2014-05-12,13.44
2014-05-13,13.33
2014-05-14,13.11
2014-05-15,12.92
2014-05-16,13.3
2014-05-19,13.02
2014-05-20,12.45
2014-05-21,12.46
2014-05-22,12.72
2014-05-23,13.48
2014-05-27,13.13
2014-05-28,13.94
2014-05-29,14.16
2014-05-30,14.03
2014-06-02,13.7
2014-06-03,14.05
2014-06-04,13.9
2014-06-05,14.27
2014-06-06,13.98
2014-06-09,14.97
2014-06-10,14.98
2014-06-11,16.16
2014-06-12,16.21
2014-06-13,16.18
2014-06-16,15.48
2014-06-17,15.16
2014-06-18,15.14
2014-06-19,15.4
2014-06-20,15.6
2014-06-23,15.87
2014-06-24,15.35
2014-06-25,15.49
2014-06-26,14.89
2014-06-27,14.14
2014-06-30,13.96
2014-07-01,14.01
2014-07-02,13.92
2014-07-03,13.79
2014-07-07,13.3
2014-07-08,12.67
2014-07-09,12.64
2014-07-10,12.25
2014-07-11,12.33
2014-07-14,12.67
2014-07-15,12.2
2014-07-16,11.75
2014-07-17,11.05
2014-07-18,11.54
2014-07-21,11.02
2014-07-22,11.17
2014-07-23,11.44
2014-07-24,11.52
2014-07-25,11.1
2014-07-28,11.04
2014-07-29,10.87
2014-07-30,11.22
2014-07-31,10.81
2014-08-01,10.34
2014-08-04,10.06
2014-08-05,9.41
2014-08-06,9.22
2014-08-07,9.33
2014-08-08,10.3
2014-08-11,10.14
2014-08-12,9.87
2014-08-13,10.25
2014-08-14,10.46
2014-08-15,10.45
2014-08-18,10.39
2014-08-19,9.29
2014-08-20,9.25
2014-08-21,9.17
2014-08-22,9.04
2014-08-25,8.77
2014-08-26,8.96
2014-08-27,8.91
2014-08-28,9.49
2014-08-29,9.51
2014-09-02,9.03
2014-09-03,9.07
2014-09-04,9
2014-09-05,8.77
2014-09-08,9.46
2014-09-09,10.82
2014-09-10,10.43
2014-09-11,9.63
2014-09-12,9.31
2014-09-15,9.04
2014-09-16,8.82
2014-09-17,8.86
2014-09-18,9.03
2014-09-19,8.85
2014-09-22,8.67
2014-09-23,8.19
2014-09-24,8.36
2014-09-25,8.04
2014-09-26,8
2014-09-29,8.04
2014-09-30,8.96
2014-10-01,8.23
2014-10-02,8.29
2014-10-03,8.3
2014-10-06,8.7
2014-10-07,8.24
2014-10-08,8.33
2014-10-09,8.1
2014-10-10,8.26
2014-10-13,9.26
2014-10-14,9.21
2014-10-15,9.43
2014-10-16,9.1
2014-10-17,8.88
2014-10-20,9.05
2014-10-21,9.14
2014-10-22,9.21
2014-10-23,9.36
2014-10-24,9.25
2014-10-27,9.36
2014-10-28,9.25
2014-10-29,9.54
2014-10-30,10.21
2014-10-31,10.62
2014-11-03,10.41
2014-11-04,9.8
2014-11-05,9.65
2014-11-06,9.74
2014-11-07,9.67
2014-11-10,9.88
2014-11-11,10.07
2014-11-12,10.06
2014-11-13,9.68
2014-11-14,9.32
2014-11-17,9.35
2014-11-18,9.44
2014-11-19,9.28
2014-11-20,9.27
2014-11-21,9.21
2014-11-24,9.35
2014-11-25,9.6
2014-11-26,9.76
2014-11-28,9.22
2014-12-01,9.5
2014-12-02,9.7
2014-12-03,9.67
2014-12-04,9.62
2014-12-05,10.03
2014-12-08,10.35
2014-12-09,12.15
2014-12-10,12.38
2014-12-11,12.22
2014-12-12,11.91
2014-12-15,11.92
2014-12-16,11.97
2014-12-17,12.22
2014-12-18,12.42
2014-12-19,13.53
2014-12-22,13.73
2014-12-23,12.99
2014-12-24,12.76
2014-12-26,12.93
2014-12-29,13.04
2014-12-30,13.06
2014-12-31,13.05
2015-01-02,13.96
2015-01-05,13.02
2015-01-06,12.72
2015-01-07,12.67
2015-01-08,12.95
2015-01-09,13.29
2015-01-12,12.86
2015-01-13,13.11
2015-01-14,12.66
2015-01-15,12.51
2015-01-16,12.35
2015-01-20,12.52
2015-01-21,11.97
2015-01-22,11.94
2015-01-23,11.73
2015-01-26,11.87
2015-01-27,11.77
2015-01-28,11.65
2015-01-29,12.05
2015-01-30,11.7
2015-02-02,11.68
2015-02-03,11.46
2015-02-04,11.29
2015-02-05,11.78
2015-02-06,11.58
2015-02-09,11.08
2015-02-10,11.47
2015-02-11,11.69
2015-02-12,11.38
2015-02-13,11.11
2015-02-17,10.98
2015-02-18,11.1
2015-02-19,11.43
2015-02-20,11.47
2015-02-23,11.18
2015-02-24,11.17
2015-02-25,11.2
2015-02-26,11.26
2015-02-27,11.17
2015-03-02,10.82
2015-03-03,10.75
2015-03-04,10.42
2015-03-05,10.43
2015-03-06,10.32
2015-03-09,10.3
2015-03-10,10.22
2015-03-11,10.44
2015-03-12,10.49
2015-03-13,10.27
2015-03-16,10.05
2015-03-17,10.23
2015-03-18,10.03
2015-03-19,10.11
2015-03-20,9.97
2015-03-23,9.79
2015-03-24,10.06
2015-03-25,9.21
2015-03-26,9.67
2015-03-27,9.7
2015-03-30,9.85
2015-03-31,9.76
2015-04-01,8
2015-04-02,7.86
2015-04-06,7.72
2015-04-07,7.91
2015-04-08,7.32
2015-04-09,7.31
2015-04-10,7.3
2015-04-13,7.24
2015-04-14,7.06
2015-04-15,6.91
2015-04-16,7.01
2015-04-17,7.06
2015-04-20,6.87
2015-04-21,6.71
2015-04-22,6.21
2015-04-23,6.4
2015-04-24,6.36
2015-04-27,6.24
2015-04-28,6.14
2015-04-29,5.78
2015-04-30,5.59
2015-05-01,5.61
2015-05-04,5.82
2015-05-05,5.93
2015-05-06,5.91
2015-05-07,5.68
2015-05-08,5.76
2015-05-11,5.91
2015-05-12,5.33
2015-05-13,5.51
2015-05-14,5.5
2015-05-15,5.49
2015-05-18,5.65
2015-05-19,5.56
2015-05-20,5.66
2015-05-21,5.92
2015-05-22,6.81
2015-05-26,6.56
2015-05-27,6.37
2015-05-28,6.11
2015-05-29,5.92
2015-06-01,5.63
2015-06-02,5.73
2015-06-03,5.92
2015-06-04,5.67
2015-06-05,5.76
2015-06-08,5.67
2015-06-09,5.53
2015-06-10,5.53
2015-06-11,5.65
2015-06-12,5.67
2015-06-15,5.93
2015-06-16,5.66
2015-06-17,5.6
2015-06-18,5.9
2015-06-19,5.78
2015-06-22,6.75
2015-06-23,6.57
2015-06-24,6.12
2015-06-25,5.91
2015-06-26,5.98
2015-06-29,5.69
2015-06-30,6.03
2015-07-01,6.05
2015-07-02,5.84
2015-07-06,5.83
2015-07-07,6.11
2015-07-08,6.13
2015-07-09,6.34
2015-07-10,6.27
2015-07-13,6.73
2015-07-14,7.33
2015-07-15,6.81
2015-07-16,7.1
2015-07-17,7.08
2015-07-20,7.04
2015-07-21,7.19
2015-07-22,7.04
2015-07-23,7.17
2015-07-24,7.17
2015-07-27,7.25
2015-07-28,7.25
2015-07-29,7.225
2015-07-30,7.18
2015-07-31,7.21
2015-08-03,7.2
2015-08-04,7.16
2015-08-05,7.21
2015-08-06,7.16
2015-08-07,6.93
2015-08-10,7.07
2015-08-11,6.93
2015-08-12,6.42
2015-08-13,7.08
2015-08-14,7.64
2015-08-17,7.23
2015-08-18,7.08
2015-08-19,7.02
2015-08-20,7.12
2015-08-21,6.89
2015-08-24,5.9
2015-08-25,6.27
2015-08-26,6.735
2015-08-27,6.65
2015-08-28,6.99
2015-08-31,6.9
2015-09-01,6.74
2015-09-02,7.02
2015-09-03,6.96
2015-09-04,7
2015-09-08,6.97
2015-09-09,6.66
2015-09-10,6.52
2015-09-11,6.8
2015-09-14,6.82
2015-09-15,6.95
2015-09-16,7
2015-09-17,7.22
2015-09-18,7.03
2015-09-21,7.03
2015-09-22,6.94
2015-09-23,6.99
2015-09-24,6.99
2015-09-25,6.53
2015-09-28,5.84
2015-09-29,5.49
2015-09-30,5.76
2015-10-01,5.86
2015-10-02,6.15
2015-10-05,5.93
2015-10-06,5.81
2015-10-07,6.19
2015-10-08,5.97
2015-10-09,6.06
2015-10-12,6.09
2015-10-13,5.55
2015-10-14,5.64
2015-10-15,5.84
2015-10-16,5.72
2015-10-19,5.64
2015-10-20,5.76
2015-10-21,5.54
2015-10-22,5.58
2015-10-23,5.66
2015-10-26,5.34
2015-10-27,5.44
2015-10-28,5.62
2015-10-29,5.58
2015-10-30,5.52
2015-11-02,5.6
2015-11-03,5.81
2015-11-04,5.73
2015-11-05,5.56
2015-11-06,5.72
2015-11-09,5.73
2015-11-10,5.79
2015-11-11,5.8
2015-11-12,5.7
2015-11-13,5.63
2015-11-16,5.6
2015-11-17,5.66
2015-11-18,5.72
2015-11-19,5.82
2015-11-20,5.9
2015-11-23,6
2015-11-24,5.78
2015-11-25,5.78
2015-11-27,5.64
2015-11-30,5.58
2015-12-01,5.58
2015-12-02,5.7
2015-12-03,5.65
2015-12-04,5.61
2015-12-07,5.51
2015-12-08,5.57
2015-12-09,5.605
2015-12-10,5.91
2015-12-11,5.76
2015-12-14,5.56
2015-12-15,5.52
2015-12-16,5.58
2015-12-17,5.8
2015-12-18,5.51
2015-12-21,5.86
2015-12-22,6.07
2015-12-23,6.11
2015-12-24,6.07
2015-12-28,5.94
2015-12-29,5.97
2015-12-30,5.88
2015-12-31,5.74
2016-01-04,5.81
2016-01-05,5.79
2016-01-06,5.73
2016-01-07,5.48
2016-01-08,5.39
2016-01-11,5.3
2016-01-12,4.87
2016-01-13,4.36
2016-01-14,4.4
2016-01-15,4.26
2016-01-19,4.45
2016-01-20,4.1
2016-01-21,4.34
2016-01-22,4.37
2016-01-25,4.35
2016-01-26,4.27
2016-01-27,4.145
2016-01-28,3.9
2016-01-29,3.62
2016-02-01,3.82
2016-02-02,3.89
2016-02-03,3.69
2016-02-04,3.83
2016-02-05,3.8
2016-02-08,3.445
2016-02-09,3.44
2016-02-10,3.55
2016-02-11,3.49
2016-02-12,3.49
2016-02-16,3.63
2016-02-17,3.99
2016-02-18,3.84
2016-02-19,3.62
2016-02-22,3.78
2016-02-23,3.72
2016-02-24,3.61
2016-02-25,3.73
2016-02-26,3.65
2016-02-29,3.5
2016-03-01,3.41
2016-03-02,3.54
2016-03-03,3.71
2016-03-04,3.77
2016-03-07,4.05
2016-03-08,3.69
2016-03-09,3.8
2016-03-10,3.71
2016-03-11,3.76
2016-03-14,3.68
2016-03-15,3.62
2016-03-16,3.28
2016-03-17,3.18
2016-03-18,3.24
2016-03-21,3.37
2016-03-22,3.18
2016-03-23,3.01
2016-03-24,2.97
2016-03-28,3.06
2016-03-29,3.06
2016-03-30,2.79
2016-03-31,2.76
2016-04-01,2.71
2016-04-04,2.74
2016-04-05,2.72
2016-04-06,2.84
2016-04-07,3.16
2016-04-08,3.18
2016-04-11,3.14
2016-04-12,3.185
2016-04-13,3.24
2016-04-14,3.51
2016-04-15,3.69
2016-04-18,3.75
2016-04-19,3.76
2016-04-20,3.68
2016-04-21,3.73
2016-04-22,3.88
2016-04-25,3.77
2016-04-26,3.52
2016-04-27,3.42
2016-04-28,3.41
2016-04-29,3.39
2016-05-02,3.27
2016-05-03,3.26
2016-05-04,3.06
2016-05-05,3.1
2016-05-06,3.06
2016-05-09,3.2
2016-05-10,3.13
2016-05-11,3
2016-05-12,2.86
2016-05-13,2.87
2016-05-16,2.92
2016-05-17,2.99
2016-05-18,2.92
2016-05-19,2.88
2016-05-20,2.84
2016-05-23,2.85
2016-05-24,2.78
2016-05-25,2.7
2016-05-26,2.82
2016-05-27,3.14
2016-05-31,3.28
2016-06-01,3.195
2016-06-02,3.61
2016-06-03,3.93
2016-06-06,3.96
2016-06-07,4.29
2016-06-08,4.25
2016-06-09,4.13
2016-06-10,3.86
2016-06-13,3.79
2016-06-14,4.11
2016-06-15,4.84
2016-06-16,4.75
2016-06-17,4.7
2016-06-20,4.44
2016-06-21,4.43
2016-06-22,4.2
2016-06-23,3.99
2016-06-24,3.87
2016-06-27,3.6
2016-06-28,3.74
2016-06-29,3.77
2016-06-30,3.79
2016-07-01,3.98
2016-07-05,4.09
2016-07-06,4.01
2016-07-07,3.89
2016-07-08,3.84
2016-07-11,3.87
2016-07-12,3.74
2016-07-13,3.69
2016-07-14,3.63
2016-07-15,3.57
2016-07-18,3.7
2016-07-19,3.53
2016-07-20,3.87
2016-07-21,3.82
2016-07-22,3.93
2016-07-25,3.75
2016-07-26,3.81
2016-07-27,3.99
2016-07-28,3.92
2016-07-29,3.93
2016-08-01,3.65
2016-08-02,3.63
2016-08-03,3.78
2016-08-04,3.9
2016-08-05,3.91
2016-08-08,3.98
2016-08-09,3.93
2016-08-10,3.78
2016-08-11,3.9
2016-08-12,3.7
2016-08-15,3.79
2016-08-16,3.86
2016-08-17,3.82
2016-08-18,3.83
2016-08-19,3.75
2016-08-22,3.81
2016-08-23,3.83
2016-08-24,3.75
2016-08-25,3.78
2016-08-26,3.72
2016-08-29,3.9
2016-08-30,3.84
2016-08-31,3.77
2016-09-01,3.99
2016-09-02,4.25
2016-09-06,4.41
2016-09-07,4.32
2016-09-08,4.5
2016-09-09,4.42
2016-09-12,4.49
2016-09-13,4.34
2016-09-14,4.41
2016-09-15,4.4
2016-09-16,4.22
2016-09-19,4.05
2016-09-20,4.21
2016-09-21,4.16
2016-09-22,4.34
2016-09-23,4.34
2016-09-26,4.3
2016-09-27,4.34
2016-09-28,4.41
2016-09-29,4.56
2016-09-30,4.79
2016-10-03,4.96
2016-10-04,4.95
2016-10-05,4.92
2016-10-06,4.92
2016-10-07,4.87
2016-10-10,5.2
2016-10-11,5.03
2016-10-12,4.92
2016-10-13,4.92
2016-10-14,4.93
2016-10-17,5.15
2016-10-18,5.13
2016-10-19,5.14
2016-10-20,5.21
2016-10-21,5.49
2016-10-24,5.31
2016-10-25,5.54
2016-10-26,5.73
2016-10-27,4.98
2016-10-28,4.5
2016-10-31,4.59
2016-11-01,4.49
2016-11-02,4.19
2016-11-03,3.77
2016-11-04,3.99
2016-11-07,4.24
2016-11-08,4.31
2016-11-09,4.4
2016-11-10,4.48
2016-11-11,4.89
2016-11-14,5.08
2016-11-15,5.34
2016-11-16,5.31
2016-11-17,4.95
2016-11-18,4.86
2016-11-21,4.87
2016-11-22,4.84
2016-11-23,4.93
2016-11-25,5.1
2016-11-28,5.08
2016-11-29,5.36
2016-11-30,5.71
2016-12-01,5.88
2016-12-02,5.62
2016-12-05,5.47
2016-12-06,5.11
2016-12-07,5.03
2016-12-08,5.03
2016-12-09,5.25
2016-12-12,13.03
2016-12-13,14.86
2016-12-14,14.28
2016-12-15,14
2016-12-16,13.17
2016-12-19,13.31
2016-12-20,13.21
2016-12-21,12.44
2016-12-22,13.15
2016-12-23,13.01
2016-12-27,14.03
2016-12-28,13.32
2016-12-29,13.3
2016-12-30,13.02
2017-01-03,13
2017-01-04,14.88
2017-01-05,14.7
2017-01-06,15.33
2017-01-09,14.99
2017-01-10,15.46
2017-01-11,16.19
2017-01-12,15.81
2017-01-13,17.96
2017-01-17,17.48
2017-01-18,17.78
2017-01-19,18.84
2017-01-20,17.55
2017-01-23,17.33
2017-01-24,17.18
2017-01-25,16.92
2017-01-26,16.86
2017-01-27,15.74
2017-01-30,15.46
2017-01-31,16.15
2017-02-01,16.83
2017-02-02,16.95
2017-02-03,17.33
2017-02-06,17.46
2017-02-07,18.85
2017-02-08,19.72
2017-02-09,20.38
2017-02-10,20.84
2017-02-13,21.51
2017-02-14,21.66
2017-02-15,21.72
2017-02-16,22
2017-02-17,22.68
2017-02-21,22.55
2017-02-22,23.62
2017-02-23,23.11
2017-02-24,23.65
2017-02-27,23.68
2017-02-28,23.45
2017-03-01,23.81
2017-03-02,25.28
2017-03-03,25.54
2017-03-06,25
2017-03-07,25.05
2017-03-08,25.94
2017-03-09,26.7
2017-03-10,27.01
2017-03-13,26.79
2017-03-14,25.25
2017-03-15,22.4
2017-03-16,23.07
2017-03-17,22.39
2017-03-20,22.64
2017-03-21,20.04
2017-03-22,20.29
2017-03-23,20.3
2017-03-24,20.88
2017-03-27,21.78
2017-03-28,23.9
2017-03-29,25.69
2017-03-30,25.11
2017-03-31,25.23
2017-04-03,24.9
2017-04-04,24.33
2017-04-05,23.81
2017-04-06,23.43
2017-04-07,22.48
2017-04-10,21.42
2017-04-11,21.82
2017-04-12,20.73
2017-04-13,20.94
2017-04-17,21.2
2017-04-18,21.21
2017-04-19,22.17
2017-04-20,22.29
2017-04-21,22.08
2017-04-24,22.1
2017-04-25,22.99
2017-04-26,24
2017-04-27,24.23
2017-04-28,24.08
2017-05-01,25.61
2017-05-02,23.31
2017-05-03,24.57
2017-05-04,24.99
2017-05-05,24.1
2017-05-08,23.49
2017-05-09,22.84
2017-05-10,22.55
2017-05-11,23.54
2017-05-12,24.02
2017-05-15,23.77
2017-05-16,25.33
2017-05-17,24.26
2017-05-18,25.48
2017-05-19,24.71
2017-05-22,25.18
2017-05-23,26.08
2017-05-24,23.65
2017-05-25,22.08
2017-05-26,21.64
2017-05-30,20.24
2017-05-31,20.18
2017-06-01,21.28
2017-06-02,21.94
2017-06-05,22.2
2017-06-06,22.55
2017-06-07,22.47
2017-06-08,22.78
2017-06-09,21.98
2017-06-12,21.06
2017-06-13,22.04
2017-06-14,22.11
2017-06-15,21.58
2017-06-16,21.57
2017-06-19,22.2
2017-06-20,22.41
2017-06-21,23.4
2017-06-22,22.49
2017-06-23,22.35
2017-06-26,22.55
2017-06-27,21.48
2017-06-28,22.53
2017-06-29,21.89
2017-06-30,21.73
2017-07-03,22.57
2017-07-05,23.16
2017-07-06,22.91
2017-07-07,23.8
2017-07-10,23.48
2017-07-11,22.93
2017-07-12,24.9
2017-07-13,24.83
2017-07-14,24.19
2017-07-17,24.04
2017-07-18,23.4
2017-07-19,22.78
2017-07-20,22.31
2017-07-21,21.9
2017-07-24,21.95
2017-07-25,19.9
2017-07-26,19.93
2017-07-27,19.22
2017-07-28,19.67
2017-07-31,19.01
2017-08-01,18.3
2017-08-02,18.18
2017-08-03,18.24
2017-08-04,17.71
2017-08-07,18.97
2017-08-08,18.73
2017-08-09,18.15
2017-08-10,16.69
2017-08-11,16.65
2017-08-14,16.32
2017-08-15,17.37
2017-08-16,18.16
2017-08-17,17.89
2017-08-18,18.22
2017-08-21,18.48
2017-08-22,18.87
2017-08-23,18.78
2017-08-24,19.49
2017-08-25,19.1
2017-08-28,19.74
2017-08-29,18.81
2017-08-30,18.02
2017-08-31,18.74
2017-09-01,18.6
2017-09-05,18.46
2017-09-06,18.38
2017-09-07,17.39
2017-09-08,17.5
2017-09-11,16.7
2017-09-12,15.91
2017-09-13,16.27
2017-09-14,16.36
2017-09-15,16.49
2017-09-18,16.5
2017-09-19,16.18
2017-09-20,16.18
2017-09-21,15.74
2017-09-22,15.84
2017-09-25,16.04
2017-09-26,16.04
2017-09-27,15.54
2017-09-28,16.27
2017-09-29,15.95
2017-10-02,15.5
2017-10-03,15.5
2017-10-04,15.43
2017-10-05,15.89
2017-10-06,15.26
2017-10-09,13.88
2017-10-10,14.05
2017-10-11,13.95
2017-10-12,13.39
2017-10-13,13.25
2017-10-16,13.52
2017-10-17,13.57
2017-10-18,13.48
2017-10-19,14.33
2017-10-20,13.88
2017-10-23,13.35
2017-10-24,13.55
2017-10-25,13.21
2017-10-26,12.46
2017-10-27,13.63
2017-10-30,12.49
2017-10-31,12.72
2017-11-01,12.71
2017-11-02,13
2017-11-03,14.04
2017-11-06,13.93
2017-11-07,13.61
2017-11-08,14.02
2017-11-09,14.65
2017-11-10,13.29
2017-11-13,13.01
2017-11-14,11.92
2017-11-15,11.69
2017-11-16,11.95
2017-11-17,11.83
2017-11-20,11.89
2017-11-21,12.4
2017-11-22,12.2
2017-11-24,12.2
2017-11-27,11.87
2017-11-28,11.83
2017-11-29,10.94
2017-11-30,11.96
2017-12-01,11.33
2017-12-04,10.99
2017-12-05,10.5
2017-12-06,10.47
2017-12-07,10.61
2017-12-08,11.1
2017-12-11,11.31
2017-12-12,10.64
2017-12-13,10.93
2017-12-14,11.12
2017-12-15,11.05
2017-12-18,11.13
2017-12-19,10.78
2017-12-20,10.98
2017-12-21,11.4
2017-12-22,10.96
2017-12-26,11.14
2017-12-27,11.22
2017-12-28,11.02
2017-12-29,10.74
2018-01-02,11.2
2018-01-03,10.6
2018-01-04,11.77
2018-01-05,11.19
2018-01-08,11.44
2018-01-09,11.15
2018-01-10,11.66
2018-01-11,12.42
2018-01-12,11.94
2018-01-16,11.58
2018-01-17,11.83
2018-01-18,11.59
2018-01-19,11.54
2018-01-22,11.54
2018-01-23,11.37
2018-01-24,11.31
2018-01-25,11.05
2018-01-26,10.81
2018-01-29,11.06
2018-01-30,12.17
2018-01-31,10.97
2018-02-01,11.145
2018-02-02,10.74
2018-02-05,10.23
2018-02-06,10.79
2018-02-07,11.11
2018-02-08,10.64
2018-02-09,10.54
2018-02-12,10.85
2018-02-13,10.98
2018-02-14,10.91
2018-02-15,10.85
2018-02-16,10.92
2018-02-20,10.75
2018-02-21,10.92
2018-02-22,10.82
2018-02-23,10.99
2018-02-26,11.06
2018-02-27,10.94
2018-02-28,10.43
2018-03-01,10.22
2018-03-02,10.48
2018-03-05,10.99
2018-03-06,11
2018-03-07,11.07
2018-03-08,11.3
2018-03-09,11.44
2018-03-12,11.74
2018-03-13,11.5
2018-03-14,11.57
2018-03-15,11.23
2018-03-16,11.5
2018-03-19,11.27
2018-03-20,11
2018-03-21,12.48
2018-03-22,13.16
2018-03-23,12.88
2018-03-26,13.27
2018-03-27,12.69
2018-03-28,12.57
2018-03-29,12.95
2018-04-02,12.58
2018-04-03,12.6
2018-04-04,12.41
2018-04-05,12.63
2018-04-06,12.15
2018-04-09,11.54
2018-04-10,11.9
2018-04-11,11.84
2018-04-12,11.72
2018-04-13,12.39
2018-04-16,12.21
2018-04-17,12.34
2018-04-18,12.68
2018-04-19,13.01
2018-04-20,13.385
2018-04-23,13.07
2018-04-24,13.12
2018-04-25,13.08
2018-04-26,12.92
2018-04-27,13.09
2018-04-30,14.31
2018-05-01,14.7
2018-05-02,14.7
2018-05-03,11.06
2018-05-04,11.71
2018-05-07,12.41
2018-05-08,13.08
2018-05-09,13.09
2018-05-10,12.46
2018-05-11,12.58
2018-05-14,12.92
2018-05-15,12.87
2018-05-16,12.89
2018-05-17,12.49
2018-05-18,12.45
2018-05-21,11.81
2018-05-22,11.83
2018-05-23,11.81
2018-05-24,11.73
2018-05-25,12.17
2018-05-29,11.82
2018-05-30,12.27
2018-05-31,12.4
2018-06-01,12.12
2018-06-04,11.89
2018-06-05,12.07
2018-06-06,12.06
2018-06-07,12.1
2018-06-08,11.95
2018-06-11,12.05
2018-06-12,11.96
2018-06-13,11.95
2018-06-14,12.12
2018-06-15,11.8
2018-06-18,11.71
2018-06-19,12.21
2018-06-20,13.02
2018-06-21,12.45
2018-06-22,12.42
2018-06-25,12.02
2018-06-26,9.59
2018-06-27,8.92
2018-06-28,8.91
2018-06-29,8.66
2018-07-02,8.93
2018-07-03,8.99
2018-07-05,8.58
2018-07-06,8.51
2018-07-09,7.78
2018-07-10,7.85
2018-07-11,8.29
2018-07-12,8.34
2018-07-13,7.82
2018-07-16,7.06
2018-07-17,7.2
2018-07-18,7.22
2018-07-19,7.41
2018-07-20,7.14
2018-07-23,7.27
2018-07-24,7.21
2018-07-25,7.19
2018-07-26,7.09
2018-07-27,6.82
2018-07-30,6.33
2018-07-31,7.12
2018-08-01,6.91
2018-08-02,6.95
2018-08-03,6.86
2018-08-06,7.05
2018-08-07,6.89
2018-08-08,6.5
2018-08-09,6.34
2018-08-10,6.21
2018-08-13,5.82
2018-08-14,5.65
2018-08-15,5.58
2018-08-16,5.68
2018-08-17,5.92
2018-08-20,5.42
2018-08-21,5.39
2018-08-22,5.33
2018-08-23,5.1
2018-08-24,5.26
2018-08-27,5.09
2018-08-28,5.37
2018-08-29,5.2
2018-08-30,5.12
2018-08-31,5.29
2018-09-04,5.25
2018-09-05,5.03
2018-09-06,4.99
2018-09-07,5.04
2018-09-10,4.82
2018-09-11,4.79
2018-09-12,4.65
2018-09-13,4.58
2018-09-14,4.47
2018-09-17,4.11
2018-09-18,4.28
2018-09-19,4.56
2018-09-20,4.31
2018-09-21,4.2
2018-09-24,4.4
2018-09-25,4.15
2018-09-26,4.08
2018-09-27,4
2018-09-28,3.99
2018-10-01,4.03
2018-10-02,4.2
2018-10-03,4.67
2018-10-04,4.25
2018-10-05,4.08
2018-10-08,3.96
2018-10-09,4.13
2018-10-10,3.95
2018-10-11,3.84
2018-10-12,3.72
2018-10-15,3.75
2018-10-16,4.11
2018-10-17,4.12
2018-10-18,3.93
2018-10-19,4
2018-10-22,3.98
2018-10-23,4.22
2018-10-24,4.04
2018-10-25,4.2
2018-10-26,4.09
2018-10-29,4.03
2018-10-30,3.94
2018-10-31,3.85
2018-11-01,3.93
2018-11-02,3.74
2018-11-05,3.27
2018-11-06,3.25
2018-11-07,3.08
2018-11-08,2.65
2018-11-09,2.25
2018-11-12,2
2018-11-13,1.93
2018-11-14,1.8
2018-11-15,1.775
2018-11-16,1.64
2018-11-19,1.8
2018-11-20,1.95
2018-11-21,1.79
2018-11-23,1.88
2018-11-26,1.71
2018-11-27,1.68
2018-11-28,1.81
2018-11-29,1.7
2018-11-30,1.61
2018-12-03,1.66
2018-12-04,1.51
2018-12-06,1.48
2018-12-07,1.39
2018-12-10,1.68
2018-12-11,1.73
2018-12-12,1.8
2018-12-13,1.71
2018-12-14,1.62
2018-12-17,1.54
2018-12-18,1.38
2018-12-19,1.27
2018-12-20,1.35
2018-12-21,1.3
2018-12-24,1.22
2018-12-26,1.31
2018-12-27,1.37
2018-12-28,1.31
2018-12-31,1.23
2019-01-02,1.26
2019-01-03,1.18
2019-01-04,1.69
2019-01-07,1.69
2019-01-08,1.48
2019-01-09,1.365
2019-01-10,1.43
2019-01-11,1.39
2019-01-14,1.4
2019-01-15,1.39
2019-01-16,1.33
2019-01-17,1.29
2019-01-18,1.31
2019-01-22,1.29
2019-01-23,1.23
2019-01-24,1.23
2019-01-25,1.38
2019-01-28,1.62
2019-01-29,1.76
2019-01-30,1.71
2019-01-31,1.51
2019-02-01,1.43
2019-02-04,1.37
2019-02-05,1.35
2019-02-06,1.48
2019-02-07,1.45
2019-02-08,1.42
2019-02-11,1.39
2019-02-12,1.42
2019-02-13,1.59
2019-02-14,1.42
2019-02-15,0.9178
2019-02-19,0.89
2019-02-20,0.8589
2019-02-21,0.866
2019-02-22,0.7799
2019-02-25,0.8081
2019-02-26,0.79
2019-02-27,0.775
2019-02-28,0.7251
2019-03-01,0.7735
2019-03-04,0.7644
2019-03-05,0.7648
2019-03-06,0.7345
2019-03-07,0.6985
2019-03-08,0.6465
2019-03-11,0.6279
2019-03-12,0.608
2019-03-13,0.5787
2019-03-14,0.5103
2019-03-15,0.5633
2019-03-18,0.55
2019-03-19,0.5204
2019-03-20,0.5449
2019-03-21,0.5555
2019-03-22,0.52
2019-03-25,0.515
2019-03-26,0.5
2019-03-27,0.4713
2019-03-28,0.46
2019-03-29,0.4563
2019-04-01,0.4369
2019-04-02,0.4338
2019-04-03,0.4796
2019-04-04,0.52
2019-04-05,0.5381
2019-04-08,0.52
2019-04-09,0.516
2019-04-10,0.5072
2019-04-11,0.486
2019-04-12,0.495
2019-04-15,0.1557
2019-04-16,0.1627
2019-04-17,0.184
2019-04-18,0.1748
2019-04-22,0.1521
2019-04-23,0.1372
2019-04-24,0.1076
2019-04-25,0.11
