date,close
2017-04-13,13.41
2017-04-17,13.55
2017-04-18,14.01
2017-04-19,14.04
2017-04-20,13.81
2017-04-21,13.44
2017-04-24,13.74
2017-04-25,13.72
2017-04-26,13.81
2017-04-27,14.63
2017-04-28,14.84
2017-05-01,14.63
2017-05-02,14.23
2017-05-03,13.92
2017-05-04,13.83
2017-05-05,13.91
2017-05-08,13.9
2017-05-09,13.9
2017-05-10,14.03
2017-05-11,13.92
2017-05-12,13.73
2017-05-15,13.63
2017-05-16,13.18
2017-05-17,13.27
2017-05-18,13.22
2017-05-19,13.27
2017-05-22,13.29
2017-05-23,13.3
2017-05-24,13.21
2017-05-25,13.15
2017-05-26,13.75
2017-05-30,14.07
2017-05-31,14.74
2017-06-01,14.79
2017-06-02,13.03
2017-06-05,12.6
2017-06-06,12.92
2017-06-07,12.64
2017-06-08,12.58
2017-06-09,12.21
2017-06-12,12.31
2017-06-13,12.57
2017-06-14,12.97
2017-06-15,13.01
2017-06-16,13.37
2017-06-19,13.51
2017-06-20,13.12
2017-06-21,13.08
2017-06-22,13.24
2017-06-23,13.23
2017-06-26,13.2
2017-06-27,13.01
2017-06-28,13.24
2017-06-29,13.09
2017-06-30,13.33
2017-07-03,13.02
2017-07-05,13.2
2017-07-06,13
2017-07-07,13.18
2017-07-10,12.99
2017-07-11,13.05
2017-07-12,13.32
2017-07-13,13.53
2017-07-14,13.78
2017-07-17,13.85
2017-07-18,14.12
2017-07-19,14.46
2017-07-20,13.88
2017-07-21,13.71
2017-07-24,13.8
2017-07-25,13.63
2017-07-26,13.61
2017-07-27,13.11
2017-07-28,13.12
2017-07-31,13
2017-08-01,12.82
2017-08-02,12.79
2017-08-03,12.78
2017-08-04,12.79
2017-08-07,13.86
2017-08-08,13.67
2017-08-09,13.59
2017-08-10,13.33
2017-08-11,13.51
2017-08-14,13.99
2017-08-15,13.1
2017-08-16,13.31
2017-08-17,13.05
2017-08-18,13.08
2017-08-21,12.73
2017-08-22,12.81
2017-08-23,12.79
2017-08-24,12.85
2017-08-25,12.76
2017-08-28,12.83
2017-08-29,13.21
2017-08-30,13.21
2017-08-31,13.01
2017-09-01,13.25
2017-09-05,13.38
2017-09-06,13.98
2017-09-07,12.89
2017-09-08,12.29
2017-09-11,12.84
2017-09-12,13.35
2017-09-13,14.47
2017-09-14,13.8
2017-09-15,13.4
2017-09-18,13.26
2017-09-19,12.99
2017-09-20,12.82
2017-09-21,12.96
2017-09-22,12.9
2017-09-25,13.03
2017-09-26,12.95
2017-09-27,13.26
2017-09-28,13.2
2017-09-29,13.28
2017-10-02,13.45
2017-10-03,13.68
2017-10-04,13.84
2017-10-05,13.55
2017-10-06,13.15
2017-10-09,12.4
2017-10-10,12.07
2017-10-11,12.13
2017-10-12,12.25
2017-10-13,12.45
2017-10-16,12.43
2017-10-17,12.13
2017-10-18,12.08
2017-10-19,12.06
2017-10-20,11.89
2017-10-23,11.73
2017-10-24,11.96
2017-10-25,11.72
2017-10-26,11.65
2017-10-27,11.78
2017-10-30,11.4
2017-10-31,11.48
2017-11-01,11.65
2017-11-02,11.85
2017-11-03,12.01
2017-11-06,12
2017-11-07,12.01
2017-11-08,12.36
2017-11-09,12.31
2017-11-10,12.44
2017-11-13,12.53
2017-11-14,12.74
2017-11-15,12.71
2017-11-16,12.95
2017-11-17,12.92
2017-11-20,12.98
2017-11-21,12.95
2017-11-22,13.05
2017-11-24,13.75
2017-11-27,13.92
2017-11-28,14.62
2017-11-29,14.04
2017-11-30,14.31
2017-12-01,13.49
2017-12-04,12.8
2017-12-05,12.71
2017-12-06,12.67
2017-12-07,12.73
2017-12-08,12.69
2017-12-11,12.11
2017-12-12,12.17
2017-12-13,12.15
2017-12-14,12.12
2017-12-15,12.3
2017-12-18,12.53
2017-12-19,12.44
2017-12-20,12.37
2017-12-21,12.47
2017-12-22,12.37
2017-12-26,11.99
2017-12-27,12
2017-12-28,12.03
2017-12-29,12.03
2018-01-02,11.85
2018-01-03,11.75
2018-01-04,11.7
2018-01-05,11.59
2018-01-08,11.45
2018-01-09,11.41
2018-01-10,12.11
2018-01-11,12.06
2018-01-12,12.06
2018-01-16,12.57
2018-01-17,12.8
2018-01-18,12.87
2018-01-19,12.79
2018-01-22,12.68
2018-01-23,12.52
2018-01-24,12.24
2018-01-25,12.15
2018-01-26,12.15
2018-01-29,12
2018-01-30,11.73
2018-01-31,12.05
2018-02-01,11.95
2018-02-02,11.64
2018-02-05,11.1
2018-02-06,11.26
2018-02-07,11.25
2018-02-08,10.84
2018-02-09,10.87
2018-02-12,10.87
2018-02-13,10.94
2018-02-14,11.56
2018-02-15,11.63
2018-02-16,12.12
2018-02-20,12.15
2018-02-21,12.14
2018-02-22,12.15
2018-02-23,12.34
2018-02-26,12.73
2018-02-27,12.77
2018-02-28,12.7
2018-03-01,12.5
2018-03-02,12.75
2018-03-05,13
2018-03-06,12.94
2018-03-07,13
2018-03-08,13.53
2018-03-09,12.5
2018-03-12,12.46
2018-03-13,12.2
2018-03-14,12.37
2018-03-15,12.34
2018-03-16,12.25
2018-03-19,12
2018-03-20,11.93
2018-03-21,12.09
2018-03-22,12.58
2018-03-23,12.64
2018-03-26,12.94
2018-03-27,12.82
2018-03-28,12.6
2018-03-29,12.65
2018-04-02,12.4
2018-04-03,12.5
2018-04-04,12.38
2018-04-05,12.45
2018-04-06,12.39
2018-04-09,12.45
2018-04-10,12.5
2018-04-11,12.39
2018-04-12,12.39
2018-04-13,12.56
2018-04-16,12.92
2018-04-17,13.48
2018-04-18,13.68
2018-04-19,13.59
2018-04-20,13.6
2018-04-23,13.51
2018-04-24,13.1
2018-04-25,13.13
2018-04-26,13.29
2018-04-27,13.24
2018-04-30,13.34
2018-05-01,13.09
2018-05-02,13.11
2018-05-03,13.31
2018-05-04,13.67
2018-05-07,13.72
2018-05-08,14.18
2018-05-09,14.29
2018-05-10,14.58
2018-05-11,14.73
2018-05-14,14.78
2018-05-15,15.1
2018-05-16,15.25
2018-05-17,15.16
2018-05-18,15.35
2018-05-21,15
2018-05-22,14.76
2018-05-23,14.7
2018-05-24,14.65
2018-05-25,14.84
2018-05-29,14.7
2018-05-30,15.14
2018-05-31,15.39
2018-06-01,16.98
2018-06-04,17.53
2018-06-05,17.26
2018-06-06,17.88
2018-06-07,17.03
2018-06-08,17.72
2018-06-11,18.44
2018-06-12,18.62
2018-06-13,18.68
2018-06-14,19.61
2018-06-15,19.76
2018-06-18,19.63
2018-06-19,19.36
2018-06-20,19.66
2018-06-21,19.26
2018-06-22,19.03
2018-06-25,18.76
2018-06-26,19.18
2018-06-27,18.63
2018-06-28,19.03
2018-06-29,19.34
2018-07-02,19.55
2018-07-03,19.38
2018-07-05,19.06
2018-07-06,19.49
2018-07-09,19.45
2018-07-10,19.34
2018-07-11,18.37
2018-07-12,18.16
2018-07-13,18.46
2018-07-16,18.73
2018-07-17,18.55
2018-07-18,18.65
2018-07-19,19.04
2018-07-20,18.87
2018-07-23,19.16
2018-07-24,18.94
2018-07-25,22.66
2018-07-26,23.36
2018-07-27,22.04
2018-07-30,21.87
2018-07-31,21.14
2018-08-01,21.8
2018-08-02,22.68
2018-08-03,21.49
2018-08-06,21.75
2018-08-07,21.45
2018-08-08,21.33
2018-08-09,22.29
2018-08-10,22.75
2018-08-13,22.57
2018-08-14,23.93
2018-08-15,23.53
2018-08-16,23.7
2018-08-17,23.78
2018-08-20,24.17
2018-08-21,24.5
2018-08-22,25.06
2018-08-23,24.61
2018-08-24,25.33
2018-08-27,26.12
2018-08-28,26.49
2018-08-29,26.75
2018-08-30,25.3
2018-08-31,24.86
2018-09-04,25.21
2018-09-05,25.09
2018-09-06,25.22
2018-09-07,26.85
2018-09-10,26.04
2018-09-11,25.97
2018-09-12,25.89
2018-09-13,25.88
2018-09-14,25.78
2018-09-17,24.95
2018-09-18,25.49
2018-09-19,25.26
2018-09-20,25.44
2018-09-21,24.77
2018-09-24,24.72
2018-09-25,25.07
2018-09-26,24.46
2018-09-27,24.06
2018-09-28,23.7
2018-10-01,22.95
2018-10-02,22.72
2018-10-03,22.42
2018-10-04,21.31
2018-10-05,21
2018-10-08,20.3
2018-10-09,20.05
2018-10-10,19.05
2018-10-11,18.4
2018-10-12,18.97
2018-10-15,19.02
2018-10-16,19.93
2018-10-17,19.9
2018-10-18,19.14
2018-10-19,18.6
2018-10-22,18.37
2018-10-23,18.83
2018-10-24,19.47
2018-10-25,19.73
2018-10-26,18.18
2018-10-29,18.35
2018-10-30,18.46
2018-10-31,19.22
2018-11-01,19.17
2018-11-02,19.43
2018-11-05,18.93
2018-11-06,18.67
2018-11-07,20
2018-11-08,19.42
2018-11-09,18.87
2018-11-12,17.89
2018-11-13,17.87
2018-11-14,17.08
2018-11-15,17.48
2018-11-16,17.72
2018-11-19,16.09
2018-11-20,16.6
2018-11-21,16.75
2018-11-23,16.92
2018-11-26,17.83
2018-11-27,17.07
2018-11-28,17.83
2018-11-29,18.21
2018-11-30,14.52
2018-12-03,15.14
2018-12-04,15.08
2018-12-06,15.52
2018-12-07,15.55
2018-12-10,15.92
2018-12-11,15.45
2018-12-12,15.71
2018-12-13,15.64
2018-12-14,15.27
2018-12-17,14.52
2018-12-18,14.69
2018-12-19,14.49
2018-12-20,14.35
2018-12-21,13.32
2018-12-24,13.44
2018-12-26,14.11
2018-12-27,14.88
2018-12-28,14.61
2018-12-31,14.85
2019-01-02,15
2019-01-03,14.34
2019-01-04,14.8
2019-01-07,15.46
2019-01-08,15.43
2019-01-09,15.41
2019-01-10,16.06
2019-01-11,15.82
2019-01-14,15.29
2019-01-15,14.92
2019-01-16,14.52
2019-01-17,14.5
2019-01-18,14.74
2019-01-22,14.28
2019-01-23,14.03
2019-01-24,14.05
2019-01-25,14.84
2019-01-28,14.96
2019-01-29,14.34
2019-01-30,15.26
2019-01-31,15.59
2019-02-01,15.84
2019-02-04,16.73
2019-02-05,17.31
2019-02-06,17.2
2019-02-07,17.41
2019-02-08,17.66
2019-02-11,18.09
2019-02-12,18.25
2019-02-13,18.21
2019-02-14,18.1
2019-02-15,18
2019-02-19,18.25
2019-02-20,19.13
2019-02-21,18.14
2019-02-22,18.51
2019-02-25,18.18
2019-02-26,17.87
2019-02-27,18.5
2019-02-28,18.58
2019-03-01,19.27
2019-03-04,18.82
2019-03-05,19.68
2019-03-06,20.37
2019-03-07,22.43
2019-03-08,22.48
2019-03-11,23.06
2019-03-12,22.12
2019-03-13,22.46
2019-03-14,22.79
2019-03-15,22.66
2019-03-18,23
2019-03-19,22.04
2019-03-20,22.13
2019-03-21,22.12
2019-03-22,20.88
2019-03-25,21.14
2019-03-26,21.17
2019-03-27,21.17
2019-03-28,21.44
2019-03-29,21.86
2019-04-01,21.59
2019-04-02,22.01
2019-04-03,21.98
2019-04-04,21.84
2019-04-05,21.72
2019-04-08,21.57
2019-04-09,21.5
2019-04-10,21.84
2019-04-11,21.64
2019-04-12,21.58
2019-04-15,21.35
2019-04-16,21.5
2019-04-17,21.1
2019-04-18,20.29
2019-04-22,20.12
2019-04-23,20.54
2019-04-24,20.4
2019-04-25,20.62
2019-04-26,20.72
2019-04-29,21.45
2019-04-30,21.91
2019-05-01,21.75
2019-05-02,21.63
2019-05-03,22.08
2019-05-06,22.37
2019-05-07,21.35
2019-05-08,20.96
2019-05-09,20.73
2019-05-10,21.03
2019-05-13,20.66
2019-05-14,20.8
2019-05-15,21.16
2019-05-16,21.45
2019-05-17,21.29
2019-05-20,21.2
2019-05-21,21.29
2019-05-22,21.19
2019-05-23,20.06
2019-05-24,20.32
2019-05-28,20.51
2019-05-29,19.52
2019-05-30,19.12
2019-05-31,18.36
2019-06-03,17.82
2019-06-04,18.47
2019-06-05,18.3
2019-06-06,18.27
2019-06-07,18.44
2019-06-10,19.07
2019-06-11,19.8
2019-06-12,20.13
2019-06-13,20.47
2019-06-14,20.485
2019-06-17,20.66
2019-06-18,20.385
2019-06-19,20.565
2019-06-20,20.335
2019-06-21,20.235
2019-06-24,19.73
2019-06-25,19.405
2019-06-26,19.01
2019-06-27,19.58
2019-06-28,20.01
2019-07-01,20.505
2019-07-02,20.4
2019-07-03,20.45
2019-07-04,20.45
2019-07-05,20.125
2019-07-08,20.27
2019-07-09,20.965
2019-07-10,20.67
2019-07-11,20.645
2019-07-12,20.73
2019-07-15,21.115
2019-07-16,20.595
2019-07-17,21.065
2019-07-18,20.965
2019-07-19,20.615
2019-07-22,20.58
2019-07-23,20.51
2019-07-24,20.99
2019-07-25,21.315
2019-07-26,22.335
2019-07-29,21.05
2019-07-30,21.29
2019-07-31,20.83
2019-08-01,20.375
2019-08-02,20.55
2019-08-05,19.74
2019-08-06,19.54
2019-08-07,19.77
2019-08-08,20.52
2019-08-09,20.92
2019-08-12,20.13
2019-08-13,20.4
2019-08-14,19.235
2019-08-15,19.185
2019-08-16,19.37
2019-08-19,19.025
2019-08-20,18.5
2019-08-21,18.58
2019-08-22,19.045
2019-08-23,18.52
2019-08-26,18.145
2019-08-27,18.19
2019-08-28,17.665
2019-08-29,18.3
2019-08-30,15.755
2019-09-02,15.765
2019-09-03,16.38
2019-09-04,16.39
2019-09-05,16.97
2019-09-06,16.96
2019-09-09,16.165
2019-09-10,16.57
2019-09-11,17.335
2019-09-12,17.745
2019-09-13,17.505
2019-09-16,17.7
2019-09-17,17.92
2019-09-18,17.545
2019-09-19,17.665
2019-09-20,17.84
2019-09-23,16.94
2019-09-24,16.62
2019-09-25,16.625
2019-09-26,16.295
2019-09-27,15.805
2019-09-30,15.9
2019-10-01,15.505
2019-10-02,15.295
2019-10-03,15.68
2019-10-04,15.845
2019-10-07,16.03
2019-10-08,15.29
2019-10-09,15.475
2019-10-10,14.93
2019-10-11,15.31
2019-10-14,15.465
2019-10-15,15.59
2019-10-16,15.365
2019-10-17,15.375
2019-10-18,14.45
2019-10-21,14.425
2019-10-22,14.53
2019-10-23,14.565
2019-10-24,15.335
2019-10-25,15.905
2019-10-28,16.075
2019-10-29,16.01
2019-10-30,16.295
2019-10-31,16.47
2019-11-01,16.37
2019-11-04,16.3
2019-11-05,16.29
2019-11-06,15.795
2019-11-07,15.875
2019-11-08,16.085
2019-11-11,16.17
2019-11-12,16.47
2019-11-13,16.485
2019-11-14,16.195
2019-11-15,16.675
2019-11-18,16.615
2019-11-19,16.335
2019-11-20,16.265
2019-11-21,16.33
2019-11-22,16.595
2019-11-25,17.165
