date,close
2014-06-13,10.7
2014-06-16,10.48
2014-06-17,10.69
2014-06-18,10.92
2014-06-19,11.03
2014-06-20,11.02
2014-06-23,10.91
2014-06-24,10.5
2014-06-25,10.39
2014-06-26,10.55
2014-06-27,10.7
2014-06-30,10.72
2014-07-01,11.1
2014-07-02,11
2014-07-03,11.13
2014-07-07,11.01
2014-07-08,11
2014-07-09,10.8
2014-07-10,10.64
2014-07-11,10.65
2014-07-14,10.94
2014-07-15,10.9
2014-07-16,11.01
2014-07-17,11.1
2014-07-18,11.1
2014-07-21,11
2014-07-22,10.96
2014-07-23,11.06
2014-07-24,11.1
2014-07-25,11.05
2014-07-28,11.02
2014-07-29,11.03
2014-07-30,11.04
2014-07-31,10.97
2014-08-01,10.86
2014-08-04,11.08
2014-08-05,11.11
2014-08-06,11.53
2014-08-07,11.43
2014-08-08,11.7
2014-08-11,11
2014-08-12,11.09
2014-08-13,11.03
2014-08-14,11.31
2014-08-15,11.36
2014-08-18,11.69
2014-08-19,11.94
2014-08-20,11.74
2014-08-21,11.63
2014-08-22,11.51
2014-08-25,11.73
2014-08-26,11.84
2014-08-27,12.27
2014-08-28,12.35
2014-08-29,12.46
2014-09-02,12.47
2014-09-03,12.55
2014-09-04,12.58
2014-09-05,12.66
2014-09-08,12.76
2014-09-09,12.76
2014-09-10,12.65
2014-09-11,12.74
2014-09-12,12.54
2014-09-15,12.9
2014-09-16,12.83
2014-09-17,12.88
2014-09-18,12.95
2014-09-19,12.53
2014-09-22,12.45
2014-09-23,12.3
2014-09-24,12.04
2014-09-25,11.91
2014-09-26,12.22
2014-09-29,11.65
2014-09-30,11.27
2014-10-01,10.96
2014-10-02,11.37
2014-10-03,11.35
2014-10-06,11.46
2014-10-07,11.28
2014-10-08,11.24
2014-10-09,10.91
2014-10-10,10.89
2014-10-13,10.93
2014-10-14,10.85
2014-10-15,11.14
2014-10-16,11.42
2014-10-17,11.35
2014-10-20,11.6
2014-10-21,11.78
2014-10-22,11.26
2014-10-23,11.51
2014-10-24,11.53
2014-10-27,11.71
2014-10-28,12.65
2014-10-29,12.89
2014-10-30,13.12
2014-10-31,12.99
2014-11-03,13
2014-11-04,12.81
2014-11-05,12.96
2014-11-06,12.15
2014-11-07,11.75
2014-11-10,12
2014-11-11,11.83
2014-11-12,11.85
2014-11-13,11.57
2014-11-14,11.72
2014-11-17,11.5
2014-11-18,11.68
2014-11-19,11
2014-11-20,11.1
2014-11-21,11
2014-11-24,11.37
2014-11-25,11.19
2014-11-26,11.1
2014-11-28,10.86
2014-12-01,10.87
2014-12-02,11.08
2014-12-03,11.41
2014-12-04,11.65
2014-12-05,11.77
2014-12-08,11.45
2014-12-09,11.86
2014-12-10,11.26
2014-12-11,11.4
2014-12-12,11.15
2014-12-15,11.1
2014-12-16,11.33
2014-12-17,11.63
2014-12-18,12.07
2014-12-19,12.09
2014-12-22,12.22
2014-12-23,12.46
2014-12-24,12.42
2014-12-26,12.63
2014-12-29,12.75
2014-12-30,12.61
2014-12-31,12.86
2015-01-02,12.96
2015-01-05,12.92
2015-01-06,12.68
2015-01-07,12.43
2015-01-08,12.65
2015-01-09,12.19
2015-01-12,12.05
2015-01-13,12.05
2015-01-14,12.29
2015-01-15,12.26
2015-01-16,12.6
2015-01-20,12.44
2015-01-21,12.27
2015-01-22,12.22
2015-01-23,12.82
2015-01-26,13.08
2015-01-27,13.17
2015-01-28,12.9
2015-01-29,13.2
2015-01-30,12.62
2015-02-02,12.56
2015-02-03,12.9
2015-02-04,12.76
2015-02-05,12.87
2015-02-06,12.83
2015-02-09,12.71
2015-02-10,12.78
2015-02-11,12.04
2015-02-12,12.25
2015-02-13,12.13
2015-02-17,12.13
2015-02-18,12.1
2015-02-19,12.1
2015-02-20,11.84
2015-02-23,11.57
2015-02-24,11.28
2015-02-25,11.36
2015-02-26,11.33
2015-02-27,11.55
2015-03-02,11.61
2015-03-03,11.36
2015-03-04,11.34
2015-03-05,11.44
2015-03-06,11.03
2015-03-09,11.12
2015-03-10,10.95
2015-03-11,10.86
2015-03-12,11.19
2015-03-13,11.32
2015-03-16,11.35
2015-03-17,11.39
2015-03-18,11.37
2015-03-19,11.49
2015-03-20,11.74
2015-03-23,11.91
2015-03-24,11.94
2015-03-25,11.4
2015-03-26,11.04
2015-03-27,11.27
2015-03-30,11.44
2015-03-31,11.29
2015-04-01,11.79
2015-04-02,11.84
2015-04-06,11.81
2015-04-07,11.31
2015-04-08,11.73
2015-04-09,11.87
2015-04-10,11.74
2015-04-13,11.63
2015-04-14,11.68
2015-04-15,11.87
2015-04-16,11.92
2015-04-17,11.35
2015-04-20,11.81
2015-04-21,11.71
2015-04-22,11.79
2015-04-23,11.9
2015-04-24,11.88
2015-04-27,11.84
2015-04-28,12.46
2015-04-29,12.15
2015-04-30,12.04
2015-05-01,12.15
2015-05-04,12.19
2015-05-05,11.95
2015-05-06,11.78
2015-05-07,11.61
2015-05-08,11.68
2015-05-11,11.66
2015-05-12,11.55
2015-05-13,11.53
2015-05-14,11.8
2015-05-15,12.18
2015-05-18,12.6
2015-05-19,12.52
2015-05-20,12.55
2015-05-21,12.25
2015-05-22,12.02
2015-05-26,11.62
2015-05-27,11.62
2015-05-28,12
2015-05-29,11.93
2015-06-01,12.03
2015-06-02,12.29
2015-06-03,12.71
2015-06-04,12.4
2015-06-05,12.52
2015-06-08,12.43
2015-06-09,12.32
2015-06-10,12.88
2015-06-11,13.04
2015-06-12,13.16
2015-06-15,12.91
2015-06-16,12.4
2015-06-17,12.29
2015-06-18,12.43
2015-06-19,12.46
2015-06-22,12.4
2015-06-23,12.4
2015-06-24,12.32
2015-06-25,12.23
2015-06-26,12.25
2015-06-29,11.76
2015-06-30,11.71
2015-07-01,11.9
2015-07-02,12.03
2015-07-06,11.63
2015-07-07,11.64
2015-07-08,11.49
2015-07-09,11.6
2015-07-10,11.88
2015-07-13,11.89
2015-07-14,11.69
2015-07-15,11.43
2015-07-16,11.54
2015-07-17,11.54
2015-07-20,11.27
2015-07-21,11.3
2015-07-22,11.23
2015-07-23,11.11
2015-07-24,10.8
2015-07-27,10.62
2015-07-28,10.43
2015-07-29,10.38
2015-07-30,10.9
2015-07-31,12.17
2015-08-03,12.37
2015-08-04,12.32
2015-08-05,12.43
2015-08-06,12.32
2015-08-07,12.13
2015-08-10,12.03
2015-08-11,11.74
2015-08-12,11.84
2015-08-13,12.07
2015-08-14,12.23
2015-08-17,12.48
2015-08-18,12.44
2015-08-19,12.35
2015-08-20,12.52
2015-08-21,12.86
2015-08-24,12.47
2015-08-25,12.34
2015-08-26,12.36
2015-08-27,12.11
2015-08-28,12.23
2015-08-31,12.21
2015-09-01,11.84
2015-09-02,12.22
2015-09-03,12.19
2015-09-04,12.24
2015-09-08,12.38
2015-09-09,12.12
2015-09-10,12.04
2015-09-11,11.87
2015-09-14,12
2015-09-15,12.22
2015-09-16,12.38
2015-09-17,12.6
2015-09-18,11.94
2015-09-21,12.09
2015-09-22,11.52
2015-09-23,11.4
2015-09-24,11.41
2015-09-25,10.8
2015-09-28,11.79
2015-09-29,12.09
2015-09-30,12.34
2015-10-01,12.2
2015-10-02,12.15
2015-10-05,12.48
2015-10-06,12.28
2015-10-07,12.33
2015-10-08,12.48
2015-10-09,12.54
2015-10-12,12.42
2015-10-13,12.26
2015-10-14,12.18
2015-10-15,12.48
2015-10-16,12.22
2015-10-19,12.1
2015-10-20,12.51
2015-10-21,12.36
2015-10-22,12.46
2015-10-23,12.8
2015-10-26,12.72
2015-10-27,11.96
2015-10-28,12.67
2015-10-29,12.44
2015-10-30,12.69
2015-11-02,12.8
2015-11-03,12.86
2015-11-04,13.1
2015-11-05,13.47
2015-11-06,13.78
2015-11-09,13.6
2015-11-10,13.55
2015-11-11,13.46
2015-11-12,13.15
2015-11-13,12.89
2015-11-16,13
2015-11-17,12.95
2015-11-18,13.42
2015-11-19,13.49
2015-11-20,13.68
2015-11-23,13.64
2015-11-24,13.94
2015-11-25,14.75
2015-11-27,14.75
2015-11-30,14.63
2015-12-01,14.73
2015-12-02,14.65
2015-12-03,14.42
2015-12-04,14.42
2015-12-07,14.26
2015-12-08,14.31
2015-12-09,14.13
2015-12-10,14.15
2015-12-11,13.76
2015-12-14,13.86
2015-12-15,14.06
2015-12-16,14.3
2015-12-17,13.94
2015-12-18,14.16
2015-12-21,14.01
2015-12-22,13.98
2015-12-23,14.51
2015-12-24,15.32
2015-12-28,14.84
2015-12-29,15.14
2015-12-30,14.8
2015-12-31,14.8
2016-01-04,13.54
2016-01-05,13.49
2016-01-06,12.52
2016-01-07,12.12
2016-01-08,12.1
2016-01-11,12.12
2016-01-12,11.82
2016-01-13,11.29
2016-01-14,11.43
2016-01-15,11.26
2016-01-19,11.1
2016-01-20,11.35
2016-01-21,11.35
2016-01-22,11.32
2016-01-25,10.71
2016-01-26,10.94
2016-01-27,10.62
2016-01-28,10.79
2016-01-29,11.31
2016-02-01,11.41
2016-02-02,11.12
2016-02-03,11.11
2016-02-04,11.13
2016-02-05,11.11
2016-02-08,11.44
2016-02-09,11.19
2016-02-10,11.7
2016-02-11,11.64
2016-02-12,11.93
2016-02-16,12.18
2016-02-17,12.36
2016-02-18,12.23
2016-02-19,11.99
2016-02-22,11.86
2016-02-23,11.82
2016-02-24,11.88
2016-02-25,11.8
2016-02-26,12.02
2016-02-29,12.04
2016-03-01,12.7
2016-03-02,13.37
2016-03-03,13.33
2016-03-04,13.19
2016-03-07,14.24
2016-03-08,13.83
2016-03-09,14.05
2016-03-10,13.63
2016-03-11,14.08
2016-03-14,14.47
2016-03-15,14.51
2016-03-16,14.7
2016-03-17,14.9
2016-03-18,14.64
2016-03-21,14.7
2016-03-22,14.64
2016-03-23,14.27
2016-03-24,14.59
2016-03-28,14.51
2016-03-29,14.7
2016-03-30,14.71
2016-03-31,14.56
2016-04-01,14.74
2016-04-04,14.42
2016-04-05,14.07
2016-04-06,14.26
2016-04-07,13.84
2016-04-08,13.91
2016-04-11,13.9
2016-04-12,14.3
2016-04-13,14.5
2016-04-14,14.15
2016-04-15,14.31
2016-04-18,14.61
2016-04-19,14.65
2016-04-20,14.62
2016-04-21,14.51
2016-04-22,14.61
2016-04-25,14.38
2016-04-26,14.44
2016-04-27,14.7
2016-04-28,14.46
2016-04-29,14.26
2016-05-02,14.26
2016-05-03,13.79
2016-05-04,14.4
2016-05-05,14.53
2016-05-06,14.43
2016-05-09,14.09
2016-05-10,14.72
2016-05-11,14.75
2016-05-12,14.79
2016-05-13,14.35
2016-05-16,14.89
2016-05-17,15.09
2016-05-18,15.49
2016-05-19,15
2016-05-20,15
2016-05-23,15.11
2016-05-24,15.4
2016-05-25,15.9
2016-05-26,16.19
2016-05-27,16.77
2016-05-31,16.41
2016-06-01,16.36
2016-06-02,16.64
2016-06-03,16.23
2016-06-06,16.31
2016-06-07,16.41
2016-06-08,16.48
2016-06-09,16.48
2016-06-10,16.26
2016-06-13,15.87
2016-06-14,15.61
2016-06-15,15.92
2016-06-16,15.82
2016-06-17,15.91
2016-06-20,16.31
2016-06-21,16.27
2016-06-22,16.12
2016-06-23,16.5
2016-06-24,15.03
2016-06-27,14.32
2016-06-28,14.71
2016-06-29,14.8
2016-06-30,14.94
2016-07-01,15.38
2016-07-05,15.13
2016-07-06,15.19
2016-07-07,15.13
2016-07-08,15.7
2016-07-11,15.68
2016-07-12,15.59
2016-07-13,15.45
2016-07-14,15.69
2016-07-15,15.74
2016-07-18,15.84
2016-07-19,16.04
2016-07-20,16.02
2016-07-21,16.31
2016-07-22,16.37
2016-07-25,16.67
2016-07-26,17.18
2016-07-27,17.15
2016-07-28,16.69
2016-07-29,16.68
2016-08-01,17.37
2016-08-02,17.84
2016-08-03,17.31
2016-08-04,17.2
2016-08-05,17.55
2016-08-08,17.84
2016-08-09,17.66
2016-08-10,17.43
2016-08-11,17.47
2016-08-12,17.3
2016-08-15,17.36
2016-08-16,17.15
2016-08-17,17.15
2016-08-18,17.01
2016-08-19,16.92
2016-08-22,16.98
2016-08-23,17.21
2016-08-24,17.31
2016-08-25,17.25
2016-08-26,17.81
2016-08-29,17.76
2016-08-30,18.26
2016-08-31,17.33
2016-09-01,17.67
2016-09-02,17.7
2016-09-06,18
2016-09-07,18.26
2016-09-08,18.27
2016-09-09,17.61
2016-09-12,17.79
2016-09-13,17.61
2016-09-14,17.78
2016-09-15,18.36
2016-09-16,18.32
2016-09-19,18.48
2016-09-20,18.4
2016-09-21,18.86
2016-09-22,19.02
2016-09-23,18.88
2016-09-26,18.67
2016-09-27,18.3
2016-09-28,18.54
2016-09-29,18.11
2016-09-30,18.4
2016-10-03,18.41
2016-10-04,18.24
2016-10-05,18.34
2016-10-06,18.15
2016-10-07,18.13
2016-10-10,18.4
2016-10-11,18.14
2016-10-12,18.3
2016-10-13,17.71
2016-10-14,17.88
2016-10-17,18.14
2016-10-18,17.61
2016-10-19,18.26
2016-10-20,18.17
2016-10-21,18.01
2016-10-24,18.34
2016-10-25,18.06
2016-10-26,18.23
2016-10-27,14.28
2016-10-28,14.55
2016-10-31,14.82
2016-11-01,14.57
2016-11-02,14.42
2016-11-03,14.51
2016-11-04,14.69
2016-11-07,14.72
2016-11-08,14.84
2016-11-09,14.98
2016-11-10,15.37
2016-11-11,15.8
2016-11-14,15.88
2016-11-15,15.99
2016-11-16,16.05
2016-11-17,16.39
2016-11-18,16.05
2016-11-21,15.93
2016-11-22,16.12
2016-11-23,15.86
2016-11-25,16
2016-11-28,15.94
2016-11-29,16.1
2016-11-30,15.87
2016-12-01,16
2016-12-02,15.86
2016-12-05,16.44
2016-12-06,16.96
2016-12-07,17.61
2016-12-08,18.11
2016-12-09,17.9
2016-12-12,18.14
2016-12-13,18.26
2016-12-14,17.77
2016-12-15,17.79
2016-12-16,17.8
2016-12-19,17.93
2016-12-20,18.2
2016-12-21,18.32
2016-12-22,17.72
2016-12-23,17.76
2016-12-27,17.93
2016-12-28,17.69
2016-12-29,17.64
2016-12-30,17.69
2017-01-03,17.6
2017-01-04,18.02
2017-01-05,17.79
2017-01-06,17.76
2017-01-09,17.59
2017-01-10,17.94
2017-01-11,17.93
2017-01-12,17.39
2017-01-13,17.43
2017-01-17,16.8
2017-01-18,17.2
2017-01-19,17.13
2017-01-20,16.81
2017-01-23,16.73
2017-01-24,16.87
2017-01-25,16.86
2017-01-26,16.76
2017-01-27,16.87
2017-01-30,16.28
2017-01-31,16.41
2017-02-01,16.8
2017-02-02,16.51
2017-02-03,16.63
2017-02-06,16.5
2017-02-07,16.39
2017-02-08,16.5
2017-02-09,16.87
2017-02-10,17.08
2017-02-13,17.21
2017-02-14,17
2017-02-15,17.05
2017-02-16,16.93
2017-02-17,17.39
2017-02-21,17.05
2017-02-22,17.19
2017-02-23,16.96
2017-02-24,16.92
2017-02-27,16.87
2017-02-28,16.89
2017-03-01,18.05
2017-03-02,18.82
2017-03-03,19
2017-03-06,18.73
2017-03-07,18.81
2017-03-08,18.65
2017-03-09,18.19
2017-03-10,18.65
2017-03-13,18.98
2017-03-14,18.95
2017-03-15,19.22
2017-03-16,19.11
2017-03-17,18.9
2017-03-20,18.86
2017-03-21,18.16
2017-03-22,18.17
2017-03-23,18.08
2017-03-24,18.21
2017-03-27,17.97
2017-03-28,18.01
2017-03-29,18.26
2017-03-30,18.4
2017-03-31,18.14
2017-04-03,17.85
2017-04-04,17.22
2017-04-05,17.39
2017-04-06,17.41
2017-04-07,17.45
2017-04-10,17.41
2017-04-11,17.5
2017-04-12,17.38
2017-04-13,17.17
2017-04-17,17.38
2017-04-18,17.42
2017-04-19,17.83
2017-04-20,18.35
2017-04-21,18.38
2017-04-24,18.94
2017-04-25,19.18
2017-04-26,19.13
2017-04-27,19.54
2017-04-28,19.61
2017-05-01,19.84
2017-05-02,20.06
2017-05-03,19.99
2017-05-04,18.45
2017-05-05,18.27
2017-05-08,18.12
2017-05-09,18.2
2017-05-10,17.99
2017-05-11,17.66
2017-05-12,17.37
2017-05-15,17.52
2017-05-16,17.5
2017-05-17,16.61
2017-05-18,16.25
2017-05-19,16.29
2017-05-22,16.38
2017-05-23,16.33
2017-05-24,16.07
2017-05-25,15.75
2017-05-26,15.68
2017-05-30,15.59
2017-05-31,15.46
2017-06-01,15.78
2017-06-02,15.86
2017-06-05,15.62
2017-06-06,15.26
2017-06-07,15.25
2017-06-08,15.22
2017-06-09,15.24
2017-06-12,15.38
2017-06-13,15.23
2017-06-14,15.09
2017-06-15,14.84
2017-06-16,14.62
2017-06-19,14.55
2017-06-20,14.37
2017-06-21,14.33
2017-06-22,14.42
2017-06-23,14.67
2017-06-26,15.22
2017-06-27,14.96
2017-06-28,15.47
2017-06-29,15.39
2017-06-30,15.41
2017-07-03,15.57
2017-07-05,15.21
2017-07-06,14.78
2017-07-07,15.19
2017-07-10,15.34
2017-07-11,15.4
2017-07-12,15.3
2017-07-13,15.3
2017-07-14,15.44
2017-07-17,15.66
2017-07-18,15.69
2017-07-19,16.02
2017-07-20,16.21
2017-07-21,15.48
2017-07-24,15.72
2017-07-25,15.75
2017-07-26,15.61
2017-07-27,15.55
2017-07-28,15.28
2017-07-31,15.26
2017-08-01,15.29
2017-08-02,15.13
2017-08-03,16.97
2017-08-04,16.84
2017-08-07,16.98
2017-08-08,16.84
2017-08-09,16.75
2017-08-10,16.56
2017-08-11,16.29
2017-08-14,16.55
2017-08-15,16.38
2017-08-16,16.44
2017-08-17,16.1
2017-08-18,16.19
2017-08-21,16.15
2017-08-22,16.06
2017-08-23,16
2017-08-24,16.01
2017-08-25,16.17
2017-08-28,16.32
2017-08-29,16.3
2017-08-30,16.35
2017-08-31,16.56
2017-09-01,16.76
2017-09-05,16.34
2017-09-06,16.51
2017-09-07,16.57
2017-09-08,16.61
2017-09-11,16.73
2017-09-12,17.1
2017-09-13,17.32
2017-09-14,17.44
2017-09-15,18.01
2017-09-18,17.81
2017-09-19,18.29
2017-09-20,17.97
2017-09-21,18.2
2017-09-22,18.62
2017-09-25,19.16
2017-09-26,19.5
2017-09-27,19.55
2017-09-28,19.57
2017-09-29,19.81
2017-10-02,20.59
2017-10-03,21.15
2017-10-04,21.99
2017-10-05,22.18
2017-10-06,21.38
2017-10-09,21.54
2017-10-10,21.68
2017-10-11,21.8
2017-10-12,21.86
2017-10-13,22.04
2017-10-16,22.1
2017-10-17,22.12
2017-10-18,22.7
2017-10-19,22.39
2017-10-20,22.2
2017-10-23,22.07
2017-10-24,22.37
2017-10-25,22.5
2017-10-26,22.33
2017-10-27,22.21
2017-10-30,21.63
2017-10-31,22.74
2017-11-01,22.2
2017-11-02,21.57
2017-11-03,22.23
2017-11-06,22.13
2017-11-07,21.89
2017-11-08,21.81
2017-11-09,21.5
2017-11-10,21.58
2017-11-13,21.76
2017-11-14,21.75
2017-11-15,20.83
2017-11-16,21.7
2017-11-17,21.63
2017-11-20,22.2
2017-11-21,22.77
2017-11-22,22.34
2017-11-24,22.47
2017-11-27,22.69
2017-11-28,23.05
2017-11-29,23.14
2017-11-30,22.82
2017-12-01,21.88
2017-12-04,21.78
2017-12-05,21.6
2017-12-06,21.26
2017-12-07,21.59
2017-12-08,21.6
2017-12-11,21.34
2017-12-12,23.99
2017-12-13,22.66
2017-12-14,22.72
2017-12-15,23.73
2017-12-18,24.62
2017-12-19,24.42
2017-12-20,24.68
2017-12-21,24.5
2017-12-22,23.82
2017-12-26,23.66
2017-12-27,23.82
2017-12-28,23.37
2017-12-29,22.86
2018-01-02,22.77
2018-01-03,23.9
2018-01-04,24.04
2018-01-05,24
2018-01-08,23.62
2018-01-09,23.54
2018-01-10,23.19
2018-01-11,24.17
2018-01-12,24.12
2018-01-16,24.98
2018-01-17,26.01
2018-01-18,25.45
2018-01-19,26.35
2018-01-22,25.42
2018-01-23,24.95
2018-01-24,24.86
2018-01-25,24.59
2018-01-26,24.96
2018-01-29,24.92
2018-01-30,24.48
2018-01-31,24.34
2018-02-01,24.49
2018-02-02,23.8
2018-02-05,22.61
2018-02-06,23.27
2018-02-07,23.39
2018-02-08,22.35
2018-02-09,22.63
2018-02-12,22.55
2018-02-13,22.17
2018-02-14,22.64
2018-02-15,22.61
2018-02-16,22.75
2018-02-20,22.54
2018-02-21,23.12
2018-02-22,22.78
2018-02-23,22.98
2018-02-26,22.88
2018-02-27,22.37
2018-02-28,21.76
2018-03-01,22.83
2018-03-02,23.2
2018-03-05,23.61
2018-03-06,24.47
2018-03-07,24.55
2018-03-08,24.59
2018-03-09,25.3
2018-03-12,24.96
2018-03-13,25.11
2018-03-14,25.03
2018-03-15,25.15
2018-03-16,24.93
2018-03-19,24.77
2018-03-20,28.79
2018-03-21,28.78
2018-03-22,28.24
2018-03-23,26.89
2018-03-26,28.41
2018-03-27,27.29
2018-03-28,27.04
2018-03-29,27.6
2018-04-02,27.84
2018-04-03,28.04
2018-04-04,28.92
2018-04-05,28.83
2018-04-06,28.81
2018-04-09,28.32
2018-04-10,28.81
2018-04-11,28.59
2018-04-12,28.85
2018-04-13,28.46
2018-04-16,29.12
2018-04-17,29.22
2018-04-18,29.29
2018-04-19,28.62
2018-04-20,28.25
2018-04-23,28.27
2018-04-24,27.34
2018-04-25,27.16
2018-04-26,26.83
2018-04-27,26.46
2018-04-30,26.33
2018-05-01,26.29
2018-05-02,26.39
2018-05-03,27
2018-05-04,27.17
2018-05-07,27.78
2018-05-08,28.21
2018-05-09,28.92
2018-05-10,28.98
2018-05-11,29.08
2018-05-14,29.6
2018-05-15,30.78
2018-05-16,31.58
2018-05-17,31.59
2018-05-18,31.34
2018-05-21,31.32
2018-05-22,31.41
2018-05-23,31.21
2018-05-24,31.21
2018-05-25,31.17
2018-05-29,30.55
2018-05-30,30.65
2018-05-31,31.53
2018-06-01,31.89
2018-06-04,30.97
2018-06-05,31.51
2018-06-06,31.74
2018-06-07,31.47
2018-06-08,31.33
2018-06-11,31.26
2018-06-12,30.75
2018-06-13,30.6
2018-06-14,31.52
2018-06-15,31.74
2018-06-18,32.24
2018-06-19,32.05
2018-06-20,35.6
2018-06-21,36.4
2018-06-22,37.15
2018-06-25,36.77
2018-06-26,36.78
2018-06-27,35.16
2018-06-28,35.85
2018-06-29,35.14
2018-07-02,35.51
2018-07-03,36
2018-07-05,35.71
2018-07-06,35.71
2018-07-09,35.8
2018-07-10,35.2
2018-07-11,34.42
2018-07-12,34.5
2018-07-13,34.65
2018-07-16,34.19
2018-07-17,34.72
2018-07-18,34.36
2018-07-19,34.42
2018-07-20,33.72
2018-07-23,33.77
2018-07-24,33.42
2018-07-25,33.36
2018-07-26,33.24
2018-07-27,33.37
2018-07-30,33.31
2018-07-31,34
2018-08-01,33.96
2018-08-02,34.82
2018-08-03,31.09
2018-08-06,31.37
2018-08-07,31.81
2018-08-08,32.43
2018-08-09,31.58
2018-08-10,31.51
2018-08-13,31.52
2018-08-14,31.15
2018-08-15,31.31
2018-08-16,31.48
2018-08-17,32.22
2018-08-20,32.62
2018-08-21,32.71
2018-08-22,31.35
2018-08-23,29.16
2018-08-24,30.58
2018-08-27,31.11
2018-08-28,30.61
2018-08-29,30.63
2018-08-30,29.85
2018-08-31,29.93
2018-09-04,29.49
2018-09-05,29.34
2018-09-06,28.5
2018-09-07,28.54
2018-09-10,28.43
2018-09-11,28.04
2018-09-12,28.22
2018-09-13,27.56
2018-09-14,28.43
2018-09-17,28.54
2018-09-18,28.15
2018-09-19,28.6
2018-09-20,29.28
2018-09-21,29.77
2018-09-24,29.62
2018-09-25,29.58
2018-09-26,29.24
2018-09-27,30
2018-09-28,29.72
2018-10-01,29.06
2018-10-02,28.5
2018-10-03,28.57
2018-10-04,28.27
2018-10-05,28.09
2018-10-08,27.84
2018-10-09,26.46
2018-10-10,24.89
2018-10-11,24.73
2018-10-12,24.73
2018-10-15,24.89
2018-10-16,25.22
2018-10-17,24.84
2018-10-18,24.08
2018-10-19,23.36
2018-10-22,23.65
2018-10-23,23.82
2018-10-24,22.4
2018-10-25,22.64
2018-10-26,22.56
2018-10-29,24.99
2018-10-30,25.34
2018-10-31,25.41
2018-11-01,25.51
2018-11-02,25.51
2018-11-05,25.53
2018-11-06,25.45
2018-11-07,25.99
2018-11-08,26.02
2018-11-09,25.89
2018-11-12,25.76
2018-11-13,26.58
2018-11-14,26.3
2018-11-15,27.07
2018-11-16,27.16
2018-11-19,26.91
2018-11-20,26.63
2018-11-21,27.16
2018-11-23,27.28
2018-11-26,26.77
2018-11-27,26.61
2018-11-28,26.33
2018-11-29,26.18
2018-11-30,26.75
2018-12-03,27
2018-12-04,25.75
2018-12-06,25.37
2018-12-07,24.63
2018-12-10,24.77
2018-12-11,24.68
2018-12-12,25
2018-12-13,24.88
2018-12-14,25
2018-12-17,24.51
2018-12-18,24.06
2018-12-19,24.3
2018-12-20,23.8
2018-12-21,22.83
2018-12-24,22.49
2018-12-26,22.82
2018-12-27,22.94
2018-12-28,24.02
2018-12-31,24.65
2019-01-02,25.18
2019-01-03,25.13
2019-01-04,25.63
2019-01-07,25.99
2019-01-08,27.35
2019-01-09,27.42
2019-01-10,27.54
2019-01-11,27.42
2019-01-14,27.24
2019-01-15,27.4
2019-01-16,26.66
2019-01-17,26.19
2019-01-18,26.93
2019-01-22,26.37
2019-01-23,25.98
2019-01-24,26.32
2019-01-25,26.59
2019-01-28,26.16
2019-01-29,25.92
2019-01-30,25.96
2019-01-31,26.11
2019-02-01,26
2019-02-04,26.19
2019-02-05,26.89
2019-02-06,27.17
2019-02-07,26.23
2019-02-08,25.26
2019-02-11,25.45
2019-02-12,26.16
2019-02-13,25.8
2019-02-14,26.16
2019-02-15,27.38
2019-02-19,27.6
2019-02-20,27.66
2019-02-21,27.48
2019-02-22,28.02
2019-02-25,28.1
2019-02-26,28.08
2019-02-27,28.47
2019-02-28,29.57
2019-03-01,30.09
2019-03-04,30.04
2019-03-05,29.7
2019-03-06,29.58
2019-03-07,29.03
2019-03-08,28.37
2019-03-11,28.64
2019-03-12,28.19
2019-03-13,28.02
2019-03-14,27.25
2019-03-15,28.03
2019-03-18,28.12
2019-03-19,28.7
2019-03-20,28.55
2019-03-21,28.83
2019-03-22,27.3
2019-03-25,27.13
2019-03-26,27.79
2019-03-27,27.86
2019-03-28,28.47
2019-03-29,28.86
2019-04-01,29.22
2019-04-02,29.14
2019-04-03,29.63
2019-04-04,29.79
2019-04-05,30.68
2019-04-08,30.75
2019-04-09,30.46
2019-04-10,30.48
2019-04-11,30.64
2019-04-12,31.25
2019-04-15,31.42
2019-04-16,31.65
2019-04-17,31.75
2019-04-18,32.01
2019-04-22,31.98
2019-04-23,32.13
2019-04-24,32.1
2019-04-25,31.42
2019-04-26,31.67
2019-04-29,31.6
2019-04-30,31.43
2019-05-01,31.31
2019-05-02,30.7
2019-05-03,31.47
2019-05-06,30.66
2019-05-07,29.64
2019-05-08,29.05
2019-05-09,28.78
2019-05-10,28.5
2019-05-13,27.88
2019-05-14,27.73
2019-05-15,28.14
2019-05-16,28.08
2019-05-17,27.64
2019-05-20,27.41
2019-05-21,27.66
2019-05-22,27.13
2019-05-23,26.44
2019-05-24,26.46
2019-05-28,26.75
2019-05-29,26.23
2019-05-30,26.63
2019-05-31,26.03
2019-06-03,26.46
2019-06-04,27.08
2019-06-05,27.38
2019-06-06,27.21
2019-06-07,28.05
2019-06-10,28.43
2019-06-11,28.87
2019-06-12,28.89
2019-06-13,29.345
2019-06-14,29.29
2019-06-17,29.35
2019-06-18,30.165
2019-06-19,30.78
2019-06-20,31.62
2019-06-21,31.97
2019-06-24,31.52
2019-06-25,30.54
2019-06-26,31.01
2019-06-27,32.28
2019-06-28,31.92
2019-07-01,31.815
2019-07-02,31
2019-07-03,31.03
2019-07-04,31.03
2019-07-05,31.54
2019-07-08,31.31
2019-07-09,31.1
2019-07-10,31.125
2019-07-11,31.01
2019-07-12,31.765
2019-07-15,31.62
2019-07-16,31.875
2019-07-17,32.015
2019-07-18,31.505
2019-07-19,31.52
2019-07-22,31.79
2019-07-23,32.175
2019-07-24,33.72
2019-07-25,34.03
2019-07-26,33.88
2019-07-29,33.595
2019-07-30,33.36
2019-07-31,32.61
2019-08-01,30.88
2019-08-02,30.31
2019-08-05,31.07
2019-08-06,31.18
2019-08-07,30.7
2019-08-08,31.045
2019-08-09,30.86
2019-08-12,30.09
2019-08-13,30.63
2019-08-14,29.69
2019-08-15,29.92
2019-08-16,30.61
2019-08-19,30.79
2019-08-20,31.09
2019-08-21,30.97
2019-08-22,31.245
2019-08-23,30.09
2019-08-26,29.915
2019-08-27,29.73
2019-08-28,29.97
2019-08-29,30.55
2019-08-30,30.685
2019-09-02,30.685
2019-09-03,30
2019-09-04,30.32
2019-09-05,32.09
2019-09-06,31.45
2019-09-09,32.385
2019-09-10,32.405
2019-09-11,33.06
2019-09-12,33.15
2019-09-13,33.28
2019-09-16,32.625
2019-09-17,32.42
2019-09-18,31.65
2019-09-19,31.26
2019-09-20,31.04
2019-09-23,30.49
2019-09-24,29.635
2019-09-25,30.355
2019-09-26,30.65
2019-09-27,30.825
2019-09-30,31.02
2019-10-01,30.635
2019-10-02,30.41
2019-10-03,29.92
2019-10-04,30.095
2019-10-07,30.04
2019-10-08,29.5
2019-10-09,29.81
2019-10-10,30.21
2019-10-11,31.155
2019-10-14,31.37
2019-10-15,32.06
2019-10-16,32.11
2019-10-17,32.33
2019-10-18,32.59
2019-10-21,32.99
2019-10-22,33.635
2019-10-23,33.67
2019-10-24,33.325
2019-10-25,33.17
2019-10-28,33.54
2019-10-29,33.515
2019-10-30,32.94
2019-10-31,30.935
2019-11-01,29.905
2019-11-04,30.3
2019-11-05,30.47
2019-11-06,30.72
2019-11-07,30.84
2019-11-08,30.75
2019-11-11,30.545
2019-11-12,30.7
2019-11-13,30.34
2019-11-14,30.31
2019-11-15,30.16
2019-11-18,29.5
2019-11-19,28.965
2019-11-20,28.825
2019-11-21,28.66
2019-11-22,28.75
2019-11-25,29.765
