date,close
2014-06-13,67.8096
2014-06-16,68.0801
2014-06-17,68.0621
2014-06-18,67.557
2014-06-19,67.3496
2014-06-20,67.9809
2014-06-23,68.026
2014-06-24,67.5931
2014-06-25,66.8715
2014-06-26,65.9966
2014-06-27,65.6268
2014-06-30,65.0495
2014-07-01,65.3923
2014-07-02,64.8511
2014-07-03,65.1217
2014-07-07,64.0845
2014-07-08,63.3539
2014-07-09,64.0123
2014-07-10,63.5703
2014-07-11,63.895
2014-07-14,65.1578
2014-07-15,65.3923
2014-07-16,66.0417
2014-07-17,64.5535
2014-07-18,65.2841
2014-07-21,65.4825
2014-07-22,65.3201
2014-07-23,65.0666
2014-07-24,65.0122
2014-07-25,65.456
2014-07-28,65.0303
2014-07-29,63.3638
2014-07-30,63.0287
2014-07-31,58.0292
2014-08-01,58.9439
2014-08-04,58.9439
2014-08-05,58.6088
2014-08-06,58.9439
2014-08-07,60.2753
2014-08-08,61.0361
2014-08-11,61.9147
2014-08-12,61.9962
2014-08-13,62.0687
2014-08-14,62.0415
2014-08-15,61.5343
2014-08-18,62.8476
2014-08-19,63.2461
2014-08-20,63.4091
2014-08-21,63.4182
2014-08-22,62.8566
2014-08-25,63.3004
2014-08-26,62.2136
2014-08-27,62.1683
2014-08-28,62.0505
2014-08-29,61.652
2014-09-02,61.3079
2014-09-03,61.1811
2014-09-04,60.692
2014-09-05,60.9727
2014-09-08,60.6105
2014-09-09,60.9727
2014-09-10,60.855
2014-09-11,61.3984
2014-09-12,61.0361
2014-09-15,60.9818
2014-09-16,61.009
2014-09-17,61.009
2014-09-18,61.3079
2014-09-19,61.4981
2014-09-22,60.7463
2014-09-23,60.5108
2014-09-24,60.9365
2014-09-25,60.4927
2014-09-26,61.0543
2014-09-29,59.9312
2014-09-30,59.3153
2014-10-01,58.5182
2014-10-02,58.5635
2014-10-03,58.9983
2014-10-06,59.1794
2014-10-07,57.8299
2014-10-08,58.7628
2014-10-09,56.8064
2014-10-10,56.2902
2014-10-13,55.5294
2014-10-14,55.9822
2014-10-15,55.1128
2014-10-16,55.9798
2014-10-17,57.7303
2014-10-20,58.1741
2014-10-21,58.8715
2014-10-22,58.8325
2014-10-23,60.3701
2014-10-24,60.8979
2014-10-27,60.0972
2014-10-28,61.2618
2014-10-29,60.8251
2014-10-30,62.2718
2014-10-31,61.0071
2014-11-03,60.7159
2014-11-04,60.2064
2014-11-05,61.1071
2014-11-06,61.7623
2014-11-07,61.9442
2014-11-10,62.1353
2014-11-11,61.9806
2014-11-12,62.2718
2014-11-13,62.2991
2014-11-14,62.472
2014-11-17,62.7813
2014-11-18,62.3355
2014-11-19,61.6895
2014-11-20,61.6895
2014-11-21,62.3901
2014-11-24,62.6175
2014-11-25,62.8541
2014-11-26,61.8987
2014-11-28,58.878
2014-12-01,57.0946
2014-12-02,57.1492
2014-12-03,58.605
2014-12-04,58.4048
2014-12-05,57.5131
2014-12-08,55.8936
2014-12-09,57.0946
2014-12-10,55.3385
2014-12-11,55.8299
2014-12-12,54.6106
2014-12-15,54.4469
2014-12-16,55.4659
2014-12-17,57.9681
2014-12-18,59.1782
2014-12-19,60.6067
2014-12-22,60.8342
2014-12-23,61.0344
2014-12-24,60.9525
2014-12-26,61.0708
2014-12-29,61.189
2014-12-30,61.0798
2014-12-31,60.4338
2015-01-02,60.6704
2015-01-05,58.1955
2015-01-06,57.6951
2015-01-07,58.1319
2015-01-08,59.6422
2015-01-09,59.251
2015-01-12,58.8052
2015-01-13,59.1418
2015-01-14,59.4239
2015-01-15,59.1054
2015-01-16,58.6687
2015-01-20,58.9871
2015-01-21,60.3337
2015-01-22,60.3337
2015-01-23,58.4594
2015-01-26,58.2137
2015-01-27,57.0491
2015-01-28,56.1163
2015-01-29,57.04
2015-01-30,56.5278
2015-02-02,58.7868
2015-02-03,60.0763
2015-02-04,58.1008
2015-02-05,58.485
2015-02-06,58.8233
2015-02-09,59.8751
2015-02-10,59.491
2015-02-11,59.116
2015-02-12,60.1586
2015-02-13,61.1554
2015-02-17,61.3292
2015-02-18,61.1463
2015-02-19,61.2286
2015-02-20,62.2163
2015-02-23,61.2286
2015-02-24,61.8505
2015-02-25,61.7682
2015-02-26,61.5853
2015-02-27,60.7896
2015-03-02,60.5518
2015-03-03,60.2409
2015-03-04,58.8874
2015-03-05,59.2623
2015-03-06,57.9911
2015-03-09,58.7593
2015-03-10,57.4881
2015-03-11,57.1589
2015-03-12,58.7044
2015-03-13,58.3112
2015-03-16,58.9788
2015-03-17,59.0886
2015-03-18,60.4146
2015-03-19,58.8782
2015-03-20,59.116
2015-03-23,58.613
2015-03-24,58.7227
2015-03-25,57.4515
2015-03-26,57.4881
2015-03-27,57.0583
2015-03-30,58.1008
2015-03-31,57.5155
2015-04-01,57.607
2015-04-02,58.2289
2015-04-06,60.0763
2015-04-07,58.9514
2015-04-08,56.8937
2015-04-09,57.0034
2015-04-10,57.3052
2015-04-13,57.2229
2015-04-14,58.2929
2015-04-15,59.3355
2015-04-16,59.116
2015-04-17,58.1557
2015-04-20,58.5398
2015-04-21,56.4913
2015-04-22,55.6271
2015-04-23,56.3534
2015-04-24,56.5556
2015-04-27,57.4566
2015-04-28,57.4014
2015-04-29,57.6128
2015-04-30,57.1348
2015-05-01,57.1164
2015-05-04,57.337
2015-05-05,56.813
2015-05-06,56.9969
2015-05-07,56.9509
2015-05-08,57.0704
2015-05-11,57.144
2015-05-12,57.6128
2015-05-13,58.1368
2015-05-14,59.1297
2015-05-15,58.8355
2015-05-18,58.8355
2015-05-19,58.8815
2015-05-20,59.0102
2015-05-21,60.619
2015-05-22,59.7732
2015-05-26,59.24
2015-05-27,59.4239
2015-05-28,59.2768
2015-05-29,58.8631
2015-06-01,58.3667
2015-06-02,58.7068
2015-06-03,58.5413
2015-06-04,57.144
2015-06-05,57.3462
2015-06-08,56.574
2015-06-09,56.2798
2015-06-10,56.9509
2015-06-11,57.1716
2015-06-12,57.0796
2015-06-15,56.1419
2015-06-16,56.62
2015-06-17,56.3534
2015-06-18,56.7487
2015-06-19,56.4545
2015-06-22,57.1348
2015-06-23,57.7507
2015-06-24,58.6516
2015-06-25,58.5413
2015-06-26,58.6057
2015-06-29,59.2308
2015-06-30,63.2022
2015-07-01,63.1654
2015-07-02,62.4576
2015-07-06,60.7201
2015-07-07,61.097
2015-07-08,59.9111
2015-07-09,59.3411
2015-07-10,58.7436
2015-07-13,59.9111
2015-07-14,60.0306
2015-07-15,58.5597
2015-07-16,59.1848
2015-07-17,58.6792
2015-07-20,58.9091
2015-07-21,56.6292
2015-07-22,56.4721
2015-07-23,57.1744
2015-07-24,56.2226
2015-07-27,54.2912
2015-07-28,54.9381
2015-07-29,56.1856
2015-07-30,56.1302
2015-07-31,56.1949
2015-08-03,55.6404
2015-08-04,55.3724
2015-08-05,56.2411
2015-08-06,56.3427
2015-08-07,56.4998
2015-08-10,57.6365
2015-08-11,56.4629
2015-08-12,56.6384
2015-08-13,56.5553
2015-08-14,56.9896
2015-08-17,57.849
2015-08-18,57.5441
2015-08-19,56.1487
2015-08-20,54.4298
2015-08-21,52.7017
2015-08-24,50.5024
2015-08-25,48.9684
2015-08-26,50.1512
2015-08-27,51.5189
2015-08-28,51.7222
2015-08-31,51.0938
2015-09-01,49.4304
2015-09-02,49.7631
2015-09-03,50.1142
2015-09-04,49.1532
2015-09-08,50.4377
2015-09-09,49.9756
2015-09-10,50.0958
2015-09-11,50.2806
2015-09-14,49.4304
2015-09-15,49.9387
2015-09-16,50.7149
2015-09-17,49.1717
2015-09-18,47.1294
2015-09-21,46.6304
2015-09-22,47.3789
2015-09-23,46.7413
2015-09-24,47.1941
2015-09-25,48.035
2015-09-28,47.3789
2015-09-29,46.9353
2015-09-30,47.1663
2015-10-01,45.7894
2015-10-02,47.4528
2015-10-05,50.373
2015-10-06,50.2344
2015-10-07,51.0014
2015-10-08,53.1638
2015-10-09,52.8126
2015-10-12,52.5631
2015-10-13,52.0179
2015-10-14,51.2694
2015-10-15,52.3506
2015-10-16,51.3525
2015-10-19,51.0199
2015-10-20,50.2529
2015-10-21,50.1599
2015-10-22,51.7495
2015-10-23,51.861
2015-10-26,51.1453
2015-10-27,50.7642
2015-10-28,50.9872
2015-10-29,51.4427
2015-10-30,51.9819
2015-11-02,52.8557
2015-11-03,54.343
2015-11-04,54.5382
2015-11-05,55.2168
2015-11-06,53.2275
2015-11-09,52.3444
2015-11-10,52.9672
2015-11-11,52.7442
2015-11-12,50.6154
2015-11-13,51.0151
2015-11-16,51.638
2015-11-17,51.0337
2015-11-18,52.2887
2015-11-19,52.772
2015-11-20,52.6884
2015-11-23,52.4653
2015-11-24,52.5582
2015-11-25,52.2236
2015-11-27,52.4188
2015-11-30,52.707
2015-12-01,53.0602
2015-12-02,52.0656
2015-12-03,51.8982
2015-12-04,51.8982
2015-12-07,51.1081
2015-12-08,48.9143
2015-12-09,48.8027
2015-12-10,49.5185
2015-12-11,48.087
2015-12-14,48.5704
2015-12-15,47.2596
2015-12-16,48.1335
2015-12-17,46.0884
2015-12-18,44.8149
2015-12-21,45.2146
2015-12-22,45.7909
2015-12-23,46.8413
2015-12-24,46.7391
2015-12-28,46.107
2015-12-29,46.925
2015-12-30,46.4788
2015-12-31,46.0419
2016-01-04,45.8095
2016-01-05,45.4191
2016-01-06,44.378
2016-01-07,43.2067
2016-01-08,42.4259
2016-01-11,42.2957
2016-01-12,42.8721
2016-01-13,41.896
2016-01-14,42.305
2016-01-15,41.4777
2016-01-19,40.9757
2016-01-20,39.9625
2016-01-21,40.325
2016-01-22,40.9943
2016-01-25,40.5109
2016-01-26,42.1191
2016-01-27,42.2502
2016-01-28,42.5779
2016-01-29,44.123
2016-02-01,43.6641
2016-02-02,41.7633
2016-02-03,42.5592
2016-02-04,43.8327
2016-02-05,43.3083
2016-02-08,42.7277
2016-02-09,42.3251
2016-02-10,40.1527
2016-02-11,40.3399
2016-02-12,41.576
2016-02-16,42.8307
2016-02-17,44.4694
2016-02-18,45.1998
2016-02-19,44.9564
2016-02-22,46.0051
2016-02-23,44.7035
2016-02-24,44.8346
2016-02-25,44.8534
2016-02-26,45.4527
2016-02-29,44.6754
2016-03-01,46.0332
2016-03-02,47.391
2016-03-03,47.6438
2016-03-04,47.3254
2016-03-07,48.5802
2016-03-08,46.7542
2016-03-09,47.0071
2016-03-10,46.3329
2016-03-11,47.1944
2016-03-14,47.3629
2016-03-15,47.0539
2016-03-16,48.4585
2016-03-17,50.3875
2016-03-18,50.3781
2016-03-21,50.6216
2016-03-22,50.5186
2016-03-23,49.5728
2016-03-24,49.3012
2016-03-28,49.3012
2016-03-29,50.0129
2016-03-30,50.6309
2016-03-31,50.8088
2016-04-01,50.144
2016-04-04,49.7507
2016-04-05,48.0933
2016-04-06,47.9247
2016-04-07,47.4753
2016-04-08,48.2338
2016-04-11,48.4117
2016-04-12,49.732
2016-04-13,51.5205
2016-04-14,51.7921
2016-04-15,51.6048
2016-04-18,51.661
2016-04-19,52.6817
2016-04-20,53.1149
2016-04-21,53.162
2016-04-22,53.9532
2016-04-25,52.87
2016-04-26,54.914
2016-04-27,56.4588
2016-04-28,55.2814
2016-04-29,54.7068
2016-05-02,55.5639
2016-05-03,54.622
2016-05-04,53.5765
2016-05-05,53.5953
2016-05-06,54.7633
2016-05-09,54.1793
2016-05-10,54.9234
2016-05-11,55.4792
2016-05-12,55.7806
2016-05-13,54.3018
2016-05-16,55.1683
2016-05-17,54.7916
2016-05-18,55.8277
2016-05-19,54.9705
2016-05-20,55.0836
2016-05-23,55.8653
2016-05-24,56.5906
2016-05-25,57.7869
2016-05-26,57.3065
2016-05-27,57.0898
2016-05-31,56.7413
2016-06-01,56.6942
2016-06-02,57.2217
2016-06-03,56.5153
2016-06-06,57.1935
2016-06-07,57.5231
2016-06-08,57.4007
2016-06-09,56.666
2016-06-10,55.9313
2016-06-13,55.1306
2016-06-14,55.7429
2016-06-15,56.3269
2016-06-16,56.779
2016-06-17,57.6456
2016-06-20,58.6629
2016-06-21,57.9187
2016-06-22,57.0993
2016-06-23,57.9376
2016-06-24,54.4713
2016-06-27,53.0113
2016-06-28,53.162
2016-06-29,54.3489
2016-06-30,54.9046
2016-07-01,55.4132
2016-07-05,54.5372
2016-07-06,55.3284
2016-07-07,55.8748
2016-07-08,57.8622
2016-07-11,58.5875
2016-07-12,59.9062
2016-07-13,59.5671
2016-07-14,59.7272
2016-07-15,59.8779
2016-07-18,59.3128
2016-07-19,58.8813
2016-07-20,59.0991
2016-07-21,58.7013
2016-07-22,59.298
2016-07-25,58.7771
2016-07-26,59.9325
2016-07-27,60.3966
2016-07-28,60.5008
2016-07-29,60.444
2016-08-01,58.9949
2016-08-02,57.8963
2016-08-03,59.0423
2016-08-04,58.957
2016-08-05,61.1448
2016-08-08,60.9744
2016-08-09,61.0975
2016-08-10,60.9649
2016-08-11,62.3477
2016-08-12,62.1582
2016-08-15,63.2379
2016-08-16,62.8686
2016-08-17,63.0675
2016-08-18,63.0106
2016-08-19,62.3098
2016-08-22,61.7889
2016-08-23,61.6752
2016-08-24,61.0975
2016-08-25,60.5955
2016-08-26,60.3303
2016-08-29,61.3532
2016-08-30,60.766
2016-08-31,60.6618
2016-09-01,59.8662
2016-09-02,60.6334
2016-09-06,60.4345
2016-09-07,60.0273
2016-09-08,58.8813
2016-09-09,56.7219
2016-09-12,57.3848
2016-09-13,55.699
2016-09-14,55.6706
2016-09-15,55.8884
2016-09-16,56.2578
2016-09-19,56.6461
2016-09-20,56.3809
2016-09-21,57.3091
2016-09-22,58.957
2016-09-23,58.0194
2016-09-26,57.7447
2016-09-27,58.2088
2016-09-28,59.9325
2016-09-29,59.62
2016-09-30,60.8418
2016-10-03,60.6145
2016-10-04,58.8907
2016-10-05,58.9381
2016-10-06,58.313
2016-10-07,57.0439
2016-10-10,56.6177
2016-10-11,56.021
2016-10-12,56.4662
2016-10-13,55.699
2016-10-14,55.6327
2016-10-17,55.879
2016-10-18,56.2957
2016-10-19,56.1528
2016-10-20,55.5146
2016-10-21,55.6003
2016-10-24,56.1433
2016-10-25,53.2666
2016-10-26,52.7712
2016-10-27,52.2283
2016-10-28,52.5331
2016-10-31,52.5141
2016-11-01,52.314
2016-11-02,51.3615
2016-11-03,51.5806
2016-11-04,52.1045
2016-11-07,52.857
2016-11-08,53.2761
2016-11-09,54.5811
2016-11-10,57.3816
2016-11-11,56.6291
2016-11-14,57.0958
2016-11-15,56.1052
2016-11-16,55.5241
2016-11-17,55.2002
2016-11-18,55.0574
2016-11-21,55.4574
2016-11-22,55.2383
2016-11-23,55.0859
2016-11-25,55.305
2016-11-28,54.3525
2016-11-29,53.5428
2016-11-30,54.7335
2016-12-01,56.0194
2016-12-02,55.9909
2016-12-05,56.8482
2016-12-06,57.2768
2016-12-07,58.4389
2016-12-08,57.7626
2016-12-09,57.3816
2016-12-12,57.0387
2016-12-13,56.1623
2016-12-14,54.9907
2016-12-15,54.2953
2016-12-16,53.8667
2016-12-19,54.4382
2016-12-20,54.4096
2016-12-21,54.3525
2016-12-22,54.1239
2016-12-23,54.1239
2016-12-27,54.562
2016-12-28,53.5904
2016-12-29,53.8286
2016-12-30,53.4094
2017-01-03,55.2002
2017-01-04,55.3908
2017-01-05,55.3145
2017-01-06,55.2574
2017-01-09,53.8857
2017-01-10,54.2286
2017-01-11,54.743
2017-01-12,54.5525
2017-01-13,55.9242
2017-01-17,55.7241
2017-01-18,55.9528
2017-01-19,56.1337
2017-01-20,56.0099
2017-01-23,56.0099
2017-01-24,57.3721
2017-01-25,58.9193
2017-01-26,58.2774
2017-01-27,58.4882
2017-01-30,58.2103
2017-01-31,56.1697
2017-02-01,55.6811
2017-02-02,55.3937
2017-02-03,55.9398
2017-02-06,55.4608
2017-02-07,55.7003
2017-02-08,55.5278
2017-02-09,55.8536
2017-02-10,56.2559
2017-02-13,56.984
2017-02-14,56.1601
2017-02-15,56.6679
2017-02-16,56.0835
2017-02-17,55.6907
2017-02-21,56.8499
2017-02-22,56.4284
2017-02-23,56.026
2017-02-24,55.7099
2017-02-27,56.1601
2017-02-28,55.6236
2017-03-01,57.3481
2017-03-02,56.3038
2017-03-03,56.6679
2017-03-06,56.3901
2017-03-07,56.4284
2017-03-08,56.8212
2017-03-09,56.7158
2017-03-10,57.5876
2017-03-13,58.2582
2017-03-14,57.8654
2017-03-15,60.0785
2017-03-16,60.0114
2017-03-17,60.2318
2017-03-20,59.5899
2017-03-21,58.3349
2017-03-22,58.3828
2017-03-23,58.4019
2017-03-24,58.172
2017-03-27,58.4977
2017-03-28,60.1264
2017-03-29,60.4234
2017-03-30,60.251
2017-03-31,60.1456
2017-04-03,59.657
2017-04-04,60.2031
2017-04-05,59.7624
2017-04-06,60.1839
2017-04-07,60.1551
2017-04-10,60.4713
2017-04-11,60.7779
2017-04-12,59.7336
2017-04-13,59.5516
2017-04-17,60.6533
2017-04-18,60.2989
2017-04-19,59.9376
2017-04-20,60.4963
2017-04-21,60.2747
2017-04-24,60.9491
2017-04-25,62.2881
2017-04-26,62.5867
2017-04-27,62.2881
2017-04-28,62.1436
2017-05-01,61.9702
2017-05-02,62.3555
2017-05-03,63.0491
2017-05-04,62.895
2017-05-05,63.9932
2017-05-08,63.6656
2017-05-09,65.2455
2017-05-10,63.5597
2017-05-11,62.6734
2017-05-12,62.2688
2017-05-15,63.0876
2017-05-16,63.0973
2017-05-17,62.8275
2017-05-18,63.5308
2017-05-19,64.6482
2017-05-22,65.1684
2017-05-23,63.7234
2017-05-24,64.1473
2017-05-25,64.1087
2017-05-26,63.8198
2017-05-30,64.2051
2017-05-31,63.7909
2017-06-01,63.8101
2017-06-02,63.7716
2017-06-05,62.9624
2017-06-06,62.317
2017-06-07,61.9991
2017-06-08,62.3651
2017-06-09,63.8294
2017-06-12,63.8968
2017-06-13,64.0895
2017-06-14,64.0606
2017-06-15,63.9161
2017-06-16,64.234
2017-06-19,64.7734
2017-06-20,64.051
2017-06-21,62.5385
2017-06-22,62.5771
2017-06-23,63.2225
2017-06-26,63.2321
2017-06-27,62.7023
2017-06-28,63.6271
2017-06-29,63.2129
2017-06-30,64.0991
2017-07-03,64.5711
2017-07-05,64.2436
2017-07-06,63.2032
2017-07-07,64.1858
2017-07-10,64.4074
2017-07-11,64.1665
2017-07-12,64.8409
2017-07-13,64.3399
2017-07-14,64.1087
2017-07-17,64.0991
2017-07-18,63.8487
2017-07-19,63.9891
2017-07-20,63.0691
2017-07-21,62.7205
2017-07-24,62.5365
2017-07-25,61.268
2017-07-26,60.3964
2017-07-27,60.5223
2017-07-28,61.268
2017-07-31,61.0743
2017-08-01,61.1615
2017-08-02,60.6773
2017-08-03,60.8613
2017-08-04,61.1615
2017-08-07,60.8419
2017-08-08,60.3287
2017-08-09,60.3964
2017-08-10,59.5733
2017-08-11,59.6218
2017-08-14,60.532
2017-08-15,60.0672
2017-08-16,60.4061
2017-08-17,59.4184
2017-08-18,59.0407
2017-08-21,58.9439
2017-08-22,59.4571
2017-08-23,58.818
2017-08-24,59.0407
2017-08-25,59.5637
2017-08-28,59.0214
2017-08-29,59.1279
2017-08-30,59.0601
2017-08-31,60.0866
2017-09-01,60.503
2017-09-05,59.6218
2017-09-06,59.7864
2017-09-07,59.6895
2017-09-08,60.0575
2017-09-11,61.6359
2017-09-12,62.3816
2017-09-13,62.4978
2017-09-14,67.3302
2017-09-15,62.5559
2017-09-18,63.4661
2017-09-19,64.4926
2017-09-20,64.9768
2017-09-21,64.6669
2017-09-22,64.9284
2017-09-25,64.8606
2017-09-26,64.2602
2017-09-27,64.8993
2017-09-28,65.0446
2017-09-29,65.8096
2017-10-02,67.1362
2017-10-03,67.4267
2017-10-04,67.8238
2017-10-05,67.3783
2017-10-06,67.8044
2017-10-09,67.785
2017-10-10,67.7366
2017-10-11,67.7366
2017-10-12,67.6785
2017-10-13,67.7656
2017-10-16,68.8502
2017-10-17,68.1917
2017-10-18,68.2692
2017-10-19,68.8093
2017-10-20,69.2569
2017-10-23,68.9163
2017-10-24,68.6828
2017-10-25,69.0331
2017-10-26,69.2472
2017-10-27,68.2449
2017-10-30,68.2157
2017-10-31,68.566
2017-11-01,67.3983
2017-11-02,68.0503
2017-11-03,67.4956
2017-11-06,67.6124
2017-11-07,67.0869
2017-11-08,67.3107
2017-11-09,66.3376
2017-11-10,66.2208
2017-11-13,66.4349
2017-11-14,66.1916
2017-11-15,65.6564
2017-11-16,66.396
2017-11-17,66.6003
2017-11-20,67.301
2017-11-21,67.4859
2017-11-22,67.6416
2017-11-24,67.301
2017-11-27,67.2523
2017-11-28,67.4567
2017-11-29,67.4567
2017-11-30,69.2472
2017-12-01,68.3033
2017-12-04,67.301
2017-12-05,66.7074
2017-12-06,67.3691
2017-12-07,67.554
2017-12-08,68.0697
2017-12-11,67.8946
2017-12-12,67.807
2017-12-13,67.7681
2017-12-14,66.9896
2017-12-15,66.3376
2017-12-18,67.0382
2017-12-19,67.3302
2017-12-20,67.9043
2017-12-21,68.2838
2017-12-22,67.8556
2017-12-26,67.5151
2017-12-27,67.5345
2017-12-28,68.2546
2017-12-29,68.7217
2018-01-02,68.3422
2018-01-03,68.8969
2018-01-04,70.5998
2018-01-05,70.7069
2018-01-08,70.6388
2018-01-09,70.921
2018-01-10,71.4367
2018-01-11,72.1374
2018-01-12,71.7773
2018-01-16,71.5827
2018-01-17,71.6022
2018-01-18,71.5827
2018-01-19,71.9914
2018-01-22,71.9525
2018-01-23,71.2032
2018-01-24,71.4756
2018-01-25,71.7201
2018-01-26,72.3752
2018-01-29,72.1699
2018-01-30,70.0579
2018-01-31,69.9112
2018-02-01,70.5565
2018-02-02,69.657
2018-02-05,66.7627
2018-02-06,66.9583
2018-02-07,67.1245
2018-02-08,65.1885
2018-02-09,65.5992
2018-02-12,67.4961
2018-02-13,67.8481
2018-02-14,69.2365
2018-02-15,69.0801
2018-02-16,69.2561
2018-02-20,69.0214
2018-02-21,69.0703
2018-02-22,69.5103
2018-02-23,69.8036
2018-02-26,69.7645
2018-02-27,68.9725
2018-02-28,67.1636
2018-03-01,65.4721
2018-03-02,65.7361
2018-03-05,66.1565
2018-03-06,66.9974
2018-03-07,67.7796
2018-03-08,68.7085
2018-03-09,70.2241
2018-03-12,69.6081
2018-03-13,68.4152
2018-03-14,69.0703
2018-03-15,70.5272
2018-03-16,71.1236
2018-03-19,70.097
2018-03-20,70.1947
2018-03-21,70.1556
2018-03-22,68.0632
2018-03-23,65.8143
2018-03-26,67.633
2018-03-27,66.7627
2018-03-28,66.3814
2018-03-29,66.6161
2018-04-02,65.7654
2018-04-03,67.3787
2018-04-04,68.337
2018-04-05,68.8845
2018-04-06,66.5672
2018-04-09,66.9094
2018-04-10,68.1805
2018-04-11,67.9752
2018-04-12,68.8695
2018-04-13,68.8007
2018-04-16,69.125
2018-04-17,69.98
2018-04-18,70.6581
2018-04-19,69.9112
2018-04-20,69.2331
2018-04-23,68.103
2018-04-24,65.9508
2018-04-25,66.4716
2018-04-26,66.4127
2018-04-27,66.0982
2018-04-30,66.1179
2018-05-01,44.0458
2018-05-02,44.6355
2018-05-03,43.181
2018-05-04,43.5348
2018-05-07,43.6626
2018-05-08,43.6724
2018-05-09,43.7805
2018-05-10,43.6232
2018-05-11,43.8984
2018-05-14,44.0556
2018-05-15,44.2227
2018-05-16,44.832
2018-05-17,44.9303
2018-05-18,45.2251
2018-05-21,45.6968
2018-05-22,45.058
2018-05-23,44.6944
2018-05-24,44.6355
2018-05-25,44.2522
2018-05-29,43.407
2018-05-30,43.9475
2018-05-31,42.8862
2018-06-01,43.1024
2018-06-04,42.896
2018-06-05,43.0729
2018-06-06,43.5545
2018-06-07,44.0655
2018-06-08,44.2227
2018-06-11,44.1146
2018-06-12,43.3972
2018-06-13,42.8174
2018-06-14,43.0238
2018-06-15,43.1024
2018-06-18,43.1221
2018-06-19,42.385
2018-06-20,42.6504
2018-06-21,41.4219
2018-06-22,41.8347
2018-06-25,41.6185
2018-06-26,41.4612
2018-06-27,41.1271
2018-06-28,41.019
2018-06-29,41.3531
2018-07-02,41.2352
2018-07-03,41.6087
2018-07-05,41.7266
2018-07-06,41.5497
2018-07-09,42.5324
2018-07-10,42.7683
2018-07-11,41.874
2018-07-12,42.1099
2018-07-13,42.7683
2018-07-16,42.326
2018-07-17,42.4145
2018-07-18,43.0238
2018-07-19,43.1372
2018-07-20,43.305
2018-07-23,43.2655
2018-07-24,43.5911
2018-07-25,41.3514
2018-07-26,42.6735
2018-07-27,42.6834
2018-07-30,42.7919
2018-07-31,44.0548
2018-08-01,42.6242
2018-08-02,42.7623
2018-08-03,43.374
2018-08-06,43.3346
2018-08-07,43.5122
2018-08-08,43.2655
2018-08-09,43.0978
2018-08-10,42.7031
2018-08-13,42.0618
2018-08-14,41.9335
2018-08-15,41.4007
2018-08-16,41.5882
2018-08-17,42.2295
2018-08-20,42.6932
2018-08-21,42.9399
2018-08-22,42.3282
2018-08-23,42.0914
2018-08-24,42.3084
2018-08-27,42.8215
2018-08-28,42.8708
2018-08-29,43.1471
2018-08-30,42.782
2018-08-31,42.9004
2018-09-04,42.3282
2018-09-05,42.8906
2018-09-06,42.9004
2018-09-07,42.5156
2018-09-10,42.9991
2018-09-11,42.2098
2018-09-12,42.3183
2018-09-13,42.6242
2018-09-14,43.4826
2018-09-17,43.7687
2018-09-18,44.706
2018-09-19,44.489
2018-09-20,44.1732
2018-09-21,44.2818
2018-09-24,43.2556
2018-09-25,43.1372
2018-09-26,43.078
2018-09-27,42.9004
2018-09-28,42.7722
2018-10-01,42.7327
2018-10-02,42.8511
2018-10-03,42.8314
2018-10-04,43.1274
2018-10-05,42.1604
2018-10-08,42.0815
2018-10-09,41.154
2018-10-10,39.9404
2018-10-11,38.6775
2018-10-12,38.4802
2018-10-15,38.4604
2018-10-16,38.9932
2018-10-17,38.6479
2018-10-18,38.4249
2018-10-19,38.0681
2018-10-22,37.7014
2018-10-23,38.415
2018-10-24,37.7609
2018-10-25,38.4943
2018-10-26,38.9997
2018-10-29,38.7222
2018-10-30,39.4656
2018-10-31,39.7926
2018-11-01,40.7738
2018-11-02,41.2594
2018-11-05,41.4775
2018-11-06,41.9929
2018-11-07,42.6569
2018-11-08,42.8749
2018-11-09,42.1514
2018-11-12,41.4676
2018-11-13,41.4478
2018-11-14,41.4676
2018-11-15,42.1217
2018-11-16,41.9136
2018-11-19,41.6162
2018-11-20,40.9819
2018-11-21,41.2198
2018-11-23,41.418
2018-11-26,41.3982
2018-11-27,41.2594
2018-11-28,42.5082
2018-11-29,42.092
2018-11-30,42.3199
2018-12-03,42.1217
2018-12-04,40.2188
2018-12-06,39.9215
2018-12-07,39.3664
2018-12-10,39.3268
2018-12-11,39.3962
2018-12-12,39.2376
2018-12-13,39.3367
2018-12-14,38.7619
2018-12-17,37.9789
2018-12-18,38.2267
2018-12-19,37.8203
2018-12-20,37.2158
2018-12-21,36.4031
2018-12-24,35.4913
2018-12-26,36.6905
2018-12-27,37.1067
2018-12-28,36.9779
2018-12-31,37.4437
2019-01-02,37.4338
2019-01-03,36.3139
2019-01-04,37.8104
2019-01-07,38.197
2019-01-08,39.307
2019-01-09,39.8818
2019-01-10,40.1098
2019-01-11,40.09
2019-01-14,40.0206
2019-01-15,39.9116
2019-01-16,39.8124
2019-01-17,40.0008
2019-01-18,40.8035
2019-01-22,39.8025
2019-01-23,39.8818
2019-01-24,40.28
2019-01-25,40.8774
2019-01-28,40.3597
2019-01-29,40.7977
2019-01-30,41.0068
2019-01-31,41.0068
2019-02-01,40.8176
2019-02-04,41.0068
2019-02-05,41.2855
2019-02-06,41.3154
2019-02-07,40.7579
2019-02-08,40.8176
2019-02-11,40.9072
2019-02-12,41.6141
2019-02-13,42.0422
2019-02-14,41.6439
2019-02-15,42.53
2019-02-19,42.291
2019-02-20,42.5997
2019-02-21,42.3508
2019-02-22,42.8585
2019-02-25,43.0775
2019-02-26,42.7888
2019-02-27,42.8784
2019-02-28,42.3508
2019-03-01,42.4902
2019-03-04,42.6793
2019-03-05,42.3607
2019-03-06,42.0422
2019-03-07,41.5643
2019-03-08,41.4548
2019-03-11,42.5101
2019-03-12,42.3408
2019-03-13,42.5997
2019-03-14,42.3707
2019-03-15,42.4304
2019-03-18,43.3961
2019-03-19,43.4459
2019-03-20,42.978
2019-03-21,43.3165
2019-03-22,42.072
2019-03-25,42.3906
2019-03-26,43.1074
2019-03-27,43.2368
2019-03-28,43.7346
2019-03-29,44.312
2019-04-01,45.2877
2019-04-02,44.8596
2019-04-03,44.7003
2019-04-04,44.9094
2019-04-05,45.0089
2019-04-08,45.0587
2019-04-09,38.956
2019-04-10,39.0555
2019-04-11,39.8022
2019-04-12,39.8818
2019-04-15,39.7126
2019-04-16,40.29
2019-04-17,38.35
2019-04-18,38.22
2019-04-22,37.64
2019-04-23,38.07
2019-04-24,38.05
2019-04-25,37.51
2019-04-26,38.41
2019-04-29,38.86
2019-04-30,38.99
2019-05-01,38.84
2019-05-02,38.99
2019-05-03,39.48
2019-05-06,38.62
2019-05-07,37.9
2019-05-08,37.54
2019-05-09,37.71
2019-05-10,37.97
2019-05-13,36.78
2019-05-14,36.77
2019-05-15,36.75
2019-05-16,36.61
2019-05-17,36.01
2019-05-20,35.7
2019-05-21,36.61
2019-05-22,36.34
2019-05-23,35.6
2019-05-24,36.25
2019-05-28,35.35
2019-05-29,35.51
2019-05-30,35.5
2019-05-31,34.82
2019-06-03,35.38
2019-06-04,36.35
2019-06-05,36.21
2019-06-06,36.11
2019-06-07,36.44
2019-06-10,36.21
2019-06-11,35.49
2019-06-12,35.36
2019-06-13,35.98
2019-06-14,35.68
2019-06-17,35.75
2019-06-18,36.07
2019-06-19,36.41
2019-06-20,37.09
2019-06-21,36.73
2019-06-24,36.59
2019-06-25,36.54
2019-06-26,36.27
2019-06-27,36.5
2019-06-28,37.175
2019-07-01,37.35
2019-07-02,37.57
2019-07-03,38.24
2019-07-04,38.24
2019-07-05,38.035
2019-07-08,37.81
2019-07-09,36.95
2019-07-10,36.9
2019-07-11,36.96
2019-07-12,37.95
2019-07-15,37.99
2019-07-16,38.52
2019-07-17,37.67
2019-07-18,37.065
2019-07-19,37.43
2019-07-22,37.555
2019-07-23,39.29
2019-07-24,39.275
2019-07-25,38.955
2019-07-26,39.225
2019-07-29,38.97
2019-07-30,38.93
2019-07-31,38.8
2019-08-01,38.71
2019-08-02,37.29
2019-08-05,36.125
2019-08-06,36.64
2019-08-07,36.69
2019-08-08,37.385
2019-08-09,36.85
2019-08-12,36.365
2019-08-13,37.035
2019-08-14,35.63
2019-08-15,35.465
2019-08-16,36.165
2019-08-19,36.74
2019-08-20,36.425
2019-08-21,36.565
2019-08-22,36.38
2019-08-23,34.99
2019-08-26,35.135
2019-08-27,34.755
2019-08-28,35.185
2019-08-29,35.89
2019-08-30,35.945
2019-09-02,35.91
2019-09-03,34.885
2019-09-04,35.535
2019-09-05,36.23
2019-09-06,36.345
2019-09-09,36.81
2019-09-10,37.89
2019-09-11,38.055
2019-09-12,37.805
2019-09-13,37.805
2019-09-16,37.67
2019-09-17,37.985
2019-09-18,38.115
2019-09-19,37.57
2019-09-20,36.625
2019-09-23,37.02
2019-09-24,36.795
2019-09-25,37.355
2019-09-26,37.24
2019-09-27,37.61
2019-09-30,37.74
2019-10-01,36.76
2019-10-02,35.75
2019-10-03,36.065
2019-10-04,36.545
2019-10-07,36.23
2019-10-08,35.2
2019-10-09,35.66
2019-10-10,36.175
2019-10-11,37.415
2019-10-14,37.2
2019-10-15,37.87
2019-10-16,37.805
2019-10-17,38.45
2019-10-18,38.58
2019-10-21,38.97
2019-10-22,39.365
2019-10-23,41.47
2019-10-24,41.665
2019-10-25,41.24
2019-10-28,41.59
2019-10-29,41.855
2019-10-30,41.845
2019-10-31,41.425
2019-11-01,42.325
2019-11-04,42.78
2019-11-05,43.11
2019-11-06,42.915
2019-11-07,43.19
2019-11-08,43.345
2019-11-11,43.14
2019-11-12,43.14
2019-11-13,43.095
2019-11-14,43.07
2019-11-15,43.485
2019-11-18,43.36
2019-11-19,43.225
2019-11-20,43.275
2019-11-21,43.435
2019-11-22,43.77
2019-11-25,44.055
