date,close
2014-06-13,82.09
2014-06-16,84.01
2014-06-17,86.02
2014-06-18,86.36
2014-06-19,86.3
2014-06-20,88.12
2014-06-23,89.28
2014-06-24,88.2
2014-06-25,86.76
2014-06-26,88.5
2014-06-27,91.01
2014-06-30,91.86
2014-07-01,92.9
2014-07-02,92.38
2014-07-03,93.71
2014-07-07,88.94
2014-07-08,84.16
2014-07-09,84.5
2014-07-10,85.52
2014-07-11,86.46
2014-07-14,88.24
2014-07-15,86.25
2014-07-16,85.14
2014-07-17,83.31
2014-07-18,85.19
2014-07-21,85.84
2014-07-22,86.65
2014-07-23,86.52
2014-07-24,86.73
2014-07-25,85.54
2014-07-28,85.97
2014-07-29,87.33
2014-07-30,87.83
2014-07-31,92
2014-08-01,95.93
2014-08-04,95.38
2014-08-05,96.81
2014-08-06,98.15
2014-08-07,99.56
2014-08-08,101.13
2014-08-11,100.93
2014-08-12,102.12
2014-08-13,103.24
2014-08-14,103.47
2014-08-15,103.01
2014-08-18,105.13
2014-08-19,105.53
2014-08-20,104.41
2014-08-21,103.01
2014-08-22,104.73
2014-08-25,107.53
2014-08-26,107.71
2014-08-27,107.13
2014-08-28,107.79
2014-08-29,108.26
2014-09-02,108.25
2014-09-03,104.02
2014-09-04,101.25
2014-09-05,102.36
2014-09-08,104.14
2014-09-09,102.35
2014-09-10,102.86
2014-09-11,103.23
2014-09-12,104.22
2014-09-15,99.61
2014-09-16,101.85
2014-09-17,103.16
2014-09-18,105.25
2014-09-19,101.18
2014-09-22,104.13
2014-09-23,101.2
2014-09-24,106.28
2014-09-25,94.62
2014-09-26,98
2014-09-29,99.16
2014-09-30,96.92
2014-10-01,95.67
2014-10-02,97.4
2014-10-03,100.37
2014-10-06,98.35
2014-10-07,97.55
2014-10-08,101.33
2014-10-09,95.56
2014-10-10,94.89
2014-10-13,94.18
2014-10-14,99.37
2014-10-15,102.8
2014-10-16,104.43
2014-10-17,101.65
2014-10-20,98.91
2014-10-21,100.85
2014-10-22,101.3
2014-10-23,104.13
2014-10-24,106.44
2014-10-27,107.8
2014-10-28,107.54
2014-10-29,105.81
2014-10-30,91.11
2014-10-31,92.82
2014-11-03,91.26
2014-11-04,89.98
2014-11-05,87.71
2014-11-06,90.2
2014-11-07,86.02
2014-11-10,87.83
2014-11-11,86.98
2014-11-12,89.41
2014-11-13,88.95
2014-11-14,88.1
2014-11-17,87.56
2014-11-18,90.74
2014-11-19,89.17
2014-11-20,91.71
2014-11-21,88.73
2014-11-24,92.65
2014-11-25,94.88
2014-11-26,96.25
2014-11-28,93.93
2014-12-01,90.88
2014-12-02,91.63
2014-12-03,95.29
2014-12-04,93.93
2014-12-05,94.63
2014-12-08,93.32
2014-12-09,94.85
2014-12-10,91.73
2014-12-11,93.23
2014-12-12,91.11
2014-12-15,91
2014-12-16,91
2014-12-17,92.47
2014-12-18,93.94
2014-12-19,94.47
2014-12-22,95.11
2014-12-23,93.88
2014-12-24,92.09
2014-12-26,93.51
2014-12-29,93.96
2014-12-30,90.73
2014-12-31,88.66
2015-01-02,91.24
2015-01-05,86.2
2015-01-06,85.01
2015-01-07,88.69
2015-01-08,91.5
2015-01-09,93.7
2015-01-12,90.905
2015-01-13,96.08
2015-01-14,98.56
2015-01-15,94.62
2015-01-16,98.68
2015-01-20,101.92
2015-01-21,99.82
2015-01-22,100.41
2015-01-23,106.54
2015-01-26,105.44
2015-01-27,106.47
2015-01-28,101.54
2015-01-29,109.46
2015-01-30,107.35
2015-02-02,109.19
2015-02-03,107.33
2015-02-04,106.67
2015-02-05,111.75
2015-02-06,110.12
2015-02-09,109.95
2015-02-10,112.74
2015-02-11,116.14
2015-02-12,114.85
2015-02-13,113.94
2015-02-17,116.96
2015-02-18,115.83
2015-02-19,115.625
2015-02-20,117.33
2015-02-23,118.04
2015-02-24,115.11
2015-02-25,119.27
2015-02-26,115.99
2015-02-27,114.77
2015-03-02,92.3
2015-03-03,93.94
2015-03-04,95.39
2015-03-05,98.4
2015-03-06,96.63
2015-03-09,95.29
2015-03-10,92.43
2015-03-11,92.12
2015-03-12,95.37
2015-03-13,92.9
2015-03-16,97.07
2015-03-17,96.18
2015-03-18,98.13
2015-03-19,97.72
2015-03-20,97.64
2015-03-23,95
2015-03-24,93.6
2015-03-25,89.92
2015-03-26,91.11
2015-03-27,92.6
2015-03-30,90.71
2015-03-31,88.85
2015-04-01,85.76
2015-04-02,86.81
2015-04-06,85.98
2015-04-07,86.84
2015-04-08,89.73
2015-04-09,87.54
2015-04-10,87.67
2015-04-13,89.33
2015-04-14,89.46
2015-04-15,92.39
2015-04-16,83.47
2015-04-17,84.65
2015-04-20,84.2
2015-04-21,84.02
2015-04-22,83.61
2015-04-23,84.27
2015-04-24,85.07
2015-04-27,83.05
2015-04-28,82.11
2015-04-29,82.12
2015-04-30,68.48
2015-05-01,68.81
2015-05-04,66.87
2015-05-05,65.78
2015-05-06,68.54
2015-05-07,71.53
2015-05-08,74.21
2015-05-11,75.1
2015-05-12,75.5
2015-05-13,74.39
2015-05-14,76.88
2015-05-15,77.83
2015-05-18,78.72
2015-05-19,78.76
2015-05-20,78.04
2015-05-21,77.58
2015-05-22,77.62
2015-05-26,77.02
2015-05-27,78.16
2015-05-28,80.08
2015-05-29,78.21
2015-06-01,79.82
2015-06-02,78.41
2015-06-03,79.43
2015-06-04,78.76
2015-06-05,80.64
2015-06-08,78.58
2015-06-09,77.08
2015-06-10,78.96
2015-06-11,79.13
2015-06-12,79.18
2015-06-15,78.56
2015-06-16,75.81
2015-06-17,77.14
2015-06-18,78.18
2015-06-19,75.17
2015-06-22,74.99
2015-06-23,74.69
2015-06-24,71.2
2015-06-25,70.83
2015-06-26,70.28
2015-06-29,67.75
2015-06-30,70.72
2015-07-01,70
2015-07-02,69.54
2015-07-06,69.31
2015-07-07,68.68
2015-07-08,66.24
2015-07-09,67.34
2015-07-10,67.54
2015-07-13,67.11
2015-07-14,67.55
2015-07-15,66.64
2015-07-16,64.56
2015-07-17,61.76
2015-07-20,63.44
2015-07-21,62.89
2015-07-22,62.13
2015-07-23,62.1
2015-07-24,62.31
2015-07-27,59.5
2015-07-28,59.64
2015-07-29,58.7
2015-07-30,61.8
2015-07-31,66.42
2015-08-03,64.42
2015-08-04,64.96
2015-08-05,65.36
2015-08-06,64.06
2015-08-07,64.72
2015-08-10,64.89
2015-08-11,63.7
2015-08-12,62.56
2015-08-13,61.69
2015-08-14,60.94
2015-08-17,61.9
2015-08-18,62.03
2015-08-19,63.81
2015-08-20,59.43
2015-08-21,59.95
2015-08-24,57.5
2015-08-25,56.95
2015-08-26,57.95
2015-08-27,58.82
2015-08-28,58.83
2015-08-31,57.55
2015-09-01,56.28
2015-09-02,56.99
2015-09-03,56.62
2015-09-04,56.23
2015-09-08,57.47
2015-09-09,60.18
2015-09-10,61.39
2015-09-11,62.76
2015-09-14,63.67
2015-09-15,67
2015-09-16,65.66
2015-09-17,68.21
2015-09-18,66.73
2015-09-21,63.46
2015-09-22,60.63
2015-09-23,55.99
2015-09-24,51.47
2015-09-25,47.62
2015-09-28,40.95
2015-09-29,42.36
2015-09-30,41.1
2015-10-01,39.55
2015-10-02,40.74
2015-10-05,42.75
2015-10-06,36.62
2015-10-07,38.54
2015-10-08,40.5
2015-10-09,42.18
2015-10-12,39.62
2015-10-13,36.99
2015-10-14,36.99
2015-10-15,38.79
2015-10-16,39.57
2015-10-19,41.13
2015-10-20,41.31
2015-10-21,39.43
2015-10-22,38
2015-10-23,43.38
2015-10-26,41.13
2015-10-27,49.12
2015-10-28,50.88
2015-10-29,50.94
2015-10-30,49.95
2015-11-02,52.13
2015-11-03,55.34
2015-11-04,55.49
2015-11-05,55.95
2015-11-06,56.88
2015-11-09,55.82
2015-11-10,56.27
2015-11-11,54.29
2015-11-12,54.15
2015-11-13,56.29
2015-11-16,55.72
2015-11-17,56.54
2015-11-18,57.94
2015-11-19,58.81
2015-11-20,60.5
2015-11-23,61.54
2015-11-24,61.14
2015-11-25,64.93
2015-11-27,65.11
2015-11-30,64.75
2015-12-01,66.89
2015-12-02,63.19
2015-12-03,63.35
2015-12-04,64.48
2015-12-07,62.23
2015-12-08,63.16
2015-12-09,63.59
2015-12-10,63.94
2015-12-11,62.05
2015-12-14,62.43
2015-12-15,70.89
2015-12-16,72.98
2015-12-17,73.62
2015-12-18,76.11
2015-12-21,75.08
2015-12-22,75.94
2015-12-23,78.29
2015-12-24,77.87
2015-12-28,76.97
2015-12-29,79.39
2015-12-30,77.02
2015-12-31,76.79
2016-01-04,75.63
2016-01-05,74.47
2016-01-06,75.12
2016-01-07,67.54
2016-01-08,67.56
2016-01-11,63.55
2016-01-12,64.84
2016-01-13,61.39
2016-01-14,65.5
2016-01-15,67.32
2016-01-19,66.62
2016-01-20,68.66
2016-01-21,64.71
2016-01-22,66.01
2016-01-25,65.32
2016-01-26,64.98
2016-01-27,63.33
2016-01-28,57.56
2016-01-29,59.42
2016-02-01,63.84
2016-02-02,61.48
2016-02-03,62.86
2016-02-04,64.22
2016-02-05,63.1
2016-02-08,58.22
2016-02-09,57.7
2016-02-10,57.92
2016-02-11,56.28
2016-02-12,57.04
2016-02-16,59.47
2016-02-17,61.94
2016-02-18,60.17
2016-02-19,61.43
2016-02-22,63.2
2016-02-23,60.39
2016-02-24,59.61
2016-02-25,57.26
2016-02-26,56.02
2016-02-29,52.01
2016-03-01,51.13
2016-03-02,54.57
2016-03-03,54.25
2016-03-04,54.25
2016-03-07,54.23
2016-03-08,50.13
2016-03-09,50.68
2016-03-10,50.35
2016-03-11,52.38
2016-03-14,54
2016-03-15,50.27
2016-03-16,48.24
2016-03-17,45.36
2016-03-18,47.82
2016-03-21,48.05
2016-03-22,50.09
2016-03-23,48.66
2016-03-24,48.71
2016-03-28,46.97
2016-03-29,50.31
2016-03-30,50.86
2016-03-31,52.98
2016-04-01,54.34
2016-04-04,55.51
2016-04-05,56.17
2016-04-06,57.96
2016-04-07,59.36
2016-04-08,60.58
2016-04-11,60.28
2016-04-12,60.65
2016-04-13,64.04
2016-04-14,64.32
2016-04-15,64.56
2016-04-18,63.95
2016-04-19,64.11
2016-04-20,60.7
2016-04-21,61.74
2016-04-22,61.91
2016-04-25,60.06
2016-04-26,60.09
2016-04-27,57.19
2016-04-28,55.55
2016-04-29,54.11
2016-05-02,50.51
2016-05-03,51.54
2016-05-04,48.83
2016-05-05,47.89
2016-05-06,47.36
2016-05-09,48.45
2016-05-10,49.59
2016-05-11,47.04
2016-05-12,43.76
2016-05-13,43.21
2016-05-16,45.16
2016-05-17,44.12
2016-05-18,43.7
2016-05-19,42.97
2016-05-20,43.9
2016-05-23,43.46
2016-05-24,46.02
2016-05-25,43.44
2016-05-26,43.7
2016-05-27,45.56
2016-05-31,46.51
2016-06-01,47.34
2016-06-02,48.18
2016-06-03,47.09
2016-06-06,48.4
2016-06-07,48.19
2016-06-08,47.04
2016-06-09,45.41
2016-06-10,44.07
2016-06-13,43.25
2016-06-14,42.15
2016-06-15,40.34
2016-06-16,39.77
2016-06-17,38.6
2016-06-20,38.36
2016-06-21,37.91
2016-06-22,37.93
2016-06-23,39.99
2016-06-24,38.85
2016-06-27,37.98
2016-06-28,38.88
2016-06-29,38.01
2016-06-30,33.73
2016-07-01,33.48
2016-07-05,33.49
2016-07-06,35.21
2016-07-07,35.86
2016-07-08,36.39
2016-07-11,36.49
2016-07-12,36.95
2016-07-13,34.78
2016-07-14,35.83
2016-07-15,36.79
2016-07-18,36.27
2016-07-19,35.69
2016-07-20,38.53
2016-07-21,37.64
2016-07-22,38.35
2016-07-25,37.66
2016-07-26,36.69
2016-07-27,36.9
2016-07-28,37.47
2016-07-29,36.25
2016-08-01,37.58
2016-08-02,38.08
2016-08-03,37.49
2016-08-04,44.63
2016-08-05,43.54
2016-08-08,43.11
2016-08-09,45.4
2016-08-10,43.72
2016-08-11,44.96
2016-08-12,45.51
2016-08-15,45.27
2016-08-16,43.87
2016-08-17,43.15
2016-08-18,43.14
2016-08-19,42.34
2016-08-22,42.95
2016-08-23,43.4
2016-08-24,39.86
2016-08-25,39.6
2016-08-26,40.21
2016-08-29,39.49
2016-08-30,41.08
2016-08-31,39.63
2016-09-01,40.37
2016-09-02,39.04
2016-09-06,40.79
2016-09-07,40.54
2016-09-08,41.18
2016-09-09,38.93
2016-09-12,40.32
2016-09-13,40.84
2016-09-14,40.87
2016-09-15,40.54
2016-09-16,42.33
2016-09-19,41.11
2016-09-20,40.37
2016-09-21,36.81
2016-09-22,37.52
2016-09-23,36.86
2016-09-26,35
2016-09-27,35.46
2016-09-28,35.55
2016-09-29,34.02
2016-09-30,34.22
2016-10-03,35.8
2016-10-04,35.63
2016-10-05,36.13
2016-10-06,34.76
2016-10-07,34.66
2016-10-10,35.73
2016-10-11,34.53
2016-10-12,33.64
2016-10-13,33.25
2016-10-14,33.19
2016-10-17,33.65
2016-10-18,34.65
2016-10-19,32.8
2016-10-20,33.3
2016-10-21,33.6
2016-10-24,34.7
2016-10-25,36.55
2016-10-26,35.5
2016-10-27,34.4
2016-10-28,33.15
2016-10-31,31.8
2016-11-01,32.15
2016-11-02,33.35
2016-11-03,30.65
2016-11-04,32.1
2016-11-07,31.2
2016-11-08,31.65
2016-11-09,34.15
2016-11-10,37.3
2016-11-11,36.8
2016-11-14,37.5
2016-11-15,37.6
2016-11-16,36.5
2016-11-17,36.55
2016-11-18,36
2016-11-21,35.05
2016-11-22,34.35
2016-11-23,32.45
2016-11-25,32.85
2016-11-28,31.4
2016-11-29,32.15
2016-11-30,31.85
2016-12-01,30.55
2016-12-02,30.25
2016-12-05,30.85
2016-12-06,32
2016-12-07,32.35
2016-12-08,33.2
2016-12-09,33.35
2016-12-12,31.6
2016-12-13,31.675
2016-12-14,30.8
2016-12-15,31.25
2016-12-16,32.4
2016-12-19,32.8
2016-12-20,31.9
2016-12-21,30.8
2016-12-22,31.6
2016-12-23,33.3
2016-12-27,32.15
2016-12-28,30.9
2016-12-29,31.25
2016-12-30,32.3
2017-01-03,34.75
2017-01-04,36.75
2017-01-05,34.15
2017-01-06,40.05
2017-01-09,39.55
2017-01-10,38.95
2017-01-11,38.05
2017-01-12,39.45
2017-01-13,39.7
2017-01-17,39.5
2017-01-18,39.6
2017-01-19,40.95
2017-01-20,40.1
2017-01-23,39.2
2017-01-24,38.95
2017-01-25,38.85
2017-01-26,37.45
2017-01-27,37.25
2017-01-30,36.45
2017-01-31,38.45
2017-02-01,40.35
2017-02-02,41.9
2017-02-03,42.5
2017-02-06,41.8
2017-02-07,41.75
2017-02-08,42.05
2017-02-09,42.4
2017-02-10,42.05
2017-02-13,41.6
2017-02-14,42.65
2017-02-15,44.15
2017-02-16,43.4
2017-02-17,43.7
2017-02-21,44.15
2017-02-22,43.15
2017-02-23,43.9
2017-02-24,43.45
2017-02-27,45.6
2017-02-28,43.7
2017-03-01,49.55
2017-03-02,49.4
2017-03-03,50.45
2017-03-06,48.45
2017-03-07,48.65
2017-03-08,48.4
2017-03-09,47
2017-03-10,46.65
2017-03-13,46.4
2017-03-14,46.7
2017-03-15,48
2017-03-16,48.95
2017-03-17,47.4
2017-03-20,48.65
2017-03-21,46.75
2017-03-22,48.15
2017-03-23,46.95
2017-03-24,46.9
2017-03-27,47.55
2017-03-28,47.4
2017-03-29,47.6
2017-03-30,45.85
2017-03-31,45.6
2017-04-03,46.25
2017-04-04,46.15
2017-04-05,45.7
2017-04-06,46
2017-04-07,46.15
2017-04-10,47
2017-04-11,46.45
2017-04-12,45.5
2017-04-13,45.9
2017-04-17,45.7
2017-04-18,43.85
2017-04-19,45
2017-04-20,45.8
2017-04-21,45.2
2017-04-24,46.4
2017-04-25,46.3
2017-04-26,47.3
2017-04-27,48.05
2017-04-28,48.55
2017-05-01,48.9
2017-05-02,48.15
2017-05-03,45.8
2017-05-04,46.8
2017-05-05,47.85
2017-05-08,47.7
2017-05-09,48.8
2017-05-10,49.15
2017-05-11,51.15
2017-05-12,51.7
2017-05-15,51.2
2017-05-16,50.45
2017-05-17,48.2
2017-05-18,48.05
2017-05-19,48.3
2017-05-22,47
2017-05-23,47.2
2017-05-24,46.3
2017-05-25,45.45
2017-05-26,45.15
2017-05-30,45.4
2017-05-31,44.4
2017-06-01,44.7
2017-06-02,44.1
2017-06-05,44.25
2017-06-06,44.2
2017-06-07,43.5
2017-06-08,44.5
2017-06-09,44.2
2017-06-12,42.2
2017-06-13,43.45
2017-06-14,44.2
2017-06-15,43.75
2017-06-16,42.3
2017-06-19,44.65
2017-06-20,43.55
2017-06-21,46.9
2017-06-22,47.85
2017-06-23,47.45
2017-06-26,47.45
2017-06-27,46.45
2017-06-28,47.2
2017-06-29,48.2
2017-06-30,47.7
2017-07-03,48.3
2017-07-05,49.1
2017-07-06,49.75
2017-07-07,50.4
2017-07-10,49.35
2017-07-11,49.7
2017-07-12,50.45
2017-07-13,50
2017-07-14,49.3
2017-07-17,49.15
2017-07-18,49.2
2017-07-19,49
2017-07-20,49.15
2017-07-21,47.65
2017-07-24,48.7
2017-07-25,42.65
2017-07-26,41.625
2017-07-27,39.55
2017-07-28,40
2017-07-31,39.5
2017-08-01,39.15
2017-08-02,38.4
2017-08-03,37.8
2017-08-04,37.225
2017-08-07,36.55
2017-08-08,36.7
2017-08-09,36.65
2017-08-10,36.2
2017-08-11,36.4
2017-08-14,36.8
2017-08-15,37.05
2017-08-16,37.15
2017-08-17,36.05
2017-08-18,35.8
2017-08-21,35.75
2017-08-22,35.85
2017-08-23,36
2017-08-24,37
2017-08-25,35.75
2017-08-28,36.3
2017-08-29,36.65
2017-08-30,36.7
2017-08-31,38.1
2017-09-01,38
2017-09-05,36.9
2017-09-06,37.15
2017-09-07,36.4
2017-09-08,37.1
2017-09-11,37.5
2017-09-12,38
2017-09-13,37.8
2017-09-14,37.85
2017-09-15,37.05
2017-09-18,36.3
2017-09-19,35.7
2017-09-20,35.9
2017-09-21,36.45
2017-09-22,37.2
2017-09-25,37.5
2017-09-26,38.15
2017-09-27,39.35
2017-09-28,38.7
2017-09-29,37.55
2017-10-02,37.8
2017-10-03,37.45
2017-10-04,36.3
2017-10-05,36.95
2017-10-06,36.55
2017-10-09,35.05
2017-10-10,34.95
2017-10-11,34.4
2017-10-12,34.2
2017-10-13,34.25
2017-10-16,34.55
2017-10-17,34.2
2017-10-18,33.05
2017-10-19,33.1
2017-10-20,33.5
2017-10-23,32.95
2017-10-24,33.4
2017-10-25,31.85
2017-10-26,32.55
2017-10-27,33.2
2017-10-30,33.15
2017-10-31,32.05
2017-11-01,32.6
2017-11-02,33.05
2017-11-03,36.1
2017-11-06,36.3
2017-11-07,35.05
2017-11-08,41
2017-11-09,40.15
2017-11-10,42.05
2017-11-13,42.75
2017-11-14,39.925
2017-11-15,38.725
2017-11-16,39.5
2017-11-17,40.25
2017-11-20,42.2
2017-11-21,42.65
2017-11-22,44.5
2017-11-24,45.95
2017-11-27,44.95
2017-11-28,46.95
2017-11-29,46.1
2017-11-30,46.2
2017-12-01,45.25
2017-12-04,43.95
2017-12-05,42.7
2017-12-06,43.3
2017-12-07,44.2
2017-12-08,44.8
2017-12-11,44.2
2017-12-12,45.35
2017-12-13,45.8
2017-12-14,44.7
2017-12-15,43.85
2017-12-18,42.55
2017-12-19,41.65
2017-12-20,42.85
2017-12-21,43.55
2017-12-22,44.15
2017-12-26,45.4
2017-12-27,45.1
2017-12-28,45.45
2017-12-29,45.65
2018-01-02,46.3
2018-01-03,46.35
2018-01-04,42.9
2018-01-05,42.45
2018-01-08,42.7
2018-01-09,42.75
2018-01-10,41.5
2018-01-11,42.225
2018-01-12,41.5
2018-01-16,40.3
2018-01-17,40.3
2018-01-18,39.1
2018-01-19,38.75
2018-01-22,39.35
2018-01-23,39.05
2018-01-24,38.95
2018-01-25,38.65
2018-01-26,40.2
2018-01-29,38.05
2018-01-30,36.45
2018-01-31,36.4
2018-02-01,38.95
2018-02-02,38.5
2018-02-05,37.2
2018-02-06,37.6
2018-02-07,38
2018-02-08,35.8
2018-02-09,37.4
2018-02-12,36.35
2018-02-13,35.9
2018-02-14,36.1
2018-02-15,36.1
2018-02-16,30.15
2018-02-20,31.25
2018-02-21,30.15
2018-02-22,30.55
2018-02-23,31.25
2018-02-26,31.8
2018-02-27,31.2
2018-02-28,31.3
2018-03-01,32.7
2018-03-02,33.25
2018-03-05,31.875
2018-03-06,31.375
2018-03-07,31.65
2018-03-08,31.7
2018-03-09,31.9
2018-03-12,32.25
2018-03-13,31.85
2018-03-14,30.55
2018-03-15,30.15
2018-03-16,30.9
2018-03-19,30.675
2018-03-20,29.975
2018-03-21,32.25
2018-03-22,32
2018-03-23,32.3
2018-03-26,31.8
2018-03-27,31.4
2018-03-28,30.95
2018-03-29,31.15
2018-04-02,27.5
2018-04-03,28
2018-04-04,28.85
2018-04-05,29.5
2018-04-06,33.3
2018-04-09,34.5
2018-04-10,36.7
2018-04-11,35.65
2018-04-12,34.55
2018-04-13,33.45
2018-04-16,35.75
2018-04-17,35.6
2018-04-18,35.7
2018-04-19,35.45
2018-04-20,36
2018-04-23,35.4
2018-04-24,35.3
2018-04-25,34.5
2018-04-26,34.45
2018-04-27,33.65
2018-04-30,33.1
2018-05-01,34
2018-05-02,34.375
2018-05-03,33.1
2018-05-04,33.95
2018-05-07,33.6
2018-05-08,32.8
2018-05-09,34.3
2018-05-10,34.35
2018-05-11,34.5
2018-05-14,34.8
2018-05-15,33.6
2018-05-16,34.6
2018-05-17,34.9
2018-05-18,34.9
2018-05-21,34.15
2018-05-22,34.05
2018-05-23,34.95
2018-05-24,35.35
2018-05-25,35.55
2018-05-29,35.2
2018-05-30,35.2
2018-05-31,34.25
2018-06-01,34
2018-06-04,34
2018-06-05,35.25
2018-06-06,37.5
2018-06-07,36.45
2018-06-08,37.2
2018-06-11,37.75
2018-06-12,38.5
2018-06-13,38.35
2018-06-14,38.45
2018-06-15,37.65
2018-06-18,37.2
2018-06-19,38.05
2018-06-20,39.8
2018-06-21,34.25
2018-06-22,33.75
2018-06-25,32.1
2018-06-26,32.25
2018-06-27,30.55
2018-06-28,31.05
2018-06-29,32.05
2018-07-02,32.85
2018-07-03,33.1
2018-07-05,33.9
2018-07-06,34
2018-07-09,34.35
2018-07-10,34.5
2018-07-11,35.9
2018-07-12,36.5
2018-07-13,36.4
2018-07-16,36.65
2018-07-17,36.9
2018-07-18,37.05
2018-07-19,37
2018-07-20,37.25
2018-07-23,37.65
2018-07-24,36.85
2018-07-25,36.25
2018-07-26,40.8
2018-07-27,41
2018-07-30,40.05
2018-07-31,40.2
2018-08-01,40.6
2018-08-02,43
2018-08-03,45.2
2018-08-06,45.2
2018-08-07,44.75
2018-08-08,45.1
2018-08-09,45.225
2018-08-10,45.95
2018-08-13,46.95
2018-08-14,46.8
2018-08-15,47.95
2018-08-16,46.2
2018-08-17,46.35
2018-08-20,45
2018-08-21,45.15
2018-08-22,45.25
2018-08-23,46.35
2018-08-24,46.2
2018-08-27,45.05
2018-08-28,45.3
2018-08-29,46.25
2018-08-30,45.9
2018-08-31,47.15
2018-09-04,46.7
2018-09-05,46.55
2018-09-06,45.2
2018-09-07,44.95
2018-09-10,44.5
2018-09-11,45.4
2018-09-12,46.45
2018-09-13,47.35
2018-09-14,46.55
2018-09-17,46.25
2018-09-18,47.85
2018-09-19,51.35
2018-09-20,52
2018-09-21,50.5
2018-09-24,50.45
2018-09-25,48.7
2018-09-26,48.95
2018-09-27,48.4
2018-09-28,49.15
2018-10-01,47.73
2018-10-02,47.16
2018-10-03,47.36
2018-10-04,45.41
2018-10-05,45.34
2018-10-08,45.16
2018-10-09,47.4
2018-10-10,45.57
2018-10-11,44.05
2018-10-12,44.14
2018-10-15,45.32
2018-10-16,47.01
2018-10-17,48.04
2018-10-18,48.21
2018-10-19,47
2018-10-22,46.59
2018-10-23,46.56
2018-10-24,46.77
2018-10-25,46.18
2018-10-26,45.97
2018-10-29,47.1
2018-10-30,49
2018-10-31,48.89
2018-11-01,52.16
2018-11-02,50.32
2018-11-05,48.66
2018-11-06,49.65
2018-11-07,51.13
2018-11-08,50.95
2018-11-09,49.52
2018-11-12,48.34
2018-11-13,47.87
2018-11-14,47.54
2018-11-15,47.27
2018-11-16,46.8
2018-11-19,46.08
2018-11-20,45.91
2018-11-21,46.73
2018-11-23,46.67
2018-11-26,48.71
2018-11-27,47.4
2018-11-28,48.09
2018-11-29,48.01
2018-11-30,48.33
2018-12-03,48.62
2018-12-04,48.32
2018-12-06,48.14
2018-12-07,46.23
2018-12-10,46.31
2018-12-11,47
2018-12-12,47.25
2018-12-13,45.8
2018-12-14,45.26
2018-12-17,45
2018-12-18,43.79
2018-12-19,44.21
2018-12-20,42.7
2018-12-21,41.56
2018-12-24,41.31
2018-12-26,43.92
2018-12-27,41.6
2018-12-28,42.51
2018-12-31,43.02
2019-01-02,41.79
2019-01-03,37.81
2019-01-04,38.06
2019-01-07,37.83
2019-01-08,39.42
2019-01-09,38.29
2019-01-10,38.17
2019-01-11,38.36
2019-01-14,37.59
2019-01-15,37.36
2019-01-16,38.34
2019-01-17,38.73
2019-01-18,40.04
2019-01-22,40.46
2019-01-23,39.81
2019-01-24,38.71
2019-01-25,38.86
2019-01-28,39.24
2019-01-29,39.96
2019-01-30,40.8
2019-01-31,40.68
2019-02-01,39.26
2019-02-04,40.08
2019-02-05,39.15
2019-02-06,38.6
2019-02-07,37.47
2019-02-08,37.58
2019-02-11,37.77
2019-02-12,37.87
2019-02-13,37.87
2019-02-14,39.68
2019-02-15,40.68
2019-02-19,39.94
2019-02-20,40.25
2019-02-21,39.61
2019-02-22,39.71
2019-02-25,39.5
2019-02-26,40.39
2019-02-27,40.63
2019-02-28,41.18
2019-03-01,42.17
2019-03-04,40.76
2019-03-05,39.08
2019-03-06,37.34
2019-03-07,36.72
2019-03-08,36.47
2019-03-11,37.78
2019-03-12,37.59
2019-03-13,38.73
2019-03-14,39.29
2019-03-15,38.62
2019-03-18,39.42
2019-03-19,40.78
2019-03-20,39.7
2019-03-21,39.75
2019-03-22,38.22
2019-03-25,37.99
2019-03-26,38.49
2019-03-27,38.22
2019-03-28,38.1
2019-03-29,38.06
2019-04-01,37.43
2019-04-02,37.97
2019-04-03,38.85
2019-04-04,39.13
2019-04-05,39.73
2019-04-08,39.88
2019-04-09,38.91
2019-04-10,38.09
2019-04-11,37.79
2019-04-12,37.77
2019-04-15,37.85
2019-04-16,38.12
2019-04-17,36.57
2019-04-18,36.81
2019-04-22,38.75
2019-04-23,39.15
2019-04-24,40.32
2019-04-25,40.19
2019-04-26,40.07
2019-04-29,39.84
2019-04-30,39.82
2019-05-01,46.25
2019-05-02,47.93
2019-05-03,46.81
2019-05-06,46.65
2019-05-07,46.29
2019-05-08,46.24
2019-05-09,46.98
2019-05-10,47.97
2019-05-13,46.9
2019-05-14,46.59
2019-05-15,45.6
2019-05-16,44.43
2019-05-17,43.73
2019-05-20,43.32
2019-05-21,43.88
2019-05-22,43.46
2019-05-23,43.33
2019-05-24,43.33
2019-05-28,42.57
2019-05-29,42.96
2019-05-30,44.46
2019-05-31,43.51
2019-06-03,42.52
2019-06-04,43.43
2019-06-05,43.54
2019-06-06,42.31
2019-06-07,44.24
2019-06-10,43.04
2019-06-11,43.06
2019-06-12,43.44
2019-06-13,44.38
2019-06-14,43.81
2019-06-17,42.765
2019-06-18,43.795
2019-06-19,44.02
2019-06-20,43.745
2019-06-21,44.1
2019-06-24,43.08
2019-06-25,43.71
2019-06-26,43.03
2019-06-27,43.735
2019-06-28,43.7
2019-07-01,42.59
2019-07-02,42.32
2019-07-03,43.14
2019-07-04,43.14
2019-07-05,43.17
2019-07-08,43.22
2019-07-09,43.62
2019-07-10,43.35
2019-07-11,42.38
2019-07-12,41.29
2019-07-15,40.935
2019-07-16,40.965
2019-07-17,40.53
2019-07-18,40.425
2019-07-19,39.88
2019-07-22,39.6
2019-07-23,39.995
2019-07-24,42.425
2019-07-25,42.245
2019-07-26,44.02
2019-07-29,44.375
2019-07-30,44.97
2019-07-31,44.005
2019-08-01,43.97
2019-08-02,43.78
2019-08-05,43.21
2019-08-06,43.625
2019-08-07,43.85
2019-08-08,42.34
2019-08-09,42.41
2019-08-12,40.425
2019-08-13,40.16
2019-08-14,39.245
2019-08-15,39.05
2019-08-16,38.255
2019-08-19,37.97
2019-08-20,37.985
2019-08-21,39.3
2019-08-22,37.98
2019-08-23,36.48
2019-08-26,36.865
2019-08-27,36.87
2019-08-28,36.045
2019-08-29,37.22
2019-08-30,37.335
2019-09-02,37.24
2019-09-03,36.39
2019-09-04,36.56
2019-09-05,36.675
2019-09-06,35.99
2019-09-09,35.69
2019-09-10,36.7
2019-09-11,37.415
2019-09-12,37.28
2019-09-13,38.17
2019-09-16,37.63
2019-09-17,37.94
2019-09-18,37.165
2019-09-19,37.09
2019-09-20,37.2
2019-09-23,37.205
2019-09-24,37.85
2019-09-25,40.575
2019-09-26,39.905
2019-09-27,39.945
2019-09-30,38.145
2019-10-01,36.905
2019-10-02,36.28
2019-10-03,38.37
2019-10-04,38.72
2019-10-07,39.24
2019-10-08,37.93
2019-10-09,36.75
2019-10-10,36.81
2019-10-11,37.685
2019-10-14,36.57
2019-10-15,37.625
2019-10-16,39.005
2019-10-17,38.915
2019-10-18,38.85
2019-10-21,39.67
2019-10-22,39.51
2019-10-23,39.3
2019-10-24,38.955
2019-10-25,39.595
2019-10-28,39.915
2019-10-29,40.75
2019-10-30,40.69
2019-10-31,40.465
2019-11-01,41.31
2019-11-04,41.72
2019-11-05,42.275
2019-11-06,41.66
2019-11-07,42.705
2019-11-08,44.01
2019-11-11,43.47
2019-11-12,42.82
2019-11-13,42.83
2019-11-14,42.6
2019-11-15,42.965
2019-11-18,43.05
2019-11-19,42.92
2019-11-20,44.15
2019-11-21,44.05
2019-11-22,44.24
2019-11-25,45.545
