date,close
2014-06-13,51.7354
2014-06-16,51.6739
2014-06-17,52.0428
2014-06-18,52.6928
2014-06-19,52.5698
2014-06-20,54.4847
2014-06-23,54.5198
2014-06-24,54.3617
2014-06-25,55.3367
2014-06-26,55.3718
2014-06-27,55.4245
2014-06-30,54.6076
2014-07-01,54.8975
2014-07-02,55.0732
2014-07-03,55.3894
2014-07-07,54.9941
2014-07-08,54.8624
2014-07-09,55.0029
2014-07-10,54.9239
2014-07-11,55.1961
2014-07-14,55.3455
2014-07-15,55.2137
2014-07-16,55.1698
2014-07-17,54.6867
2014-07-18,55.7495
2014-07-21,55.8988
2014-07-22,55.9691
2014-07-23,56.4346
2014-07-24,56.54
2014-07-25,56.0218
2014-07-28,55.6792
2014-07-29,55.1347
2014-07-30,55.0029
2014-07-31,53.6327
2014-08-01,54.1333
2014-08-04,54.1333
2014-08-05,53.4658
2014-08-06,53.6766
2014-08-07,53.009
2014-08-08,53.5624
2014-08-11,53.6502
2014-08-12,53.905
2014-08-13,53.6482
2014-08-14,54.1794
2014-08-15,53.8695
2014-08-18,54.3211
2014-08-19,55.0383
2014-08-20,54.9055
2014-08-21,54.9232
2014-08-22,55.18
2014-08-25,55.543
2014-08-26,55.6138
2014-08-27,55.7821
2014-08-28,55.8794
2014-08-29,56.2779
2014-09-02,56.3841
2014-09-03,56.8003
2014-09-04,56.8623
2014-09-05,57.305
2014-09-08,57.5529
2014-09-09,57.0571
2014-09-10,57.3581
2014-09-11,57.7123
2014-09-12,57.792
2014-09-15,57.7211
2014-09-16,58.2612
2014-09-17,58.3586
2014-09-18,58.9607
2014-09-19,58.9076
2014-09-22,58.5092
2014-09-23,58.3941
2014-09-24,58.6066
2014-09-25,58.0665
2014-09-26,57.9779
2014-09-29,57.854
2014-09-30,57.4201
2014-10-01,57.6237
2014-10-02,57.4024
2014-10-03,58.1461
2014-10-06,58.1019
2014-10-07,56.8623
2014-10-08,57.7654
2014-10-09,56.9331
2014-10-10,56.8003
2014-10-13,56.03
2014-10-14,55.906
2014-10-15,55.6669
2014-10-16,55.2068
2014-10-17,55.4102
2014-10-20,55.8706
2014-10-21,57.2696
2014-10-22,57.2696
2014-10-23,56.9774
2014-10-24,58.4826
2014-10-27,58.6154
2014-10-28,57.4024
2014-10-29,57.9868
2014-10-30,59.1467
2014-10-31,58.7305
2014-11-03,58.9165
2014-11-04,59.4743
2014-11-05,59.3149
2014-11-06,59.2883
2014-11-07,58.9696
2014-11-10,60.5191
2014-11-11,60.0764
2014-11-12,60.1089
2014-11-13,60.3586
2014-11-14,60.0464
2014-11-17,60.0108
2014-11-18,60.4477
2014-11-19,59.9394
2014-11-20,59.5738
2014-11-21,60.0732
2014-11-24,59.6897
2014-11-25,59.6184
2014-11-26,60.0375
2014-11-28,60.751
2014-12-01,61.0988
2014-12-02,62.7665
2014-12-03,63.4354
2014-12-04,64.5501
2014-12-05,64.0775
2014-12-08,64.9515
2014-12-09,64.3985
2014-12-10,63.364
2014-12-11,63.8634
2014-12-12,62.0263
2014-12-15,62.1333
2014-12-16,61.7676
2014-12-17,62.6773
2014-12-18,64.6126
2014-12-19,64.568
2014-12-22,63.694
2014-12-23,62.1957
2014-12-24,62.5703
2014-12-26,62.7754
2014-12-29,62.5168
2014-12-30,62.1065
2014-12-31,61.5269
2015-01-02,62.4811
2015-01-05,61.8657
2015-01-06,62.1779
2015-01-07,61.7409
2015-01-08,63.2035
2015-01-09,62.3652
2015-01-12,61.9103
2015-01-13,61.8747
2015-01-14,62.2136
2015-01-15,62.1957
2015-01-16,63.034
2015-01-20,64.238
2015-01-21,64.4253
2015-01-22,64.6215
2015-01-23,64.3272
2015-01-26,64.3093
2015-01-27,63.9705
2015-01-28,63.2927
2015-01-29,64.3093
2015-01-30,64.2112
2015-02-02,63.9348
2015-02-03,63.2213
2015-02-04,62.6238
2015-02-05,63.6851
2015-02-06,62.7487
2015-02-09,62.0798
2015-02-10,62.8735
2015-02-11,62.8286
2015-02-12,63.3495
2015-02-13,63.3765
2015-02-17,64.2747
2015-02-18,63.7807
2015-02-19,63.8795
2015-02-20,64.5621
2015-02-23,63.8525
2015-02-24,63.6819
2015-02-25,63.1968
2015-02-26,62.9004
2015-02-27,63.0262
2015-03-02,63.8795
2015-03-03,63.2058
2015-03-04,63.4573
2015-03-05,63.4034
2015-03-06,61.4454
2015-03-09,62.4963
2015-03-10,61.7777
2015-03-11,61.4903
2015-03-12,62.4783
2015-03-13,62.7747
2015-03-16,63.8346
2015-03-17,63.628
2015-03-18,66.0531
2015-03-19,66.6639
2015-03-20,68.3704
2015-03-23,68.586
2015-03-24,67.8674
2015-03-25,66.7896
2015-03-26,65.9633
2015-03-27,66.089
2015-03-30,66.3495
2015-03-31,65.2537
2015-04-01,64.2477
2015-04-02,63.9873
2015-04-06,64.0501
2015-04-07,64.4004
2015-04-08,64.8046
2015-04-09,64.9932
2015-04-10,66.3944
2015-04-13,66.0351
2015-04-14,65.9812
2015-04-15,66.2058
2015-04-16,66.0082
2015-04-17,65.092
2015-04-20,65.0381
2015-04-21,64.8585
2015-04-22,64.9393
2015-04-23,65.0292
2015-04-24,64.2926
2015-04-27,63.6729
2015-04-28,63.9334
2015-04-29,64.9214
2015-04-30,64.5531
2015-05-01,65.6759
2015-05-04,65.613
2015-05-05,64.589
2015-05-06,64.7148
2015-05-07,64.5082
2015-05-08,65.8016
2015-05-11,65.9902
2015-05-12,65.0651
2015-05-13,65.3884
2015-05-14,66.0758
2015-05-15,65.9311
2015-05-18,65.9672
2015-05-19,66.4285
2015-05-20,66.3471
2015-05-21,67.1701
2015-05-22,67.1972
2015-05-26,67.2063
2015-05-27,67.7399
2015-05-28,69.1055
2015-05-29,71.3575
2015-06-01,71.4479
2015-06-02,70.4983
2015-06-03,70.3898
2015-06-04,70.2541
2015-06-05,70.6521
2015-06-08,71.0138
2015-06-09,74.8575
2015-06-10,75.2283
2015-06-11,78.3124
2015-06-12,76.1599
2015-06-15,76.0423
2015-06-16,76.6754
2015-06-17,75.5449
2015-06-18,75.1017
2015-06-19,74.7309
2015-06-22,74.9932
2015-06-23,74.7671
2015-06-24,74.3963
2015-06-25,76.6935
2015-06-26,77.6431
2015-06-29,75.771
2015-06-30,75.5087
2015-07-01,76.7387
2015-07-02,77.9054
2015-07-06,78.0953
2015-07-07,80.2478
2015-07-08,78.9093
2015-07-09,79.1173
2015-07-10,79.8499
2015-07-13,80.3292
2015-07-14,80.2749
2015-07-15,78.1224
2015-07-16,78.8369
2015-07-17,79.0178
2015-07-20,79.47
2015-07-21,77.3899
2015-07-22,78.1224
2015-07-23,78.4661
2015-07-24,76.6211
2015-07-27,76.1056
2015-07-28,77.4894
2015-07-29,76.9558
2015-07-30,76.4583
2015-07-31,76.4312
2015-08-03,76.0966
2015-08-04,76.0152
2015-08-05,76.6302
2015-08-06,74.7942
2015-08-07,74.4053
2015-08-10,75.5268
2015-08-11,75.5539
2015-08-12,75.8633
2015-08-13,75.5448
2015-08-14,76.3455
2015-08-17,75.9452
2015-08-18,75.8724
2015-08-19,76.2181
2015-08-20,79.4572
2015-08-21,76.9096
2015-08-24,73.4522
2015-08-25,71.2048
2015-08-26,73.7888
2015-08-27,76.1908
2015-08-28,75.6904
2015-08-31,74.9261
2015-09-01,72.606
2015-09-02,74.4348
2015-09-03,74.2437
2015-09-04,73.0791
2015-09-08,75.4083
2015-09-09,73.7797
2015-09-10,73.5523
2015-09-11,74.4257
2015-09-14,74.5076
2015-09-15,75.4811
2015-09-16,76.8368
2015-09-17,81.8683
2015-09-18,80.5126
2015-09-21,79.6937
2015-09-22,79.8848
2015-09-23,78.8749
2015-09-24,77.6557
2015-09-25,76.482
2015-09-28,72.5514
2015-09-29,73.0427
2015-09-30,76.1453
2015-10-01,77.501
2015-10-02,79.63
2015-10-05,78.7657
2015-10-06,76.5821
2015-10-07,76.4183
2015-10-08,76.2181
2015-10-09,78.3745
2015-10-12,72.2785
2015-10-13,72.4422
2015-10-14,72.1056
2015-10-15,72.6606
2015-10-16,74.1618
2015-10-19,73.0154
2015-10-20,70.7772
2015-10-21,70.0675
2015-10-22,70.0402
2015-10-23,71.2503
2015-10-26,71.9782
2015-10-27,73.6159
2015-10-28,75.5812
2015-10-29,74.6077
2015-10-30,74.2164
2015-11-02,74.6441
2015-11-03,74.3074
2015-11-04,73.7433
2015-11-05,73.343
2015-11-06,73.2065
2015-11-09,72.2057
2015-11-10,73.3044
2015-11-11,73.8904
2015-11-12,73.1213
2015-11-13,72.8374
2015-11-16,74.3757
2015-11-17,74.4398
2015-11-18,76.5915
2015-11-19,76.6555
2015-11-20,77.3423
2015-11-23,77.5895
2015-11-24,76.802
2015-11-25,76.6739
2015-11-27,76.5915
2015-11-30,75.1173
2015-12-01,79.201
2015-12-02,77.4247
2015-12-03,76.0512
2015-12-04,79.3108
2015-12-07,79.0911
2015-12-08,79.1186
2015-12-09,76.7837
2015-12-10,77.7451
2015-12-11,76.2618
2015-12-14,77.5345
2015-12-15,78.3037
2015-12-16,79.0087
2015-12-17,78.9446
2015-12-18,77.6169
2015-12-21,78.7798
2015-12-22,78.6608
2015-12-23,78.9263
2015-12-24,78.6058
2015-12-28,78.2762
2015-12-29,78.9721
2015-12-30,78.9263
2015-12-31,77.15
2016-01-04,75.8773
2016-01-05,77.0126
2016-01-06,76.5274
2016-01-07,74.5405
2016-01-08,74.394
2016-01-11,73.4967
2016-01-12,73.6157
2016-01-13,72.6085
2016-01-14,75.5751
2016-01-15,74.3848
2016-01-19,76.2069
2016-01-20,75.6484
2016-01-21,74.5313
2016-01-22,75.5202
2016-01-25,74.8152
2016-01-26,75.0441
2016-01-27,74.8609
2016-01-28,70.3286
2016-01-29,72.4254
2016-02-01,71.7845
2016-02-02,69.8617
2016-02-03,69.6694
2016-02-04,68.0121
2016-02-05,68.0487
2016-02-08,67.9297
2016-02-09,67.5177
2016-02-10,67.3701
2016-02-11,65.8489
2016-02-12,65.7106
2016-02-16,67.6099
2016-02-17,68.8546
2016-02-18,67.7389
2016-02-19,66.946
2016-02-22,67.3148
2016-02-23,67.7389
2016-02-24,68.3198
2016-02-25,68.9836
2016-02-26,67.8588
2016-02-29,66.3836
2016-03-01,67.0659
2016-03-02,68.246
2016-03-03,67.5361
2016-03-04,67.8588
2016-03-07,67.6744
2016-03-08,67.3056
2016-03-09,67.8035
2016-03-10,67.324
2016-03-11,68.8269
2016-03-14,68.1446
2016-03-15,65.6829
2016-03-16,66.8262
2016-03-17,63.6729
2016-03-18,65.4155
2016-03-21,64.7701
2016-03-22,66.3099
2016-03-23,65.6184
2016-03-24,65.5723
2016-03-28,65.1113
2016-03-29,66.107
2016-03-30,66.1808
2016-03-31,66.3928
2016-04-01,67.6928
2016-04-04,67.4716
2016-04-05,67.3425
2016-04-06,68.9283
2016-04-07,68.7716
2016-04-08,68.5872
2016-04-11,68.1815
2016-04-12,68.7531
2016-04-13,69.2971
2016-04-14,69.7305
2016-04-15,69.6383
2016-04-18,71.1964
2016-04-19,71.2241
2016-04-20,71.0673
2016-04-21,71.3347
2016-04-22,71.7588
2016-04-25,71.8603
2016-04-26,70.3205
2016-04-27,70.5418
2016-04-28,70.4957
2016-04-29,69.6383
2016-05-02,70.7631
2016-05-03,70.3021
2016-05-04,69.0297
2016-05-05,69.3985
2016-05-06,68.7808
2016-05-09,69.6936
2016-05-10,70.8861
2016-05-11,70.8304
2016-05-12,70.5055
2016-05-13,70.849
2016-05-16,72.6682
2016-05-17,70.9047
2016-05-18,70.849
2016-05-19,68.974
2016-05-20,69.4381
2016-05-23,68.7605
2016-05-24,69.6052
2016-05-25,69.1875
2016-05-26,70.0971
2016-05-27,69.6052
2016-05-31,69.6423
2016-06-01,69.5588
2016-06-02,70.0414
2016-06-03,69.7259
2016-06-06,69.466
2016-06-07,69.336
2016-06-08,69.5309
2016-06-09,69.0854
2016-06-10,68.6399
2016-06-13,68.5563
2016-06-14,68.9833
2016-06-15,68.4171
2016-06-16,68.9183
2016-06-17,68.5563
2016-06-20,68.018
2016-06-21,67.359
2016-06-22,67.8231
2016-06-23,68.6306
2016-06-24,68.9926
2016-06-27,69.5124
2016-06-28,69.7537
2016-06-29,72.5383
2016-06-30,73.0952
2016-07-01,73.2808
2016-07-05,73.9213
2016-07-06,74.274
2016-07-07,73.6243
2016-07-08,73.9399
2016-07-11,73.4572
2016-07-12,73.9491
2016-07-13,73.6614
2016-07-14,74.8031
2016-07-15,74.4596
2016-07-18,74.209
2016-07-19,74.2276
2016-07-20,74.5153
2016-07-21,74.6267
2016-07-22,75.7313
2016-07-25,76.0933
2016-07-26,76.1954
2016-07-27,77.4113
2016-07-28,76.9751
2016-07-29,76.9379
2016-08-01,77.2071
2016-08-02,77.337
2016-08-03,76.7801
2016-08-04,76.5017
2016-08-05,75.7034
2016-08-08,75.7406
2016-08-09,75.6477
2016-08-10,74.769
2016-08-11,75.2548
2016-08-12,74.9371
2016-08-15,74.9745
2016-08-16,74.5822
2016-08-17,74.8344
2016-08-18,74.5261
2016-08-19,73.8535
2016-08-22,74.0684
2016-08-23,74.33
2016-08-24,73.2744
2016-08-25,72.8727
2016-08-26,73.0875
2016-08-29,73.4238
2016-08-30,72.6485
2016-08-31,72.6298
2016-09-01,72.1441
2016-09-02,71.7891
2016-09-06,73.3398
2016-09-07,73.4145
2016-09-08,74.6289
2016-09-09,73.0875
2016-09-12,73.8722
2016-09-13,73.3117
2016-09-14,73.1342
2016-09-15,73.6293
2016-09-16,73.6107
2016-09-19,73.947
2016-09-20,74.6195
2016-09-21,75.5443
2016-09-22,75.9367
2016-09-23,75.8152
2016-09-26,74.2832
2016-09-27,75.5537
2016-09-28,75.3949
2016-09-29,74.4888
2016-09-30,74.9745
2016-10-03,75.6658
2016-10-04,75.7685
2016-10-05,76.3664
2016-10-06,76.1048
2016-10-07,76.684
2016-10-10,77.5901
2016-10-11,76.4224
2016-10-12,75.2081
2016-10-13,74.7316
2016-10-14,74.0497
2016-10-17,73.3584
2016-10-18,73.5826
2016-10-19,73.3865
2016-10-20,73.5546
2016-10-21,73.0969
2016-10-24,72.4617
2016-10-25,72.6298
2016-10-26,71.705
2016-10-27,71.1445
2016-10-28,69.6219
2016-10-31,68.9773
2016-11-01,68.1739
2016-11-02,67.8657
2016-11-03,67.3612
2016-11-04,67.7162
2016-11-07,69.0147
2016-11-08,69.1454
2016-11-09,73.2277
2016-11-10,73.6602
2016-11-11,73.0302
2016-11-14,72.419
2016-11-15,72.7011
2016-11-16,72.3438
2016-11-17,73.0678
2016-11-18,72.09
2016-11-21,72.0617
2016-11-22,71.4506
2016-11-23,63.9379
2016-11-25,64.991
2016-11-28,63.1857
2016-11-29,63.1386
2016-11-30,63.1104
2016-12-01,62.0291
2016-12-02,63.6652
2016-12-05,63.2421
2016-12-06,63.7498
2016-12-07,63.3549
2016-12-08,63.1763
2016-12-09,63.7968
2016-12-12,63.5712
2016-12-13,64.5396
2016-12-14,63.6276
2016-12-15,67.1066
2016-12-16,68.9307
2016-12-19,69.0341
2016-12-20,68.9965
2016-12-21,68.8743
2016-12-22,68.8837
2016-12-23,69.382
2016-12-27,69.4008
2016-12-28,68.6956
2016-12-29,69.1657
2016-12-30,69.1563
2017-01-03,70.1436
2017-01-04,70.2564
2017-01-05,71.0745
2017-01-06,71.1497
2017-01-09,71.7138
2017-01-10,71.7138
2017-01-11,70.7642
2017-01-12,72.5413
2017-01-13,72.7763
2017-01-17,72.2592
2017-01-18,72.8986
2017-01-19,72.2498
2017-01-20,72.2216
2017-01-23,71.7609
2017-01-24,70.3787
2017-01-25,70.3787
2017-01-26,70.1248
2017-01-27,70.877
2017-01-30,70.2376
2017-01-31,72.4284
2017-02-01,72.9644
2017-02-02,72.7669
2017-02-03,72.6165
2017-02-06,73.1807
2017-02-07,73.0584
2017-02-08,73.4439
2017-02-09,73.0584
2017-02-10,73.143
2017-02-13,73.6164
2017-02-14,74.6008
2017-02-15,75.9639
2017-02-16,75.7651
2017-02-17,76.0964
2017-02-21,76.068
2017-02-22,76.7401
2017-02-23,78.1411
2017-02-24,78.444
2017-02-27,78.6238
2017-02-28,78.3872
2017-03-01,79.3716
2017-03-02,78.4818
2017-03-03,79.3054
2017-03-06,79.3527
2017-03-07,78.3209
2017-03-08,78.9551
2017-03-09,80.0342
2017-03-10,79.8544
2017-03-13,79.6461
2017-03-14,79.9491
2017-03-15,81.2932
2017-03-16,80.4507
2017-03-17,79.4758
2017-03-20,79.5704
2017-03-21,79.258
2017-03-22,79.8544
2017-03-23,79.9112
2017-03-24,79.684
2017-03-27,79.7408
2017-03-28,80.2236
2017-03-29,79.9301
2017-03-30,80.233
2017-03-31,79.6178
2017-04-03,79.9396
2017-04-04,81.492
2017-04-05,81.0566
2017-04-06,80.801
2017-04-07,80.7631
2017-04-10,80.9051
2017-04-11,81.3405
2017-04-12,81.6435
2017-04-13,81.2932
2017-04-17,77.9801
2017-04-18,76.8632
2017-04-19,76.5697
2017-04-20,77.5636
2017-04-21,77.5163
2017-04-24,78.9646
2017-04-25,76.8632
2017-04-26,76.636
2017-04-27,76.9862
2017-04-28,77.6772
2017-05-01,77.4501
2017-05-02,77.3365
2017-05-03,76.9105
2017-05-04,78.6049
2017-05-05,78.1032
2017-05-08,76.3615
2017-05-09,76.4751
2017-05-10,76.7212
2017-05-11,76.4259
2017-05-12,76.3973
2017-05-15,76.5021
2017-05-16,75.254
2017-05-17,74.4442
2017-05-18,74.5967
2017-05-19,74.1203
2017-05-22,73.3391
2017-05-23,74.3013
2017-05-24,74.2728
2017-05-25,74.6348
2017-05-26,74.3585
2017-05-30,74.6443
2017-05-31,75.8066
2017-06-01,76.2067
2017-06-02,76.3401
2017-06-05,75.597
2017-06-06,75.3493
2017-06-07,75.6351
2017-06-08,76.3115
2017-06-09,77.2071
2017-06-12,77.0737
2017-06-13,77.4071
2017-06-14,77.7406
2017-06-15,78.1693
2017-06-16,78.0073
2017-06-19,78.4456
2017-06-20,78.8362
2017-06-21,78.7314
2017-06-22,80.3224
2017-06-23,79.9223
2017-06-26,80.2938
2017-06-27,79.1125
2017-06-28,79.1696
2017-06-29,78.7886
2017-06-30,78.4075
2017-07-03,78.7886
2017-07-05,78.7886
2017-07-06,77.7406
2017-07-07,78.398
2017-07-10,78.3884
2017-07-11,78.4551
2017-07-12,79.5507
2017-07-13,80.0461
2017-07-14,80.3605
2017-07-17,79.6841
2017-07-18,79.7413
2017-07-19,80.2462
2017-07-20,80.7416
2017-07-21,80.6559
2017-07-24,80.7321
2017-07-25,78.3027
2017-07-26,77.9692
2017-07-27,79.0934
2017-07-28,79.1696
2017-07-31,78.7505
2017-08-01,78.417
2017-08-02,77.9502
2017-08-03,78.055
2017-08-04,78.417
2017-08-07,78.1884
2017-08-08,78.0931
2017-08-09,78.6647
2017-08-10,78.1693
2017-08-11,77.805
2017-08-14,78.131
2017-08-15,78.3419
2017-08-16,77.364
2017-08-17,74.5931
2017-08-18,73.8932
2017-08-21,74.1904
2017-08-22,75.0341
2017-08-23,74.9287
2017-08-24,75.6094
2017-08-25,75.5423
2017-08-28,75.5902
2017-08-29,75.3122
2017-08-30,77.1722
2017-08-31,77.9392
2017-09-01,76.7791
2017-09-05,76.5298
2017-09-06,77.1914
2017-09-07,78.1789
2017-09-08,79.502
2017-09-11,79.224
2017-09-12,78.783
2017-09-13,79.0322
2017-09-14,79.6459
2017-09-15,79.0418
2017-09-18,79.1185
2017-09-19,78.3611
2017-09-20,78.6391
2017-09-21,79.8951
2017-09-22,80.4512
2017-09-25,81.1511
2017-09-26,80.7485
2017-09-27,81.1607
2017-09-28,81.4963
2017-09-29,82.014
2017-10-02,82.7907
2017-10-03,82.8865
2017-10-04,83.3755
2017-10-05,84.0371
2017-10-06,83.4906
2017-10-09,83.4618
2017-10-10,82.6085
2017-10-11,82.5126
2017-10-12,82.8674
2017-10-13,82.9824
2017-10-16,82.4071
2017-10-17,82.5126
2017-10-18,82.1962
2017-10-19,82.8002
2017-10-20,83.6344
2017-10-23,83.5864
2017-10-24,81.6593
2017-10-25,81.3717
2017-10-26,80.6909
2017-10-27,80.4033
2017-10-30,79.2432
2017-10-31,78.5624
2017-11-01,79.4733
2017-11-02,79.7034
2017-11-03,80.0677
2017-11-06,79.5212
2017-11-07,79.8472
2017-11-08,80.5471
2017-11-09,80.5279
2017-11-10,79.8568
2017-11-13,79.4445
2017-11-14,79.5893
2017-11-15,79.2998
2017-11-16,80.5059
2017-11-17,79.9752
2017-11-20,80.255
2017-11-21,80.5734
2017-11-22,80.7374
2017-11-24,81.0751
2017-11-27,81.8277
2017-11-28,82.0592
2017-11-29,81.9724
2017-11-30,81.6637
2017-12-01,82.3198
2017-12-04,82.5706
2017-12-05,83.0337
2017-12-06,82.3198
2017-12-07,82.8504
2017-12-08,83.41
2017-12-11,83.6223
2017-12-12,83.6609
2017-12-13,84.7994
2017-12-14,83.4583
2017-12-15,83.4969
2017-12-18,83.053
2017-12-19,83.6609
2017-12-20,82.725
2017-12-21,82.5996
2017-12-22,82.0785
2017-12-26,82.0014
2017-12-27,82.1461
2017-12-28,82.0592
2017-12-29,81.49
2018-01-02,81.7023
2018-01-03,82.1461
2018-01-04,82.5127
2018-01-05,83.5258
2018-01-08,83.1013
2018-01-09,83.0337
2018-01-10,83.0723
2018-01-11,83.3521
2018-01-12,83.9214
2018-01-16,82.2908
2018-01-17,83.1785
2018-01-18,82.8022
2018-01-19,82.4838
2018-01-22,82.4355
2018-01-23,81.4514
2018-01-24,81.3356
2018-01-25,82.0207
2018-01-26,84.0179
2018-01-29,84.5196
2018-01-30,83.0627
2018-01-31,78.5858
2018-02-01,79.5121
2018-02-02,78.3253
2018-02-05,74.7651
2018-02-06,75.2475
2018-02-07,74.0222
2018-02-08,71.6004
2018-02-09,73.5494
2018-02-12,73.5687
2018-02-13,73.5301
2018-02-14,74.8739
2018-02-15,75.8362
2018-02-16,76.7596
2018-02-20,75.3794
2018-02-21,75.3794
2018-02-22,75.0294
2018-02-23,76.5458
2018-02-26,77.9357
2018-02-27,76.4972
2018-02-28,74.8642
2018-03-01,74.3587
2018-03-02,75.0683
2018-03-05,75.5252
2018-03-06,75.0294
2018-03-07,75.2724
2018-03-08,76.6819
2018-03-09,77.3817
2018-03-12,76.8277
2018-03-13,76.9346
2018-03-14,76.293
2018-03-15,76.5458
2018-03-16,78.2371
2018-03-19,76.5263
2018-03-20,76.1764
2018-03-21,76.05
2018-03-22,74.3879
2018-03-23,72.6675
2018-03-26,74.0477
2018-03-27,73.5423
2018-03-28,74.8545
2018-03-29,75.2044
2018-04-02,73.5811
2018-04-03,75.3696
2018-04-04,76.4
2018-04-05,76.4194
2018-04-06,74.699
2018-04-09,75.1752
2018-04-10,77.0026
2018-04-11,76.5263
2018-04-12,77.0707
2018-04-13,77.4886
2018-04-16,77.8774
2018-04-17,77.683
2018-04-18,77.4886
2018-04-19,77.5178
2018-04-20,76.8471
2018-04-23,77.9552
2018-04-24,77.8483
2018-04-25,78.8689
2018-04-26,80.2394
2018-04-27,80.4144
2018-04-30,78.8008
2018-05-01,76.8568
2018-05-02,76.6235
2018-05-03,75.8556
2018-05-04,76.2056
2018-05-07,76.4291
2018-05-08,76.6721
2018-05-09,77.0512
2018-05-10,78.5967
2018-05-11,80.1422
2018-05-14,80.7449
2018-05-15,79.9089
2018-05-16,79.4514
2018-05-17,79.9211
2018-05-18,80.3224
2018-05-21,80.0875
2018-05-22,80.4692
2018-05-23,80.9194
2018-05-24,80.9488
2018-05-25,81.0075
2018-05-29,80.6845
2018-05-30,82.0743
2018-05-31,83.2292
2018-06-01,83.0432
2018-06-04,83.2585
2018-06-05,83.0138
2018-06-06,84.1002
2018-06-07,84.0513
2018-06-08,84.247
2018-06-11,84.0317
2018-06-12,83.6696
2018-06-13,83.8947
2018-06-14,84.5113
2018-06-15,85.03
2018-06-18,84.2764
2018-06-19,84.9713
2018-06-20,84.4428
2018-06-21,84.2372
2018-06-22,84.0904
2018-06-25,83.9436
2018-06-26,83.2977
2018-06-27,82.867
2018-06-28,83.6696
2018-06-29,83.513
2018-07-02,84.0317
2018-07-03,84.6679
2018-07-05,84.7168
2018-07-06,85.5291
2018-07-09,85.9989
2018-07-10,86.1751
2018-07-11,85.6955
2018-07-12,87.0168
2018-07-13,87.7997
2018-07-16,87.1734
2018-07-17,87.6627
2018-07-18,88.1129
2018-07-19,87.5257
2018-07-20,86.5861
2018-07-23,86.9874
2018-07-24,91.3622
2018-07-25,94.3766
2018-07-26,93.1532
2018-07-27,94.543
2018-07-30,95.9328
2018-07-31,96.7059
2018-08-01,96.5983
2018-08-02,97.3519
2018-08-03,98.4383
2018-08-06,99.828
2018-08-07,99.7693
2018-08-08,100.0923
2018-08-09,100.014
2018-08-10,100.0727
2018-08-13,100.2587
2018-08-14,100.8122
2018-08-15,101.6881
2018-08-16,102.7017
2018-08-17,103.8728
2018-08-20,104.1385
2018-08-21,103.4004
2018-08-22,103.3611
2018-08-23,103.1544
2018-08-24,104.0893
2018-08-27,103.4398
2018-08-28,103.5087
2018-08-29,103.6563
2018-08-30,103.8039
2018-08-31,103.9712
2018-09-04,102.9576
2018-09-05,104.0401
2018-09-06,103.6957
2018-09-07,105.3293
2018-09-10,104.729
2018-09-11,103.9614
2018-09-12,104.2861
2018-09-13,104.8864
2018-09-14,104.0893
2018-09-17,104.0302
2018-09-18,105.1817
2018-09-19,104.0598
2018-09-20,104.3845
2018-09-21,104.6404
2018-09-24,103.9122
2018-09-25,104.0204
2018-09-26,104.6207
2018-09-27,104.9947
2018-09-28,105.6048
2018-10-01,105.8902
2018-10-02,106.2445
2018-10-03,106.894
2018-10-04,111.1946
2018-10-05,113.1923
2018-10-08,113.6253
2018-10-09,113.6155
2018-10-10,111.539
2018-10-11,106.1953
2018-10-12,108.7245
2018-10-15,108.8622
2018-10-16,109.2657
2018-10-17,111.785
2018-10-18,111.5095
2018-10-19,110.1416
2018-10-22,110.2498
2018-10-23,108.6359
2018-10-24,104.6306
2018-10-25,106.1756
2018-10-26,104.6994
2018-10-29,105.6934
2018-10-30,106.6185
2018-10-31,106.7169
2018-11-01,106.1461
2018-11-02,105.0537
2018-11-05,108.3899
2018-11-06,104.2172
2018-11-07,107.9765
2018-11-08,108.3505
2018-11-09,110.427
2018-11-12,111.4012
2018-11-13,110.6041
2018-11-14,108.6087
2018-11-15,110.9725
2018-11-16,112.5847
2018-11-19,114.543
2018-11-20,113.465
2018-11-21,111.0022
2018-11-23,111.6352
2018-11-26,111.1506
2018-11-27,112.9704
2018-11-28,114.2661
2018-11-29,115.72
2018-11-30,117.3421
2018-12-03,117.2234
2018-12-04,115.2453
2018-12-06,114.5727
2018-12-07,112.3374
2018-12-10,112.8419
2018-12-11,113.2474
2018-12-12,113.0891
2018-12-13,113.6034
2018-12-14,110.7055
2018-12-17,107.1745
2018-12-18,105.3349
2018-12-19,107.9163
2018-12-20,108.0944
2018-12-21,108.223
2018-12-24,105.5822
2018-12-26,109.8747
2018-12-27,111.655
2018-12-28,112.9507
2018-12-31,114.454
2019-01-02,113.6232
2019-01-03,110.0923
2019-01-04,113.4056
2019-01-07,114.0188
2019-01-08,115.0672
2019-01-09,115.9277
2019-01-10,114.6716
2019-01-11,114.909
2019-01-14,113.4254
2019-01-15,115.809
2019-01-16,115.5222
2019-01-17,117.8564
2019-01-18,115.3145
2019-01-22,115.809
2019-01-23,117.4904
2019-01-24,113.732
2019-01-25,113.7122
2019-01-28,113.7716
2019-01-29,114.4441
2019-01-30,115.6607
2019-01-31,118.5487
2019-02-01,119.5675
2019-02-04,118.8554
2019-02-05,119.1125
2019-02-06,117.9652
2019-02-07,116.2146
2019-02-08,118.2916
2019-02-11,116.719
2019-02-12,118.1828
2019-02-13,118.341
2019-02-14,120.0763
2019-02-15,121.7967
2019-02-19,121.4486
2019-02-20,121.9757
2019-02-21,122.0353
2019-02-22,123.3082
2019-02-25,123.1988
2019-02-26,123.9745
2019-02-27,124.9788
2019-02-28,125.5854
2019-03-01,128.1212
2019-03-04,126.7489
2019-03-05,127.7732
2019-03-06,125.9733
2019-03-07,125.6351
2019-03-08,125.9931
2019-03-11,121.4188
2019-03-12,123.195
2019-03-13,125.486
2019-03-14,122.3933
2019-03-15,123.2485
2019-03-18,124.5413
2019-03-19,125.8838
2019-03-20,127.445
2019-03-21,127.5942
2019-03-22,127.5842
2019-03-25,129.1455
2019-03-26,130.289
2019-03-27,128.0516
2019-03-28,128.2306
2019-03-29,129.0361
2019-04-01,128.33
2019-04-02,128.5985
2019-04-03,126.3412
2019-04-04,124.9092
2019-04-05,126.2815
2019-04-08,126.4506
2019-04-09,126.5301
2019-04-10,126.4804
2019-04-11,124.4518
2019-04-12,122.3734
2019-04-15,123.3878
2019-04-16,119.2907
2019-04-17,115.85
2019-04-18,114.5573
2019-04-22,114.8258
2019-04-23,116.8345
2019-04-24,117.3417
2019-04-25,117.5704
2019-04-26,119.2012
2019-04-29,118.9328
2019-04-30,116.387
2019-05-01,117.5207
2019-05-02,117.7991
2019-05-03,116.2578
2019-05-06,115.9992
2019-05-07,114.2987
2019-05-08,115.6014
2019-05-09,115.154
2019-05-10,115.5716
2019-05-13,113.7319
2019-05-14,114.2987
2019-05-15,114.975
2019-05-16,116.73
2019-05-17,116.01
2019-05-20,116.23
2019-05-21,116.58
2019-05-22,117.98
2019-05-23,116.81
2019-05-24,116.79
2019-05-28,115.76
2019-05-29,115.49
2019-05-30,115.9
2019-05-31,115.94
2019-06-03,116.77
2019-06-04,117.56
2019-06-05,117.02
2019-06-06,117.5
2019-06-07,118.35
2019-06-10,113.93
2019-06-11,112.21
2019-06-12,115.24
2019-06-13,111.77
2019-06-14,112.085
2019-06-17,113.08
2019-06-18,114.36
2019-06-19,115.18
2019-06-20,115.755
2019-06-21,115.74
2019-06-24,115.935
2019-06-25,115.7
2019-06-26,111.39
2019-06-27,111.46
2019-06-28,110.25
2019-07-01,112.56
2019-07-02,114.01
2019-07-03,114.6
2019-07-04,114.6
2019-07-05,112.845
2019-07-08,111.3
2019-07-09,112.75
2019-07-10,114.425
2019-07-11,109.59
2019-07-12,108.02
2019-07-15,108.16
2019-07-16,108.925
2019-07-17,107.3
2019-07-18,108.39
2019-07-19,106.85
2019-07-22,107.28
2019-07-23,108.22
2019-07-24,108.405
2019-07-25,107.845
2019-07-26,108.38
2019-07-29,108.8
2019-07-30,108.54
2019-07-31,109.04
2019-08-01,110.3
2019-08-02,112.5
2019-08-05,108.875
2019-08-06,111.37
2019-08-07,111.225
2019-08-08,113.8
2019-08-09,113.85
2019-08-12,113.68
2019-08-13,115.755
2019-08-14,110.31
2019-08-15,110.375
2019-08-16,110.61
2019-08-19,112.61
2019-08-20,111.09
2019-08-21,111.58
2019-08-22,111.81
2019-08-23,109.02
2019-08-26,111.61
2019-08-27,110.85
2019-08-28,110.93
2019-08-29,112.18
2019-08-30,112.96
2019-09-02,112.93
2019-09-03,113.82
2019-09-04,113.25
2019-09-05,114.58
2019-09-06,114.12
2019-09-09,111.115
2019-09-10,110.99
2019-09-11,111.605
2019-09-12,111.61
2019-09-13,110.74
2019-09-16,110.125
2019-09-17,111.125
2019-09-18,112.595
2019-09-19,114.35
2019-09-20,116.415
2019-09-23,114.195
2019-09-24,113.15
2019-09-25,111.5
2019-09-26,111.8
2019-09-27,112.28
2019-09-30,111.815
2019-10-01,110.92
2019-10-02,106.95
2019-10-03,107.235
2019-10-04,108.16
2019-10-07,108.04
2019-10-08,107.13
2019-10-09,107.33
2019-10-10,106.9
2019-10-11,108.415
2019-10-14,107.95
2019-10-15,109.735
2019-10-16,108
2019-10-17,108.375
2019-10-18,108.78
2019-10-21,107.82
2019-10-22,109.69
2019-10-23,107.485
2019-10-24,107.91
2019-10-25,110.205
2019-10-28,113.11
2019-10-29,111.645
2019-10-30,112.675
2019-10-31,113.585
2019-11-01,112.54
2019-11-04,113.2
2019-11-05,111.27
2019-11-06,113.695
2019-11-07,112.785
2019-11-08,113.555
2019-11-11,112.675
2019-11-12,113.07
2019-11-13,112.78
2019-11-14,111.375
2019-11-15,113.3
2019-11-18,114
2019-11-19,115.15
2019-11-20,114.465
2019-11-21,114.675
2019-11-22,116.225
2019-11-25,117.465
