date,close
2014-06-13,36
2014-06-16,34.99
2014-06-17,35.77
2014-06-18,34.99
2014-06-19,34.45
2014-06-20,34.95
2014-06-23,35.22
2014-06-24,35.41
2014-06-25,35.48
2014-06-26,34.65
2014-06-27,34.2
2014-06-30,35.41
2014-07-01,33.82
2014-07-02,33.77
2014-07-03,34.1
2014-07-07,32.7
2014-07-08,31.48
2014-07-09,31.87
2014-07-10,31.89
2014-07-11,32.86
2014-07-14,33.53
2014-07-15,32.44
2014-07-16,32.96
2014-07-17,32.13
2014-07-18,32.13
2014-07-21,32.78
2014-07-22,32.42
2014-07-23,33.52
2014-07-24,34.96
2014-07-25,35.23
2014-07-28,38.02
2014-07-29,37.59
2014-07-30,36.52
2014-07-31,36.29
2014-08-01,35.76
2014-08-04,36.26
2014-08-05,35.83
2014-08-06,36.92
2014-08-07,35.83
2014-08-08,36.4
2014-08-11,38.79
2014-08-12,39.36
2014-08-13,45.21
2014-08-14,42.76
2014-08-15,40.93
2014-08-18,41.11
2014-08-19,42.41
2014-08-20,42.45
2014-08-21,43.45
2014-08-22,42.76
2014-08-25,39.16
2014-08-26,38.48
2014-08-27,38.96
2014-08-28,38.68
2014-08-29,38.44
2014-09-02,39.32
2014-09-03,40.84
2014-09-04,39.65
2014-09-05,39.75
2014-09-08,39.7
2014-09-09,39.26
2014-09-10,38.88
2014-09-11,37.72
2014-09-12,39.45
2014-09-15,39.57
2014-09-16,39.52
2014-09-17,38.58
2014-09-18,38.47
2014-09-19,37.99
2014-09-22,35.49
2014-09-23,35.32
2014-09-24,35.91
2014-09-25,34.72
2014-09-26,34.58
2014-09-29,35.36
2014-09-30,34.24
2014-10-01,35.05
2014-10-02,35.09
2014-10-03,35.6
2014-10-06,35.65
2014-10-07,36.2
2014-10-08,37.11
2014-10-09,36.92
2014-10-10,35.35
2014-10-13,35.34
2014-10-14,36.61
2014-10-15,36.98
2014-10-16,37.02
2014-10-17,37.06
2014-10-20,36.86
2014-10-21,36.95
2014-10-22,37.17
2014-10-23,37.19
2014-10-24,36
2014-10-27,36.47
2014-10-28,36.24
2014-10-29,36.09
2014-10-30,34.37
2014-10-31,36.36
2014-11-03,36.42
2014-11-04,36.35
2014-11-05,34.21
2014-11-06,33.98
2014-11-07,33.25
2014-11-10,33.52
2014-11-11,34.13
2014-11-12,34.51
2014-11-13,34.37
2014-11-14,33.86
2014-11-17,34.06
2014-11-18,34.3
2014-11-19,34.78
2014-11-20,34.55
2014-11-21,34.9
2014-11-24,35.5
2014-11-25,36
2014-11-26,36.36
2014-11-28,36.8
2014-12-01,36.44
2014-12-02,35.93
2014-12-03,36.08
2014-12-04,34.05
2014-12-05,34.49
2014-12-08,33.74
2014-12-09,34.29
2014-12-10,32.54
2014-12-11,31.9
2014-12-12,32.01
2014-12-15,31.74
2014-12-16,33.11
2014-12-17,33.96
2014-12-18,35.28
2014-12-19,35.79
2014-12-22,35.54
2014-12-23,35.77
2014-12-24,35.65
2014-12-26,35.82
2014-12-29,35.91
2014-12-30,35.87
2014-12-31,36.32
2015-01-02,36.57
2015-01-05,37.15
2015-01-06,37.77
2015-01-07,37.21
2015-01-08,37.96
2015-01-09,38.25
2015-01-12,36.75
2015-01-13,37.16
2015-01-14,36.82
2015-01-15,36.09
2015-01-16,36.98
2015-01-20,36.06
2015-01-21,35.53
2015-01-22,35.87
2015-01-23,35.71
2015-01-26,36.57
2015-01-27,35.32
2015-01-28,34.49
2015-01-29,34.81
2015-01-30,34.43
2015-02-02,35.82
2015-02-03,36.48
2015-02-04,37.43
2015-02-05,39.76
2015-02-06,40.57
2015-02-09,39.08
2015-02-10,37.94
2015-02-11,37.45
2015-02-12,38.22
2015-02-13,39.93
2015-02-17,39.67
2015-02-18,39.75
2015-02-19,39.69
2015-02-20,41.36
2015-02-23,40.42
2015-02-24,40.96
2015-02-25,42.46
2015-02-26,41.75
2015-02-27,42.01
2015-03-02,44.09
2015-03-03,43.49
2015-03-04,43.43
2015-03-05,43.19
2015-03-06,42.32
2015-03-09,42.99
2015-03-10,42.55
2015-03-11,42.92
2015-03-12,43.55
2015-03-13,44.25
2015-03-16,45.18
2015-03-17,45.29
2015-03-18,45.3
2015-03-19,45.24
2015-03-20,45.12
2015-03-23,45.79
2015-03-24,45.57
2015-03-25,44.84
2015-03-26,44.99
2015-03-27,45.34
2015-03-30,46.23
2015-03-31,45.39
2015-04-01,44.57
2015-04-02,44.27
2015-04-06,44.84
2015-04-07,45.03
2015-04-08,45.24
2015-04-09,43.91
2015-04-10,43.81
2015-04-13,44.28
2015-04-14,43.64
2015-04-15,45.18
2015-04-16,45.33
2015-04-17,45.21
2015-04-20,45.46
2015-04-21,46.29
2015-04-22,45.84
2015-04-23,46.25
2015-04-24,46
2015-04-27,47.18
2015-04-28,45.3
2015-04-29,40.85
2015-04-30,41.17
2015-05-01,40.09
2015-05-04,39.02
2015-05-05,38.94
2015-05-06,39
2015-05-07,39.41
2015-05-08,40.23
2015-05-11,39.98
2015-05-12,39.7
2015-05-13,39.69
2015-05-14,40.22
2015-05-15,39.91
2015-05-18,40.28
2015-05-19,39.94
2015-05-20,40.22
2015-05-21,40.48
2015-05-22,40.26
2015-05-26,39.63
2015-05-27,39.74
2015-05-28,40.26
2015-05-29,40.32
2015-06-01,40.78
2015-06-02,40.38
2015-06-03,40.76
2015-06-04,40.12
2015-06-05,39.59
2015-06-08,38.89
2015-06-09,37.23
2015-06-10,37.63
2015-06-11,37.3
2015-06-12,37.4
2015-06-15,37.82
2015-06-16,37.38
2015-06-17,35.82
2015-06-18,34.77
2015-06-19,35.1
2015-06-22,34.73
2015-06-23,35.38
2015-06-24,35.69
2015-06-25,35.78
2015-06-26,34.47
2015-06-29,33.31
2015-06-30,34.07
2015-07-01,31.67
2015-07-02,30.69
2015-07-06,30.83
2015-07-07,30.98
2015-07-08,31.42
2015-07-09,31.56
2015-07-10,31.21
2015-07-13,32.15
2015-07-14,32.43
2015-07-15,31.39
2015-07-16,31.66
2015-07-17,31.64
2015-07-20,32.57
2015-07-21,33.38
2015-07-22,33.84
2015-07-23,33.86
2015-07-24,33.79
2015-07-27,31.01
2015-07-28,33.25
2015-07-29,32.32
2015-07-30,31.64
2015-07-31,31.71
2015-08-03,30.39
2015-08-04,30.29
2015-08-05,30.1
2015-08-06,29.19
2015-08-07,28.85
2015-08-10,29.58
2015-08-11,28.61
2015-08-12,29.98
2015-08-13,30.32
2015-08-14,30.64
2015-08-17,31.22
2015-08-18,30.47
2015-08-19,29.95
2015-08-20,28.38
2015-08-21,28.13
2015-08-24,27.16
2015-08-25,27.61
2015-08-26,25.92
2015-08-27,26.1
2015-08-28,26.91
2015-08-31,26.45
2015-09-01,25.17
2015-09-02,26.83
2015-09-03,26.91
2015-09-04,26.45
2015-09-08,25.5
2015-09-09,25.74
2015-09-10,27.42
2015-09-11,27.6
2015-09-14,27.34
2015-09-15,27.83
2015-09-16,26.9
2015-09-17,27.75
2015-09-18,28.13
2015-09-21,27.92
2015-09-22,25.91
2015-09-23,25.59
2015-09-24,25.22
2015-09-25,24.89
2015-09-28,24.05
2015-09-29,24.26
2015-09-30,24.34
2015-10-01,24.49
2015-10-02,25.8
2015-10-05,27.16
2015-10-06,27.36
2015-10-07,28.49
2015-10-08,29.96
2015-10-09,30.18
2015-10-12,29.8
2015-10-13,30.18
2015-10-14,30.3
2015-10-15,30.51
2015-10-16,31.32
2015-10-19,30.81
2015-10-20,30.88
2015-10-21,29.92
2015-10-22,30.1
2015-10-23,31.04
2015-10-26,32.09
2015-10-27,24.49
2015-10-28,24.41
2015-10-29,23.85
2015-10-30,23.98
2015-11-02,24.34
2015-11-03,24.56
2015-11-04,24.37
2015-11-05,24.28
2015-11-06,25.19
2015-11-09,25.85
2015-11-10,25.02
2015-11-11,24.07
2015-11-12,23.86
2015-11-13,23.89
2015-11-16,24.57
2015-11-17,25.31
2015-11-18,25.98
2015-11-19,25.7
2015-11-20,26
2015-11-23,26.24
2015-11-24,26.46
2015-11-25,27.54
2015-11-27,25.78
2015-11-30,25.64
2015-12-01,26.27
2015-12-02,26.17
2015-12-03,25.74
2015-12-04,24.65
2015-12-07,24.22
2015-12-08,24.17
2015-12-09,23.93
2015-12-10,24.54
2015-12-11,24.03
2015-12-14,22.97
2015-12-15,24
2015-12-16,23.6
2015-12-17,23.07
2015-12-18,23.43
2015-12-21,23.9
2015-12-22,24.81
2015-12-23,25.86
2015-12-24,25.38
2015-12-28,24.99
2015-12-29,24.66
2015-12-30,24.43
2015-12-31,24.2
2016-01-04,23.62
2016-01-05,23.06
2016-01-06,22.32
2016-01-07,22.85
2016-01-08,21.99
2016-01-11,21.72
2016-01-12,21.7
2016-01-13,21.12
2016-01-14,21.95
2016-01-15,21
2016-01-19,20.19
2016-01-20,20.41
2016-01-21,19.42
2016-01-22,19.17
2016-01-25,18.71
2016-01-26,19.2
2016-01-27,18.9
2016-01-28,18.34
2016-01-29,18.85
2016-02-01,19.15
2016-02-02,18.95
2016-02-03,19.08
2016-02-04,21.53
2016-02-05,21.13
2016-02-08,20.01
2016-02-09,19.24
2016-02-10,19.34
2016-02-11,20.09
2016-02-12,20.93
2016-02-16,22.41
2016-02-17,22.52
2016-02-18,22.24
2016-02-19,22.61
2016-02-22,22.04
2016-02-23,22.01
2016-02-24,22.79
2016-02-25,22.58
2016-02-26,23.83
2016-02-29,23.54
2016-03-01,23.64
2016-03-02,24.08
2016-03-03,23.71
2016-03-04,24.49
2016-03-07,25.28
2016-03-08,24.47
2016-03-09,25.12
2016-03-10,24
2016-03-11,24.88
2016-03-14,24.66
2016-03-15,23.56
2016-03-16,23.27
2016-03-17,23.83
2016-03-18,23.41
2016-03-21,23.73
2016-03-22,23.48
2016-03-23,22.73
2016-03-24,22.61
2016-03-28,22.98
2016-03-29,23.72
2016-03-30,24.29
2016-03-31,25.13
2016-04-01,24.7
2016-04-04,23.99
2016-04-05,23.76
2016-04-06,23.9
2016-04-07,24.01
2016-04-08,24.16
2016-04-11,23.29
2016-04-12,23.62
2016-04-13,24.94
2016-04-14,25.59
2016-04-15,25.51
2016-04-18,25.49
2016-04-19,25.99
2016-04-20,26.36
2016-04-21,26.59
2016-04-22,26.99
2016-04-25,26.8
2016-04-26,26.97
2016-04-27,26.71
2016-04-28,26.26
2016-04-29,26.22
2016-05-02,26.54
2016-05-03,24.65
2016-05-04,24.02
2016-05-05,24.55
2016-05-06,24.58
2016-05-09,24.36
2016-05-10,24.76
2016-05-11,24.85
2016-05-12,24.8
2016-05-13,25.38
2016-05-16,25.28
2016-05-17,23.3
2016-05-18,22.35
2016-05-19,22.33
2016-05-20,22.8
2016-05-23,23.49
2016-05-24,23.93
2016-05-25,24.24
2016-05-26,24.55
2016-05-27,24.97
2016-05-31,25.59
2016-06-01,26.22
2016-06-02,27.73
2016-06-03,28.54
2016-06-06,28.67
2016-06-07,28.98
2016-06-08,28.85
2016-06-09,28.83
2016-06-10,27.99
2016-06-13,28.25
2016-06-14,27.67
2016-06-15,28.39
2016-06-16,28.89
2016-06-17,30.07
2016-06-20,30.59
2016-06-21,29.78
2016-06-22,29.84
2016-06-23,30.67
2016-06-24,30.1
2016-06-27,28.62
2016-06-28,28.73
2016-06-29,30.53
2016-06-30,31.07
2016-07-01,30.77
2016-07-05,30.11
2016-07-06,30.84
2016-07-07,31.08
2016-07-08,32.06
2016-07-11,30.74
2016-07-12,31.66
2016-07-13,30.66
2016-07-14,29.94
2016-07-15,29.8
2016-07-18,30.67
2016-07-19,30.56
2016-07-20,30.55
2016-07-21,30.94
2016-07-22,31.74
2016-07-25,31.6
2016-07-26,31.75
2016-07-27,30.74
2016-07-28,38.15
2016-07-29,37.92
2016-08-01,38.52
2016-08-02,39
2016-08-03,38.52
2016-08-04,38.65
2016-08-05,38.76
2016-08-08,39.02
2016-08-09,38.7
2016-08-10,38.81
2016-08-11,38.6
2016-08-12,38.53
2016-08-15,38.1
2016-08-16,37.13
2016-08-17,36.42
2016-08-18,36.7
2016-08-19,38.03
2016-08-22,37.7
2016-08-23,38.27
2016-08-24,38.36
2016-08-25,38.8
2016-08-26,39.02
2016-08-29,39.94
2016-08-30,39.84
2016-08-31,40.57
2016-09-01,41.06
2016-09-02,41.47
2016-09-06,42.83
2016-09-07,42.46
2016-09-08,42.15
2016-09-09,40.86
2016-09-12,41.39
2016-09-13,41.48
2016-09-14,41.6
2016-09-15,41.17
2016-09-16,41.48
2016-09-19,40.85
2016-09-20,41.45
2016-09-21,41.72
2016-09-22,42.94
2016-09-23,42
2016-09-26,42.19
2016-09-27,43.77
2016-09-28,43.89
2016-09-29,42.31
2016-09-30,42.99
2016-10-03,42.68
2016-10-04,41.53
2016-10-05,40.84
2016-10-06,40.31
2016-10-07,40.56
2016-10-10,40.84
2016-10-11,39.66
2016-10-12,40.35
2016-10-13,41.18
2016-10-14,41.56
2016-10-17,42.01
2016-10-18,42.08
2016-10-19,42.09
2016-10-20,42.64
2016-10-21,43.2
2016-10-24,43.79
2016-10-25,43.39
2016-10-26,37.88
2016-10-27,38.36
2016-10-28,38.43
2016-10-31,38.11
2016-11-01,37.36
2016-11-02,37.02
2016-11-03,36.49
2016-11-04,36.81
2016-11-07,37.95
2016-11-08,38.23
2016-11-09,38.68
2016-11-10,37.1
2016-11-11,35.31
2016-11-14,36.34
2016-11-15,36.01
2016-11-16,35.99
2016-11-17,36.29
2016-11-18,36.65
2016-11-21,37.99
2016-11-22,37.14
2016-11-23,37.93
2016-11-25,37.58
2016-11-28,38.15
2016-11-29,38.22
2016-11-30,37.03
2016-12-01,35.56
2016-12-02,35.78
2016-12-05,36.34
2016-12-06,36.57
2016-12-07,37.35
2016-12-08,38.08
2016-12-09,37.89
2016-12-12,37.24
2016-12-13,38.04
2016-12-14,37.46
2016-12-15,37.84
2016-12-16,37.25
2016-12-19,37.36
2016-12-20,39.15
2016-12-21,38.6
2016-12-22,37.42
2016-12-23,37.61
2016-12-27,38.18
2016-12-28,37.51
2016-12-29,37.6
2016-12-30,37.62
2017-01-03,37.06
2017-01-04,37.26
2017-01-05,36.75
2017-01-06,36.34
2017-01-09,36.32
2017-01-10,36.83
2017-01-11,37.17
2017-01-12,37.37
2017-01-13,39.04
2017-01-17,39.13
2017-01-18,39.44
2017-01-19,39.35
2017-01-20,39.4
2017-01-23,39.69
2017-01-24,40.47
2017-01-25,41.97
2017-01-26,41.83
2017-01-27,41.87
2017-01-30,41.59
2017-01-31,41.55
2017-02-01,41.48
2017-02-02,41.38
2017-02-03,40.9
2017-02-06,40.55
2017-02-07,41.31
2017-02-08,39.86
2017-02-09,38.2
2017-02-10,37.67
2017-02-13,36.7
2017-02-14,36.92
2017-02-15,37.1
2017-02-16,37.06
2017-02-17,37.6
2017-02-21,37.97
2017-02-22,37.33
2017-02-23,36.28
2017-02-24,36.33
2017-02-27,36.23
2017-02-28,35.06
2017-03-01,36.21
2017-03-02,34.87
2017-03-03,34.27
2017-03-06,33.87
2017-03-07,33.88
2017-03-08,33.36
2017-03-09,33.56
2017-03-10,33.77
2017-03-13,34.42
2017-03-14,33.9
2017-03-15,34.62
2017-03-16,34.51
2017-03-17,34.33
2017-03-20,34.92
2017-03-21,34.12
2017-03-22,34.03
2017-03-23,33.51
2017-03-24,33.67
2017-03-27,33.67
2017-03-28,33.31
2017-03-29,33.59
2017-03-30,33.13
2017-03-31,32.89
2017-04-03,33.16
2017-04-04,33.04
2017-04-05,33.27
2017-04-06,33.46
2017-04-07,33.86
2017-04-10,34.16
2017-04-11,34.55
2017-04-12,35.05
2017-04-13,34.93
2017-04-17,34.22
2017-04-18,34.07
2017-04-19,34.67
2017-04-20,34.72
2017-04-21,34.61
2017-04-24,34.7
2017-04-25,34.78
2017-04-26,35.02
2017-04-27,42.92
2017-04-28,42.98
2017-05-01,42.89
2017-05-02,44.09
2017-05-03,44.89
2017-05-04,44.89
2017-05-05,45.72
2017-05-08,45.3
2017-05-09,45.35
2017-05-10,45.01
2017-05-11,45
2017-05-12,44.91
2017-05-15,44.32
2017-05-16,44.65
2017-05-17,43.36
2017-05-18,44.07
2017-05-19,43.37
2017-05-22,43.14
2017-05-23,42.73
2017-05-24,42.83
2017-05-25,42.35
2017-05-26,43.83
2017-05-30,43.49
2017-05-31,43.47
2017-06-01,43.71
2017-06-02,44.67
2017-06-05,44.52
2017-06-06,43.76
2017-06-07,43.88
2017-06-08,43.81
2017-06-09,43.35
2017-06-12,43.02
2017-06-13,43.43
2017-06-14,43.75
2017-06-15,43.59
2017-06-16,43.32
2017-06-19,45.34
2017-06-20,45.39
2017-06-21,46.54
2017-06-22,46.33
2017-06-23,47.7
2017-06-26,44.64
2017-06-27,43.42
2017-06-28,44.07
2017-06-29,43.2
2017-06-30,43.6
2017-07-03,43.41
2017-07-05,43.46
2017-07-06,43.13
2017-07-07,43.68
2017-07-10,43.65
2017-07-11,43.55
2017-07-12,45.04
2017-07-13,45.91
2017-07-14,45.78
2017-07-17,45.51
2017-07-18,45.51
2017-07-19,45.53
2017-07-20,45.79
2017-07-21,45.25
2017-07-24,45.44
2017-07-25,45.61
2017-07-26,47.04
2017-07-27,46.99
2017-07-28,46.64
2017-07-31,46.13
2017-08-01,47.22
2017-08-02,46.66
2017-08-03,48.25
2017-08-04,52.62
2017-08-07,56.96
2017-08-08,56.09
2017-08-09,55.82
2017-08-10,54.17
2017-08-11,54.46
2017-08-14,54.42
2017-08-15,54.35
2017-08-16,54.65
2017-08-17,53.56
2017-08-18,53.87
2017-08-21,54.36
2017-08-22,54.93
2017-08-23,54.58
2017-08-24,54.53
2017-08-25,54.15
2017-08-28,54.13
2017-08-29,54.71
2017-08-30,56.29
2017-08-31,57.09
2017-09-01,56.06
2017-09-05,56.3
2017-09-06,56.75
2017-09-07,57.08
2017-09-08,56.08
2017-09-11,56.4
2017-09-12,56.04
2017-09-13,56.18
2017-09-14,54.98
2017-09-15,53.56
2017-09-18,53
2017-09-19,54.35
2017-09-20,53.19
2017-09-21,53.51
2017-09-22,51.69
2017-09-25,51.69
2017-09-26,50.74
2017-09-27,51.61
2017-09-28,51.78
2017-09-29,52.66
2017-10-02,53.67
2017-10-03,54.23
2017-10-04,54.1
2017-10-05,51.98
2017-10-06,51.29
2017-10-09,51.28
2017-10-10,52.19
2017-10-11,51.98
2017-10-12,52.16
2017-10-13,51.61
2017-10-16,51.14
2017-10-17,51.51
2017-10-18,52
2017-10-19,51.77
2017-10-20,52.34
2017-10-23,51.44
2017-10-24,51.98
2017-10-25,57.795
2017-10-26,59.04
2017-10-27,60.02
2017-10-30,59.68
2017-10-31,61.02
2017-11-01,60.83
2017-11-02,60.83
2017-11-03,62.19
2017-11-06,62.92
2017-11-07,62.45
2017-11-08,62.42
2017-11-09,61.64
2017-11-10,63.1
2017-11-13,63.62
2017-11-14,63.08
2017-11-15,62.99
2017-11-16,64.51
2017-11-17,64.7
2017-11-20,65.03
2017-11-21,66.79
2017-11-22,67.7
2017-11-24,68.58
2017-11-27,68.59
2017-11-28,68.23
2017-11-29,66.2
2017-11-30,67.56
2017-12-01,66.6
2017-12-04,66.94
2017-12-05,67.58
2017-12-06,68.42
2017-12-07,68.94
2017-12-08,68.22
2017-12-11,70.34
2017-12-12,69.83
2017-12-13,71.41
2017-12-14,71.54
2017-12-15,72.3
2017-12-18,73.66
2017-12-19,73.18
2017-12-20,74.09
2017-12-21,71.44
2017-12-22,71.74
2017-12-26,72.22
2017-12-27,73.14
2017-12-28,72.19
2017-12-29,71.8
2018-01-02,71.26
2018-01-03,71.32
2018-01-04,71.88
2018-01-05,72.97
2018-01-08,71.36
2018-01-09,69.16
2018-01-10,66.53
2018-01-11,68.22
2018-01-12,70.61
2018-01-16,69.84
2018-01-17,70.8
2018-01-18,70.34
2018-01-19,70.03
2018-01-22,71.92
2018-01-23,71.16
2018-01-24,71.53
2018-01-25,73.4
2018-01-26,76.49
2018-01-29,75.42
2018-01-30,72.72
2018-01-31,72.25
2018-02-01,72.86
2018-02-02,70.65
2018-02-05,68.16
2018-02-06,68.9
2018-02-07,69.91
2018-02-08,89.04
2018-02-09,85.54
2018-02-12,86.7
2018-02-13,87.97
2018-02-14,93.39
2018-02-15,94.4
2018-02-16,95.93
2018-02-20,97.05
2018-02-21,97.52
2018-02-22,98.27
2018-02-23,96.73
2018-02-26,99.13
2018-02-27,98.92
2018-02-28,99.41
2018-03-01,97.55
2018-03-02,99.71
2018-03-05,101.98
2018-03-06,101.42
2018-03-07,104.16
2018-03-08,106.39
2018-03-09,108.56
2018-03-12,109.59
2018-03-13,109.25
2018-03-14,110.78
2018-03-15,110.89
2018-03-16,110.53
2018-03-19,108.82
2018-03-20,110.48
2018-03-21,110.02
2018-03-22,105.91
2018-03-23,104.61
2018-03-26,108.46
2018-03-27,103.34
2018-03-28,99.11
2018-03-29,101.47
2018-04-02,97.59
2018-04-03,97.64
2018-04-04,99.53
2018-04-05,100.18
2018-04-06,97.09
2018-04-09,97.08
2018-04-10,99.87
2018-04-11,98.32
2018-04-12,99.9
2018-04-13,97.91
2018-04-16,98.5
2018-04-17,103.72
2018-04-18,103.07
2018-04-19,101.74
2018-04-20,101.67
2018-04-23,102.17
2018-04-24,98.03
2018-04-25,95.57
2018-04-26,98.53
2018-04-27,99.37
2018-04-30,101.14
2018-05-01,92.65
2018-05-02,95.56
2018-05-03,96.79
2018-05-04,98.78
2018-05-07,101.68
2018-05-08,102.45
2018-05-09,103.45
2018-05-10,104.4
2018-05-11,102.04
2018-05-14,101.7
2018-05-15,100.64
2018-05-16,102.67
2018-05-17,103.38
2018-05-18,103.8
2018-05-21,103.68
2018-05-22,102.65
2018-05-23,102.75
2018-05-24,103.09
2018-05-25,101.78
2018-05-29,101.13
2018-05-30,107.54
2018-05-31,107.21
2018-06-01,107.77
2018-06-04,107.93
2018-06-05,109.48
2018-06-06,107.78
2018-06-07,104.91
2018-06-08,104.82
2018-06-11,107.57
2018-06-12,112.82
2018-06-13,115.98
2018-06-14,119.86
2018-06-15,118.77
2018-06-18,117.31
2018-06-19,114
2018-06-20,113.48
2018-06-21,110.48
2018-06-22,106.98
2018-06-25,101.78
2018-06-26,103.34
2018-06-27,103.61
2018-06-28,105.58
2018-06-29,104.91
2018-07-02,106.6
2018-07-03,105.33
2018-07-05,106.28
2018-07-06,108.3
2018-07-09,109.67
2018-07-10,108.42
2018-07-11,109
2018-07-12,111.25
2018-07-13,110.93
2018-07-16,110.18
2018-07-17,113.91
2018-07-18,113.87
2018-07-19,112.45
2018-07-20,111.94
2018-07-23,110.27
2018-07-24,109.06
2018-07-25,134.73
2018-07-26,135.51
2018-07-27,131
2018-07-30,124.28
2018-07-31,121.89
2018-08-01,125
2018-08-02,127.78
2018-08-03,126.08
2018-08-06,129.05
2018-08-07,128.64
2018-08-08,127.89
2018-08-09,130.44
2018-08-10,130.42
2018-08-13,129.92
2018-08-14,129.01
2018-08-15,127.37
2018-08-16,128.55
2018-08-17,127.4
2018-08-20,132.31
2018-08-21,133.11
2018-08-22,135.34
2018-08-23,137.93
2018-08-24,138.44
2018-08-27,139.86
2018-08-28,140.48
2018-08-29,143
2018-08-30,142.61
2018-08-31,144.11
2018-09-04,144
2018-09-05,137.62
2018-09-06,137.75
2018-09-07,141.92
2018-09-10,141.01
2018-09-11,146.73
2018-09-12,142.6
2018-09-13,144.97
2018-09-14,146.11
2018-09-17,140.28
2018-09-18,143.6
2018-09-19,136.56
2018-09-20,137.21
2018-09-21,135.75
2018-09-24,134.81
2018-09-25,138.32
2018-09-26,138.42
2018-09-27,139.79
2018-09-28,138.62
2018-10-01,137.38
2018-10-02,136.99
2018-10-03,135.24
2018-10-04,130.53
2018-10-05,129.84
2018-10-08,126.7
2018-10-09,128.45
2018-10-10,117.82
2018-10-11,114.33
2018-10-12,116.55
2018-10-15,114.05
2018-10-16,121.34
2018-10-17,120.62
2018-10-18,117.41
2018-10-19,114.69
2018-10-22,116.77
2018-10-23,115.73
2018-10-24,109.62
2018-10-25,96.48
2018-10-26,87.95
2018-10-29,84.44
2018-10-30,89.25
2018-10-31,92.74
2018-11-01,94.63
2018-11-02,95.29
2018-11-05,92.46
2018-11-06,91.15
2018-11-07,94.12
2018-11-08,92.36
2018-11-09,88.96
2018-11-12,85.52
2018-11-13,86.59
2018-11-14,87.87
2018-11-15,90.78
2018-11-16,87.49
2018-11-19,80.42
2018-11-20,78.52
2018-11-21,78.59
2018-11-23,78.98
2018-11-26,81.21
2018-11-27,76.8
2018-11-28,80.06
2018-11-29,80.19
2018-11-30,78.29
2018-12-03,82.74
2018-12-04,77.76
2018-12-06,81.41
2018-12-07,76.8
2018-12-10,80.81
2018-12-11,80.92
2018-12-12,81.36
2018-12-13,79.61
2018-12-14,79.2
2018-12-17,75.89
2018-12-18,75.95
2018-12-19,72.71
2018-12-20,71.2
2018-12-21,68.78
2018-12-24,67.84
2018-12-26,72.41
2018-12-27,75.25
2018-12-28,75.99
2018-12-31,76.81
2019-01-02,75.46
2019-01-03,71.31
2019-01-04,75.8
2019-01-07,79.85
2019-01-08,81.09
2019-01-09,80.39
2019-01-10,80.97
2019-01-11,78.54
2019-01-14,77.91
2019-01-15,76.58
2019-01-16,77.99
2019-01-17,79.66
2019-01-18,80.97
2019-01-22,74.56
2019-01-23,74.46
2019-01-24,77.24
2019-01-25,80.77
2019-01-28,80.99
2019-01-29,77.03
2019-01-30,79.95
2019-01-31,80.4
2019-02-01,80.13
2019-02-04,81.41
2019-02-05,79.87
2019-02-06,83.95
2019-02-07,82.27
2019-02-08,86.08
2019-02-11,78.08
2019-02-12,79.57
2019-02-13,80.73
2019-02-14,82.47
2019-02-15,83.21
2019-02-19,83.54
2019-02-20,81.68
2019-02-21,79.5
2019-02-22,79.97
2019-02-25,81.66
2019-02-26,80.43
2019-02-27,81.29
2019-02-28,81.58
2019-03-01,83.02
2019-03-04,77.99
2019-03-05,79.39
2019-03-06,76.42
2019-03-07,73.75
2019-03-08,73.4
2019-03-11,76.35
2019-03-12,78.07
2019-03-13,76.21
2019-03-14,73.85
2019-03-15,74.98
2019-03-18,77.05
2019-03-19,70.6
2019-03-20,68.85
2019-03-21,69.75
2019-03-22,68.59
2019-03-25,67.86
2019-03-26,67.25
2019-03-27,66.15
2019-03-28,66.96
2019-03-29,69.47
2019-04-01,70.48
2019-04-02,70.58
2019-04-03,70.88
2019-04-04,70.27
2019-04-05,71.18
2019-04-08,71.7
2019-04-09,70.25
2019-04-10,70.28
2019-04-11,69.4
2019-04-12,65.4
2019-04-15,65.33
2019-04-16,66.31
2019-04-17,65.94
2019-04-18,64.07
2019-04-22,65.94
2019-04-23,67.96
2019-04-24,69.23
2019-04-25,69.78
2019-04-26,66.78
2019-04-29,65.67
2019-04-30,66.79
2019-05-01,71.41
2019-05-02,69.01
2019-05-03,71.02
2019-05-06,71.1
2019-05-07,69.78
2019-05-08,68.29
2019-05-09,68.39
2019-05-10,66.6
2019-05-13,61.91
2019-05-14,62.54
2019-05-15,63.61
2019-05-16,62.81
2019-05-17,61.71
2019-05-20,63.13
2019-05-21,66.59
2019-05-22,68.5
2019-05-23,66.14
2019-05-24,65.87
2019-05-28,64.42
2019-05-29,63.99
2019-05-30,63.8
2019-05-31,65.15
2019-06-03,62.94
2019-06-04,64.82
2019-06-05,61.62
2019-06-06,63.14
2019-06-07,65.22
2019-06-10,64.7
2019-06-11,70.06
2019-06-12,69.94
2019-06-13,72.935
2019-06-14,70.465
2019-06-17,72.4
2019-06-18,71.57
2019-06-19,71.51
2019-06-20,71.43
2019-06-21,71.49
2019-06-24,72.195
2019-06-25,76.05
2019-06-26,77.24
2019-06-27,75.71
2019-06-28,77.585
2019-07-01,76.94
2019-07-02,75.38
2019-07-03,76.97
2019-07-04,76.97
2019-07-05,77.47
2019-07-08,75.695
2019-07-09,77.51
2019-07-10,77.26
2019-07-11,73.8
2019-07-12,76.285
2019-07-15,76.345
2019-07-16,75.01
2019-07-17,74.76
2019-07-18,74.83
2019-07-19,75.44
2019-07-22,73.83
2019-07-23,72.99
2019-07-24,73.695
2019-07-25,73.02
2019-07-26,74.655
2019-07-29,79.9
2019-07-30,70.41
2019-07-31,67.51
2019-08-01,66.705
2019-08-02,69.76
2019-08-05,69.22
2019-08-06,69.91
2019-08-07,69.375
2019-08-08,69.34
2019-08-09,66.205
2019-08-12,65.79
2019-08-13,65.49
2019-08-14,61.085
2019-08-15,58.555
2019-08-16,59.93
2019-08-19,60.98
2019-08-20,61.57
2019-08-21,62.01
2019-08-22,61.01
2019-08-23,57.84
2019-08-26,58.35
2019-08-27,56.64
2019-08-28,57.6
2019-08-29,58.77
2019-08-30,59.4
2019-09-02,59.33
2019-09-03,56.7
2019-09-04,58.7
2019-09-05,60.36
2019-09-06,60.515
2019-09-09,62.76
2019-09-10,64.25
2019-09-11,66.65
2019-09-12,67.2
2019-09-13,66.365
2019-09-16,66.03
2019-09-17,64.61
2019-09-18,63.76
2019-09-19,60.39
2019-09-20,59.69
2019-09-23,57.11
2019-09-24,56.515
2019-09-25,56.435
2019-09-26,55.995
2019-09-27,55.87
2019-09-30,56.25
2019-10-01,56.395
2019-10-02,53.18
2019-10-03,54
2019-10-04,56.59
2019-10-07,55.05
2019-10-08,52.25
2019-10-09,52.855
2019-10-10,53.585
2019-10-11,55.21
2019-10-14,54.54
2019-10-15,55.8
2019-10-16,55.685
2019-10-17,57.44
2019-10-18,55.795
2019-10-21,55.76
2019-10-22,56.27
2019-10-23,56.365
2019-10-24,56.38
2019-10-25,59.01
2019-10-28,58.59
2019-10-29,33.15
2019-10-30,34.03
2019-10-31,34.13
2019-11-01,33.69
2019-11-04,35.05
2019-11-05,35.635
2019-11-06,36.1
2019-11-07,34.66
2019-11-08,36.195
2019-11-11,37.12
2019-11-12,37.325
2019-11-13,36.655
2019-11-14,38.53
2019-11-15,39.715
2019-11-18,40.895
2019-11-19,39.97
2019-11-20,40.66
2019-11-21,41.775
2019-11-22,42.69
2019-11-25,42.635
