date,close
2014-06-13,20.3959
2014-06-16,20.3544
2014-06-17,20.7522
2014-06-18,20.5865
2014-06-19,20.3627
2014-06-20,20.0975
2014-06-23,20.3462
2014-06-24,20.3793
2014-06-25,20.5616
2014-06-26,20.4622
2014-06-27,20.3793
2014-06-30,20.5036
2014-07-01,20.8351
2014-07-02,20.5948
2014-07-03,20.9429
2014-07-07,20.4436
2014-07-08,20.3271
2014-07-09,20.3604
2014-07-10,19.6532
2014-07-11,19.545
2014-07-14,19.545
2014-07-15,19.2787
2014-07-16,19.337
2014-07-17,18.9958
2014-07-18,18.9958
2014-07-21,18.7379
2014-07-22,18.9709
2014-07-23,19.2871
2014-07-24,19.1373
2014-07-25,19.8529
2014-07-28,19.3453
2014-07-29,19.104
2014-07-30,19.2704
2014-07-31,19.0707
2014-08-01,18.8378
2014-08-04,19.1539
2014-08-05,19.2871
2014-08-06,19.4535
2014-08-07,19.3869
2014-08-08,20.0276
2014-08-11,20.0276
2014-08-12,19.6532
2014-08-13,19.5367
2014-08-14,19.9361
2014-08-15,19.9111
2014-08-18,20.3937
2014-08-19,21.0344
2014-08-20,20.843
2014-08-21,20.9845
2014-08-22,21.0427
2014-08-25,21.1093
2014-08-26,21.2091
2014-08-27,21.0261
2014-08-28,20.8846
2014-08-29,20.9928
2014-09-02,21.1758
2014-09-03,21.1509
2014-09-04,21.3256
2014-09-05,21.4254
2014-09-08,21.2424
2014-09-09,21.1675
2014-09-10,21.2091
2014-09-11,21.2923
2014-09-12,21.0011
2014-09-15,20.8763
2014-09-16,21.0926
2014-09-17,21.2507
2014-09-18,20.9512
2014-09-19,20.4769
2014-09-22,20.1108
2014-09-23,19.7697
2014-09-24,19.8362
2014-09-25,19.57
2014-09-26,19.6199
2014-09-29,19.4868
2014-09-30,18.9709
2014-10-01,18.9293
2014-10-02,19.2704
2014-10-03,19.3536
2014-10-06,19.5533
2014-10-07,19.2355
2014-10-08,19.754
2014-10-09,19.6369
2014-10-10,19.5366
2014-10-13,19.846
2014-10-14,20.5151
2014-10-15,20.2893
2014-10-16,20.5402
2014-10-17,20.5569
2014-10-20,21.1089
2014-10-21,21.5103
2014-10-22,21.5354
2014-10-23,22.5725
2014-10-24,22.8568
2014-10-27,22.8735
2014-10-28,23.8019
2014-10-29,23.484
2014-10-30,23.6346
2014-10-31,23.668
2014-11-03,23.944
2014-11-04,24.0193
2014-11-05,23.944
2014-11-06,24.4375
2014-11-07,24.5295
2014-11-10,24.1698
2014-11-11,24.1113
2014-11-12,24.4291
2014-11-13,24.2618
2014-11-14,23.9858
2014-11-17,23.4339
2014-11-18,23.3335
2014-11-19,23.7851
2014-11-20,24.5378
2014-11-21,24.4375
2014-11-24,24.7218
2014-11-25,24.7887
2014-11-26,24.7636
2014-11-28,24.7636
2014-12-01,24.9142
2014-12-02,24.7051
2014-12-03,24.7804
2014-12-04,24.5211
2014-12-05,24.6549
2014-12-08,24.588
2014-12-09,25.1902
2014-12-10,24.3538
2014-12-11,24.6047
2014-12-12,24.4542
2014-12-15,24.4876
2014-12-16,24.3204
2014-12-17,25.0814
2014-12-18,24.9727
2014-12-19,24.8556
2014-12-22,25.0814
2014-12-23,25.3909
2014-12-24,25.324
2014-12-26,25.4578
2014-12-29,25.6334
2014-12-30,25.7338
2014-12-31,25.901
2015-01-02,25.6919
2015-01-05,25.4912
2015-01-06,25.3156
2015-01-07,25.9873
2015-01-08,26.3064
2015-01-09,26.2056
2015-01-12,26.2812
2015-01-13,26.6171
2015-01-14,26.6339
2015-01-15,25.8698
2015-01-16,26.6339
2015-01-20,26.3904
2015-01-21,26.7262
2015-01-22,27.1292
2015-01-23,26.8606
2015-01-26,26.9865
2015-01-27,26.5751
2015-01-28,23.3508
2015-01-29,23.3928
2015-01-30,22.8554
2015-02-02,22.9814
2015-02-03,23.5019
2015-02-04,23.3844
2015-02-05,23.0821
2015-02-06,23.2333
2015-02-09,22.8638
2015-02-10,23.1997
2015-02-11,22.9226
2015-02-12,22.8722
2015-02-13,22.6707
2015-02-17,23.25
2015-02-18,22.9814
2015-02-19,22.8218
2015-02-20,23.0065
2015-02-23,22.9814
2015-02-24,23.5943
2015-02-25,23.7119
2015-02-26,22.9646
2015-02-27,22.5279
2015-03-02,23.1661
2015-03-03,22.4608
2015-03-04,22.4776
2015-03-05,22.2089
2015-03-06,22.2425
2015-03-09,22.4524
2015-03-10,22.3012
2015-03-11,22.4776
2015-03-12,23.0149
2015-03-13,23.1073
2015-03-16,23.0821
2015-03-17,22.6035
2015-03-18,22.6539
2015-03-19,23.2165
2015-03-20,23.4935
2015-03-23,23.334
2015-03-24,23.3256
2015-03-25,22.9646
2015-03-26,21.7387
2015-03-27,22.805
2015-03-30,23.3676
2015-03-31,23.2081
2015-04-01,23.3424
2015-04-02,23.3844
2015-04-06,23.418
2015-04-07,23.0737
2015-04-08,23.4195
2015-04-09,22.728
2015-04-10,22.7448
2015-04-13,22.34
2015-04-14,21.6232
2015-04-15,21.5726
2015-04-16,21.3533
2015-04-17,21.0497
2015-04-20,21.8003
2015-04-21,21.7581
2015-04-22,21.893
2015-04-23,22.2641
2015-04-24,21.3702
2015-04-27,20.8642
2015-04-28,20.9232
2015-04-29,20.6702
2015-04-30,20.4256
2015-05-01,20.7545
2015-05-04,20.9569
2015-05-05,20.8051
2015-05-06,20.6871
2015-05-07,21.1593
2015-05-08,21.4376
2015-05-11,21.7665
2015-05-12,21.5135
2015-05-13,21.1593
2015-05-14,21.3449
2015-05-15,21.4039
2015-05-18,21.5557
2015-05-19,21.7328
2015-05-20,21.6316
2015-05-21,21.6232
2015-05-22,21.387
2015-05-26,21.3533
2015-05-27,21.4039
2015-05-28,21.5473
2015-05-29,21.1678
2015-06-01,21.1931
2015-06-02,21.2605
2015-06-03,21.4208
2015-06-04,21.2268
2015-06-05,21.1762
2015-06-08,21.0666
2015-06-09,21.0834
2015-06-10,21.1762
2015-06-11,21.8171
2015-06-12,22.7533
2015-06-15,22.087
2015-06-16,22.1629
2015-06-17,22.6183
2015-06-18,22.5762
2015-06-19,22.3231
2015-06-22,22.4328
2015-06-23,22.5677
2015-06-24,22.4581
2015-06-25,22.3231
2015-06-26,22.9219
2015-06-29,22.3738
2015-06-30,22.2135
2015-07-01,22.0954
2015-07-02,22.0954
2015-07-06,22.0111
2015-07-07,22.3588
2015-07-08,22.3418
2015-07-09,23.8934
2015-07-10,23.6984
2015-07-13,24.9702
2015-07-14,25.2416
2015-07-15,25.6401
2015-07-16,25.3942
2015-07-17,24.8515
2015-07-20,24.5124
2015-07-21,24.3598
2015-07-22,24.7159
2015-07-23,24.046
2015-07-24,24.0969
2015-07-27,23.3338
2015-07-28,23.6306
2015-07-29,25.7757
2015-07-30,25.7588
2015-07-31,25.5977
2015-08-03,25.2161
2015-08-04,25.2755
2015-08-05,25.7333
2015-08-06,25.3687
2015-08-07,25.6146
2015-08-10,26.3353
2015-08-11,26.0555
2015-08-12,25.8181
2015-08-13,26.276
2015-08-14,26.6151
2015-08-17,26.5982
2015-08-18,26.5727
2015-08-19,26.5558
2015-08-20,26.1234
2015-08-21,26.0216
2015-08-24,24.8685
2015-08-25,24.8854
2015-08-26,25.4281
2015-08-27,25.284
2015-08-28,25.0296
2015-08-31,25.2246
2015-09-01,24.8346
2015-09-02,25.3009
2015-09-03,25.3518
2015-09-04,25.1483
2015-09-08,25.5977
2015-09-09,25.267
2015-09-10,25.1313
2015-09-11,25.9029
2015-09-14,25.9962
2015-09-15,26.064
2015-09-16,25.7079
2015-09-17,25.479
2015-09-18,24.5972
2015-09-21,24.7498
2015-09-22,24.5802
2015-09-23,24.2071
2015-09-24,23.9528
2015-09-25,23.6984
2015-09-28,23.0625
2015-09-29,22.1892
2015-09-30,22.3927
2015-10-01,22.9692
2015-10-02,23.071
2015-10-05,24.3174
2015-10-06,23.525
2015-10-07,23.738
2015-10-08,23.7891
2015-10-09,23.755
2015-10-12,24.1043
2015-10-13,23.6868
2015-10-14,22.7666
2015-10-15,23.0393
2015-10-16,23.5164
2015-10-19,23.4312
2015-10-20,23.5761
2015-10-21,23.3119
2015-10-22,23.5335
2015-10-23,23.4824
2015-10-26,23.5079
2015-10-27,22.8859
2015-10-28,22.2298
2015-10-29,23.2949
2015-10-30,23.1841
2015-11-02,24.36
2015-11-03,24.6667
2015-11-04,24.5304
2015-11-05,24.8712
2015-11-06,25.1779
2015-11-09,24.4026
2015-11-10,24.5985
2015-11-11,24.0873
2015-11-12,23.6783
2015-11-13,23.1586
2015-11-16,23.8999
2015-11-17,23.2353
2015-11-18,23.738
2015-11-19,23.738
2015-11-20,24.0106
2015-11-23,24.4026
2015-11-24,24.5133
2015-11-25,24.6752
2015-11-27,25.016
2015-11-30,24.164
2015-12-01,24.2322
2015-12-02,24.5644
2015-12-03,23.9339
2015-12-04,24.4878
2015-12-07,24.2492
2015-12-08,23.738
2015-12-09,23.4227
2015-12-10,23.3716
2015-12-11,22.6729
2015-12-14,22.7326
2015-12-15,23.525
2015-12-16,24.2918
2015-12-17,23.6272
2015-12-18,22.8604
2015-12-21,23.3034
2015-12-22,23.6016
2015-12-23,24.0617
2015-12-24,23.8232
2015-12-28,23.8913
2015-12-29,24.0277
2015-12-30,23.8573
2015-12-31,23.7039
2016-01-04,22.9882
2016-01-05,23.116
2016-01-06,22.6644
2016-01-07,22.1505
2016-01-08,21.5766
2016-01-11,21.9791
2016-01-12,21.9021
2016-01-13,20.7714
2016-01-14,20.5059
2016-01-15,20.7628
2016-01-19,20.0605
2016-01-20,20.2489
2016-01-21,21.0284
2016-01-22,21.8078
2016-01-25,21.8678
2016-01-26,22.4502
2016-01-27,21.962
2016-01-28,23.0413
2016-01-29,22.87
2016-02-01,23.6751
2016-02-02,24.3604
2016-02-03,23.4267
2016-02-04,23.401
2016-02-05,22.8871
2016-02-08,22.87
2016-02-09,22.87
2016-02-10,22.4588
2016-02-11,22.2875
2016-02-12,22.4845
2016-02-16,24.0691
2016-02-17,23.6922
2016-02-18,23.9064
2016-02-19,23.8122
2016-02-22,24.4974
2016-02-23,24.4289
2016-02-24,24.6002
2016-02-25,24.3347
2016-02-26,24.3689
2016-02-29,24.4374
2016-03-01,24.8914
2016-03-02,25.2426
2016-03-03,25.4996
2016-03-04,25.354
2016-03-07,25.551
2016-03-08,25.3454
2016-03-09,25.4996
2016-03-10,25.3283
2016-03-11,25.7394
2016-03-14,25.7822
2016-03-15,25.2769
2016-03-16,25.7565
2016-03-17,26.4418
2016-03-18,26.9985
2016-03-21,26.6131
2016-03-22,26.2533
2016-03-23,26.2105
2016-03-24,26.3133
2016-03-28,26.4332
2016-03-29,27.2041
2016-03-30,27.0071
2016-03-31,27.2555
2016-04-01,26.8015
2016-04-04,26.2448
2016-04-05,26.2619
2016-04-06,26.2105
2016-04-07,26.0899
2016-04-08,25.7282
2016-04-11,25.7109
2016-04-12,26.0641
2016-04-13,26.8135
2016-04-14,26.6584
2016-04-15,26.6584
2016-04-18,26.6154
2016-04-19,26.2794
2016-04-20,27.1235
2016-04-21,26.8996
2016-04-22,26.7187
2016-04-25,26.7015
2016-04-26,29.6473
2016-04-27,29.6386
2016-04-28,29.2252
2016-04-29,29.32
2016-05-02,29.5525
2016-05-03,28.5792
2016-05-04,28.6567
2016-05-05,28.0279
2016-05-06,28.5189
2016-05-09,28.338
2016-05-10,28.4758
2016-05-11,27.9763
2016-05-12,27.7523
2016-05-13,27.313
2016-05-16,27.5714
2016-05-17,27.1149
2016-05-18,27.2441
2016-05-19,27.2183
2016-05-20,27.8471
2016-05-23,27.6231
2016-05-24,28.6309
2016-05-25,28.605
2016-05-26,28.5964
2016-05-27,28.9237
2016-05-31,29.0874
2016-06-01,29.1132
2016-06-02,29.1994
2016-06-03,28.8893
2016-06-06,28.8548
2016-06-07,28.8893
2016-06-08,29.096
2016-06-09,28.2519
2016-06-10,27.8729
2016-06-13,27.3216
2016-06-14,28.0882
2016-06-15,28.1055
2016-06-16,27.9332
2016-06-17,27.8729
2016-06-20,28.3983
2016-06-21,28.3294
2016-06-22,28.338
2016-06-23,28.4242
2016-06-24,27.5198
2016-06-27,27.003
2016-06-28,27.3389
2016-06-29,27.8901
2016-06-30,28.4586
2016-07-01,28.2605
2016-07-05,28.0021
2016-07-06,28.435
2016-07-07,28.2878
2016-07-08,29.2749
2016-07-11,29.5607
2016-07-12,30.0802
2016-07-13,30.2793
2016-07-14,30.3746
2016-07-15,30.1235
2016-07-18,30.2793
2016-07-19,31.0932
2016-07-20,31.4136
2016-07-21,30.8941
2016-07-22,31.1452
2016-07-25,30.591
2016-07-26,30.9634
2016-07-27,29.4568
2016-07-28,29.5953
2016-07-29,30.0715
2016-08-01,29.8724
2016-08-02,29.9763
2016-08-03,29.8204
2016-08-04,30.0542
2016-08-05,30.1668
2016-08-08,30.0455
2016-08-09,30.2101
2016-08-10,29.5866
2016-08-11,29.5001
2016-08-12,29.3009
2016-08-15,29.9849
2016-08-16,30.0542
2016-08-17,29.5866
2016-08-18,29.8637
2016-08-19,29.7598
2016-08-22,29.552
2016-08-23,30.0282
2016-08-24,29.0325
2016-08-25,29.3355
2016-08-26,29.0411
2016-08-29,28.8247
2016-08-30,29.0585
2016-08-31,28.9719
2016-09-01,28.9978
2016-09-02,29.2836
2016-09-06,29.4221
2016-09-07,29.7079
2016-09-08,29.0325
2016-09-09,27.6644
2016-09-12,27.8982
2016-09-13,27.6038
2016-09-14,27.7856
2016-09-15,27.7164
2016-09-16,27.6125
2016-09-19,28.2619
2016-09-20,28.3917
2016-09-21,29.2749
2016-09-22,29.5347
2016-09-23,29.5607
2016-09-26,28.7987
2016-09-27,28.9805
2016-09-28,27.8895
2016-09-29,27.0323
2016-09-30,27.0756
2016-10-03,26.2531
2016-10-04,26.1492
2016-10-05,26.3146
2016-10-06,26.4975
2016-10-07,26.4017
2016-10-10,26.6629
2016-10-11,26.0098
2016-10-12,26.332
2016-10-13,26.0882
2016-10-14,25.827
2016-10-17,26.1666
2016-10-18,27.7775
2016-10-19,27.7339
2016-10-20,27.3421
2016-10-21,26.6019
2016-10-24,26.9067
2016-10-25,26.4278
2016-10-26,26.6455
2016-10-27,26.0795
2016-10-28,26.9067
2016-10-31,26.7326
2016-11-01,26.1666
2016-11-02,26.1666
2016-11-03,25.9924
2016-11-04,26.123
2016-11-07,26.3407
2016-11-08,26.2101
2016-11-09,27.5162
2016-11-10,27.9952
2016-11-11,29.0836
2016-11-14,29.9544
2016-11-15,29.5626
2016-11-16,29.6496
2016-11-17,30.0415
2016-11-18,29.9109
2016-11-21,30.2156
2016-11-22,30.9122
2016-11-23,30.6946
2016-11-25,30.9558
2016-11-28,30.4769
2016-11-29,30.5204
2016-11-30,30.0415
2016-12-01,30.1721
2016-12-02,30.2592
2016-12-05,30.8252
2016-12-06,30.8252
2016-12-07,31.5218
2016-12-08,32.4361
2016-12-09,32.4361
2016-12-12,32.6538
2016-12-13,32.4361
2016-12-14,31.8701
2016-12-15,31.9136
2016-12-16,32.0878
2016-12-19,33.3069
2016-12-20,33.7858
2016-12-21,32.9585
2016-12-22,32.1313
2016-12-23,32.1313
2016-12-27,32.7409
2016-12-28,32.2619
2016-12-29,32.6538
2016-12-30,32.0878
2017-01-03,32.4361
2017-01-04,32.5667
2017-01-05,31.3041
2017-01-06,30.6388
2017-01-09,30.3762
2017-01-10,30.595
2017-01-11,27.3561
2017-01-12,27.2685
2017-01-13,27.75
2017-01-17,27.9688
2017-01-18,28.0126
2017-01-19,28.1001
2017-01-20,28.2752
2017-01-23,28.319
2017-01-24,29.0193
2017-01-25,29.5008
2017-01-26,25.8241
2017-01-27,25.3864
2017-01-30,25.2551
2017-01-31,25.474
2017-02-01,24.9487
2017-02-02,24.6861
2017-02-03,24.8612
2017-02-06,25.3864
2017-02-07,25.2551
2017-02-08,25.1238
2017-02-09,25.2113
2017-02-10,25.5615
2017-02-13,25.2989
2017-02-14,25.08
2017-02-15,24.7299
2017-02-16,24.9925
2017-02-17,24.3797
2017-02-21,25.08
2017-02-22,25.2113
2017-02-23,24.7299
2017-02-24,24.905
2017-02-27,25.6053
2017-02-28,25.1676
2017-03-01,25.9554
2017-03-02,25.649
2017-03-03,25.5177
2017-03-06,24.8612
2017-03-07,24.8174
2017-03-08,25.5615
2017-03-09,25.2113
2017-03-10,25.3864
2017-03-13,25.3864
2017-03-14,26.4369
2017-03-15,27.181
2017-03-16,27.1372
2017-03-17,27.5311
2017-03-20,26.6557
2017-03-21,25.7803
2017-03-22,25.9117
2017-03-23,26.4369
2017-03-24,26.043
2017-03-27,26.3056
2017-03-28,26.2618
2017-03-29,26.4369
2017-03-30,26.612
2017-03-31,26.8308
2017-04-03,26.2618
2017-04-04,25.649
2017-04-05,25.7366
2017-04-06,26.6557
2017-04-07,26.1625
2017-04-10,26.1184
2017-04-11,26.691
2017-04-12,25.8982
2017-04-13,25.722
2017-04-17,26.1184
2017-04-18,26.3827
2017-04-19,26.3827
2017-04-20,27.1314
2017-04-21,27.2636
2017-04-24,27.1314
2017-04-25,27.3957
2017-04-26,27.5278
2017-04-27,25.5458
2017-04-28,26.2505
2017-05-01,27.0433
2017-05-02,28.1445
2017-05-03,27.2195
2017-05-04,26.9993
2017-05-05,27.3076
2017-05-08,27.3957
2017-05-09,27.3076
2017-05-10,27.3957
2017-05-11,26.4267
2017-05-12,25.1494
2017-05-15,24.6209
2017-05-16,24.6649
2017-05-17,24.5768
2017-05-18,24.1364
2017-05-19,24.3566
2017-05-22,24.0483
2017-05-23,23.9162
2017-05-24,23.8281
2017-05-25,23.8721
2017-05-26,24.1364
2017-05-30,23.784
2017-05-31,23.74
2017-06-01,24.1804
2017-06-02,23.8721
2017-06-05,23.74
2017-06-06,24.2685
2017-06-07,24.4007
2017-06-08,25.1494
2017-06-09,25.4577
2017-06-12,25.6339
2017-06-13,25.6339
2017-06-14,26.4708
2017-06-15,26.1184
2017-06-16,26.1625
2017-06-19,26.1184
2017-06-20,25.4577
2017-06-21,26.2946
2017-06-22,26.5148
2017-06-23,26.4267
2017-06-26,27.1314
2017-06-27,27.0874
2017-06-28,27.5278
2017-06-29,27.8802
2017-06-30,28.4528
2017-07-03,28.4968
2017-07-05,28.1004
2017-07-06,27.6159
2017-07-07,26.5879
2017-07-10,26.3663
2017-07-11,26.8981
2017-07-12,26.9424
2017-07-13,26.9424
2017-07-14,27.1196
2017-07-17,26.9867
2017-07-18,27.0753
2017-07-19,27.6514
2017-07-20,27.8729
2017-07-21,27.6514
2017-07-24,27.2526
2017-07-25,27.6071
2017-07-26,27.2969
2017-07-27,28.6263
2017-07-28,28.8478
2017-07-31,28.4047
2017-08-01,28.6263
2017-08-02,28.0945
2017-08-03,27.74
2017-08-04,28.4047
2017-08-07,28.6263
2017-08-08,28.3604
2017-08-09,28.449
2017-08-10,27.8729
2017-08-11,27.9173
2017-08-14,28.3161
2017-08-15,27.3412
2017-08-16,27.2526
2017-08-17,26.6322
2017-08-18,26.1004
2017-08-21,26.1004
2017-08-22,26.1891
2017-08-23,24.9926
2017-08-24,24.3722
2017-08-25,24.6381
2017-08-28,24.904
2017-08-29,25.0369
2017-08-30,25.3471
2017-08-31,25.9232
2017-09-01,26.4106
2017-09-05,26.4992
2017-09-06,26.6765
2017-09-07,26.7651
2017-09-08,27.031
2017-09-11,26.7651
2017-09-12,27.031
2017-09-13,26.8094
2017-09-14,26.5436
2017-09-15,26.7651
2017-09-18,27.1639
2017-09-19,27.2083
2017-09-20,27.2526
2017-09-21,26.8537
2017-09-22,27.1196
2017-09-25,27.1639
2017-09-26,27.6071
2017-09-27,28.3161
2017-09-28,28.7592
2017-09-29,28.7149
2017-10-02,28.7149
2017-10-03,28.8478
2017-10-04,28.7592
2017-10-05,28.4933
2017-10-06,27.9941
2017-10-09,27.9495
2017-10-10,27.9049
2017-10-11,27.1917
2017-10-12,25.8544
2017-10-13,26.8351
2017-10-16,26.5231
2017-10-17,26.9242
2017-10-18,27.6375
2017-10-19,27.6375
2017-10-20,27.8604
2017-10-23,27.7266
2017-10-24,27.9941
2017-10-25,27.6375
2017-10-26,27.8604
2017-10-27,26.7905
2017-10-30,25.9881
2017-10-31,26.5231
2017-11-01,26.1664
2017-11-02,25.899
2017-11-03,25.6761
2017-11-06,25.0075
2017-11-07,24.1605
2017-11-08,24.1159
2017-11-09,24.2496
2017-11-10,24.5617
2017-11-13,24.2051
2017-11-14,24.74
2017-11-15,24.4725
2017-11-16,25.1412
2017-11-17,25.2749
2017-11-20,25.2303
2017-11-21,25.5424
2017-11-22,25.2749
2017-11-24,25.3195
2017-11-27,24.9183
2017-11-28,25.8544
2017-11-29,26.0773
2017-11-30,26.211
2017-12-01,25.7653
2017-12-04,26.3893
2017-12-05,25.8098
2017-12-06,25.8098
2017-12-07,25.8544
2017-12-08,25.7207
2017-12-11,25.4086
2017-12-12,25.3641
2017-12-13,25.3641
2017-12-14,24.5171
2017-12-15,25.1412
2017-12-18,26.0327
2017-12-19,26.0773
2017-12-20,26.0327
2017-12-21,25.8544
2017-12-22,25.4532
2017-12-26,25.7653
2017-12-27,26.0327
2017-12-28,25.8544
2017-12-29,25.4978
2018-01-02,25.5869
2018-01-03,25.8098
2018-01-04,25.5869
2018-01-05,25.4532
2018-01-08,25.4978
2018-01-09,25.1783
2018-01-10,24.6793
2018-01-11,25.632
2018-01-12,25.9949
2018-01-16,25.5413
2018-01-17,23.6813
2018-01-18,24.2257
2018-01-19,24.8608
2018-01-22,24.8154
2018-01-23,24.5432
2018-01-24,24.4525
2018-01-25,22.7286
2018-01-26,23.4998
2018-01-29,22.6378
2018-01-30,22.5925
2018-01-31,22.5471
2018-02-01,22.5925
2018-02-02,22.1388
2018-02-05,21.6398
2018-02-06,21.7759
2018-02-07,22.4564
2018-02-08,22.0481
2018-02-09,22.6832
2018-02-12,22.6378
2018-02-13,22.3203
2018-02-14,22.5925
2018-02-15,22.6832
2018-02-16,22.91
2018-02-20,22.5925
2018-02-21,22.91
2018-02-22,22.3203
2018-02-23,22.6378
2018-02-26,22.3656
2018-02-27,21.7305
2018-02-28,21.549
2018-03-01,21.7305
2018-03-02,21.8666
2018-03-05,22.0934
2018-03-06,22.5471
2018-03-07,21.8212
2018-03-08,21.7305
2018-03-09,21.912
2018-03-12,21.912
2018-03-13,22.0934
2018-03-14,21.9573
2018-03-15,21.8212
2018-03-16,22.3656
2018-03-19,21.549
2018-03-20,21.2768
2018-03-21,21.05
2018-03-22,20.5963
2018-03-23,20.188
2018-03-26,20.7778
2018-03-27,20.5963
2018-03-28,21.05
2018-03-29,20.8232
2018-04-02,20.2788
2018-04-03,20.5056
2018-04-04,21.0046
2018-04-05,21.05
2018-04-06,20.6417
2018-04-09,20.8685
2018-04-10,20.7222
2018-04-11,20.402
2018-04-12,20.4934
2018-04-13,20.4477
2018-04-16,20.5392
2018-04-17,20.6307
2018-04-18,20.4477
2018-04-19,20.1732
2018-04-20,20.1732
2018-04-23,20.4934
2018-04-24,20.7222
2018-04-25,21.3626
2018-04-26,21.0881
2018-04-27,20.9966
2018-04-30,20.1732
2018-05-01,20.6307
2018-05-02,21.0424
2018-05-03,21.1796
2018-05-04,21.9115
2018-05-07,21.82
2018-05-08,21.8658
2018-05-09,21.8658
2018-05-10,21.7743
2018-05-11,22.0487
2018-05-14,21.9115
2018-05-15,21.6828
2018-05-16,22.2317
2018-05-17,22.2775
2018-05-18,22.6434
2018-05-21,22.5519
2018-05-22,21.6828
2018-05-23,22.0945
2018-05-24,22.2317
2018-05-25,22.186
2018-05-29,22.1402
2018-05-30,22.1402
2018-05-31,21.4541
2018-06-01,21.7285
2018-06-04,22.003
2018-06-05,22.5062
2018-06-06,22.4147
2018-06-07,22.1402
2018-06-08,22.1402
2018-06-11,22.2317
2018-06-12,22.186
2018-06-13,22.0945
2018-06-14,22.3232
2018-06-15,22.2317
2018-06-18,22.5062
2018-06-19,22.8264
2018-06-20,22.9179
2018-06-21,22.7807
2018-06-22,22.369
2018-06-25,22.0487
2018-06-26,22.6892
2018-06-27,22.0487
2018-06-28,22.2775
2018-06-29,22.4147
2018-07-02,22.4604
2018-07-03,22.5977
2018-07-05,22.8264
2018-07-06,23.1924
2018-07-09,23.3675
2018-07-10,23.0449
2018-07-11,22.9066
2018-07-12,22.9988
2018-07-13,23.091
2018-07-16,22.3074
2018-07-17,22.4918
2018-07-18,22.3535
2018-07-19,22.7222
2018-07-20,22.3996
2018-07-23,22.3074
2018-07-24,21.7083
2018-07-25,21.6161
2018-07-26,20.7404
2018-07-27,20.6021
2018-07-30,20.6943
2018-07-31,20.7404
2018-08-01,20.5099
2018-08-02,20.5099
2018-08-03,20.7404
2018-08-06,20.4177
2018-08-07,20.6021
2018-08-08,20.6943
2018-08-09,20.4638
2018-08-10,20.3717
2018-08-13,20.6021
2018-08-14,20.8786
2018-08-15,20.9247
2018-08-16,21.063
2018-08-17,21.2474
2018-08-20,21.4778
2018-08-21,21.6161
2018-08-22,21.2935
2018-08-23,21.063
2018-08-24,21.063
2018-08-27,20.8786
2018-08-28,20.8786
2018-08-29,20.8326
2018-08-30,20.3717
2018-08-31,20.5099
2018-09-04,20.5099
2018-09-05,20.5099
2018-09-06,20.4638
2018-09-07,20.7404
2018-09-10,21.2013
2018-09-11,20.9247
2018-09-12,20.2334
2018-09-13,19.9108
2018-09-14,20.1873
2018-09-17,20.049
2018-09-18,19.8647
2018-09-19,20.0951
2018-09-20,20.3256
2018-09-21,20.0029
2018-09-24,19.7264
2018-09-25,19.7264
2018-09-26,19.7725
2018-09-27,19.0351
2018-09-28,19.1272
2018-10-01,19.0996
2018-10-02,18.906
2018-10-03,19.2471
2018-10-04,19.0904
2018-10-05,18.2976
2018-10-08,18.4912
2018-10-09,17.9328
2018-10-10,17.9887
2018-10-11,19.0682
2018-10-12,19.031
2018-10-15,19.2543
2018-10-16,19.822
2018-10-17,19.4777
2018-10-18,18.9844
2018-10-19,18.6029
2018-10-22,18.668
2018-10-23,18.6866
2018-10-24,18.1562
2018-10-25,18.4819
2018-10-26,18.333
2018-10-29,18.1655
2018-10-30,18.547
2018-10-31,17.8119
2018-11-01,18.3144
2018-11-02,18.4168
2018-11-05,17.7188
2018-11-06,18.1469
2018-11-07,18.4075
2018-11-08,18.3702
2018-11-09,18.4354
2018-11-12,18.0259
2018-11-13,18.333
2018-11-14,17.9887
2018-11-15,17.7932
2018-11-16,18.212
2018-11-19,17.9421
2018-11-20,18.2213
2018-11-21,18.9565
2018-11-23,19.0496
2018-11-26,19.1333
2018-11-27,19.0217
2018-11-28,19.4218
2018-11-29,19.2915
2018-11-30,19.3381
2018-12-03,19.366
2018-12-04,18.4168
2018-12-06,18.6866
2018-12-07,18.3237
2018-12-10,18.0445
2018-12-11,18.119
2018-12-12,18.1934
2018-12-13,17.7188
2018-12-14,17.3559
2018-12-17,17.5327
2018-12-18,17.5978
2018-12-19,16.9743
2018-12-20,16.8347
2018-12-21,16.5648
2018-12-24,16.2671
2018-12-26,16.6207
2018-12-27,16.6858
2018-12-28,16.6951
2018-12-31,16.3694
2019-01-02,16.63
2019-01-03,16.751
2019-01-04,17.4675
2019-01-07,18.091
2019-01-08,18.2399
2019-01-09,18.5472
2019-01-10,18.4482
2019-01-11,18.1016
2019-01-14,18.3195
2019-01-15,18.0026
2019-01-16,18.3294
2019-01-17,18.4779
2019-01-18,18.4878
2019-01-22,18.2501
2019-01-23,18.26
2019-01-24,18.2997
2019-01-25,18.5769
2019-01-28,18.567
2019-01-29,17.8045
2019-01-30,17.8739
2019-01-31,18.7948
2019-02-01,18.7057
2019-02-04,18.8047
2019-02-05,18.874
2019-02-06,18.2898
2019-02-07,18.5274
2019-02-08,19.0423
2019-02-11,18.9928
2019-02-12,19.3592
2019-02-13,19.1315
2019-02-14,19.3196
2019-02-15,19.5672
2019-02-19,19.5276
2019-02-20,19.4681
2019-02-21,19.3097
2019-02-22,19.4978
2019-02-25,19.9633
2019-02-26,20.1415
2019-02-27,19.5474
2019-02-28,19.884
2019-03-01,20.092
2019-03-04,19.6761
2019-03-05,19.3691
2019-03-06,19.4681
2019-03-07,19.1711
2019-03-08,19.181
2019-03-11,19.3988
2019-03-12,19.2602
2019-03-13,19.072
2019-03-14,18.7552
2019-03-15,18.9631
2019-03-18,19.2008
2019-03-19,19.1513
2019-03-20,18.8542
2019-03-21,18.9532
2019-03-22,18.369
2019-03-25,18.775
2019-03-26,19.0522
2019-03-27,19.2008
2019-03-28,19.2206
2019-03-29,18.9433
2019-04-01,18.9928
2019-04-02,18.775
2019-04-03,18.9829
2019-04-04,19.3097
2019-04-05,19.3691
2019-04-08,19.3691
2019-04-09,19.28
2019-04-10,19.85
2019-04-11,20.24
2019-04-12,19.94
2019-04-15,20.12
2019-04-16,20.31
2019-04-17,20.35
2019-04-18,20.05
2019-04-22,19.49
2019-04-23,19.85
2019-04-24,20.22
2019-04-25,19.75
2019-04-26,20.16
2019-04-29,20.41
2019-04-30,22.1
2019-05-01,21.82
2019-05-02,22.42
2019-05-03,22.54
2019-05-06,23.03
2019-05-07,22.43
2019-05-08,22.5
2019-05-09,22.67
2019-05-10,22.84
2019-05-13,22.32
2019-05-14,22.58
2019-05-15,22.8
2019-05-16,22.57
2019-05-17,22.64
2019-05-20,22.45
2019-05-21,22.34
2019-05-22,21.81
2019-05-23,21.43
2019-05-24,21.94
2019-05-28,21.64
2019-05-29,21.37
2019-05-30,21.72
2019-05-31,21.22
2019-06-03,20.88
2019-06-04,21.44
2019-06-05,21.28
2019-06-06,21.02
2019-06-07,20.91
2019-06-10,20.95
2019-06-11,20.91
2019-06-12,20.93
2019-06-13,21.01
2019-06-14,21.02
2019-06-17,20.715
2019-06-18,20.595
2019-06-19,20.975
2019-06-20,20.41
2019-06-21,20.2
2019-06-24,20.105
2019-06-25,20.2
2019-06-26,20.325
2019-06-27,20.475
2019-06-28,20.815
2019-07-01,21.13
2019-07-02,21.035
2019-07-03,20.99
2019-07-04,20.99
2019-07-05,20.965
2019-07-08,20.885
2019-07-09,20.34
2019-07-10,20.79
2019-07-11,20.555
2019-07-12,20.815
2019-07-15,20.59
2019-07-16,21.465
2019-07-17,21.075
2019-07-18,20.645
2019-07-19,20.685
2019-07-22,20.46
2019-07-23,20.57
2019-07-24,20.765
2019-07-25,20.67
2019-07-26,20.885
2019-07-29,20.72
2019-07-30,20.845
2019-07-31,20.63
2019-08-01,18.39
2019-08-02,17.55
2019-08-05,17.56
2019-08-06,17.535
2019-08-07,17.74
2019-08-08,17.895
2019-08-09,17.85
2019-08-12,17.81
2019-08-13,18.08
2019-08-14,17.755
2019-08-15,17.745
2019-08-16,17.89
2019-08-19,18.04
2019-08-20,17.865
2019-08-21,17.94
2019-08-22,18.165
2019-08-23,17.72
2019-08-26,17.43
2019-08-27,17.045
2019-08-28,17.34
2019-08-29,17.3
2019-08-30,17.195
2019-09-02,17.19
2019-09-03,16.895
2019-09-04,16.86
2019-09-05,17.555
2019-09-06,17.985
2019-09-09,18.16
2019-09-10,18.575
2019-09-11,18.905
2019-09-12,19.18
2019-09-13,19.38
2019-09-16,19.46
2019-09-17,19.14
2019-09-18,18.865
2019-09-19,18.585
2019-09-20,18.35
2019-09-23,18.545
2019-09-24,18.81
2019-09-25,18.695
2019-09-26,18.49
2019-09-27,18.905
2019-09-30,19.12
2019-10-01,18.95
2019-10-02,18.715
2019-10-03,18.195
2019-10-04,18.505
2019-10-07,18.875
2019-10-08,18.925
2019-10-09,18.345
2019-10-10,18.42
2019-10-11,18.76
2019-10-14,18.705
2019-10-15,19
2019-10-16,18.945
2019-10-17,19.16
2019-10-18,18.905
2019-10-21,19.235
2019-10-22,19.48
2019-10-23,19.41
2019-10-24,18.93
2019-10-25,19.36
2019-10-28,19.4
2019-10-29,19.735
2019-10-30,19.875
2019-10-31,19.735
2019-11-01,19.655
2019-11-04,19.735
2019-11-05,19.84
2019-11-06,19.405
2019-11-07,19.61
2019-11-08,19.525
2019-11-11,19.33
2019-11-12,19.18
2019-11-13,18.865
2019-11-14,18.925
2019-11-15,19.04
2019-11-18,18.885
2019-11-19,18.565
2019-11-20,18.345
2019-11-21,17.21
2019-11-22,17.12
2019-11-25,17.72
