date,close
2019-01-28,38.77
2019-01-29,38.66
2019-01-30,36.96
2019-01-31,35.43
2019-02-01,35.09
2019-02-04,34
2019-02-05,33.71
2019-02-06,33.53
2019-02-07,34.65
2019-02-08,34.23
2019-02-11,33.86
2019-02-12,33.25
2019-02-13,33.17
2019-02-14,33.77
2019-02-15,32.59
2019-02-19,32.69
2019-02-20,31.38
2019-02-21,31.79
2019-02-22,30.59
2019-02-25,31.14
2019-02-26,31.4
2019-02-27,31.43
2019-02-28,31.41
2019-03-01,29.98
2019-03-04,30.71
2019-03-05,30.89
2019-03-06,31.8
2019-03-07,33.01
2019-03-08,33.23
2019-03-11,30.81
2019-03-12,29.94
2019-03-13,29.62
2019-03-14,29.13
2019-03-15,28.59
2019-03-18,28.66
2019-03-19,28.85
2019-03-20,29.16
2019-03-21,28.78
2019-03-22,32.08
2019-03-25,32.24
2019-03-26,30.42
2019-03-27,30.88
2019-03-28,30.19
2019-03-29,29.26
2019-04-01,28.74
2019-04-02,28.66
2019-04-03,28.86
2019-04-04,28.57
2019-04-05,28
2019-04-08,27.87
2019-04-09,28.86
2019-04-10,28.05
2019-04-11,27.5
2019-04-12,26.26
2019-04-15,25.92
2019-04-16,25.71
2019-04-17,25.89
2019-04-18,25.48
2019-04-22,25.25
2019-04-23,25.05
2019-04-24,25.7
2019-04-25,26.2
2019-04-26,25.29
2019-04-29,25.68
2019-04-30,25.68
2019-05-01,26.65
2019-05-02,26.69
2019-05-03,25.42
2019-05-06,26.86
2019-05-07,31.33
2019-05-08,30.71
2019-05-09,30.55
2019-05-10,28.19
2019-05-13,32.45
2019-05-14,30.65
2019-05-15,29.36
2019-05-16,28.1
2019-05-17,28.52
2019-05-20,28.94
2019-05-21,27.48
2019-05-22,27.22
2019-05-23,29.02
2019-05-24,28.42
2019-05-28,29.27
2019-05-29,29.84
2019-05-30,29.31
2019-05-31,30.42
2019-06-03,30.73
2019-06-04,29.02
2019-06-05,28.46
2019-06-06,27.85
2019-06-07,28.06
2019-06-10,27.86
2019-06-11,27.91
2019-06-12,27.78
2019-06-13,27.695
2019-06-14,27.305
2019-06-17,27.065
2019-06-18,26.76
2019-06-19,26.07
2019-06-20,25.785
2019-06-21,26.335
2019-06-24,26.39
2019-06-25,26.985
2019-06-26,26.725
2019-06-27,26.385
2019-06-28,26.13
2019-07-01,24.645
2019-07-02,23.695
2019-07-03,23.36
2019-07-04,23.36
2019-07-05,23.68
2019-07-08,23.975
2019-07-09,24.305
2019-07-10,23.515
2019-07-11,23.37
2019-07-12,22.81
2019-07-15,22.715
2019-07-16,22.605
2019-07-17,23.285
2019-07-18,23.105
2019-07-19,23.365
2019-07-22,22.895
2019-07-23,22.105
2019-07-24,21.545
2019-07-25,22.255
2019-07-26,21.64
2019-07-29,21.755
2019-07-30,22.395
2019-07-31,23.615
2019-08-01,25.375
2019-08-02,25.685
2019-08-05,29.07
2019-08-06,27.635
2019-08-07,27.58
2019-08-08,26.065
2019-08-09,26.86
2019-08-12,28.88
2019-08-13,26.905
2019-08-14,30.355
2019-08-15,29.705
2019-08-16,28.02
2019-08-19,25.97
2019-08-20,26.615
2019-08-21,25.335
2019-08-22,25.665
2019-08-23,29.3
2019-08-26,28.3
2019-08-27,28.715
2019-08-28,28.105
2019-08-29,26.96
2019-08-30,26.93
2019-09-02,27.3
2019-09-03,28.195
2019-09-04,26.45
2019-09-05,25.405
2019-09-06,24.785
2019-09-09,24.475
2019-09-10,24.545
2019-09-11,24.055
2019-09-12,23.365
2019-09-13,23.105
2019-09-16,23.535
2019-09-17,23.315
2019-09-18,22.605
2019-09-19,22.25
2019-09-20,23.18
2019-09-23,23.095
2019-09-24,24.09
2019-09-25,23.63
2019-09-26,23.885
2019-09-27,24.605
2019-09-30,23.735
2019-10-01,24.735
2019-10-02,26.405
2019-10-03,25.475
2019-10-04,24.07
2019-10-07,24.26
2019-10-08,26.195
2019-10-09,25.15
2019-10-10,24.47
2019-10-11,23.025
2019-10-14,22.335
2019-10-15,21.52
2019-10-16,21.42
2019-10-17,21.305
2019-10-18,21.205
2019-10-21,20.68
2019-10-22,20.965
2019-10-23,20.815
2019-10-24,20.465
2019-10-25,19.795
2019-10-28,19.985
2019-10-29,19.975
2019-10-30,19.5
2019-10-31,19.875
2019-11-01,18.91
2019-11-04,18.975
2019-11-05,19.305
2019-11-06,19.25
2019-11-07,19.105
2019-11-08,18.68
2019-11-11,18.655
2019-11-12,18.355
2019-11-13,18.465
2019-11-14,18.225
2019-11-15,17.415
2019-11-18,17.42
2019-11-19,17.585
2019-11-20,17.77
2019-11-21,17.785
2019-11-22,17.265
2019-11-25,16.53
