date,close
2014-06-13,25.88
2014-06-16,25.67
2014-06-17,26.98
2014-06-18,26.85
2014-06-19,27.02
2014-06-20,27.46
2014-06-23,28.28
2014-06-24,28.6
2014-06-25,28.63
2014-06-26,28.51
2014-06-27,29.06
2014-06-30,29.14
2014-07-01,29.14
2014-07-02,28.96
2014-07-03,29.04
2014-07-07,28.64
2014-07-08,28.3
2014-07-09,28.13
2014-07-10,27.71
2014-07-11,27.42
2014-07-14,27.03
2014-07-15,26.28
2014-07-16,26.25
2014-07-17,25.61
2014-07-18,25.43
2014-07-21,24.85
2014-07-22,24.85
2014-07-23,24.9
2014-07-24,25.18
2014-07-25,24.99
2014-07-28,25.13
2014-07-29,25.48
2014-07-30,25.71
2014-07-31,25.52
2014-08-01,25.32
2014-08-04,25.44
2014-08-05,26.65
2014-08-06,26.59
2014-08-07,26.82
2014-08-08,26.6
2014-08-11,26.61
2014-08-12,26.55
2014-08-13,26.58
2014-08-14,26.92
2014-08-15,27.65
2014-08-18,28.26
2014-08-19,29.07
2014-08-20,29.33
2014-08-21,30.46
2014-08-22,31.98
2014-08-25,31.74
2014-08-26,31.99
2014-08-27,31.95
2014-08-28,31.9
2014-08-29,31.99
2014-09-02,31.96
2014-09-03,31.02
2014-09-04,31.26
2014-09-05,31.35
2014-09-08,31.24
2014-09-09,31.07
2014-09-10,31.26
2014-09-11,31.3
2014-09-12,31.45
2014-09-15,30.93
2014-09-16,31.65
2014-09-17,31.95
2014-09-18,31.98
2014-09-19,31.9
2014-09-22,31.82
2014-09-23,32.2
2014-09-24,32.14
2014-09-25,32.2
2014-09-26,34.83
2014-09-29,35.4
2014-09-30,35.89
2014-10-01,35
2014-10-02,35.06
2014-10-03,35.85
2014-10-06,35.5
2014-10-07,34.54
2014-10-08,34.5
2014-10-09,34.3
2014-10-10,34.2
2014-10-13,34.31
2014-10-14,34.5
2014-10-15,35.29
2014-10-16,36.6
2014-10-17,36.25
2014-10-20,37
2014-10-21,37.01
2014-10-22,37.06
2014-10-23,37.08
2014-10-24,36.45
2014-10-27,36.26
2014-10-28,36.5
2014-10-29,36.57
2014-10-30,36.66
2014-10-31,36.99
2014-11-03,36.76
2014-11-04,36.68
2014-11-05,36.16
2014-11-06,43.91
2014-11-07,47.03
2014-11-10,47.72
2014-11-11,48.01
2014-11-12,48.17
2014-11-13,47.3
2014-11-14,47.4
2014-11-17,46.89
2014-11-18,46.32
2014-11-19,45.3
2014-11-20,44.48
2014-11-21,44.5
2014-11-24,44.98
2014-11-25,44.47
2014-11-26,44.62
2014-11-28,45.26
2014-12-01,45.29
2014-12-02,45.39
2014-12-03,44.74
2014-12-04,44.23
2014-12-05,43.82
2014-12-08,42.35
2014-12-09,42.355
2014-12-10,41.67
2014-12-11,43.12
2014-12-12,42.85
2014-12-15,41.7
2014-12-16,41.6
2014-12-17,43.45
2014-12-18,44.32
2014-12-19,43.29
2014-12-22,43.55
2014-12-23,46.18
2014-12-24,47.39
2014-12-26,47.96
2014-12-29,48.05
2014-12-30,47.93
2014-12-31,48.34
2015-01-02,47.34
2015-01-05,46.94
2015-01-06,48.21
2015-01-07,48.19
2015-01-08,49.21
2015-01-09,49.39
2015-01-12,48.47
2015-01-13,45.3
2015-01-14,44.43
2015-01-15,41.73
2015-01-16,42.77
2015-01-20,41.13
2015-01-21,41.14
2015-01-22,42.2
2015-01-23,40.4
2015-01-26,40.43
2015-01-27,40.83
2015-01-28,40.9
2015-01-29,40.76
2015-01-30,41.18
2015-02-02,41.56
2015-02-03,42.68
2015-02-04,42.35
2015-02-05,42.01
2015-02-06,41.26
2015-02-09,40.3
2015-02-10,40.51
2015-02-11,40.19
2015-02-12,42.52
2015-02-13,42.92
2015-02-17,43.33
2015-02-18,43.8
2015-02-19,43.9
2015-02-20,43.84
2015-02-23,43.55
2015-02-24,44.07
2015-02-25,47
2015-02-26,52.16
2015-02-27,53.04
2015-03-02,52.91
2015-03-03,52.42
2015-03-04,52.39
2015-03-05,52.03
2015-03-06,51.11
2015-03-09,51.8
2015-03-10,50.63
2015-03-11,54
2015-03-12,54.42
2015-03-13,54.24
2015-03-16,54.39
2015-03-17,54.88
2015-03-18,56.55
2015-03-19,56.28
2015-03-20,55.9
2015-03-23,57.64
2015-03-24,56.23
2015-03-25,56.12
2015-03-26,56.09
2015-03-27,55.92
2015-03-30,56.06
2015-03-31,56.01
2015-04-01,55.87
2015-04-02,55.86
2015-04-06,56.86
2015-04-07,58.1
2015-04-08,57.23
2015-04-09,56.99
2015-04-10,56.6
2015-04-13,56.78
2015-04-14,56.86
2015-04-15,58.69
2015-04-16,59
2015-04-17,59.89
2015-04-20,59.99
2015-04-21,59.91
2015-04-22,59.94
2015-04-23,60.73
2015-04-24,60.91
2015-04-27,61.12
2015-04-28,61.75
2015-04-29,61.75
2015-04-30,55.03
2015-05-01,55.02
2015-05-04,55.71
2015-05-05,55.73
2015-05-06,56
2015-05-07,55.94
2015-05-08,57.34
2015-05-11,57.91
2015-05-12,57.76
2015-05-13,57.28
2015-05-14,57.3
2015-05-15,57.2
2015-05-18,57
2015-05-19,59.22
2015-05-20,60.07
2015-05-21,57.74
2015-05-22,57.01
2015-05-26,57.44
2015-05-27,58.36
2015-05-28,58.53
2015-05-29,59.26
2015-06-01,59.62
2015-06-02,61.29
2015-06-03,63.41
2015-06-04,62.93
2015-06-05,62.7
2015-06-08,62.42
2015-06-09,63.54
2015-06-10,64.3
2015-06-11,63.86
2015-06-12,63.99
2015-06-15,64.78
2015-06-16,65.24
2015-06-17,65.99
2015-06-18,72.38
2015-06-19,71.82
2015-06-22,73.42
2015-06-23,73.5
2015-06-24,73.23
2015-06-25,76.94
2015-06-26,78.16
2015-06-29,77.89
2015-06-30,78.61
2015-07-01,78.18
2015-07-02,74.99
2015-07-06,76.71
2015-07-07,76.84
2015-07-08,77.92
2015-07-09,78.63
2015-07-10,77.85
2015-07-13,78.15
2015-07-14,82.35
2015-07-15,83.47
2015-07-16,81.4
2015-07-17,82.56
2015-07-20,83.28
2015-07-21,84.22
2015-07-22,84.8
2015-07-23,81.65
2015-07-24,82.16
2015-07-27,81.71
2015-07-28,83.22
2015-07-29,79.66
2015-07-30,82.01
2015-07-31,82.92
2015-08-03,82.595
2015-08-04,117.51
2015-08-05,117.95
2015-08-06,113.37
2015-08-07,121.035
2015-08-10,119.52
2015-08-11,125.09
2015-08-12,121.9
2015-08-13,134.46
2015-08-14,133.71
2015-08-17,138.08
2015-08-18,136.66
2015-08-19,136.9
2015-08-20,133.87
2015-08-21,110.88
2015-08-24,104.2
2015-08-25,104.66
2015-08-26,107.82
2015-08-27,103.35
2015-08-28,107.2
2015-08-31,105.95
2015-09-01,100.85
2015-09-02,98.44
2015-09-03,104.94
2015-09-04,104.19
2015-09-08,105.48
2015-09-09,103.95
2015-09-10,104.93
2015-09-11,105.34
2015-09-14,105.49
2015-09-15,115.83
2015-09-16,116.23
2015-09-17,118.27
2015-09-18,115.81
2015-09-21,115.6
2015-09-22,116.3
2015-09-23,116.87
2015-09-24,103.05
2015-09-25,98.43
2015-09-28,91.07
2015-09-29,89.99
2015-09-30,93.03
2015-10-01,90.04
2015-10-02,92.51
2015-10-05,96.13
2015-10-06,91.49
2015-10-07,95.5
2015-10-08,96
2015-10-09,96.37
2015-10-12,98.05
2015-10-13,92.39
2015-10-14,92.64
2015-10-15,96.36
2015-10-16,96.19
2015-10-19,98.46
2015-10-20,98.74
2015-10-21,94.49
2015-10-22,94.62
2015-10-23,98
2015-10-26,120.98
2015-10-27,124
2015-10-28,127.29
2015-10-29,122.51
2015-10-30,121.36
2015-11-02,115
2015-11-03,115.77
2015-11-04,113.9
2015-11-05,120.25
2015-11-06,124.97
2015-11-09,128.98
2015-11-10,121.3
2015-11-11,121.46
2015-11-12,119
2015-11-13,116.49
2015-11-16,117.19
2015-11-17,116.79
2015-11-18,110.51
2015-11-19,103.83
2015-11-20,100.92
2015-11-23,100.23
2015-11-24,102.2
2015-11-25,100.82
2015-11-27,102.58
2015-11-30,101.88
2015-12-01,105.99
2015-12-02,99.93
2015-12-03,97.15
2015-12-04,102.13
2015-12-07,98.97
2015-12-08,95.73
2015-12-09,92.54
2015-12-10,102.74
2015-12-11,94.51
2015-12-14,94.15
2015-12-15,97.6
2015-12-16,98.01
2015-12-17,95.17
2015-12-18,95.39
2015-12-21,93.01
2015-12-22,90.04
2015-12-23,91.5
2015-12-24,91.21
2015-12-28,90.04
2015-12-29,91.31
2015-12-30,89.8
2015-12-31,89.28
2016-01-04,87.89
2016-01-05,87.82
2016-01-06,86.34
2016-01-07,84.04
2016-01-08,83.04
2016-01-11,81.97
2016-01-12,86.63
2016-01-13,61.14
2016-01-14,66.24
2016-01-15,67.74
2016-01-19,67.64
2016-01-20,71.83
2016-01-21,71.75
2016-01-22,71.04
2016-01-25,70.15
2016-01-26,72.62
2016-01-27,71.05
2016-01-28,70.36
2016-01-29,73.69
2016-02-01,73.88
2016-02-02,65.96
2016-02-03,64.38
2016-02-04,67.64
2016-02-05,60.05
2016-02-08,55.77
2016-02-09,54.98
2016-02-10,57.1
2016-02-11,57.08
2016-02-12,59.81
2016-02-16,63.36
2016-02-17,62.15
2016-02-18,64.69
2016-02-19,63.69
2016-02-22,67.96
2016-02-23,68.9
2016-02-24,69.94
2016-02-25,85.5
2016-02-26,83.48
2016-02-29,88.37
2016-03-01,90.11
2016-03-02,85.97
2016-03-03,89.89
2016-03-04,90.4
2016-03-07,90
2016-03-08,85.19
2016-03-09,85.6
2016-03-10,82.17
2016-03-11,86.02
2016-03-14,88.17
2016-03-15,89.96
2016-03-16,91.4
2016-03-17,95.78
2016-03-18,93.26
2016-03-21,92.17
2016-03-22,94.81
2016-03-23,92.36
2016-03-24,95.1
2016-03-28,94.33
2016-03-29,94.27
2016-03-30,92.68
2016-03-31,97.78
2016-04-01,97.39
2016-04-04,102.18
2016-04-05,99.03
2016-04-06,101.37
2016-04-07,99.26
2016-04-08,99.9
2016-04-11,94.92
2016-04-12,93.86
2016-04-13,98.86
2016-04-14,97
2016-04-15,97.64
2016-04-18,101.37
2016-04-19,102.95
2016-04-20,101.85
2016-04-21,99.35
2016-04-22,93.92
2016-04-25,90.86
2016-04-26,89.49
2016-04-27,91.26
2016-04-28,87.83
2016-04-29,89.47
2016-05-02,92.39
2016-05-03,85.18
2016-05-04,82.62
2016-05-05,79.43
2016-05-06,75.56
2016-05-09,73.34
2016-05-10,73.54
2016-05-11,70.72
2016-05-12,67.14
2016-05-13,69.69
2016-05-16,70.47
2016-05-17,67.4
2016-05-18,70.01
2016-05-19,69.5
2016-05-20,69.04
2016-05-23,74.62
2016-05-24,81
2016-05-25,78.1
2016-05-26,79.52
2016-05-27,81.09
2016-05-31,83.25
2016-06-01,83.96
2016-06-02,87.85
2016-06-03,85.98
2016-06-06,88.03
2016-06-07,89.51
2016-06-08,91.15
2016-06-09,87.93
2016-06-10,85.77
2016-06-13,81.42
2016-06-14,74.13
2016-06-15,74.26
2016-06-16,74.16
2016-06-17,72.25
2016-06-20,76.96
2016-06-21,76.12
2016-06-22,76.46
2016-06-23,79.23
2016-06-24,78.4
2016-06-27,79.44
2016-06-28,81.24
2016-06-29,84.72
2016-06-30,88.33
2016-07-01,92.84
2016-07-05,92.11
2016-07-06,95.21
2016-07-07,93.11
2016-07-08,95.76
2016-07-11,96.37
2016-07-12,96.15
2016-07-13,98.9
2016-07-14,102.71
2016-07-15,102.29
2016-07-18,102.9
2016-07-19,101.5
2016-07-20,95.37
2016-07-21,94.93
2016-07-22,97.41
2016-07-25,98.13
2016-07-26,95.35
2016-07-27,95.5
2016-07-28,102.29
2016-07-29,100.98
2016-08-01,102.34
2016-08-02,99.34
2016-08-03,102.38
2016-08-04,106.57
2016-08-05,110.02
2016-08-08,108.17
2016-08-09,110.62
2016-08-10,111.6
2016-08-11,110.77
2016-08-12,110.35
2016-08-15,110.39
2016-08-16,106.24
2016-08-17,103.58
2016-08-18,103.79
2016-08-19,102.92
2016-08-22,102.33
2016-08-23,107.05
2016-08-24,102.56
2016-08-25,102.41
2016-08-26,100.68
2016-08-29,101.67
2016-08-30,101.03
2016-08-31,97
2016-09-01,95.34
2016-09-02,95.69
2016-09-06,95.08
2016-09-07,98.16
2016-09-08,100.49
2016-09-09,101.55
2016-09-12,103.07
2016-09-13,98.15
2016-09-14,96.47
2016-09-15,96.28
2016-09-16,95.63
2016-09-19,92.57
2016-09-20,88.93
2016-09-21,89.32
2016-09-22,93.99
2016-09-23,92.14
2016-09-26,91.83
2016-09-27,93.19
2016-09-28,96.16
2016-09-29,96.12
2016-09-30,96.91
2016-10-03,97.16
2016-10-04,97.62
2016-10-05,94.87
2016-10-06,91.78
2016-10-07,91.02
2016-10-10,91.95
2016-10-11,90.58
2016-10-12,90.55
2016-10-13,89.34
2016-10-14,88.87
2016-10-17,87.79
2016-10-18,88.76
2016-10-19,91.48
2016-10-20,88.44
2016-10-21,89.28
2016-10-24,90.88
2016-10-25,89.15
2016-10-26,91.27
2016-10-27,77.07
2016-10-28,77.73
2016-10-31,79.85
2016-11-01,80.6
2016-11-02,80.8
2016-11-03,79.85
2016-11-04,81.55
2016-11-07,83.6
2016-11-08,83.4
2016-11-09,87.55
2016-11-10,90.5
2016-11-11,95.15
2016-11-14,95.5
2016-11-15,93.7
2016-11-16,88.15
2016-11-17,93.2
2016-11-18,100
2016-11-21,102.55
2016-11-22,105.5
2016-11-23,106.55
2016-11-25,107.8
2016-11-28,106.1
2016-11-29,101.4
2016-11-30,104.8
2016-12-01,101.65
2016-12-02,98.85
2016-12-05,99.25
2016-12-06,99.85
2016-12-07,100.2
2016-12-08,105
2016-12-09,105.3
2016-12-12,102.7
2016-12-13,102.15
2016-12-14,102.95
2016-12-15,104.2
2016-12-16,105.8
2016-12-19,107.4
2016-12-20,108.6
2016-12-21,106.65
2016-12-22,103.3
2016-12-23,102.7
2016-12-27,103.35
2016-12-28,100.95
2016-12-29,100.3
2016-12-30,101.35
2017-01-03,98.35
2017-01-04,104.05
2017-01-05,102
2017-01-06,100.75
2017-01-09,101.45
2017-01-10,105.05
2017-01-11,104.25
2017-01-12,103.75
2017-01-13,104.6
2017-01-17,104.9
2017-01-18,105.95
2017-01-19,106
2017-01-20,105.65
2017-01-23,104.15
2017-01-24,106.35
2017-01-25,105.8
2017-01-26,106.1
2017-01-27,110.8
2017-01-30,110.9
2017-01-31,111.9
2017-02-01,111
2017-02-02,111.9
2017-02-03,114.6
2017-02-06,113.7
2017-02-07,113.5
2017-02-08,115.95
2017-02-09,116.8
2017-02-10,117
2017-02-13,115.8
2017-02-14,117.95
2017-02-15,114.4
2017-02-16,113.65
2017-02-17,112.95
2017-02-21,113.6
2017-02-22,112.15
2017-02-23,122.25
2017-02-24,123.4
2017-02-27,121.8
2017-02-28,118.4
2017-03-01,119.3
2017-03-02,117.2
2017-03-03,119.1
2017-03-06,118.4
2017-03-07,117.25
2017-03-08,116.45
2017-03-09,115.4
2017-03-10,118.9
2017-03-13,120.9
2017-03-14,120.7
2017-03-15,121.2
2017-03-16,123.9
2017-03-17,124
2017-03-20,122.55
2017-03-21,116.65
2017-03-22,117.5
2017-03-23,118.75
2017-03-24,118.85
2017-03-27,119.7
2017-03-28,124.15
2017-03-29,123.7
2017-03-30,125.75
2017-03-31,125.35
2017-04-03,121.8
2017-04-04,118.6
2017-04-05,117.8
2017-04-06,121.5
2017-04-07,122.65
2017-04-10,119.4
2017-04-11,122.05
2017-04-12,120.55
2017-04-13,116.8
2017-04-17,119.85
2017-04-18,121.95
2017-04-19,123.7
2017-04-20,125.2
2017-04-21,127.15
2017-04-24,129
2017-04-25,131.2
2017-04-26,125.75
2017-04-27,142.4
2017-04-28,140.9
2017-05-01,144.425
2017-05-02,144.4
2017-05-03,142.65
2017-05-04,146.45
2017-05-05,146.875
2017-05-08,147.95
2017-05-09,146.55
2017-05-10,146.1
2017-05-11,148.6
2017-05-12,151.3
2017-05-15,154.2
2017-05-16,158
2017-05-17,152.6
2017-05-18,153.35
2017-05-19,157.65
2017-05-22,156.75
2017-05-23,157.6
2017-05-24,156.7
2017-05-25,155.85
2017-05-26,157.45
2017-05-30,157.9
2017-05-31,155.6
2017-06-01,163.4
2017-06-02,166
2017-06-05,163.5
2017-06-06,170.7
2017-06-07,169.8
2017-06-08,170.85
2017-06-09,170
2017-06-12,161.3
2017-06-13,163.95
2017-06-14,166.8
2017-06-15,166.55
2017-06-16,169.85
2017-06-19,175.2
2017-06-20,173.3
2017-06-21,178.85
2017-06-22,179.65
2017-06-23,182.05
2017-06-26,181
2017-06-27,175
2017-06-28,179.85
2017-06-29,175
2017-06-30,172.2
2017-07-03,171.4
2017-07-05,174.35
2017-07-06,167.15
2017-07-07,168.9
2017-07-10,172.1
2017-07-11,170.45
2017-07-12,173.4
2017-07-13,171.25
2017-07-14,173.65
2017-07-17,174.3
2017-07-18,180.25
2017-07-19,181.2
2017-07-20,180.9
2017-07-21,181.925
2017-07-24,184.35
2017-07-25,186.05
2017-07-26,183.8
2017-07-27,217.15
2017-07-28,216.55
2017-07-31,220.6
2017-08-01,224.25
2017-08-02,228.25
2017-08-03,229.95
2017-08-04,229.25
2017-08-07,233.45
2017-08-08,229.3
2017-08-09,229.2
2017-08-10,221.85
2017-08-11,219.65
2017-08-14,226.35
2017-08-15,223.5
2017-08-16,229.2
2017-08-17,222.1
2017-08-18,224.85
2017-08-21,225.8
2017-08-22,226.85
2017-08-23,225.5
2017-08-24,225.7
2017-08-25,222.75
2017-08-28,229.95
2017-08-29,225.45
2017-08-30,231.55
2017-08-31,230.95
2017-09-01,235.9
2017-09-05,232.8
2017-09-06,230.4
2017-09-07,231.2
2017-09-08,230.25
2017-09-11,228.8
2017-09-12,229.8
2017-09-13,236.55
2017-09-14,231.15
2017-09-15,227.75
2017-09-18,234.4
2017-09-19,246.05
2017-09-20,246.35
2017-09-21,252.15
2017-09-22,246.75
2017-09-25,234.4
2017-09-26,228.3
2017-09-27,240.2
2017-09-28,244.5
2017-09-29,244.45
2017-10-02,249.6
2017-10-03,253.1
2017-10-04,258.05
2017-10-05,256.95
2017-10-06,259.15
2017-10-09,256.5
2017-10-10,261.3
2017-10-11,257.7
2017-10-12,250.2
2017-10-13,238.4
2017-10-16,241.6
2017-10-17,236.3
2017-10-18,238.45
2017-10-19,228.35
2017-10-20,223.9
2017-10-23,224.75
2017-10-24,231.25
2017-10-25,221.45
2017-10-26,255.4
2017-10-27,266.4
2017-10-30,264.5
2017-10-31,268.05
2017-11-01,264.2
2017-11-02,267.1
2017-11-03,273.2
2017-11-06,275.85
2017-11-07,267.55
2017-11-08,269.25
2017-11-09,258.25
2017-11-10,257.75
2017-11-13,264.6
2017-11-14,268.75
2017-11-15,271.7
2017-11-16,279.4
2017-11-17,290.1
2017-11-20,295.45
2017-11-21,297.05
2017-11-22,298.2
2017-11-24,301
2017-11-27,303.05
2017-11-28,305.95
2017-11-29,297.8
2017-11-30,301.95
2017-12-01,304.3
2017-12-04,303.4
2017-12-05,305.2
2017-12-06,306.9
2017-12-07,311.25
2017-12-08,315.05
2017-12-11,308.9
2017-12-12,312.65
2017-12-13,325.6
2017-12-14,334.7
2017-12-15,344.35
2017-12-18,352.5
2017-12-19,337.45
2017-12-20,337.55
2017-12-21,338.15
2017-12-22,341.95
2017-12-26,343.7
2017-12-27,336.65
2017-12-28,342.95
2017-12-29,340.45
2018-01-02,340.25
2018-01-03,350.35
2018-01-04,352.1
2018-01-05,356.05
2018-01-08,357
2018-01-09,360.6
2018-01-10,362.65
2018-01-11,362.3
2018-01-12,364
2018-01-16,360
2018-01-17,372.75
2018-01-18,372.5
2018-01-19,383.7
2018-01-22,387.4
2018-01-23,402.6
2018-01-24,362.5
2018-01-25,367.1
2018-01-26,363.1
2018-01-29,362.25
2018-01-30,367.75
2018-01-31,367.85
2018-02-01,370.6
2018-02-02,350.7
2018-02-05,348.6
2018-02-06,340.5
2018-02-07,352.55
2018-02-08,333.9
2018-02-09,339.55
2018-02-12,348.65
2018-02-13,355.55
2018-02-14,372.25
2018-02-15,376.1
2018-02-16,378.95
2018-02-20,379.05
2018-02-21,371.25
2018-02-22,341.05
2018-02-23,339.45
2018-02-26,359.25
2018-02-27,349.9
2018-02-28,348.5
2018-03-01,344.95
2018-03-02,348.2
2018-03-05,354.45
2018-03-06,355.05
2018-03-07,349.55
2018-03-08,343.2
2018-03-09,350.6
2018-03-12,353.65
2018-03-13,348.8
2018-03-14,373.35
2018-03-15,377.35
2018-03-16,379.85
2018-03-19,382.55
2018-03-20,386.35
2018-03-21,384
2018-03-22,361.85
2018-03-23,354.65
2018-03-26,366.55
2018-03-27,347.9
2018-03-28,330.6
2018-03-29,328.15
2018-04-02,321.95
2018-04-03,325.95
2018-04-04,327.85
2018-04-05,319.65
2018-04-06,322.8
2018-04-09,328.8
2018-04-10,322.65
2018-04-11,318.2
2018-04-12,318
2018-04-13,314.1
2018-04-16,308.65
2018-04-17,316.4
2018-04-18,315.45
2018-04-19,322.5
2018-04-20,318.45
2018-04-23,323.25
2018-04-24,327.5
2018-04-25,307
2018-04-26,260.15
2018-04-27,244.7
2018-04-30,238.4
2018-05-01,258.4
2018-05-02,263.35
2018-05-03,258.95
2018-05-04,259.8
2018-05-07,272.45
2018-05-08,277.4
2018-05-09,280.4
2018-05-10,287.2
2018-05-11,279.5
2018-05-14,279.35
2018-05-15,271.05
2018-05-16,275.35
2018-05-17,274.95
2018-05-18,278.7
2018-05-21,275.65
2018-05-22,265.45
2018-05-23,272.1
2018-05-24,263.45
2018-05-25,259.85
2018-05-29,258.65
2018-05-30,260.1
2018-05-31,258.9
2018-06-01,259.65
2018-06-04,261.7
2018-06-05,263.5
2018-06-06,270.35
2018-06-07,270.25
2018-06-08,277.45
2018-06-11,288.4
2018-06-12,266.1
2018-06-13,245.45
2018-06-14,248.25
2018-06-15,254.4
2018-06-18,257.75
2018-06-19,259.35
2018-06-20,266.45
2018-06-21,257.85
2018-06-22,257.15
2018-06-25,246.75
2018-06-26,226.8
2018-06-27,210.6
2018-06-28,210.15
2018-06-29,213.8
2018-07-02,214.15
2018-07-03,215.9
2018-07-05,219.6
2018-07-06,220.5
2018-07-09,226.75
2018-07-10,222.55
2018-07-11,238.75
2018-07-12,246.5
2018-07-13,232
2018-07-16,236.225
2018-07-17,239
2018-07-18,249.45
2018-07-19,248.3
2018-07-20,247.55
2018-07-23,244.85
2018-07-24,244.55
2018-07-25,246.05
2018-07-26,253.65
2018-07-27,238.6
2018-07-30,229.15
2018-07-31,238.8
2018-08-01,238.3
2018-08-02,250.35
2018-08-03,244.1
2018-08-06,244.15
2018-08-07,241.1
2018-08-08,244.25
2018-08-09,248.15
2018-08-10,245.8
2018-08-13,237.1
2018-08-14,238.9
2018-08-15,232.45
2018-08-16,226.9
2018-08-17,230.25
2018-08-20,229.2
2018-08-21,233.5
2018-08-22,238
2018-08-23,233.95
2018-08-24,240.2
2018-08-27,243.6
2018-08-28,244.25
2018-08-29,245.2
2018-08-30,249.35
2018-08-31,253.35
2018-09-04,257.55
2018-09-05,253.55
2018-09-06,248.85
2018-09-07,248.65
2018-09-10,248.35
2018-09-11,242.9
2018-09-12,240.6
2018-09-13,231.3
2018-09-14,235.9
2018-09-17,226.6
2018-09-18,232.25
2018-09-19,230.9
2018-09-20,230.8
2018-09-21,227.5
2018-09-24,226.05
2018-09-25,228.25
2018-09-26,223.05
2018-09-27,226.85
2018-09-28,230.1
2018-10-01,218.33
2018-10-02,216.03
2018-10-03,219.78
2018-10-04,210.63
2018-10-05,218.39
2018-10-08,217.44
2018-10-09,217.03
2018-10-10,210.18
2018-10-11,206.6
2018-10-12,199.29
2018-10-15,208.22
2018-10-16,219.99
2018-10-17,218.64
2018-10-18,214.09
2018-10-19,206.75
2018-10-22,203.79
2018-10-23,207.75
2018-10-24,200.59
2018-10-25,211.93
2018-10-26,197.19
2018-10-29,186.15
2018-10-30,194.33
2018-10-31,201.69
2018-11-01,250.4
2018-11-02,262.26
2018-11-05,250.18
2018-11-06,255.78
2018-11-07,264.33
2018-11-08,249.03
2018-11-09,245.15
2018-11-12,237.11
2018-11-13,238.86
2018-11-14,228.19
2018-11-15,234.74
2018-11-16,236.6
2018-11-19,226.5
2018-11-20,224.04
2018-11-21,226.57
2018-11-23,228.2
2018-11-26,245.86
2018-11-27,245.97
2018-11-28,254.84
2018-11-29,254.27
2018-11-30,260.34
2018-12-03,265.39
2018-12-04,250.31
2018-12-06,261.92
2018-12-07,242.74
2018-12-10,239.2
2018-12-11,245.25
2018-12-12,248.4
2018-12-13,235.43
2018-12-14,231.76
2018-12-17,223.26
2018-12-18,222.48
2018-12-19,216.18
2018-12-20,212.48
2018-12-21,202.87
2018-12-24,202.7
2018-12-26,217.55
2018-12-27,219.95
2018-12-28,220.52
2018-12-31,219.57
2019-01-02,222.41
2019-01-03,218.07
2019-01-04,227.29
2019-01-07,235.81
2019-01-08,242.27
2019-01-09,238.64
2019-01-10,248.65
2019-01-11,252.15
2019-01-14,256.52
2019-01-15,265.75
2019-01-16,276.07
2019-01-17,287.61
2019-01-18,288.46
2019-01-22,278.55
2019-01-23,282.74
2019-01-24,289.31
2019-01-25,293.46
2019-01-28,294.94
2019-01-29,287.55
2019-01-30,290.2
2019-01-31,296.34
2019-02-01,305.52
2019-02-04,306.81
2019-02-05,303.53
2019-02-06,306.8
2019-02-07,306.91
2019-02-08,299.92
2019-02-11,298.02
2019-02-12,304.75
2019-02-13,309.13
2019-02-14,308.96
2019-02-15,316.65
2019-02-19,317.91
2019-02-20,315.23
2019-02-21,310.19
2019-02-22,325.58
2019-02-25,320.41
2019-02-26,309.75
2019-02-27,321
2019-02-28,318.95
2019-03-01,322.6
2019-03-04,312.44
2019-03-05,316.61
2019-03-06,314.59
2019-03-07,305.46
2019-03-08,310.87
2019-03-11,319.84
2019-03-12,322.31
2019-03-13,330.85
2019-03-14,335.14
2019-03-15,340.68
2019-03-18,339.83
2019-03-19,336.51
2019-03-20,335.37
2019-03-21,341.44
2019-03-22,330.64
2019-03-25,335.15
2019-03-26,341.76
2019-03-27,342.77
2019-03-28,347.78
2019-03-29,351.56
2019-04-01,362.01
2019-04-02,352.36
2019-04-03,359.99
2019-04-04,360.48
2019-04-05,366.9
2019-04-08,365.78
2019-04-09,349.85
2019-04-10,363.6
2019-04-11,363.11
2019-04-12,366.41
2019-04-15,364.31
2019-04-16,369.73
2019-04-17,367.71
2019-04-18,367.13
2019-04-22,372.56
2019-04-23,371.03
2019-04-24,370.37
2019-04-25,369.59
2019-04-26,390.97
2019-04-29,376.35
2019-04-30,384.82
2019-05-01,384.94
2019-05-02,382.02
2019-05-03,391.03
2019-05-06,398.72
2019-05-07,389.86
2019-05-08,387.03
2019-05-09,392.59
2019-05-10,389.62
2019-05-13,365.58
2019-05-14,369.47
2019-05-15,379.55
2019-05-16,386.44
2019-05-17,383.76
2019-05-20,386.68
2019-05-21,378.16
2019-05-22,379.01
2019-05-23,373.45
2019-05-24,375.47
2019-05-28,377.28
2019-05-29,370.42
2019-05-30,376.1
2019-05-31,375.74
2019-06-03,367.24
2019-06-04,380.7
2019-06-05,388.32
2019-06-06,397
2019-06-07,399.11
2019-06-10,396.44
2019-06-11,388.3
2019-06-12,387.12
2019-06-13,387.44
2019-06-14,385.07
2019-06-17,394.685
2019-06-18,413.86
2019-06-19,414.515
2019-06-20,414.58
2019-06-21,418.765
2019-06-24,411.51
2019-06-25,406.21
2019-06-26,403.59
2019-06-27,418.23
2019-06-28,420
2019-07-01,414.79
2019-07-02,401.11
2019-07-03,415.8
2019-07-04,415.8
2019-07-05,417.305
2019-07-08,420.79
2019-07-09,417.375
2019-07-10,418.88
2019-07-11,434.665
2019-07-12,432.325
2019-07-15,430.21
2019-07-16,419.625
2019-07-17,412.47
2019-07-18,409.935
2019-07-19,410.655
2019-07-22,415.45
2019-07-23,418.98
2019-07-24,413.39
2019-07-25,347.7
2019-07-26,349.445
2019-07-29,329.795
2019-07-30,326.64
2019-07-31,322.22
2019-08-01,324.42
2019-08-02,320.695
2019-08-05,313.7
2019-08-06,310.73
2019-08-07,312.25
2019-08-08,315.325
2019-08-09,311.13
2019-08-12,296.17
2019-08-13,299.62
2019-08-14,292.75
2019-08-15,294.68
2019-08-16,295.71
2019-08-19,299.18
2019-08-20,295.44
2019-08-21,302.71
2019-08-22,308.6
2019-08-23,298.17
2019-08-26,314.39
2019-08-27,302.21
2019-08-28,308.16
2019-08-29,302.795
2019-08-30,310.095
2019-09-02,310.24
2019-09-03,303.065
2019-09-04,304.635
2019-09-05,305.87
2019-09-06,309.72
2019-09-09,302.6
2019-09-10,311.535
2019-09-11,316.61
2019-09-12,321.855
2019-09-13,323.455
2019-09-16,325.08
2019-09-17,329.295
2019-09-18,323.695
2019-09-19,325.22
2019-09-20,325.055
2019-09-23,322.81
2019-09-24,313.445
2019-09-25,315.76
2019-09-26,309.53
2019-09-27,305.6
2019-09-30,310.54
2019-10-01,305.135
2019-10-02,303.525
2019-10-03,300.69
2019-10-04,314.21
2019-10-07,313.2
2019-10-08,307.545
2019-10-09,303.82
2019-10-10,308.605
2019-10-11,312.85
2019-10-14,313.96
2019-10-15,318.375
2019-10-16,308.245
2019-10-17,319.71
2019-10-18,314.5
2019-10-21,318.11
2019-10-22,313.51
2019-10-23,316.77
2019-10-24,314.32
2019-10-25,323.915
2019-10-28,329.22
2019-10-29,323.41
2019-10-30,314.83
2019-10-31,359.04
2019-11-01,374.555
2019-11-04,386.08
2019-11-05,368.995
2019-11-06,361.915
2019-11-07,364
2019-11-08,363
2019-11-11,365.725
2019-11-12,372.09
2019-11-13,375.6
2019-11-14,371.04
2019-11-15,370.395
2019-11-18,368.285
2019-11-19,367.965
2019-11-20,370.66
2019-11-21,366.535
2019-11-22,369.01
2019-11-25,368.76
