date,close
2014-06-13,6.1243
2014-06-16,6.1297
2014-06-17,6.1688
2014-06-18,6.1856
2014-06-19,6.1911
2014-06-20,6.18
2014-06-23,6.1911
2014-06-24,6.1688
2014-06-25,6.2079
2014-06-26,6.3698
2014-06-27,6.4144
2014-06-30,6.3977
2014-07-01,6.4479
2014-07-02,6.4368
2014-07-03,6.3921
2014-07-07,6.3977
2014-07-08,6.4368
2014-07-09,6.501
2014-07-10,6.4312
2014-07-11,6.4033
2014-07-14,6.4256
2014-07-15,6.4256
2014-07-16,6.42
2014-07-17,6.3307
2014-07-18,6.3865
2014-07-21,6.3865
2014-07-22,6.3809
2014-07-23,6.4089
2014-07-24,6.4144
2014-07-25,6.4591
2014-07-28,6.4703
2014-07-29,6.3865
2014-07-30,6.353
2014-07-31,6.2135
2014-08-01,6.2637
2014-08-04,6.314
2014-08-05,6.1632
2014-08-06,6.2805
2014-08-07,6.3419
2014-08-08,6.42
2014-08-11,6.4926
2014-08-12,6.4814
2014-08-13,6.4814
2014-08-14,6.5205
2014-08-15,6.5484
2014-08-18,6.5652
2014-08-19,6.5428
2014-08-20,6.5596
2014-08-21,6.5708
2014-08-22,6.554
2014-08-25,6.6098
2014-08-26,6.5484
2014-08-27,6.554
2014-08-28,6.5931
2014-08-29,6.6433
2014-09-02,6.6489
2014-09-03,6.5875
2014-09-04,6.621
2014-09-05,6.3698
2014-09-08,6.4647
2014-09-09,6.4535
2014-09-10,6.4703
2014-09-11,6.4368
2014-09-12,6.4312
2014-09-15,6.4312
2014-09-16,6.3754
2014-09-17,6.3865
2014-09-18,6.3921
2014-09-19,6.314
2014-09-22,6.2637
2014-09-23,6.314
2014-09-24,6.3655
2014-09-25,6.3655
2014-09-26,6.4055
2014-09-29,6.3311
2014-09-30,6.2453
2014-10-01,6.2682
2014-10-02,6.2624
2014-10-03,6.2395
2014-10-06,6.2395
2014-10-07,6.1995
2014-10-08,6.1708
2014-10-09,6.1594
2014-10-10,6.0449
2014-10-13,5.9934
2014-10-14,5.959
2014-10-15,5.7816
2014-10-16,5.9934
2014-10-17,6.0907
2014-10-20,6.1193
2014-10-21,6.1193
2014-10-22,6.1995
2014-10-23,6.0793
2014-10-24,6.0964
2014-10-27,6.1708
2014-10-28,6.1995
2014-10-29,6.2166
2014-10-30,6.1823
2014-10-31,6.2281
2014-11-03,6.2453
2014-11-04,6.1537
2014-11-05,6.1079
2014-11-06,6.085
2014-11-07,6.1422
2014-11-10,6.2281
2014-11-11,6.1766
2014-11-12,6.1708
2014-11-13,6.1995
2014-11-14,6.2052
2014-11-17,6.1766
2014-11-18,6.188
2014-11-19,6.1823
2014-11-20,6.2109
2014-11-21,6.2109
2014-11-24,6.2567
2014-11-25,6.2739
2014-11-26,6.3483
2014-11-28,6.3483
2014-12-01,6.1995
2014-12-02,6.1365
2014-12-03,6.1537
2014-12-04,6.0964
2014-12-05,6.0106
2014-12-08,5.8446
2014-12-09,5.9762
2014-12-10,5.8159
2014-12-11,5.7243
2014-12-12,5.5698
2014-12-15,5.5297
2014-12-16,5.3752
2014-12-17,5.3162
2014-12-18,5.5581
2014-12-19,5.7823
2014-12-22,5.6643
2014-12-23,5.7292
2014-12-24,5.623
2014-12-26,5.5699
2014-12-29,5.6289
2014-12-30,5.6702
2014-12-31,5.623
2015-01-02,5.7292
2015-01-05,5.7115
2015-01-06,5.5345
2015-01-07,5.5699
2015-01-08,5.6053
2015-01-09,5.5581
2015-01-12,5.4932
2015-01-13,5.3693
2015-01-14,5.1923
2015-01-15,5.2336
2015-01-16,5.145
2015-01-20,5.027
2015-01-21,5.0801
2015-01-22,5.0329
2015-01-23,5.0123
2015-01-26,5.0388
2015-01-27,5.0447
2015-01-28,5.0093
2015-01-29,4.9916
2015-01-30,4.9503
2015-02-02,4.8205
2015-02-03,4.9975
2015-02-04,5.0152
2015-02-05,5.2218
2015-02-06,5.5994
2015-02-09,5.5699
2015-02-10,5.4755
2015-02-11,5.4342
2015-02-12,5.4519
2015-02-13,5.5463
2015-02-17,5.5581
2015-02-18,5.5758
2015-02-19,5.6407
2015-02-20,5.5994
2015-02-23,5.6348
2015-02-24,5.6761
2015-02-25,5.6879
2015-02-26,5.6938
2015-02-27,5.6112
2015-03-02,5.6289
2015-03-03,5.741
2015-03-04,5.6938
2015-03-05,5.7528
2015-03-06,5.7646
2015-03-09,5.6879
2015-03-10,5.6407
2015-03-11,5.6466
2015-03-12,5.6643
2015-03-13,5.6348
2015-03-16,5.6171
2015-03-17,5.5846
2015-03-18,5.5694
2015-03-19,5.5269
2015-03-20,5.5937
2015-03-23,5.539
2015-03-24,5.539
2015-03-25,5.5086
2015-03-26,5.5329
2015-03-27,5.5147
2015-03-30,5.5451
2015-03-31,5.5025
2015-04-01,5.5147
2015-04-02,5.5269
2015-04-06,5.5573
2015-04-07,5.5694
2015-04-08,5.5694
2015-04-09,5.5512
2015-04-10,5.539
2015-04-13,5.5512
2015-04-14,5.539
2015-04-15,5.6302
2015-04-16,5.6545
2015-04-17,5.6424
2015-04-20,5.6667
2015-04-21,5.612
2015-04-22,5.6363
2015-04-23,5.7518
2015-04-24,5.6971
2015-04-27,5.7032
2015-04-28,5.7032
2015-04-29,5.7883
2015-04-30,5.7275
2015-05-01,5.6728
2015-05-04,5.6606
2015-05-05,5.6728
2015-05-06,5.6302
2015-05-07,5.6971
2015-05-08,5.7457
2015-05-11,5.691
2015-05-12,5.7336
2015-05-13,5.7275
2015-05-14,5.7579
2015-05-15,5.8005
2015-05-18,5.8309
2015-05-19,5.8248
2015-05-20,5.8491
2015-05-21,5.8734
2015-05-22,5.8734
2015-05-26,5.8674
2015-05-27,5.8795
2015-05-28,5.8978
2015-05-29,5.8674
2015-06-01,5.8309
2015-06-02,5.8795
2015-06-03,5.8978
2015-06-04,5.843
2015-06-05,5.8917
2015-06-08,5.8491
2015-06-09,5.8309
2015-06-10,5.8126
2015-06-11,5.7938
2015-06-12,5.8064
2015-06-15,5.8001
2015-06-16,5.8001
2015-06-17,5.8126
2015-06-18,5.8502
2015-06-19,5.8001
2015-06-22,5.8001
2015-06-23,5.8064
2015-06-24,5.7938
2015-06-25,5.75
2015-06-26,5.7124
2015-06-29,5.5308
2015-06-30,5.4995
2015-07-01,5.418
2015-07-02,5.4431
2015-07-06,5.4243
2015-07-07,5.4118
2015-07-08,5.3115
2015-07-09,5.274
2015-07-10,5.2614
2015-07-13,5.2489
2015-07-14,5.299
2015-07-15,5.3241
2015-07-16,5.3867
2015-07-17,5.3491
2015-07-20,5.3053
2015-07-21,5.2959
2015-07-22,5.1612
2015-07-23,5.0297
2015-07-24,4.7791
2015-07-27,4.8543
2015-07-28,4.8794
2015-07-29,5.0234
2015-07-30,4.942
2015-07-31,4.9608
2015-08-03,4.7917
2015-08-04,4.7603
2015-08-05,4.8042
2015-08-06,4.8919
2015-08-07,4.848
2015-08-10,4.9044
2015-08-11,4.9044
2015-08-12,4.8543
2015-08-13,4.8794
2015-08-14,4.8919
2015-08-17,4.8606
2015-08-18,4.8606
2015-08-19,4.7917
2015-08-20,4.7416
2015-08-21,4.5912
2015-08-24,4.3595
2015-08-25,4.3845
2015-08-26,4.4284
2015-08-27,4.6476
2015-08-28,4.7165
2015-08-31,4.7603
2015-09-01,4.6852
2015-09-02,4.729
2015-09-03,4.7416
2015-09-04,4.7854
2015-09-08,4.9232
2015-09-09,4.8668
2015-09-10,4.8355
2015-09-11,4.7353
2015-09-14,4.6789
2015-09-15,4.6038
2015-09-16,4.6476
2015-09-17,4.6346
2015-09-18,4.4068
2015-09-21,4.4263
2015-09-22,4.4979
2015-09-23,4.3742
2015-09-24,4.3872
2015-09-25,4.3742
2015-09-28,4.2245
2015-09-29,4.1464
2015-09-30,4.2115
2015-10-01,4.3547
2015-10-02,4.3352
2015-10-05,4.4458
2015-10-06,4.5174
2015-10-07,4.6216
2015-10-08,4.6671
2015-10-09,4.6281
2015-10-12,4.6541
2015-10-13,4.5955
2015-10-14,4.589
2015-10-15,4.6476
2015-10-16,4.6671
2015-10-19,4.5695
2015-10-20,4.602
2015-10-21,4.5304
2015-10-22,4.55
2015-10-23,4.5435
2015-10-26,4.4849
2015-10-27,4.3417
2015-10-28,4.4523
2015-10-29,4.4198
2015-10-30,4.4979
2015-11-02,4.576
2015-11-03,4.6671
2015-11-04,4.6346
2015-11-05,4.5304
2015-11-06,4.602
2015-11-09,4.5955
2015-11-10,4.563
2015-11-11,4.2375
2015-11-12,4.2245
2015-11-13,4.244
2015-11-16,4.3026
2015-11-17,4.3156
2015-11-18,4.3937
2015-11-19,4.4914
2015-11-20,4.4718
2015-11-23,4.4849
2015-11-24,4.5695
2015-11-25,4.6216
2015-11-27,4.5955
2015-11-30,4.7257
2015-12-01,4.7583
2015-12-02,4.7583
2015-12-03,4.6736
2015-12-04,4.7127
2015-12-07,4.5304
2015-12-08,4.3612
2015-12-09,4.244
2015-12-10,4.2636
2015-12-11,4.0813
2015-12-14,3.9055
2015-12-15,4.1334
2015-12-16,4.3156
2015-12-17,4.2896
2015-12-18,4.3937
2015-12-21,4.2115
2015-12-22,4.2523
2015-12-23,4.3884
2015-12-24,4.368
2015-12-28,4.1434
2015-12-29,4.2251
2015-12-30,4.1094
2015-12-31,4.2047
2016-01-04,4.2319
2016-01-05,4.2795
2016-01-06,4.3748
2016-01-07,4.1911
2016-01-08,4.1911
2016-01-11,4.0482
2016-01-12,3.8917
2016-01-13,3.7352
2016-01-14,3.8781
2016-01-15,3.7216
2016-01-19,3.4767
2016-01-20,3.3678
2016-01-21,3.395
2016-01-22,3.5175
2016-01-25,3.4563
2016-01-26,3.5787
2016-01-27,3.6196
2016-01-28,3.6128
2016-01-29,3.6128
2016-02-01,3.6468
2016-02-02,3.4835
2016-02-03,3.5651
2016-02-04,3.6808
2016-02-05,3.7012
2016-02-08,3.64
2016-02-09,3.5107
2016-02-10,3.4631
2016-02-11,3.4495
2016-02-12,3.5651
2016-02-16,3.6128
2016-02-17,3.7692
2016-02-18,3.8373
2016-02-19,3.776
2016-02-22,3.6808
2016-02-23,3.6808
2016-02-24,3.6604
2016-02-25,3.708
2016-02-26,3.8101
2016-02-29,3.9325
2016-03-01,4.0482
2016-03-02,4.089
2016-03-03,4.1298
2016-03-04,4.2727
2016-03-07,4.368
2016-03-08,4.1979
2016-03-09,4.1366
2016-03-10,4.1026
2016-03-11,4.2387
2016-03-14,4.3203
2016-03-15,4.2727
2016-03-16,4.3154
2016-03-17,4.3653
2016-03-18,4.4151
2016-03-21,4.3439
2016-03-22,4.3724
2016-03-23,4.2727
2016-03-24,4.351
2016-03-28,4.23
2016-03-29,4.3012
2016-03-30,4.2656
2016-03-31,4.3154
2016-04-01,4.3724
2016-04-04,4.3938
2016-04-05,4.4365
2016-04-06,4.522
2016-04-07,4.4579
2016-04-08,4.465
2016-04-11,4.4721
2016-04-12,4.6359
2016-04-13,4.6929
2016-04-14,4.6359
2016-04-15,4.5789
2016-04-18,4.6288
2016-04-19,4.6715
2016-04-20,4.6573
2016-04-21,4.5006
2016-04-22,4.6145
2016-04-25,4.5789
2016-04-26,4.6786
2016-04-27,4.7071
2016-04-28,4.6501
2016-04-29,4.6929
2016-05-02,4.4365
2016-05-03,4.3439
2016-05-04,4.3938
2016-05-05,4.351
2016-05-06,4.3724
2016-05-09,4.3653
2016-05-10,4.4792
2016-05-11,4.5504
2016-05-12,4.6074
2016-05-13,4.5291
2016-05-16,4.5718
2016-05-17,4.6074
2016-05-18,4.5291
2016-05-19,4.3938
2016-05-20,4.4579
2016-05-23,4.4507
2016-05-24,4.5576
2016-05-25,4.643
2016-05-26,4.5932
2016-05-27,4.6217
2016-05-31,4.6217
2016-06-01,4.6359
2016-06-02,4.6288
2016-06-03,4.7214
2016-06-06,4.8282
2016-06-07,4.8068
2016-06-08,4.7783
2016-06-09,4.757
2016-06-10,4.7712
2016-06-13,4.7356
2016-06-14,4.7142
2016-06-15,4.9968
2016-06-16,4.8406
2016-06-17,4.9001
2016-06-20,4.9373
2016-06-21,4.9447
2016-06-22,4.9299
2016-06-23,4.9819
2016-06-24,4.9596
2016-06-27,4.9001
2016-06-28,4.9819
2016-06-29,4.9819
2016-06-30,5.0786
2016-07-01,5.1604
2016-07-05,5.1158
2016-07-06,5.1455
2016-07-07,5.1901
2016-07-08,5.1975
2016-07-11,5.2868
2016-07-12,5.376
2016-07-13,5.3537
2016-07-14,5.3388
2016-07-15,5.3909
2016-07-18,5.3537
2016-07-19,5.3611
2016-07-20,5.3834
2016-07-21,5.3834
2016-07-22,5.4281
2016-07-25,5.4429
2016-07-26,5.495
2016-07-27,5.4578
2016-07-28,5.4058
2016-07-29,5.4801
2016-08-01,5.4652
2016-08-02,5.4281
2016-08-03,5.4652
2016-08-04,5.4727
2016-08-05,5.5098
2016-08-08,5.5024
2016-08-09,5.6214
2016-08-10,5.6437
2016-08-11,5.6363
2016-08-12,5.666
2016-08-15,5.6883
2016-08-16,5.718
2016-08-17,5.7255
2016-08-18,5.7404
2016-08-19,5.7255
2016-08-22,5.7404
2016-08-23,5.7478
2016-08-24,5.7404
2016-08-25,5.666
2016-08-26,5.7627
2016-08-29,5.8668
2016-08-30,5.9188
2016-08-31,5.9262
2016-09-01,5.9262
2016-09-02,5.9857
2016-09-06,6.0378
2016-09-07,6.0675
2016-09-08,6.0675
2016-09-09,5.8965
2016-09-12,5.8668
2016-09-13,5.7032
2016-09-14,5.7329
2016-09-15,5.7924
2016-09-16,5.7329
2016-09-19,5.7946
2016-09-20,5.7946
2016-09-21,5.8487
2016-09-22,5.8332
2016-09-23,5.8101
2016-09-26,5.7946
2016-09-27,5.8101
2016-09-28,5.8641
2016-09-29,5.8487
2016-09-30,5.8024
2016-10-03,6.003
2016-10-04,5.9412
2016-10-05,5.9412
2016-10-06,5.8795
2016-10-07,5.8872
2016-10-10,5.9027
2016-10-11,5.8795
2016-10-12,5.8487
2016-10-13,5.7946
2016-10-14,5.8409
2016-10-17,5.7946
2016-10-18,5.7946
2016-10-19,5.8255
2016-10-20,5.8332
2016-10-21,5.9027
2016-10-24,5.9027
2016-10-25,5.895
2016-10-26,5.8332
2016-10-27,5.7946
2016-10-28,5.7869
2016-10-31,5.8101
2016-11-01,5.7329
2016-11-02,5.5786
2016-11-03,5.5709
2016-11-04,5.5246
2016-11-07,5.648
2016-11-08,5.6095
2016-11-09,5.7406
2016-11-10,5.9027
2016-11-11,5.949
2016-11-14,5.7869
2016-11-15,5.8101
2016-11-16,5.8332
2016-11-17,5.895
2016-11-18,5.949
2016-11-21,5.9335
2016-11-22,5.594
2016-11-23,5.4629
2016-11-25,5.6017
2016-11-28,5.6789
2016-11-29,5.7098
2016-11-30,5.7406
2016-12-01,5.8024
2016-12-02,5.7715
2016-12-05,5.8641
2016-12-06,5.9181
2016-12-07,5.9412
2016-12-08,5.9644
2016-12-09,5.9644
2016-12-12,5.9953
2016-12-13,6.0338
2016-12-14,6.0107
2016-12-15,6.0184
2016-12-16,6.0416
2016-12-19,6.2036
2016-12-20,6.2995
2016-12-21,6.3075
2016-12-22,6.3155
2016-12-23,6.1876
2016-12-27,6.1636
2016-12-28,6.0997
2016-12-29,6.1157
2016-12-30,6.1236
2017-01-03,6.1876
2017-01-04,6.2675
2017-01-05,6.2356
2017-01-06,6.2036
2017-01-09,6.1956
2017-01-10,6.2116
2017-01-11,6.2196
2017-01-12,6.2276
2017-01-13,6.2196
2017-01-17,6.1876
2017-01-18,6.1796
2017-01-19,6.1636
2017-01-20,6.1876
2017-01-23,6.2036
2017-01-24,6.2196
2017-01-25,6.2436
2017-01-26,6.2675
2017-01-27,6.2595
2017-01-30,6.3155
2017-01-31,6.3075
2017-02-01,6.3075
2017-02-02,6.3435
2017-02-03,6.4114
2017-02-06,6.5154
2017-02-07,6.4834
2017-02-08,6.4994
2017-02-09,6.6193
2017-02-10,6.7552
2017-02-13,6.8032
2017-02-14,6.8311
2017-02-15,6.7792
2017-02-16,6.7152
2017-02-17,6.8112
2017-02-21,6.8431
2017-02-22,6.8311
2017-02-23,6.8511
2017-02-24,6.8511
2017-02-27,6.8431
2017-02-28,6.8112
2017-03-01,6.8191
2017-03-02,6.8591
2017-03-03,6.6113
2017-03-06,6.5793
2017-03-07,6.5234
2017-03-08,6.4754
2017-03-09,6.3555
2017-03-10,6.3955
2017-03-13,6.3955
2017-03-14,6.3795
2017-03-15,6.4434
2017-03-16,6.4274
2017-03-17,6.4514
2017-03-20,6.5414
2017-03-21,6.4269
2017-03-22,6.3206
2017-03-23,6.3369
2017-03-24,6.3696
2017-03-27,6.3778
2017-03-28,6.4759
2017-03-29,6.5986
2017-03-30,6.6313
2017-03-31,6.6558
2017-04-03,6.6313
2017-04-04,6.6313
2017-04-05,6.5414
2017-04-06,6.5986
2017-04-07,6.5168
2017-04-10,6.5005
2017-04-11,6.4841
2017-04-12,6.4187
2017-04-13,6.3778
2017-04-17,6.4105
2017-04-18,6.4105
2017-04-19,6.3942
2017-04-20,6.386
2017-04-21,6.4187
2017-04-24,6.4432
2017-04-25,6.4596
2017-04-26,6.5495
2017-04-27,6.525
2017-04-28,6.5495
2017-05-01,6.5414
2017-05-02,6.5822
2017-05-03,6.5005
2017-05-04,6.3942
2017-05-05,6.3778
2017-05-08,6.4105
2017-05-09,6.6558
2017-05-10,6.5741
2017-05-11,6.4105
2017-05-12,6.3042
2017-05-15,6.3369
2017-05-16,6.3288
2017-05-17,6.2388
2017-05-18,6.2633
2017-05-19,6.2225
2017-05-22,6.2306
2017-05-23,6.2061
2017-05-24,6.1325
2017-05-25,6.1243
2017-05-26,6.1407
2017-05-30,6.1571
2017-05-31,6.1162
2017-06-01,6.1734
2017-06-02,6.2715
2017-06-05,6.2552
2017-06-06,6.2061
2017-06-07,6.1816
2017-06-08,6.1489
2017-06-09,6.2143
2017-06-12,6.2225
2017-06-13,6.2388
2017-06-14,6.2143
2017-06-15,6.1898
2017-06-16,6.1162
2017-06-19,6.1581
2017-06-20,6.1497
2017-06-21,6.1748
2017-06-22,6.1413
2017-06-23,6.1413
2017-06-26,6.1497
2017-06-27,6.1581
2017-06-28,6.2167
2017-06-29,6.2335
2017-06-30,6.1916
2017-07-03,6.267
2017-07-05,6.2083
2017-07-06,6.2083
2017-07-07,6.2083
2017-07-10,6.2083
2017-07-11,6.2083
2017-07-12,6.2167
2017-07-13,6.2586
2017-07-14,6.2083
2017-07-17,6.2335
2017-07-18,6.2502
2017-07-19,6.2502
2017-07-20,6.267
2017-07-21,6.2502
2017-07-24,6.2418
2017-07-25,6.2502
2017-07-26,6.2502
2017-07-27,6.2754
2017-07-28,6.2335
2017-07-31,6.2502
2017-08-01,6.2837
2017-08-02,6.2837
2017-08-03,6.2921
2017-08-04,6.2335
2017-08-07,6.1581
2017-08-08,6.2754
2017-08-09,6.4345
2017-08-10,6.5016
2017-08-11,6.4597
2017-08-14,6.4429
2017-08-15,6.3759
2017-08-16,6.3927
2017-08-17,6.3591
2017-08-18,6.3424
2017-08-21,6.3424
2017-08-22,6.401
2017-08-23,6.3508
2017-08-24,6.3591
2017-08-25,6.334
2017-08-28,6.3675
2017-08-29,6.3843
2017-08-30,6.3591
2017-08-31,6.2921
2017-09-01,6.3424
2017-09-05,6.3005
2017-09-06,6.3005
2017-09-07,6.3256
2017-09-08,6.3089
2017-09-11,6.3005
2017-09-12,6.2921
2017-09-13,6.3256
2017-09-14,6.3591
2017-09-15,6.3005
2017-09-18,6.3172
2017-09-19,6.3516
2017-09-20,6.446
2017-09-21,6.4288
2017-09-22,6.4202
2017-09-25,6.4546
2017-09-26,6.4546
2017-09-27,6.4117
2017-09-28,6.446
2017-09-29,6.446
2017-10-02,6.4717
2017-10-03,6.5404
2017-10-04,6.6863
2017-10-05,6.6434
2017-10-06,6.5232
2017-10-09,6.5404
2017-10-10,6.5662
2017-10-11,6.5833
2017-10-12,6.5662
2017-10-13,6.5576
2017-10-16,6.5318
2017-10-17,6.446
2017-10-18,6.4288
2017-10-19,6.5147
2017-10-20,6.5404
2017-10-23,6.5147
2017-10-24,6.5061
2017-10-25,6.4288
2017-10-26,6.4546
2017-10-27,6.4803
2017-10-30,6.4202
2017-10-31,6.4117
2017-11-01,6.4202
2017-11-02,6.3602
2017-11-03,6.3773
2017-11-06,6.3602
2017-11-07,6.4374
2017-11-08,6.5404
2017-11-09,6.4632
2017-11-10,6.4288
2017-11-13,6.4031
2017-11-14,6.4031
2017-11-15,6.343
2017-11-16,6.3859
2017-11-17,6.4632
2017-11-20,6.4803
2017-11-21,6.4632
2017-11-22,6.4975
2017-11-24,6.4717
2017-11-27,6.5061
2017-11-28,6.4546
2017-11-29,6.3687
2017-11-30,6.1971
2017-12-01,6.1627
2017-12-04,6.1542
2017-12-05,6.1198
2017-12-06,6.2657
2017-12-07,6.1713
2017-12-08,6.1799
2017-12-11,6.1627
2017-12-12,6.1456
2017-12-13,6.1627
2017-12-14,6.1284
2017-12-15,6.0426
2017-12-18,6.1284
2017-12-19,6.1799
2017-12-20,6.1713
2017-12-21,6.1542
2017-12-22,6.1454
2017-12-26,6.1454
2017-12-27,6.1101
2017-12-28,6.1454
2017-12-29,6.0837
2018-01-02,6.163
2018-01-03,6.1013
2018-01-04,6.0749
2018-01-05,6.163
2018-01-08,6.1718
2018-01-09,6.1013
2018-01-10,6.0309
2018-01-11,6.1278
2018-01-12,6.1806
2018-01-16,6.0837
2018-01-17,6.0837
2018-01-18,6.0573
2018-01-19,6.0749
2018-01-22,6.0661
2018-01-23,6.0837
2018-01-24,6.0837
2018-01-25,6.0925
2018-01-26,6.0925
2018-01-29,6.0573
2018-01-30,5.9605
2018-01-31,5.9341
2018-02-01,5.9957
2018-02-02,5.8988
2018-02-05,5.6435
2018-02-06,5.6875
2018-02-07,5.8548
2018-02-08,5.9605
2018-02-09,6.0749
2018-02-12,6.1454
2018-02-13,6.2334
2018-02-14,6.1718
2018-02-15,6.1806
2018-02-16,6.2686
2018-02-20,6.2246
2018-02-21,6.2686
2018-02-22,6.3126
2018-02-23,6.295
2018-02-26,6.2774
2018-02-27,6.2158
2018-02-28,6.119
2018-03-01,6.1542
2018-03-02,6.1806
2018-03-05,6.1982
2018-03-06,6.207
2018-03-07,6.2334
2018-03-08,6.251
2018-03-09,6.251
2018-03-12,6.3126
2018-03-13,6.295
2018-03-14,6.2598
2018-03-15,6.1366
2018-03-16,6.1727
2018-03-19,6.1817
2018-03-20,6.1275
2018-03-21,6.1456
2018-03-22,6.3535
2018-03-23,6.2586
2018-03-26,6.2269
2018-03-27,6.1004
2018-03-28,6.0733
2018-03-29,6.0371
2018-04-02,6.1004
2018-04-03,6.1637
2018-04-04,6.1546
2018-04-05,6.2269
2018-04-06,6.1546
2018-04-09,6.1637
2018-04-10,6.1185
2018-04-11,6.1908
2018-04-12,6.2089
2018-04-13,6.2405
2018-04-16,6.236
2018-04-17,6.3173
2018-04-18,6.2992
2018-04-19,6.2269
2018-04-20,6.2541
2018-04-23,6.1094
2018-04-24,6.1817
2018-04-25,6.1275
2018-04-26,6.1546
2018-04-27,6.1366
2018-04-30,6.1456
2018-05-01,6.1004
2018-05-02,6.0597
2018-05-03,6.0281
2018-05-04,6.0371
2018-05-07,6.001
2018-05-08,6.1094
2018-05-09,6.1998
2018-05-10,6.2631
2018-05-11,6.3444
2018-05-14,6.3806
2018-05-15,6.3715
2018-05-16,6.48
2018-05-17,6.5342
2018-05-18,6.5342
2018-05-21,6.5071
2018-05-22,6.5523
2018-05-23,6.5794
2018-05-24,6.6336
2018-05-25,6.6427
2018-05-29,6.5523
2018-05-30,6.5884
2018-05-31,6.5704
2018-06-01,6.6246
2018-06-04,6.6788
2018-06-05,6.5252
2018-06-06,6.6246
2018-06-07,6.6427
2018-06-08,6.733
2018-06-11,6.6427
2018-06-12,6.5884
2018-06-13,6.5342
2018-06-14,6.6156
2018-06-15,6.6248
2018-06-18,6.597
2018-06-19,6.6063
2018-06-20,6.6156
2018-06-21,6.5414
2018-06-22,6.5785
2018-06-25,6.4951
2018-06-26,6.5322
2018-06-27,6.4673
2018-06-28,6.4395
2018-06-29,6.4905
2018-07-02,6.5322
2018-07-03,6.6156
2018-07-05,6.5785
2018-07-06,6.5646
2018-07-09,6.56
2018-07-10,6.5507
2018-07-11,6.5507
2018-07-12,6.5229
2018-07-13,6.56
2018-07-16,6.5553
2018-07-17,6.6526
2018-07-18,6.8565
2018-07-19,6.8611
2018-07-20,6.8657
2018-07-23,6.8565
2018-07-24,6.8565
2018-07-25,6.875
2018-07-26,6.875
2018-07-27,6.8935
2018-07-30,6.9491
2018-07-31,7.014
2018-08-01,6.9769
2018-08-02,6.9676
2018-08-03,7.0418
2018-08-06,7.0232
2018-08-07,7.014
2018-08-08,6.9862
2018-08-09,6.9769
2018-08-10,7.1159
2018-08-13,7.1159
2018-08-14,7.1066
2018-08-15,7.1066
2018-08-16,7.1807
2018-08-17,7.153
2018-08-20,7.1437
2018-08-21,7.1715
2018-08-22,7.1807
2018-08-23,7.19
2018-08-24,7.1807
2018-08-27,7.2271
2018-08-28,7.153
2018-08-29,7.2178
2018-08-30,7.2178
2018-08-31,7.2085
2018-09-04,7.2641
2018-09-05,7.2641
2018-09-06,7.1437
2018-09-07,7.1159
2018-09-10,7.1437
2018-09-11,7.1066
2018-09-12,7.153
2018-09-13,7.1807
2018-09-14,7.1523
2018-09-17,7.2187
2018-09-18,7.2187
2018-09-19,7.1428
2018-09-20,7.2092
2018-09-21,7.1902
2018-09-24,7.1618
2018-09-25,7.1618
2018-09-26,7.1143
2018-09-27,7.0385
2018-09-28,7.0764
2018-10-01,7.1049
2018-10-02,7.1333
2018-10-03,7.1808
2018-10-04,7.2472
2018-10-05,7.2282
2018-10-08,7.0385
2018-10-09,7.1523
2018-10-10,7.0622
2018-10-11,6.8582
2018-10-12,6.8298
2018-10-15,6.8393
2018-10-16,6.8582
2018-10-17,6.8582
2018-10-18,6.7729
2018-10-19,6.8013
2018-10-22,6.6685
2018-10-23,6.5926
2018-10-24,6.4788
2018-10-25,6.6495
2018-10-26,6.5547
2018-10-29,6.5547
2018-10-30,6.5167
2018-10-31,6.7349
2018-11-01,6.8393
2018-11-02,6.6685
2018-11-05,6.7444
2018-11-06,6.8108
2018-11-07,6.7823
2018-11-08,6.7349
2018-11-09,6.6875
2018-11-12,6.6495
2018-11-13,6.678
2018-11-14,6.697
2018-11-15,6.6401
2018-11-16,6.9721
2018-11-19,6.9721
2018-11-20,6.8772
2018-11-21,6.9246
2018-11-23,6.9246
2018-11-26,6.9626
2018-11-27,6.9531
2018-11-28,6.9531
2018-11-29,6.9531
2018-11-30,6.9531
2018-12-03,6.9531
2018-12-04,6.8487
2018-12-06,6.8582
2018-12-07,6.9246
2018-12-10,6.8677
2018-12-11,6.9294
2018-12-12,6.9531
2018-12-13,6.9057
2018-12-14,6.8582
2018-12-17,6.4124
2018-12-18,6.327
2018-12-19,6.3839
2018-12-20,6.1403
2018-12-21,6.1598
2018-12-24,6.1403
2018-12-26,6.267
2018-12-27,6.3011
2018-12-28,6.3645
2018-12-31,6.2085
2019-01-02,6.4717
2019-01-03,6.4424
2019-01-04,6.4814
2019-01-07,6.6958
2019-01-08,6.7933
2019-01-09,6.7348
2019-01-10,6.7738
2019-01-11,6.803
2019-01-14,6.7835
2019-01-15,6.8713
2019-01-16,6.8323
2019-01-17,6.8615
2019-01-18,6.9882
2019-01-22,6.8518
2019-01-23,6.881
2019-01-24,6.9297
2019-01-25,6.9005
2019-01-28,6.8908
2019-01-29,6.92
2019-01-30,6.9785
2019-01-31,6.998
2019-02-01,6.9882
2019-02-04,6.9882
2019-02-05,7.0272
2019-02-06,7.0272
2019-02-07,7.0175
2019-02-08,6.7835
2019-02-11,6.7348
2019-02-12,6.92
2019-02-13,6.8713
2019-02-14,6.8713
2019-02-15,6.9492
2019-02-19,7.0077
2019-02-20,7.037
2019-02-21,7.1052
2019-02-22,7.1539
2019-02-25,7.0565
2019-02-26,7.0565
2019-02-27,6.9931
2019-02-28,6.9492
2019-03-01,6.8518
2019-03-04,6.8225
2019-03-05,6.7738
2019-03-06,6.7348
2019-03-07,6.7641
2019-03-08,6.7933
2019-03-11,6.8908
2019-03-12,6.842
2019-03-13,6.8713
2019-03-14,6.9103
2019-03-15,6.881
2019-03-18,6.92
2019-03-19,6.97
2019-03-20,6.91
2019-03-21,6.91
2019-03-22,6.9
2019-03-25,6.92
2019-03-26,6.99
2019-03-27,6.99
2019-03-28,7
2019-03-29,6.91
2019-04-01,7
2019-04-02,7.08
2019-04-03,7.04
2019-04-04,7.01
2019-04-05,7.04
2019-04-08,7.11
2019-04-09,7.02
2019-04-10,7.04
2019-04-11,7.04
2019-04-12,7.05
2019-04-15,7.02
2019-04-16,7.15
2019-04-17,7.11
2019-04-18,7.05
2019-04-22,7.07
2019-04-23,7.15
2019-04-24,7.03
2019-04-25,7.06
2019-04-26,7.11
2019-04-29,7.13
2019-04-30,7.14
2019-05-01,7.1
2019-05-02,7.13
2019-05-03,7
2019-05-06,6.96
2019-05-07,6.96
2019-05-08,6.95
2019-05-09,6.68
2019-05-10,6.7
2019-05-13,6.48
2019-05-14,6.57
2019-05-15,6.55
2019-05-16,6.57
2019-05-17,6.59
2019-05-20,6.59
2019-05-21,6.63
2019-05-22,6.62
2019-05-23,6.67
2019-05-24,6.63
2019-05-28,6.69
2019-05-29,6.61
2019-05-30,6.59
2019-05-31,6.49
2019-06-03,6.49
2019-06-04,6.54
2019-06-05,6.52
2019-06-06,6.55
2019-06-07,6.5
2019-06-10,6.5
2019-06-11,6.49
2019-06-12,6.46
2019-06-13,6.52
2019-06-14,6.355
2019-06-17,6.29
2019-06-18,6.315
2019-06-19,6.375
2019-06-20,6.29
2019-06-21,6.295
2019-06-24,6.27
2019-06-25,6.235
2019-06-26,6.245
2019-06-27,6.265
2019-06-28,6.295
2019-07-01,6.33
2019-07-02,6.33
2019-07-03,6.345
2019-07-04,6.345
2019-07-05,6.33
2019-07-08,6.32
2019-07-09,6.3
2019-07-10,6.28
2019-07-11,6.27
2019-07-12,6.285
2019-07-15,6.275
2019-07-16,6.645
2019-07-17,6.595
2019-07-18,6.585
2019-07-19,6.555
2019-07-22,6.63
2019-07-23,6.705
2019-07-24,6.695
2019-07-25,6.665
2019-07-26,6.675
2019-07-29,6.625
2019-07-30,6.635
2019-07-31,6.64
2019-08-01,6.57
2019-08-02,6.54
2019-08-05,6.435
2019-08-06,6.445
2019-08-07,6.345
2019-08-08,6.505
2019-08-09,6.34
2019-08-12,6.325
2019-08-13,6.405
2019-08-14,6.295
2019-08-15,6.305
2019-08-16,6.385
2019-08-19,6.475
2019-08-20,6.435
2019-08-21,6.415
2019-08-22,6.38
2019-08-23,6.305
2019-08-26,6.345
2019-08-27,6.265
2019-08-28,6.245
2019-08-29,6.355
2019-08-30,6.295
2019-09-02,6.295
2019-09-03,6.225
2019-09-04,6.175
2019-09-05,6.23
2019-09-06,6.21
2019-09-09,6.305
2019-09-10,6.335
2019-09-11,6.345
2019-09-12,6.31
2019-09-13,6.41
2019-09-16,6.285
2019-09-17,6.245
2019-09-18,6.245
2019-09-19,6.235
2019-09-20,6.275
2019-09-23,6.275
2019-09-24,6.29
2019-09-25,6.32
2019-09-26,6.285
2019-09-27,6.29
2019-09-30,6.275
2019-10-01,6.185
2019-10-02,6.075
2019-10-03,6.08
2019-10-04,6.105
2019-10-07,6.12
2019-10-08,6.085
2019-10-09,6.085
2019-10-10,6.085
2019-10-11,6.12
2019-10-14,6.055
2019-10-15,6.12
2019-10-16,6.07
2019-10-17,6.085
2019-10-18,6.13
2019-10-21,6.145
2019-10-22,6.155
2019-10-23,6.175
2019-10-24,6.185
2019-10-25,6.155
2019-10-28,6.235
2019-10-29,6.065
2019-10-30,6.055
2019-10-31,6.035
2019-11-01,6.035
2019-11-04,6.105
2019-11-05,6.115
2019-11-06,6.095
2019-11-07,6.065
2019-11-08,6.055
2019-11-11,5.98
2019-11-12,6.055
2019-11-13,5.985
2019-11-14,5.965
2019-11-15,5.955
2019-11-18,5.94
2019-11-19,5.945
2019-11-20,5.935
2019-11-21,5.945
2019-11-22,6.025
2019-11-25,6.095
