date,close
2014-06-13,37.3054
2014-06-16,37.3404
2014-06-17,37.4717
2014-06-18,37.7081
2014-06-19,37.7869
2014-06-20,37.6293
2014-06-23,37.8736
2014-06-24,37.6182
2014-06-25,37.7239
2014-06-26,37.6799
2014-06-27,37.7239
2014-06-30,37.7239
2014-07-01,37.9353
2014-07-02,37.9353
2014-07-03,38.0938
2014-07-07,37.9705
2014-07-08,37.7767
2014-07-09,37.9001
2014-07-10,37.7944
2014-07-11,37.8208
2014-07-14,37.9353
2014-07-15,37.9441
2014-07-16,38.1203
2014-07-17,37.7415
2014-07-18,38.0498
2014-07-21,37.9617
2014-07-22,38.0938
2014-07-23,38.1018
2014-07-24,38.1731
2014-07-25,37.9793
2014-07-28,37.9969
2014-07-29,37.8208
2014-07-30,37.7477
2014-07-31,37.0105
2014-08-01,36.8783
2014-08-04,37.1074
2014-08-05,36.7198
2014-08-06,36.7286
2014-08-07,36.5525
2014-08-08,36.9488
2014-08-11,37.0536
2014-08-12,37.0457
2014-08-13,37.2307
2014-08-14,37.4332
2014-08-15,37.3892
2014-08-18,37.8199
2014-08-19,37.8199
2014-08-20,37.9353
2014-08-21,38.1026
2014-08-22,37.9811
2014-08-25,38.1907
2014-08-26,38.2259
2014-08-27,38.2436
2014-08-28,38.2171
2014-08-29,38.3404
2014-09-02,38.277
2014-09-03,38.3404
2014-09-04,38.2876
2014-09-05,38.4391
2014-09-08,38.314
2014-09-09,38.0322
2014-09-10,38.1026
2014-09-11,38.2163
2014-09-12,37.9969
2014-09-15,38.0498
2014-09-16,38.2964
2014-09-17,38.3404
2014-09-18,38.5166
2014-09-19,38.543
2014-09-22,38.2739
2014-09-23,37.9992
2014-09-24,38.2473
2014-09-25,37.7069
2014-09-26,37.9372
2014-09-29,37.8309
2014-09-30,37.7795
2014-10-01,37.2639
2014-10-02,37.2462
2014-10-03,37.6183
2014-10-06,37.6271
2014-10-07,37.0512
2014-10-08,37.6448
2014-10-09,36.8909
2014-10-10,36.5374
2014-10-13,36.0138
2014-10-14,36.059
2014-10-15,35.7134
2014-10-16,35.7311
2014-10-17,36.1919
2014-10-20,36.3956
2014-10-21,36.9981
2014-10-22,36.8032
2014-10-23,37.131
2014-10-24,37.4588
2014-10-27,37.4047
2014-10-28,37.7955
2014-10-29,37.7689
2014-10-30,37.9992
2014-10-31,38.4511
2014-11-03,38.459
2014-11-04,38.3802
2014-11-05,38.6814
2014-11-06,38.77
2014-11-07,38.8586
2014-11-10,38.9649
2014-11-11,38.9472
2014-11-12,38.8941
2014-11-13,38.8498
2014-11-14,38.8852
2014-11-17,39.0181
2014-11-18,39.151
2014-11-19,39.089
2014-11-20,39.1599
2014-11-21,39.3459
2014-11-24,39.3636
2014-11-25,39.3459
2014-11-26,39.4363
2014-11-28,39.3193
2014-12-01,39.1953
2014-12-02,39.4522
2014-12-03,39.578
2014-12-04,39.5408
2014-12-05,39.6117
2014-12-08,39.3636
2014-12-09,39.2573
2014-12-10,38.6371
2014-12-11,38.7877
2014-12-12,38.1321
2014-12-15,37.8043
2014-12-16,37.6005
2014-12-17,38.3625
2014-12-18,39.275
2014-12-19,39.4256
2014-12-22,39.6546
2014-12-23,39.7972
2014-12-24,39.824
2014-12-26,39.8864
2014-12-29,39.9132
2014-12-30,39.7526
2014-12-31,39.3246
2015-01-02,39.3603
2015-01-05,38.6469
2015-01-06,38.3437
2015-01-07,38.7183
2015-01-08,39.396
2015-01-09,39.0482
2015-01-12,38.8163
2015-01-13,38.6737
2015-01-14,38.3883
2015-01-15,38.1476
2015-01-16,38.6113
2015-01-20,38.5934
2015-01-21,38.7633
2015-01-22,39.3157
2015-01-23,38.9858
2015-01-26,39.1017
2015-01-27,38.5774
2015-01-28,37.9692
2015-01-29,38.2546
2015-01-30,37.6741
2015-02-02,38.1921
2015-02-03,38.7985
2015-02-04,38.6469
2015-02-05,38.9867
2015-02-06,38.9234
2015-02-09,38.7628
2015-02-10,39.1195
2015-02-11,39.0482
2015-02-12,39.4138
2015-02-13,39.585
2015-02-17,39.6101
2015-02-18,39.5583
2015-02-19,39.4495
2015-02-20,39.6813
2015-02-23,39.61
2015-02-24,39.7794
2015-02-25,39.6991
2015-02-26,39.5939
2015-02-27,39.5565
2015-03-02,39.6902
2015-03-03,39.5386
2015-03-04,39.3514
2015-03-05,39.3514
2015-03-06,38.745
2015-03-09,38.9412
2015-03-10,38.3437
2015-03-11,38.3081
2015-03-12,38.7272
2015-03-13,38.5221
2015-03-16,38.9947
2015-03-17,38.8342
2015-03-18,39.3514
2015-03-19,39.0655
2015-03-20,39.4495
2015-03-23,39.4208
2015-03-24,39.1158
2015-03-25,38.6743
2015-03-26,38.5685
2015-03-27,38.6402
2015-03-30,39.1068
2015-03-31,38.8197
2015-04-01,38.6672
2015-04-02,38.8466
2015-04-06,39.0915
2015-04-07,38.9991
2015-04-08,39.044
2015-04-09,39.2144
2015-04-10,39.4925
2015-04-13,39.3399
2015-04-14,39.4028
2015-04-15,39.6271
2015-04-16,39.6181
2015-04-17,39.2503
2015-04-20,39.5733
2015-04-21,39.4172
2015-04-22,39.6092
2015-04-23,39.7078
2015-04-24,39.8155
2015-04-27,39.654
2015-04-28,39.8963
2015-04-29,39.8065
2015-04-30,39.488
2015-05-01,39.8334
2015-05-04,39.9501
2015-05-05,39.5419
2015-05-06,39.3669
2015-05-07,39.4836
2015-05-08,39.986
2015-05-11,39.7886
2015-05-12,39.6809
2015-05-13,39.7168
2015-05-14,40.0667
2015-05-15,40.1295
2015-05-18,40.2013
2015-05-19,40.2282
2015-05-20,40.2282
2015-05-21,40.2731
2015-05-22,40.1324
2015-05-26,39.7706
2015-05-27,40.0757
2015-05-28,40.0757
2015-05-29,39.8604
2015-06-01,39.8693
2015-06-02,39.8245
2015-06-03,39.8783
2015-06-04,39.5464
2015-06-05,39.4477
2015-06-08,39.2862
2015-06-09,39.3221
2015-06-10,39.7706
2015-06-11,39.8602
2015-06-12,39.5733
2015-06-15,39.3759
2015-06-16,39.5822
2015-06-17,39.6899
2015-06-18,40.0398
2015-06-19,39.8245
2015-06-22,40.0238
2015-06-23,40.0157
2015-06-24,39.7348
2015-06-25,39.5632
2015-06-26,39.6084
2015-06-29,38.8408
2015-06-30,38.8588
2015-07-01,39.1569
2015-07-02,39.1388
2015-07-06,38.9681
2015-07-07,39.2381
2015-07-08,38.6421
2015-07-09,38.7234
2015-07-10,39.1298
2015-07-13,39.4639
2015-07-14,39.6084
2015-07-15,39.6084
2015-07-16,39.8748
2015-07-17,39.7438
2015-07-20,39.6806
2015-07-21,39.4729
2015-07-22,39.4458
2015-07-23,39.2381
2015-07-24,38.8227
2015-07-27,38.6331
2015-07-28,39.0214
2015-07-29,39.3556
2015-07-30,39.4007
2015-07-31,39.2923
2015-08-03,39.1569
2015-08-04,39.0918
2015-08-05,39.1975
2015-08-06,39.0214
2015-08-07,38.904
2015-08-10,39.4278
2015-08-11,39.0665
2015-08-12,39.1117
2015-08-13,39.0395
2015-08-14,39.202
2015-08-17,39.3736
2015-08-18,39.2833
2015-08-19,38.9311
2015-08-20,38.1996
2015-08-21,37.1611
2015-08-24,35.662
2015-08-25,35.0371
2015-08-26,36.249
2015-08-27,37.1521
2015-08-28,37.1701
2015-08-31,36.9534
2015-09-01,35.7794
2015-09-02,36.3574
2015-09-03,36.5379
2015-09-04,35.8968
2015-09-08,36.7728
2015-09-09,36.2761
2015-09-10,36.3754
2015-09-11,36.5018
2015-09-14,36.4025
2015-09-15,36.8902
2015-09-16,37.2333
2015-09-17,37.1069
2015-09-18,36.4838
2015-09-21,36.682
2015-09-22,36.2273
2015-09-23,36.1364
2015-09-24,36.0546
2015-09-25,36.2273
2015-09-28,35.4544
2015-09-29,35.5817
2015-09-30,36.2092
2015-10-01,36.191
2015-10-02,36.6547
2015-10-05,37.4358
2015-10-06,37.4186
2015-10-07,37.755
2015-10-08,38.146
2015-10-09,38.0642
2015-10-12,38.0278
2015-10-13,37.8096
2015-10-14,37.6367
2015-10-15,38.1697
2015-10-16,38.3824
2015-10-19,38.3552
2015-10-20,38.3552
2015-10-21,38.1551
2015-10-22,38.8553
2015-10-23,39.2008
2015-10-26,39.0826
2015-10-27,38.9371
2015-10-28,39.4554
2015-10-29,39.2918
2015-10-30,39.1645
2015-11-02,39.6009
2015-11-03,39.6919
2015-11-04,39.5373
2015-11-05,39.5282
2015-11-06,39.4373
2015-11-09,39.1099
2015-11-10,39.2281
2015-11-11,39.1281
2015-11-12,38.5734
2015-11-13,38.2188
2015-11-16,38.8644
2015-11-17,38.7644
2015-11-18,39.3281
2015-11-19,39.3463
2015-11-20,39.4009
2015-11-23,39.3281
2015-11-24,39.4282
2015-11-25,39.3781
2015-11-27,39.4282
2015-11-30,39.3372
2015-12-01,39.71
2015-12-02,39.2281
2015-12-03,38.7007
2015-12-04,39.4191
2015-12-07,39.1917
2015-12-08,38.8189
2015-12-09,38.637
2015-12-10,38.7189
2015-12-11,38.0278
2015-12-14,38.1642
2015-12-15,38.7125
2015-12-16,39.3009
2015-12-17,38.7553
2015-12-18,38.0733
2015-12-21,38.3342
2015-12-22,38.7372
2015-12-23,39.3051
2015-12-24,39.2318
2015-12-28,39.1311
2015-12-29,39.4975
2015-12-30,39.241
2015-12-31,38.8746
2016-01-04,38.38
2016-01-05,38.554
2016-01-06,38.0136
2016-01-07,37.1617
2016-01-08,36.689
2016-01-11,36.7678
2016-01-12,36.9877
2016-01-13,36.2365
2016-01-14,36.7953
2016-01-15,36.035
2016-01-19,36.0533
2016-01-20,35.5129
2016-01-21,35.6869
2016-01-22,36.3465
2016-01-25,35.8152
2016-01-26,36.4106
2016-01-27,36.2457
2016-01-28,36.4299
2016-01-29,37.3266
2016-02-01,37.2624
2016-02-02,36.6047
2016-02-03,36.8594
2016-02-04,36.9418
2016-02-05,36.5205
2016-02-08,36.1541
2016-02-09,36.0717
2016-02-10,35.9709
2016-02-11,35.4213
2016-02-12,36.1724
2016-02-16,36.7312
2016-02-17,37.2533
2016-02-18,37.2075
2016-02-19,37.1159
2016-02-22,37.6105
2016-02-23,37.1434
2016-02-24,37.2716
2016-02-25,37.7296
2016-02-26,37.5739
2016-02-29,37.2624
2016-03-01,38.0594
2016-03-02,38.3891
2016-03-03,38.5632
2016-03-04,38.7189
2016-03-07,38.8105
2016-03-08,38.4349
2016-03-09,38.6822
2016-03-10,38.6806
2016-03-11,39.2501
2016-03-14,39.1585
2016-03-15,39.0853
2016-03-16,39.2868
2016-03-17,39.6074
2016-03-18,39.7485
2016-03-21,39.7577
2016-03-22,39.7023
2016-03-23,39.4717
2016-03-24,39.4163
2016-03-28,39.4809
2016-03-29,39.7762
2016-03-30,39.9238
2016-03-31,39.8592
2016-04-01,40.0714
2016-04-04,39.9515
2016-04-05,39.5916
2016-04-06,39.933
2016-04-07,39.5178
2016-04-08,39.6747
2016-04-11,39.6055
2016-04-12,39.9791
2016-04-13,40.3482
2016-04-14,40.3298
2016-04-15,40.3205
2016-04-18,40.5917
2016-04-19,40.8095
2016-04-20,40.8095
2016-04-21,40.5143
2016-04-22,40.6139
2016-04-25,40.5512
2016-04-26,40.6804
2016-04-27,40.8926
2016-04-28,40.5789
2016-04-29,40.3759
2016-05-02,40.625
2016-05-03,40.2836
2016-05-04,40.0806
2016-05-05,40.0714
2016-05-06,40.2467
2016-05-09,40.219
2016-05-10,40.6711
2016-05-11,40.422
2016-05-12,40.4774
2016-05-13,40.0991
2016-05-16,40.4682
2016-05-17,40.0714
2016-05-18,40.0437
2016-05-19,39.9607
2016-05-20,40.1452
2016-05-23,40.0437
2016-05-24,40.5512
2016-05-25,40.8557
2016-05-26,40.8465
2016-05-27,41.0218
2016-05-31,40.9941
2016-06-01,41.0771
2016-06-02,41.2063
2016-06-03,41.114
2016-06-06,41.2801
2016-06-07,41.3816
2016-06-08,41.4923
2016-06-09,41.437
2016-06-10,41.1509
2016-06-13,40.8095
2016-06-14,40.7357
2016-06-15,40.6804
2016-06-16,40.8834
2016-06-17,40.8069
2016-06-20,41.0112
2016-06-21,41.169
2016-06-22,41.104
2016-06-23,41.6426
2016-06-24,40.2403
2016-06-27,39.581
2016-06-28,40.2032
2016-06-29,40.909
2016-06-30,41.5962
2016-07-01,41.6334
2016-07-05,41.3362
2016-07-06,41.5684
2016-07-07,41.4755
2016-07-08,42.0792
2016-07-11,42.237
2016-07-12,42.5157
2016-07-13,42.5807
2016-07-14,42.7943
2016-07-15,42.7664
2016-07-18,42.8128
2016-07-19,42.7385
2016-07-20,42.9057
2016-07-21,42.7571
2016-07-22,42.9614
2016-07-25,42.8407
2016-07-26,42.85
2016-07-27,42.6642
2016-07-28,42.655
2016-07-29,42.72
2016-08-01,42.6085
2016-08-02,42.3578
2016-08-03,42.4785
2016-08-04,42.4878
2016-08-05,42.7664
2016-08-08,42.7571
2016-08-09,42.7478
2016-08-10,42.6364
2016-08-11,42.8221
2016-08-12,42.7664
2016-08-15,42.8593
2016-08-16,42.6457
2016-08-17,42.7385
2016-08-18,42.8686
2016-08-19,42.7478
2016-08-22,42.7478
2016-08-23,42.8128
2016-08-24,42.6735
2016-08-25,42.6828
2016-08-26,42.5528
2016-08-29,42.8593
2016-08-30,42.8035
2016-08-31,42.72
2016-09-01,42.6735
2016-09-02,42.915
2016-09-06,43.0543
2016-09-07,43.0264
2016-09-08,42.9986
2016-09-09,41.9491
2016-09-12,42.5249
2016-09-13,41.847
2016-09-14,41.7355
2016-09-15,42.1163
2016-09-16,41.9399
2016-09-19,41.9863
2016-09-20,41.9489
2016-09-21,42.4344
2016-09-22,42.6492
2016-09-23,42.4624
2016-09-26,42.0983
2016-09-27,42.3504
2016-09-28,42.6492
2016-09-29,42.229
2016-09-30,42.5371
2016-10-03,42.4158
2016-10-04,42.1263
2016-10-05,42.3971
2016-10-06,42.4251
2016-10-07,42.3224
2016-10-10,42.4438
2016-10-11,41.9396
2016-10-12,41.9863
2016-10-13,41.8556
2016-10-14,41.8836
2016-10-17,41.7809
2016-10-18,41.9583
2016-10-19,42.0143
2016-10-20,41.9303
2016-10-21,41.9396
2016-10-24,42.0796
2016-10-25,42.0703
2016-10-26,42.117
2016-10-27,42.033
2016-10-28,41.9769
2016-10-31,42.0329
2016-11-01,41.7529
2016-11-02,41.4914
2016-11-03,41.4167
2016-11-04,41.3047
2016-11-07,42.1637
2016-11-08,42.3877
2016-11-09,42.9199
2016-11-10,43.06
2016-11-11,43.0226
2016-11-14,43.2467
2016-11-15,43.5828
2016-11-16,43.4148
2016-11-17,43.5641
2016-11-18,43.5175
2016-11-21,43.8256
2016-11-22,43.9563
2016-11-23,43.9843
2016-11-25,44.171
2016-11-28,44.0216
2016-11-29,44.031
2016-11-30,44.0496
2016-12-01,43.9749
2016-12-02,43.9656
2016-12-05,44.2364
2016-12-06,44.4324
2016-12-07,45.0486
2016-12-08,45.1794
2016-12-09,45.4221
2016-12-12,45.4595
2016-12-13,45.7395
2016-12-14,45.3194
2016-12-15,45.5248
2016-12-16,45.4781
2016-12-19,45.6125
2016-12-20,45.7915
2016-12-21,45.6691
2016-12-22,45.6691
2016-12-23,45.7256
2016-12-27,45.7821
2016-12-28,45.3959
2016-12-29,45.4336
2016-12-30,45.3017
2017-01-03,45.622
2017-01-04,45.8292
2017-01-05,45.6879
2017-01-06,45.735
2017-01-09,45.4712
2017-01-10,45.4524
2017-01-11,45.5937
2017-01-12,45.4807
2017-01-13,45.5466
2017-01-17,45.362
2017-01-18,45.443
2017-01-19,45.2546
2017-01-20,45.443
2017-01-23,45.3111
2017-01-24,45.6502
2017-01-25,45.9611
2017-01-26,45.9046
2017-01-27,45.8857
2017-01-30,45.6125
2017-01-31,45.6031
2017-02-01,45.4807
2017-02-02,45.556
2017-02-03,45.9611
2017-02-06,45.8575
2017-02-07,45.8009
2017-02-08,45.8009
2017-02-09,46.0741
2017-02-10,46.2249
2017-02-13,46.4792
2017-02-14,46.6864
2017-02-15,46.8937
2017-02-16,46.8843
2017-02-17,46.9502
2017-02-21,47.2328
2017-02-22,47.1763
2017-02-23,47.2893
2017-02-24,47.3096
2017-02-27,47.3364
2017-02-28,47.2422
2017-03-01,47.8922
2017-03-02,47.6002
2017-03-03,47.5908
2017-03-06,47.4589
2017-03-07,47.2988
2017-03-08,47.148
2017-03-09,47.2046
2017-03-10,47.4118
2017-03-13,47.3741
2017-03-14,47.2046
2017-03-15,47.6379
2017-03-16,47.5814
2017-03-17,47.5154
2017-03-20,47.3832
2017-03-21,46.7876
2017-03-22,46.8525
2017-03-23,46.8241
2017-03-24,46.7767
2017-03-27,46.7104
2017-03-28,47.0137
2017-03-29,47.0326
2017-03-30,47.2316
2017-03-31,47.08
2017-04-03,46.9663
2017-04-04,47.0516
2017-04-05,46.8715
2017-04-06,46.9947
2017-04-07,46.9473
2017-04-10,46.9473
2017-04-11,46.9284
2017-04-12,46.7673
2017-04-13,46.3977
2017-04-17,46.7767
2017-04-18,46.6346
2017-04-19,46.4545
2017-04-20,46.7673
2017-04-21,46.6156
2017-04-24,47.1368
2017-04-25,47.4211
2017-04-26,47.3643
2017-04-27,47.298
2017-04-28,47.08
2017-05-01,47.0989
2017-05-02,47.0516
2017-05-03,47.061
2017-05-04,47.0137
2017-05-05,47.2316
2017-05-08,47.1842
2017-05-09,47.061
2017-05-10,47.1558
2017-05-11,47.0516
2017-05-12,46.9094
2017-05-15,47.1558
2017-05-16,47.1842
2017-05-17,46.4166
2017-05-18,46.483
2017-05-19,46.7767
2017-05-22,46.9947
2017-05-23,47.1463
2017-05-24,47.2127
2017-05-25,47.3359
2017-05-26,47.3643
2017-05-30,47.3359
2017-05-31,47.2885
2017-06-01,47.6581
2017-06-02,47.7054
2017-06-05,47.6581
2017-06-06,47.5823
2017-06-07,47.6296
2017-06-08,47.677
2017-06-09,47.9329
2017-06-12,48.0371
2017-06-13,48.1793
2017-06-14,48.1129
2017-06-15,48.0561
2017-06-16,48.1603
2017-06-19,48.4257
2017-06-20,48.092
2017-06-21,47.9013
2017-06-22,47.8537
2017-06-23,47.949
2017-06-26,48.0348
2017-06-27,47.7202
2017-06-28,48.073
2017-06-29,47.7965
2017-06-30,47.8632
2017-07-03,48.1206
2017-07-05,48.1111
2017-07-06,47.6821
2017-07-07,47.9109
2017-07-10,47.8632
2017-07-11,47.7965
2017-07-12,48.092
2017-07-13,48.1683
2017-07-14,48.3399
2017-07-17,48.3495
2017-07-18,48.2923
2017-07-19,48.502
2017-07-20,48.5878
2017-07-21,48.4734
2017-07-24,48.359
2017-07-25,48.6069
2017-07-26,48.5116
2017-07-27,48.6069
2017-07-28,48.4734
2017-07-31,48.502
2017-08-01,48.6069
2017-08-02,48.5211
2017-08-03,48.4925
2017-08-04,48.626
2017-08-07,48.645
2017-08-08,48.5592
2017-08-09,48.5306
2017-08-10,47.9967
2017-08-11,47.9586
2017-08-14,48.3781
2017-08-15,48.3781
2017-08-16,48.4353
2017-08-17,47.7297
2017-08-18,47.6153
2017-08-21,47.6725
2017-08-22,48.0634
2017-08-23,47.9681
2017-08-24,47.9204
2017-08-25,48.0539
2017-08-28,47.9681
2017-08-29,47.9872
2017-08-30,48.1206
2017-08-31,48.3018
2017-09-01,48.4067
2017-09-05,48.0348
2017-09-06,48.1683
2017-09-07,48.092
2017-09-08,48.1111
2017-09-11,48.645
2017-09-12,48.8548
2017-09-13,48.9597
2017-09-14,49.036
2017-09-15,49.0932
2017-09-18,49.2958
2017-09-19,49.4108
2017-09-20,49.4398
2017-09-21,49.3629
2017-09-22,49.4205
2017-09-25,49.4973
2017-09-26,49.4205
2017-09-27,49.5452
2017-09-28,49.6316
2017-09-29,49.7179
2017-10-02,50.0058
2017-10-03,50.0921
2017-10-04,50.1401
2017-10-05,50.3991
2017-10-06,50.3032
2017-10-09,50.2456
2017-10-10,50.4663
2017-10-11,50.5047
2017-10-12,50.4087
2017-10-13,50.4375
2017-10-16,50.5047
2017-10-17,50.5047
2017-10-18,50.6198
2017-10-19,50.7253
2017-10-20,50.994
2017-10-23,50.8789
2017-10-24,50.946
2017-10-25,50.6294
2017-10-26,50.7062
2017-10-27,50.8789
2017-10-30,50.5526
2017-10-31,50.5718
2017-11-01,50.7157
2017-11-02,50.7733
2017-11-03,50.8117
2017-11-06,50.7829
2017-11-07,50.7541
2017-11-08,50.7925
2017-11-09,50.6006
2017-11-10,50.591
2017-11-13,50.6486
2017-11-14,50.5526
2017-11-15,50.332
2017-11-16,50.6774
2017-11-17,50.5814
2017-11-20,50.6678
2017-11-21,50.8501
2017-11-22,50.8021
2017-11-24,50.8405
2017-11-27,50.8117
2017-11-28,51.4833
2017-11-29,51.7328
2017-11-30,52.0877
2017-12-01,52.0781
2017-12-04,52.1837
2017-12-05,51.9342
2017-12-06,51.8767
2017-12-07,51.963
2017-12-08,52.27
2017-12-11,52.4331
2017-12-12,52.5675
2017-12-13,52.4907
2017-12-14,52.1933
2017-12-15,52.625
2017-12-18,52.9211
2017-12-19,52.7665
2017-12-20,52.7569
2017-12-21,52.8824
2017-12-22,52.8921
2017-12-26,52.8438
2017-12-27,52.8824
2017-12-28,52.979
2017-12-29,52.8052
2018-01-02,53.0466
2018-01-03,53.2205
2018-01-04,53.4813
2018-01-05,53.7131
2018-01-08,53.7904
2018-01-09,53.8387
2018-01-10,53.7614
2018-01-11,54.1188
2018-01-12,54.4279
2018-01-16,54.2347
2018-01-17,54.7466
2018-01-18,54.6114
2018-01-19,54.8142
2018-01-22,55.2392
2018-01-23,55.2392
2018-01-24,55.2875
2018-01-25,55.3261
2018-01-26,56.0216
2018-01-29,55.7028
2018-01-30,55.0171
2018-01-31,54.9784
2018-02-01,55.0267
2018-02-02,53.8387
2018-02-05,51.6171
2018-02-06,52.3415
2018-02-07,52.1967
2018-02-08,50.3422
2018-02-09,51.0666
2018-02-12,51.7234
2018-02-13,51.8972
2018-02-14,52.4961
2018-02-15,53.066
2018-02-16,53.1336
2018-02-20,52.6893
2018-02-21,52.3222
2018-02-22,52.3609
2018-02-23,53.2012
2018-02-26,53.8097
2018-02-27,53.1432
2018-02-28,52.4961
2018-03-01,51.9069
2018-03-02,52.1387
2018-03-05,52.7376
2018-03-06,52.8438
2018-03-07,52.7279
2018-03-08,52.9694
2018-03-09,53.8
2018-03-12,53.7035
2018-03-13,53.4233
2018-03-14,53.037
2018-03-15,52.9694
2018-03-16,53.1167
2018-03-19,52.5239
2018-03-20,52.4948
2018-03-21,52.4462
2018-03-22,51.1732
2018-03-23,50.0848
2018-03-26,51.3578
2018-03-27,50.7067
2018-03-28,50.7359
2018-03-29,51.3481
2018-04-02,50.182
2018-04-03,50.9011
2018-04-04,51.4647
2018-04-05,51.7757
2018-04-06,50.7553
2018-04-09,50.9594
2018-04-10,51.766
2018-04-11,51.4939
2018-04-12,51.902
2018-04-13,51.766
2018-04-16,52.1741
2018-04-17,52.4559
2018-04-18,52.4073
2018-04-19,52.1255
2018-04-20,51.8048
2018-04-23,51.8243
2018-04-24,51.387
2018-04-25,51.4647
2018-04-26,51.7757
2018-04-27,51.8534
2018-04-30,51.3287
2018-05-01,51.2898
2018-05-02,50.7748
2018-05-03,50.6581
2018-05-04,51.2218
2018-05-07,51.3092
2018-05-08,51.3189
2018-05-09,51.8048
2018-05-10,52.3101
2018-05-11,52.417
2018-05-14,52.4948
2018-05-15,52.2664
2018-05-16,52.4656
2018-05-17,52.417
2018-05-18,52.1935
2018-05-21,52.592
2018-05-22,52.5531
2018-05-23,52.5822
2018-05-24,52.4268
2018-05-25,52.2518
2018-05-29,51.5716
2018-05-30,52.349
2018-05-31,51.902
2018-06-01,52.3782
2018-06-04,52.5142
2018-06-05,52.5142
2018-06-06,52.9418
2018-06-07,53.0195
2018-06-08,53.2236
2018-06-11,53.2333
2018-06-12,53.1847
2018-06-13,52.9515
2018-06-14,52.8932
2018-06-15,52.8738
2018-06-18,52.6989
2018-06-19,52.5628
2018-06-20,52.5628
2018-06-21,52.2518
2018-06-22,52.417
2018-06-25,51.9312
2018-06-26,51.9843
2018-06-27,51.6027
2018-06-28,51.9256
2018-06-29,51.9745
2018-07-02,51.9941
2018-07-03,51.9549
2018-07-05,52.3267
2018-07-06,52.6496
2018-07-09,53.0899
2018-07-10,53.3737
2018-07-11,52.8649
2018-07-12,53.2171
2018-07-13,53.2171
2018-07-16,53.2073
2018-07-17,53.4422
2018-07-18,53.5302
2018-07-19,53.266
2018-07-20,53.2563
2018-07-23,53.3737
2018-07-24,53.6574
2018-07-25,54.0684
2018-07-26,54.2347
2018-07-27,54.0488
2018-07-30,54.0586
2018-07-31,54.3032
2018-08-01,54.0292
2018-08-02,54.1858
2018-08-03,54.5184
2018-08-06,54.6652
2018-08-07,54.7924
2018-08-08,54.763
2018-08-09,54.6456
2018-08-10,54.2543
2018-08-13,53.9216
2018-08-14,54.2543
2018-08-15,53.9314
2018-08-16,54.5184
2018-08-17,54.7728
2018-08-20,54.8902
2018-08-21,54.9685
2018-08-22,54.8609
2018-08-23,54.7337
2018-08-24,54.9587
2018-08-27,55.3501
2018-08-28,55.3305
2018-08-29,55.4871
2018-08-30,55.1936
2018-08-31,55.1446
2018-09-04,55.0957
2018-09-05,55.174
2018-09-06,55.0468
2018-09-07,54.8511
2018-09-10,54.9881
2018-09-11,55.0077
2018-09-12,55.0859
2018-09-13,55.311
2018-09-14,55.4186
2018-09-17,55.3795
2018-09-18,55.5556
2018-09-19,55.6045
2018-09-20,56.0937
2018-09-21,56.2111
2018-09-24,55.8002
2018-09-25,55.5625
2018-09-26,55.2571
2018-09-27,55.2275
2018-09-28,55.2571
2018-10-01,55.4443
2018-10-02,55.5921
2018-10-03,55.6118
2018-10-04,55.5231
2018-10-05,55.3458
2018-10-08,55.5822
2018-10-09,55.3458
2018-10-10,54.0648
2018-10-11,52.6755
2018-10-12,52.9219
2018-10-15,52.8233
2018-10-16,53.6411
2018-10-17,53.7397
2018-10-18,53.2273
2018-10-19,53.2864
2018-10-22,52.8233
2018-10-23,52.5474
2018-10-24,51.3158
2018-10-25,51.838
2018-10-26,51.1877
2018-10-29,51.365
2018-10-30,52.2223
2018-10-31,52.3405
2018-11-01,52.8135
2018-11-02,52.6361
2018-11-05,53.2175
2018-11-06,53.5032
2018-11-07,54.2718
2018-11-08,54.2422
2018-11-09,53.8973
2018-11-12,53.178
2018-11-13,53.0992
2018-11-14,52.7544
2018-11-15,53.247
2018-11-16,53.5426
2018-11-19,53.2569
2018-11-20,52.3307
2018-11-21,52.3011
2018-11-23,51.9858
2018-11-26,52.6164
2018-11-27,52.7642
2018-11-28,53.5919
2018-11-29,53.4539
2018-11-30,53.9072
2018-12-03,54.3407
2018-12-04,52.8627
2018-12-06,52.5573
2018-12-07,51.6212
2018-12-10,51.4143
2018-12-11,51.3749
2018-12-12,51.5409
2018-12-13,51.521
2018-12-14,50.7563
2018-12-17,49.7632
2018-12-18,49.5547
2018-12-19,48.8993
2018-12-20,48.3133
2018-12-21,47.638
2018-12-24,46.2577
2018-12-26,48.1445
2018-12-27,48.6411
2018-12-28,48.5418
2018-12-31,48.9489
2019-01-02,49.0184
2019-01-03,48.2041
2019-01-04,49.6143
2019-01-07,49.8824
2019-01-08,50.2598
2019-01-09,50.2995
2019-01-10,50.518
2019-01-11,50.6471
2019-01-14,50.4286
2019-01-15,50.7166
2019-01-16,50.8656
2019-01-17,51.3124
2019-01-18,51.9778
2019-01-22,51.382
2019-01-23,51.4912
2019-01-24,51.5508
2019-01-25,51.7891
2019-01-28,51.5309
2019-01-29,51.6799
2019-01-30,52.1168
2019-01-31,52.4644
2019-02-01,52.6829
2019-02-04,52.8517
2019-02-05,52.951
2019-02-06,52.9808
2019-02-07,52.5538
2019-02-08,52.6134
2019-02-11,52.6531
2019-02-12,53.239
2019-02-13,53.4376
2019-02-14,53.1993
2019-02-15,53.964
2019-02-19,54.0931
2019-02-20,54.3314
2019-02-21,54.1427
2019-02-22,54.3811
2019-02-25,54.4903
2019-02-26,54.3811
2019-02-27,54.4208
2019-02-28,54.2917
2019-03-01,54.5797
2019-03-04,54.4208
2019-03-05,54.3215
2019-03-06,53.9838
2019-03-07,53.6859
2019-03-08,53.5369
2019-03-11,54.2222
2019-03-12,54.3612
2019-03-13,54.6691
2019-03-14,54.6293
2019-03-15,54.8975
2019-03-18,55.0961
2019-03-19,55.0067
2019-03-20,54.55
2019-03-21,55.03
2019-03-22,54.13
2019-03-25,54.02
2019-03-26,54.58
2019-03-27,54.34
2019-03-28,54.46
2019-03-29,54.74
2019-04-01,55.39
2019-04-02,55.29
2019-04-03,55.36
2019-04-04,55.54
2019-04-05,55.77
2019-04-08,55.81
2019-04-09,55.41
2019-04-10,55.61
2019-04-11,55.7
2019-04-12,56.08
2019-04-15,55.98
2019-04-16,56.21
2019-04-17,56.07
2019-04-18,56.08
2019-04-22,56.05
2019-04-23,56.36
2019-04-24,56.26
2019-04-25,55.95
2019-04-26,56.17
2019-04-29,56.25
2019-04-30,56.56
2019-05-01,56.12
2019-05-02,56
2019-05-03,56.45
2019-05-06,56.22
2019-05-07,55.42
2019-05-08,55.2
2019-05-09,55.05
2019-05-10,55.42
2019-05-13,54.29
2019-05-14,54.73
2019-05-15,54.85
2019-05-16,55.3
2019-05-17,55.04
2019-05-20,54.86
2019-05-21,55.29
2019-05-22,55.09
2019-05-23,54.48
2019-05-24,54.6
2019-05-28,53.87
2019-05-29,53.58
2019-05-30,53.55
2019-05-31,52.84
2019-06-03,53.34
2019-06-04,54.39
2019-06-05,54.71
2019-06-06,55.1
2019-06-07,55.32
2019-06-10,55.51
2019-06-11,55.57
2019-06-12,55.48
2019-06-13,55.735
2019-06-14,55.74
2019-06-17,55.595
2019-06-18,56.06
2019-06-19,56.04
2019-06-20,56.555
2019-06-21,56.555
2019-06-24,56.54
2019-06-25,56.24
2019-06-26,55.71
2019-06-27,55.72
2019-06-28,55.975
2019-07-01,56.47
2019-07-02,56.53
2019-07-03,57.05
2019-07-04,57.05
2019-07-05,56.97
2019-07-08,56.635
2019-07-09,56.61
2019-07-10,56.835
2019-07-11,56.6
2019-07-12,57.02
2019-07-15,56.975
2019-07-16,56.93
2019-07-17,56.6
2019-07-18,56.63
2019-07-19,56.72
2019-07-22,56.6
2019-07-23,57.035
2019-07-24,57.3
2019-07-25,57.21
2019-07-26,57.21
2019-07-29,57.41
2019-07-30,57.285
2019-07-31,56.8
2019-08-01,55.99
2019-08-02,55.76
2019-08-05,54.29
2019-08-06,54.75
2019-08-07,54.72
2019-08-08,55.705
2019-08-09,55.45
2019-08-12,54.64
2019-08-13,55.33
2019-08-14,53.89
2019-08-15,53.86
2019-08-16,54.56
2019-08-19,55.29
2019-08-20,54.72
2019-08-21,54.965
2019-08-22,55.085
2019-08-23,53.49
2019-08-26,53.94
2019-08-27,53.98
2019-08-28,54.395
2019-08-29,55.04
2019-08-30,55.12
2019-09-02,55.14
2019-09-03,54.9
2019-09-04,55.55
2019-09-05,56.42
2019-09-06,56.42
2019-09-09,56.65
2019-09-10,56.86
2019-09-11,57.37
2019-09-12,57.51
2019-09-13,57.47
2019-09-16,57.315
2019-09-17,57.27
2019-09-18,57.27
2019-09-19,57.37
2019-09-20,57.595
2019-09-23,57.3
2019-09-24,56.86
2019-09-25,56.76
2019-09-26,56.66
2019-09-27,56.49
2019-09-30,56.785
2019-10-01,55.91
2019-10-02,54.83
2019-10-03,55.06
2019-10-04,55.64
2019-10-07,55.74
2019-10-08,54.81
2019-10-09,55.145
2019-10-10,55.49
2019-10-11,56.37
2019-10-14,56.09
2019-10-15,56.63
2019-10-16,56.45
2019-10-17,56.64
2019-10-18,56.67
2019-10-21,56.94
2019-10-22,57.11
2019-10-23,57.095
2019-10-24,57.04
2019-10-25,57.355
2019-10-28,57.505
2019-10-29,57.745
2019-10-30,57.525
2019-10-31,57.35
2019-11-01,57.985
2019-11-04,58.325
2019-11-05,58.465
2019-11-06,58.475
2019-11-07,58.66
2019-11-08,58.77
2019-11-11,58.655
2019-11-12,58.545
2019-11-13,58.425
2019-11-14,58.425
2019-11-15,58.65
2019-11-18,58.8
2019-11-19,58.73
2019-11-20,58.505
2019-11-21,58.525
2019-11-22,58.73
2019-11-25,59.01
