date,close
2014-06-13,20.48
2014-06-16,20.34
2014-06-17,20.71
2014-06-18,20.22
2014-06-19,20.18
2014-06-20,20.48
2014-06-23,20.39
2014-06-24,20.19
2014-06-25,20.39
2014-06-26,20.2
2014-06-27,19.83
2014-06-30,19.96
2014-07-01,19.86
2014-07-02,19.85
2014-07-03,19.93
2014-07-07,19.71
2014-07-08,19.5
2014-07-09,19.38
2014-07-10,19.52
2014-07-11,19.61
2014-07-14,20.03
2014-07-15,19.92
2014-07-16,20.09
2014-07-17,20.02
2014-07-18,20.02
2014-07-21,20.02
2014-07-22,19.95
2014-07-23,19.95
2014-07-24,19.58
2014-07-25,19.17
2014-07-28,19.04
2014-07-29,19.2
2014-07-30,19.1
2014-07-31,18.95
2014-08-01,18.94
2014-08-04,19.01
2014-08-05,18
2014-08-06,17.96
2014-08-07,17.72
2014-08-08,17.89
2014-08-11,17.95
2014-08-12,17.7
2014-08-13,17.61
2014-08-14,17.85
2014-08-15,17.94
2014-08-18,18.02
2014-08-19,18.33
2014-08-20,18.64
2014-08-21,18.64
2014-08-22,18.77
2014-08-25,18.97
2014-08-26,18.76
2014-08-27,18.43
2014-08-28,18.25
2014-08-29,18.34
2014-09-02,18.58
2014-09-03,18.41
2014-09-04,18.2
2014-09-05,18.27
2014-09-08,18.06
2014-09-09,17.73
2014-09-10,17.75
2014-09-11,17.7
2014-09-12,17.57
2014-09-15,17.63
2014-09-16,17.55
2014-09-17,17.53
2014-09-18,18.02
2014-09-19,17.9
2014-09-22,17.54
2014-09-23,17.5
2014-09-24,17.45
2014-09-25,17.25
2014-09-26,17.38
2014-09-29,17.27
2014-09-30,17.4
2014-10-01,16.76
2014-10-02,16.98
2014-10-03,16.89
2014-10-06,16.76
2014-10-07,16.7
2014-10-08,16.67
2014-10-09,16.42
2014-10-10,16.45
2014-10-13,16.56
2014-10-14,17.14
2014-10-15,17.19
2014-10-16,17.6
2014-10-17,17.29
2014-10-20,17.33
2014-10-21,17.42
2014-10-22,17.05
2014-10-23,17.27
2014-10-24,17.45
2014-10-27,17.61
2014-10-28,18.12
2014-10-29,17.74
2014-10-30,17.08
2014-10-31,17.75
2014-11-03,17.59
2014-11-04,17.52
2014-11-05,17.45
2014-11-06,17.47
2014-11-07,17.1
2014-11-10,17.2
2014-11-11,17.14
2014-11-12,17.18
2014-11-13,17.08
2014-11-14,17.14
2014-11-17,17.1
2014-11-18,16.87
2014-11-19,16.87
2014-11-20,17.14
2014-11-21,13.98
2014-11-24,14.31
2014-11-25,14.29
2014-11-26,14.15
2014-11-28,13.99
2014-12-01,13.77
2014-12-02,14.39
2014-12-03,14.22
2014-12-04,13.99
2014-12-05,13.94
2014-12-08,13.65
2014-12-09,13.79
2014-12-10,13.88
2014-12-11,13.48
2014-12-12,13.53
2014-12-15,13.61
2014-12-16,13.67
2014-12-17,14.32
2014-12-18,14.65
2014-12-19,14.94
2014-12-22,14.22
2014-12-23,14.2
2014-12-24,14.2
2014-12-26,14.16
2014-12-29,14.11
2014-12-30,13.83
2014-12-31,13.98
2015-01-02,14.05
2015-01-05,13.8
2015-01-06,13.45
2015-01-07,13.25
2015-01-08,13.24
2015-01-09,13.4
2015-01-12,13.73
2015-01-13,13.81
2015-01-14,13.68
2015-01-15,13.22
2015-01-16,13.2
2015-01-20,12.98
2015-01-21,13.01
2015-01-22,13.02
2015-01-23,13.14
2015-01-26,13.14
2015-01-27,13.06
2015-01-28,13.04
2015-01-29,13.21
2015-01-30,13.04
2015-02-02,13.13
2015-02-03,13.12
2015-02-04,13.05
2015-02-05,13.06
2015-02-06,13.6
2015-02-09,13.89
2015-02-10,13.99
2015-02-11,13.79
2015-02-12,14.02
2015-02-13,14.32
2015-02-17,14.44
2015-02-18,14.76
2015-02-19,14.84
2015-02-20,14.81
2015-02-23,14.92
2015-02-24,14.94
2015-02-25,15.11
2015-02-26,14.98
2015-02-27,15.01
2015-03-02,15.37
2015-03-03,15.51
2015-03-04,15.41
2015-03-05,15.24
2015-03-06,15.05
2015-03-09,15.11
2015-03-10,14.87
2015-03-11,15.04
2015-03-12,15.47
2015-03-13,15.35
2015-03-16,15.35
2015-03-17,15.49
2015-03-18,15.68
2015-03-19,15.6
2015-03-20,15.67
2015-03-23,15.73
2015-03-24,15.65
2015-03-25,15.41
2015-03-26,15.33
2015-03-27,15.43
2015-03-30,15.36
2015-03-31,15.32
2015-04-01,15.24
2015-04-02,15.2
2015-04-06,15.34
2015-04-07,15.76
2015-04-08,15.8
2015-04-09,15.89
2015-04-10,15.94
2015-04-13,15.93
2015-04-14,16.09
2015-04-15,16.39
2015-04-16,16.11
2015-04-17,16
2015-04-20,16.21
2015-04-21,16.37
2015-04-22,16.39
2015-04-23,16.12
2015-04-24,15.97
2015-04-27,15.8
2015-04-28,15.9
2015-04-29,15.76
2015-04-30,15.68
2015-05-01,15.53
2015-05-04,15.3
2015-05-05,15.18
2015-05-06,15.09
2015-05-07,15.25
2015-05-08,16.19
2015-05-11,15.95
2015-05-12,16.06
2015-05-13,15.83
2015-05-14,15.91
2015-05-15,15.82
2015-05-18,15.97
2015-05-19,15.79
2015-05-20,15.32
2015-05-21,15.28
2015-05-22,15.2
2015-05-26,14.64
2015-05-27,14.73
2015-05-28,14.87
2015-05-29,14.76
2015-06-01,14.75
2015-06-02,14.81
2015-06-03,14.89
2015-06-04,14.84
2015-06-05,15.37
2015-06-08,15.26
2015-06-09,15.08
2015-06-10,15.27
2015-06-11,15.44
2015-06-12,15.37
2015-06-15,15.55
2015-06-16,15.69
2015-06-17,15.46
2015-06-18,15.76
2015-06-19,15.62
2015-06-22,15.78
2015-06-23,15.99
2015-06-24,15.78
2015-06-25,15.71
2015-06-26,15.52
2015-06-29,15.13
2015-06-30,15.15
2015-07-01,15.06
2015-07-02,14.96
2015-07-06,15.02
2015-07-07,14.93
2015-07-08,14.71
2015-07-09,14.8
2015-07-10,15.15
2015-07-13,15.54
2015-07-14,15.33
2015-07-15,14.93
2015-07-16,15.01
2015-07-17,15.27
2015-07-20,15.24
2015-07-21,15.04
2015-07-22,14.62
2015-07-23,14.4
2015-07-24,14.2
2015-07-27,13.98
2015-07-28,14.64
2015-07-29,14.64
2015-07-30,14.48
2015-07-31,14.39
2015-08-03,14.53
2015-08-04,14.46
2015-08-05,14.37
2015-08-06,14.29
2015-08-07,13.48
2015-08-10,14.5
2015-08-11,14.54
2015-08-12,14.5
2015-08-13,14.52
2015-08-14,14.7
2015-08-17,14.74
2015-08-18,14.78
2015-08-19,14.5
2015-08-20,14.32
2015-08-21,14.3
2015-08-24,13.66
2015-08-25,13.61
2015-08-26,13.93
2015-08-27,14.08
2015-08-28,14.3
2015-08-31,14.04
2015-09-01,13.57
2015-09-02,13.95
2015-09-03,13.69
2015-09-04,13.17
2015-09-08,13.23
2015-09-09,13.1
2015-09-10,13.14
2015-09-11,13.12
2015-09-14,12.78
2015-09-15,12.91
2015-09-16,12.92
2015-09-17,12.92
2015-09-18,12.6
2015-09-21,12.62
2015-09-22,12.58
2015-09-23,12.52
2015-09-24,12.62
2015-09-25,12.56
2015-09-28,12.43
2015-09-29,12.21
2015-09-30,12.2
2015-10-01,12.06
2015-10-02,11.96
2015-10-05,12.14
2015-10-06,12.17
2015-10-07,12.6
2015-10-08,12.78
2015-10-09,12.76
2015-10-12,12.74
2015-10-13,12.3
2015-10-14,12.15
2015-10-15,12.26
2015-10-16,12.08
2015-10-19,12.03
2015-10-20,12.32
2015-10-21,12.27
2015-10-22,12.62
2015-10-23,12.55
2015-10-26,12.52
2015-10-27,12.27
2015-10-28,12.44
2015-10-29,12.5
2015-10-30,12.46
2015-11-02,12.84
2015-11-03,12.8
2015-11-04,12.74
2015-11-05,12.97
2015-11-06,13.31
2015-11-09,13.04
2015-11-10,13.2
2015-11-11,12.87
2015-11-12,12.11
2015-11-13,11.9
2015-11-16,11.66
2015-11-17,11.46
2015-11-18,11.44
2015-11-19,11.46
2015-11-20,12.41
2015-11-23,12.37
2015-11-24,12.82
2015-11-25,13
2015-11-27,13.01
2015-11-30,13.38
2015-12-01,13.12
2015-12-02,13.21
2015-12-03,13.16
2015-12-04,13.31
2015-12-07,13.16
2015-12-08,12.87
2015-12-09,12.72
2015-12-10,12.76
2015-12-11,12.26
2015-12-14,12.18
2015-12-15,12.19
2015-12-16,12.37
2015-12-17,12.11
2015-12-18,12.11
2015-12-21,12.14
2015-12-22,12.14
2015-12-23,12.25
2015-12-24,12.31
2015-12-28,12.13
2015-12-29,12.05
2015-12-30,11.86
2015-12-31,11.97
2016-01-04,11.5
2016-01-05,11.67
2016-01-06,11.54
2016-01-07,11.05
2016-01-08,10.6
2016-01-11,10.59
2016-01-12,10.49
2016-01-13,10.49
2016-01-14,10.45
2016-01-15,10.22
2016-01-19,10.19
2016-01-20,10.35
2016-01-21,10.48
2016-01-22,10.88
2016-01-25,10.81
2016-01-26,11.09
2016-01-27,10.83
2016-01-28,10.94
2016-01-29,11.29
2016-02-01,11.11
2016-02-02,10.83
2016-02-03,10.99
2016-02-04,11.16
2016-02-05,10.97
2016-02-08,10.67
2016-02-09,11.17
2016-02-10,11.14
2016-02-11,11.16
2016-02-12,11.5
2016-02-16,11.68
2016-02-17,11.83
2016-02-18,12.06
2016-02-19,12.24
2016-02-22,12.59
2016-02-23,12.7
2016-02-24,12.75
2016-02-25,12.82
2016-02-26,12.84
2016-02-29,12.79
2016-03-01,12.98
2016-03-02,13.29
2016-03-03,13.36
2016-03-04,13.38
2016-03-07,13.59
2016-03-08,13.33
2016-03-09,13.71
2016-03-10,13.33
2016-03-11,13.69
2016-03-14,13.5
2016-03-15,13.45
2016-03-16,13.71
2016-03-17,13.94
2016-03-18,14.23
2016-03-21,14.41
2016-03-22,14.22
2016-03-23,14.18
2016-03-24,14
2016-03-28,13.96
2016-03-29,14.15
2016-03-30,14.37
2016-03-31,14.39
2016-04-01,14.48
2016-04-04,14.38
2016-04-05,14.45
2016-04-06,14.42
2016-04-07,14.33
2016-04-08,14.5
2016-04-11,14.63
2016-04-12,14.42
2016-04-13,14.79
2016-04-14,14.84
2016-04-15,14.7
2016-04-18,14.82
2016-04-19,15
2016-04-20,14.9
2016-04-21,14.81
2016-04-22,14.79
2016-04-25,14.58
2016-04-26,14.85
2016-04-27,14.7
2016-04-28,14.47
2016-04-29,14.43
2016-05-02,14.47
2016-05-03,14.33
2016-05-04,14.15
2016-05-05,14.33
2016-05-06,14.29
2016-05-09,13.87
2016-05-10,14.28
2016-05-11,14.09
2016-05-12,14.07
2016-05-13,14.16
2016-05-16,14.29
2016-05-17,14.18
2016-05-18,14.13
2016-05-19,14.13
2016-05-20,14.48
2016-05-23,14.43
2016-05-24,14.24
2016-05-25,14.4
2016-05-26,14.32
2016-05-27,14.26
2016-05-31,14.09
2016-06-01,14.49
2016-06-02,14.19
2016-06-03,14.21
2016-06-06,14.3
2016-06-07,14.47
2016-06-08,14.67
2016-06-09,14.31
2016-06-10,13.93
2016-06-13,14.02
2016-06-14,14.02
2016-06-15,13.77
2016-06-16,13.72
2016-06-17,13.82
2016-06-20,13.92
2016-06-21,13.96
2016-06-22,13.77
2016-06-23,13.98
2016-06-24,13.32
2016-06-27,12.64
2016-06-28,12.79
2016-06-29,13.01
2016-06-30,13.42
2016-07-01,13.56
2016-07-05,13.35
2016-07-06,13.48
2016-07-07,13.47
2016-07-08,13.92
2016-07-11,14.03
2016-07-12,14.1
2016-07-13,14.07
2016-07-14,13.96
2016-07-15,14.03
2016-07-18,13.36
2016-07-19,13.21
2016-07-20,13.29
2016-07-21,13.03
2016-07-22,13.06
2016-07-25,12.95
2016-07-26,13.02
2016-07-27,13.21
2016-07-28,12.9
2016-07-29,12.85
2016-08-01,12.93
2016-08-02,12.68
2016-08-03,12.97
2016-08-04,12.92
2016-08-05,13.38
2016-08-08,13.44
2016-08-09,13.64
2016-08-10,13.62
2016-08-11,13.53
2016-08-12,13.58
2016-08-15,13.73
2016-08-16,13.64
2016-08-17,13.86
2016-08-18,13.94
2016-08-19,13.83
2016-08-22,13.64
2016-08-23,13.8
2016-08-24,14.06
2016-08-25,13.9
2016-08-26,13.76
2016-08-29,13.85
2016-08-30,13.9
2016-08-31,13.74
2016-09-01,13.66
2016-09-02,13.8
2016-09-06,13.75
2016-09-07,14.08
2016-09-08,14.37
2016-09-09,14.28
2016-09-12,14.43
2016-09-13,13.73
2016-09-14,13.54
2016-09-15,13.5
2016-09-16,13.21
2016-09-19,13.33
2016-09-20,13.17
2016-09-21,13.11
2016-09-22,13.5
2016-09-23,13.48
2016-09-26,13.47
2016-09-27,13.52
2016-09-28,13.54
2016-09-29,13.4
2016-09-30,13.43
2016-10-03,13.5
2016-10-04,13.45
2016-10-05,13.84
2016-10-06,13.71
2016-10-07,13.51
2016-10-10,13.4
2016-10-11,13.04
2016-10-12,13
2016-10-13,12.56
2016-10-14,12.58
2016-10-17,12.68
2016-10-18,12.78
2016-10-19,12.93
2016-10-20,12.86
2016-10-21,12.55
2016-10-24,12.7
2016-10-25,12.73
2016-10-26,12.74
2016-10-27,12.68
2016-10-28,12.78
2016-10-31,12.85
2016-11-01,12.6
2016-11-02,12.4
2016-11-03,12.65
2016-11-04,12.65
2016-11-07,13.05
2016-11-08,13.1
2016-11-09,13.6
2016-11-10,13.75
2016-11-11,14.3
2016-11-14,14.75
2016-11-15,14.45
2016-11-16,14.4
2016-11-17,14.45
2016-11-18,13.9
2016-11-21,13.95
2016-11-22,14.2
2016-11-23,14.75
2016-11-25,15
2016-11-28,15
2016-11-29,14.7
2016-11-30,14.75
2016-12-01,15
2016-12-02,14.95
2016-12-05,14.85
2016-12-06,15.2
2016-12-07,15.15
2016-12-08,15.55
2016-12-09,15.4
2016-12-12,15.4
2016-12-13,15.15
2016-12-14,15
2016-12-15,15.35
2016-12-16,15.25
2016-12-19,15.05
2016-12-20,15.25
2016-12-21,15.15
2016-12-22,15.1
2016-12-23,15.2
2016-12-27,15.25
2016-12-28,15.05
2016-12-29,15
2016-12-30,14.95
2017-01-03,15.25
2017-01-04,15.25
2017-01-05,15.25
2017-01-06,15.25
2017-01-09,15.1
2017-01-10,15.3
2017-01-11,15.3
2017-01-12,15.3
2017-01-13,15.3
2017-01-17,14.85
2017-01-18,14.85
2017-01-19,15.15
2017-01-20,15.25
2017-01-23,15.25
2017-01-24,15.1
2017-01-25,15.2
2017-01-26,15.15
2017-01-27,15
2017-01-30,14.85
2017-01-31,15.15
2017-02-01,15.1
2017-02-02,15
2017-02-03,15.3
2017-02-06,15.05
2017-02-07,15
2017-02-08,13
2017-02-09,12.7
2017-02-10,12.95
2017-02-13,12.6
2017-02-14,12.55
2017-02-15,12.5
2017-02-16,12.4
2017-02-17,12.35
2017-02-21,12.35
2017-02-22,12.3
2017-02-23,12.25
2017-02-24,12.05
2017-02-27,12.15
2017-02-28,12.1
2017-03-01,12.1
2017-03-02,11.9
2017-03-03,11.65
2017-03-06,11.7
2017-03-07,11.4
2017-03-08,11.85
2017-03-09,11.55
2017-03-10,11.45
2017-03-13,11.6
2017-03-14,11.65
2017-03-15,11.6
2017-03-16,11.65
2017-03-17,11.9
2017-03-20,11.75
2017-03-21,11.5
2017-03-22,11.2
2017-03-23,11.15
2017-03-24,11.35
2017-03-27,11.15
2017-03-28,11.45
2017-03-29,11.3
2017-03-30,11.45
2017-03-31,11.4
2017-04-03,11.35
2017-04-04,11.3
2017-04-05,11.25
2017-04-06,11.65
2017-04-07,11.8
2017-04-10,11.9
2017-04-11,12.1
2017-04-12,11.8
2017-04-13,11.65
2017-04-17,11.8
2017-04-18,11.9
2017-04-19,11.8
2017-04-20,12.05
2017-04-21,12.15
2017-04-24,12.05
2017-04-25,12.15
2017-04-26,12.45
2017-04-27,12.45
2017-04-28,12.15
2017-05-01,9.95
2017-05-02,9.6
2017-05-03,9.4
2017-05-04,9.25
2017-05-05,9.15
2017-05-08,9.1
2017-05-09,9.15
2017-05-10,8.35
2017-05-11,8.45
2017-05-12,8.25
2017-05-15,8.95
2017-05-16,8.8
2017-05-17,8.9
2017-05-18,9.05
2017-05-19,9.1
2017-05-22,9.25
2017-05-23,9.3
2017-05-24,9.4
2017-05-25,9.25
2017-05-26,9.45
2017-05-30,9.6
2017-05-31,9.65
2017-06-01,9.9
2017-06-02,9.85
2017-06-05,9.9
2017-06-06,9.65
2017-06-07,9.65
2017-06-08,9.8
2017-06-09,9.9
2017-06-12,10.25
2017-06-13,10.1
2017-06-14,10.25
2017-06-15,10.25
2017-06-16,10.05
2017-06-19,10.05
2017-06-20,9.8
2017-06-21,9.9
2017-06-22,9.85
2017-06-23,10.05
2017-06-26,10.25
2017-06-27,10.25
2017-06-28,10.45
2017-06-29,10.6
2017-06-30,10.85
2017-07-03,10.85
2017-07-05,10.9
2017-07-06,10.7
2017-07-07,10.85
2017-07-10,10.95
2017-07-11,10.95
2017-07-12,11.05
2017-07-13,11.1
2017-07-14,11.25
2017-07-17,10.9
2017-07-18,10.8
2017-07-19,10.95
2017-07-20,11
2017-07-21,11
2017-07-24,10.6
2017-07-25,10.9
2017-07-26,10.55
2017-07-27,10.45
2017-07-28,10.65
2017-07-31,10.85
2017-08-01,10.45
2017-08-02,10.55
2017-08-03,10.35
2017-08-04,10.45
2017-08-07,10.05
2017-08-08,10.35
2017-08-09,7.85
2017-08-10,7.05
2017-08-11,7.55
2017-08-14,7.8
2017-08-15,7.85
2017-08-16,7.75
2017-08-17,7.75
2017-08-18,7.75
2017-08-21,7.9
2017-08-22,8.15
2017-08-23,8
2017-08-24,8.05
2017-08-25,8.15
2017-08-28,8.1
2017-08-29,8.1
2017-08-30,8.2
2017-08-31,8.4
2017-09-01,8.4
2017-09-05,8.45
2017-09-06,8.55
2017-09-07,8.65
2017-09-08,8.6
2017-09-11,8.75
2017-09-12,8.6
2017-09-13,8.75
2017-09-14,8.75
2017-09-15,8.85
2017-09-18,9.05
2017-09-19,9
2017-09-20,9.05
2017-09-21,9.2
2017-09-22,9.35
2017-09-25,9.3
2017-09-26,9.5
2017-09-27,9.45
2017-09-28,9.35
2017-09-29,9.4
2017-10-02,9.55
2017-10-03,9.6
2017-10-04,9.55
2017-10-05,9.7
2017-10-06,9.75
2017-10-09,9.15
2017-10-10,9.15
2017-10-11,9.15
2017-10-12,9.25
2017-10-13,9.5
2017-10-16,9.45
2017-10-17,9.4
2017-10-18,9.5
2017-10-19,9.45
2017-10-20,9.5
2017-10-23,9.5
2017-10-24,9.55
2017-10-25,9.45
2017-10-26,9.45
2017-10-27,9.25
2017-10-30,9.05
2017-10-31,9.05
2017-11-01,9.2
2017-11-02,9.5
2017-11-03,9.05
2017-11-06,9.05
2017-11-07,8.8
2017-11-08,8.9
2017-11-09,8.7
2017-11-10,8.6
2017-11-13,8.2
2017-11-14,8.25
2017-11-15,8.05
2017-11-16,8.1
2017-11-17,8.1
2017-11-20,8.05
2017-11-21,8
2017-11-22,8
2017-11-24,8
2017-11-27,7.8
2017-11-28,7.7
2017-11-29,7.25
2017-11-30,7.4
2017-12-01,7.3
2017-12-04,7.25
2017-12-05,7.1
2017-12-06,7
2017-12-07,6.8
2017-12-08,6.75
2017-12-11,6.9
2017-12-12,6.75
2017-12-13,6.8
2017-12-14,6.85
2017-12-15,6.8
2017-12-18,6.85
2017-12-19,6.8
2017-12-20,6.8
2017-12-21,6.9
2017-12-22,7.1
2017-12-26,7
2017-12-27,7.2
2017-12-28,7.35
2017-12-29,7.4
2018-01-02,7.5
2018-01-03,7.65
2018-01-04,7.65
2018-01-05,7.65
2018-01-08,7.6
2018-01-09,7.6
2018-01-10,7.6
2018-01-11,7.75
2018-01-12,7.65
2018-01-16,7.4
2018-01-17,7.35
2018-01-18,7.35
2018-01-19,7.4
2018-01-22,7.4
2018-01-23,7.5
2018-01-24,7.5
2018-01-25,7.15
2018-01-26,7.25
2018-01-29,7.25
2018-01-30,7.3
2018-01-31,7.15
2018-02-01,7.05
2018-02-02,7.05
2018-02-05,6.55
2018-02-06,6.3
2018-02-07,6.5
2018-02-08,6.55
2018-02-09,8.35
2018-02-12,8.5
2018-02-13,8.6
2018-02-14,8.85
2018-02-15,8.85
2018-02-16,8.9
2018-02-20,8.95
2018-02-21,8.95
2018-02-22,8.75
2018-02-23,8.8
2018-02-26,8.85
2018-02-27,8.7
2018-02-28,8.95
2018-03-01,9.2
2018-03-02,9.15
2018-03-05,9.25
2018-03-06,9.45
2018-03-07,9.7
2018-03-08,9.8
2018-03-09,9.85
2018-03-12,9.4
2018-03-13,9.55
2018-03-14,9.6
2018-03-15,9.65
2018-03-16,9.85
2018-03-19,10.05
2018-03-20,9.9
2018-03-21,10.1
2018-03-22,10.05
2018-03-23,10.1
2018-03-26,10.45
2018-03-27,10.3
2018-03-28,10
2018-03-29,10.25
2018-04-02,10.25
2018-04-03,10.4
2018-04-04,10.6
2018-04-05,10.7
2018-04-06,10.5
2018-04-09,10.35
2018-04-10,10.45
2018-04-11,10.4
2018-04-12,10.4
2018-04-13,10.4
2018-04-16,10.6
2018-04-17,10.7
2018-04-18,10.85
2018-04-19,11.05
2018-04-20,10.9
2018-04-23,10.9
2018-04-24,11
2018-04-25,10.9
2018-04-26,10.65
2018-04-27,9.9
2018-04-30,10.1
2018-05-01,9.4
2018-05-02,9.45
2018-05-03,9.35
2018-05-04,9.8
2018-05-07,9.95
2018-05-08,10.25
2018-05-09,10.35
2018-05-10,10.4
2018-05-11,10.4
2018-05-14,10.5
2018-05-15,10.35
2018-05-16,10.4
2018-05-17,10.55
2018-05-18,10.6
2018-05-21,11.05
2018-05-22,11
2018-05-23,11.25
2018-05-24,11.6
2018-05-25,11.55
2018-05-29,11.55
2018-05-30,11.65
2018-05-31,11.5
2018-06-01,11.7
2018-06-04,11.6
2018-06-05,11.55
2018-06-06,11.65
2018-06-07,11.75
2018-06-08,11.95
2018-06-11,11.7
2018-06-12,11.65
2018-06-13,11.7
2018-06-14,11.5
2018-06-15,11.6
2018-06-18,11.7
2018-06-19,11.55
2018-06-20,11.8
2018-06-21,11.55
2018-06-22,11.6
2018-06-25,11.25
2018-06-26,11.45
2018-06-27,11.25
2018-06-28,11.3
2018-06-29,11.25
2018-07-02,11.15
2018-07-03,11
2018-07-05,11.05
2018-07-06,11.15
2018-07-09,11.4
2018-07-10,11.4
2018-07-11,11.25
2018-07-12,11.3
2018-07-13,11.45
2018-07-16,11.65
2018-07-17,11.8
2018-07-18,12
2018-07-19,12.1
2018-07-20,12.1
2018-07-23,11.85
2018-07-24,11.9
2018-07-25,11.9
2018-07-26,11.9
2018-07-27,11.4
2018-07-30,11.65
2018-07-31,11.95
2018-08-01,11.95
2018-08-02,11.95
2018-08-03,13.2
2018-08-06,13.5
2018-08-07,13.55
2018-08-08,13.8
2018-08-09,13.95
2018-08-10,13.9
2018-08-13,13.95
2018-08-14,13.95
2018-08-15,13.65
2018-08-16,12.95
2018-08-17,13.2
2018-08-20,13.05
2018-08-21,13.05
2018-08-22,12.85
2018-08-23,12.8
2018-08-24,13.15
2018-08-27,12.7
2018-08-28,12.55
2018-08-29,12.5
2018-08-30,12.25
2018-08-31,12.15
2018-09-04,11.6
2018-09-05,11.35
2018-09-06,11.15
2018-09-07,10.75
2018-09-10,10.85
2018-09-11,10.8
2018-09-12,10.85
2018-09-13,10.55
2018-09-14,10.65
2018-09-17,10.8
2018-09-18,10.85
2018-09-19,11.15
2018-09-20,11.1
2018-09-21,11.35
2018-09-24,11.05
2018-09-25,11.25
2018-09-26,11.05
2018-09-27,11.15
2018-09-28,11.25
2018-10-01,11.09
2018-10-02,11.35
2018-10-03,11.71
2018-10-04,11.37
2018-10-05,11.26
2018-10-08,11.01
2018-10-09,10.91
2018-10-10,10.71
2018-10-11,10.65
2018-10-12,10.69
2018-10-15,10.8
2018-10-16,11.25
2018-10-17,10.89
2018-10-18,10.51
2018-10-19,10.46
2018-10-22,10.84
2018-10-23,10.51
2018-10-24,10.02
2018-10-25,10.15
2018-10-26,10.2
2018-10-29,9.87
2018-10-30,10.07
2018-10-31,10.18
2018-11-01,10.44
2018-11-02,10.39
2018-11-05,10.58
2018-11-06,10.86
2018-11-07,11.14
2018-11-08,11.13
2018-11-09,11.01
2018-11-12,10.91
2018-11-13,10.89
2018-11-14,11.05
2018-11-15,11.26
2018-11-16,9.77
2018-11-19,9.75
2018-11-20,8.85
2018-11-21,8.95
2018-11-23,9.25
2018-11-26,9.29
2018-11-27,9.06
2018-11-28,9.36
2018-11-29,9.29
2018-11-30,9.52
2018-12-03,9.47
2018-12-04,9.08
2018-12-06,9.05
2018-12-07,8.94
2018-12-10,8.93
2018-12-11,9.01
2018-12-12,9.29
2018-12-13,8.83
2018-12-14,8.74
2018-12-17,8.84
2018-12-18,8.72
2018-12-19,8.38
2018-12-20,8.28
2018-12-21,7.74
2018-12-24,7.74
2018-12-26,8.1
2018-12-27,7.98
2018-12-28,8.03
2018-12-31,7.9
2019-01-02,8.24
2019-01-03,7.77
2019-01-04,7.96
2019-01-07,7.9
2019-01-08,7.89
2019-01-09,8
2019-01-10,7.97
2019-01-11,8.21
2019-01-14,8.31
2019-01-15,8.27
2019-01-16,8.23
2019-01-17,8.42
2019-01-18,8.44
2019-01-22,8.12
2019-01-23,8.14
2019-01-24,8.34
2019-01-25,8.3
2019-01-28,8.05
2019-01-29,8
2019-01-30,8.11
2019-01-31,8.74
2019-02-01,7.9
2019-02-04,8
2019-02-05,7.92
2019-02-06,8.43
2019-02-07,8.15
2019-02-08,7.97
2019-02-11,7.87
2019-02-12,8.06
2019-02-13,7.92
2019-02-14,7.94
2019-02-15,7.98
2019-02-19,8.2
2019-02-20,8.2
2019-02-21,8.25
2019-02-22,8.5
2019-02-25,8.36
2019-02-26,8.4
2019-02-27,8.49
2019-02-28,8.49
2019-03-01,8.55
2019-03-04,8.19
2019-03-05,8.08
2019-03-06,7.9
2019-03-07,7.95
2019-03-08,7.94
2019-03-11,7.77
2019-03-12,7.9
2019-03-13,7.96
2019-03-14,7.99
2019-03-15,8.22
2019-03-18,8.62
2019-03-19,8.75
2019-03-20,8.7
2019-03-21,8.76
2019-03-22,8.7
2019-03-25,8.7
2019-03-26,8.65
2019-03-27,8.78
2019-03-28,8.75
2019-03-29,8.79
2019-04-01,9.03
2019-04-02,8.84
2019-04-03,8.29
2019-04-04,8.21
2019-04-05,8.3
2019-04-08,8.39
2019-04-09,8.15
2019-04-10,8.26
2019-04-11,8.36
2019-04-12,8.42
2019-04-15,8.25
2019-04-16,8.32
2019-04-17,8.25
2019-04-18,8.26
2019-04-22,8.18
2019-04-23,8.37
2019-04-24,8.22
2019-04-25,8.17
2019-04-26,8.25
2019-04-29,8.4
2019-04-30,8.44
2019-05-01,8.43
2019-05-02,8.38
2019-05-03,10.53
2019-05-06,10.33
2019-05-07,10.01
2019-05-08,10.01
2019-05-09,10.2
2019-05-10,10.04
2019-05-13,9.84
2019-05-14,9.98
2019-05-15,10.4
2019-05-16,10.23
2019-05-17,10.19
2019-05-20,10.17
2019-05-21,10.23
2019-05-22,10.09
2019-05-23,9.82
2019-05-24,9.69
2019-05-28,10.15
2019-05-29,10.51
2019-05-30,10.06
2019-05-31,9.82
2019-06-03,10.1
2019-06-04,10.51
2019-06-05,10.48
2019-06-06,10.45
2019-06-07,10.6
2019-06-10,10.47
2019-06-11,10.54
2019-06-12,10.51
2019-06-13,11.15
2019-06-14,10.86
2019-06-17,10.2
2019-06-18,10.31
2019-06-19,10.13
2019-06-20,10.065
2019-06-21,10.365
2019-06-24,10.095
2019-06-25,10.46
2019-06-26,10.685
2019-06-27,10.46
2019-06-28,11.04
2019-07-01,10.94
2019-07-02,11.095
2019-07-03,11.035
2019-07-04,11.035
2019-07-05,11.055
2019-07-08,10.83
2019-07-09,10.945
2019-07-10,10.825
2019-07-11,10.75
2019-07-12,10.935
2019-07-15,10.755
2019-07-16,10.865
2019-07-17,10.64
2019-07-18,10.665
2019-07-19,10.835
2019-07-22,10.675
2019-07-23,10.905
2019-07-24,10.985
2019-07-25,10.545
2019-07-26,10.85
2019-07-29,10.885
2019-07-30,10.75
2019-07-31,10.565
2019-08-01,10.395
2019-08-02,10.455
2019-08-05,9.795
2019-08-06,9.915
2019-08-07,9.905
2019-08-08,10.34
2019-08-09,11.065
2019-08-12,11.005
2019-08-13,11.005
2019-08-14,11.005
2019-08-15,10.945
2019-08-16,10.97
2019-08-19,10.95
2019-08-20,10.985
2019-08-21,10.995
2019-08-22,11.015
2019-08-23,10.955
2019-08-26,10.945
2019-08-27,10.925
2019-08-28,10.925
2019-08-29,10.955
2019-08-30,10.99
2019-09-02,11
2019-09-03,10.97
2019-09-04,10.955
2019-09-05,10.965
2019-09-06,10.955
2019-09-09,10.945
2019-09-10,10.945
2019-09-11,10.945
2019-09-12,10.935
2019-09-13,10.94
2019-09-16,10.98
2019-09-17,10.935
2019-09-18,10.99
2019-09-19,10.955
2019-09-20,10.965
2019-09-23,10.975
2019-09-24,10.975
2019-09-25,10.98
2019-09-26,10.985
2019-09-27,10.97
2019-09-30,10.995
2019-10-01,10.995
2019-10-02,10.975
2019-10-03,11.025
2019-10-04,10.985
2019-10-07,11.005
2019-10-08,10.985
2019-10-09,10.985
2019-10-10,11.015
2019-10-11,11.005
2019-10-14,10.995
2019-10-15,11
2019-10-16,10.995
2019-10-17,11.005
2019-10-18,11.01
2019-10-21,11.005
2019-10-22,11.005
2019-10-23,11.005
2019-10-24,11.005
2019-10-25,11.005
2019-10-28,11.01
2019-10-29,11.015
2019-10-30,11.005
2019-10-31,11.02
2019-11-01,11.015
2019-11-04,11.025
2019-11-05,11.025
2019-11-06,11.015
2019-11-07,11.03
2019-11-08,11.01
2019-11-11,10.965
2019-11-12,10.985
2019-11-13,10.99
2019-11-14,10.985
2019-11-15,10.965
2019-11-18,10.955
2019-11-19,10.975
2019-11-20,10.965
2019-11-21,10.975
2019-11-22,10.965
2019-11-25,10.97
