date,close
2014-06-13,4.9995
2014-06-16,5.0161
2014-06-17,5.0328
2014-06-18,5.0494
2014-06-19,5.149
2014-06-20,5.0992
2014-06-23,5.0411
2014-06-24,5.0161
2014-06-25,5.0244
2014-06-26,5.0244
2014-06-27,5.1739
2014-06-30,5.1905
2014-07-01,5.2155
2014-07-02,5.2238
2014-07-03,5.2072
2014-07-07,5.2653
2014-07-08,5.2985
2014-07-09,5.3068
2014-07-10,5.3733
2014-07-11,5.3566
2014-07-14,5.3566
2014-07-15,5.3566
2014-07-16,5.3899
2014-07-17,5.3068
2014-07-18,5.3816
2014-07-21,5.34
2014-07-22,5.3733
2014-07-23,5.3733
2014-07-24,5.3151
2014-07-25,5.2736
2014-07-28,5.2819
2014-07-29,5.2404
2014-07-30,5.2321
2014-07-31,5.2321
2014-08-01,5.1739
2014-08-04,5.2404
2014-08-05,5.1905
2014-08-06,5.2492
2014-08-07,5.1738
2014-08-08,5.224
2014-08-11,5.3161
2014-08-12,5.2408
2014-08-13,5.3161
2014-08-14,5.3161
2014-08-15,5.3161
2014-08-18,5.4082
2014-08-19,5.4333
2014-08-20,5.4082
2014-08-21,5.4501
2014-08-22,5.3915
2014-08-25,5.3496
2014-08-26,5.3998
2014-08-27,5.3747
2014-08-28,5.3664
2014-08-29,5.4166
2014-09-02,5.4333
2014-09-03,5.3747
2014-09-04,5.291
2014-09-05,5.2826
2014-09-08,5.3245
2014-09-09,5.2408
2014-09-10,5.1738
2014-09-11,5.1738
2014-09-12,5.1571
2014-09-15,5.0901
2014-09-16,5.1487
2014-09-17,5.1571
2014-09-18,5.1571
2014-09-19,5.1571
2014-09-22,5.0901
2014-09-23,4.998
2014-09-24,5.0064
2014-09-25,4.931
2014-09-26,4.9896
2014-09-29,4.9813
2014-09-30,4.9394
2014-10-01,4.9561
2014-10-02,4.9813
2014-10-03,4.998
2014-10-06,4.9813
2014-10-07,4.931
2014-10-08,5.1236
2014-10-09,5.0817
2014-10-10,5.0733
2014-10-13,5.1236
2014-10-14,5.2157
2014-10-15,5.2324
2014-10-16,5.2653
2014-10-17,5.2157
2014-10-20,5.3329
2014-10-21,5.3412
2014-10-22,5.3747
2014-10-23,5.4501
2014-10-24,5.4752
2014-10-27,5.5003
2014-10-28,5.584
2014-10-29,5.5924
2014-10-30,5.6259
2014-10-31,5.7598
2014-11-03,5.718
2014-11-04,5.7012
2014-11-05,5.7515
2014-11-06,5.7002
2014-11-07,5.7508
2014-11-10,5.8183
2014-11-11,5.7424
2014-11-12,5.734
2014-11-13,5.7255
2014-11-14,5.6159
2014-11-17,5.6497
2014-11-18,5.6497
2014-11-19,5.5822
2014-11-20,5.6497
2014-11-21,5.5991
2014-11-24,5.6328
2014-11-25,5.6244
2014-11-26,5.7087
2014-11-28,5.7255
2014-12-01,5.734
2014-12-02,5.8352
2014-12-03,5.8014
2014-12-04,5.7761
2014-12-05,5.7508
2014-12-08,5.7593
2014-12-09,5.8183
2014-12-10,5.8099
2014-12-11,5.8267
2014-12-12,5.7761
2014-12-15,5.6497
2014-12-16,5.6834
2014-12-17,5.7846
2014-12-18,5.7677
2014-12-19,5.8014
2014-12-22,5.9448
2014-12-23,6.046
2014-12-24,6.0038
2014-12-26,6.0628
2014-12-29,6.1556
2014-12-30,6.223
2014-12-31,6.1893
2015-01-02,6.1978
2015-01-05,6.3495
2015-01-06,6.4423
2015-01-07,6.5435
2015-01-08,6.4844
2015-01-09,6.4423
2015-01-12,6.4676
2015-01-13,6.4676
2015-01-14,6.5097
2015-01-15,6.5182
2015-01-16,6.6109
2015-01-20,6.5519
2015-01-21,6.5603
2015-01-22,6.7121
2015-01-23,6.7121
2015-01-26,6.7711
2015-01-27,6.8639
2015-01-28,6.9061
2015-01-29,6.9482
2015-01-30,6.7121
2015-02-02,6.6868
2015-02-03,6.7206
2015-02-04,6.7374
2015-02-05,6.8133
2015-02-06,6.5672
2015-02-09,6.5757
2015-02-10,6.4485
2015-02-11,6.423
2015-02-12,6.4569
2015-02-13,6.4569
2015-02-17,6.3721
2015-02-18,6.4654
2015-02-19,6.3382
2015-02-20,6.3806
2015-02-23,6.4315
2015-02-24,6.3636
2015-02-25,6.3721
2015-02-26,6.3212
2015-02-27,6.3466
2015-03-02,6.3976
2015-03-03,6.423
2015-03-04,6.3127
2015-03-05,6.3806
2015-03-06,6.1345
2015-03-09,6.1091
2015-03-10,6.0327
2015-03-11,6.0497
2015-03-12,6.1854
2015-03-13,6.2194
2015-03-16,6.2533
2015-03-17,6.2448
2015-03-18,6.3976
2015-03-19,6.3721
2015-03-20,6.4569
2015-03-23,6.4824
2015-03-24,6.4569
2015-03-25,6.3042
2015-03-26,6.2448
2015-03-27,6.3042
2015-03-30,6.3891
2015-03-31,6.3551
2015-04-01,6.3806
2015-04-02,6.4145
2015-04-06,6.4145
2015-04-07,6.2873
2015-04-08,6.2363
2015-04-09,6.0751
2015-04-10,6.3976
2015-04-13,6.3297
2015-04-14,6.3127
2015-04-15,6.2533
2015-04-16,6.2618
2015-04-17,6.2109
2015-04-20,6.2363
2015-04-21,6.2279
2015-04-22,6.2533
2015-04-23,6.2363
2015-04-24,6.2448
2015-04-27,6.2279
2015-04-28,6.2024
2015-04-29,6.0582
2015-04-30,5.9309
2015-05-01,5.9818
2015-05-04,5.9818
2015-05-05,5.8545
2015-05-06,5.8289
2015-05-07,5.9143
2015-05-08,5.9913
2015-05-11,5.8802
2015-05-12,5.8716
2015-05-13,5.8118
2015-05-14,5.9058
2015-05-15,5.9656
2015-05-18,5.9656
2015-05-19,5.9571
2015-05-20,5.9143
2015-05-21,5.9143
2015-05-22,5.9143
2015-05-26,5.8203
2015-05-27,5.8716
2015-05-28,5.8374
2015-05-29,5.7691
2015-06-01,5.8374
2015-06-02,5.7605
2015-06-03,5.7007
2015-06-04,5.675
2015-06-05,5.6665
2015-06-08,5.6494
2015-06-09,5.5639
2015-06-10,5.6067
2015-06-11,5.6323
2015-06-12,5.5896
2015-06-15,5.5212
2015-06-16,5.5554
2015-06-17,5.5639
2015-06-18,5.6836
2015-06-19,5.7349
2015-06-22,5.7007
2015-06-23,5.6836
2015-06-24,5.6494
2015-06-25,5.5896
2015-06-26,5.6238
2015-06-29,5.5212
2015-06-30,5.4699
2015-07-01,5.5981
2015-07-02,5.6238
2015-07-06,5.6494
2015-07-07,5.7691
2015-07-08,5.8032
2015-07-09,5.7263
2015-07-10,5.8289
2015-07-13,5.846
2015-07-14,5.846
2015-07-15,5.8716
2015-07-16,5.9143
2015-07-17,5.9058
2015-07-20,5.8545
2015-07-21,5.8032
2015-07-22,5.8118
2015-07-23,5.7007
2015-07-24,5.6836
2015-07-27,5.7007
2015-07-28,5.7178
2015-07-29,5.7349
2015-07-30,5.7092
2015-07-31,5.7263
2015-08-03,5.7434
2015-08-04,5.752
2015-08-05,5.7263
2015-08-06,5.7608
2015-08-07,5.9933
2015-08-10,5.9072
2015-08-11,5.9244
2015-08-12,5.9244
2015-08-13,5.9502
2015-08-14,5.9847
2015-08-17,6.0277
2015-08-18,6.0277
2015-08-19,5.9416
2015-08-20,5.8985
2015-08-21,5.7866
2015-08-24,5.3474
2015-08-25,5.1752
2015-08-26,5.4163
2015-08-27,5.4852
2015-08-28,5.468
2015-08-31,5.3905
2015-09-01,5.2269
2015-09-02,5.1838
2015-09-03,5.1924
2015-09-04,5.0805
2015-09-08,5.1236
2015-09-09,5.0805
2015-09-10,5.0891
2015-09-11,5.1838
2015-09-14,5.2441
2015-09-15,5.3474
2015-09-16,5.4163
2015-09-17,5.4336
2015-09-18,5.313
2015-09-21,5.3733
2015-09-22,5.3216
2015-09-23,5.3647
2015-09-24,5.3733
2015-09-25,5.3991
2015-09-28,5.3044
2015-09-29,5.3991
2015-09-30,5.3474
2015-10-01,5.4077
2015-10-02,5.4422
2015-10-05,5.5541
2015-10-06,5.4594
2015-10-07,5.6058
2015-10-08,5.6919
2015-10-09,5.6919
2015-10-12,5.7952
2015-10-13,5.6747
2015-10-14,5.623
2015-10-15,5.7608
2015-10-16,5.7435
2015-10-19,5.8297
2015-10-20,5.8297
2015-10-21,5.7608
2015-10-22,5.8727
2015-10-23,5.9072
2015-10-26,5.9416
2015-10-27,5.9072
2015-10-28,6.0191
2015-10-29,6.0191
2015-10-30,6.0191
2015-11-02,6.1569
2015-11-03,6.131
2015-11-04,6.088
2015-11-05,6.1224
2015-11-06,6.0964
2015-11-09,6.0357
2015-11-10,6.1311
2015-11-11,6.0877
2015-11-12,5.975
2015-11-13,5.897
2015-11-16,5.9143
2015-11-17,5.9316
2015-11-18,5.9923
2015-11-19,6.0791
2015-11-20,6.2091
2015-11-23,6.2699
2015-11-24,6.2959
2015-11-25,6.2959
2015-11-27,6.3826
2015-11-30,6.3479
2015-12-01,6.3826
2015-12-02,6.2005
2015-12-03,6.1138
2015-12-04,6.1658
2015-12-07,6.1484
2015-12-08,6.1658
2015-12-09,6.1571
2015-12-10,6.1224
2015-12-11,6.0791
2015-12-14,6.027
2015-12-15,6.0877
2015-12-16,6.2178
2015-12-17,6.2352
2015-12-18,6.1051
2015-12-21,6.0531
2015-12-22,6.0791
2015-12-23,6.1484
2015-12-24,6.1658
2015-12-28,6.2005
2015-12-29,6.2872
2015-12-30,6.2438
2015-12-31,6.1398
2016-01-04,5.897
2016-01-05,6.0791
2016-01-06,6.1224
2016-01-07,5.9577
2016-01-08,5.8709
2016-01-11,5.9143
2016-01-12,5.8536
2016-01-13,5.8623
2016-01-14,5.8796
2016-01-15,5.8016
2016-01-19,5.8449
2016-01-20,5.7842
2016-01-21,5.7322
2016-01-22,5.9577
2016-01-25,5.897
2016-01-26,6.0357
2016-01-27,5.897
2016-01-28,5.9056
2016-01-29,6.1224
2016-02-01,6.1918
2016-02-02,6.1831
2016-02-03,6.1831
2016-02-04,6.1745
2016-02-05,6.0531
2016-02-08,5.975
2016-02-09,5.9316
2016-02-10,6.0277
2016-02-11,5.9142
2016-02-12,5.9142
2016-02-16,6.0452
2016-02-17,6.0015
2016-02-18,6.0714
2016-02-19,6.2112
2016-02-22,6.2636
2016-02-23,6.1413
2016-02-24,6.1326
2016-02-25,6.2112
2016-02-26,6.0539
2016-02-29,5.9666
2016-03-01,6.0889
2016-03-02,6.1762
2016-03-03,6.2025
2016-03-04,6.15
2016-03-07,6.185
2016-03-08,6.0802
2016-03-09,6.1064
2016-03-10,6.1064
2016-03-11,6.2287
2016-03-14,6.1326
2016-03-15,6.0802
2016-03-16,6.185
2016-03-17,6.3073
2016-03-18,6.2374
2016-03-21,6.1588
2016-03-22,6.1588
2016-03-23,6.0976
2016-03-24,6.0277
2016-03-28,6.0889
2016-03-29,6.2636
2016-03-30,6.316
2016-03-31,6.316
2016-04-01,6.3248
2016-04-04,6.2549
2016-04-05,6.2374
2016-04-06,6.2374
2016-04-07,6.1413
2016-04-08,6.1675
2016-04-11,6.1326
2016-04-12,6.185
2016-04-13,6.2025
2016-04-14,6.0976
2016-04-15,6.1151
2016-04-18,6.15
2016-04-19,6.1151
2016-04-20,6.0103
2016-04-21,5.9666
2016-04-22,5.9928
2016-04-25,6.0452
2016-04-26,6.1064
2016-04-27,6.0976
2016-04-28,6.1762
2016-04-29,6.0452
2016-05-02,6.1238
2016-05-03,6.1588
2016-05-04,6.2374
2016-05-05,6.1937
2016-05-06,6.0617
2016-05-09,6.1057
2016-05-10,6.2993
2016-05-11,6.0793
2016-05-12,6.1233
2016-05-13,6.2289
2016-05-16,6.3257
2016-05-17,6.0178
2016-05-18,5.9562
2016-05-19,5.877
2016-05-20,5.921
2016-05-23,5.9122
2016-05-24,6.1233
2016-05-25,5.9738
2016-05-26,6.0354
2016-05-27,6.053
2016-05-31,5.9738
2016-06-01,6.053
2016-06-02,6.0969
2016-06-03,6.1409
2016-06-06,6.0881
2016-06-07,6.1233
2016-06-08,6.2993
2016-06-09,6.2289
2016-06-10,6.2201
2016-06-13,6.3081
2016-06-14,6.3521
2016-06-15,6.2905
2016-06-16,6.3257
2016-06-17,6.3081
2016-06-20,6.2729
2016-06-21,6.2641
2016-06-22,6.2465
2016-06-23,6.2817
2016-06-24,6.1761
2016-06-27,6.2201
2016-06-28,6.3257
2016-06-29,6.4313
2016-06-30,6.5368
2016-07-01,6.4665
2016-07-05,6.5368
2016-07-06,6.5016
2016-07-07,6.4753
2016-07-08,6.6952
2016-07-11,6.792
2016-07-12,6.7656
2016-07-13,6.8096
2016-07-14,6.792
2016-07-15,6.9415
2016-07-18,6.9767
2016-07-19,6.9855
2016-07-20,6.9855
2016-07-21,6.9943
2016-07-22,7.0031
2016-07-25,7.0207
2016-07-26,7.0647
2016-07-27,6.9767
2016-07-28,7.0119
2016-07-29,7.0735
2016-08-01,7.0559
2016-08-02,6.8712
2016-08-03,6.7568
2016-08-04,6.6424
2016-08-05,6.7392
2016-08-08,6.6952
2016-08-09,6.6952
2016-08-10,6.6952
2016-08-11,6.6332
2016-08-12,6.6598
2016-08-15,6.6243
2016-08-16,6.4915
2016-08-17,6.4561
2016-08-18,6.4827
2016-08-19,6.4561
2016-08-22,6.5624
2016-08-23,6.5978
2016-08-24,6.6775
2016-08-25,6.7395
2016-08-26,6.6332
2016-08-29,6.6775
2016-08-30,6.6598
2016-08-31,6.7041
2016-09-01,6.6863
2016-09-02,6.766
2016-09-06,7.0317
2016-09-07,7.0317
2016-09-08,6.952
2016-09-09,6.6863
2016-09-12,6.6155
2016-09-13,6.4207
2016-09-14,6.3321
2016-09-15,6.3498
2016-09-16,6.3764
2016-09-19,6.3675
2016-09-20,6.3144
2016-09-21,6.4384
2016-09-22,6.6421
2016-09-23,6.6598
2016-09-26,6.6509
2016-09-27,6.5004
2016-09-28,6.5978
2016-09-29,6.4649
2016-09-30,6.3764
2016-10-03,6.3144
2016-10-04,6.1727
2016-10-05,5.9867
2016-10-06,5.9867
2016-10-07,5.8893
2016-10-10,5.9601
2016-10-11,5.9424
2016-10-12,6.0664
2016-10-13,6.2524
2016-10-14,6.2701
2016-10-17,6.1373
2016-10-18,6.0841
2016-10-19,6.1284
2016-10-20,6.1284
2016-10-21,6.1638
2016-10-24,6.1993
2016-10-25,6.1904
2016-10-26,6.031
2016-10-27,5.8007
2016-10-28,5.8273
2016-10-31,5.9956
2016-11-01,5.7299
2016-11-02,5.6767
2016-11-03,5.7122
2016-11-04,5.5351
2016-11-07,5.5705
2016-11-08,5.5348
2016-11-09,5.6508
2016-11-10,5.5615
2016-11-11,5.7669
2016-11-14,5.9008
2016-11-15,5.8383
2016-11-16,5.8115
2016-11-17,5.8472
2016-11-18,6.0168
2016-11-21,5.9008
2016-11-22,5.9722
2016-11-23,5.9276
2016-11-25,5.9097
2016-11-28,5.8383
2016-11-29,5.8829
2016-11-30,5.7579
2016-12-01,5.5437
2016-12-02,5.5258
2016-12-05,5.624
2016-12-06,5.6687
2016-12-07,5.7579
2016-12-08,5.8651
2016-12-09,5.7937
2016-12-12,5.874
2016-12-13,5.8561
2016-12-14,5.6419
2016-12-15,5.5883
2016-12-16,5.6776
2016-12-19,5.7312
2016-12-20,5.7937
2016-12-21,5.6508
2016-12-22,5.6062
2016-12-23,5.5794
2016-12-27,5.5973
2016-12-28,5.5526
2016-12-29,5.7133
2016-12-30,5.8294
2017-01-03,5.9454
2017-01-04,6.0258
2017-01-05,5.9811
2017-01-06,5.9008
2017-01-09,5.7044
2017-01-10,5.6508
2017-01-11,5.6062
2017-01-12,5.633
2017-01-13,5.5883
2017-01-17,5.633
2017-01-18,5.624
2017-01-19,5.5348
2017-01-20,5.5437
2017-01-23,5.5705
2017-01-24,5.5258
2017-01-25,5.5348
2017-01-26,5.4544
2017-01-27,5.3652
2017-01-30,5.3116
2017-01-31,5.3652
2017-02-01,5.3384
2017-02-02,5.4901
2017-02-03,5.5437
2017-02-06,5.4544
2017-02-07,5.3652
2017-02-08,5.5092
2017-02-09,5.5902
2017-02-10,5.6712
2017-02-13,5.6622
2017-02-14,5.5992
2017-02-15,5.4372
2017-02-16,5.4372
2017-02-17,5.4552
2017-02-21,5.4732
2017-02-22,5.4102
2017-02-23,5.3832
2017-02-24,5.1851
2017-02-27,5.2571
2017-02-28,5.2841
2017-03-01,5.2751
2017-03-02,4.9871
2017-03-03,4.9241
2017-03-06,4.825
2017-03-07,4.744
2017-03-08,4.663
2017-03-09,4.573
2017-03-10,4.51
2017-03-13,4.537
2017-03-14,4.546
2017-03-15,4.681
2017-03-16,4.744
2017-03-17,4.753
2017-03-20,4.717
2017-03-21,4.609
2017-03-22,4.501
2017-03-23,4.528
2017-03-24,4.528
2017-03-27,4.4019
2017-03-28,4.546
2017-03-29,4.564
2017-03-30,4.537
2017-03-31,4.519
2017-04-03,4.483
2017-04-04,4.573
2017-04-05,4.537
2017-04-06,4.636
2017-04-07,4.636
2017-04-10,4.672
2017-04-11,4.78
2017-04-12,4.78
2017-04-13,4.78
2017-04-17,4.816
2017-04-18,4.798
2017-04-19,4.726
2017-04-20,4.735
2017-04-21,4.807
2017-04-24,4.744
2017-04-25,4.798
2017-04-26,4.825
2017-04-27,4.852
2017-04-28,4.843
2017-05-01,4.879
2017-05-02,4.87
2017-05-03,4.771
2017-05-04,4.654
2017-05-05,4.771
2017-05-08,4.672
2017-05-09,4.717
2017-05-10,4.817
2017-05-11,4.8715
2017-05-12,4.7079
2017-05-15,4.5716
2017-05-16,4.6261
2017-05-17,4.4716
2017-05-18,4.4625
2017-05-19,4.5443
2017-05-22,4.5625
2017-05-23,4.5989
2017-05-24,4.6352
2017-05-25,4.6352
2017-05-26,4.5534
2017-05-30,4.4989
2017-05-31,4.5352
2017-06-01,4.6534
2017-06-02,4.7897
2017-06-05,4.6534
2017-06-06,4.6807
2017-06-07,4.7897
2017-06-08,4.6988
2017-06-09,4.7806
2017-06-12,4.8897
2017-06-13,4.8079
2017-06-14,4.7715
2017-06-15,4.7715
2017-06-16,4.6807
2017-06-19,4.4989
2017-06-20,4.4444
2017-06-21,4.3171
2017-06-22,4.2989
2017-06-23,4.3626
2017-06-26,4.4353
2017-06-27,4.408
2017-06-28,4.4534
2017-06-29,4.5625
2017-06-30,4.408
2017-07-03,4.6261
2017-07-05,4.4625
2017-07-06,4.4625
2017-07-07,4.4989
2017-07-10,4.5171
2017-07-11,4.508
2017-07-12,4.5898
2017-07-13,4.6716
2017-07-14,4.7261
2017-07-17,4.6625
2017-07-18,4.6716
2017-07-19,4.6716
2017-07-20,4.6352
2017-07-21,4.6716
2017-07-24,4.6352
2017-07-25,4.7261
2017-07-26,4.7897
2017-07-27,4.8533
2017-07-28,4.8079
2017-07-31,4.7079
2017-08-01,4.7079
2017-08-02,4.6534
2017-08-03,4.6352
2017-08-04,4.7988
2017-08-07,4.8261
2017-08-08,4.8352
2017-08-09,4.8627
2017-08-10,4.7801
2017-08-11,4.6333
2017-08-14,4.7342
2017-08-15,4.7067
2017-08-16,4.6425
2017-08-17,4.5232
2017-08-18,4.4773
2017-08-21,4.5507
2017-08-22,4.4957
2017-08-23,4.4957
2017-08-24,4.6608
2017-08-25,4.7526
2017-08-28,4.6425
2017-08-29,4.6058
2017-08-30,4.6058
2017-08-31,4.6241
2017-09-01,4.6425
2017-09-05,4.615
2017-09-06,4.6425
2017-09-07,4.67
2017-09-08,4.6975
2017-09-11,4.7893
2017-09-12,4.7709
2017-09-13,4.8168
2017-09-14,4.9086
2017-09-15,4.7801
2017-09-18,4.7801
2017-09-19,4.7067
2017-09-20,4.7251
2017-09-21,4.7434
2017-09-22,4.7709
2017-09-25,4.8994
2017-09-26,5.0278
2017-09-27,5.037
2017-09-28,5.0003
2017-09-29,5.1563
2017-10-02,5.2113
2017-10-03,5.2297
2017-10-04,5.2205
2017-10-05,5.2756
2017-10-06,5.2205
2017-10-09,5.1379
2017-10-10,5.2297
2017-10-11,5.2756
2017-10-12,5.2756
2017-10-13,5.3123
2017-10-16,5.2664
2017-10-17,5.193
2017-10-18,5.2113
2017-10-19,5.1655
2017-10-20,5.0462
2017-10-23,5.1288
2017-10-24,5.1012
2017-10-25,5.0921
2017-10-26,5.1196
2017-10-27,5.0278
2017-10-30,5.0003
2017-10-31,4.9911
2017-11-01,5.1563
2017-11-02,5.3031
2017-11-03,5.2756
2017-11-06,5.3765
2017-11-07,5.3857
2017-11-08,5.349
2017-11-09,5.4137
2017-11-10,5.4878
2017-11-13,5.497
2017-11-14,5.4693
2017-11-15,5.4878
2017-11-16,5.5711
2017-11-17,5.5525
2017-11-20,5.5525
2017-11-21,5.5248
2017-11-22,5.5248
2017-11-24,5.6081
2017-11-27,5.5525
2017-11-28,5.5525
2017-11-29,5.6081
2017-11-30,5.5248
2017-12-01,5.6081
2017-12-04,5.6821
2017-12-05,5.6914
2017-12-06,5.6636
2017-12-07,5.5988
2017-12-08,5.6266
2017-12-11,5.6636
2017-12-12,5.6543
2017-12-13,5.6266
2017-12-14,5.5988
2017-12-15,5.5896
2017-12-18,5.6821
2017-12-19,5.6451
2017-12-20,5.6173
2017-12-21,5.6173
2017-12-22,5.5988
2017-12-26,5.6081
2017-12-27,5.6266
2017-12-28,5.6543
2017-12-29,5.6266
2018-01-02,5.7006
2018-01-03,5.6081
2018-01-04,5.4878
2018-01-05,5.5155
2018-01-08,5.5248
2018-01-09,5.2934
2018-01-10,5.0898
2018-01-11,4.9788
2018-01-12,4.9233
2018-01-16,4.9603
2018-01-17,5.0898
2018-01-18,5.0065
2018-01-19,5.0251
2018-01-22,5.0621
2018-01-23,5.1176
2018-01-24,5.0991
2018-01-25,4.9047
2018-01-26,4.803
2018-01-29,4.7567
2018-01-30,4.6919
2018-01-31,4.7289
2018-02-01,4.6549
2018-02-02,4.4698
2018-02-05,4.3495
2018-02-06,4.368
2018-02-07,4.3125
2018-02-08,4.1737
2018-02-09,4.2205
2018-02-12,3.9959
2018-02-13,3.8648
2018-02-14,3.7806
2018-02-15,3.8181
2018-02-16,3.8648
2018-02-20,3.7713
2018-02-21,3.7619
2018-02-22,3.7993
2018-02-23,3.8368
2018-02-26,3.8836
2018-02-27,3.7338
2018-02-28,3.7151
2018-03-01,3.7806
2018-03-02,3.7338
2018-03-05,3.7338
2018-03-06,3.7432
2018-03-07,3.7526
2018-03-08,3.7619
2018-03-09,3.7619
2018-03-12,3.7058
2018-03-13,3.6122
2018-03-14,3.5654
2018-03-15,3.4344
2018-03-16,3.4344
2018-03-19,3.5747
2018-03-20,3.4437
2018-03-21,3.4531
2018-03-22,3.4999
2018-03-23,3.4063
2018-03-26,3.5373
2018-03-27,3.5186
2018-03-28,3.6215
2018-03-29,3.687
2018-04-02,3.6964
2018-04-03,3.7806
2018-04-04,3.8461
2018-04-05,3.8742
2018-04-06,3.7619
2018-04-09,3.8181
2018-04-10,3.7432
2018-04-11,3.7338
2018-04-12,3.5935
2018-04-13,3.5467
2018-04-16,3.6215
2018-04-17,3.687
2018-04-18,3.6122
2018-04-19,3.4718
2018-04-20,3.3408
2018-04-23,3.3782
2018-04-24,3.3689
2018-04-25,3.425
2018-04-26,3.6777
2018-04-27,3.6964
2018-04-30,3.6403
2018-05-01,3.6309
2018-05-02,3.5935
2018-05-03,3.5935
2018-05-04,3.7432
2018-05-07,3.7245
2018-05-08,3.7619
2018-05-09,3.8648
2018-05-10,3.8364
2018-05-11,3.7607
2018-05-14,3.6565
2018-05-15,3.647
2018-05-16,3.7701
2018-05-17,3.7228
2018-05-18,3.8649
2018-05-21,3.8838
2018-05-22,3.8743
2018-05-23,3.969
2018-05-24,3.969
2018-05-25,4.149
2018-05-29,4.2153
2018-05-30,4.2343
2018-05-31,4.1585
2018-06-01,4.1964
2018-06-04,4.2532
2018-06-05,4.3764
2018-06-06,4.329
2018-06-07,4.3574
2018-06-08,4.2911
2018-06-11,4.2532
2018-06-12,4.3385
2018-06-13,4.2153
2018-06-14,4.2059
2018-06-15,4.149
2018-06-18,4.168
2018-06-19,4.2532
2018-06-20,4.3669
2018-06-21,4.4522
2018-06-22,4.6511
2018-06-25,4.5753
2018-06-26,4.5374
2018-06-27,4.4806
2018-06-28,4.4711
2018-06-29,4.4711
2018-07-02,4.5753
2018-07-03,4.8026
2018-07-05,4.9353
2018-07-06,4.9921
2018-07-09,4.8974
2018-07-10,4.8121
2018-07-11,4.6227
2018-07-12,4.5658
2018-07-13,4.5469
2018-07-16,4.6037
2018-07-17,4.5374
2018-07-18,4.5279
2018-07-19,4.6321
2018-07-20,4.67
2018-07-23,4.689
2018-07-24,4.5942
2018-07-25,4.5564
2018-07-26,4.5848
2018-07-27,4.3101
2018-07-30,4.3764
2018-07-31,4.509
2018-08-01,4.4427
2018-08-02,4.3953
2018-08-03,4.3764
2018-08-06,4.4616
2018-08-07,4.348
2018-08-08,4.329
2018-08-09,4.3099
2018-08-10,4.262
2018-08-13,4.2428
2018-08-14,4.2907
2018-08-15,4.3003
2018-08-16,4.329
2018-08-17,4.3865
2018-08-20,4.4439
2018-08-21,4.4248
2018-08-22,4.3482
2018-08-23,4.329
2018-08-24,4.3386
2018-08-27,4.2237
2018-08-28,4.3194
2018-08-29,4.2811
2018-08-30,4.2524
2018-08-31,4.2811
2018-09-04,4.3673
2018-09-05,4.4056
2018-09-06,4.3577
2018-09-07,4.4344
2018-09-10,4.5014
2018-09-11,4.4918
2018-09-12,4.3194
2018-09-13,4.3961
2018-09-14,4.2524
2018-09-17,4.4344
2018-09-18,4.3577
2018-09-19,4.1566
2018-09-20,4.3194
2018-09-21,4.2811
2018-09-24,4.1949
2018-09-25,4.262
2018-09-26,4.2045
2018-09-27,4.3194
2018-09-28,4.4631
2018-10-01,4.262
2018-10-02,4.2141
2018-10-03,4.0992
2018-10-04,3.9172
2018-10-05,3.9938
2018-10-08,4.08
2018-10-09,4.1375
2018-10-10,4.0417
2018-10-11,3.898
2018-10-12,3.8023
2018-10-15,3.7735
2018-10-16,3.8884
2018-10-17,3.8501
2018-10-18,3.7927
2018-10-19,3.7735
2018-10-22,3.7065
2018-10-23,3.6394
2018-10-24,3.5149
2018-10-25,3.7639
2018-10-26,3.582
2018-10-29,3.7256
2018-10-30,3.7256
2018-10-31,3.6107
2018-11-01,3.6011
2018-11-02,3.4958
2018-11-05,3.7448
2018-11-06,3.7639
2018-11-07,3.7639
2018-11-08,3.8124
2018-11-09,3.696
2018-11-12,3.793
2018-11-13,3.6475
2018-11-14,3.5893
2018-11-15,3.5408
2018-11-16,3.3953
2018-11-19,3.3856
2018-11-20,3.3856
2018-11-21,3.4438
2018-11-23,3.4147
2018-11-26,3.308
2018-11-27,3.2886
2018-11-28,3.4438
2018-11-29,3.4923
2018-11-30,3.4826
2018-12-03,3.5311
2018-12-04,3.3371
2018-12-06,3.5117
2018-12-07,3.4244
2018-12-10,3.4244
2018-12-11,3.3565
2018-12-12,3.3371
2018-12-13,3.3468
2018-12-14,3.3274
2018-12-17,2.92
2018-12-18,2.9782
2018-12-19,2.8036
2018-12-20,2.6968
2018-12-21,2.7551
2018-12-24,2.8327
2018-12-26,2.9879
2018-12-27,2.9491
2018-12-28,3.0655
2018-12-31,3.0461
2019-01-02,3.0073
2019-01-03,3.0073
2019-01-04,3.1237
2019-01-07,3.1237
2019-01-08,3.2886
2019-01-09,3.1237
2019-01-10,3.1237
2019-01-11,3.1334
2019-01-14,3.2304
2019-01-15,3.2886
2019-01-16,3.3565
2019-01-17,3.3371
2019-01-18,3.211
2019-01-22,3.2013
2019-01-23,3.3274
2019-01-24,3.3371
2019-01-25,3.2983
2019-01-28,3.3468
2019-01-29,3.3759
2019-01-30,3.3468
2019-01-31,3.3856
2019-02-01,3.3953
2019-02-04,3.4438
2019-02-05,3.3953
2019-02-06,3.4244
2019-02-07,3.4146
2019-02-08,3.572
2019-02-11,3.5917
2019-02-12,3.513
2019-02-13,3.4047
2019-02-14,3.4343
2019-02-15,3.4933
2019-02-19,3.5425
2019-02-20,3.5917
2019-02-21,3.5327
2019-02-22,3.5523
2019-02-25,3.5228
2019-02-26,3.4539
2019-02-27,3.3555
2019-02-28,3.4244
2019-03-01,3.3162
2019-03-04,3.3063
2019-03-05,3.1784
2019-03-06,3.1784
2019-03-07,3.1981
2019-03-08,3.1981
2019-03-11,3.2374
2019-03-12,3.2473
2019-03-13,3.2965
2019-03-14,3.2866
2019-03-15,3.2965
2019-03-18,3.3063
2019-03-19,3.3555
2019-03-20,3.3358
2019-03-21,3.4047
2019-03-22,3.2965
2019-03-25,3.3457
2019-03-26,3.3358
2019-03-27,3.3555
2019-03-28,3.4244
2019-03-29,3.3457
2019-04-01,3.2768
2019-04-02,3.2866
2019-04-03,3.3358
2019-04-04,3.2965
2019-04-05,3.3555
2019-04-08,3.3063
2019-04-09,3.2571
2019-04-10,3.2768
2019-04-11,3.2571
2019-04-12,3.1981
2019-04-15,3.1587
2019-04-16,3.1292
2019-04-17,3.1587
2019-04-18,3.0702
2019-04-22,3.0702
2019-04-23,3.1489
2019-04-24,3.1686
2019-04-25,3.1194
2019-04-26,3.1784
2019-04-29,3.1587
2019-04-30,3.021
2019-05-01,3.1194
2019-05-02,3.0997
2019-05-03,3.1981
2019-05-06,3.1882
2019-05-07,3.1292
2019-05-08,3.08
2019-05-09,3.1
2019-05-10,3.12
2019-05-13,3.08
2019-05-14,3.12
2019-05-15,3.06
2019-05-16,3.05
2019-05-17,3.05
2019-05-20,3.02
2019-05-21,3.06
2019-05-22,3.02
2019-05-23,2.92
2019-05-24,2.96
2019-05-28,2.97
2019-05-29,2.85
2019-05-30,2.8
2019-05-31,2.83
2019-06-03,2.85
2019-06-04,2.88
2019-06-05,2.82
2019-06-06,2.81
2019-06-07,2.76
2019-06-10,2.73
2019-06-11,2.84
2019-06-12,2.84
2019-06-13,2.845
2019-06-14,2.86
2019-06-17,2.84
2019-06-18,2.82
2019-06-19,2.93
2019-06-20,2.9
2019-06-21,2.71
2019-06-24,2.645
2019-06-25,2.625
2019-06-26,2.605
2019-06-27,2.595
2019-06-28,2.615
2019-07-01,2.58
2019-07-02,2.565
2019-07-03,2.58
2019-07-04,2.58
2019-07-05,2.58
2019-07-08,2.65
2019-07-09,2.635
2019-07-10,2.645
2019-07-11,2.565
2019-07-12,2.55
2019-07-15,2.5
2019-07-16,2.515
2019-07-17,2.52
2019-07-18,2.485
2019-07-19,2.405
2019-07-22,2.355
2019-07-23,2.465
2019-07-24,2.49
2019-07-25,2.455
2019-07-26,2.5
2019-07-29,2.525
2019-07-30,2.59
2019-07-31,2.765
2019-08-01,2.605
2019-08-02,2.625
2019-08-05,2.495
2019-08-06,2.525
2019-08-07,2.51
2019-08-08,2.455
2019-08-09,2.465
2019-08-12,2.455
2019-08-13,2.465
2019-08-14,2.425
2019-08-15,2.345
2019-08-16,2.345
2019-08-19,2.38
2019-08-20,2.325
2019-08-21,2.33
2019-08-22,2.325
2019-08-23,2.3
2019-08-26,2.275
2019-08-27,2.225
2019-08-28,2.225
2019-08-29,2.33
2019-08-30,2.375
2019-09-02,2.37
2019-09-03,2.35
2019-09-04,2.38
2019-09-05,2.425
2019-09-06,2.425
2019-09-09,2.565
2019-09-10,2.735
2019-09-11,2.785
2019-09-12,2.865
2019-09-13,2.855
2019-09-16,2.845
2019-09-17,2.815
2019-09-18,2.765
2019-09-19,2.725
2019-09-20,2.805
2019-09-23,2.805
2019-09-24,2.96
2019-09-25,2.94
2019-09-26,3.14
2019-09-27,3.135
2019-09-30,3.015
2019-10-01,2.875
2019-10-02,2.85
2019-10-03,2.86
2019-10-04,2.815
2019-10-07,2.895
2019-10-08,2.905
2019-10-09,2.895
2019-10-10,2.895
2019-10-11,2.945
2019-10-14,3.365
2019-10-15,3.385
2019-10-16,3.455
2019-10-17,3.415
2019-10-18,3.44
2019-10-21,3.49
2019-10-22,3.63
2019-10-23,3.58
2019-10-24,3.325
2019-10-25,3.295
2019-10-28,3.345
2019-10-29,3.345
2019-10-30,3.345
2019-10-31,3.33
2019-11-01,3.355
2019-11-04,3.295
2019-11-05,3.325
2019-11-06,3.195
2019-11-07,3.08
2019-11-08,2.775
2019-11-11,2.875
2019-11-12,2.805
2019-11-13,2.755
2019-11-14,2.775
2019-11-15,2.825
2019-11-18,2.785
2019-11-19,2.76
2019-11-20,2.755
2019-11-21,2.67
2019-11-22,2.605
2019-11-25,2.635
