date,close
2014-06-13,22.15
2014-06-16,22.6446
2014-06-17,22.4227
2014-06-18,22.3118
2014-06-19,22.321
2014-06-20,21.9188
2014-06-23,22.1222
2014-06-24,21.9142
2014-06-25,21.646
2014-06-26,21.9373
2014-06-27,22.1083
2014-06-30,22.1638
2014-07-01,22.6585
2014-07-02,22.5984
2014-07-03,22.5383
2014-07-07,22.1638
2014-07-08,22.1546
2014-07-09,22.3395
2014-07-10,22.2332
2014-07-11,21.8448
2014-07-14,21.8679
2014-07-15,21.7246
2014-07-16,21.8864
2014-07-17,21.8494
2014-07-18,22.0621
2014-07-21,22.0621
2014-07-22,22.1407
2014-07-23,22.039
2014-07-24,22.0251
2014-07-25,21.9049
2014-07-28,22.0297
2014-07-29,21.9604
2014-07-30,22.395
2014-07-31,25.7283
2014-08-01,25.414
2014-08-04,25.2845
2014-08-05,25.1227
2014-08-06,25.4232
2014-08-07,25.2799
2014-08-08,25.1504
2014-08-11,25.6128
2014-08-12,25.5896
2014-08-13,25.8902
2014-08-14,26.0473
2014-08-15,25.4694
2014-08-18,25.8208
2014-08-19,25.6081
2014-08-20,25.622
2014-08-21,25.7561
2014-08-22,26.1999
2014-08-25,25.8855
2014-08-26,25.9456
2014-08-27,26.29
2014-08-28,26.2019
2014-08-29,26.0766
2014-09-02,26.174
2014-09-03,26.7862
2014-09-04,26.5729
2014-09-05,26.5682
2014-09-08,26.4662
2014-09-09,26.4198
2014-09-10,26.4847
2014-09-11,26.5172
2014-09-12,26.7769
2014-09-15,26.712
2014-09-16,27.0041
2014-09-17,26.661
2014-09-18,26.763
2014-09-19,26.1184
2014-09-22,26.1416
2014-09-23,25.8819
2014-09-24,25.8448
2014-09-25,25.4181
2014-09-26,25.5294
2014-09-29,25.5712
2014-09-30,25.701
2014-10-01,25.4784
2014-10-02,25.4599
2014-10-03,25.65
2014-10-06,25.9746
2014-10-07,25.8123
2014-10-08,26.3085
2014-10-09,26.1137
2014-10-10,25.112
2014-10-13,24.588
2014-10-14,24.6576
2014-10-15,24.6715
2014-10-16,24.5092
2014-10-17,25.0889
2014-10-20,25.4274
2014-10-21,25.6825
2014-10-22,25.1491
2014-10-23,23.7254
2014-10-24,24.6854
2014-10-27,24.6576
2014-10-28,25.1677
2014-10-29,25.0239
2014-10-30,25.1723
2014-10-31,25.5619
2014-11-03,25.8262
2014-11-04,26.1508
2014-11-05,26.5265
2014-11-06,26.7305
2014-11-07,26.8928
2014-11-10,27.2407
2014-11-11,27.2778
2014-11-12,26.9949
2014-11-13,27.0366
2014-11-14,27.403
2014-11-17,27.6117
2014-11-18,27.7554
2014-11-19,27.0822
2014-11-20,26.8822
2014-11-21,26.7566
2014-11-24,26.5939
2014-11-25,26.9101
2014-11-26,27.3147
2014-11-28,27.4961
2014-12-01,27.4822
2014-12-02,26.859
2014-12-03,27.5473
2014-12-04,27.1055
2014-12-05,27.6682
2014-12-08,27.3938
2014-12-09,27.5194
2014-12-10,26.3334
2014-12-11,26.5334
2014-12-12,26.1148
2014-12-15,26.3334
2014-12-16,26.0637
2014-12-17,26.3334
2014-12-18,26.538
2014-12-19,26.938
2014-12-22,26.9938
2014-12-23,27.5194
2014-12-24,27.352
2014-12-26,27.4124
2014-12-29,27.1892
2014-12-30,27.4031
2014-12-31,27.0962
2015-01-02,27.031
2015-01-05,26.5846
2015-01-06,25.7381
2015-01-07,26.1381
2015-01-08,26.5101
2015-01-09,26.4776
2015-01-12,26.0637
2015-01-13,26.6357
2015-01-14,26.352
2015-01-15,26.6357
2015-01-16,27.1427
2015-01-20,27.2636
2015-01-21,27.1008
2015-01-22,27.1566
2015-01-23,27.2543
2015-01-26,27.338
2015-01-27,27.7147
2015-01-28,25.1939
2015-01-29,25.9753
2015-01-30,26.3567
2015-02-02,25.9706
2015-02-03,26.4636
2015-02-04,26.2962
2015-02-05,27.4171
2015-02-06,26.9148
2015-02-09,27.2217
2015-02-10,27.4403
2015-02-11,27.7426
2015-02-12,27.9984
2015-02-13,28.4589
2015-02-17,28.1891
2015-02-18,27.724
2015-02-19,27.7473
2015-02-20,27.7891
2015-02-23,27.6403
2015-02-24,27.161
2015-02-25,27.3943
2015-02-26,27.6042
2015-02-27,27.1564
2015-03-02,27.2963
2015-03-03,27.1051
2015-03-04,27.0071
2015-03-05,26.8579
2015-03-06,26.4707
2015-03-09,26.8159
2015-03-10,25.4212
2015-03-11,25.0387
2015-03-12,25.813
2015-03-13,25.4958
2015-03-16,25.7197
2015-03-17,25.9576
2015-03-18,26.2935
2015-03-19,26.0509
2015-03-20,26.3914
2015-03-23,26.3401
2015-03-24,26.0882
2015-03-25,25.2813
2015-03-26,25.0947
2015-03-27,24.7682
2015-03-30,24.7122
2015-03-31,24.6702
2015-04-01,25.16
2015-04-02,24.9828
2015-04-06,25.062
2015-04-07,25.8224
2015-04-08,25.8224
2015-04-09,25.897
2015-04-10,26.1209
2015-04-13,26.3354
2015-04-14,26.3681
2015-04-15,27.1051
2015-04-16,27.2124
2015-04-17,26.6899
2015-04-20,26.5034
2015-04-21,26.8252
2015-04-22,26.6993
2015-04-23,26.7786
2015-04-24,26.0416
2015-04-27,26.1209
2015-04-28,25.8363
2015-04-29,24.2224
2015-04-30,23.5927
2015-05-01,23.5181
2015-05-04,23.6067
2015-05-05,23.3315
2015-05-06,23.2149
2015-05-07,22.9864
2015-05-08,22.9677
2015-05-11,22.6599
2015-05-12,22.5106
2015-05-13,22.4173
2015-05-14,22.4593
2015-05-15,22.7671
2015-05-18,22.5712
2015-05-19,22.4779
2015-05-20,22.8558
2015-05-21,19.8006
2015-05-22,20.0758
2015-05-26,19.9405
2015-05-27,19.8842
2015-05-28,19.9311
2015-05-29,19.8889
2015-06-01,19.7765
2015-06-02,19.8374
2015-06-03,19.8796
2015-06-04,19.739
2015-06-05,19.8655
2015-06-08,19.9171
2015-06-09,19.8889
2015-06-10,19.9827
2015-06-11,20.0061
2015-06-12,20.0014
2015-06-15,20.0295
2015-06-16,20.0295
2015-06-17,19.9639
2015-06-18,19.978
2015-06-19,19.6968
2015-06-22,19.6218
2015-06-23,19.5937
2015-06-24,19.4578
2015-06-25,19.2797
2015-06-26,19.1157
2015-06-29,18.8017
2015-06-30,18.9938
2015-07-01,19.0266
2015-07-02,19.0313
2015-07-06,18.5439
2015-07-07,18.6236
2015-07-08,18.3424
2015-07-09,18.3471
2015-07-10,18.3424
2015-07-13,18.3612
2015-07-14,18.3588
2015-07-15,18.1128
2015-07-16,18.2487
2015-07-17,18.0847
2015-07-20,17.9956
2015-07-21,17.8176
2015-07-22,17.8457
2015-07-23,17.8176
2015-07-24,17.527
2015-07-27,17.2927
2015-07-28,17.4192
2015-07-29,17.6348
2015-07-30,21.4307
2015-07-31,21.3276
2015-08-03,21.3979
2015-08-04,21.5667
2015-08-05,21.4682
2015-08-06,21.4214
2015-08-07,21.5338
2015-08-10,21.7166
2015-08-11,21.4448
2015-08-12,21.4261
2015-08-13,21.5151
2015-08-14,21.4964
2015-08-17,21.4917
2015-08-18,21.5385
2015-08-19,21.3605
2015-08-20,20.934
2015-08-21,20.5591
2015-08-24,19.8936
2015-08-25,20.1935
2015-08-26,20.9516
2015-08-27,21.3047
2015-08-28,21.2246
2015-08-31,21.3376
2015-09-01,21.2953
2015-09-02,21.3
2015-09-03,21.4365
2015-09-04,21.3141
2015-09-08,21.5307
2015-09-09,21.1587
2015-09-10,21.2105
2015-09-11,21.2576
2015-09-14,21.2293
2015-09-15,21.8085
2015-09-16,22.0439
2015-09-17,21.9685
2015-09-18,21.7614
2015-09-21,21.865
2015-09-22,21.3047
2015-09-23,21.2435
2015-09-24,21.0975
2015-09-25,21.0504
2015-09-28,20.735
2015-09-29,20.7774
2015-09-30,21.0693
2015-10-01,21.3753
2015-10-02,21.1917
2015-10-05,21.5872
2015-10-06,21.5213
2015-10-07,21.7049
2015-10-08,21.8367
2015-10-09,22.1004
2015-10-12,22.1427
2015-10-13,22.1286
2015-10-14,22.1004
2015-10-15,22.2463
2015-10-16,22.3217
2015-10-19,22.3781
2015-10-20,22.2087
2015-10-21,21.832
2015-10-22,22.1804
2015-10-23,22.2039
2015-10-26,21.832
2015-10-27,21.2388
2015-10-28,21.4083
2015-10-29,21.3518
2015-10-30,21.8461
2015-11-02,22.058
2015-11-03,22.364
2015-11-04,22.2322
2015-11-05,22.2557
2015-11-06,21.8932
2015-11-09,21.2811
2015-11-10,21.2858
2015-11-11,21.1069
2015-11-12,21.2529
2015-11-13,21.154
2015-11-16,21.573
2015-11-17,21.6531
2015-11-18,22.2275
2015-11-19,22.4817
2015-11-20,22.4817
2015-11-23,22.4394
2015-11-24,22.4158
2015-11-25,22.7515
2015-11-27,22.813
2015-11-30,22.9075
2015-12-01,23.2716
2015-12-02,23.1534
2015-12-03,22.9265
2015-12-04,23.1581
2015-12-07,22.7562
2015-12-08,22.6144
2015-12-09,22.3922
2015-12-10,22.5718
2015-12-11,22.3402
2015-12-14,22.0281
2015-12-15,22.4489
2015-12-16,22.6191
2015-12-17,22.5482
2015-12-18,22.5388
2015-12-21,22.6002
2015-12-22,23.0116
2015-12-23,23.1723
2015-12-24,23.1581
2015-12-28,22.8792
2015-12-29,23.352
2015-12-30,23.0163
2015-12-31,22.6617
2016-01-04,22.5293
2016-01-05,22.3023
2016-01-06,22.1038
2016-01-07,21.4276
2016-01-08,21.4607
2016-01-11,21.3449
2016-01-12,21.5742
2016-01-13,21.2811
2016-01-14,21.735
2016-01-15,21.6168
2016-01-19,21.5884
2016-01-20,21.1912
2016-01-21,21.5931
2016-01-22,21.995
2016-01-25,22.0896
2016-01-26,22.6239
2016-01-27,23.0116
2016-01-28,22.9454
2016-01-29,23.1014
2016-02-01,23.1534
2016-02-02,22.5482
2016-02-03,22.4867
2016-02-04,22.3118
2016-02-05,21.3851
2016-02-08,20.7421
2016-02-09,20.2598
2016-02-10,22.2267
2016-02-11,22.1038
2016-02-12,22.6286
2016-02-16,22.865
2016-02-17,23.8957
2016-02-18,23.3236
2016-02-19,23.3614
2016-02-22,23.7113
2016-02-23,23.1345
2016-02-24,23.1156
2016-02-25,23.3425
2016-02-26,23.3803
2016-02-29,23.5175
2016-03-01,23.8721
2016-03-02,23.9004
2016-03-03,23.6593
2016-03-04,23.3425
2016-03-07,23.3378
2016-03-08,23.3046
2016-03-09,23.2571
2016-03-10,23.0957
2016-03-11,23.5134
2016-03-14,23.2571
2016-03-15,22.8393
2016-03-16,23.6844
2016-03-17,23.841
2016-03-18,23.4138
2016-03-21,23.4897
2016-03-22,23.6559
2016-03-23,23.5467
2016-03-24,23.6084
2016-03-28,23.6654
2016-03-29,24.292
2016-03-30,24.8
2016-03-31,24.5911
2016-04-01,24.5579
2016-04-04,24.9376
2016-04-05,25.1655
2016-04-06,25.6782
2016-04-07,24.9234
2016-04-08,25.0421
2016-04-11,25.4171
2016-04-12,25.2842
2016-04-13,25.5928
2016-04-14,25.7637
2016-04-15,25.645
2016-04-18,25.9203
2016-04-19,26.3096
2016-04-20,26.3761
2016-04-21,26.2811
2016-04-22,26.3808
2016-04-25,25.9583
2016-04-26,25.8349
2016-04-27,25.7067
2016-04-28,26.5802
2016-04-29,26.547
2016-05-02,26.452
2016-05-03,25.626
2016-05-04,25.6497
2016-05-05,25.8824
2016-05-06,25.8776
2016-05-09,25.7779
2016-05-10,26.2669
2016-05-11,26.3144
2016-05-12,26.5232
2016-05-13,26.433
2016-05-16,26.6704
2016-05-17,26.3856
2016-05-18,26.433
2016-05-19,26.4093
2016-05-20,26.7749
2016-05-23,26.5422
2016-05-24,26.7416
2016-05-25,27.5901
2016-05-26,27.7855
2016-05-27,27.7665
2016-05-31,27.9715
2016-06-01,28.3004
2016-06-02,28.4148
2016-06-03,28.6674
2016-06-06,28.8009
2016-06-07,28.777
2016-06-08,29.063
2016-06-09,29.0535
2016-06-10,28.5768
2016-06-13,28.4672
2016-06-14,28.2336
2016-06-15,28.0906
2016-06-16,27.9238
2016-06-17,27.8809
2016-06-20,28.7437
2016-06-21,29.2013
2016-06-22,29.1536
2016-06-23,29.3967
2016-06-24,27.9381
2016-06-27,27.3327
2016-06-28,27.6282
2016-06-29,27.9333
2016-06-30,28.2003
2016-07-01,28.1049
2016-07-05,27.7855
2016-07-06,27.9238
2016-07-07,27.7855
2016-07-08,28.0906
2016-07-11,28.0001
2016-07-12,28.4148
2016-07-13,28.6007
2016-07-14,28.8247
2016-07-15,28.634
2016-07-18,28.615
2016-07-19,29.3204
2016-07-20,29.7399
2016-07-21,29.3157
2016-07-22,29.2251
2016-07-25,29.7113
2016-07-26,29.7352
2016-07-27,29.9354
2016-07-28,28.3576
2016-07-29,29.044
2016-08-01,29.2775
2016-08-02,28.8295
2016-08-03,29.3014
2016-08-04,29.4778
2016-08-05,29.5969
2016-08-08,29.8257
2016-08-09,30.1499
2016-08-10,29.8114
2016-08-11,30.2023
2016-08-12,30.1165
2016-08-15,29.9354
2016-08-16,29.8925
2016-08-17,29.6875
2016-08-18,29.8877
2016-08-19,29.8972
2016-08-22,29.7304
2016-08-23,29.9687
2016-08-24,29.6721
2016-08-25,29.873
2016-08-26,30.0453
2016-08-29,29.94
2016-08-30,29.8539
2016-08-31,30.0548
2016-09-01,30.2032
2016-09-02,30.5285
2016-09-06,30.4615
2016-09-07,30.4567
2016-09-08,30.3467
2016-09-09,28.5956
2016-09-12,31.1696
2016-09-13,30.9112
2016-09-14,31.2413
2016-09-15,31.2605
2016-09-16,30.9878
2016-09-19,31.0978
2016-09-20,31.294
2016-09-21,31.6624
2016-09-22,31.8346
2016-09-23,31.4423
2016-09-26,31.2222
2016-09-27,31.2653
2016-09-28,31.0978
2016-09-29,31.0404
2016-09-30,31.0308
2016-10-03,30.9256
2016-10-04,31.0356
2016-10-05,31.0835
2016-10-06,31.16
2016-10-07,30.9112
2016-10-10,30.8347
2016-10-11,30.5237
2016-10-12,30.5285
2016-10-13,30.5189
2016-10-14,30.6911
2016-10-17,30.6911
2016-10-18,30.806
2016-10-19,30.8347
2016-10-20,30.8108
2016-10-21,30.782
2016-10-24,30.8634
2016-10-25,30.3897
2016-10-26,29.7534
2016-10-27,29.5764
2016-10-28,29.5333
2016-10-31,29.7008
2016-11-01,29.342
2016-11-02,28.9162
2016-11-03,29.0454
2016-11-04,29.0549
2016-11-07,29.409
2016-11-08,30.0835
2016-11-09,29.7199
2016-11-10,29.4903
2016-11-11,29.0788
2016-11-14,28.2464
2016-11-15,28.7248
2016-11-16,29.208
2016-11-17,29.4759
2016-11-18,29.4137
2016-11-21,29.2559
2016-11-22,29.5955
2016-11-23,30.1027
2016-11-25,29.8204
2016-11-28,29.9831
2016-11-29,30.3371
2016-11-30,30.5196
2016-12-01,29.9242
2016-12-02,29.929
2016-12-05,29.7369
2016-12-06,29.4536
2016-12-07,29.6313
2016-12-08,29.4968
2016-12-09,29.3576
2016-12-12,29.42
2016-12-13,29.7945
2016-12-14,29.2951
2016-12-15,29.1511
2016-12-16,29.0502
2016-12-19,29.42
2016-12-20,29.7033
2016-12-21,29.7849
2016-12-22,29.4584
2016-12-23,29.5112
2016-12-27,29.5352
2016-12-28,29.54
2016-12-29,29.7945
2016-12-30,29.6793
2017-01-03,29.54
2017-01-04,30.0298
2017-01-05,30.1738
2017-01-06,30.0538
2017-01-09,29.8761
2017-01-10,30.2987
2017-01-11,30.6444
2017-01-12,30.8077
2017-01-13,30.8221
2017-01-17,30.8893
2017-01-18,30.4043
2017-01-19,30.0298
2017-01-20,30.4427
2017-01-23,30.5436
2017-01-24,31.7056
2017-01-25,32.9108
2017-01-26,33.4006
2017-01-27,33.4102
2017-01-30,32.7187
2017-01-31,32.9108
2017-02-01,32.4114
2017-02-02,31.9793
2017-02-03,32.0945
2017-02-06,31.9793
2017-02-07,31.72
2017-02-08,31.6528
2017-02-09,31.816
2017-02-10,32.2194
2017-02-13,32.3346
2017-02-14,32.4402
2017-02-15,32.6707
2017-02-16,32.6131
2017-02-17,32.2098
2017-02-21,32.3154
2017-02-22,32.4883
2017-02-23,32.421
2017-02-24,32.1521
2017-02-27,32.1713
2017-02-28,31.672
2017-03-01,31.9659
2017-03-02,32.0141
2017-03-03,31.9948
2017-03-06,32.1394
2017-03-07,32.043
2017-03-08,31.9177
2017-03-09,32.1105
2017-03-10,32.3899
2017-03-13,32.8236
2017-03-14,32.708
2017-03-15,33.344
2017-03-16,33.3054
2017-03-17,33.2187
2017-03-20,32.8429
2017-03-21,32.3996
2017-03-22,32.5538
2017-03-23,32.6694
2017-03-24,32.7658
2017-03-27,32.6983
2017-03-28,32.7658
2017-03-29,32.7658
2017-03-30,32.8236
2017-03-31,32.7754
2017-04-03,32.8525
2017-04-04,32.6598
2017-04-05,32.0044
2017-04-06,32.0815
2017-04-07,31.8021
2017-04-10,32.1779
2017-04-11,32.1586
2017-04-12,32.3321
2017-04-13,32.1008
2017-04-17,32.5345
2017-04-18,32.5056
2017-04-19,32.5827
2017-04-20,32.8332
2017-04-21,32.7272
2017-04-24,33.1416
2017-04-25,33.6235
2017-04-26,33.2573
2017-04-27,33.3247
2017-04-28,33.4211
2017-05-01,33.5078
2017-05-02,33.4789
2017-05-03,33.3054
2017-05-04,33.2476
2017-05-05,33.556
2017-05-08,33.5656
2017-05-09,31.6672
2017-05-10,31.6672
2017-05-11,31.5226
2017-05-12,30.9926
2017-05-15,31.301
2017-05-16,31.3299
2017-05-17,30.5782
2017-05-18,30.6167
2017-05-19,31.0793
2017-05-22,31.3491
2017-05-23,31.166
2017-05-24,31.3712
2017-05-25,31.4583
2017-05-26,31.497
2017-05-30,31.226
2017-05-31,31.5744
2017-06-01,31.7002
2017-06-02,31.6905
2017-06-05,31.7292
2017-06-06,31.6421
2017-06-07,31.4292
2017-06-08,31.8163
2017-06-09,31.6325
2017-06-12,31.3712
2017-06-13,31.4873
2017-06-14,31.0422
2017-06-15,30.4713
2017-06-16,30.3552
2017-06-19,31.3518
2017-06-20,31.1777
2017-06-21,31.1002
2017-06-22,31.3518
2017-06-23,31.0228
2017-06-26,30.6745
2017-06-27,30.3068
2017-06-28,30.4035
2017-06-29,30.0939
2017-06-30,30.5197
2017-07-03,30.0745
2017-07-05,30.1423
2017-07-06,30.0165
2017-07-07,30.3648
2017-07-10,30.4422
2017-07-11,30.5487
2017-07-12,31.1583
2017-07-13,31.9131
2017-07-14,31.9034
2017-07-17,31.7582
2017-07-18,31.7582
2017-07-19,31.9131
2017-07-20,32.0098
2017-07-21,31.9905
2017-07-24,32.0872
2017-07-25,32.2614
2017-07-26,33.3065
2017-07-27,32.7936
2017-07-28,32.6291
2017-07-31,32.4162
2017-08-01,32.7065
2017-08-02,32.3775
2017-08-03,32.3001
2017-08-04,33.3742
2017-08-07,32.6291
2017-08-08,31.7582
2017-08-09,31.2841
2017-08-10,30.7422
2017-08-11,30.8777
2017-08-14,30.9357
2017-08-15,31.0325
2017-08-16,31.4292
2017-08-17,31.1099
2017-08-18,30.9164
2017-08-21,31.0519
2017-08-22,31.3422
2017-08-23,31.0519
2017-08-24,30.8487
2017-08-25,30.9164
2017-08-28,30.8293
2017-08-29,30.6164
2017-08-30,30.7058
2017-08-31,31.3277
2017-09-01,31.4443
2017-09-05,30.939
2017-09-06,31.1042
2017-09-07,31.2111
2017-09-08,31.1625
2017-09-11,31.4152
2017-09-12,31.3666
2017-09-13,31.3569
2017-09-14,31.3569
2017-09-15,31.3277
2017-09-18,31.2305
2017-09-19,31.0751
2017-09-20,30.7641
2017-09-21,30.8904
2017-09-22,31.1625
2017-09-25,30.8516
2017-09-26,30.5406
2017-09-27,30.735
2017-09-28,30.9585
2017-09-29,31.3763
2017-10-02,31.5804
2017-10-03,31.3957
2017-10-04,31.9204
2017-10-05,32.1925
2017-10-06,32.3091
2017-10-09,32.416
2017-10-10,32.5035
2017-10-11,32.6978
2017-10-12,32.4743
2017-10-13,32.727
2017-10-16,32.7172
2017-10-17,32.7464
2017-10-18,32.8727
2017-10-19,32.9019
2017-10-20,32.8338
2017-10-23,32.931
2017-10-24,33.1254
2017-10-25,32.999
2017-10-26,33.4072
2017-10-27,33.7375
2017-10-30,33.9513
2017-10-31,33.9902
2017-11-01,33.2905
2017-11-02,33.2322
2017-11-03,33.5043
2017-11-06,33.2808
2017-11-07,32.7755
2017-11-08,32.4549
2017-11-09,31.901
2017-11-10,32.4743
2017-11-13,32.4646
2017-11-14,32.2897
2017-11-15,32.2411
2017-11-16,32.1634
2017-11-17,32.1245
2017-11-20,32.5812
2017-11-21,32.9505
2017-11-22,32.0856
2017-11-24,32.0856
2017-11-27,32.1634
2017-11-28,32.1245
2017-11-29,31.7067
2017-11-30,31.8159
2017-12-01,31.6793
2017-12-04,31.4842
2017-12-05,31.6598
2017-12-06,31.3964
2017-12-07,31.5525
2017-12-08,31.7379
2017-12-11,32.0989
2017-12-12,31.8062
2017-12-13,31.9135
2017-12-14,32.0891
2017-12-15,31.9916
2017-12-18,31.894
2017-12-19,31.9135
2017-12-20,31.933
2017-12-21,31.9135
2017-12-22,31.9623
2017-12-26,32.2257
2017-12-27,32.2062
2017-12-28,34.6551
2017-12-29,34.8014
2018-01-02,33.9624
2018-01-03,33.5428
2018-01-04,33.5136
2018-01-05,33.4745
2018-01-08,33.1428
2018-01-09,33.0062
2018-01-10,32.6843
2018-01-11,32.9672
2018-01-12,32.9867
2018-01-16,32.7818
2018-01-17,32.8794
2018-01-18,32.8794
2018-01-19,32.8404
2018-01-22,32.9379
2018-01-23,33.2501
2018-01-24,33.5136
2018-01-25,33.055
2018-01-26,33.377
2018-01-29,33.3379
2018-01-30,33.2794
2018-01-31,33.416
2018-02-01,37.6601
2018-02-02,35.6112
2018-02-05,34.9966
2018-02-06,34.6843
2018-02-07,34.1673
2018-02-08,33.4745
2018-02-09,33.5916
2018-02-12,33.855
2018-02-13,33.855
2018-02-14,34.616
2018-02-15,34.4892
2018-02-16,34.2551
2018-02-20,34.1185
2018-02-21,33.8453
2018-02-22,33.7087
2018-02-23,34.5478
2018-02-26,34.8502
2018-02-27,34.6356
2018-02-28,34.2258
2018-03-01,33.9633
2018-03-02,34.12
2018-03-05,34.2571
2018-03-06,34.4236
2018-03-07,34.7566
2018-03-08,35.3344
2018-03-09,35.4715
2018-03-12,35.638
2018-03-13,35.4911
2018-03-14,35.7065
2018-03-15,35.4911
2018-03-16,35.5596
2018-03-19,34.8839
2018-03-20,34.7076
2018-03-21,34.9916
2018-03-22,33.9927
2018-03-23,33.5324
2018-03-26,33.9242
2018-03-27,33.3561
2018-03-28,33.3366
2018-03-29,34.0809
2018-04-02,33.2582
2018-04-03,33.6304
2018-04-04,33.7381
2018-04-05,33.6499
2018-04-06,33.4541
2018-04-09,33.8262
2018-04-10,33.9242
2018-04-11,33.4835
2018-04-12,33.7381
2018-04-13,33.4737
2018-04-16,33.836
2018-04-17,35.1189
2018-04-18,35.0504
2018-04-19,34.688
2018-04-20,34.5705
2018-04-23,34.4628
2018-04-24,34.2082
2018-04-25,34.3159
2018-04-26,34.786
2018-04-27,34.7958
2018-04-30,34.5999
2018-05-01,35.0896
2018-05-02,35.3638
2018-05-03,35.1875
2018-05-04,35.4323
2018-05-07,35.8143
2018-05-08,35.6184
2018-05-09,35.8339
2018-05-10,33.9927
2018-05-11,34.12
2018-05-14,33.9242
2018-05-15,33.3464
2018-05-16,33.4247
2018-05-17,33.2876
2018-05-18,33.2974
2018-05-21,33.3855
2018-05-22,33.4835
2018-05-23,33.7185
2018-05-24,33.934
2018-05-25,34.0123
2018-05-29,33.5226
2018-05-30,34.0809
2018-05-31,34.1494
2018-06-01,34.5803
2018-06-04,34.5901
2018-06-05,34.786
2018-06-06,34.9231
2018-06-07,34.8265
2018-06-08,35.0822
2018-06-11,35.2396
2018-06-12,35.5346
2018-06-13,35.7215
2018-06-14,35.3773
2018-06-15,35.3281
2018-06-18,35.0724
2018-06-19,34.8855
2018-06-20,35.3674
2018-06-21,35.1314
2018-06-22,35.1904
2018-06-25,34.2364
2018-06-26,34.3446
2018-06-27,33.9905
2018-06-28,34.3839
2018-06-29,34.6101
2018-07-02,34.9249
2018-07-03,35.0035
2018-07-05,35.456
2018-07-06,35.8395
2018-07-09,36.351
2018-07-10,36.5477
2018-07-11,36.2428
2018-07-12,37.1378
2018-07-13,37.2951
2018-07-16,37.4427
2018-07-17,36.8132
2018-07-18,37.0984
2018-07-19,37.0591
2018-07-20,37.2853
2018-07-23,37.0689
2018-07-24,36.9312
2018-07-25,37.3443
2018-07-26,37.7869
2018-07-27,37.2066
2018-07-30,36.351
2018-07-31,36.587
2018-08-01,36.7542
2018-08-02,37.1378
2018-08-03,38.6229
2018-08-06,38.2885
2018-08-07,38.0229
2018-08-08,38.6327
2018-08-09,38.6721
2018-08-10,38.3377
2018-08-13,38.3573
2018-08-14,38.6917
2018-08-15,38.0328
2018-08-16,38.141
2018-08-17,38.1901
2018-08-20,38.0721
2018-08-21,37.8853
2018-08-22,37.8066
2018-08-23,38.1901
2018-08-24,38.2983
2018-08-27,38.2885
2018-08-28,38.3377
2018-08-29,38.6819
2018-08-30,39.2267
2018-08-31,38.7528
2018-09-04,38.8614
2018-09-05,38.4072
2018-09-06,38.0024
2018-09-07,37.884
2018-09-10,37.9531
2018-09-11,37.9432
2018-09-12,37.8346
2018-09-13,37.8247
2018-09-14,38.1308
2018-09-17,37.6766
2018-09-18,37.726
2018-09-19,37.6964
2018-09-20,38.0222
2018-09-21,37.6865
2018-09-24,37.5088
2018-09-25,37.4989
2018-09-26,37.4298
2018-09-27,38.0024
2018-09-28,37.5581
2018-10-01,37.2916
2018-10-02,36.7387
2018-10-03,36.6597
2018-10-04,36.1166
2018-10-05,35.7612
2018-10-08,35.4452
2018-10-09,35.1392
2018-10-10,33.7372
2018-10-11,33.5397
2018-10-12,34.3394
2018-10-15,33.6878
2018-10-16,34.5665
2018-10-17,34.4283
2018-10-18,33.8951
2018-10-19,33.5594
2018-10-22,33.9149
2018-10-23,33.9445
2018-10-24,33.1349
2018-10-25,33.283
2018-10-26,32.6906
2018-10-29,32.3154
2018-10-30,32.8486
2018-10-31,33.3718
2018-11-01,33.5397
2018-11-02,32.74
2018-11-05,32.5425
2018-11-06,32.6807
2018-11-07,33.283
2018-11-08,32.9275
2018-11-09,32.6313
2018-11-12,32.0291
2018-11-13,32.5326
2018-11-14,32.3154
2018-11-15,32.4734
2018-11-16,32.7794
2018-11-19,32.1081
2018-11-20,32.1476
2018-11-21,33.0164
2018-11-23,33.0757
2018-11-26,33.6878
2018-11-27,33.6582
2018-11-28,34.1518
2018-11-29,33.7173
2018-11-30,34.0247
2018-12-03,34.2925
2018-12-04,33.9454
2018-12-06,33.152
2018-12-07,32.7851
2018-12-10,33.0727
2018-12-11,33.2115
2018-12-12,33.757
2018-12-13,33.5983
2018-12-14,32.4678
2018-12-17,31.7438
2018-12-18,33.033
2018-12-19,32.6959
2018-12-20,32.3686
2018-12-21,31.1786
2018-12-24,31.1786
2018-12-26,32.3389
2018-12-27,32.3884
2018-12-28,32.1703
2018-12-31,32.3289
2019-01-02,32.1604
2019-01-03,31.1885
2019-01-04,31.9422
2019-01-07,32.4876
2019-01-08,33.4297
2019-01-09,33.8958
2019-01-10,34.1834
2019-01-11,34.2032
2019-01-14,33.9851
2019-01-15,34.1239
2019-01-16,34.2131
2019-01-17,34.5206
2019-01-18,34.9966
2019-01-22,34.4908
2019-01-23,34.6792
2019-01-24,34.9371
2019-01-25,35.5123
2019-01-28,35.2048
2019-01-29,34.7982
2019-01-30,34.9767
2019-01-31,35.3437
2019-02-01,36.9304
2019-02-04,37.2874
2019-02-05,37.3766
2019-02-06,37.1684
2019-02-07,36.6329
2019-02-08,36.7221
2019-02-11,36.3949
2019-02-12,36.5535
2019-02-13,36.7519
2019-02-14,37.0989
2019-02-15,37.2477
2019-02-19,37.2279
2019-02-20,37.3667
2019-02-21,37.0989
2019-02-22,37.575
2019-02-25,37.7634
2019-02-26,37.8824
2019-02-27,38.051
2019-02-28,37.7541
2019-03-01,37.9034
2019-03-04,37.6943
2019-03-05,37.6545
2019-03-06,37.7043
2019-03-07,37.4355
2019-03-08,37.4056
2019-03-11,37.5748
2019-03-12,37.8536
2019-03-13,37.8337
2019-03-14,37.7242
2019-03-15,37.9333
2019-03-18,37.9831
2019-03-19,38.212
2019-03-20,37.6844
2019-03-21,37.9831
2019-03-22,37.2762
2019-03-25,37.3459
2019-03-26,37.5748
2019-03-27,37.7341
2019-03-28,38.3116
2019-03-29,38.2618
2019-04-01,38.3813
2019-04-02,38.2917
2019-04-03,38.5008
2019-04-04,37.9034
2019-04-05,38.3017
2019-04-08,38.1125
2019-04-09,38.4012
2019-04-10,38.2917
2019-04-11,38.451
2019-04-12,38.6501
2019-04-15,38.441
2019-04-16,38.5406
2019-04-17,37.8835
2019-04-18,37.9134
2019-04-22,37.774
2019-04-23,37.9532
2019-04-24,37.9731
2019-04-25,38.1822
2019-04-26,38.2519
2019-04-29,38.1025
2019-04-30,38.2817
2019-05-01,38.2718
2019-05-02,39.5761
2019-05-03,40.1137
2019-05-06,40.0241
2019-05-07,39.1479
2019-05-08,40.0639
2019-05-09,40.044
2019-05-10,40.1734
2019-05-13,39.4168
2019-05-14,39.5462
2019-05-15,39.7553
2019-05-16,40.1236
2019-05-17,40.6215
2019-05-20,40.2531
2019-05-21,40.7608
2019-05-22,40.8505
2019-05-23,40.1734
2019-05-24,40.2929
2019-05-28,40.3925
2019-05-29,39.7254
2019-05-30,39.76
2019-05-31,39.72
2019-06-03,39
2019-06-04,39.59
2019-06-05,40.11
2019-06-06,40.75
2019-06-07,41.11
2019-06-10,41.28
2019-06-11,40.99
2019-06-12,41.27
2019-06-13,41.27
2019-06-14,41.26
2019-06-17,40.83
2019-06-18,41.2
2019-06-19,41.28
2019-06-20,41.535
2019-06-21,41.33
2019-06-24,41.68
2019-06-25,40.995
2019-06-26,40.99
2019-06-27,41.265
2019-06-28,41.19
2019-07-01,41.35
2019-07-02,41.92
2019-07-03,42.35
2019-07-04,42.35
2019-07-05,42.01
2019-07-08,41.84
2019-07-09,42.42
2019-07-10,42.5
2019-07-11,42.85
2019-07-12,42.495
2019-07-15,42.705
2019-07-16,42.475
2019-07-17,42.54
2019-07-18,42.715
2019-07-19,42.745
2019-07-22,43.385
2019-07-23,43.19
2019-07-24,43.715
2019-07-25,43.94
2019-07-26,44.045
2019-07-29,43.705
2019-07-30,43.155
2019-07-31,42.625
2019-08-01,42.525
2019-08-02,38.755
2019-08-05,37.6
2019-08-06,37.9
2019-08-07,37.98
2019-08-08,38.51
2019-08-09,38.38
2019-08-12,38.34
2019-08-13,38.32
2019-08-14,37.58
2019-08-15,37.915
2019-08-16,38.45
2019-08-19,38.715
2019-08-20,38.62
2019-08-21,38.935
2019-08-22,39.105
2019-08-23,38.5
2019-08-26,38.43
2019-08-27,38.685
2019-08-28,38.515
2019-08-29,38.855
2019-08-30,39.11
2019-09-02,39.105
2019-09-03,39.555
2019-09-04,40.38
2019-09-05,41.6
2019-09-06,41.52
2019-09-09,41.37
2019-09-10,40.895
2019-09-11,41.155
2019-09-12,41.235
2019-09-13,40.92
2019-09-16,40.85
2019-09-17,40.985
2019-09-18,40.845
2019-09-19,41.21
2019-09-20,41.375
2019-09-23,41.09
2019-09-24,40.64
2019-09-25,40.98
2019-09-26,40.855
2019-09-27,40.52
2019-09-30,40.795
2019-10-01,40.41
2019-10-02,39.61
2019-10-03,39.965
2019-10-04,40.445
2019-10-07,40.275
2019-10-08,39.915
2019-10-09,40.46
2019-10-10,40.265
2019-10-11,40.81
2019-10-14,40.625
2019-10-15,40.8
2019-10-16,40.815
2019-10-17,40.835
2019-10-18,39.33
2019-10-21,40.005
2019-10-22,39.42
2019-10-23,39.475
2019-10-24,39.895
2019-10-25,39.98
2019-10-28,40.39
2019-10-29,40.165
2019-10-30,40.355
2019-10-31,40.235
2019-11-01,41.12
2019-11-04,41.185
2019-11-05,40.945
2019-11-06,40.935
2019-11-07,41.12
2019-11-08,41.54
2019-11-11,42.565
2019-11-12,42.65
2019-11-13,43.525
2019-11-14,43.41
2019-11-15,43.445
2019-11-18,43.495
2019-11-19,43.57
2019-11-20,43.2
2019-11-21,43.12
2019-11-22,43.045
2019-11-25,43.815
