date,close
2014-09-24,29.93
2014-09-25,31.39
2014-09-26,29.8
2014-09-29,27.39
2014-09-30,32.01
2014-10-01,29.62
2014-10-02,28.69
2014-10-03,30.38
2014-10-06,29.92
2014-10-07,29.35
2014-10-08,29.38
2014-10-09,28.2
2014-10-10,29.84
2014-10-13,31.25
2014-10-14,29.6
2014-10-15,28.76
2014-10-16,29.45
2014-10-17,30.29
2014-10-20,29.88
2014-10-21,29.48
2014-10-22,28.6
2014-10-23,29.21
2014-10-24,30.24
2014-10-27,35.08
2014-10-28,32.32
2014-10-29,34.91
2014-10-30,34.71
2014-10-31,35.28
2014-11-03,36.58
2014-11-04,36.53
2014-11-05,33.8
2014-11-06,33.03
2014-11-07,32.71
2014-11-10,34.88
2014-11-11,33.89
2014-11-12,33.7
2014-11-13,42.92
2014-11-14,44.37
2014-11-17,43.45
2014-11-18,42.67
2014-11-19,42.41
2014-11-20,42.64
2014-11-21,42.81
2014-11-24,47.01
2014-11-25,42.59
2014-11-26,43.16
2014-11-28,41.32
2014-12-01,39.04
2014-12-02,40.75
2014-12-03,43.02
2014-12-04,40.6
2014-12-05,41.1
2014-12-08,38.15
2014-12-09,40.91
2014-12-10,39.13
2014-12-11,37.85
2014-12-12,37.98
2014-12-15,37.44
2014-12-16,37.27
2014-12-17,38.62
2014-12-18,40.63
2014-12-19,41.95
2014-12-22,42.67
2014-12-23,41.01
2014-12-24,41.6
2014-12-26,41.83
2014-12-29,41.22
2014-12-30,39.85
2014-12-31,39.65
2015-01-02,38.88
2015-01-05,39.05
2015-01-06,37.15
2015-01-07,37.95
2015-01-08,38.55
2015-01-09,37.06
2015-01-12,38.37
2015-01-13,37.45
2015-01-14,37.75
2015-01-15,35.71
2015-01-16,36.65
2015-01-20,36.85
2015-01-21,36.225
2015-01-22,36.12
2015-01-23,36.99
2015-01-26,36.06
2015-01-27,35.8
2015-01-28,34.65
2015-01-29,33.78
2015-01-30,33.87
2015-02-02,34
2015-02-03,34.93
2015-02-04,34.05
2015-02-05,36.82
2015-02-06,37.07
2015-02-09,36.09
2015-02-10,40.9
2015-02-11,41.79
2015-02-12,45.69
2015-02-13,52.52
2015-02-17,58.86
2015-02-18,60.32
2015-02-19,64.28
2015-02-20,70.35
2015-02-23,58.42
2015-02-24,60.11
2015-02-25,60.31
2015-02-26,62.46
2015-02-27,59.27
2015-03-02,57.74
2015-03-03,58.02
2015-03-04,59.31
2015-03-05,62.87
2015-03-06,59.78
2015-03-09,57.79
2015-03-10,54.7
2015-03-11,55.6
2015-03-12,51.72
2015-03-13,50.04
2015-03-16,50.5
2015-03-17,53.06
2015-03-18,51.57
2015-03-19,50.41
2015-03-20,48.69
2015-03-23,54.89
2015-03-24,53.05
2015-03-25,50.14
2015-03-26,52.87
2015-03-27,52.23
2015-03-30,54.82
2015-03-31,55.57
2015-04-01,55.41
2015-04-02,53.81
2015-04-06,54.98
2015-04-07,59.45
2015-04-08,58.73
2015-04-09,59.1
2015-04-10,58.79
2015-04-13,58.09
2015-04-14,58.71
2015-04-15,61.66
2015-04-16,61.12
2015-04-17,60.7
2015-04-20,62.64
2015-04-21,66.37
2015-04-22,65.53
2015-04-23,66.62
2015-04-24,66.78
2015-04-27,66.62
2015-04-28,64.93
2015-04-29,66.5
2015-04-30,62.95
2015-05-01,66.92
2015-05-04,66.81
2015-05-05,63.09
2015-05-06,62.68
2015-05-07,61.47
2015-05-08,66.13
2015-05-11,64.32
2015-05-12,60.77
2015-05-13,61.3
2015-05-14,61.5
2015-05-15,60.23
2015-05-18,63.22
2015-05-19,63.16
2015-05-20,63.2
2015-05-21,64.83
2015-05-22,63.54
2015-05-26,62.5
2015-05-27,64.27
2015-05-28,64.26
2015-05-29,62.19
2015-06-01,60.72
2015-06-02,62.11
2015-06-03,62.28
2015-06-04,61.67
2015-06-05,66.24
2015-06-08,68.65
2015-06-09,65.34
2015-06-10,63.37
2015-06-11,62.66
2015-06-12,66.45
2015-06-15,70.83
2015-06-16,71.18
2015-06-17,73.89
2015-06-18,72.53
2015-06-19,73.22
2015-06-22,73.4
2015-06-23,71.86
2015-06-24,69.89
2015-06-25,69.75
2015-06-26,65.78
2015-06-29,61.91
2015-06-30,62.82
2015-07-01,62.27
2015-07-02,60.38
2015-07-06,58.03
2015-07-07,56.81
2015-07-08,56.98
2015-07-09,59.3
2015-07-10,58.55
2015-07-13,57.62
2015-07-14,59.22
2015-07-15,57.31
2015-07-16,56.89
2015-07-17,56.86
2015-07-20,54.98
2015-07-21,56.82
2015-07-22,57.5
2015-07-23,61.72
2015-07-24,63.01
2015-07-27,59.83
2015-07-28,59.83
2015-07-29,58.93
2015-07-30,58.58
2015-07-31,59.13
2015-08-03,56.83
2015-08-04,57.57
2015-08-05,59.91
2015-08-06,58.64
2015-08-07,60.32
2015-08-10,63.14
2015-08-11,58.925
2015-08-12,57.93
2015-08-13,58.06
2015-08-14,58.7
2015-08-17,59.93
2015-08-18,59.5
2015-08-19,61.63
2015-08-20,55.19
2015-08-21,52.17
2015-08-24,48.55
2015-08-25,46.71
2015-08-26,50.14
2015-08-27,50.68
2015-08-28,52.38
2015-08-31,51.05
2015-09-01,50.26
2015-09-02,50.99
2015-09-03,48.59
2015-09-04,46.51
2015-09-08,48.28
2015-09-09,48.25
2015-09-10,47.4
2015-09-11,48.48
2015-09-14,46.44
2015-09-15,45.98
2015-09-16,46.24
2015-09-17,47.32
2015-09-18,47.65
2015-09-21,49.46
2015-09-22,50.05
2015-09-23,52.51
2015-09-24,52.7
2015-09-25,50.11
2015-09-28,50.86
2015-09-29,48.35
2015-09-30,50.14
2015-10-01,51.14
2015-10-02,53.11
2015-10-05,53.58
2015-10-06,52.2
2015-10-07,52.86
2015-10-08,53.37
2015-10-09,52.91
2015-10-12,50.85
2015-10-13,49.93
2015-10-14,47.99
2015-10-15,50.02
2015-10-16,49.95
2015-10-19,50.46
2015-10-20,49.52
2015-10-21,46.41
2015-10-22,47.34
2015-10-23,46.1
2015-10-26,47.62
2015-10-27,47.2
2015-10-28,49.73
2015-10-29,48.28
2015-10-30,49.64
2015-11-02,50.71
2015-11-03,50.7
2015-11-04,51.6
2015-11-05,49.25
2015-11-06,47.23
2015-11-09,44.78
2015-11-10,40.5
2015-11-11,40.17
2015-11-12,40.26
2015-11-13,38.78
2015-11-16,38.64
2015-11-17,38.07
2015-11-18,39.15
2015-11-19,40.17
2015-11-20,41.54
2015-11-23,40.91
2015-11-24,42.49
2015-11-25,44.42
2015-11-27,43.86
2015-11-30,43.29
2015-12-01,43.14
2015-12-02,42.08
2015-12-03,40.33
2015-12-04,41
2015-12-07,39.39
2015-12-08,40.04
2015-12-09,38.91
2015-12-10,42.33
2015-12-11,40.25
2015-12-14,40.51
2015-12-15,41.35
2015-12-16,43.98
2015-12-17,44.23
2015-12-18,45.45
2015-12-21,45.41
2015-12-22,45.15
2015-12-23,45.97
2015-12-24,46.17
2015-12-28,45.56
2015-12-29,45.42
2015-12-30,45.66
2015-12-31,45.14
2016-01-04,43.85
2016-01-05,43.8
2016-01-06,42.1
2016-01-07,39.69
2016-01-08,38.29
2016-01-11,37.91
2016-01-12,37.84
2016-01-13,45.27
2016-01-14,46.75
2016-01-15,48.31
2016-01-19,46.34
2016-01-20,46.33
2016-01-21,48.65
2016-01-22,46.3
2016-01-25,44.57
2016-01-26,43.01
2016-01-27,42.16
2016-01-28,39.86
2016-01-29,43.58
2016-02-01,44.13
2016-02-02,42.94
2016-02-03,43.35
2016-02-04,43.68
2016-02-05,40.84
2016-02-08,37.18
2016-02-09,35.17
2016-02-10,35.97
2016-02-11,36.74
2016-02-12,32.78
2016-02-16,34.47
2016-02-17,36.32
2016-02-18,35.99
2016-02-19,36.04
2016-02-22,36.81
2016-02-23,35.92
2016-02-24,35.96
2016-02-25,36.87
2016-02-26,38.07
2016-02-29,37.47
2016-03-01,37.8
2016-03-02,37.66
2016-03-03,38.56
2016-03-04,39.62
2016-03-07,38.75
2016-03-08,38.22
2016-03-09,38.04
2016-03-10,37.44
2016-03-11,38.53
2016-03-14,38.41
2016-03-15,37.85
2016-03-16,37.67
2016-03-17,39.97
2016-03-18,41.63
2016-03-21,42.63
2016-03-22,42.19
2016-03-23,40.67
2016-03-24,40.25
2016-03-28,40.89
2016-03-29,41.57
2016-03-30,42.04
2016-03-31,42.63
2016-04-01,42.26
2016-04-04,42.49
2016-04-05,42.09
2016-04-06,42.76
2016-04-07,40.7
2016-04-08,40.3
2016-04-11,38.48
2016-04-12,38.5
2016-04-13,38.78
2016-04-14,39.42
2016-04-15,39.61
2016-04-18,39.66
2016-04-19,39.79
2016-04-20,39.18
2016-04-21,39.62
2016-04-22,39.6
2016-04-25,39.26
2016-04-26,39.61
2016-04-27,41.02
2016-04-28,39.58
2016-04-29,40.84
2016-05-02,42.28
2016-05-03,41.55
2016-05-04,39.73
2016-05-05,40.38
2016-05-06,40.82
2016-05-09,40.81
2016-05-10,41.4
2016-05-11,40.39
2016-05-12,40.1
2016-05-13,40.64
2016-05-16,41.15
2016-05-17,41.31
2016-05-18,41.48
2016-05-19,42.54
2016-05-20,42.9
2016-05-23,42.18
2016-05-24,42.87
2016-05-25,44.41
2016-05-26,44.95
2016-05-27,43.83
2016-05-31,45.42
2016-06-01,46.18
2016-06-02,47.47
2016-06-03,47.45
2016-06-06,47.52
2016-06-07,47.68
2016-06-08,46.88
2016-06-09,45.71
2016-06-10,45.58
2016-06-13,45.99
2016-06-14,45.5
2016-06-15,46.75
2016-06-16,47.79
2016-06-17,48.29
2016-06-20,48.32
2016-06-21,49.77
2016-06-22,49.33
2016-06-23,51.03
2016-06-24,48.35
2016-06-27,44.54
2016-06-28,45.51
2016-06-29,46.54
2016-06-30,48.59
2016-07-01,48.37
2016-07-05,49.4
2016-07-06,50.21
2016-07-07,50.5
2016-07-08,51.7
2016-07-11,52.72
2016-07-12,53.06
2016-07-13,52.84
2016-07-14,53.63
2016-07-15,53.58
2016-07-18,54.1
2016-07-19,53.37
2016-07-20,52.7
2016-07-21,51.38
2016-07-22,53.6
2016-07-25,55
2016-07-26,56.98
2016-07-27,55.96
2016-07-28,56.55
2016-07-29,56.39
2016-08-01,56.48
2016-08-02,54.9
2016-08-03,56.15
2016-08-04,56.36
2016-08-05,56.21
2016-08-08,55.59
2016-08-09,55.31
2016-08-10,51.71
2016-08-11,53.13
2016-08-12,52.95
2016-08-15,51.89
2016-08-16,54.17
2016-08-17,53.91
2016-08-18,55.47
2016-08-19,55.61
2016-08-22,54.73
2016-08-23,56.07
2016-08-24,54.57
2016-08-25,54.14
2016-08-26,53.8
2016-08-29,53.69
2016-08-30,53.88
2016-08-31,52.8
2016-09-01,53.63
2016-09-02,55.38
2016-09-06,57.47
2016-09-07,56.88
2016-09-08,54.87
2016-09-09,51.86
2016-09-12,52.58
2016-09-13,51.84
2016-09-14,51.71
2016-09-15,50.87
2016-09-16,50.59
2016-09-19,50.02
2016-09-20,49.57
2016-09-21,50.25
2016-09-22,50.72
2016-09-23,51.56
2016-09-26,50.7
2016-09-27,50.92
2016-09-28,50.45
2016-09-29,49.62
2016-09-30,49.57
2016-10-03,49.64
2016-10-04,49.97
2016-10-05,50.6
2016-10-06,49.84
2016-10-07,49.73
2016-10-10,50.34
2016-10-11,49.93
2016-10-12,48.09
2016-10-13,47.04
2016-10-14,46.63
2016-10-17,45.4
2016-10-18,46.47
2016-10-19,45.2
2016-10-20,45.56
2016-10-21,46.95
2016-10-24,47.22
2016-10-25,46.52
2016-10-26,45.97
2016-10-27,45.26
2016-10-28,46.41
2016-10-31,46.75
2016-11-01,46.05
2016-11-02,44.94
2016-11-03,47.8
2016-11-04,47.73
2016-11-07,49.43
2016-11-08,49.5
2016-11-09,51.34
2016-11-10,52.07
2016-11-11,53.04
2016-11-14,53.7
2016-11-15,53.99
2016-11-16,55.01
2016-11-17,54.46
2016-11-18,54.46
2016-11-21,54.62
2016-11-22,52.91
2016-11-23,52.37
2016-11-25,51.94
2016-11-28,50.73
2016-11-29,51.16
2016-11-30,51.01
2016-12-01,48.39
2016-12-02,48.52
2016-12-05,49.78
2016-12-06,48.98
2016-12-07,49.01
2016-12-08,48.11
2016-12-09,47.83
2016-12-12,47.67
2016-12-13,47.89
2016-12-14,47.5
2016-12-15,47.82
2016-12-16,47.81
2016-12-19,47.49
2016-12-20,46.9
2016-12-21,46.23
2016-12-22,45.88
2016-12-23,46.13
2016-12-27,46.32
2016-12-28,45.41
2016-12-29,45.43
2016-12-30,45.5
2017-01-03,46.16
2017-01-04,46.98
2017-01-05,47.66
2017-01-06,48.44
2017-01-09,49.72
2017-01-10,50.42
2017-01-11,51.22
2017-01-12,50.8
2017-01-13,52.21
2017-01-17,50.42
2017-01-18,50.04
2017-01-19,51.48
2017-01-20,51.35
2017-01-23,50.6
2017-01-24,51.73
2017-01-25,52.01
2017-01-26,51.93
2017-01-27,51.62
2017-01-30,51.53
2017-01-31,53.06
2017-02-01,53.02
2017-02-02,53.2
2017-02-03,53.98
2017-02-06,54
2017-02-07,53.91
2017-02-08,53.77
2017-02-09,55.33
2017-02-10,52.86
2017-02-13,52.87
2017-02-14,54.32
2017-02-15,53.69
2017-02-16,51.6
2017-02-17,52.55
2017-02-21,52.18
2017-02-22,51.03
2017-02-23,50.57
2017-02-24,50.53
2017-02-27,50.6
2017-02-28,50.58
2017-03-01,51.64
2017-03-02,50.84
2017-03-03,51.2
2017-03-06,50.43
2017-03-07,49.29
2017-03-08,49.74
2017-03-09,49.83
2017-03-10,50.12
2017-03-13,51
2017-03-14,49.97
2017-03-15,50
2017-03-16,50.58
2017-03-17,50.72
2017-03-20,50.8
2017-03-21,49.43
2017-03-22,48.73
2017-03-23,48.55
2017-03-24,48.78
2017-03-27,49.04
2017-03-28,49.04
2017-03-29,50.15
2017-03-30,51.33
2017-03-31,50.87
2017-04-03,51.06
2017-04-04,50.97
2017-04-05,51.62
2017-04-06,51.69
2017-04-07,52.16
2017-04-10,52.65
2017-04-11,52.84
2017-04-12,53.05
2017-04-13,51.95
2017-04-17,52.88
2017-04-18,52.53
2017-04-19,52.42
2017-04-20,51.86
2017-04-21,51.88
2017-04-24,52.61
2017-04-25,52.76
2017-04-26,52.66
2017-04-27,53.91
2017-04-28,52.91
2017-05-01,53.18
2017-05-02,53.27
2017-05-03,51.97
2017-05-04,53.69
2017-05-05,54.21
2017-05-08,54.5
2017-05-09,54.79
2017-05-10,55.25
2017-05-11,55.15
2017-05-12,48.29
2017-05-15,47.82
2017-05-16,48.39
2017-05-17,46.72
2017-05-18,46.46
2017-05-19,46.66
2017-05-22,46.41
2017-05-23,47.99
2017-05-24,49
2017-05-25,48.87
2017-05-26,48.99
2017-05-30,48.99
2017-05-31,49.01
2017-06-01,48.99
2017-06-02,48.95
2017-06-05,48.69
2017-06-06,48.7
2017-06-07,47.61
2017-06-08,48.66
2017-06-09,47.29
2017-06-12,48.02
2017-06-13,48.83
2017-06-14,48.39
2017-06-15,48.54
2017-06-16,48.57
2017-06-19,48.97
2017-06-20,48.67
2017-06-21,49.37
2017-06-22,49.59
2017-06-23,49.98
2017-06-26,49.64
2017-06-27,49.47
2017-06-28,50.87
2017-06-29,49.81
2017-06-30,49.95
2017-07-03,49.21
2017-07-05,49.28
2017-07-06,48.65
2017-07-07,49.3
2017-07-10,49.44
2017-07-11,49.27
2017-07-12,50.44
2017-07-13,51
2017-07-14,42.68
2017-07-17,42.4
2017-07-18,42.33
2017-07-19,42.57
2017-07-20,42.56
2017-07-21,42.35
2017-07-24,42.49
2017-07-25,43.21
2017-07-26,42.78
2017-07-27,42.65
2017-07-28,42.2
2017-07-31,41.68
2017-08-01,42.14
2017-08-02,40.23
2017-08-03,40.72
2017-08-04,40.68
2017-08-07,40.71
2017-08-08,40.2
2017-08-09,40.3
2017-08-10,40.21
2017-08-11,40.07
2017-08-14,40.6
2017-08-15,40.37
2017-08-16,40.52
2017-08-17,40.07
2017-08-18,40.08
2017-08-21,40.28
2017-08-22,40.39
2017-08-23,39.72
2017-08-24,40.01
2017-08-25,40.02
2017-08-28,40.04
2017-08-29,40.19
2017-08-30,39.49
2017-08-31,40.01
2017-09-01,41.45
2017-09-05,40.64
2017-09-06,41.11
2017-09-07,40.87
2017-09-08,41.52
2017-09-11,42.09
2017-09-12,42.44
2017-09-13,41.9
2017-09-14,41.44
2017-09-15,41.68
2017-09-18,42.42
2017-09-19,42.09
2017-09-20,42.29
2017-09-21,42.16
2017-09-22,42.85
2017-09-25,41.99
2017-09-26,42.51
2017-09-27,41.91
2017-09-28,41.05
2017-09-29,41
2017-10-02,41.11
2017-10-03,41.71
2017-10-04,42.02
2017-10-05,42.36
2017-10-06,42.65
2017-10-09,42.63
2017-10-10,42.26
2017-10-11,42.11
2017-10-12,42.03
2017-10-13,42.41
2017-10-16,42.37
2017-10-17,42.58
2017-10-18,42.98
2017-10-19,43.83
2017-10-20,43.66
2017-10-23,43.51
2017-10-24,43.47
2017-10-25,43.41
2017-10-26,43.58
2017-10-27,43.09
2017-10-30,41.9
2017-10-31,42.37
2017-11-01,41.47
2017-11-02,46.09
2017-11-03,44.61
2017-11-06,44.49
2017-11-07,44.55
2017-11-08,45.36
2017-11-09,44.21
2017-11-10,44.84
2017-11-13,44.33
2017-11-14,44.4
2017-11-15,43.89
2017-11-16,44.73
2017-11-17,45.1
2017-11-20,45.86
2017-11-21,47.02
2017-11-22,47.19
2017-11-24,46.93
2017-11-27,47.03
2017-11-28,47.395
2017-11-29,46.67
2017-11-30,47.06
2017-12-01,46.48
2017-12-04,44.78
2017-12-05,44.52
2017-12-06,44.07
2017-12-07,44.13
2017-12-08,44.02
2017-12-11,43.9
2017-12-12,43.5
2017-12-13,43.49
2017-12-14,43
2017-12-15,43.6
2017-12-18,43.97
2017-12-19,43.83
2017-12-20,42.83
2017-12-21,42.26
2017-12-22,41.94
2017-12-26,41.86
2017-12-27,42.09
2017-12-28,41.74
2017-12-29,41.39
2018-01-02,41.59
2018-01-03,42.31
2018-01-04,40.77
2018-01-05,41.79
2018-01-08,42.27
2018-01-09,42.55
2018-01-10,42.63
2018-01-11,43.3
2018-01-12,43.42
2018-01-16,42.39
2018-01-17,41.91
2018-01-18,42.49
2018-01-19,42.84
2018-01-22,43.35
2018-01-23,43.23
2018-01-24,43.75
2018-01-25,43.62
2018-01-26,43.49
2018-01-29,43.55
2018-01-30,42.62
2018-01-31,43.28
2018-02-01,44.03
2018-02-02,44.25
2018-02-05,42.83
2018-02-06,42
2018-02-07,41.87
2018-02-08,42.24
2018-02-09,44.05
2018-02-12,43.56
2018-02-13,44.68
2018-02-14,45.35
2018-02-15,48.85
2018-02-16,47.9
2018-02-20,49.3
2018-02-21,49.16
2018-02-22,49.78
2018-02-23,49.96
2018-02-26,49.72
2018-02-27,48.57
2018-02-28,49.51
2018-03-01,49.43
2018-03-02,50.26
2018-03-05,49.76
2018-03-06,49.27
2018-03-07,50.04
2018-03-08,50.31
2018-03-09,50.99
2018-03-12,51.31
2018-03-13,52.04
2018-03-14,51.95
2018-03-15,51.79
2018-03-16,51.42
2018-03-19,50.99
2018-03-20,51.41
2018-03-21,51.56
2018-03-22,50.78
2018-03-23,49.09
2018-03-26,50.02
2018-03-27,50.03
2018-03-28,50
2018-03-29,51.02
2018-04-02,50.05
2018-04-03,49.71
2018-04-04,51.26
2018-04-05,52.27
2018-04-06,50.78
2018-04-09,50.71
2018-04-10,51.23
2018-04-11,51.62
2018-04-12,51.79
2018-04-13,51.68
2018-04-16,52.03
2018-04-17,53.58
2018-04-18,53.03
2018-04-19,53.32
2018-04-20,52.4
2018-04-23,52.48
2018-04-24,53.34
2018-04-25,53.28
2018-04-26,54.36
2018-04-27,54.82
2018-04-30,54.96
2018-05-01,55.02
2018-05-02,55.58
2018-05-03,55.07
2018-05-04,57.57
2018-05-07,57.06
2018-05-08,58.5
2018-05-09,59.53
2018-05-10,59.5
2018-05-11,58.78
2018-05-14,58.26
2018-05-15,58.89
2018-05-16,58.97
2018-05-17,59.02
2018-05-18,59.02
2018-05-21,59.58
2018-05-22,59.74
2018-05-23,59.79
2018-05-24,60.24
2018-05-25,60.2
2018-05-29,59.99
2018-05-30,60.97
2018-05-31,60.85
2018-06-01,61.98
2018-06-04,62.42
2018-06-05,62.42
2018-06-06,64.33
2018-06-07,63.94
2018-06-08,64.65
2018-06-11,64.7
2018-06-12,65.56
2018-06-13,65.67
2018-06-14,66.25
2018-06-15,65.33
2018-06-18,65.65
2018-06-19,66.29
2018-06-20,66.52
2018-06-21,63.66
2018-06-22,63.45
2018-06-25,62.79
2018-06-26,63.72
2018-06-27,61.95
2018-06-28,62.82
2018-06-29,62.96
2018-07-02,64.05
2018-07-03,64.14
2018-07-05,64.19
2018-07-06,65
2018-07-09,65.74
2018-07-10,65.76
2018-07-11,66.07
2018-07-12,67.68
2018-07-13,67.39
2018-07-16,65.84
2018-07-17,68.53
2018-07-18,69.57
2018-07-19,68.55
2018-07-20,69.15
2018-07-23,68.56
2018-07-24,66.27
2018-07-25,67.56
2018-07-26,67.45
2018-07-27,63.93
2018-07-30,61.23
2018-07-31,60.71
2018-08-01,60.84
2018-08-02,61.52
2018-08-03,62.16
2018-08-06,63.25
2018-08-07,61.77
2018-08-08,69.02
2018-08-09,69.89
2018-08-10,71.15
2018-08-13,70.79
2018-08-14,70.92
2018-08-15,71.79
2018-08-16,71.65
2018-08-17,72.73
2018-08-20,71.87
2018-08-21,72.38
2018-08-22,72.82
2018-08-23,73.22
2018-08-24,74.2
2018-08-27,73.71
2018-08-28,73.66
2018-08-29,73.76
2018-08-30,73.56
2018-08-31,75.42
2018-09-04,75.98
2018-09-05,74.51
2018-09-06,75.4
2018-09-07,75.92
2018-09-10,76.5
2018-09-11,77
2018-09-12,77.38
2018-09-13,75.8
2018-09-14,75.24
2018-09-17,73.11
2018-09-18,73.51
2018-09-19,72.73
2018-09-20,72.23
2018-09-21,72.52
2018-09-24,72.91
2018-09-25,73
2018-09-26,73.49
2018-09-27,78.76
2018-09-28,79.84
2018-10-01,77.03
2018-10-02,73.97
2018-10-03,75
2018-10-04,73.9
2018-10-05,74.22
2018-10-08,70.13
2018-10-09,70.4
2018-10-10,68.15
2018-10-11,67.7
2018-10-12,69.8
2018-10-15,70.38
2018-10-16,71.73
2018-10-17,71
2018-10-18,70.06
2018-10-19,70.28
2018-10-22,71.8
2018-10-23,71.73
2018-10-24,67.94
2018-10-25,69.02
2018-10-26,67.78
2018-10-29,67.87
2018-10-30,66.83
2018-10-31,68.26
2018-11-01,69.14
2018-11-02,67.93
2018-11-05,67.47
2018-11-06,67.81
2018-11-07,71.7
2018-11-08,78
2018-11-09,77.33
2018-11-12,74.61
2018-11-13,75.15
2018-11-14,75.03
2018-11-15,74.56
2018-11-16,74.73
2018-11-19,67.54
2018-11-20,64.68
2018-11-21,65.98
2018-11-23,66.4
2018-11-26,68.73
2018-11-27,67.37
2018-11-28,70.8
2018-11-29,71.9
2018-11-30,74.14
2018-12-03,74.93
2018-12-04,72.81
2018-12-06,76.17
2018-12-07,74.52
2018-12-10,75.73
2018-12-11,76.81
2018-12-12,77.62
2018-12-13,76.85
2018-12-14,73.97
2018-12-17,69.87
2018-12-18,71.21
2018-12-19,71.07
2018-12-20,69.37
2018-12-21,67.55
2018-12-24,66.18
2018-12-26,69.96
2018-12-27,72.45
2018-12-28,73.27
2018-12-31,74.14
2019-01-02,73.24
2019-01-03,69.91
2019-01-04,69.42
2019-01-07,72.78
2019-01-08,77.73
2019-01-09,77.32
2019-01-10,78.58
2019-01-11,77.92
2019-01-14,77.08
2019-01-15,79.63
2019-01-16,77.22
2019-01-17,78
2019-01-18,78.52
2019-01-22,75.63
2019-01-23,77
2019-01-24,77.44
2019-01-25,80.15
2019-01-28,84.13
2019-01-29,83.53
2019-01-30,86.88
2019-01-31,87.76
2019-02-01,88.48
2019-02-04,88.44
2019-02-05,89.6
2019-02-06,87.94
2019-02-07,86.89
2019-02-08,88.97
2019-02-11,89.24
2019-02-12,87.48
2019-02-13,86.38
2019-02-14,104.06
2019-02-15,101.05
2019-02-19,101.81
2019-02-20,101.85
2019-02-21,104.09
2019-02-22,105.89
2019-02-25,107.15
2019-02-26,106.72
2019-02-27,109.59
2019-02-28,109.77
2019-03-01,109.93
2019-03-04,105.67
2019-03-05,106.92
2019-03-06,105.71
2019-03-07,106.76
2019-03-08,106.83
2019-03-11,110.74
2019-03-12,110.73
2019-03-13,109.92
2019-03-14,113.2
2019-03-15,111.18
2019-03-18,112.31
2019-03-19,114.46
2019-03-20,113.68
2019-03-21,117.58
2019-03-22,113.19
2019-03-25,112.83
2019-03-26,116.03
2019-03-27,113.7
2019-03-28,115.95
2019-03-29,119.05
2019-04-01,119.34
2019-04-02,119.57
2019-04-03,120.19
2019-04-04,114.22
2019-04-05,114.42
2019-04-08,117.03
2019-04-09,118.38
2019-04-10,121.02
2019-04-11,119.54
2019-04-12,121.41
2019-04-15,121.89
2019-04-16,123.7
2019-04-17,121.26
2019-04-18,117.73
2019-04-22,121.92
2019-04-23,126.02
2019-04-24,125.63
2019-04-25,124.73
2019-04-26,127.57
2019-04-29,129.26
2019-04-30,128.93
2019-05-01,127.01
2019-05-02,127.93
2019-05-03,128.98
2019-05-06,129.22
2019-05-07,127.63
2019-05-08,128.37
2019-05-09,126.62
2019-05-10,125.74
2019-05-13,121.24
2019-05-14,123
2019-05-15,126.12
2019-05-16,131.59
2019-05-17,128.81
2019-05-20,127.87
2019-05-21,132.66
2019-05-22,135.77
2019-05-23,131.65
2019-05-24,133.91
2019-05-28,135.76
2019-05-29,130.91
2019-05-30,132.17
2019-05-31,132.05
2019-06-03,119.89
2019-06-04,127.31
2019-06-05,128.23
2019-06-06,130.15
2019-06-07,129.11
2019-06-10,130.11
2019-06-11,130.5
2019-06-12,132.49
2019-06-13,131.57
2019-06-14,131.38
2019-06-17,129.31
2019-06-18,133.25
2019-06-19,133.61
2019-06-20,131.415
2019-06-21,126.36
2019-06-24,126.97
2019-06-25,125.21
2019-06-26,124.16
2019-06-27,127.13
2019-06-28,126.88
2019-07-01,127.27
2019-07-02,126.89
2019-07-03,129.32
2019-07-04,129.32
2019-07-05,128.26
2019-07-08,126.09
2019-07-09,129.89
2019-07-10,131.96
2019-07-11,130.94
2019-07-12,133.6
2019-07-15,141.66
2019-07-16,139.6
2019-07-17,140.71
2019-07-18,139.56
2019-07-19,139.63
2019-07-22,142.085
2019-07-23,141.22
2019-07-24,145.12
2019-07-25,147.18
2019-07-26,146.85
2019-07-29,141.74
2019-07-30,140.64
2019-07-31,138.94
2019-08-01,138.37
2019-08-02,133.71
2019-08-05,126.16
2019-08-06,127.26
2019-08-07,116.1
2019-08-08,123.32
2019-08-09,118.64
2019-08-12,118.1
2019-08-13,120.105
2019-08-14,114.71
2019-08-15,112.91
2019-08-16,115.06
2019-08-19,115.65
2019-08-20,116.01
2019-08-21,119.78
2019-08-22,117.935
2019-08-23,115.61
2019-08-26,114.56
2019-08-27,111.85
2019-08-28,112.2
2019-08-29,113.8
2019-08-30,112.55
2019-09-02,112.43
2019-09-03,112.25
2019-09-04,114.28
2019-09-05,115.745
2019-09-06,113.62
2019-09-09,107.53
2019-09-10,103.09
2019-09-11,99.69
2019-09-12,98.01
2019-09-13,100.37
2019-09-16,101.275
2019-09-17,103.545
2019-09-18,104.84
2019-09-19,104.95
2019-09-20,105.76
2019-09-23,105.63
2019-09-24,101.02
2019-09-25,101.295
2019-09-26,100.78
2019-09-27,98.65
2019-09-30,99.6
2019-10-01,101.23
2019-10-02,100.1
2019-10-03,104.835
2019-10-04,104.48
2019-10-07,105.7
2019-10-08,103.215
2019-10-09,106.02
2019-10-10,102.07
2019-10-11,104.53
2019-10-14,102.87
2019-10-15,105.335
2019-10-16,102.09
2019-10-17,101.88
2019-10-18,99.16
2019-10-21,100.53
2019-10-22,97.07
2019-10-23,96.84
2019-10-24,100.78
2019-10-25,100.11
2019-10-28,101.25
2019-10-29,101.15
2019-10-30,103.87
2019-10-31,101.47
2019-11-01,106.35
2019-11-04,105.76
2019-11-05,106.105
2019-11-06,115.24
2019-11-07,109.4
2019-11-08,114.13
2019-11-11,113.76
2019-11-12,115.23
2019-11-13,114.295
2019-11-14,114.415
2019-11-15,112.77
2019-11-18,116.26
2019-11-19,117
2019-11-20,117.85
2019-11-21,120
2019-11-22,121.715
2019-11-25,123.79
