date,close
2014-06-13,68.36
2014-06-16,71.91
2014-06-17,71.23
2014-06-18,72.46
2014-06-19,72.23
2014-06-20,72.54
2014-06-23,73.09
2014-06-24,72.71
2014-06-25,74.95
2014-06-26,75.01
2014-06-27,75.7
2014-06-30,75.54
2014-07-01,77.08
2014-07-02,75.4
2014-07-03,76.02
2014-07-07,73.26
2014-07-08,71.61
2014-07-09,71.39
2014-07-10,70.3
2014-07-11,69.61
2014-07-14,70.36
2014-07-15,70.63
2014-07-16,70.39
2014-07-17,69.12
2014-07-18,70.99
2014-07-21,70.54
2014-07-22,72.23
2014-07-23,73.32
2014-07-24,72.4
2014-07-25,72.15
2014-07-28,71.3
2014-07-29,71.64
2014-07-30,72.11
2014-07-31,71.03
2014-08-01,78.78
2014-08-04,78.58
2014-08-05,76.43
2014-08-06,75.78
2014-08-07,75.93
2014-08-08,76.71
2014-08-11,77.38
2014-08-12,77.62
2014-08-13,77.99
2014-08-14,78.01
2014-08-15,76.88
2014-08-18,78.03
2014-08-19,77.68
2014-08-20,76
2014-08-21,74.93
2014-08-22,76.01
2014-08-25,76.77
2014-08-26,77.79
2014-08-27,78.27
2014-08-28,78.68
2014-08-29,80.12
2014-09-02,81.09
2014-09-03,81.46
2014-09-04,81.19
2014-09-05,80.77
2014-09-08,82.81
2014-09-09,80.63
2014-09-10,79.5
2014-09-11,81.21
2014-09-12,78.81
2014-09-15,78.24
2014-09-16,79.05
2014-09-17,79.62
2014-09-18,81.22
2014-09-19,79.38
2014-09-22,78.2
2014-09-23,76.49
2014-09-24,76.99
2014-09-25,75.5
2014-09-26,75.1
2014-09-29,75.09
2014-09-30,73.68
2014-10-01,71.91
2014-10-02,72.72
2014-10-03,73.3
2014-10-06,72.24
2014-10-07,70.6
2014-10-08,72.06
2014-10-09,66.94
2014-10-10,65.03
2014-10-13,65.19
2014-10-14,65.52
2014-10-15,61.47
2014-10-16,59.74
2014-10-17,59.915
2014-10-20,59.68
2014-10-21,61.12
2014-10-22,61.35
2014-10-23,62.55
2014-10-24,63.18
2014-10-27,61.91
2014-10-28,64.48
2014-10-29,64.51
2014-10-30,64.19
2014-10-31,66.29
2014-11-03,64.5
2014-11-04,62.29
2014-11-05,63.72
2014-11-06,65.47
2014-11-07,65.63
2014-11-10,67.66
2014-11-11,67.07
2014-11-12,68.13
2014-11-13,66.73
2014-11-14,65.54
2014-11-17,64.69
2014-11-18,64.5
2014-11-19,63.26
2014-11-20,64.74
2014-11-21,64.41
2014-11-24,65.53
2014-11-25,64.22
2014-11-26,63.8
2014-11-28,58.76
2014-12-01,52.51
2014-12-02,51.25
2014-12-03,52.46
2014-12-04,53.07
2014-12-05,52.95
2014-12-08,50.77
2014-12-09,51.5
2014-12-10,48.3
2014-12-11,47.58
2014-12-12,45.25
2014-12-15,44.85
2014-12-16,44.74
2014-12-17,47.31
2014-12-18,49.45
2014-12-19,50.56
2014-12-22,50.99
2014-12-23,51.96
2014-12-24,51.55
2014-12-26,51.69
2014-12-29,52.15
2014-12-30,51.5
2014-12-31,50.53
2015-01-02,50.2
2015-01-05,49.5
2015-01-06,47.76
2015-01-07,48.08
2015-01-08,50.07
2015-01-09,47.7
2015-01-12,42.74
2015-01-13,42.59
2015-01-14,40.8
2015-01-15,39.82
2015-01-16,40.11
2015-01-20,39.19
2015-01-21,39.5
2015-01-22,40.05
2015-01-23,39.7
2015-01-26,41.7
2015-01-27,41.12
2015-01-28,40.7
2015-01-29,40.98
2015-01-30,41.02
2015-02-02,41.67
2015-02-03,44.27
2015-02-04,42.53
2015-02-05,44.21
2015-02-06,44.71
2015-02-09,45.11
2015-02-10,44.97
2015-02-11,44.43
2015-02-12,45.15
2015-02-13,46.57
2015-02-17,46.84
2015-02-18,47.66
2015-02-19,47.35
2015-02-20,47.11
2015-02-23,45.84
2015-02-24,46.88
2015-02-25,46.68
2015-02-26,46.43
2015-02-27,45.8
2015-03-02,44.74
2015-03-03,47.3
2015-03-04,46
2015-03-05,47.46
2015-03-06,47.84
2015-03-09,45.53
2015-03-10,44.81
2015-03-11,44.55
2015-03-12,44.88
2015-03-13,44.56
2015-03-16,44.6
2015-03-17,44.83
2015-03-18,45.3
2015-03-19,44.47
2015-03-20,45.08
2015-03-23,45.23
2015-03-24,46.28
2015-03-25,45.85
2015-03-26,45.62
2015-03-27,43.17
2015-03-30,43.79
2015-03-31,44.09
2015-04-01,44.48
2015-04-02,45.28
2015-04-06,45.85
2015-04-07,46.2
2015-04-08,43.76
2015-04-09,45.25
2015-04-10,45.21
2015-04-13,45.62
2015-04-14,46.9
2015-04-15,48.85
2015-04-16,47.75
2015-04-17,47.33
2015-04-20,47.42
2015-04-21,45.66
2015-04-22,44.71
2015-04-23,44.89
2015-04-24,44
2015-04-27,44.63
2015-04-28,45.71
2015-04-29,46.19
2015-04-30,45.05
2015-05-01,45.53
2015-05-04,46.58
2015-05-05,45.46
2015-05-06,45.4
2015-05-07,46.46
2015-05-08,44.15
2015-05-11,43.33
2015-05-12,43.88
2015-05-13,44.17
2015-05-14,44.04
2015-05-15,44.11
2015-05-18,44.16
2015-05-19,42.87
2015-05-20,42.08
2015-05-21,41.75
2015-05-22,41.58
2015-05-26,40.46
2015-05-27,41.36
2015-05-28,41.11
2015-05-29,41.01
2015-06-01,41.29
2015-06-02,41.99
2015-06-03,42.35
2015-06-04,41.1
2015-06-05,41.29
2015-06-08,39.94
2015-06-09,40.86
2015-06-10,42.25
2015-06-11,42.23
2015-06-12,42.27
2015-06-15,42.48
2015-06-16,43.3
2015-06-17,43.97
2015-06-18,44.05
2015-06-19,44.04
2015-06-22,45.18
2015-06-23,46.05
2015-06-24,46.8
2015-06-25,47.15
2015-06-26,47.81
2015-06-29,46.63
2015-06-30,46.5
2015-07-01,45.26
2015-07-02,44.59
2015-07-06,43.04
2015-07-07,42.96
2015-07-08,41.79
2015-07-09,42.38
2015-07-10,41.17
2015-07-13,41.55
2015-07-14,41.98
2015-07-15,39.86
2015-07-16,41.63
2015-07-17,41.1
2015-07-20,40.69
2015-07-21,39.87
2015-07-22,38.35
2015-07-23,37.82
2015-07-24,37.09
2015-07-27,37.07
2015-07-28,37.19
2015-07-29,37.15
2015-07-30,37.03
2015-07-31,36.7
2015-08-03,36.03
2015-08-04,35.7
2015-08-05,35.9
2015-08-06,36.23
2015-08-07,35.83
2015-08-10,32.3
2015-08-11,31.24
2015-08-12,30.75
2015-08-13,30.15
2015-08-14,30
2015-08-17,29.75
2015-08-18,29.92
2015-08-19,29.03
2015-08-20,28.36
2015-08-21,28.59
2015-08-24,27.86
2015-08-25,27.57
2015-08-26,26.53
2015-08-27,26.32
2015-08-28,28.01
2015-08-31,29.75
2015-09-01,29.56
2015-09-02,29.79
2015-09-03,29.5
2015-09-04,29.58
2015-09-08,30.31
2015-09-09,30.36
2015-09-10,30.55
2015-09-11,30.32
2015-09-14,28.9
2015-09-15,29.7
2015-09-16,30.9
2015-09-17,29.78
2015-09-18,28.74
2015-09-21,28.75
2015-09-22,28.22
2015-09-23,27.42
2015-09-24,27.95
2015-09-25,28.31
2015-09-28,27.98
2015-09-29,28.01
2015-09-30,27.28
2015-10-01,27.19
2015-10-02,28
2015-10-05,29.32
2015-10-06,29.875
2015-10-07,30.03
2015-10-08,33.44
2015-10-09,33.34
2015-10-12,32.31
2015-10-13,32.47
2015-10-14,32.22
2015-10-15,32.75
2015-10-16,31.22
2015-10-19,29.77
2015-10-20,30.53
2015-10-21,29.82
2015-10-22,31.66
2015-10-23,31.58
2015-10-26,30.78
2015-10-27,29.72
2015-10-28,31.36
2015-10-29,29.74
2015-10-30,30.26
2015-11-02,30.88
2015-11-03,31.46
2015-11-04,32
2015-11-05,31.5
2015-11-06,32.26
2015-11-09,29.92
2015-11-10,30.58
2015-11-11,29.94
2015-11-12,28.94
2015-11-13,29.23
2015-11-16,29.87
2015-11-17,29.2
2015-11-18,30.66
2015-11-19,30.92
2015-11-20,31.16
2015-11-23,31.05
2015-11-24,32.54
2015-11-25,32.46
2015-11-27,32.4
2015-11-30,32.75
2015-12-01,32.5
2015-12-02,31.16
2015-12-03,30.96
2015-12-04,30.71
2015-12-07,29.4
2015-12-08,28.2
2015-12-09,28.58
2015-12-10,28.35
2015-12-11,28.31
2015-12-14,27.66
2015-12-15,26.74
2015-12-16,26.21
2015-12-17,26.18
2015-12-18,25.7
2015-12-21,23.26
2015-12-22,23.88
2015-12-23,24.69
2015-12-24,24.71
2015-12-28,23.14
2015-12-29,22.66
2015-12-30,23.25
2015-12-31,22.8
2016-01-04,21.91
2016-01-05,21.77
2016-01-06,21.34
2016-01-07,19.6
2016-01-08,18.92
2016-01-11,18.38
2016-01-12,18.12
2016-01-13,16.74
2016-01-14,17.02
2016-01-15,16.19
2016-01-19,15.77
2016-01-20,14.82
2016-01-21,15.48
2016-01-22,16.38
2016-01-25,15.46
2016-01-26,16.06
2016-01-27,15.58
2016-01-28,15.54
2016-01-29,15.68
2016-02-01,15.2
2016-02-02,14.65
2016-02-03,14.99
2016-02-04,16.12
2016-02-05,15.86
2016-02-08,14.46
2016-02-09,14.12
2016-02-10,13.71
2016-02-11,13.31
2016-02-12,13.62
2016-02-16,14.55
2016-02-17,14.48
2016-02-18,15.09
2016-02-19,13.92
2016-02-22,13.89
2016-02-23,14.07
2016-02-24,14.7
2016-02-25,14.21
2016-02-26,14
2016-02-29,13.59
2016-03-01,15.4
2016-03-02,15.72
2016-03-03,16.68
2016-03-04,16.46
2016-03-07,18.01
2016-03-08,17
2016-03-09,16.61
2016-03-10,16.53
2016-03-11,17.04
2016-03-14,17.13
2016-03-15,16.37
2016-03-16,17.2
2016-03-17,18.07
2016-03-18,18.32
2016-03-21,18.53
2016-03-22,18.61
2016-03-23,17.23
2016-03-24,17.58
2016-03-28,17.3
2016-03-29,18.18
2016-03-30,18.25
2016-03-31,17.56
2016-04-01,17.48
2016-04-04,17.21
2016-04-05,17
2016-04-06,17.51
2016-04-07,17.18
2016-04-08,17
2016-04-11,17.98
2016-04-12,17.95
2016-04-13,18.87
2016-04-14,19.11
2016-04-15,19.91
2016-04-18,20.19
2016-04-19,20.5
2016-04-20,21.76
2016-04-21,21.75
2016-04-22,22.46
2016-04-25,21.92
2016-04-26,22.57
2016-04-27,22.94
2016-04-28,22.07
2016-04-29,21.85
2016-05-02,21.4
2016-05-03,20.3
2016-05-04,20.14
2016-05-05,19.79
2016-05-06,20.39
2016-05-09,18.77
2016-05-10,19.17
2016-05-11,18.1
2016-05-12,17.3
2016-05-13,14.49
2016-05-16,13.52
2016-05-17,13.95
2016-05-18,13.62
2016-05-19,12.78
2016-05-20,12.88
2016-05-23,13.33
2016-05-24,13.78
2016-05-25,14.98
2016-05-26,13.57
2016-05-27,13.36
2016-05-31,13.88
2016-06-01,13.71
2016-06-02,13.67
2016-06-03,13.54
2016-06-06,15.02
2016-06-07,14.61
2016-06-08,14.52
2016-06-09,14.44
2016-06-10,14.03
2016-06-13,14.08
2016-06-14,14.63
2016-06-15,14.45
2016-06-16,14.47
2016-06-17,15.18
2016-06-20,15.37
2016-06-21,15.19
2016-06-22,15.29
2016-06-23,16.35
2016-06-24,15.47
2016-06-27,14.17
2016-06-28,14.14
2016-06-29,14.88
2016-06-30,14.93
2016-07-01,15.46
2016-07-05,15.07
2016-07-06,15.57
2016-07-07,16.28
2016-07-08,17.41
2016-07-11,17.74
2016-07-12,17.87
2016-07-13,17.81
2016-07-14,17.9
2016-07-15,17.93
2016-07-18,17.81
2016-07-19,16.57
2016-07-20,16.69
2016-07-21,16.24
2016-07-22,16.16
2016-07-25,15.95
2016-07-26,16.48
2016-07-27,16.63
2016-07-28,16.65
2016-07-29,16.64
2016-08-01,16.12
2016-08-02,15.67
2016-08-03,16.58
2016-08-04,15.68
2016-08-05,16.53
2016-08-08,17.73
2016-08-09,17.44
2016-08-10,27.6
2016-08-11,28.35
2016-08-12,28.01
2016-08-15,29.74
2016-08-16,29.77
2016-08-17,29.99
2016-08-18,30.13
2016-08-19,30.69
2016-08-22,30
2016-08-23,30.45
2016-08-24,29.32
2016-08-25,29.01
2016-08-26,28.85
2016-08-29,28.88
2016-08-30,28.68
2016-08-31,28.09
2016-09-01,28.09
2016-09-02,28.21
2016-09-06,27.67
2016-09-07,27.56
2016-09-08,27.71
2016-09-09,26.31
2016-09-12,27.06
2016-09-13,26.9
2016-09-14,25.86
2016-09-15,26.37
2016-09-16,25.95
2016-09-19,25.33
2016-09-20,24.86
2016-09-21,25.57
2016-09-22,25.78
2016-09-23,25.23
2016-09-26,25.2
2016-09-27,25.35
2016-09-28,25.94
2016-09-29,27.38
2016-09-30,28.19
2016-10-03,28.29
2016-10-04,28.95
2016-10-05,29.32
2016-10-06,29.46
2016-10-07,29.13
2016-10-10,29.62
2016-10-11,29.69
2016-10-12,28.72
2016-10-13,28.65
2016-10-14,28.9
2016-10-17,28.52
2016-10-18,29
2016-10-19,29.02
2016-10-20,24.03
2016-10-21,21.17
2016-10-24,20.36
2016-10-25,19.75
2016-10-26,21.76
2016-10-27,21.67
2016-10-28,21.7
2016-10-31,21.79
2016-11-01,21.24
2016-11-02,20.98
2016-11-03,21.17
2016-11-04,20.82
2016-11-07,21.01
2016-11-08,20.82
2016-11-09,22.36
2016-11-10,24.5
2016-11-11,25.31
2016-11-14,25.15
2016-11-15,29.18
2016-11-16,29.58
2016-11-17,28.75
2016-11-18,29.25
2016-11-21,29.49
2016-11-22,30.11
2016-11-23,31.15
2016-11-25,31.33
2016-11-28,30.38
2016-11-29,29.86
2016-11-30,33.69
2016-12-01,34.97
2016-12-02,34.77
2016-12-05,34.98
2016-12-06,35.13
2016-12-07,36.26
2016-12-08,36.89
2016-12-09,37.36
2016-12-12,37.88
2016-12-13,37.23
2016-12-14,35.55
2016-12-15,36.65
2016-12-16,36.65
2016-12-19,36.66
2016-12-20,36.67
2016-12-21,36.86
2016-12-22,35.91
2016-12-23,35.9
2016-12-27,36.43
2016-12-28,35.52
2016-12-29,34.98
2016-12-30,34.74
2017-01-03,35.77
2017-01-04,35.97
2017-01-05,35.32
2017-01-06,36.21
2017-01-09,35.7
2017-01-10,36.84
2017-01-11,38.85
2017-01-12,37.95
2017-01-13,37.95
2017-01-17,37
2017-01-18,37.33
2017-01-19,37.5
2017-01-20,38.29
2017-01-23,37.87
2017-01-24,39.29
2017-01-25,39.94
2017-01-26,39.67
2017-01-27,39.39
2017-01-30,37.89
2017-01-31,37.82
2017-02-01,38.72
2017-02-02,37.64
2017-02-03,38.5
2017-02-06,37.84
2017-02-07,37.39
2017-02-08,36.58
2017-02-09,37.19
2017-02-10,38.45
2017-02-13,37.76
2017-02-14,37.88
2017-02-15,37.95
2017-02-16,37.63
2017-02-17,37.1
2017-02-21,37.23
2017-02-22,36.71
2017-02-23,34.93
2017-02-24,34.46
2017-02-27,36.38
2017-02-28,35
2017-03-01,36.38
2017-03-02,34.84
2017-03-03,35.12
2017-03-06,34.51
2017-03-07,33.46
2017-03-08,32.58
2017-03-09,31.37
2017-03-10,31.24
2017-03-13,32.51
2017-03-14,31.61
2017-03-15,32.78
2017-03-16,32.46
2017-03-17,31.98
2017-03-20,32.15
2017-03-21,30.42
2017-03-22,29.54
2017-03-23,33.08
2017-03-24,32.46
2017-03-27,31.54
2017-03-28,32.07
2017-03-29,32.3
2017-03-30,32.74
2017-03-31,37.87
2017-04-03,38
2017-04-04,38.11
2017-04-05,36.82
2017-04-06,37.36
2017-04-07,37.09
2017-04-10,37.78
2017-04-11,39.12
2017-04-12,36.54
2017-04-13,35.46
2017-04-17,36.21
2017-04-18,35.8
2017-04-19,35.69
2017-04-20,36.59
2017-04-21,36.32
2017-04-24,36.85
2017-04-25,37.86
2017-04-26,38.44
2017-04-27,37.76
2017-04-28,36.48
2017-05-01,36.14
2017-05-02,35.87
2017-05-03,35.51
2017-05-04,34.85
2017-05-05,35.3
2017-05-08,35.11
2017-05-09,35.17
2017-05-10,35.49
2017-05-11,34.49
2017-05-12,32.8
2017-05-15,33.06
2017-05-16,41.67
2017-05-17,38.9
2017-05-18,38.89
2017-05-19,38.39
2017-05-22,38.21
2017-05-23,37.95
2017-05-24,37.84
2017-05-25,36.66
2017-05-26,36.76
2017-05-30,35.85
2017-05-31,35.83
2017-06-01,36.51
2017-06-02,36.7
2017-06-05,36.21
2017-06-06,36.08
2017-06-07,35.97
2017-06-08,37.44
2017-06-09,39.01
2017-06-12,36.99
2017-06-13,36.98
2017-06-14,36.02
2017-06-15,36.74
2017-06-16,36.21
2017-06-19,36.25
2017-06-20,34.67
2017-06-21,33.33
2017-06-22,33.18
2017-06-23,33.23
2017-06-26,33.55
2017-06-27,33.74
2017-06-28,35.45
2017-06-29,34.89
2017-06-30,34.5
2017-07-03,34.88
2017-07-05,34.38
2017-07-06,33.72
2017-07-07,33.64
2017-07-10,33.8
2017-07-11,34.8
2017-07-12,35.62
2017-07-13,35.18
2017-07-14,35.45
2017-07-17,35.205
2017-07-18,34.32
2017-07-19,34.87
2017-07-20,34.96
2017-07-21,33.8
2017-07-24,33.34
2017-07-25,33.59
2017-07-26,30.99
2017-07-27,29.72
2017-07-28,29.49
2017-07-31,28.59
2017-08-01,28.6
2017-08-02,26.81
2017-08-03,27.86
2017-08-04,28.33
2017-08-07,28.65
2017-08-08,28.43
2017-08-09,27.5
2017-08-10,26.49
2017-08-11,26.87
2017-08-14,27.2
2017-08-15,26.35
2017-08-16,26.31
2017-08-17,25.65
2017-08-18,25.52
2017-08-21,25.35
2017-08-22,26.01
2017-08-23,25.96
2017-08-24,25.96
2017-08-25,26.36
2017-08-28,26.65
2017-08-29,27.26
2017-08-30,28.41
2017-08-31,27.09
2017-09-01,26.75
2017-09-05,26.82
2017-09-06,26.95
2017-09-07,27.41
2017-09-08,27.28
2017-09-11,28.5
2017-09-12,28.33
2017-09-13,29.13
2017-09-14,29.63
2017-09-15,29.88
2017-09-18,29.67
2017-09-19,29.84
2017-09-20,30
2017-09-21,29.5
2017-09-22,29.7
2017-09-25,30.86
2017-09-26,31.16
2017-09-27,32.03
2017-09-28,31.85
2017-09-29,31.49
2017-10-02,32.32
2017-10-03,32.44
2017-10-04,31.73
2017-10-05,32.24
2017-10-06,32.1
2017-10-09,32.03
2017-10-10,32.14
2017-10-11,32.04
2017-10-12,31.98
2017-10-13,31.9
2017-10-16,31.9
2017-10-17,31.8
2017-10-18,31.95
2017-10-19,31.62
2017-10-20,32.14
2017-10-23,31.35
2017-10-24,31.29
2017-10-25,31.29
2017-10-26,31.76
2017-10-27,31.82
2017-10-30,31.26
2017-10-31,32.07
2017-11-01,30.8
2017-11-02,30.95
2017-11-03,26.79
2017-11-06,26.64
2017-11-07,25.97
2017-11-08,26.3
2017-11-09,26.45
2017-11-10,26.61
2017-11-13,26.51
2017-11-14,26.38
2017-11-15,25.01
2017-11-16,25.33
2017-11-17,25.79
2017-11-20,25.3
2017-11-21,26.39
2017-11-22,26.3
2017-11-24,26.36
2017-11-27,25.91
2017-11-28,27.06
2017-11-29,28.28
2017-11-30,27.8
2017-12-01,28.52
2017-12-04,28.64
2017-12-05,27.94
2017-12-06,26.93
2017-12-07,27.37
2017-12-08,27.08
2017-12-11,27.02
2017-12-12,27.79
2017-12-13,28.27
2017-12-14,27.59
2017-12-15,28.13
2017-12-18,28.88
2017-12-19,28.64
2017-12-20,29
2017-12-21,30.13
2017-12-22,29.36
2017-12-26,29.41
2017-12-27,29.26
2017-12-28,29.91
2017-12-29,29.57
2018-01-02,30
2018-01-03,29
2018-01-04,29.61
2018-01-05,30.31
2018-01-08,30.54
2018-01-09,30.4
2018-01-10,30.44
2018-01-11,32.57
2018-01-12,33.1
2018-01-16,33.51
2018-01-17,33.9
2018-01-18,33.76
2018-01-19,34.58
2018-01-22,34.4
2018-01-23,34.63
2018-01-24,34.72
2018-01-25,35
2018-01-26,34.48
2018-01-29,34.68
2018-01-30,34.36
2018-01-31,34.21
2018-02-01,33.69
2018-02-02,32.02
2018-02-05,30.57
2018-02-06,31.19
2018-02-07,30.91
2018-02-08,30.27
2018-02-09,30.66
2018-02-12,30.62
2018-02-13,30.7
2018-02-14,30.99
2018-02-15,30.96
2018-02-16,30.51
2018-02-20,30.26
2018-02-21,30.47
2018-02-22,30.71
2018-02-23,31.04
2018-02-26,32.02
2018-02-27,31.61
2018-02-28,29.74
2018-03-01,29.24
2018-03-02,30.28
2018-03-05,30.52
2018-03-06,30.91
2018-03-07,31.81
2018-03-08,31.76
2018-03-09,32.59
2018-03-12,32.31
2018-03-13,33.11
2018-03-14,32.74
2018-03-15,32.37
2018-03-16,32.33
2018-03-19,32.23
2018-03-20,32.76
2018-03-21,39.92
2018-03-22,41.48
2018-03-23,39.29
2018-03-26,40.48
2018-03-27,39.26
2018-03-28,38.81
2018-03-29,38.95
2018-04-02,38.41
2018-04-03,38.49
2018-04-04,38.73
2018-04-05,37.74
2018-04-06,37.32
2018-04-09,36.5
2018-04-10,36.94
2018-04-11,36.6
2018-04-12,36.47
2018-04-13,36.56
2018-04-16,37.09
2018-04-17,38.03
2018-04-18,38.46
2018-04-19,37.94
2018-04-20,37.53
2018-04-23,36.77
2018-04-24,36.15
2018-04-25,36.15
2018-04-26,36.34
2018-04-27,36.9
2018-04-30,36.3
2018-05-01,36.32
2018-05-02,36.75
2018-05-03,36.35
2018-05-04,36.79
2018-05-07,37.95
2018-05-08,39.1
2018-05-09,37.89
2018-05-10,37.8
2018-05-11,37.93
2018-05-14,37.59
2018-05-15,39.06
2018-05-16,38.93
2018-05-17,39.8
2018-05-18,40.78
2018-05-21,42.01
2018-05-22,40.09
2018-05-23,39.9
2018-05-24,40.05
2018-05-25,39.54
2018-05-29,39.79
2018-05-30,40.79
2018-05-31,39.02
2018-06-01,38.69
2018-06-04,39.27
2018-06-05,39.86
2018-06-06,39.53
2018-06-07,39.65
2018-06-08,39.77
2018-06-11,39.86
2018-06-12,39.85
2018-06-13,39.7
2018-06-14,39.9
2018-06-15,40.31
2018-06-18,40.67
2018-06-19,40.31
2018-06-20,40.51
2018-06-21,39.1
2018-06-22,39.53
2018-06-25,39.08
2018-06-26,39.52
2018-06-27,38.65
2018-06-28,36.83
2018-06-29,38.2
2018-07-02,39.01
2018-07-03,39.46
2018-07-05,40.51
2018-07-06,41.01
2018-07-09,42.19
2018-07-10,41.71
2018-07-11,41.38
2018-07-12,41.85
2018-07-13,42.38
2018-07-16,41.9
2018-07-17,42.05
2018-07-18,42.33
2018-07-19,42.55
2018-07-20,42.64
2018-07-23,44.05
2018-07-24,43.24
2018-07-25,42.43
2018-07-26,42.39
2018-07-27,40.6
2018-07-30,40.3
2018-07-31,41.34
2018-08-01,41.18
2018-08-02,42.12
2018-08-03,41.54
2018-08-06,41.82
2018-08-07,44.47
2018-08-08,48.68
2018-08-09,47.67
2018-08-10,46.57
2018-08-13,45.9
2018-08-14,46.32
2018-08-15,45.32
2018-08-16,46.76
2018-08-17,46.4
2018-08-20,46.84
2018-08-21,47.12
2018-08-22,48.34
2018-08-23,48.59
2018-08-24,48.56
2018-08-27,47.37
2018-08-28,46.99
2018-08-29,46.64
2018-08-30,45.91
2018-08-31,45.89
2018-09-04,47.01
2018-09-05,46.9
2018-09-06,45
2018-09-07,45.04
2018-09-10,44.87
2018-09-11,44.56
2018-09-12,43.93
2018-09-13,43.28
2018-09-14,43.53
2018-09-17,42.15
2018-09-18,41.96
2018-09-19,41.2
2018-09-20,41.57
2018-09-21,41.12
2018-09-24,40.4
2018-09-25,40.61
2018-09-26,39.98
2018-09-27,39.87
2018-09-28,40.07
2018-10-01,39.68
2018-10-02,38.75
2018-10-03,39.39
2018-10-04,38.82
2018-10-05,38.65
2018-10-08,38.39
2018-10-09,38.71
2018-10-10,37.83
2018-10-11,36.72
2018-10-12,36.46
2018-10-15,36.59
2018-10-16,37.52
2018-10-17,36.76
2018-10-18,36.02
2018-10-19,35.92
2018-10-22,35.37
2018-10-23,34.36
2018-10-24,31.88
2018-10-25,32.02
2018-10-26,31.85
2018-10-29,30.74
2018-10-30,30.98
2018-10-31,31.78
2018-11-01,33.54
2018-11-02,34.78
2018-11-05,39.87
2018-11-06,42.45
2018-11-07,42.1
2018-11-08,41.61
2018-11-09,39.81
2018-11-12,39.72
2018-11-13,39.27
2018-11-14,40.26
2018-11-15,39.89
2018-11-16,39.44
2018-11-19,38.5
2018-11-20,36.7
2018-11-21,37.63
2018-11-23,36.91
2018-11-26,36.84
2018-11-27,35.63
2018-11-28,37.92
2018-11-29,36.72
2018-11-30,36.23
2018-12-03,37.04
2018-12-04,34.71
2018-12-06,35.5
2018-12-07,35.03
2018-12-10,34.6
2018-12-11,34.52
2018-12-12,35.46
2018-12-13,34.03
2018-12-14,32.27
2018-12-17,31.94
2018-12-18,30.96
2018-12-19,29.7
2018-12-20,28.06
2018-12-21,27.93
2018-12-24,27.75
2018-12-26,28.43
2018-12-27,28.35
2018-12-28,27.95
2018-12-31,27.84
2019-01-02,29.5
2019-01-03,29
2019-01-04,30.17
2019-01-07,30.53
2019-01-08,31.78
2019-01-09,32.31
2019-01-10,32.35
2019-01-11,32.04
2019-01-14,31.39
2019-01-15,31.39
2019-01-16,31.71
2019-01-17,31.99
2019-01-18,32.78
2019-01-22,31.83
2019-01-23,31.93
2019-01-24,32.03
2019-01-25,32.26
2019-01-28,31.28
2019-01-29,31.56
2019-01-30,32.05
2019-01-31,32.91
2019-02-01,32.17
2019-02-04,32.59
2019-02-05,32.51
2019-02-06,33.23
2019-02-07,32.05
2019-02-08,32.05
2019-02-11,32.32
2019-02-12,33.21
2019-02-13,33.9
2019-02-14,33.89
2019-02-15,34.8
2019-02-19,35.7
2019-02-20,36.32
2019-02-21,36.28
2019-02-22,36.87
2019-02-25,36.64
2019-02-26,35.28
2019-02-27,35.08
2019-02-28,35.37
2019-03-01,35.02
2019-03-04,33.89
2019-03-05,33.33
2019-03-06,32.2
2019-03-07,31.7
2019-03-08,42.17
2019-03-11,41.13
2019-03-12,40.41
2019-03-13,39.67
2019-03-14,40.37
2019-03-15,40.57
2019-03-18,42
2019-03-19,41.22
2019-03-20,41.33
2019-03-21,41.07
2019-03-22,38.76
2019-03-25,38.91
2019-03-26,38.47
2019-03-27,38.98
2019-03-28,39.49
2019-03-29,38.92
2019-04-01,41.05
2019-04-02,40.26
2019-04-03,41.13
2019-04-04,41.8
2019-04-05,42.59
2019-04-08,42.43
2019-04-09,41.96
2019-04-10,43.37
2019-04-11,44.01
2019-04-12,44.15
2019-04-15,43.79
2019-04-16,43.87
2019-04-17,45
2019-04-18,44.99
2019-04-22,43.86
2019-04-23,44.82
2019-04-24,44.5
2019-04-25,43.17
2019-04-26,43.66
2019-04-29,43.8
2019-04-30,42.89
2019-05-01,42.08
2019-05-02,41.39
2019-05-03,43.38
2019-05-06,43.5
2019-05-07,39.02
2019-05-08,37.16
2019-05-09,36.9
2019-05-10,37.07
2019-05-13,35.95
2019-05-14,35.67
2019-05-15,35.72
2019-05-16,35.73
2019-05-17,35.03
2019-05-20,35.29
2019-05-21,35.73
2019-05-22,35.25
2019-05-23,33.51
2019-05-24,33.99
2019-05-28,33.65
2019-05-29,33.65
2019-05-30,33.67
2019-05-31,32.22
2019-06-03,32.45
2019-06-04,34.45
2019-06-05,34.41
2019-06-06,33.89
2019-06-07,34.19
2019-06-10,35.8
2019-06-11,34.54
2019-06-12,34.18
2019-06-13,34.54
2019-06-14,33.89
2019-06-17,33.74
2019-06-18,34.825
2019-06-19,34.87
2019-06-20,35.81
2019-06-21,36.81
2019-06-24,36.755
2019-06-25,36.7
2019-06-26,37.71
2019-06-27,38.525
2019-06-28,38.28
2019-07-01,37.575
2019-07-02,36.345
2019-07-03,37.6
2019-07-04,37.6
2019-07-05,36.985
2019-07-08,37.04
2019-07-09,36.97
2019-07-10,36.245
2019-07-11,33.545
2019-07-12,33.325
2019-07-15,33.3
2019-07-16,33.04
2019-07-17,32.5
2019-07-18,31.8
2019-07-19,31.39
2019-07-22,31.635
2019-07-23,31.75
2019-07-24,32.63
2019-07-25,31.93
2019-07-26,32.61
2019-07-29,32.59
2019-07-30,34.07
2019-07-31,33.98
2019-08-01,32.74
2019-08-02,32.095
2019-08-05,31.21
2019-08-06,31.4
2019-08-07,33.68
2019-08-08,33.74
2019-08-09,32.65
2019-08-12,32.08
2019-08-13,32.83
2019-08-14,32.08
2019-08-15,31.8
2019-08-16,32.67
2019-08-19,32.875
2019-08-20,32.055
2019-08-21,31.89
2019-08-22,31.22
2019-08-23,30.12
2019-08-26,29.91
2019-08-27,29.835
2019-08-28,30.89
2019-08-29,31.785
2019-08-30,32.47
2019-09-02,32.44
2019-09-03,31
2019-09-04,31.36
2019-09-05,33.035
2019-09-06,31.965
2019-09-09,33.07
2019-09-10,34.06
2019-09-11,35.65
2019-09-12,35.05
2019-09-13,36.14
2019-09-16,36.8
2019-09-17,36.385
2019-09-18,36.36
2019-09-19,36.385
2019-09-20,36.455
2019-09-23,36.51
2019-09-24,36.135
2019-09-25,36.275
2019-09-26,34.7
2019-09-27,34.73
2019-09-30,34.71
2019-10-01,33.65
2019-10-02,32.85
2019-10-03,32.57
2019-10-04,32.99
2019-10-07,32.95
2019-10-08,31.95
2019-10-09,32.01
2019-10-10,31.735
2019-10-11,32.65
2019-10-14,32.165
2019-10-15,32.98
2019-10-16,32.8
2019-10-17,33.02
2019-10-18,32.97
2019-10-21,33.285
2019-10-22,34.45
2019-10-23,35.24
2019-10-24,34.475
2019-10-25,34.7
2019-10-28,34.93
2019-10-29,35.46
2019-10-30,35.33
2019-10-31,34.38
2019-11-01,35.85
2019-11-04,36.34
2019-11-05,35.985
2019-11-06,36.15
2019-11-07,40.69
2019-11-08,40.96
2019-11-11,41.845
2019-11-12,41.395
2019-11-13,40
2019-11-14,39.61
2019-11-15,39.39
2019-11-18,38.905
2019-11-19,39.22
2019-11-20,38.91
2019-11-21,38.65
2019-11-22,39.165
2019-11-25,40.01
