date,close
2014-06-13,99.6116
2014-06-16,99.6032
2014-06-17,99.2669
2014-06-18,99.8386
2014-06-19,99.4855
2014-06-20,99.6788
2014-06-23,99.6704
2014-06-24,100.0908
2014-06-25,100.1917
2014-06-26,100.3767
2014-06-27,100.3598
2014-06-30,99.9815
2014-07-01,99.8804
2014-07-02,99.5263
2014-07-03,99.4252
2014-07-07,99.6022
2014-07-08,99.9732
2014-07-09,100.1334
2014-07-10,100.0575
2014-07-11,100.3694
2014-07-14,99.1807
2014-07-15,100.0491
2014-07-16,100.2851
2014-07-17,100.6645
2014-07-18,100.5296
2014-07-21,100.5296
2014-07-22,100.6055
2014-07-23,100.7235
2014-07-24,100.3273
2014-07-25,100.7151
2014-07-28,100.5971
2014-07-29,100.6898
2014-07-30,100.2261
2014-07-31,99.6612
2014-08-01,100.4638
2014-08-04,100.4891
2014-08-05,100.5906
2014-08-06,100.413
2014-08-07,100.6751
2014-08-08,100.6498
2014-08-11,100.692
2014-08-12,100.6413
2014-08-13,100.8442
2014-08-14,100.9542
2014-08-15,101.3093
2014-08-18,101.0133
2014-08-19,101.0133
2014-08-20,100.785
2014-08-21,101.1317
2014-08-22,101.2585
2014-08-25,101.4192
2014-08-26,101.3177
2014-08-27,101.6559
2014-08-28,101.8758
2014-08-29,101.6644
2014-09-02,101.4677
2014-09-03,101.6033
2014-09-04,100.8826
2014-09-05,100.8996
2014-09-08,100.73
2014-09-09,100.4587
2014-09-10,100.2976
2014-09-11,100.2213
2014-09-12,99.738
2014-09-15,99.7634
2014-09-16,99.7464
2014-09-17,99.4751
2014-09-18,99.6532
2014-09-19,100.0432
2014-09-22,100.1365
2014-09-23,100.2976
2014-09-24,100.0602
2014-09-25,100.3569
2014-09-26,100.1365
2014-09-29,100.0941
2014-09-30,100.2382
2014-10-01,100.8461
2014-10-02,100.8376
2014-10-03,101.1267
2014-10-06,101.1777
2014-10-07,101.5434
2014-10-08,102.0621
2014-10-09,101.6369
2014-10-10,101.7219
2014-10-13,101.9855
2014-10-14,102.2151
2014-10-15,102.2916
2014-10-16,102.0195
2014-10-17,102.0195
2014-10-20,102.2066
2014-10-21,102.1471
2014-10-22,101.977
2014-10-23,101.7814
2014-10-24,101.824
2014-10-27,101.9515
2014-10-28,101.6114
2014-10-29,101.4923
2014-10-30,100.7526
2014-10-31,101.4753
2014-11-03,101.2749
2014-11-04,101.4199
2014-11-05,101.2323
2014-11-06,100.9253
2014-11-07,101.5649
2014-11-10,101.0532
2014-11-11,101.0447
2014-11-12,101.0362
2014-11-13,100.9253
2014-11-14,101.0532
2014-11-17,100.8145
2014-11-18,100.8998
2014-11-19,100.3626
2014-11-20,100.7463
2014-11-21,101.1812
2014-11-24,101.3432
2014-11-25,101.778
2014-11-26,102.1276
2014-11-28,102.4005
2014-12-01,102.0458
2014-12-02,101.3617
2014-12-03,101.4643
2014-12-04,101.6268
2014-12-05,101.2078
2014-12-08,101.6867
2014-12-09,101.7722
2014-12-10,101.738
2014-12-11,101.6354
2014-12-12,101.7978
2014-12-15,102.0372
2014-12-16,102.003
2014-12-17,102.0287
2014-12-18,102.1313
2014-12-19,102.08
2014-12-22,102.4049
2014-12-23,101.6268
2014-12-24,101.9545
2014-12-26,102.0317
2014-12-29,102.2289
2014-12-30,102.3146
2014-12-31,102.3832
2015-01-02,102.7433
2015-01-05,103.1635
2015-01-06,103.5836
2015-01-07,103.7208
2015-01-08,103.3864
2015-01-09,103.6607
2015-01-12,103.858
2015-01-13,103.9523
2015-01-14,104.1323
2015-01-15,104.6725
2015-01-16,104.0895
2015-01-20,104.3295
2015-01-21,104.2867
2015-01-22,104.2352
2015-01-23,104.844
2015-01-26,104.8183
2015-01-27,104.8954
2015-01-28,105.6071
2015-01-29,105.3584
2015-01-30,106.2244
2015-02-02,106.3235
2015-02-03,105.4637
2015-02-04,105.6099
2015-02-05,105.2746
2015-02-06,104.1741
2015-02-09,104.2429
2015-02-10,103.9592
2015-02-11,104.028
2015-02-12,104.2945
2015-02-13,103.8818
2015-02-17,103.4004
2015-02-18,103.7701
2015-02-19,103.7529
2015-02-20,103.9076
2015-02-23,104.2601
2015-02-24,104.9393
2015-02-25,105.0339
2015-02-26,104.4665
2015-02-27,104.7158
2015-03-02,103.8084
2015-03-03,103.748
2015-03-04,103.6791
2015-03-05,103.817
2015-03-06,102.7136
2015-03-09,103.1274
2015-03-10,103.2912
2015-03-11,103.817
2015-03-12,103.7136
2015-03-13,103.4205
2015-03-16,103.5239
2015-03-17,103.6963
2015-03-18,104.9722
2015-03-19,104.4377
2015-03-20,104.7308
2015-03-23,104.9722
2015-03-24,105.1273
2015-03-25,104.7825
2015-03-26,104.136
2015-03-27,104.5497
2015-03-30,104.7308
2015-03-31,104.9204
2015-04-01,105.2221
2015-04-02,105.0492
2015-04-06,105.1875
2015-04-07,105.5678
2015-04-08,105.5333
2015-04-09,104.9973
2015-04-10,105.1443
2015-04-13,105.1097
2015-04-14,105.3517
2015-04-15,105.4209
2015-04-16,105.3604
2015-04-17,105.6456
2015-04-20,105.395
2015-04-21,105.369
2015-04-22,104.6862
2015-04-23,104.9541
2015-04-24,105.1529
2015-04-27,105.0751
2015-04-28,104.4528
2015-04-29,103.5884
2015-04-30,103.6748
2015-05-01,103.1028
2015-05-04,102.7735
2015-05-05,102.6001
2015-05-06,102.158
2015-05-07,102.5654
2015-05-08,103.1548
2015-05-11,102.1147
2015-05-12,101.9673
2015-05-13,101.872
2015-05-14,102.2187
2015-05-15,102.9295
2015-05-18,102.1407
2015-05-19,101.5946
2015-05-20,101.716
2015-05-21,102.2014
2015-05-22,102.132
2015-05-26,102.5828
2015-05-27,102.6868
2015-05-28,102.4701
2015-05-29,102.5134
2015-06-01,101.9386
2015-06-02,101.4171
2015-06-03,100.7652
2015-06-04,101.2867
2015-06-05,100.7739
2015-06-08,100.7043
2015-06-09,100.2524
2015-06-10,99.9829
2015-06-11,100.8695
2015-06-12,100.6957
2015-06-15,100.6783
2015-06-16,100.9303
2015-06-17,100.9216
2015-06-18,100.7391
2015-06-19,101.278
2015-06-22,100.4784
2015-06-23,100.2524
2015-06-24,100.5305
2015-06-25,100.3654
2015-06-26,99.9047
2015-06-29,100.7739
2015-06-30,100.5827
2015-07-01,100.2605
2015-07-02,100.644
2015-07-06,101.045
2015-07-07,101.4634
2015-07-08,101.6029
2015-07-09,100.9317
2015-07-10,100.2866
2015-07-13,100.0687
2015-07-14,100.1559
2015-07-15,100.4174
2015-07-16,100.5743
2015-07-17,100.644
2015-07-20,100.4087
2015-07-21,100.6179
2015-07-22,100.7486
2015-07-23,101.045
2015-07-24,101.0014
2015-07-27,101.0101
2015-07-28,100.9317
2015-07-29,100.8445
2015-07-30,100.8968
2015-07-31,101.4198
2015-08-03,101.6554
2015-08-04,101.1396
2015-08-05,100.7463
2015-08-06,100.9386
2015-08-07,101.2882
2015-08-10,100.8861
2015-08-11,101.3057
2015-08-12,101.1484
2015-08-13,100.7987
2015-08-14,100.8949
2015-08-17,101.2183
2015-08-18,100.8337
2015-08-19,101.3232
2015-08-20,101.3844
2015-08-21,101.4106
2015-08-24,101.1309
2015-08-25,100.6151
2015-08-26,100.554
2015-08-27,100.6501
2015-08-28,100.8337
2015-08-31,100.5802
2015-09-01,101.1893
2015-09-02,101.0403
2015-09-03,101.5225
2015-09-04,101.7504
2015-09-08,101.277
2015-09-09,101.4962
2015-09-10,101.2945
2015-09-11,101.3647
2015-09-14,101.3559
2015-09-15,100.5932
2015-09-16,100.7773
2015-09-17,101.6102
2015-09-18,101.917
2015-09-21,101.3997
2015-09-22,101.8381
2015-09-23,101.7767
2015-09-24,101.7943
2015-09-25,101.4874
2015-09-28,101.6628
2015-09-29,101.7943
2015-09-30,101.7767
2015-10-01,101.754
2015-10-02,102.2024
2015-10-05,101.9298
2015-10-06,102.132
2015-10-07,102.4925
2015-10-08,102.0881
2015-10-09,102.132
2015-10-12,102.5453
2015-10-13,102.4661
2015-10-14,102.8706
2015-10-15,102.8266
2015-10-16,102.8618
2015-10-19,102.853
2015-10-20,102.6596
2015-10-21,103.1695
2015-10-22,103.3893
2015-10-23,103.0113
2015-10-26,103.1959
2015-10-27,103.2223
2015-10-28,102.8178
2015-10-29,102.0969
2015-10-30,102.3606
2015-11-02,101.9204
2015-11-03,101.9292
2015-11-04,101.8146
2015-11-05,101.8411
2015-11-06,101.1798
2015-11-09,101.0122
2015-11-10,101.2679
2015-11-11,101.2591
2015-11-12,101.2238
2015-11-13,101.5236
2015-11-16,101.5413
2015-11-17,101.6471
2015-11-18,101.6735
2015-11-19,101.9733
2015-11-20,101.9557
2015-11-23,101.991
2015-11-24,102.0262
2015-11-25,102.1232
2015-11-27,102.1585
2015-11-30,102.2026
2015-12-01,102.9705
2015-12-02,102.723
2015-12-03,101.3612
2015-12-04,101.9094
2015-12-07,102.0863
2015-12-08,101.9537
2015-12-09,101.9271
2015-12-10,101.6884
2015-12-11,101.8652
2015-12-14,101.1136
2015-12-15,101.1225
2015-12-16,101.1048
2015-12-17,101.2197
2015-12-18,101.2197
2015-12-21,101.2905
2015-12-22,101.1578
2015-12-23,101.2463
2015-12-24,101.5763
2015-12-28,101.4522
2015-12-29,100.929
2015-12-30,100.929
2015-12-31,101.0975
2016-01-04,101.0443
2016-01-05,101.0975
2016-01-06,101.4965
2016-01-07,101.5763
2016-01-08,101.6561
2016-01-11,101.328
2016-01-12,101.5586
2016-01-13,101.8689
2016-01-14,101.3635
2016-01-15,101.2127
2016-01-19,100.7605
2016-01-20,100.9113
2016-01-21,100.6186
2016-01-22,100.6807
2016-01-25,100.5743
2016-01-26,100.8581
2016-01-27,100.5832
2016-01-28,100.6984
2016-01-29,101.2216
2016-02-01,100.8989
2016-02-02,101.0857
2016-02-03,100.8367
2016-02-04,100.8812
2016-02-05,100.8634
2016-02-08,101.3881
2016-02-09,101.0412
2016-02-10,101.1658
2016-02-11,101.5037
2016-02-12,100.9345
2016-02-16,100.4543
2016-02-17,100.4276
2016-02-18,101.2458
2016-02-19,101.1747
2016-02-22,101.3792
2016-02-23,101.5838
2016-02-24,101.6816
2016-02-25,102.2508
2016-02-26,102.2152
2016-02-29,102.2864
2016-03-01,101.7289
2016-03-02,101.9341
2016-03-03,102.4157
2016-03-04,102.3979
2016-03-07,102.5138
2016-03-08,103.0579
2016-03-09,102.942
2016-03-10,103.3701
2016-03-11,103.6645
2016-03-14,103.9677
2016-03-15,103.9321
2016-03-16,104.4316
2016-03-17,104.7527
2016-03-18,104.9935
2016-03-21,104.8686
2016-03-22,104.6724
2016-03-23,105.1987
2016-03-24,105.1541
2016-03-28,105.2165
2016-03-29,105.6892
2016-03-30,105.5644
2016-03-31,105.9836
2016-04-01,106.3255
2016-04-04,106.3344
2016-04-05,106.6743
2016-04-06,106.5849
2016-04-07,106.8711
2016-04-08,106.6296
2016-04-11,106.6207
2016-04-12,106.2002
2016-04-13,106.567
2016-04-14,106.4954
2016-04-15,106.9427
2016-04-18,107.0589
2016-04-19,107.2557
2016-04-20,106.9605
2016-04-21,106.9158
2016-04-22,107.0321
2016-04-25,106.7817
2016-04-26,106.7369
2016-04-27,107.4167
2016-04-28,107.5151
2016-04-29,107.6314
2016-05-02,107.4921
2016-05-03,107.6804
2016-05-04,107.501
2016-05-05,107.7163
2016-05-06,107.4831
2016-05-09,107.3755
2016-05-10,107.5549
2016-05-11,107.6714
2016-05-12,107.4472
2016-05-13,107.6445
2016-05-16,107.2858
2016-05-17,107.2499
2016-05-18,106.3351
2016-05-19,106.5862
2016-05-20,106.658
2016-05-23,106.658
2016-05-24,106.4786
2016-05-25,106.6669
2016-05-26,106.9719
2016-05-27,106.8912
2016-05-31,107.0795
2016-06-01,107.1552
2016-06-02,107.3711
2016-06-03,108.2345
2016-06-06,107.9737
2016-06-07,108.1356
2016-06-08,108.4953
2016-06-09,108.6482
2016-06-10,108.7741
2016-06-13,108.6122
2016-06-14,108.3694
2016-06-15,108.7741
2016-06-16,108.936
2016-06-17,108.6122
2016-06-20,108.4773
2016-06-21,108.3784
2016-06-22,108.5763
2016-06-23,108.4683
2016-06-24,108.981
2016-06-27,109.4397
2016-06-28,110.0423
2016-06-29,110.0063
2016-06-30,110.3931
2016-07-01,110.9715
2016-07-05,111.3503
2016-07-06,111.5487
2016-07-07,111.5667
2016-07-08,112.189
2016-07-11,111.9004
2016-07-12,111.2691
2016-07-13,111.702
2016-07-14,111.4314
2016-07-15,111.0076
2016-07-18,111.0076
2016-07-19,111.206
2016-07-20,111.1699
2016-07-21,111.2962
2016-07-22,111.233
2016-07-25,111.1699
2016-07-26,111.0617
2016-07-27,111.5216
2016-07-28,111.4134
2016-07-29,111.8192
2016-08-01,111.1888
2016-08-02,110.5649
2016-08-03,110.7096
2016-08-04,111.1797
2016-08-05,110.7276
2016-08-08,110.8
2016-08-09,111.451
2016-08-10,111.7675
2016-08-11,111.3967
2016-08-12,111.9031
2016-08-15,111.5595
2016-08-16,111.3606
2016-08-17,111.668
2016-08-18,111.9393
2016-08-19,111.6047
2016-08-22,111.9845
2016-08-23,112.1111
2016-08-24,112.0387
2016-08-25,111.9302
2016-08-26,111.5776
2016-08-29,112.2105
2016-08-30,112.0659
2016-08-31,112.0206
2016-09-01,112.0204
2016-09-02,111.821
2016-09-06,112.2108
2016-09-07,112.0567
2016-09-08,111.268
2016-09-09,110.434
2016-09-12,110.4431
2016-09-13,110.0804
2016-09-14,110.153
2016-09-15,110.2255
2016-09-16,110.3524
2016-09-19,110.3161
2016-09-20,110.4612
2016-09-21,111.0232
2016-09-22,111.4765
2016-09-23,111.3949
2016-09-26,111.5672
2016-09-27,111.8391
2016-09-28,111.9116
2016-09-29,111.8663
2016-09-30,111.6669
2016-10-03,111.3503
2016-10-04,110.8323
2016-10-05,110.7141
2016-10-06,110.7232
2016-10-07,110.9868
2016-10-10,110.9868
2016-10-11,110.6414
2016-10-12,110.7868
2016-10-13,111.0595
2016-10-14,110.5414
2016-10-17,110.905
2016-10-18,111.1777
2016-10-19,111.3231
2016-10-20,111.2867
2016-10-21,111.3503
2016-10-24,111.0322
2016-10-25,110.9504
2016-10-26,110.4869
2016-10-27,109.987
2016-10-28,109.8597
2016-10-31,109.9597
2016-11-01,109.8216
2016-11-02,109.9856
2016-11-03,109.7669
2016-11-04,110.095
2016-11-07,110.0221
2016-11-08,109.776
2016-11-09,108.163
2016-11-10,108.0719
2016-11-11,107.6071
2016-11-14,107.0512
2016-11-15,107.3793
2016-11-16,107.5342
2016-11-17,106.8507
2016-11-18,106.2493
2016-11-21,106.3586
2016-11-22,106.632
2016-11-23,106.2401
2016-11-25,106.2493
2016-11-28,106.7323
2016-11-29,106.8781
2016-11-30,106.4771
2016-12-01,105.8802
2016-12-02,106.3645
2016-12-05,106.5929
2016-12-06,106.5838
2016-12-07,107.0315
2016-12-08,106.5929
2016-12-09,106.1817
2016-12-12,106.0812
2016-12-13,106.3188
2016-12-14,105.6426
2016-12-15,105.7157
2016-12-16,105.6334
2016-12-19,106.1452
2016-12-20,106.0812
2016-12-21,106.4193
2016-12-22,106.4263
2016-12-23,106.5913
2016-12-27,106.3989
2016-12-28,106.7929
2016-12-29,107.2052
2016-12-30,107.3701
2017-01-03,107.4617
2017-01-04,107.8283
2017-01-05,108.4055
2017-01-06,107.8374
2017-01-09,108.0482
2017-01-10,107.984
2017-01-11,108.149
2017-01-12,108.1398
2017-01-13,107.9199
2017-01-17,108.3872
2017-01-18,107.6725
2017-01-19,107.306
2017-01-20,107.4984
2017-01-23,107.9932
2017-01-24,107.6725
2017-01-25,107.2602
2017-01-26,107.3884
2017-01-27,107.5167
2017-01-30,107.3335
2017-01-31,107.5259
2017-02-01,107.3934
2017-02-02,107.421
2017-02-03,107.5404
2017-02-06,107.8803
2017-02-07,108.0641
2017-02-08,108.4408
2017-02-09,108.009
2017-02-10,107.9814
2017-02-13,107.9355
2017-02-14,107.6782
2017-02-15,107.5955
2017-02-16,107.8987
2017-02-17,108.1743
2017-02-21,108.2203
2017-02-22,108.303
2017-02-23,108.5786
2017-02-24,109.1298
2017-02-27,108.8726
2017-02-28,108.9461
2017-03-01,108.302
2017-03-02,108.1362
2017-03-03,108.2468
2017-03-06,108.0533
2017-03-07,107.519
2017-03-08,107.1873
2017-03-09,106.6069
2017-03-10,106.8741
2017-03-13,106.5148
2017-03-14,106.6069
2017-03-15,107.5282
2017-03-16,107.3716
2017-03-17,107.6203
2017-03-20,107.8823
2017-03-21,108.1362
2017-03-22,108.4126
2017-03-23,108.3389
2017-03-24,108.4494
2017-03-27,108.6797
2017-03-28,108.4494
2017-03-29,108.7995
2017-03-30,108.5139
2017-03-31,108.6245
2017-04-03,109.1124
2017-04-04,108.8261
2017-04-05,108.9646
2017-04-06,109.0662
2017-04-07,108.7983
2017-04-10,109.0016
2017-04-11,109.5096
2017-04-12,109.8699
2017-04-13,110.0546
2017-04-17,109.8422
2017-04-18,110.4888
2017-04-19,110.1562
2017-04-20,109.9992
2017-04-21,109.9992
2017-04-24,109.8514
2017-04-25,109.4173
2017-04-26,109.6851
2017-04-27,109.7868
2017-04-28,109.9161
2017-05-01,109.5749
2017-05-02,109.8991
2017-05-03,109.8435
2017-05-04,109.6304
2017-05-05,109.6675
2017-05-08,109.473
2017-05-09,109.4915
2017-05-10,109.6397
2017-05-11,109.6953
2017-05-12,110.251
2017-05-15,110.2418
2017-05-16,110.3992
2017-05-17,111.0754
2017-05-18,111.0569
2017-05-19,111.1217
2017-05-22,111.0291
2017-05-23,110.6864
2017-05-24,110.8624
2017-05-25,110.9087
2017-05-26,110.992
2017-05-30,111.2514
2017-05-31,111.3811
2017-06-01,111.4056
2017-06-02,111.9256
2017-06-05,111.6099
2017-06-06,111.9349
2017-06-07,111.7956
2017-06-08,111.6006
2017-06-09,111.4891
2017-06-12,111.517
2017-06-13,111.6377
2017-06-14,112.3992
2017-06-15,112.1299
2017-06-16,112.2228
2017-06-19,112.0835
2017-06-20,112.3342
2017-06-21,112.39
2017-06-22,112.4828
2017-06-23,112.5386
2017-06-26,112.7429
2017-06-27,112.2321
2017-06-28,112.3528
2017-06-29,112.0092
2017-06-30,111.9163
2017-07-03,111.6744
2017-07-05,111.8606
2017-07-06,111.572
2017-07-07,111.4789
2017-07-10,111.6651
2017-07-11,111.7117
2017-07-12,112.2052
2017-07-13,112.0096
2017-07-14,112.2704
2017-07-17,112.3728
2017-07-18,112.857
2017-07-19,112.8197
2017-07-20,112.9222
2017-07-21,113.1829
2017-07-24,113.0525
2017-07-25,112.3821
2017-07-26,112.7546
2017-07-27,112.4752
2017-07-28,112.7732
2017-07-31,112.7732
2017-08-01,113.0045
2017-08-02,113.0045
2017-08-03,113.1632
2017-08-04,112.7244
2017-08-07,112.7524
2017-08-08,112.211
2017-08-09,112.323
2017-08-10,112.2856
2017-08-11,112.491
2017-08-14,112.4163
2017-08-15,112.2856
2017-08-16,112.6031
2017-08-17,112.7151
2017-08-18,112.6404
2017-08-21,112.7991
2017-08-22,112.6871
2017-08-23,113.1166
2017-08-24,112.9018
2017-08-25,113.1632
2017-08-28,113.1632
2017-08-29,113.2473
2017-08-30,113.3406
2017-08-31,113.5367
2017-09-01,113.0876
2017-09-05,113.7896
2017-09-06,113.3871
2017-09-07,113.8271
2017-09-08,113.4901
2017-09-11,113.1437
2017-09-12,113.022
2017-09-13,112.9097
2017-09-14,113.1905
2017-09-15,113.2841
2017-09-18,113.1718
2017-09-19,113.2373
2017-09-20,113.0969
2017-09-21,113.0969
2017-09-22,113.2467
2017-09-25,113.6679
2017-09-26,113.6492
2017-09-27,113.2092
2017-09-28,113.3777
2017-09-29,113.4807
2017-10-02,113.5866
2017-10-03,113.84
2017-10-04,113.7743
2017-10-05,113.6148
2017-10-06,113.5209
2017-10-09,113.6148
2017-10-10,113.6899
2017-10-11,113.6335
2017-10-12,113.6617
2017-10-13,114.1122
2017-10-16,113.9527
2017-10-17,113.9339
2017-10-18,113.7649
2017-10-19,113.9339
2017-10-20,113.6242
2017-10-23,113.7368
2017-10-24,113.4552
2017-10-25,113.1549
2017-10-26,113.1455
2017-10-27,113.4834
2017-10-30,113.8588
2017-10-31,113.6992
2017-11-01,113.8791
2017-11-02,113.8603
2017-11-03,113.992
2017-11-06,114.0203
2017-11-07,113.9262
2017-11-08,113.7756
2017-11-09,113.4745
2017-11-10,112.8251
2017-11-13,112.8439
2017-11-14,112.8722
2017-11-15,113.3521
2017-11-16,113.2204
2017-11-17,113.3615
2017-11-20,113.3615
2017-11-21,113.738
2017-11-22,114.1803
2017-11-24,114.0485
2017-11-27,113.9826
2017-11-28,114.1426
2017-11-29,113.6909
2017-11-30,113.5592
2017-12-01,114.2155
2017-12-04,114.3953
2017-12-05,114.6129
2017-12-06,114.8305
2017-12-07,114.6034
2017-12-08,114.4615
2017-12-11,114.5467
2017-12-12,114.4615
2017-12-13,114.8589
2017-12-14,115.067
2017-12-15,115.2279
2017-12-18,114.8873
2017-12-19,114.3007
2017-12-20,113.9979
2017-12-21,114.5468
2017-12-22,114.6323
2017-12-26,114.7843
2017-12-27,115.4209
2017-12-28,115.3449
2017-12-29,115.4969
2018-01-02,114.7273
2018-01-03,114.9364
2018-01-04,114.8983
2018-01-05,114.8603
2018-01-08,114.8508
2018-01-09,114.4328
2018-01-10,114.5088
2018-01-11,114.7843
2018-01-12,114.8033
2018-01-16,114.9078
2018-01-17,114.5943
2018-01-18,114.1477
2018-01-19,113.7962
2018-01-22,113.6917
2018-01-23,114.1858
2018-01-24,114.1097
2018-01-25,114.6893
2018-01-26,114.5373
2018-01-29,114.2333
2018-01-30,113.8437
2018-01-31,114.0812
2018-02-01,113.5776
2018-02-02,112.9964
2018-02-05,113.0631
2018-02-06,112.8345
2018-02-07,112.5201
2018-02-08,112.0342
2018-02-09,111.6722
2018-02-12,111.6722
2018-02-13,111.6341
2018-02-14,111.2245
2018-02-15,111.7484
2018-02-16,112.0819
2018-02-20,111.6055
2018-02-21,110.9958
2018-02-22,111.1483
2018-02-23,111.6627
2018-02-26,111.8056
2018-02-27,111.3197
2018-02-28,111.5293
2018-03-01,111.4149
2018-03-02,111.0614
2018-03-05,111.0232
2018-03-06,111.1188
2018-03-07,111.0805
2018-03-08,111.3003
2018-03-09,110.9086
2018-03-12,111.0519
2018-03-13,111.0614
2018-03-14,111.3098
2018-03-15,111.4245
2018-03-16,111.5487
2018-03-19,111.1761
2018-03-20,110.7844
2018-03-21,110.7175
2018-03-22,110.9086
2018-03-23,110.5551
2018-03-26,110.9468
2018-03-27,111.348
2018-03-28,111.6442
2018-03-29,112.1506
2018-04-02,112.09
2018-04-03,111.793
2018-04-04,111.793
2018-04-05,111.8313
2018-04-06,112.1666
2018-04-09,112.2241
2018-04-10,112.2529
2018-04-11,112.3295
2018-04-12,112.0229
2018-04-13,112.0613
2018-04-16,112.0708
2018-04-17,112.0804
2018-04-18,111.5055
2018-04-19,111.084
2018-04-20,110.6337
2018-04-23,110.5858
2018-04-24,110.26
2018-04-25,109.9151
2018-04-26,110.2408
2018-04-27,110.4899
2018-04-30,110.3941
2018-05-01,110.0957
2018-05-02,110.0092
2018-05-03,110.0284
2018-05-04,110.1822
2018-05-07,110.0573
2018-05-08,110.0188
2018-05-09,109.9996
2018-05-10,110.5569
2018-05-11,110.7491
2018-05-14,110.5473
2018-05-15,109.7114
2018-05-16,109.5672
2018-05-17,109.3558
2018-05-18,109.8074
2018-05-21,109.8747
2018-05-22,109.7594
2018-05-23,110.2302
2018-05-24,110.5377
2018-05-25,110.8644
2018-05-29,111.4505
2018-05-30,111.0181
2018-05-31,110.9701
2018-06-01,110.7568
2018-06-04,110.5062
2018-06-05,110.5833
2018-06-06,110.1785
2018-06-07,110.5447
2018-06-08,110.3616
2018-06-11,110.2556
2018-06-12,110.2652
2018-06-13,110.1592
2018-06-14,110.6604
2018-06-15,110.5062
2018-06-18,110.3905
2018-06-19,110.4484
2018-06-20,109.8315
2018-06-21,109.7447
2018-06-22,109.8797
2018-06-25,109.7737
2018-06-26,110.1399
2018-06-27,110.5158
2018-06-28,110.3713
2018-06-29,110.4291
2018-07-02,110.444
2018-07-03,110.85
2018-07-05,111.1981
2018-07-06,111.3528
2018-07-09,111.4301
2018-07-10,111.3044
2018-07-11,111.5268
2018-07-12,111.7685
2018-07-13,111.8555
2018-07-16,111.6718
2018-07-17,111.5945
2018-07-18,111.5751
2018-07-19,111.7491
2018-07-20,111.4204
2018-07-23,110.9757
2018-07-24,111.3238
2018-07-25,111.4688
2018-07-26,111.5751
2018-07-27,111.7201
2018-07-30,111.5655
2018-07-31,111.9135
2018-08-01,111.5185
2018-08-02,111.6543
2018-08-03,112.0033
2018-08-06,112.11
2018-08-07,111.7609
2018-08-08,111.5864
2018-08-09,111.6737
2018-08-10,111.8579
2018-08-13,111.8288
2018-08-14,111.9742
2018-08-15,112.207
2018-08-16,112.3524
2018-08-17,112.4494
2018-08-20,112.7403
2018-08-21,112.4591
2018-08-22,112.4494
2018-08-23,112.4882
2018-08-24,112.7112
2018-08-27,112.5366
2018-08-28,112.11
2018-08-29,111.9936
2018-08-30,112.1003
2018-08-31,111.9355
2018-09-04,111.729
2018-09-05,111.6609
2018-09-06,111.9721
2018-09-07,111.5053
2018-09-10,111.8749
2018-09-11,111.622
2018-09-12,111.8457
2018-09-13,112.0791
2018-09-14,111.9429
2018-09-17,111.8749
2018-09-18,111.4178
2018-09-19,111.2524
2018-09-20,111.5442
2018-09-21,111.5636
2018-09-24,111.3108
2018-09-25,111.3108
2018-09-26,111.7095
2018-09-27,111.8554
2018-09-28,111.7776
2018-10-01,111.6234
2018-10-02,111.7209
2018-10-03,111.0673
2018-10-04,110.6088
2018-10-05,110.1796
2018-10-08,110.0625
2018-10-09,110.3747
2018-10-10,110.0723
2018-10-11,110.5308
2018-10-12,110.5503
2018-10-15,110.3454
2018-10-16,110.6283
2018-10-17,110.082
2018-10-18,110.082
2018-10-19,109.9454
2018-10-22,109.8089
2018-10-23,109.9649
2018-10-24,110.121
2018-10-25,109.9845
2018-10-26,110.1698
2018-10-29,110.043
2018-10-30,109.7991
2018-10-31,109.4869
2018-11-01,109.8191
2018-11-02,109.3786
2018-11-05,109.5744
2018-11-06,109.7603
2018-11-07,110.0442
2018-11-08,109.7212
2018-11-09,109.7995
2018-11-12,109.7897
2018-11-13,109.6429
2018-11-14,109.3493
2018-11-15,109.1437
2018-11-16,109.359
2018-11-19,109.2514
2018-11-20,108.9871
2018-11-21,109.222
2018-11-23,109.2709
2018-11-26,109.3199
2018-11-27,109.1829
2018-11-28,109.4765
2018-11-29,109.1633
2018-11-30,109.0948
2018-12-03,109.4998
2018-12-04,109.5195
2018-12-06,109.8533
2018-12-07,109.8631
2018-12-10,110.197
2018-12-11,110.3934
2018-12-12,110.5112
2018-12-13,110.8057
2018-12-14,110.6879
2018-12-17,110.8057
2018-12-18,111.2013
2018-12-19,111.1127
2018-12-20,110.7483
2018-12-21,110.6399
2018-12-24,110.3838
2018-12-26,110.2952
2018-12-27,110.2952
2018-12-28,110.8172
2018-12-31,111.1226
2019-01-02,111.4673
2019-01-03,111.5165
2019-01-04,111.4476
2019-01-07,111.4574
2019-01-08,111.7037
2019-01-09,112.1272
2019-01-10,111.8317
2019-01-11,112.0386
2019-01-14,111.7431
2019-01-15,111.812
2019-01-16,112.0287
2019-01-17,112.2553
2019-01-18,112.4522
2019-01-22,112.6394
2019-01-23,112.925
2019-01-24,113.2205
2019-01-25,113.319
2019-01-28,113.2993
2019-01-29,113.5455
2019-01-30,114.0676
2019-01-31,114.8654
2019-02-01,114.5913
2019-02-04,114.4332
2019-02-05,114.8975
2019-02-06,114.6802
2019-02-07,114.6604
2019-02-08,114.9469
2019-02-11,114.6901
2019-02-12,114.8481
2019-02-13,114.5517
2019-02-14,114.6802
2019-02-15,114.8185
2019-02-19,114.8876
2019-02-20,114.7889
2019-02-21,114.4628
2019-02-22,114.9766
2019-02-25,114.937
2019-02-26,115.1149
2019-02-27,114.7889
2019-02-28,114.6308
2019-03-01,114.431
2019-03-04,114.6887
2019-03-05,114.7283
2019-03-06,114.8373
2019-03-07,115.2139
2019-03-08,115.3626
2019-03-11,115.4914
2019-03-12,115.8085
2019-03-13,115.6202
2019-03-14,115.3923
2019-03-15,115.8085
2019-03-18,115.749
2019-03-19,115.7689
2019-03-20,116.5518
2019-03-21,116.7698
2019-03-22,117.4833
2019-03-25,117.7211
2019-03-26,117.7707
2019-03-27,117.9293
2019-03-28,118.0779
2019-03-29,117.9887
2019-04-01,117.5494
2019-04-02,117.7084
2019-04-03,117.4599
2019-04-04,117.6488
2019-04-05,117.8376
2019-04-08,117.6687
2019-04-09,117.9172
2019-04-10,118.4937
2019-04-11,118.3744
2019-04-12,118.3048
2019-04-15,118.116
2019-04-16,117.7879
2019-04-17,117.7681
2019-04-18,117.8675
2019-04-22,117.6786
2019-04-23,118.1657
2019-04-24,118.5633
2019-04-25,118.5036
2019-04-26,118.9211
2019-04-29,118.4539
2019-04-30,118.5036
2019-05-01,118.4653
2019-05-02,118.0366
2019-05-03,118.565
2019-05-06,118.7245
2019-05-07,118.7145
2019-05-08,118.3158
2019-05-09,118.4254
2019-05-10,118.4952
2019-05-13,118.565
2019-05-14,118.7345
2019-05-15,119.0635
2019-05-16,118.8741
2019-05-17,118.884
2019-05-20,118.6049
2019-05-21,118.7046
2019-05-22,118.8541
2019-05-23,119.1133
2019-05-24,119.3625
2019-05-28,119.4423
2019-05-29,119.4921
2019-05-30,120.18
2019-05-31,120.4592
2019-06-03,120.83
2019-06-04,120.87
2019-06-05,120.79
2019-06-06,121.02
2019-06-07,121.56
2019-06-10,121.12
2019-06-11,121.23
2019-06-12,121.41
2019-06-13,121.685
2019-06-14,121.715
2019-06-17,121.865
2019-06-18,122.58
2019-06-19,123.34
2019-06-20,124.02
2019-06-21,123.675
2019-06-24,123.99
2019-06-25,123.605
2019-06-26,123.305
2019-06-27,124.08
2019-06-28,124.415
2019-07-01,124.14
2019-07-02,124.5
2019-07-03,124.915
2019-07-04,124.915
2019-07-05,123.835
2019-07-08,123.775
2019-07-09,123.395
2019-07-10,123.59
2019-07-11,123.055
2019-07-12,123.075
2019-07-15,123.275
2019-07-16,122.955
2019-07-17,123.645
2019-07-18,123.885
2019-07-19,123.765
2019-07-22,124.115
2019-07-23,124.215
2019-07-24,124.565
2019-07-25,124.215
2019-07-26,124.32
2019-07-29,124.26
2019-07-30,124.185
2019-07-31,124.3
2019-08-01,124.98
2019-08-02,125.13
2019-08-05,125.285
2019-08-06,125.945
2019-08-07,125.915
2019-08-08,126.22
2019-08-09,125.945
2019-08-12,126.72
2019-08-13,126.65
2019-08-14,127
2019-08-15,127.615
2019-08-16,127.805
2019-08-19,127.435
2019-08-20,128.06
2019-08-21,128.395
2019-08-22,127.88
2019-08-23,128.445
2019-08-26,128.385
2019-08-27,129.025
2019-08-28,129.135
2019-08-29,128.73
2019-08-30,128.82
2019-09-02,128.785
2019-09-03,128.34
2019-09-04,128.575
2019-09-05,127.625
2019-09-06,128.12
2019-09-09,127.2
2019-09-10,126.07
2019-09-11,126.005
2019-09-12,125.82
2019-09-13,124.715
2019-09-16,125.325
2019-09-17,125.685
2019-09-18,125.96
2019-09-19,126.26
2019-09-20,127.165
2019-09-23,127.075
2019-09-24,127.48
2019-09-25,126.82
2019-09-26,127.085
2019-09-27,127.1
2019-09-30,127.48
2019-10-01,127.275
2019-10-02,127.255
2019-10-03,127.725
2019-10-04,128.235
2019-10-07,127.645
2019-10-08,127.52
2019-10-09,127.485
2019-10-10,126.78
2019-10-11,126.61
2019-10-14,127.025
2019-10-15,126.69
2019-10-16,126.785
2019-10-17,126.96
2019-10-18,127.145
2019-10-21,126.855
2019-10-22,127.07
2019-10-23,127.17
2019-10-24,127.375
2019-10-25,127.165
2019-10-28,126.8
2019-10-29,126.505
2019-10-30,126.865
2019-10-31,127.685
2019-11-01,127.555
2019-11-04,126.895
2019-11-05,126.205
2019-11-06,126.87
2019-11-07,125.92
2019-11-08,125.725
2019-11-11,125.77
2019-11-12,125.79
2019-11-13,126.15
2019-11-14,126.775
2019-11-15,126.785
2019-11-18,127.005
2019-11-19,127.245
2019-11-20,127.425
2019-11-21,127.135
2019-11-22,127.49
2019-11-25,127.94
