date,close
2014-06-13,6.6497
2014-06-16,6.6028
2014-06-17,6.5754
2014-06-18,6.5128
2014-06-19,6.548
2014-06-20,6.595
2014-06-23,6.5911
2014-06-24,6.595
2014-06-25,6.6693
2014-06-26,6.6615
2014-06-27,6.6224
2014-06-30,6.6224
2014-07-01,6.6772
2014-07-02,6.6459
2014-07-03,6.6263
2014-07-07,6.6357
2014-07-08,6.6145
2014-07-09,6.6028
2014-07-10,6.5801
2014-07-11,6.5473
2014-07-14,6.6028
2014-07-15,6.6106
2014-07-16,6.6223
2014-07-17,6.5832
2014-07-18,6.6028
2014-07-21,6.6302
2014-07-22,6.5871
2014-07-23,6.6106
2014-07-24,6.4423
2014-07-25,6.4815
2014-07-28,6.4032
2014-07-29,6.3993
2014-07-30,6.4697
2014-07-31,6.4032
2014-08-01,6.3993
2014-08-04,6.3915
2014-08-05,6.3993
2014-08-06,6.4149
2014-08-07,6.5089
2014-08-08,6.5519
2014-08-11,6.6224
2014-08-12,6.6106
2014-08-13,6.6145
2014-08-14,6.6537
2014-08-15,6.7202
2014-08-18,6.5284
2014-08-19,6.5597
2014-08-20,6.5637
2014-08-21,6.5597
2014-08-22,6.5402
2014-08-25,6.5284
2014-08-26,6.5324
2014-08-27,6.5402
2014-08-28,6.548
2014-08-29,6.5519
2014-09-02,6.5793
2014-09-03,6.5911
2014-09-04,6.5363
2014-09-05,6.548
2014-09-08,6.5754
2014-09-09,6.5637
2014-09-10,6.5284
2014-09-11,6.5363
2014-09-12,6.6215
2014-09-15,6.4997
2014-09-16,6.5525
2014-09-17,6.5444
2014-09-18,6.5038
2014-09-19,6.3698
2014-09-22,6.2277
2014-09-23,6.2643
2014-09-24,6.2724
2014-09-25,6.3333
2014-09-26,6.2752
2014-09-29,6.2927
2014-09-30,6.2237
2014-10-01,6.1343
2014-10-02,6.0775
2014-10-03,6.2318
2014-10-06,6.3211
2014-10-07,6.2277
2014-10-08,6.1831
2014-10-09,6.0856
2014-10-10,6.0897
2014-10-13,6.0937
2014-10-14,6.2237
2014-10-15,6.0491
2014-10-16,6.3617
2014-10-17,6.3211
2014-10-20,6.179
2014-10-21,6.317
2014-10-22,6.3779
2014-10-23,6.382
2014-10-24,6.3739
2014-10-27,6.3617
2014-10-28,6.3698
2014-10-29,6.3942
2014-10-30,6.4429
2014-10-31,6.4348
2014-11-03,6.4348
2014-11-04,6.451
2014-11-05,6.5484
2014-11-06,6.4957
2014-11-07,6.516
2014-11-10,6.589
2014-11-11,6.654
2014-11-12,6.6581
2014-11-13,6.5972
2014-11-14,6.6134
2014-11-17,6.6621
2014-11-18,6.6784
2014-11-19,6.6743
2014-11-20,6.6743
2014-11-21,6.654
2014-11-24,6.6581
2014-11-25,6.6459
2014-11-26,6.654
2014-11-28,6.6215
2014-12-01,6.5363
2014-12-02,6.5769
2014-12-03,6.6175
2014-12-04,6.585
2014-12-05,6.5931
2014-12-08,6.5484
2014-12-09,6.4672
2014-12-10,6.4348
2014-12-11,6.4672
2014-12-12,6.4632
2014-12-15,6.2565
2014-12-16,5.9147
2014-12-17,6.1426
2014-12-18,6.3155
2014-12-19,6.3493
2014-12-22,6.1679
2014-12-23,6.1847
2014-12-24,6.1257
2014-12-26,6.2649
2014-12-29,6.1383
2014-12-30,6.2944
2014-12-31,6.3071
2015-01-02,6.3872
2015-01-05,6.2565
2015-01-06,6.2227
2015-01-07,6.2733
2015-01-08,6.2565
2015-01-09,6.2691
2015-01-12,6.2396
2015-01-13,6.2227
2015-01-14,6.2241
2015-01-15,6.2269
2015-01-16,6.3619
2015-01-20,6.2312
2015-01-21,6.2269
2015-01-22,6.2754
2015-01-23,6.3197
2015-01-26,6.324
2015-01-27,6.3282
2015-01-28,6.2818
2015-01-29,6.3113
2015-01-30,6.2649
2015-02-02,6.248
2015-02-03,6.3113
2015-02-04,6.3957
2015-02-05,6.383
2015-02-06,6.3999
2015-02-09,6.3704
2015-02-10,6.4758
2015-02-11,6.4252
2015-02-12,6.4716
2015-02-13,6.421
2015-02-17,6.4294
2015-02-18,6.4168
2015-02-19,6.4674
2015-02-20,6.5265
2015-02-23,6.4801
2015-02-24,6.5307
2015-02-25,6.5897
2015-02-26,6.6615
2015-02-27,6.6108
2015-03-02,6.653
2015-03-03,6.4126
2015-03-04,6.3155
2015-03-05,6.6024
2015-03-06,6.4294
2015-03-09,6.556
2015-03-10,6.5602
2015-03-11,6.6024
2015-03-12,6.6657
2015-03-13,6.6876
2015-03-16,6.5166
2015-03-17,6.4377
2015-03-18,6.5561
2015-03-19,6.5955
2015-03-20,6.578
2015-03-23,6.5868
2015-03-24,6.4903
2015-03-25,6.5561
2015-03-26,6.5648
2015-03-27,6.5254
2015-03-30,6.499
2015-03-31,6.499
2015-04-01,6.5297
2015-04-02,6.5078
2015-04-06,6.5122
2015-04-07,6.5166
2015-04-08,6.5254
2015-04-09,6.5999
2015-04-10,6.6438
2015-04-13,6.5517
2015-04-14,6.6021
2015-04-15,6.5692
2015-04-16,6.578
2015-04-17,6.5561
2015-04-20,6.5473
2015-04-21,6.5473
2015-04-22,6.6832
2015-04-23,6.5736
2015-04-24,6.6043
2015-04-27,6.5539
2015-04-28,6.5999
2015-04-29,6.5977
2015-04-30,6.5824
2015-05-01,6.5648
2015-05-04,6.6613
2015-05-05,6.6131
2015-05-06,6.5561
2015-05-07,6.6613
2015-05-08,6.6481
2015-05-11,6.6328
2015-05-12,6.6218
2015-05-13,6.6832
2015-05-14,6.6788
2015-05-15,6.635
2015-05-18,6.7008
2015-05-19,6.703
2015-05-20,6.6657
2015-05-21,6.6481
2015-05-22,6.7731
2015-05-26,6.7665
2015-05-27,6.7402
2015-05-28,6.8367
2015-05-29,6.942
2015-06-01,6.9727
2015-06-02,6.9727
2015-06-03,7.0384
2015-06-04,6.6657
2015-06-05,6.749
2015-06-08,6.6591
2015-06-09,6.6832
2015-06-10,6.6613
2015-06-11,6.6832
2015-06-12,6.8247
2015-06-15,6.7882
2015-06-16,6.8019
2015-06-17,6.7426
2015-06-18,6.77
2015-06-19,6.7837
2015-06-22,6.6421
2015-06-23,6.6033
2015-06-24,6.5919
2015-06-25,6.5645
2015-06-26,6.5417
2015-06-29,6.3911
2015-06-30,6.4869
2015-07-01,6.6558
2015-07-02,6.7471
2015-07-06,6.665
2015-07-07,6.6467
2015-07-08,6.5645
2015-07-09,6.5645
2015-07-10,6.5691
2015-07-13,6.6011
2015-07-14,6.6832
2015-07-15,6.6148
2015-07-16,6.5782
2015-07-17,6.5737
2015-07-20,6.5737
2015-07-21,6.5782
2015-07-22,6.4961
2015-07-23,6.4732
2015-07-24,6.5235
2015-07-27,6.3956
2015-07-28,6.5235
2015-07-29,6.4641
2015-07-30,6.5257
2015-07-31,6.4824
2015-08-03,6.4595
2015-08-04,6.4322
2015-08-05,6.3774
2015-08-06,6.261
2015-08-07,6.0555
2015-08-10,6.1674
2015-08-11,6.2632
2015-08-12,6.318
2015-08-13,6.3317
2015-08-14,6.3226
2015-08-17,6.2359
2015-08-18,6.1395
2015-08-19,5.9483
2015-08-20,5.7976
2015-08-21,5.4918
2015-08-24,5.3685
2015-08-25,5.1676
2015-08-26,5.437
2015-08-27,5.7154
2015-08-28,5.7976
2015-08-31,5.9802
2015-09-01,5.7474
2015-09-02,5.8433
2015-09-03,5.825
2015-09-04,5.8067
2015-09-08,5.8798
2015-09-09,5.8661
2015-09-10,5.857
2015-09-11,5.9437
2015-09-14,6.1582
2015-09-15,6.2861
2015-09-16,6.3545
2015-09-17,6.35
2015-09-18,6.3135
2015-09-21,6.3408
2015-09-22,6.3591
2015-09-23,6.4276
2015-09-24,6.2678
2015-09-25,6.1309
2015-09-28,5.7916
2015-09-29,5.4762
2015-09-30,5.4523
2015-10-01,5.2659
2015-10-02,5.2564
2015-10-05,5.1752
2015-10-06,5.1895
2015-10-07,5.4236
2015-10-08,5.7175
2015-10-09,5.8298
2015-10-12,5.7008
2015-10-13,5.6673
2015-10-14,5.567
2015-10-15,5.6243
2015-10-16,5.696
2015-10-19,5.6196
2015-10-20,5.6817
2015-10-21,5.6339
2015-10-22,5.469
2015-10-23,5.5479
2015-10-26,5.438
2015-10-27,5.3806
2015-10-28,5.4427
2015-10-29,5.4905
2015-10-30,5.6052
2015-11-02,5.6865
2015-11-03,5.6339
2015-11-04,5.6243
2015-11-05,5.6052
2015-11-06,5.5383
2015-11-09,5.4905
2015-11-10,5.5144
2015-11-11,5.4189
2015-11-12,5.3328
2015-11-13,5.3424
2015-11-16,5.395
2015-11-17,5.1321
2015-11-18,5.3281
2015-11-19,5.3902
2015-11-20,5.4666
2015-11-23,5.4332
2015-11-24,5.4045
2015-11-25,5.4332
2015-11-27,5.4475
2015-11-30,5.4236
2015-12-01,5.4475
2015-12-02,5.438
2015-12-03,5.3424
2015-12-04,5.2229
2015-12-07,5.1226
2015-12-08,5.1106
2015-12-09,5.1608
2015-12-10,5.0987
2015-12-11,4.9697
2015-12-14,4.8125
2015-12-15,4.8226
2015-12-16,4.9747
2015-12-17,4.9088
2015-12-18,4.6908
2015-12-21,4.635
2015-12-22,4.6198
2015-12-23,4.9342
2015-12-24,4.919
2015-12-28,4.7415
2015-12-29,4.777
2015-12-30,4.9088
2015-12-31,5.0508
2016-01-04,5.0559
2016-01-05,5.0407
2016-01-06,5.1776
2016-01-07,5.0255
2016-01-08,5.0356
2016-01-11,5.0914
2016-01-12,4.9697
2016-01-13,4.8074
2016-01-14,4.7973
2016-01-15,4.6046
2016-01-19,4.6198
2016-01-20,4.5741
2016-01-21,4.6096
2016-01-22,4.7212
2016-01-25,4.7871
2016-01-26,4.8277
2016-01-27,4.9088
2016-01-28,4.9139
2016-01-29,4.8733
2016-02-01,4.8632
2016-02-02,4.7719
2016-02-03,4.7212
2016-02-04,4.2293
2016-02-05,4.3307
2016-02-08,4.3003
2016-02-09,4.3104
2016-02-10,4.351
2016-02-11,3.8591
2016-02-12,3.9453
2016-02-16,3.5751
2016-02-17,3.5853
2016-02-18,3.5903
2016-02-19,3.5244
2016-02-22,3.4433
2016-02-23,3.0173
2016-02-24,3.0427
2016-02-25,3.2556
2016-02-26,3.5903
2016-02-29,3.8439
2016-03-01,3.996
2016-03-02,4.2039
2016-03-03,4.5386
2016-03-04,4.5691
2016-03-07,4.531
2016-03-08,4.4575
2016-03-09,4.4828
2016-03-10,4.4575
2016-03-11,4.4474
2016-03-14,4.3603
2016-03-15,4.2133
2016-03-16,4.2895
2016-03-17,4.3276
2016-03-18,4.2623
2016-03-21,4.2786
2016-03-22,4.3113
2016-03-23,4.2677
2016-03-24,4.3657
2016-03-28,4.5508
2016-03-29,4.5943
2016-03-30,4.774
2016-03-31,4.5998
2016-04-01,4.6596
2016-04-04,4.774
2016-04-05,4.774
2016-04-06,4.7903
2016-04-07,4.6814
2016-04-08,4.774
2016-04-11,4.8338
2016-04-12,4.8338
2016-04-13,4.8556
2016-04-14,4.8937
2016-04-15,4.9971
2016-04-18,4.8447
2016-04-19,4.9209
2016-04-20,4.8883
2016-04-21,4.8665
2016-04-22,4.9427
2016-04-25,5.008
2016-04-26,5.0461
2016-04-27,5.0189
2016-04-28,4.9971
2016-04-29,5.008
2016-05-02,5.008
2016-05-03,4.9754
2016-05-04,5.0407
2016-05-05,5.0135
2016-05-06,5.0189
2016-05-09,5.0298
2016-05-10,5.1223
2016-05-11,5.1605
2016-05-12,5.1822
2016-05-13,5.1713
2016-05-16,5.3238
2016-05-17,5.3671
2016-05-18,5.1986
2016-05-19,4.7522
2016-05-20,4.7957
2016-05-23,4.9645
2016-05-24,5.155
2016-05-25,5.0842
2016-05-26,4.823
2016-05-27,4.8828
2016-05-31,4.8937
2016-06-01,4.8665
2016-06-02,4.8338
2016-06-03,4.8992
2016-06-06,4.9536
2016-06-07,4.9917
2016-06-08,4.9645
2016-06-09,4.9645
2016-06-10,4.891
2016-06-13,4.9917
2016-06-14,5.0266
2016-06-15,4.9102
2016-06-16,4.8461
2016-06-17,4.7529
2016-06-20,4.5607
2016-06-21,4.5956
2016-06-22,4.5898
2016-06-23,4.7063
2016-06-24,4.6102
2016-06-27,4.45
2016-06-28,4.6248
2016-06-29,4.782
2016-06-30,4.8286
2016-07-01,5.0034
2016-07-05,5.1082
2016-07-06,5.1548
2016-07-07,5.2363
2016-07-08,5.3004
2016-07-11,5.1956
2016-07-12,5.2422
2016-07-13,5.2538
2016-07-14,5.2538
2016-07-15,5.2247
2016-07-18,5.3004
2016-07-19,5.3062
2016-07-20,5.3353
2016-07-21,5.2829
2016-07-22,5.2829
2016-07-25,5.2946
2016-07-26,5.3179
2016-07-27,5.3004
2016-07-28,5.2888
2016-07-29,5.347
2016-08-01,5.4926
2016-08-02,5.5072
2016-08-03,5.6674
2016-08-04,5.5276
2016-08-05,5.5858
2016-08-08,5.5858
2016-08-09,5.6499
2016-08-10,6.0809
2016-08-11,6.2964
2016-08-12,6.5294
2016-08-15,6.6983
2016-08-16,6.5527
2016-08-17,6.378
2016-08-18,6.5061
2016-08-19,6.5702
2016-08-22,6.5876
2016-08-23,6.6051
2016-08-24,6.5119
2016-08-25,6.5119
2016-08-26,6.5527
2016-08-29,6.5644
2016-08-30,6.5818
2016-08-31,6.5527
2016-09-01,6.5527
2016-09-02,6.6575
2016-09-06,6.6401
2016-09-07,6.6342
2016-09-08,6.5702
2016-09-09,6.5644
2016-09-12,6.5585
2016-09-13,6.4886
2016-09-14,6.4209
2016-09-15,6.3963
2016-09-16,6.2547
2016-09-19,6.0639
2016-09-20,5.9407
2016-09-21,6.2178
2016-09-22,6.3532
2016-09-23,6.2855
2016-09-26,6.1562
2016-09-27,6.1008
2016-09-28,6.1685
2016-09-29,6.2793
2016-09-30,6.4455
2016-10-03,6.4948
2016-10-04,6.5563
2016-10-05,6.5379
2016-10-06,6.464
2016-10-07,6.3778
2016-10-10,6.4209
2016-10-11,6.1562
2016-10-12,6.1254
2016-10-13,6.0269
2016-10-14,6.1747
2016-10-17,6.1622
2016-10-18,6.2916
2016-10-19,6.2362
2016-10-20,6.2547
2016-10-21,6.2855
2016-10-24,6.3101
2016-10-25,6.3101
2016-10-26,6.267
2016-10-27,6.307
2016-10-28,6.4271
2016-10-31,6.4333
2016-11-01,6.4394
2016-11-02,6.3655
2016-11-03,6.4209
2016-11-04,6.2793
2016-11-07,6.3409
2016-11-08,6.3532
2016-11-09,6.4209
2016-11-10,6.4517
2016-11-11,6.5563
2016-11-14,6.7657
2016-11-15,6.9442
2016-11-16,7.1166
2016-11-17,7.1412
2016-11-18,7.1473
2016-11-21,7.0796
2016-11-22,7.0796
2016-11-23,7.1227
2016-11-25,7.1227
2016-11-28,7.1227
2016-11-29,7.135
2016-11-30,7.0858
2016-12-01,7.0858
2016-12-02,7.0858
2016-12-05,7.0919
2016-12-06,7.0796
2016-12-07,7.0796
2016-12-08,7.0735
2016-12-09,7.0796
2016-12-12,6.9873
2016-12-13,7.0181
2016-12-14,7.1285
2016-12-15,6.8296
2016-12-16,6.7581
2016-12-19,6.6282
2016-12-20,6.6412
2016-12-21,6.8751
2016-12-22,6.8036
2016-12-23,6.7451
2016-12-27,6.8686
2016-12-28,6.8426
2016-12-29,6.8751
2016-12-30,6.8296
2017-01-03,6.9336
2017-01-04,6.9661
2017-01-05,6.9531
2017-01-06,6.8816
2017-01-09,6.9466
2017-01-10,6.9531
2017-01-11,7.0376
2017-01-12,7.0246
2017-01-13,7.0506
2017-01-17,7.161
2017-01-18,7.1415
2017-01-19,7.0376
2017-01-20,7.0246
2017-01-23,7.0571
2017-01-24,7.0636
2017-01-25,7.0895
2017-01-26,7.122
2017-01-27,7.0831
2017-01-30,7.0831
2017-01-31,7.096
2017-02-01,7.096
2017-02-02,7.174
2017-02-03,7.278
2017-02-06,7.5704
2017-02-07,7.0766
2017-02-08,7.2845
2017-02-09,7.1675
2017-02-10,7.2325
2017-02-13,7.4145
2017-02-14,7.4534
2017-02-15,7.4989
2017-02-16,7.5054
2017-02-17,7.4534
2017-02-21,7.4794
2017-02-22,7.4729
2017-02-23,7.4599
2017-02-24,7.4664
2017-02-27,7.4729
2017-02-28,7.4599
2017-03-01,7.4015
2017-03-02,7.4275
2017-03-03,7.421
2017-03-06,7.4405
2017-03-07,7.4405
2017-03-08,7.408
2017-03-09,7.343
2017-03-10,7.4015
2017-03-13,7.4015
2017-03-14,7.4701
2017-03-15,7.4083
2017-03-16,7.4769
2017-03-17,7.3809
2017-03-20,7.3466
2017-03-21,7.2163
2017-03-22,7.2574
2017-03-23,7.2848
2017-03-24,7.3191
2017-03-27,7.2574
2017-03-28,7.4632
2017-03-29,7.4426
2017-03-30,7.4906
2017-03-31,7.6347
2017-04-03,7.5798
2017-04-04,7.6072
2017-04-05,7.6827
2017-04-06,7.6758
2017-04-07,7.573
2017-04-10,7.5044
2017-04-11,7.4289
2017-04-12,7.422
2017-04-13,7.4426
2017-04-17,7.4632
2017-04-18,7.4289
2017-04-19,7.4083
2017-04-20,7.4769
2017-04-21,7.4289
2017-04-24,7.5112
2017-04-25,7.5249
2017-04-26,7.5661
2017-04-27,7.573
2017-04-28,7.5798
2017-05-01,7.573
2017-05-02,7.5455
2017-05-03,7.5661
2017-05-04,7.4975
2017-05-05,7.4906
2017-05-08,7.5318
2017-05-09,7.5387
2017-05-10,7.5112
2017-05-11,7.5387
2017-05-12,7.5455
2017-05-15,7.5592
2017-05-16,7.5524
2017-05-17,7.5387
2017-05-18,7.5387
2017-05-19,7.5455
2017-05-22,7.5387
2017-05-23,7.5044
2017-05-24,7.5044
2017-05-25,7.4701
2017-05-26,7.5112
2017-05-30,7.4769
2017-05-31,7.4906
2017-06-01,7.4838
2017-06-02,7.4769
2017-06-05,7.5044
2017-06-06,7.5044
2017-06-07,7.5112
2017-06-08,7.4769
2017-06-09,7.4769
2017-06-12,7.4769
2017-06-13,7.4426
2017-06-14,7.464
2017-06-15,7.4782
2017-06-16,7.1862
2017-06-19,7.1221
2017-06-20,7.1079
2017-06-21,6.9654
2017-06-22,6.8657
2017-06-23,6.8871
2017-06-26,6.9512
2017-06-27,6.9369
2017-06-28,6.8942
2017-06-29,6.9085
2017-06-30,7.058
2017-07-03,7.35
2017-07-05,7.4426
2017-07-06,7.4569
2017-07-07,7.3429
2017-07-10,7.4711
2017-07-11,7.4782
2017-07-12,7.521
2017-07-13,7.4853
2017-07-14,7.4284
2017-07-17,7.407
2017-07-18,7.3999
2017-07-19,7.4711
2017-07-20,7.4782
2017-07-21,7.4853
2017-07-24,7.407
2017-07-25,7.4212
2017-07-26,7.3928
2017-07-27,7.4141
2017-07-28,7.3856
2017-07-31,7.4212
2017-08-01,7.4355
2017-08-02,7.3999
2017-08-03,7.3856
2017-08-04,7.4426
2017-08-07,7.4925
2017-08-08,7.5423
2017-08-09,7.5494
2017-08-10,7.4925
2017-08-11,7.521
2017-08-14,7.5494
2017-08-15,7.5281
2017-08-16,7.6064
2017-08-17,7.6278
2017-08-18,7.6492
2017-08-21,7.6919
2017-08-22,7.699
2017-08-23,7.7417
2017-08-24,7.7204
2017-08-25,7.7489
2017-08-28,7.7774
2017-08-29,7.7774
2017-08-30,7.7774
2017-08-31,7.7346
2017-09-01,7.7631
2017-09-05,7.7275
2017-09-06,7.7275
2017-09-07,7.7133
2017-09-08,7.7204
2017-09-11,7.6492
2017-09-12,7.6207
2017-09-13,7.8426
2017-09-14,7.9657
2017-09-15,7.858
2017-09-18,7.8349
2017-09-19,7.8811
2017-09-20,7.8119
2017-09-21,7.8119
2017-09-22,7.8119
2017-09-25,7.7119
2017-09-26,7.7427
2017-09-27,7.8657
2017-09-28,7.9118
2017-09-29,7.8426
2017-10-02,8.0272
2017-10-03,7.981
2017-10-04,8.0887
2017-10-05,8.0964
2017-10-06,8.1733
2017-10-09,8.1809
2017-10-10,8.2501
2017-10-11,8.327
2017-10-12,8.3578
2017-10-13,8.3809
2017-10-16,8.3655
2017-10-17,8.204
2017-10-18,8.3347
2017-10-19,8.2963
2017-10-20,8.2963
2017-10-23,8.3732
2017-10-24,8.3655
2017-10-25,8.327
2017-10-26,8.3578
2017-10-27,8.3962
2017-10-30,8.3962
2017-10-31,8.4039
2017-11-01,8.4116
2017-11-02,8.2655
2017-11-03,8.1963
2017-11-06,8.154
2017-11-07,7.7734
2017-11-08,7.9887
2017-11-09,7.9041
2017-11-10,7.9041
2017-11-13,7.8965
2017-11-14,7.8273
2017-11-15,7.7119
2017-11-16,7.7811
2017-11-17,7.7965
2017-11-20,7.8349
2017-11-21,7.8119
2017-11-22,7.8042
2017-11-24,7.7734
2017-11-27,7.7888
2017-11-28,7.7811
2017-11-29,7.8042
2017-11-30,7.7504
2017-12-01,7.735
2017-12-04,7.7581
2017-12-05,7.7504
2017-12-06,7.7427
2017-12-07,7.7042
2017-12-08,7.7196
2017-12-11,7.7811
2017-12-12,7.7657
2017-12-13,7.6658
2017-12-14,7.802
2017-12-15,7.6418
2017-12-18,7.3374
2017-12-19,7.3614
2017-12-20,7.4335
2017-12-21,7.9301
2017-12-22,7.7299
2017-12-26,7.866
2017-12-27,8.0583
2017-12-28,8.0423
2017-12-29,8.0503
2018-01-02,8.1864
2018-01-03,8.4027
2018-01-04,8.3066
2018-01-05,8.0343
2018-01-08,7.5697
2018-01-09,7.9782
2018-01-10,8.0262
2018-01-11,8.1384
2018-01-12,8.2826
2018-01-16,8.2666
2018-01-17,8.1624
2018-01-18,8.1544
2018-01-19,8.1304
2018-01-22,8.2075
2018-01-23,8.2075
2018-01-24,8.2075
2018-01-25,8.2237
2018-01-26,8.1994
2018-01-29,8.102
2018-01-30,8.1669
2018-01-31,8.2562
2018-02-01,8.3374
2018-02-02,8.175
2018-02-05,8.0127
2018-02-06,8.24
2018-02-07,8.378
2018-02-08,8.4429
2018-02-09,8.2887
2018-02-12,8.1994
2018-02-13,8.2724
2018-02-14,8.2724
2018-02-15,8.2643
2018-02-16,8.2767
2018-02-20,8.252
2018-02-21,8.2191
2018-02-22,8.2684
2018-02-23,8.3754
2018-02-26,8.326
2018-02-27,8.2931
2018-02-28,8.2684
2018-03-01,8.2849
2018-03-02,8.2849
2018-03-05,8.2849
2018-03-06,8.3013
2018-03-07,8.2849
2018-03-08,8.2849
2018-03-09,8.2767
2018-03-12,8.3013
2018-03-13,8.3425
2018-03-14,8.3425
2018-03-15,8.326
2018-03-16,8.3466
2018-03-19,8.3507
2018-03-20,8.3425
2018-03-21,8.3467
2018-03-22,8.355
2018-03-23,8.3717
2018-03-26,8.43
2018-03-27,8.3883
2018-03-28,8.4467
2018-03-29,8.4467
2018-04-02,8.5134
2018-04-03,8.5051
2018-04-04,8.5551
2018-04-05,8.6385
2018-04-06,8.6468
2018-04-09,8.7552
2018-04-10,8.6969
2018-04-11,8.8303
2018-04-12,8.7844
2018-04-13,8.8303
2018-04-16,8.9387
2018-04-17,8.9387
2018-04-18,9.0638
2018-04-19,8.8485
2018-04-20,8.9413
2018-04-23,8.8738
2018-04-24,8.9076
2018-04-25,8.9413
2018-04-26,9.0426
2018-04-27,9.0342
2018-04-30,9.0595
2018-05-01,9.0764
2018-05-02,9.2115
2018-05-03,9.2284
2018-05-04,9.1946
2018-05-07,9.1693
2018-05-08,9.2115
2018-05-09,9.2748
2018-05-10,9.3044
2018-05-11,9.431
2018-05-14,9.4564
2018-05-15,9.4986
2018-05-16,9.4732
2018-05-17,9.5999
2018-05-18,9.7603
2018-05-21,9.6843
2018-05-22,9.6032
2018-05-23,9.569
2018-05-24,9.475
2018-05-25,9.3896
2018-05-29,9.1589
2018-05-30,9.1076
2018-05-31,8.9966
2018-06-01,9.0051
2018-06-04,9.1503
2018-06-05,9.2272
2018-06-06,9.1333
2018-06-07,9.0649
2018-06-08,9.0478
2018-06-11,9.0265
2018-06-12,9.0735
2018-06-13,9.0393
2018-06-14,8.9709
2018-06-15,9.0222
2018-06-18,9.0564
2018-06-19,9.0649
2018-06-20,9.0346
2018-06-21,8.9914
2018-06-22,8.9654
2018-06-25,8.9394
2018-06-26,8.9481
2018-06-27,8.9827
2018-06-28,9
2018-06-29,9.0173
2018-07-02,9.1385
2018-07-03,9.1341
2018-07-05,9.0952
2018-07-06,9.1125
2018-07-09,9.1298
2018-07-10,9.3115
2018-07-11,9.3894
2018-07-12,9.4587
2018-07-13,9.6058
2018-07-16,9.7183
2018-07-17,9.675
2018-07-18,9.649
2018-07-19,9.6837
2018-07-20,9.6618
2018-07-23,9.4603
2018-07-24,9.5479
2018-07-25,9.618
2018-07-26,9.7231
2018-07-27,9.6705
2018-07-30,9.6968
2018-07-31,9.7406
2018-08-01,9.8238
2018-08-02,9.8545
2018-08-03,9.8457
2018-08-06,9.9421
2018-08-07,10.0034
2018-08-08,10.0209
2018-08-09,10.0384
2018-08-10,10.0034
2018-08-13,9.8983
2018-08-14,9.8545
2018-08-15,9.8019
2018-08-16,9.7844
2018-08-17,9.8107
2018-08-20,9.8807
2018-08-21,9.8632
2018-08-22,9.7435
2018-08-23,9.6549
2018-08-24,9.6637
2018-08-27,9.6105
2018-08-28,9.5795
2018-08-29,9.5751
2018-08-30,9.5751
2018-08-31,9.5751
2018-09-04,9.5839
2018-09-05,9.5485
2018-09-06,9.5751
2018-09-07,9.5574
2018-09-10,9.5396
2018-09-11,9.5485
2018-09-12,9.5574
2018-09-13,9.5574
2018-09-14,9.5751
2018-09-17,9.6283
2018-09-18,9.6371
2018-09-19,9.6775
2018-09-20,9.6416
2018-09-21,9.5968
2018-09-24,9.5429
2018-09-25,9.5698
2018-09-26,9.5429
2018-09-27,9.489
2018-09-28,9.5115
2018-10-01,9.516
2018-10-02,9.7045
2018-10-03,9.6865
2018-10-04,9.6775
2018-10-05,9.6596
2018-10-08,9.7314
2018-10-09,9.8212
2018-10-10,9.5788
2018-10-11,9.3095
2018-10-12,9.4621
2018-10-15,9.6775
2018-10-16,9.8481
2018-10-17,9.875
2018-10-18,9.7583
2018-10-19,9.8571
2018-10-22,9.8212
2018-10-23,9.4985
2018-10-24,9.2258
2018-10-25,9.3076
2018-10-26,9.2985
2018-10-29,9.2894
2018-10-30,9.2985
2018-10-31,9.4167
2018-11-01,9.7257
2018-11-02,9.544
2018-11-05,9.6712
2018-11-06,9.7985
2018-11-07,9.6621
2018-11-08,9.6258
2018-11-09,9.553
2018-11-12,9.544
2018-11-13,9.4712
2018-11-14,9.5167
2018-11-15,9.444
2018-11-16,9.2985
2018-11-19,9.2531
2018-11-20,9.1895
2018-11-21,9.2309
2018-11-23,9.1572
2018-11-26,9.2125
2018-11-27,9.1388
2018-11-28,9.2125
2018-11-29,9.2125
2018-11-30,9.2125
2018-12-03,9.2217
2018-12-04,9.148
2018-12-06,9.0927
2018-12-07,8.973
2018-12-10,8.8071
2018-12-11,8.8993
2018-12-12,9.1664
2018-12-13,9.0651
2018-12-14,8.7795
2018-12-17,8.7519
2018-12-18,8.3373
2018-12-19,8.0333
2018-12-20,7.5635
2018-12-21,7.8913
2018-12-24,7.9522
2018-12-26,8.5423
2018-12-27,8.8607
2018-12-28,8.9263
2018-12-31,9.0855
2019-01-02,9.2728
2019-01-03,9.1885
2019-01-04,9.3009
2019-01-07,9.4133
2019-01-08,9.3852
2019-01-09,9.4789
2019-01-10,9.4789
2019-01-11,9.4976
2019-01-14,9.6288
2019-01-15,9.507
2019-01-16,9.6943
2019-01-17,9.5632
2019-01-18,9.685
2019-01-22,9.788
2019-01-23,9.7168
2019-01-24,9.8022
2019-01-25,9.7453
2019-01-28,9.7263
2019-01-29,9.8782
2019-01-30,9.8782
2019-01-31,9.7927
2019-02-01,9.6599
2019-02-04,9.6789
2019-02-05,9.7358
2019-02-06,9.7263
2019-02-07,9.6599
2019-02-08,9.5555
2019-02-11,9.8117
2019-02-12,9.7738
2019-02-13,9.6314
2019-02-14,9.584
2019-02-15,9.6789
2019-02-19,9.7073
2019-02-20,9.6737
2019-02-21,9.6929
2019-02-22,9.8083
2019-02-25,9.6833
2019-02-26,9.7122
2019-02-27,9.6352
2019-02-28,9.6256
2019-03-01,9.616
2019-03-04,9.616
2019-03-05,9.6737
2019-03-06,9.5968
2019-03-07,9.5968
2019-03-08,9.4141
2019-03-11,9.4237
2019-03-12,9.5102
2019-03-13,9.5968
2019-03-14,9.5679
2019-03-15,9.616
2019-03-18,9.5968
2019-03-19,9.616
2019-03-20,9.6064
2019-03-21,9.6502
2019-03-22,9.4553
2019-03-25,9.4943
2019-03-26,9.4748
2019-03-27,9.5625
2019-03-28,9.5528
2019-03-29,9.5918
2019-04-01,9.6113
2019-04-02,9.5528
2019-04-03,9.543
2019-04-04,9.543
2019-04-05,9.5723
2019-04-08,10.0402
2019-04-09,10.0207
2019-04-10,10.1181
2019-04-11,10.1376
2019-04-12,10.2059
2019-04-15,10.3326
2019-04-16,10.3716
2019-04-17,10.3911
2019-04-18,10.4398
2019-04-22,10.6027
2019-04-23,10.4645
2019-04-24,10.3855
2019-04-25,10.5138
2019-04-26,10.5435
2019-04-29,10.583
2019-04-30,10.7409
2019-05-01,10.583
2019-05-02,10.6224
2019-05-03,10.6915
2019-05-06,10.8001
2019-05-07,10.7607
2019-05-08,10.5533
2019-05-09,10.4793
2019-05-10,10.5138
2019-05-13,10.3362
2019-05-14,10.425
2019-05-15,10.4744
2019-05-16,10.4744
2019-05-17,10.4645
2019-05-20,10.3855
2019-05-21,10.4053
2019-05-22,10.425
2019-05-23,10.44
2019-05-24,10.37
2019-05-28,10.17
2019-05-29,9.99
2019-05-30,9.95
2019-05-31,9.93
2019-06-03,9.99
2019-06-04,10.1
2019-06-05,10.01
2019-06-06,10.05
2019-06-07,10.06
2019-06-10,10.15
2019-06-11,10.13
2019-06-12,10.5
2019-06-13,10.345
2019-06-14,10.43
2019-06-17,10.47
2019-06-18,10.48
2019-06-19,10.475
2019-06-20,10.24
2019-06-21,10.2
2019-06-24,10.245
2019-06-25,10.175
2019-06-26,10.13
2019-06-27,10.095
2019-06-28,10.085
2019-07-01,10.14
2019-07-02,10.125
2019-07-03,10.165
2019-07-04,10.165
2019-07-05,10.185
2019-07-08,10.4
2019-07-09,10.365
2019-07-10,10.49
2019-07-11,10.58
2019-07-12,10.62
2019-07-15,10.75
2019-07-16,10.64
2019-07-17,10.745
2019-07-18,10.715
2019-07-19,10.75
2019-07-22,10.77
2019-07-23,10.61
2019-07-24,10.71
2019-07-25,10.54
2019-07-26,10.62
2019-07-29,10.65
2019-07-30,10.72
2019-07-31,10.6
2019-08-01,10.48
2019-08-02,10.37
2019-08-05,10.155
2019-08-06,10.315
2019-08-07,10.2
2019-08-08,10.225
2019-08-09,10.285
2019-08-12,10.18
2019-08-13,10.275
2019-08-14,10.03
2019-08-15,9.97
2019-08-16,10.18
2019-08-19,10.245
2019-08-20,10.415
2019-08-21,10.29
2019-08-22,10.05
2019-08-23,9.99
2019-08-26,9.975
2019-08-27,9.7
2019-08-28,9.515
2019-08-29,9.73
2019-08-30,9.38
2019-09-02,9.38
2019-09-03,9.58
2019-09-04,9.72
2019-09-05,9.67
2019-09-06,9.885
2019-09-09,9.865
2019-09-10,9.725
2019-09-11,9.765
2019-09-12,9.74
2019-09-13,9.83
2019-09-16,9.95
2019-09-17,9.955
2019-09-18,9.905
2019-09-19,9.78
2019-09-20,9.69
2019-09-23,9.59
2019-09-24,9.43
2019-09-25,9.255
2019-09-26,9.305
2019-09-27,9.27
2019-09-30,9.31
2019-10-01,9.195
2019-10-02,9.165
2019-10-03,9.275
2019-10-04,9.285
2019-10-07,9.37
2019-10-08,9.375
2019-10-09,9.425
2019-10-10,9.51
2019-10-11,9.51
2019-10-14,9.62
2019-10-15,9.665
2019-10-16,9.69
2019-10-17,9.68
2019-10-18,9.48
2019-10-21,9.5
2019-10-22,9.515
2019-10-23,9.545
2019-10-24,9.595
2019-10-25,9.55
2019-10-28,9.565
2019-10-29,9.66
2019-10-30,9.24
2019-10-31,9.355
2019-11-01,9.58
2019-11-04,9.355
2019-11-05,9.375
2019-11-06,9.35
2019-11-07,9.405
2019-11-08,9.465
2019-11-11,9.455
2019-11-12,9.415
2019-11-13,9.325
2019-11-14,8.915
2019-11-15,8.99
2019-11-18,8.74
2019-11-19,8.355
2019-11-20,8.175
2019-11-21,8.265
2019-11-22,8.34
2019-11-25,8.38
