date,close
2014-06-13,42.9992
2014-06-16,43.0411
2014-06-17,43.1959
2014-06-18,43.5055
2014-06-19,43.5601
2014-06-20,43.4508
2014-06-23,43.6522
2014-06-24,43.3595
2014-06-25,43.5699
2014-06-26,43.5425
2014-06-27,43.6522
2014-06-30,43.6522
2014-07-01,43.9724
2014-07-02,43.9459
2014-07-03,44.148
2014-07-07,43.9632
2014-07-08,43.6614
2014-07-09,43.826
2014-07-10,43.6522
2014-07-11,43.6888
2014-07-14,43.8901
2014-07-15,43.7803
2014-07-16,43.9184
2014-07-17,43.3961
2014-07-18,43.8535
2014-07-21,43.7629
2014-07-22,43.9815
2014-07-23,44.0831
2014-07-24,44.0913
2014-07-25,43.8498
2014-07-28,43.8535
2014-07-29,43.6888
2014-07-30,43.7062
2014-07-31,42.8381
2014-08-01,42.7018
2014-08-04,43.0302
2014-08-05,42.6368
2014-08-06,42.646
2014-08-07,42.4347
2014-08-08,42.8838
2014-08-11,43.0576
2014-08-12,42.9744
2014-08-13,43.268
2014-08-14,43.4601
2014-08-15,43.451
2014-08-18,43.8626
2014-08-19,44.0822
2014-08-20,44.1645
2014-08-21,44.2926
2014-08-22,44.2102
2014-08-25,44.5578
2014-08-26,44.5121
2014-08-27,44.5121
2014-08-28,44.4481
2014-08-29,44.5935
2014-09-02,44.5944
2014-09-03,44.5578
2014-09-04,44.4737
2014-09-05,44.6786
2014-09-08,44.5853
2014-09-09,44.2651
2014-09-10,44.4472
2014-09-11,44.503
2014-09-12,44.2377
2014-09-15,44.1188
2014-09-16,44.4298
2014-09-17,44.4847
2014-09-18,44.7225
2014-09-19,44.6402
2014-09-22,44.2379
2014-09-23,43.9531
2014-09-24,44.2839
2014-09-25,43.6132
2014-09-26,43.9623
2014-09-29,43.8612
2014-09-30,43.6867
2014-10-01,43.1005
2014-10-02,43.1354
2014-10-03,43.5948
2014-10-06,43.5121
2014-10-07,42.8506
2014-10-08,43.5663
2014-10-09,42.6852
2014-10-10,42.1432
2014-10-13,41.4449
2014-10-14,41.5735
2014-10-15,41.353
2014-10-16,41.4082
2014-10-17,41.8859
2014-10-20,42.2994
2014-10-21,43.1354
2014-10-22,42.8139
2014-10-23,43.3284
2014-10-24,43.6407
2014-10-27,43.558
2014-10-28,44.1277
2014-10-29,44.045
2014-10-30,45.3588
2014-10-31,44.8535
2014-11-03,44.8719
2014-11-04,44.7157
2014-11-05,44.9454
2014-11-06,45.1567
2014-11-07,45.1842
2014-11-10,45.3312
2014-11-11,45.368
2014-11-12,45.3772
2014-11-13,45.3588
2014-11-14,45.368
2014-11-17,45.368
2014-11-18,45.6069
2014-11-19,45.515
2014-11-20,45.6436
2014-11-21,45.8733
2014-11-24,46.0662
2014-11-25,46.0295
2014-11-26,46.1581
2014-11-28,45.9836
2014-12-01,45.6069
2014-12-02,45.8825
2014-12-03,46.0938
2014-12-04,46.0479
2014-12-05,46.1397
2014-12-08,45.7906
2014-12-09,45.8366
2014-12-10,45.0832
2014-12-11,45.2761
2014-12-12,44.5962
2014-12-15,44.2471
2014-12-16,43.9531
2014-12-17,44.8535
2014-12-18,45.8825
2014-12-19,46.0938
2014-12-22,46.2945
2014-12-23,46.3775
2014-12-24,46.4052
2014-12-26,46.5529
2014-12-29,46.6359
2014-12-30,46.4144
2014-12-31,45.9715
2015-01-02,45.9162
2015-01-05,45.1318
2015-01-06,44.6889
2015-01-07,45.2149
2015-01-08,46.0177
2015-01-09,45.6486
2015-01-12,45.2961
2015-01-13,45.2149
2015-01-14,44.9565
2015-01-15,44.4951
2015-01-16,45.0857
2015-01-20,45.1503
2015-01-21,45.3625
2015-01-22,46.0546
2015-01-23,45.8516
2015-01-26,46.0269
2015-01-27,45.5101
2015-01-28,44.9011
2015-01-29,45.2702
2015-01-30,44.6981
2015-02-02,45.2056
2015-02-03,45.8792
2015-02-04,45.7224
2015-02-05,46.2114
2015-02-06,46.0638
2015-02-09,45.87
2015-02-10,46.3314
2015-02-11,46.3499
2015-02-12,46.8112
2015-02-13,47.0327
2015-02-17,47.0881
2015-02-18,47.1065
2015-02-19,47.1065
2015-02-20,47.3741
2015-02-23,47.3557
2015-02-24,47.4848
2015-02-25,47.4664
2015-02-26,47.4387
2015-02-27,47.2542
2015-03-02,47.5587
2015-03-03,47.3741
2015-03-04,47.1803
2015-03-05,47.2357
2015-03-06,46.5898
2015-03-09,46.7559
2015-03-10,46.0638
2015-03-11,46.0177
2015-03-12,46.5898
2015-03-13,46.3406
2015-03-16,46.922
2015-03-17,46.8112
2015-03-18,47.3464
2015-03-19,47.1803
2015-03-20,47.5771
2015-03-23,47.5217
2015-03-24,47.253
2015-03-25,46.5394
2015-03-26,46.4189
2015-03-27,46.5301
2015-03-30,47.1325
2015-03-31,46.7803
2015-04-01,46.6227
2015-04-02,46.7803
2015-04-06,47.0769
2015-04-07,46.9471
2015-04-08,47.1047
2015-04-09,47.2808
2015-04-10,47.5124
2015-04-13,47.3271
2015-04-14,47.392
2015-04-15,47.6422
2015-04-16,47.6236
2015-04-17,47.0584
2015-04-20,47.4615
2015-04-21,47.4383
2015-04-22,47.6329
2015-04-23,47.7905
2015-04-24,47.8461
2015-04-27,47.6144
2015-04-28,47.7256
2015-04-29,47.5402
2015-04-30,47.0213
2015-05-01,47.4754
2015-05-04,47.6236
2015-05-05,47.0584
2015-05-06,46.9017
2015-05-07,47.0954
2015-05-08,47.6514
2015-05-11,47.4846
2015-05-12,47.3456
2015-05-13,47.3456
2015-05-14,47.809
2015-05-15,47.8739
2015-05-18,48.0685
2015-05-19,48.0499
2015-05-20,48.0314
2015-05-21,48.1333
2015-05-22,48.0407
2015-05-26,47.5588
2015-05-27,47.9758
2015-05-28,47.9202
2015-05-29,47.6422
2015-06-01,47.7349
2015-06-02,47.6978
2015-06-03,47.8646
2015-06-04,47.4754
2015-06-05,47.4383
2015-06-08,47.1418
2015-06-09,47.114
2015-06-10,47.67
2015-06-11,47.809
2015-06-12,47.4846
2015-06-15,47.29
2015-06-16,47.5495
2015-06-17,47.6144
2015-06-18,48.1055
2015-06-19,47.8646
2015-06-22,48.1682
2015-06-23,48.1962
2015-06-24,47.8608
2015-06-25,47.721
2015-06-26,47.7024
2015-06-29,46.7055
2015-06-30,46.7987
2015-07-01,47.1341
2015-07-02,47.0782
2015-07-06,46.9198
2015-07-07,47.2086
2015-07-08,46.426
2015-07-09,46.5098
2015-07-10,47.0782
2015-07-13,47.5999
2015-07-14,47.8235
2015-07-15,47.749
2015-07-16,48.0937
2015-07-17,48.0751
2015-07-20,48.103
2015-07-21,47.8981
2015-07-22,47.8049
2015-07-23,47.544
2015-07-24,47.0502
2015-07-27,46.7334
2015-07-28,47.2831
2015-07-29,47.6372
2015-07-30,47.6651
2015-07-31,47.6185
2015-08-03,47.4602
2015-08-04,47.3577
2015-08-05,47.5347
2015-08-06,47.162
2015-08-07,47.0036
2015-08-10,47.5999
2015-08-11,47.19
2015-08-12,47.2077
2015-08-13,47.1713
2015-08-14,47.3484
2015-08-17,47.6372
2015-08-18,47.5067
2015-08-19,47.1154
2015-08-20,46.0813
2015-08-21,44.7396
2015-08-24,43.0058
2015-08-25,42.4104
2015-08-26,43.9477
2015-08-27,45.0285
2015-08-28,45.0844
2015-08-31,44.7396
2015-09-01,43.4073
2015-09-02,44.2179
2015-09-03,44.2738
2015-09-04,43.6496
2015-09-08,44.721
2015-09-09,44.134
2015-09-10,44.3483
2015-09-11,44.5533
2015-09-14,44.3856
2015-09-15,44.9371
2015-09-16,45.308
2015-09-17,45.2707
2015-09-18,44.544
2015-09-21,44.709
2015-09-22,44.1285
2015-09-23,44.0442
2015-09-24,43.8682
2015-09-25,43.7914
2015-09-28,42.6398
2015-09-29,42.6398
2015-09-30,43.4263
2015-10-01,43.4918
2015-10-02,44.1379
2015-10-05,44.9618
2015-10-06,44.7933
2015-10-07,45.1865
2015-10-08,45.5798
2015-10-09,45.6547
2015-10-12,45.6734
2015-10-13,45.3363
2015-10-14,45.1116
2015-10-15,45.7952
2015-10-16,45.9637
2015-10-19,46.0011
2015-10-20,45.9356
2015-10-21,45.6079
2015-10-22,46.282
2015-10-23,46.7596
2015-10-26,46.6659
2015-10-27,46.4974
2015-10-28,47.1247
2015-10-29,47.0592
2015-10-30,46.8719
2015-11-02,47.4534
2015-11-03,47.6022
2015-11-04,47.4712
2015-11-05,47.4337
2015-11-06,47.4337
2015-11-09,46.9749
2015-11-10,47.0779
2015-11-11,46.8813
2015-11-12,46.2165
2015-11-13,45.7109
2015-11-16,46.3476
2015-11-17,46.2914
2015-11-18,47.0217
2015-11-19,46.9843
2015-11-20,47.1622
2015-11-23,47.1622
2015-11-24,47.2371
2015-11-25,47.2886
2015-11-27,47.3213
2015-11-30,47.1528
2015-12-01,47.5726
2015-12-02,47.106
2015-12-03,46.4038
2015-12-04,47.2371
2015-12-07,46.8813
2015-12-08,46.6191
2015-12-09,46.2259
2015-12-10,46.3289
2015-12-11,45.4206
2015-12-14,45.5704
2015-12-15,46.0573
2015-12-16,46.7221
2015-12-17,46.076
2015-12-18,45.2895
2015-12-21,45.6092
2015-12-22,46.0233
2015-12-23,46.6162
2015-12-24,46.5503
2015-12-28,46.4374
2015-12-29,46.9268
2015-12-30,46.5974
2015-12-31,46.155
2016-01-04,45.468
2016-01-05,45.5056
2016-01-06,44.9409
2016-01-07,43.8398
2016-01-08,43.3409
2016-01-11,43.3127
2016-01-12,43.595
2016-01-13,42.4939
2016-01-14,43.1433
2016-01-15,42.2586
2016-01-19,42.1833
2016-01-20,41.788
2016-01-21,41.9574
2016-01-22,42.8234
2016-01-25,42.1456
2016-01-26,42.7574
2016-01-27,42.3056
2016-01-28,42.4609
2016-01-29,43.5198
2016-02-01,43.5292
2016-02-02,42.701
2016-02-03,42.908
2016-02-04,43.0115
2016-02-05,42.1551
2016-02-08,41.5057
2016-02-09,41.4492
2016-02-10,41.4398
2016-02-11,40.9409
2016-02-12,41.7409
2016-02-16,42.5033
2016-02-17,43.2186
2016-02-18,43.0398
2016-02-19,43.0492
2016-02-22,43.6798
2016-02-23,43.1527
2016-02-24,43.3786
2016-02-25,43.8774
2016-02-26,43.8398
2016-02-29,43.5103
2016-03-01,44.5645
2016-03-02,44.7997
2016-03-03,45.0256
2016-03-04,45.1692
2016-03-07,45.2797
2016-03-08,44.7056
2016-03-09,44.9127
2016-03-10,44.9033
2016-03-11,45.6562
2016-03-14,45.6092
2016-03-15,45.4303
2016-03-16,45.7221
2016-03-17,46.0703
2016-03-18,46.2807
2016-03-21,46.328
2016-03-22,46.3186
2016-03-23,45.9497
2016-03-24,45.9308
2016-03-28,45.9591
2016-03-29,46.4746
2016-03-30,46.6307
2016-03-31,46.6118
2016-04-01,46.8955
2016-04-04,46.6969
2016-04-05,46.2429
2016-04-06,46.7347
2016-04-07,46.1861
2016-04-08,46.3091
2016-04-11,46.2051
2016-04-12,46.6212
2016-04-13,47.1793
2016-04-14,47.1793
2016-04-15,47.1509
2016-04-18,47.4536
2016-04-19,47.5766
2016-04-20,47.6333
2016-04-21,47.3968
2016-04-22,47.4441
2016-04-25,47.3306
2016-04-26,47.4631
2016-04-27,47.5766
2016-04-28,47.132
2016-04-29,46.8766
2016-05-02,47.236
2016-05-03,46.7915
2016-05-04,46.5077
2016-05-05,46.4699
2016-05-06,46.6496
2016-05-09,46.6969
2016-05-10,47.2644
2016-05-11,46.8293
2016-05-12,46.7726
2016-05-13,46.3942
2016-05-16,46.8577
2016-05-17,46.4415
2016-05-18,46.4415
2016-05-19,46.2713
2016-05-20,46.6212
2016-05-23,46.536
2016-05-24,47.1793
2016-05-25,47.5103
2016-05-26,47.5103
2016-05-27,47.7279
2016-05-31,47.6995
2016-06-01,47.8036
2016-06-02,47.9833
2016-06-03,47.8414
2016-06-06,48.1062
2016-06-07,48.2008
2016-06-08,48.3616
2016-06-09,48.267
2016-06-10,47.7705
2016-06-13,47.3874
2016-06-14,47.2739
2016-06-15,47.2455
2016-06-16,47.359
2016-06-17,47.1913
2016-06-20,47.524
2016-06-21,47.6285
2016-06-22,47.5335
2016-06-23,48.1798
2016-06-24,46.4689
2016-06-27,45.5184
2016-06-28,46.3264
2016-06-29,47.1438
2016-06-30,47.8091
2016-07-01,47.9327
2016-07-05,47.5525
2016-07-06,47.8281
2016-07-07,47.8281
2016-07-08,48.579
2016-07-11,48.7881
2016-07-12,49.1683
2016-07-13,49.1398
2016-07-14,49.3584
2016-07-15,49.3394
2016-07-18,49.4629
2016-07-19,49.3774
2016-07-20,49.6055
2016-07-21,49.4344
2016-07-22,49.672
2016-07-25,49.539
2016-07-26,49.596
2016-07-27,49.5295
2016-07-28,49.6245
2016-07-29,49.7037
2016-08-01,49.635
2016-08-02,49.2633
2016-08-03,49.4724
2016-08-04,49.5105
2016-08-05,49.9192
2016-08-08,49.9002
2016-08-09,49.9097
2016-08-10,49.7861
2016-08-11,50.0142
2016-08-12,49.9572
2016-08-15,50.1568
2016-08-16,49.8621
2016-08-17,49.9382
2016-08-18,50.0902
2016-08-19,50.0237
2016-08-22,50.0332
2016-08-23,50.1568
2016-08-24,49.8811
2016-08-25,49.8621
2016-08-26,49.7576
2016-08-29,50.0142
2016-08-30,49.9382
2016-08-31,49.8051
2016-09-01,49.8241
2016-09-02,50.0712
2016-09-06,50.2233
2016-09-07,50.2708
2016-09-08,50.1568
2016-09-09,48.9193
2016-09-12,49.5865
2016-09-13,48.8451
2016-09-14,48.8261
2016-09-15,49.3204
2016-09-16,49.1367
2016-09-19,49.1771
2016-09-20,49.1885
2016-09-21,49.7226
2016-09-22,50.104
2016-09-23,49.8275
2016-09-26,49.4269
2016-09-27,49.7035
2016-09-28,49.9705
2016-09-29,49.4937
2016-09-30,49.8942
2016-10-03,49.7226
2016-10-04,49.4937
2016-10-05,49.7321
2016-10-06,49.7035
2016-10-07,49.5223
2016-10-10,49.7893
2016-10-11,49.1695
2016-10-12,49.2171
2016-10-13,49.055
2016-10-14,49.0264
2016-10-17,48.8834
2016-10-18,49.179
2016-10-19,49.3316
2016-10-20,49.2457
2016-10-21,49.2267
2016-10-24,49.4651
2016-10-25,49.2648
2016-10-26,49.1313
2016-10-27,48.9024
2016-10-28,48.7785
2016-10-31,48.8261
2016-11-01,48.4542
2016-11-02,48.1109
2016-11-03,47.9107
2016-11-04,47.8916
2016-11-07,48.9215
2016-11-08,49.1408
2016-11-09,49.7416
2016-11-10,49.9038
2016-11-11,49.9419
2016-11-14,50.0659
2016-11-15,50.4378
2016-11-16,50.371
2016-11-17,50.6381
2016-11-18,50.5808
2016-11-21,50.9146
2016-11-22,51.0672
2016-11-23,51.1339
2016-11-25,51.3342
2016-11-28,51.0577
2016-11-29,51.1149
2016-11-30,51.0004
2016-12-01,50.762
2016-12-02,50.8288
2016-12-05,51.1721
2016-12-06,51.401
2016-12-07,52.0304
2016-12-08,52.2306
2016-12-09,52.4786
2016-12-12,52.3641
2016-12-13,52.6502
2016-12-14,52.2402
2016-12-15,52.4118
2016-12-16,52.326
2016-12-19,52.4616
2016-12-20,52.7015
2016-12-21,52.5384
2016-12-22,52.3944
2016-12-23,52.4808
2016-12-27,52.6535
2016-12-28,52.1928
2016-12-29,52.1832
2016-12-30,52.0009
2017-01-03,52.356
2017-01-04,52.8071
2017-01-05,52.7207
2017-01-06,52.8695
2017-01-09,52.6727
2017-01-10,52.7399
2017-01-11,52.8647
2017-01-12,52.7399
2017-01-13,52.8551
2017-01-17,52.6343
2017-01-18,52.7639
2017-01-19,52.5576
2017-01-20,52.7495
2017-01-23,52.6151
2017-01-24,53.0279
2017-01-25,53.4598
2017-01-26,53.4022
2017-01-27,53.3158
2017-01-30,52.9607
2017-01-31,52.9895
2017-02-01,52.9991
2017-02-02,53.0183
2017-02-03,53.4502
2017-02-06,53.3062
2017-02-07,53.287
2017-02-08,53.3542
2017-02-09,53.6901
2017-02-10,53.9396
2017-02-13,54.2084
2017-02-14,54.4195
2017-02-15,54.6883
2017-02-16,54.6307
2017-02-17,54.7075
2017-02-21,55.0626
2017-02-22,54.9954
2017-02-23,54.9186
2017-02-24,55.0146
2017-02-27,55.1682
2017-02-28,54.9474
2017-03-01,55.7056
2017-03-02,55.3505
2017-03-03,55.3793
2017-03-06,55.197
2017-03-07,54.9858
2017-03-08,54.8514
2017-03-09,54.8322
2017-03-10,55.053
2017-03-13,55.1106
2017-03-14,54.909
2017-03-15,55.3889
2017-03-16,55.3409
2017-03-17,55.2929
2017-03-20,55.1691
2017-03-21,54.3821
2017-03-22,54.4688
2017-03-23,54.4688
2017-03-24,54.4592
2017-03-27,54.4013
2017-03-28,54.7772
2017-03-29,54.9025
2017-03-30,55.0759
2017-03-31,54.9892
2017-04-03,54.8446
2017-04-04,54.8639
2017-04-05,54.6519
2017-04-06,54.835
2017-04-07,54.7965
2017-04-10,54.8446
2017-04-11,54.835
2017-04-12,54.5555
2017-04-13,54.1797
2017-04-17,54.6615
2017-04-18,54.5362
2017-04-19,54.4881
2017-04-20,54.9121
2017-04-21,54.7675
2017-04-24,55.3458
2017-04-25,55.712
2017-04-26,55.7216
2017-04-27,55.7505
2017-04-28,55.5385
2017-05-01,55.712
2017-05-02,55.712
2017-05-03,55.5578
2017-05-04,55.6156
2017-05-05,55.8854
2017-05-08,55.818
2017-05-09,55.7794
2017-05-10,55.8951
2017-05-11,55.7409
2017-05-12,55.6349
2017-05-15,55.9336
2017-05-16,55.9144
2017-05-17,54.8928
2017-05-18,55.1048
2017-05-19,55.4325
2017-05-22,55.7698
2017-05-23,55.8565
2017-05-24,56.0107
2017-05-25,56.2324
2017-05-26,56.2517
2017-05-30,56.1456
2017-05-31,56.1456
2017-06-01,56.6275
2017-06-02,56.8588
2017-06-05,56.7624
2017-06-06,56.6179
2017-06-07,56.666
2017-06-08,56.7913
2017-06-09,56.7239
2017-06-12,56.7046
2017-06-13,57.0033
2017-06-14,56.9166
2017-06-15,56.7528
2017-06-16,56.7721
2017-06-19,57.2319
2017-06-20,56.835
2017-06-21,56.7962
2017-06-22,56.7962
2017-06-23,56.9221
2017-06-26,56.9608
2017-06-27,56.4865
2017-06-28,57.0092
2017-06-29,56.5639
2017-06-30,56.5929
2017-07-03,56.8059
2017-07-05,56.8253
2017-07-06,56.2928
2017-07-07,56.6897
2017-07-10,56.6994
2017-07-11,56.7188
2017-07-12,57.1157
2017-07-13,57.2125
2017-07-14,57.4739
2017-07-17,57.4932
2017-07-18,57.5029
2017-07-19,57.8417
2017-07-20,57.8708
2017-07-21,57.8127
2017-07-24,57.7933
2017-07-25,57.9773
2017-07-26,57.9482
2017-07-27,57.8417
2017-07-28,57.7643
2017-07-31,57.7353
2017-08-01,57.8127
2017-08-02,57.8127
2017-08-03,57.6578
2017-08-04,57.8224
2017-08-07,57.9192
2017-08-08,57.7837
2017-08-09,57.7062
2017-08-10,56.8737
2017-08-11,56.9608
2017-08-14,57.5416
2017-08-15,57.4932
2017-08-16,57.6094
2017-08-17,56.6994
2017-08-18,56.5833
2017-08-21,56.622
2017-08-22,57.2222
2017-08-23,57.0479
2017-08-24,56.9414
2017-08-25,57.077
2017-08-28,57.0963
2017-08-29,57.1544
2017-08-30,57.4255
2017-08-31,57.8127
2017-09-01,57.9482
2017-09-05,57.4932
2017-09-06,57.6384
2017-09-07,57.6384
2017-09-08,57.5804
2017-09-11,58.1999
2017-09-12,58.4226
2017-09-13,58.471
2017-09-14,58.4323
2017-09-15,58.5291
2017-09-18,58.6999
2017-09-19,58.7193
2017-09-20,58.7971
2017-09-21,58.6221
2017-09-22,58.661
2017-09-25,58.5832
2017-09-26,58.6221
2017-09-27,58.904
2017-09-28,59.011
2017-09-29,59.2151
2017-10-02,59.4776
2017-10-03,59.6429
2017-10-04,59.672
2017-10-05,60.0026
2017-10-06,59.9637
2017-10-09,59.8179
2017-10-10,59.9637
2017-10-11,60.0609
2017-10-12,59.9831
2017-10-13,60.022
2017-10-16,60.1192
2017-10-17,60.129
2017-10-18,60.197
2017-10-19,60.2067
2017-10-20,60.5081
2017-10-23,60.2748
2017-10-24,60.3623
2017-10-25,60.0317
2017-10-26,60.1484
2017-10-27,60.6248
2017-10-30,60.3914
2017-10-31,60.4984
2017-11-01,60.547
2017-11-02,60.547
2017-11-03,60.722
2017-11-06,60.8386
2017-11-07,60.7414
2017-11-08,60.8095
2017-11-09,60.5859
2017-11-10,60.5859
2017-11-13,60.6539
2017-11-14,60.4887
2017-11-15,60.2262
2017-11-16,60.7512
2017-11-17,60.6637
2017-11-20,60.7998
2017-11-21,61.2081
2017-11-22,61.1692
2017-11-24,61.2664
2017-11-27,61.2275
2017-11-28,61.8303
2017-11-29,61.8594
2017-11-30,62.3163
2017-12-01,62.1997
2017-12-04,62.1025
2017-12-05,61.84
2017-12-06,61.8205
2017-12-07,62.0636
2017-12-08,62.3747
2017-12-11,62.5497
2017-12-12,62.6177
2017-12-13,62.6177
2017-12-14,62.3261
2017-12-15,62.8705
2017-12-18,63.3003
2017-12-19,63.0561
2017-12-20,63.0463
2017-12-21,63.1831
2017-12-22,63.1831
2017-12-26,63.1147
2017-12-27,63.1538
2017-12-28,63.2906
2017-12-29,63.0268
2018-01-02,63.4859
2018-01-03,63.8376
2018-01-04,64.0818
2018-01-05,64.4921
2018-01-08,64.6386
2018-01-09,64.7461
2018-01-10,64.6386
2018-01-11,65.1954
2018-01-12,65.5862
2018-01-16,65.2638
2018-01-17,65.8988
2018-01-18,65.7522
2018-01-19,66.1137
2018-01-22,66.651
2018-01-23,66.817
2018-01-24,66.7682
2018-01-25,66.7779
2018-01-26,67.4715
2018-01-29,67.0319
2018-01-30,66.3384
2018-01-31,66.3091
2018-02-01,66.2895
2018-02-02,64.9024
2018-02-05,62.3039
2018-02-06,63.4078
2018-02-07,63.0952
2018-02-08,60.8289
2018-02-09,61.6592
2018-02-12,62.4895
2018-02-13,62.6849
2018-02-14,63.5836
2018-02-15,64.3456
2018-02-16,64.3749
2018-02-20,63.9939
2018-02-21,63.7008
2018-02-22,63.7204
2018-02-23,64.7265
2018-02-26,65.4201
2018-02-27,64.5898
2018-02-28,63.8474
2018-03-01,63.105
2018-03-02,63.4957
2018-03-05,64.2283
2018-03-06,64.4628
2018-03-07,64.4823
2018-03-08,64.7363
2018-03-09,65.8304
2018-03-12,65.8011
2018-03-13,65.3713
2018-03-14,65.0684
2018-03-15,64.9805
2018-03-16,65.0757
2018-03-19,64.2518
2018-03-20,64.3303
2018-03-21,64.2714
2018-03-22,62.712
2018-03-23,61.4075
2018-03-26,63.0062
2018-03-27,61.9077
2018-03-28,61.7606
2018-03-29,62.5648
2018-04-02,61.1623
2018-04-03,61.9273
2018-04-04,62.6433
2018-04-05,63.0847
2018-04-06,61.7508
2018-04-09,61.9371
2018-04-10,62.9768
2018-04-11,62.7022
2018-04-12,63.1729
2018-04-13,62.9964
2018-04-16,63.4966
2018-04-17,64.2028
2018-04-18,64.291
2018-04-19,63.8987
2018-04-20,63.4181
2018-04-23,63.3691
2018-04-24,62.5845
2018-04-25,62.6923
2018-04-26,63.271
2018-04-27,63.3102
2018-04-30,62.8002
2018-05-01,62.967
2018-05-02,62.6139
2018-05-03,62.4471
2018-05-04,63.2416
2018-05-07,63.5162
2018-05-08,63.5751
2018-05-09,64.1537
2018-05-10,64.703
2018-05-11,64.8109
2018-05-14,64.8599
2018-05-15,64.4676
2018-05-16,64.7716
2018-05-17,64.7618
2018-05-18,64.6637
2018-05-21,65.1051
2018-05-22,64.8795
2018-05-23,65.0561
2018-05-24,64.9482
2018-05-25,64.8109
2018-05-29,64.1832
2018-05-30,65.0168
2018-05-31,64.5755
2018-06-01,65.2326
2018-06-04,65.5563
2018-06-05,65.6347
2018-06-06,66.2036
2018-06-07,66.1153
2018-06-08,66.3605
2018-06-11,66.439
2018-06-12,66.5763
2018-06-13,66.3311
2018-06-14,66.5272
2018-06-15,66.4488
2018-06-18,66.3801
2018-06-19,66.1251
2018-06-20,66.3311
2018-06-21,65.8309
2018-06-22,65.9486
2018-06-25,65.0266
2018-06-26,65.1718
2018-06-27,64.5513
2018-06-28,64.965
2018-06-29,65.0044
2018-07-02,65.1817
2018-07-03,64.9748
2018-07-05,65.5363
2018-07-06,66.088
2018-07-09,66.679
2018-07-10,66.8662
2018-07-11,66.4032
2018-07-12,66.9154
2018-07-13,66.9745
2018-07-16,66.876
2018-07-17,67.1715
2018-07-18,67.2996
2018-07-19,67.1518
2018-07-20,67.0336
2018-07-23,67.1321
2018-07-24,67.2602
2018-07-25,67.8709
2018-07-26,67.7527
2018-07-27,67.2208
2018-07-30,66.7873
2018-07-31,67.1912
2018-08-01,67.1223
2018-08-02,67.4966
2018-08-03,67.7429
2018-08-06,68.0285
2018-08-07,68.2551
2018-08-08,68.2058
2018-08-09,68.1566
2018-08-10,67.733
2018-08-13,67.4473
2018-08-14,67.9005
2018-08-15,67.3685
2018-08-16,67.9005
2018-08-17,68.1467
2018-08-20,68.324
2018-08-21,68.5408
2018-08-22,68.5605
2018-08-23,68.4127
2018-08-24,68.8461
2018-08-27,69.3387
2018-08-28,69.3682
2018-08-29,69.7425
2018-08-30,69.447
2018-08-31,69.4766
2018-09-04,69.3781
2018-09-05,69.1712
2018-09-06,68.9348
2018-09-07,68.7673
2018-09-10,68.9249
2018-09-11,69.1614
2018-09-12,69.1712
2018-09-13,69.5258
2018-09-14,69.5751
2018-09-17,69.1417
2018-09-18,69.4963
2018-09-19,69.5258
2018-09-20,70.0479
2018-09-21,69.9888
2018-09-24,69.7524
2018-09-25,69.7031
2018-09-26,69.4162
2018-09-27,69.624
2018-09-28,69.6438
2018-10-01,69.7526
2018-10-02,69.6438
2018-10-03,69.7328
2018-10-04,69.1392
2018-10-05,68.7137
2018-10-08,68.6346
2018-10-09,68.5159
2018-10-10,66.3392
2018-10-11,64.9441
2018-10-12,65.7653
2018-10-15,65.4982
2018-10-16,66.9328
2018-10-17,66.9229
2018-10-18,65.9236
2018-10-19,65.7653
2018-10-22,65.518
2018-10-23,65.1321
2018-10-24,63.094
2018-10-25,64.2614
2018-10-26,63.1632
2018-10-29,62.807
2018-10-30,63.7865
2018-10-31,64.4593
2018-11-01,65.2706
2018-11-02,64.9243
2018-11-05,65.2212
2018-11-06,65.6169
2018-11-07,66.9625
2018-11-08,66.8141
2018-11-09,66.1413
2018-11-12,64.8353
2018-11-13,64.7759
2018-11-14,64.3109
2018-11-15,65.0233
2018-11-16,65.1717
2018-11-19,64.024
2018-11-20,62.8763
2018-11-21,63.1632
2018-11-23,62.8367
2018-11-26,63.8063
2018-11-27,63.8855
2018-11-28,65.3696
2018-11-29,65.2904
2018-11-30,65.6961
2018-12-03,66.5173
2018-12-04,64.3505
2018-12-06,64.2417
2018-12-07,62.7675
2018-12-10,62.8268
2018-12-11,62.7872
2018-12-12,63.1671
2018-12-13,63.0179
2018-12-14,61.8741
2018-12-17,60.601
2018-12-18,60.5612
2018-12-19,59.5865
2018-12-20,58.6516
2018-12-21,57.4382
2018-12-24,55.9065
2018-12-26,58.7411
2018-12-27,59.2483
2018-12-28,59.1585
2018-12-31,59.6864
2019-01-02,59.7063
2019-01-03,58.3419
2019-01-04,60.3437
2019-01-07,60.8815
2019-01-08,61.5089
2019-01-09,61.8376
2019-01-10,62.1165
2019-01-11,62.1165
2019-01-14,61.738
2019-01-15,62.4152
2019-01-16,62.5945
2019-01-17,63.0925
2019-01-18,63.8992
2019-01-22,63.0427
2019-01-23,63.1024
2019-01-24,63.2419
2019-01-25,63.8195
2019-01-28,63.3713
2019-01-29,63.2718
2019-01-30,64.2278
2019-01-31,64.7955
2019-02-01,64.8852
2019-02-04,65.3533
2019-02-05,65.6222
2019-02-06,65.5126
2019-02-07,64.9449
2019-02-08,65.0146
2019-02-11,65.1043
2019-02-12,65.9409
2019-02-13,66.15
2019-02-14,66.0405
2019-02-15,66.7675
2019-02-19,66.887
2019-02-20,67.0264
2019-02-21,66.7774
2019-02-22,67.2356
2019-02-25,67.3352
2019-02-26,67.2157
2019-02-27,67.2256
2019-02-28,67.0762
2019-03-01,67.5344
2019-03-04,67.2057
2019-03-05,67.0961
2019-03-06,66.5683
2019-03-07,66.0405
2019-03-08,65.901
2019-03-11,66.897
2019-03-12,67.1161
2019-03-13,67.5543
2019-03-14,67.5045
2019-03-15,67.8033
2019-03-18,68.0821
2019-03-19,68.0423
2019-03-20,67.79
2019-03-21,68.55
2019-03-22,67.14
2019-03-25,67.09
2019-03-26,67.6
2019-03-27,67.31
2019-03-28,67.61
2019-03-29,68.05
2019-04-01,68.84
2019-04-02,68.82
2019-04-03,69.01
2019-04-04,69.12
2019-04-05,69.51
2019-04-08,69.55
2019-04-09,69.12
2019-04-10,69.47
2019-04-11,69.46
2019-04-12,69.92
2019-04-15,69.87
2019-04-16,69.9
2019-04-17,69.65
2019-04-18,69.73
2019-04-22,69.81
2019-04-23,70.44
2019-04-24,70.33
2019-04-25,70.25
2019-04-26,70.59
2019-04-29,70.73
2019-04-30,70.73
2019-05-01,70.2
2019-05-02,70.1
2019-05-03,70.83
2019-05-06,70.6
2019-05-07,69.42
2019-05-08,69.26
2019-05-09,69.09
2019-05-10,69.34
2019-05-13,67.62
2019-05-14,68.23
2019-05-15,68.62
2019-05-16,69.24
2019-05-17,68.75
2019-05-20,68.27
2019-05-21,68.91
2019-05-22,68.68
2019-05-23,67.8
2019-05-24,67.97
2019-05-28,67.37
2019-05-29,66.88
2019-05-30,67.04
2019-05-31,66.16
2019-06-03,66.02
2019-06-04,67.5
2019-06-05,68.03
2019-06-06,68.42
2019-06-07,69.04
2019-06-10,69.42
2019-06-11,69.36
2019-06-12,69.27
2019-06-13,69.4
2019-06-14,69.57
2019-06-17,69.625
2019-06-18,70.22
2019-06-19,70.43
2019-06-20,70.91
2019-06-21,71.05
2019-06-24,70.735
2019-06-25,70.145
2019-06-26,69.705
2019-06-27,70.04
2019-06-28,70.325
2019-07-01,70.96
2019-07-02,71.04
2019-07-03,71.695
2019-07-04,71.695
2019-07-05,71.715
2019-07-08,71.21
2019-07-09,71.255
2019-07-10,71.795
2019-07-11,71.66
2019-07-12,72.11
2019-07-15,72.14
2019-07-16,72.02
2019-07-17,71.685
2019-07-18,71.685
2019-07-19,71.46
2019-07-22,71.57
2019-07-23,71.92
2019-07-24,72.315
2019-07-25,72.09
2019-07-26,72.605
2019-07-29,72.42
2019-07-30,72.24
2019-07-31,71.88
2019-08-01,70.8
2019-08-02,70.28
2019-08-05,68.31
2019-08-06,69.08
2019-08-07,69.235
2019-08-08,70.42
2019-08-09,70.01
2019-08-12,69.125
2019-08-13,70.17
2019-08-14,68.16
2019-08-15,68.215
2019-08-16,69.32
2019-08-19,70.17
2019-08-20,69.705
2019-08-21,70.11
2019-08-22,70.195
2019-08-23,68.66
2019-08-26,68.89
2019-08-27,68.795
2019-08-28,69.135
2019-08-29,70.065
2019-08-30,70.07
2019-09-02,70.07
2019-09-03,69.59
2019-09-04,70.21
2019-09-05,71.305
2019-09-06,71.415
2019-09-09,71.265
2019-09-10,71.225
2019-09-11,71.865
2019-09-12,72.295
2019-09-13,72.225
2019-09-16,72.04
2019-09-17,72.05
2019-09-18,72.11
2019-09-19,72.16
2019-09-20,72.015
2019-09-23,71.835
2019-09-24,71.16
2019-09-25,70.96
2019-09-26,71.05
2019-09-27,70.6
2019-09-30,71.025
2019-10-01,70.24
2019-10-02,69.02
2019-10-03,69.21
2019-10-04,70.335
2019-10-07,70.185
2019-10-08,69.095
2019-10-09,69.7
2019-10-10,70.095
2019-10-11,71.31
2019-10-14,70.805
2019-10-15,71.5
2019-10-16,71.355
2019-10-17,71.545
2019-10-18,71.42
2019-10-21,71.75
2019-10-22,71.52
2019-10-23,71.65
2019-10-24,71.88
2019-10-25,72.195
2019-10-28,72.68
2019-10-29,72.565
2019-10-30,72.43
2019-10-31,72.375
2019-11-01,73.155
2019-11-04,73.54
2019-11-05,73.46
2019-11-06,73.415
2019-11-07,73.65
2019-11-08,73.71
2019-11-11,73.74
2019-11-12,73.85
2019-11-13,73.85
2019-11-14,74.04
2019-11-15,74.43
2019-11-18,74.57
2019-11-19,74.725
2019-11-20,74.4
2019-11-21,74.34
2019-11-22,74.4
2019-11-25,74.985
