date,close
2014-06-13,33.1375
2014-06-16,33.0151
2014-06-17,33.0528
2014-06-18,33.5894
2014-06-19,34.4743
2014-06-20,34.4743
2014-06-23,34.0695
2014-06-24,33.2128
2014-06-25,33.4482
2014-06-26,33.3348
2014-06-27,33.9773
2014-06-30,33.9962
2014-07-01,34.8371
2014-07-02,34.6198
2014-07-03,35.0167
2014-07-07,34.1096
2014-07-08,34.1001
2014-07-09,33.9206
2014-07-10,33.6183
2014-07-11,33.5332
2014-07-14,34.0718
2014-07-15,33.486
2014-07-16,33.6277
2014-07-17,33.0041
2014-07-18,33.5049
2014-07-21,33.1931
2014-07-22,33.5805
2014-07-23,33.2214
2014-07-24,33.2687
2014-07-25,32.8246
2014-07-28,32.0592
2014-07-29,31.8797
2014-07-30,31.9648
2014-07-31,30.7553
2014-08-01,31.001
2014-08-04,31.1049
2014-08-05,31.2656
2014-08-06,31.4734
2014-08-07,31.3506
2014-08-08,32.012
2014-08-11,32.5789
2014-08-12,32.3616
2014-08-13,32.6734
2014-08-14,32.7017
2014-08-15,32.3616
2014-08-18,32.7017
2014-08-19,32.6167
2014-08-20,32.4939
2014-08-21,32.6356
2014-08-22,32.664
2014-08-25,33.2498
2014-08-26,33.5805
2014-08-27,33.5332
2014-08-28,33.2687
2014-08-29,33.3254
2014-09-02,33.7505
2014-09-03,33.0891
2014-09-04,32.7962
2014-09-05,32.7017
2014-09-08,32.6734
2014-09-09,32.1537
2014-09-10,32.7017
2014-09-11,33.3632
2014-09-12,32.5695
2014-09-15,31.8986
2014-09-16,32.1915
2014-09-17,32.2955
2014-09-18,32.2766
2014-09-19,31.9459
2014-09-22,31.3506
2014-09-23,30.9537
2014-09-24,31.1522
2014-09-25,30.5475
2014-09-26,30.8036
2014-09-29,30.4811
2014-09-30,30.1775
2014-10-01,29.5419
2014-10-02,29.779
2014-10-03,30.0067
2014-10-06,29.8834
2014-10-07,29.4565
2014-10-08,30.5949
2014-10-09,29.6083
2014-10-10,29.5039
2014-10-13,28.9537
2014-10-14,29.4849
2014-10-15,30.9839
2014-10-16,31.6384
2014-10-17,32.4448
2014-10-20,31.7048
2014-10-21,32.2361
2014-10-22,31.1831
2014-10-23,32.2456
2014-10-24,32.4164
2014-10-27,32.5871
2014-10-28,33.9153
2014-10-29,33.9248
2014-10-30,34.4086
2014-10-31,35.0157
2014-11-03,32.3405
2014-11-04,33.6971
2014-11-05,33.8583
2014-11-06,34.0386
2014-11-07,34.494
2014-11-10,34.3896
2014-11-11,34.8355
2014-11-12,35.6608
2014-11-13,34.4086
2014-11-14,34.4086
2014-11-17,33.8773
2014-11-18,34.0386
2014-11-19,33.4789
2014-11-20,34.6268
2014-11-21,34.5509
2014-11-24,34.3042
2014-11-25,34.5983
2014-11-26,34.6552
2014-11-28,34.0101
2014-12-01,33.4694
2014-12-02,34.0576
2014-12-03,34.5129
2014-12-04,34.0006
2014-12-05,34.6457
2014-12-08,33.4694
2014-12-09,34.5699
2014-12-10,34.2473
2014-12-11,34.3611
2014-12-12,33.9058
2014-12-15,33.8868
2014-12-16,34.0671
2014-12-17,35.2909
2014-12-18,36.2016
2014-12-19,36.1352
2014-12-22,35.917
2014-12-23,36.6759
2014-12-24,36.6095
2014-12-26,36.7139
2014-12-29,36.8376
2014-12-30,36.7424
2014-12-31,36.1903
2015-01-02,35.4003
2015-01-05,35.029
2015-01-06,34.8482
2015-01-07,34.9053
2015-01-08,35.4955
2015-01-09,34.9148
2015-01-12,34.1248
2015-01-13,34.1343
2015-01-14,33.7535
2015-01-15,32.7445
2015-01-16,33.5346
2015-01-20,32.4019
2015-01-21,32.7731
2015-01-22,33.506
2015-01-23,33.4204
2015-01-26,33.4489
2015-01-27,33.0111
2015-01-28,32.3543
2015-01-29,33.3823
2015-01-30,32.4399
2015-02-02,33.5441
2015-02-03,34.3627
2015-02-04,33.7535
2015-02-05,34.4198
2015-02-06,34.0867
2015-02-09,34.0867
2015-02-10,34.5721
2015-02-11,34.0581
2015-02-12,34.7625
2015-02-13,35.2385
2015-02-17,35.01
2015-02-18,34.7435
2015-02-19,34.6483
2015-02-20,34.0677
2015-02-23,33.9058
2015-02-24,33.7916
2015-02-25,33.2395
2015-02-26,33.2776
2015-02-27,31.5261
2015-03-02,31.9164
2015-03-03,32.0306
2015-03-04,31.7927
2015-03-05,31.4785
2015-03-06,30.6219
2015-03-09,30.7075
2015-03-10,30.1745
2015-03-11,30.2125
2015-03-12,31.5357
2015-03-13,30.7551
2015-03-16,30.7837
2015-03-17,30.8218
2015-03-18,31.2501
2015-03-19,31.8974
2015-03-20,32.4019
2015-03-23,32.3733
2015-03-24,32.3638
2015-03-25,31.6023
2015-03-26,31.9354
2015-03-27,32.0215
2015-03-30,33.0917
2015-03-31,33.579
2015-04-01,33.5408
2015-04-02,33.4644
2015-04-06,33.9708
2015-04-07,33.7128
2015-04-08,33.7988
2015-04-09,34.1046
2015-04-10,34.3817
2015-04-13,34.5729
2015-04-14,34.506
2015-04-15,35.1653
2015-04-16,34.4773
2015-04-17,33.4835
2015-04-20,34.0473
2015-04-21,34.2288
2015-04-22,34.0759
2015-04-23,34.0855
2015-04-24,34.0568
2015-04-27,34.1715
2015-04-28,34.2862
2015-04-29,34.1428
2015-04-30,33.1681
2015-05-01,32.6235
2015-05-04,32.6521
2015-05-05,34.9933
2015-05-06,35.882
2015-05-07,35.8342
2015-05-08,36.1973
2015-05-11,36.4745
2015-05-12,35.882
2015-05-13,35.8342
2015-05-14,36.312
2015-05-15,36.226
2015-05-18,36.312
2015-05-19,36.054
2015-05-20,36.2069
2015-05-21,35.9393
2015-05-22,35.2131
2015-05-26,34.3244
2015-05-27,34.7544
2015-05-28,34.4677
2015-05-29,34.2575
2015-06-01,34.9073
2015-06-02,35.2226
2015-06-03,35.7387
2015-06-04,34.9742
2015-06-05,35.5571
2015-06-08,34.9837
2015-06-09,34.8309
2015-06-10,35.5475
2015-06-11,35.7864
2015-06-12,35.1175
2015-06-15,34.8213
2015-06-16,35.1175
2015-06-17,35.3564
2015-06-18,35.71
2015-06-19,36.0731
2015-06-22,36.0636
2015-06-23,35.9584
2015-06-24,35.3851
2015-06-25,34.9742
2015-06-26,35.3098
2015-06-29,34.2166
2015-06-30,34.0536
2015-07-01,34.2645
2015-07-02,34.2358
2015-07-06,34.2358
2015-07-07,34.2454
2015-07-08,33.5741
2015-07-09,33.4206
2015-07-10,33.5837
2015-07-13,33.7083
2015-07-14,33.459
2015-07-15,32.7494
2015-07-16,33.3535
2015-07-17,33.4111
2015-07-20,33.3919
2015-07-21,33.6796
2015-07-22,33.2384
2015-07-23,32.0301
2015-07-24,31.8959
2015-07-27,31.8767
2015-07-28,32.5959
2015-07-29,33.2193
2015-07-30,32.8644
2015-07-31,32.6247
2015-08-03,32.1356
2015-08-04,32.3753
2015-08-05,32.5384
2015-08-06,32.5767
2015-08-07,32.0876
2015-08-10,32.5192
2015-08-11,32.3658
2015-08-12,32.1835
2015-08-13,32.1164
2015-08-14,32.7589
2015-08-17,32.6151
2015-08-18,32.174
2015-08-19,31.7712
2015-08-20,31.3684
2015-08-21,31.1383
2015-08-24,30.6779
2015-08-25,31.2246
2015-08-26,32.2219
2015-08-27,32.5671
2015-08-28,32.9028
2015-08-31,33.085
2015-09-01,32.1548
2015-09-02,32.1356
2015-09-03,31.9917
2015-09-04,31.7232
2015-09-08,32.3082
2015-09-09,32.2794
2015-09-10,32.3178
2015-09-11,32.6439
2015-09-14,32.4712
2015-09-15,32.8261
2015-09-16,33.4111
2015-09-17,32.8644
2015-09-18,31.7424
2015-09-21,31.2917
2015-09-22,30.5629
2015-09-23,29.9012
2015-09-24,29.4217
2015-09-25,29.1723
2015-09-28,28.556
2015-09-29,28.5945
2015-09-30,28.5752
2015-10-01,28.0455
2015-10-02,28.8353
2015-10-05,30.2895
2015-10-06,30.617
2015-10-07,30.9348
2015-10-08,32.2735
2015-10-09,32.0713
2015-10-12,32.1098
2015-10-13,31.3779
2015-10-14,31.4549
2015-10-15,32.0809
2015-10-16,31.243
2015-10-19,31.0311
2015-10-20,31.1949
2015-10-21,30.3473
2015-10-22,31.1371
2015-10-23,31.4742
2015-10-26,31.2912
2015-10-27,30.4822
2015-10-28,32.0424
2015-10-29,31.9846
2015-10-30,31.6283
2015-11-02,32.8418
2015-11-03,33.8915
2015-11-04,34.9606
2015-11-05,36.2415
2015-11-06,36.4919
2015-11-09,36.5016
2015-11-10,36.8772
2015-11-11,38.1581
2015-11-12,36.2126
2015-11-13,36.4823
2015-11-16,36.8194
2015-11-17,36.463
2015-11-18,37.1661
2015-11-19,37.8499
2015-11-20,37.378
2015-11-23,37.6573
2015-11-24,38.264
2015-11-25,38.7648
2015-11-27,38.9864
2015-11-30,39.2657
2015-12-01,40.0169
2015-12-02,39.1982
2015-12-03,39.9302
2015-12-04,40.4503
2015-12-07,39.5257
2015-12-08,39.2753
2015-12-09,39.2464
2015-12-10,39.3427
2015-12-11,39.3427
2015-12-14,40.0169
2015-12-15,40.431
2015-12-16,41.7312
2015-12-17,41.1822
2015-12-18,39.6509
2015-12-21,39.8435
2015-12-22,40.4406
2015-12-23,41.6156
2015-12-24,41.7697
2015-12-28,42.0394
2015-12-29,42.7445
2015-12-30,42.6093
2015-12-31,41.4501
2016-01-04,40.204
2016-01-05,39.7886
2016-01-06,40.3393
2016-01-07,37.6249
2016-01-08,36.9583
2016-01-11,36.7651
2016-01-12,35.9924
2016-01-13,35.1809
2016-01-14,35.6832
2016-01-15,37.393
2016-01-19,37.3061
2016-01-20,39.6534
2016-01-21,38.417
2016-01-22,37.6249
2016-01-25,36.1662
2016-01-26,37.0742
2016-01-27,35.4321
2016-01-28,36.1952
2016-01-29,37.3157
2016-02-01,37.1612
2016-02-02,36.2918
2016-02-03,36.427
2016-02-04,36.9004
2016-02-05,36.7072
2016-02-08,35.5673
2016-02-09,35.6253
2016-02-10,35.8475
2016-02-11,36.0696
2016-02-12,35.0167
2016-02-16,36.3498
2016-02-17,38.301
2016-02-18,37.0646
2016-02-19,37.1998
2016-02-22,37.8084
2016-02-23,37.4993
2016-02-24,38.1175
2016-02-25,38.0112
2016-02-26,39.3636
2016-02-29,40.0398
2016-03-01,40.3779
2016-03-02,41.7592
2016-03-03,42.8894
2016-03-04,42.7445
2016-03-07,42.7639
2016-03-08,41.4115
2016-03-09,41.7303
2016-03-10,40.629
2016-03-11,41.624
2016-03-14,41.653
2016-03-15,40.6773
2016-03-16,42.1167
2016-03-17,42.8894
2016-03-18,42.4161
2016-03-21,43.3531
2016-03-22,45.2851
2016-03-23,44.9083
2016-03-24,44.918
2016-03-28,44.4257
2016-03-29,45.191
2016-03-30,45.8691
2016-03-31,46.305
2016-04-01,46.3728
2016-04-04,45.5494
2016-04-05,45.9272
2016-04-06,45.5107
2016-04-07,44.9488
2016-04-08,44.881
2016-04-11,43.951
2016-04-12,44.7066
2016-04-13,44.5032
2016-04-14,44.2223
2016-04-15,44.5613
2016-04-18,45.7916
2016-04-19,45.6463
2016-04-20,45.0263
2016-04-21,44.7066
2016-04-22,45.2394
2016-04-25,44.6776
2016-04-26,45.3073
2016-04-27,44.5904
2016-04-28,44.1254
2016-04-29,43.1954
2016-05-02,42.8854
2016-05-03,42.2655
2016-05-04,41.0739
2016-05-05,41.413
2016-05-06,42.0523
2016-05-09,41.9361
2016-05-10,41.6261
2016-05-11,41.7133
2016-05-12,41.8102
2016-05-13,41.5874
2016-05-16,41.6745
2016-05-17,40.4249
2016-05-18,39.8146
2016-05-19,39.0687
2016-05-20,39.9211
2016-05-23,39.4562
2016-05-24,40.9577
2016-05-25,41.0545
2016-05-26,40.7058
2016-05-27,40.6961
2016-05-31,41.5874
2016-06-01,41.9942
2016-06-02,41.8877
2016-06-03,41.6067
2016-06-06,43.4764
2016-06-07,42.9339
2016-06-08,44.1932
2016-06-09,43.147
2016-06-10,42.4592
2016-06-13,42.1492
2016-06-14,42.1589
2016-06-15,42.1008
2016-06-16,42.1298
2016-06-17,41.6067
2016-06-20,42.6239
2016-06-21,42.4786
2016-06-22,42.7886
2016-06-23,44.106
2016-06-24,41.568
2016-06-27,40.0668
2016-06-28,40.2709
2016-06-29,42.5546
2016-06-30,44.265
2016-07-01,43.818
2016-07-05,43.6236
2016-07-06,44.0706
2016-07-07,45.1104
2016-07-08,46.1697
2016-07-11,47.365
2016-07-12,48.1327
2016-07-13,47.8314
2016-07-14,48.5603
2016-07-15,48.5311
2016-07-18,48.8227
2016-07-19,47.8023
2016-07-20,47.8023
2016-07-21,47.2289
2016-07-22,46.7625
2016-07-25,47.676
2016-07-26,48.6477
2016-07-27,49.5612
2016-07-28,49.3086
2016-07-29,48.3756
2016-08-01,48.7255
2016-08-02,48.5506
2016-08-03,48.6575
2016-08-04,47.8703
2016-08-05,49.396
2016-08-08,49.2405
2016-08-09,49.6584
2016-08-10,49.0753
2016-08-11,48.4145
2016-08-12,47.9383
2016-08-15,48.5797
2016-08-16,47.2775
2016-08-17,46.8499
2016-08-18,47.6954
2016-08-19,46.9665
2016-08-22,47.054
2016-08-23,47.3941
2016-08-24,47.2775
2016-08-25,46.9665
2016-08-26,46.8111
2016-08-29,47.1123
2016-08-30,47.122
2016-08-31,46.6459
2016-09-01,46.9957
2016-09-02,47.6176
2016-09-06,47.4816
2016-09-07,47.9675
2016-09-08,48.0452
2016-09-09,45.6158
2016-09-12,45.227
2016-09-13,43.818
2016-09-14,43.6042
2016-09-15,44.7703
2016-09-16,44.9355
2016-09-19,45.9365
2016-09-20,45.5477
2016-09-21,46.7236
2016-09-22,47.7245
2016-09-23,46.5292
2016-09-26,46.9568
2016-09-27,47.2386
2016-09-28,48.2033
2016-09-29,47.112
2016-09-30,48.4664
2016-10-03,47.1412
2016-10-04,46.9366
2016-10-05,47.8915
2016-10-06,47.833
2016-10-07,47.2289
2016-10-10,47.2094
2016-10-11,45.095
2016-10-12,45.2021
2016-10-13,44.4616
2016-10-14,43.5652
2016-10-17,43.6041
2016-10-18,43.4288
2016-10-19,42.8539
2016-10-20,42.2985
2016-10-21,42.4154
2016-10-24,43.3508
2016-10-25,42.7077
2016-10-26,43.2241
2016-10-27,41.6164
2016-10-28,46.0499
2016-10-31,47.9012
2016-11-01,46.0109
2016-11-02,45.2898
2016-11-03,45.3386
2016-11-04,45.2801
2016-11-07,46.4591
2016-11-08,46.7417
2016-11-09,51.8378
2016-11-10,53.6014
2016-11-11,56.0569
2016-11-14,58.5513
2016-11-15,56.3979
2016-11-16,56.7487
2016-11-17,56.8851
2016-11-18,56.1641
2016-11-21,56.4174
2016-11-22,57.957
2016-11-23,59.7304
2016-11-25,59.555
2016-11-28,59.4868
2016-11-29,58.9606
2016-11-30,57.4795
2016-12-01,58.0544
2016-12-02,57.6354
2016-12-05,58.2006
2016-12-06,57.8888
2016-12-07,58.8826
2016-12-08,58.7755
2016-12-09,58.8534
2016-12-12,57.4893
2016-12-13,56.1738
2016-12-14,56.1738
2016-12-15,56.3785
2016-12-16,55.7256
2016-12-19,55.7841
2016-12-20,56.778
2016-12-21,55.3456
2016-12-22,55.3846
2016-12-23,54.8779
2016-12-27,55.2774
2016-12-28,54.6426
2016-12-29,54.0957
2016-12-30,53.7148
2017-01-03,53.8808
2017-01-04,55.4337
2017-01-05,54.4961
2017-01-06,53.3827
2017-01-09,51.7518
2017-01-10,53.2753
2017-01-11,53.4902
2017-01-12,52.8456
2017-01-13,53.7832
2017-01-17,53.0214
2017-01-18,54.0469
2017-01-19,54.0957
2017-01-20,54.5742
2017-01-23,53.4804
2017-01-24,56.5275
2017-01-25,58.1878
2017-01-26,57.4553
2017-01-27,56.8303
2017-01-30,56.0782
2017-01-31,54.8184
2017-02-01,54.6817
2017-02-02,53.5878
2017-02-03,54.2422
2017-02-06,52.6698
2017-02-07,52.7577
2017-02-08,51.9862
2017-02-09,52.6112
2017-02-10,53.3632
2017-02-13,52.7089
2017-02-14,53.2362
2017-02-15,53.7539
2017-02-16,53.6855
2017-02-17,52.1619
2017-02-21,53.7246
2017-02-22,53.0409
2017-02-23,51.8885
2017-02-24,52.6503
2017-02-27,53.4023
2017-02-28,51.7713
2017-03-01,52.953
2017-03-02,51.5369
2017-03-03,51.8787
2017-03-06,51.2341
2017-03-07,50.9216
2017-03-08,50.0134
2017-03-09,49.7301
2017-03-10,50.5798
2017-03-13,49.9938
2017-03-14,49.6325
2017-03-15,51.1658
2017-03-16,49.6715
2017-03-17,47.8355
2017-03-20,46.8198
2017-03-21,45.4232
2017-03-22,45.2767
2017-03-23,45.7455
2017-03-24,45.5013
2017-03-27,45.433
2017-03-28,45.7845
2017-03-29,47.7236
2017-03-30,49.2221
2017-03-31,49.1535
2017-04-03,49.1927
2017-04-04,48.8205
2017-04-05,49.7117
2017-04-06,48.4973
2017-04-07,52.7085
2017-04-10,52.5322
2017-04-11,52.5812
2017-04-12,51.8467
2017-04-13,50.5833
2017-04-17,51.3668
2017-04-18,51.3276
2017-04-19,50.6813
2017-04-20,51.2493
2017-04-21,50.6127
2017-04-24,51.7684
2017-04-25,52.7281
2017-04-26,52.6889
2017-04-27,52.542
2017-04-28,51.6215
2017-05-01,52.1699
2017-05-02,53.0121
2017-05-03,51.9936
2017-05-04,51.9936
2017-05-05,51.5823
2017-05-08,49.888
2017-05-09,48.7813
2017-05-10,48.135
2017-05-11,48.3113
2017-05-12,47.3809
2017-05-15,47.3809
2017-05-16,46.8031
2017-05-17,44.766
2017-05-18,45.2949
2017-05-19,45.9119
2017-05-22,45.3145
2017-05-23,45.8335
2017-05-24,45.4124
2017-05-25,46.0588
2017-05-26,46.4015
2017-05-30,45.6083
2017-05-31,45.8923
2017-06-01,46.4015
2017-06-02,46.9695
2017-06-05,46.3917
2017-06-06,45.8727
2017-06-07,45.5593
2017-06-08,46.6268
2017-06-09,49.5452
2017-06-12,48.6736
2017-06-13,48.9674
2017-06-14,48.9478
2017-06-15,48.9576
2017-06-16,48.3994
2017-06-19,48.9282
2017-06-20,46.8716
2017-06-21,46.4309
2017-06-22,46.1959
2017-06-23,47.2536
2017-06-26,48.0664
2017-06-27,47.0577
2017-06-28,47.48
2017-06-29,46.1837
2017-06-30,47.372
2017-07-03,48.6486
2017-07-05,48.8548
2017-07-06,48.5111
2017-07-07,49.3654
2017-07-10,48.8548
2017-07-11,48.4914
2017-07-12,48.9824
2017-07-13,49.5913
2017-07-14,49.4538
2017-07-17,49.1003
2017-07-18,48.1576
2017-07-19,48.7075
2017-07-20,47.6862
2017-07-21,48.1183
2017-07-24,48.1183
2017-07-25,48.8155
2017-07-26,47.804
2017-07-27,48.1085
2017-07-28,46.5176
2017-07-31,48.1379
2017-08-01,52.1838
2017-08-02,52.2722
2017-08-03,51.791
2017-08-04,52.1838
2017-08-07,52.2525
2017-08-08,52.5766
2017-08-09,52.5471
2017-08-10,50.5438
2017-08-11,51.4178
2017-08-14,51.8008
2017-08-15,50.4849
2017-08-16,49.9841
2017-08-17,49.1003
2017-08-18,48.5111
2017-08-21,47.8139
2017-08-22,48.5995
2017-08-23,48.7468
2017-08-24,49.4243
2017-08-25,50.8581
2017-08-28,51.0839
2017-08-29,51.5749
2017-08-30,52.1641
2017-08-31,54.2362
2017-09-01,54.0791
2017-09-05,54.3246
2017-09-06,55.0021
2017-09-07,54.5111
2017-09-08,54.7174
2017-09-11,54.1969
2017-09-12,55.5422
2017-09-13,56.2493
2017-09-14,56.0038
2017-09-15,55.935
2017-09-18,56.0431
2017-09-19,55.4931
2017-09-20,55.8761
2017-09-21,56.4948
2017-09-22,57.0054
2017-09-25,57.192
2017-09-26,57.3982
2017-09-27,57.8401
2017-09-28,57.0429
2017-09-29,57.0331
2017-10-02,58.3814
2017-10-03,57.9878
2017-10-04,57.5547
2017-10-05,58.1157
2017-10-06,59.0113
2017-10-09,57.6925
2017-10-10,58.3027
2017-10-11,57.3087
2017-10-12,57.4661
2017-10-13,57.5055
2017-10-16,57.6236
2017-10-17,57.4563
2017-10-18,57.0528
2017-10-19,56.7575
2017-10-20,56.915
2017-10-23,56.6197
2017-10-24,57.102
2017-10-25,55.6553
2017-10-26,56.9544
2017-10-27,62.1508
2017-10-30,62.8201
2017-10-31,62.6823
2017-11-01,61.8457
2017-11-02,62.8496
2017-11-03,63.1645
2017-11-06,64.877
2017-11-07,65.6053
2017-11-08,64.4636
2017-11-09,63.5582
2017-11-10,62.4658
2017-11-13,63.0661
2017-11-14,61.0387
2017-11-15,60.3104
2017-11-16,60.96
2017-11-17,62.2296
2017-11-20,63.8141
2017-11-21,64.5129
2017-11-22,64.0306
2017-11-24,63.3515
2017-11-27,62.6331
2017-11-28,63.8731
2017-11-29,64.4538
2017-11-30,65.3199
2017-12-01,64.5916
2017-12-04,64.6408
2017-12-05,63.5779
2017-12-06,64.257
2017-12-07,64.3357
2017-12-08,64.503
2017-12-11,62.3181
2017-12-12,62.5642
2017-12-13,62.4658
2017-12-14,60.8222
2017-12-15,61.393
2017-12-18,63.6468
2017-12-19,62.1804
2017-12-20,63.2826
2017-12-21,62.9972
2017-12-22,62.4953
2017-12-26,63.1645
2017-12-27,63.7944
2017-12-28,64.179
2017-12-29,62.5519
2018-01-02,63.114
2018-01-03,63.5084
2018-01-04,64.3171
2018-01-05,63.3211
2018-01-08,63.1929
2018-01-09,63.2619
2018-01-10,63.3605
2018-01-11,66.1316
2018-01-12,66.2204
2018-01-16,64.9482
2018-01-17,64.7313
2018-01-18,65.1948
2018-01-19,66.7036
2018-01-22,65.9738
2018-01-23,65.8555
2018-01-24,66.4472
2018-01-25,66.3979
2018-01-26,66.2697
2018-01-29,66.9008
2018-01-30,66.5754
2018-01-31,65.7667
2018-02-01,66.1513
2018-02-02,63.8437
2018-02-05,58.5284
2018-02-06,58.8242
2018-02-07,60.4612
2018-02-08,58.5382
2018-02-09,59.1496
2018-02-12,58.8735
2018-02-13,59.2483
2018-02-14,55.2938
2018-02-15,56.8716
2018-02-16,59.5244
2018-02-20,59.1694
2018-02-21,58.7157
2018-02-22,59.7413
2018-02-23,59.6822
2018-02-26,59.9583
2018-02-27,58.8143
2018-02-28,57.2957
2018-03-01,57.3252
2018-03-02,58.0156
2018-03-05,58.4199
2018-03-06,58.6073
2018-03-07,59.406
2018-03-08,59.337
2018-03-09,61.0924
2018-03-12,61.0825
2018-03-13,60.8557
2018-03-14,60.5697
2018-03-15,60.1259
2018-03-16,59.6624
2018-03-19,58.1142
2018-03-20,57.9071
2018-03-21,58.1536
2018-03-22,56.2996
2018-03-23,52.9664
2018-03-26,53.3313
2018-03-27,51.931
2018-03-28,52.7614
2018-03-29,55.223
2018-04-02,53.1865
2018-04-03,54.1949
2018-04-04,55.401
2018-04-05,56.9432
2018-04-06,54.6595
2018-04-09,53.8686
2018-04-10,55.4899
2018-04-11,54.62
2018-04-12,55.055
2018-04-13,54.4618
2018-04-16,55.1637
2018-04-17,55.6481
2018-04-18,55.6382
2018-04-19,55.3812
2018-04-20,54.2937
2018-04-23,54.531
2018-04-24,53.404
2018-04-25,54.0466
2018-04-26,52.6329
2018-04-27,52.5934
2018-04-30,51.7827
2018-05-01,53.4238
2018-05-02,53.9477
2018-05-03,53.7599
2018-05-04,53.4238
2018-05-07,55.0747
2018-05-08,56.7356
2018-05-09,56.1424
2018-05-10,56.261
2018-05-11,56.5675
2018-05-14,56.6367
2018-05-15,57.3485
2018-05-16,58.2679
2018-05-17,58.5843
2018-05-18,58.7424
2018-05-21,58.6238
2018-05-22,57.6747
2018-05-23,57.0223
2018-05-24,56.5379
2018-05-25,56.0337
2018-05-29,55.747
2018-05-30,56.6763
2018-05-31,56.2215
2018-06-01,56.528
2018-06-04,56.8147
2018-06-05,57.0322
2018-06-06,58.0702
2018-06-07,58.0998
2018-06-08,58.436
2018-06-11,57.9812
2018-06-12,57.4375
2018-06-13,57.4474
2018-06-14,56.439
2018-06-15,56.8839
2018-06-18,56.6169
2018-06-19,56.6268
2018-06-20,57.8428
2018-06-21,57.0717
2018-06-22,56.4884
2018-06-25,55.9348
2018-06-26,57.0025
2018-06-27,55.4998
2018-06-28,54.2018
2018-06-29,55.153
2018-07-02,55.5197
2018-07-03,54.9747
2018-07-05,55.6188
2018-07-06,55.6188
2018-07-09,56.2331
2018-07-10,56.2529
2018-07-11,55.6287
2018-07-12,55.5197
2018-07-13,55.5098
2018-07-16,53.7361
2018-07-17,54.0036
2018-07-18,54.4198
2018-07-19,54.8161
2018-07-20,54.1027
2018-07-23,53.7856
2018-07-24,52.9334
2018-07-25,51.5165
2018-07-26,51.5363
2018-07-27,50.585
2018-07-30,51.8831
2018-07-31,53.4586
2018-08-01,52.6362
2018-08-02,53.2604
2018-08-03,52.1605
2018-08-06,52.7353
2018-08-07,52.4974
2018-08-08,45.7495
2018-08-09,45.8684
2018-08-10,45.1252
2018-08-13,43.7677
2018-08-14,42.5786
2018-08-15,41.6769
2018-08-16,43.5992
2018-08-17,43.6488
2018-08-20,43.6587
2018-08-21,44.0154
2018-08-22,43.9857
2018-08-23,44.4316
2018-08-24,44.1541
2018-08-27,44.3622
2018-08-28,44.7388
2018-08-29,45.3036
2018-08-30,45.2243
2018-08-31,45.2639
2018-09-04,44.065
2018-09-05,44.6099
2018-09-06,44.5703
2018-09-07,44.3424
2018-09-10,45.145
2018-09-11,44.6496
2018-09-12,44.8973
2018-09-13,44.7388
2018-09-14,44.7883
2018-09-17,44.6892
2018-09-18,44.5901
2018-09-19,45.1549
2018-09-20,45.9477
2018-09-21,45.7792
2018-09-24,44.6694
2018-09-25,44.3622
2018-09-26,43.8172
2018-09-27,44.6918
2018-09-28,45.4173
2018-10-01,44.7614
2018-10-02,45.1688
2018-10-03,45.7751
2018-10-04,45.2086
2018-10-05,44.5328
2018-10-08,44.6322
2018-10-09,44.4036
2018-10-10,43.4694
2018-10-11,42.7737
2018-10-12,42.3365
2018-10-15,42.6247
2018-10-16,43.9564
2018-10-17,43.9067
2018-10-18,40.6072
2018-10-19,40.7762
2018-10-22,40.7662
2018-10-23,40.3786
2018-10-24,39.5737
2018-10-25,40.3091
2018-10-26,44.9402
2018-10-29,45.6955
2018-10-30,47.2061
2018-10-31,45.4372
2018-11-01,46.8981
2018-11-02,48.0708
2018-11-05,47.6931
2018-11-06,49.3329
2018-11-07,55.3455
2018-11-08,53.5169
2018-11-09,52.4734
2018-11-12,50.2969
2018-11-13,49.4522
2018-11-14,50.6447
2018-11-15,51.7777
2018-11-16,52.4038
2018-11-19,51.5988
2018-11-20,50.6348
2018-11-21,50.5056
2018-11-23,51.0621
2018-11-26,52.3243
2018-11-27,50.5752
2018-11-28,51.1814
2018-11-29,50.287
2018-11-30,50.3168
2018-12-03,49.1838
2018-12-04,46.2024
2018-12-06,46.6894
2018-12-07,45.2086
2018-12-10,43.2607
2018-12-11,42.0781
2018-12-12,42.4855
2018-12-13,41.0743
2018-12-14,40.1501
2018-12-17,40.0209
2018-12-18,40.5277
2018-12-19,39.7525
2018-12-20,39.3351
2018-12-21,39.0569
2018-12-24,38.5798
2018-12-26,40.4482
2018-12-27,40.319
2018-12-28,39.8704
2018-12-31,40.1595
2019-01-02,40.2592
2019-01-03,39.98
2019-01-04,41.645
2019-01-07,42.323
2019-01-08,42.8913
2019-01-09,42.991
2019-01-10,44.1276
2019-01-11,43.5393
2019-01-14,43.0707
2019-01-15,42.5623
2019-01-16,42.5025
2019-01-17,43.0109
2019-01-18,44.2771
2019-01-22,43.3698
2019-01-23,42.4925
2019-01-24,43.0109
2019-01-25,43.7986
2019-01-28,43.7786
2019-01-29,42.9112
2019-01-30,42.8913
2019-01-31,43.0907
2019-02-01,42.333
2019-02-04,43.1505
2019-02-05,43.8285
2019-02-06,43.7986
2019-02-07,42.0737
2019-02-08,42.0438
2019-02-11,41.5852
2019-02-12,43.9681
2019-02-13,44.5862
2019-02-14,44.6959
2019-02-15,45.3439
2019-02-19,45.1944
2019-02-20,48.2851
2019-02-21,46.6699
2019-02-22,46.5503
2019-02-25,46.9491
2019-02-26,46.1116
2019-02-27,46.1714
2019-02-28,46.4207
2019-03-01,47.7467
2019-03-04,48.0558
2019-03-05,48.0259
2019-03-06,46.969
2019-03-07,47.2881
2019-03-08,46.7298
2019-03-11,47.318
2019-03-12,47.1585
2019-03-13,46.5204
2019-03-14,46.0418
2019-03-15,45.9222
2019-03-18,46.6999
2019-03-19,45.9521
2019-03-20,45.2043
2019-03-21,45.7427
2019-03-22,42.981
2019-03-25,43.5194
2019-03-26,43.31
2019-03-27,43.32
2019-03-28,43.33
2019-03-29,43.15
2019-04-01,44.92
2019-04-02,43.79
2019-04-03,43.77
2019-04-04,44.5
2019-04-05,44.88
2019-04-08,44.19
2019-04-09,42.81
2019-04-10,43.48
2019-04-11,44.05
2019-04-12,44.48
2019-04-15,45.49
2019-04-16,46.26
2019-04-17,45.74
2019-04-18,46.4
2019-04-22,46.21
2019-04-23,45.35
2019-04-24,46.53
2019-04-25,43.48
2019-04-26,45.02
2019-04-29,44.54
2019-04-30,44.89
2019-05-01,45.48
2019-05-02,45.44
2019-05-03,46.98
2019-05-06,46.84
2019-05-07,44.96
2019-05-08,44.3
2019-05-09,43
2019-05-10,43.43
2019-05-13,41.48
2019-05-14,42.64
2019-05-15,42.21
2019-05-16,42.29
2019-05-17,41.27
2019-05-20,40.94
2019-05-21,41.46
2019-05-22,41.36
2019-05-23,40.03
2019-05-24,40.25
2019-05-28,40.11
2019-05-29,41.5
2019-05-30,41.14
2019-05-31,40.19
2019-06-03,40.44
2019-06-04,42.52
2019-06-05,41.98
2019-06-06,41.86
2019-06-07,42.34
2019-06-10,42.59
2019-06-11,42.66
2019-06-12,42.22
2019-06-13,42.925
2019-06-14,43.03
2019-06-17,43.305
2019-06-18,44.685
2019-06-19,44.8
2019-06-20,45.54
2019-06-21,45.23
2019-06-24,44.73
2019-06-25,45.44
2019-06-26,45.465
2019-06-27,46.81
2019-06-28,48.42
2019-07-01,47.55
2019-07-02,46.62
2019-07-03,47.21
2019-07-04,47.21
2019-07-05,47.015
2019-07-08,46.92
2019-07-09,46.735
2019-07-10,42.735
2019-07-11,42.84
2019-07-12,43.5
2019-07-15,43.07
2019-07-16,43.21
2019-07-17,42.19
2019-07-18,40.87
2019-07-19,41.85
2019-07-22,41.25
2019-07-23,42.565
2019-07-24,44.16
2019-07-25,43.73
2019-07-26,44.7
2019-07-29,44.35
2019-07-30,36.4
2019-07-31,35.515
2019-08-01,33.985
2019-08-02,31.19
2019-08-05,30.59
2019-08-06,30.45
2019-08-07,29.565
2019-08-08,29.87
2019-08-09,28.41
2019-08-12,27.9
2019-08-13,28.13
2019-08-14,27.11
2019-08-15,27.45
2019-08-16,28.5
2019-08-19,28.39
2019-08-20,28
2019-08-21,28.5
2019-08-22,28.16
2019-08-23,27.255
2019-08-26,27.41
2019-08-27,26.94
2019-08-28,27.375
2019-08-29,27.84
2019-08-30,28.43
2019-09-02,28.41
2019-09-03,27.83
2019-09-04,28.205
2019-09-05,28.86
2019-09-06,29.025
2019-09-09,29.28
2019-09-10,30.71
2019-09-11,32.105
2019-09-12,33.005
2019-09-13,33.54
2019-09-16,33.44
2019-09-17,33.56
2019-09-18,33.85
2019-09-19,32.88
2019-09-20,33.235
2019-09-23,32.91
2019-09-24,31.635
2019-09-25,32.3
2019-09-26,31.83
2019-09-27,31.585
2019-09-30,32.15
2019-10-01,31.225
2019-10-02,30.86
2019-10-03,31.115
2019-10-04,31.655
2019-10-07,31.31
2019-10-08,30.455
2019-10-09,31.31
2019-10-10,31.6
2019-10-11,32.74
2019-10-14,32.695
2019-10-15,32.91
2019-10-16,34.76
2019-10-17,34.87
2019-10-18,35.325
2019-10-21,36.33
2019-10-22,36.74
2019-10-23,37.405
2019-10-24,36.85
2019-10-25,26.25
2019-10-28,25.67
2019-10-29,23.655
2019-10-30,24.145
2019-10-31,23.48
2019-11-01,25.235
2019-11-04,26.78
2019-11-05,27.31
2019-11-06,26.665
2019-11-07,27.75
2019-11-08,27.94
2019-11-11,27.505
2019-11-12,27.445
2019-11-13,27.185
2019-11-14,27.3
2019-11-15,27.11
2019-11-18,26.505
2019-11-19,26.79
2019-11-20,26.23
2019-11-21,26.145
2019-11-22,26.185
2019-11-25,26.875
