date,close
2014-06-13,9.8314
2014-06-16,9.8125
2014-06-17,9.926
2014-06-18,9.989
2014-06-19,10.0268
2014-06-20,10.052
2014-06-23,10.1024
2014-06-24,10.052
2014-06-25,10.0835
2014-06-26,10.052
2014-06-27,10.0583
2014-06-30,10.0835
2014-07-01,10.1654
2014-07-02,10.1125
2014-07-03,10.1717
2014-07-07,10.1528
2014-07-08,10.1402
2014-07-09,10.1717
2014-07-10,10.0961
2014-07-11,10.052
2014-07-14,10.0079
2014-07-15,9.9953
2014-07-16,9.9764
2014-07-17,9.8377
2014-07-18,9.9323
2014-07-21,9.8818
2014-07-22,9.9386
2014-07-23,9.989
2014-07-24,10.0016
2014-07-25,9.9134
2014-07-28,9.8629
2014-07-29,9.844
2014-07-30,9.9071
2014-07-31,9.7558
2014-08-01,9.6361
2014-08-04,9.5982
2014-08-05,9.5478
2014-08-06,9.5541
2014-08-07,9.5226
2014-08-08,9.573
2014-08-11,9.6424
2014-08-12,9.5982
2014-08-13,9.6424
2014-08-14,9.6676
2014-08-15,9.6676
2014-08-18,9.7369
2014-08-19,9.8503
2014-08-20,9.8251
2014-08-21,9.8881
2014-08-22,9.8251
2014-08-25,9.8314
2014-08-26,9.9134
2014-08-27,9.9764
2014-08-28,9.8944
2014-08-29,9.9575
2014-09-02,9.9386
2014-09-03,9.9386
2014-09-04,9.8818
2014-09-05,9.8944
2014-09-08,9.8629
2014-09-09,9.7558
2014-09-10,9.8314
2014-09-11,9.9022
2014-09-12,9.7993
2014-09-15,9.722
2014-09-16,9.78
2014-09-17,9.8379
2014-09-18,9.9215
2014-09-19,9.8507
2014-09-22,9.6706
2014-09-23,9.5741
2014-09-24,9.6255
2014-09-25,9.3939
2014-09-26,9.4389
2014-09-29,9.381
2014-09-30,9.3296
2014-10-01,9.2652
2014-10-02,9.2202
2014-10-03,9.3489
2014-10-06,9.2073
2014-10-07,9.1301
2014-10-08,9.2137
2014-10-09,9.0529
2014-10-10,8.9242
2014-10-13,8.7827
2014-10-14,8.9113
2014-10-15,8.9178
2014-10-16,9.1494
2014-10-17,9.0979
2014-10-20,9.1237
2014-10-21,9.3682
2014-10-22,9.3038
2014-10-23,9.4196
2014-10-24,9.4389
2014-10-27,9.4196
2014-10-28,9.6384
2014-10-29,9.6255
2014-10-30,9.9086
2014-10-31,9.7993
2014-11-03,9.7607
2014-11-04,9.7092
2014-11-05,9.7607
2014-11-06,9.7864
2014-11-07,9.8057
2014-11-10,9.8379
2014-11-11,9.8636
2014-11-12,9.9086
2014-11-13,9.8765
2014-11-14,9.8572
2014-11-17,9.8379
2014-11-18,9.8958
2014-11-19,9.7993
2014-11-20,9.7864
2014-11-21,9.8314
2014-11-24,9.87
2014-11-25,9.8507
2014-11-26,9.8636
2014-11-28,9.8121
2014-12-01,9.5805
2014-12-02,9.6834
2014-12-03,9.7993
2014-12-04,9.8765
2014-12-05,9.9086
2014-12-08,9.8829
2014-12-09,9.8636
2014-12-10,9.7413
2014-12-11,9.9053
2014-12-12,9.5296
2014-12-15,9.3246
2014-12-16,9.311
2014-12-17,9.5569
2014-12-18,9.7413
2014-12-19,9.7892
2014-12-22,9.7413
2014-12-23,9.8097
2014-12-24,9.8233
2014-12-26,9.9395
2014-12-29,9.9326
2014-12-30,9.8302
2014-12-31,9.7892
2015-01-02,9.7687
2015-01-05,9.5023
2015-01-06,9.4339
2015-01-07,9.5296
2015-01-08,9.6389
2015-01-09,9.5706
2015-01-12,9.5569
2015-01-13,9.5364
2015-01-14,9.4954
2015-01-15,9.3998
2015-01-16,9.5227
2015-01-20,9.4544
2015-01-21,9.4818
2015-01-22,9.6047
2015-01-23,9.6457
2015-01-26,9.6184
2015-01-27,9.5637
2015-01-28,9.4818
2015-01-29,9.5501
2015-01-30,9.4476
2015-02-02,9.5159
2015-02-03,9.6867
2015-02-04,9.714
2015-02-05,9.7892
2015-02-06,9.7892
2015-02-09,9.714
2015-02-10,9.796
2015-02-11,9.796
2015-02-12,9.9599
2015-02-13,9.8711
2015-02-17,9.8643
2015-02-18,9.9599
2015-02-19,9.9531
2015-02-20,10.0214
2015-02-23,9.9395
2015-02-24,10.0351
2015-02-25,10.0351
2015-02-26,10.0804
2015-02-27,10.0635
2015-03-02,10.1171
2015-03-03,10.0829
2015-03-04,10.0488
2015-03-05,10.0283
2015-03-06,9.9463
2015-03-09,9.9599
2015-03-10,9.8848
2015-03-11,9.8778
2015-03-12,9.9127
2015-03-13,9.8988
2015-03-16,9.9336
2015-03-17,9.9267
2015-03-18,10.0034
2015-03-19,9.9476
2015-03-20,10.0034
2015-03-23,10.0104
2015-03-24,10.0104
2015-03-25,9.9685
2015-03-26,9.8709
2015-03-27,9.9685
2015-03-30,10.0313
2015-03-31,9.9894
2015-04-01,9.9267
2015-04-02,9.9197
2015-04-06,9.9755
2015-04-07,9.9825
2015-04-08,10.0313
2015-04-09,9.9546
2015-04-10,9.9755
2015-04-13,9.9894
2015-04-14,9.9825
2015-04-15,10.0732
2015-04-16,10.0801
2015-04-17,9.9546
2015-04-20,9.9825
2015-04-21,9.9894
2015-04-22,10.0174
2015-04-23,10.0174
2015-04-24,10.0871
2015-04-27,9.9825
2015-04-28,9.9964
2015-04-29,9.9825
2015-04-30,9.8918
2015-05-01,9.9615
2015-05-04,9.9755
2015-05-05,9.8429
2015-05-06,9.8639
2015-05-07,9.9127
2015-05-08,9.9825
2015-05-11,9.9267
2015-05-12,9.9546
2015-05-13,9.9476
2015-05-14,10.0732
2015-05-15,10.0522
2015-05-18,10.0941
2015-05-19,10.122
2015-05-20,10.0662
2015-05-21,10.0453
2015-05-22,10.0104
2015-05-26,9.8988
2015-05-27,9.9825
2015-05-28,9.9755
2015-05-29,9.836
2015-06-01,9.8709
2015-06-02,9.9057
2015-06-03,9.9964
2015-06-04,9.8918
2015-06-05,9.9267
2015-06-08,9.9127
2015-06-09,9.8848
2015-06-10,10.0104
2015-06-11,10.0389
2015-06-12,9.989
2015-06-15,9.9677
2015-06-16,9.989
2015-06-17,9.9819
2015-06-18,10.0175
2015-06-19,9.989
2015-06-22,10.0175
2015-06-23,10.0389
2015-06-24,9.9605
2015-06-25,9.989
2015-06-26,10.0104
2015-06-29,9.7398
2015-06-30,9.8181
2015-07-01,9.8395
2015-07-02,9.7754
2015-07-06,9.7469
2015-07-07,9.7754
2015-07-08,9.5761
2015-07-09,9.6117
2015-07-10,9.7185
2015-07-13,9.7469
2015-07-14,9.7612
2015-07-15,9.6615
2015-07-16,9.6829
2015-07-17,9.5903
2015-07-20,9.4977
2015-07-21,9.4123
2015-07-22,9.4266
2015-07-23,9.3554
2015-07-24,9.2984
2015-07-27,9.213
2015-07-28,9.2628
2015-07-29,9.3767
2015-07-30,9.3482
2015-07-31,9.391
2015-08-03,9.4194
2015-08-04,9.3554
2015-08-05,9.3269
2015-08-06,9.213
2015-08-07,9.0919
2015-08-10,9.2201
2015-08-11,9.2272
2015-08-12,9.213
2015-08-13,9.2058
2015-08-14,9.1916
2015-08-17,9.2557
2015-08-18,9.1702
2015-08-19,9.1489
2015-08-20,8.9851
2015-08-21,8.8641
2015-08-24,8.3728
2015-08-25,8.4654
2015-08-26,8.6434
2015-08-27,8.7359
2015-08-28,8.7715
2015-08-31,8.7502
2015-09-01,8.6078
2015-09-02,8.7359
2015-09-03,8.7146
2015-09-04,8.6363
2015-09-08,8.7715
2015-09-09,8.6861
2015-09-10,8.7152
2015-09-11,8.6788
2015-09-14,8.6351
2015-09-15,8.708
2015-09-16,8.7954
2015-09-17,8.8027
2015-09-18,8.7444
2015-09-21,8.7663
2015-09-22,8.7444
2015-09-23,8.6424
2015-09-24,8.6715
2015-09-25,8.5914
2015-09-28,8.3655
2015-09-29,8.2343
2015-09-30,8.38
2015-10-01,8.2926
2015-10-02,8.3509
2015-10-05,8.5185
2015-10-06,8.5185
2015-10-07,8.6351
2015-10-08,8.708
2015-10-09,8.7954
2015-10-12,8.8318
2015-10-13,8.7444
2015-10-14,8.6788
2015-10-15,8.8173
2015-10-16,8.8391
2015-10-19,8.8391
2015-10-20,8.8391
2015-10-21,8.7298
2015-10-22,8.8464
2015-10-23,8.9047
2015-10-26,8.8756
2015-10-27,8.708
2015-10-28,8.8756
2015-10-29,8.7735
2015-10-30,8.7663
2015-11-02,8.8318
2015-11-03,8.9339
2015-11-04,8.9484
2015-11-05,8.963
2015-11-06,9.0213
2015-11-09,8.9557
2015-11-10,8.9339
2015-11-11,8.8537
2015-11-12,8.7152
2015-11-13,8.6278
2015-11-16,8.7007
2015-11-17,8.6424
2015-11-18,8.7152
2015-11-19,8.7735
2015-11-20,8.8173
2015-11-23,8.8391
2015-11-24,8.8828
2015-11-25,8.9266
2015-11-27,8.9484
2015-11-30,8.9703
2015-12-01,9.0577
2015-12-02,8.9922
2015-12-03,8.8974
2015-12-04,8.9411
2015-12-07,8.81
2015-12-08,8.7663
2015-12-09,8.6861
2015-12-10,8.641
2015-12-11,8.4906
2015-12-14,8.4304
2015-12-15,8.4906
2015-12-16,8.5959
2015-12-17,8.5282
2015-12-18,8.483
2015-12-21,8.5883
2015-12-22,8.6786
2015-12-23,8.7839
2015-12-24,8.8139
2015-12-28,8.8591
2015-12-29,8.8967
2015-12-30,8.829
2015-12-31,8.8515
2016-01-04,8.8215
2016-01-05,8.7914
2016-01-06,8.6184
2016-01-07,8.2725
2016-01-08,8.0769
2016-01-11,8.0017
2016-01-12,8.0243
2016-01-13,7.746
2016-01-14,7.8137
2016-01-15,7.5505
2016-01-19,7.4302
2016-01-20,7.355
2016-01-21,7.4076
2016-01-22,7.6708
2016-01-25,7.543
2016-01-26,7.6483
2016-01-27,7.6107
2016-01-28,7.6708
2016-01-29,7.8739
2016-02-01,7.904
2016-02-02,7.7987
2016-02-03,7.7836
2016-02-04,7.8288
2016-02-05,7.7084
2016-02-08,7.5881
2016-02-09,7.5656
2016-02-10,7.5355
2016-02-11,7.4151
2016-02-12,7.5129
2016-02-16,7.6332
2016-02-17,7.7912
2016-02-18,7.7686
2016-02-19,7.8288
2016-02-22,7.904
2016-02-23,7.8965
2016-02-24,7.9491
2016-02-25,8.0243
2016-02-26,8.0544
2016-02-29,8.0769
2016-03-01,8.2273
2016-03-02,8.3402
2016-03-03,8.5282
2016-03-04,8.5432
2016-03-07,8.6335
2016-03-08,8.5808
2016-03-09,8.5883
2016-03-10,8.5422
2016-03-11,8.6345
2016-03-14,8.6499
2016-03-15,8.5499
2016-03-16,8.5922
2016-03-17,8.7269
2016-03-18,8.8577
2016-03-21,8.8885
2016-03-22,8.8885
2016-03-23,8.7961
2016-03-24,8.7038
2016-03-28,8.6884
2016-03-29,8.8654
2016-03-30,8.95
2016-03-31,9.0116
2016-04-01,8.9731
2016-04-04,8.85
2016-04-05,8.7345
2016-04-06,8.8038
2016-04-07,8.7345
2016-04-08,8.7192
2016-04-11,8.7345
2016-04-12,8.8423
2016-04-13,9.0039
2016-04-14,8.9885
2016-04-15,9.0039
2016-04-18,9.0501
2016-04-19,9.0962
2016-04-20,9.1347
2016-04-21,9.1116
2016-04-22,9.2425
2016-04-25,9.2271
2016-04-26,9.2732
2016-04-27,9.3117
2016-04-28,9.2655
2016-04-29,9.2425
2016-05-02,9.2578
2016-05-03,9.1424
2016-05-04,9.0809
2016-05-05,9.0578
2016-05-06,9.0424
2016-05-09,9.0732
2016-05-10,9.1193
2016-05-11,9.0501
2016-05-12,9.0424
2016-05-13,8.9885
2016-05-16,9.0501
2016-05-17,8.9423
2016-05-18,8.9423
2016-05-19,8.8423
2016-05-20,8.9192
2016-05-23,8.9269
2016-05-24,9.1039
2016-05-25,9.1347
2016-05-26,9.1578
2016-05-27,9.2271
2016-05-31,9.2502
2016-06-01,9.3194
2016-06-02,9.3502
2016-06-03,9.3348
2016-06-06,9.4387
2016-06-07,9.5118
2016-06-08,9.5888
2016-06-09,9.5888
2016-06-10,9.4631
2016-06-13,9.3375
2016-06-14,9.2825
2016-06-15,9.306
2016-06-16,9.2903
2016-06-17,9.2668
2016-06-20,9.3689
2016-06-21,9.3767
2016-06-22,9.3218
2016-06-23,9.4238
2016-06-24,9.1333
2016-06-27,8.8349
2016-06-28,8.9919
2016-06-29,9.149
2016-06-30,9.2432
2016-07-01,9.3375
2016-07-05,9.2118
2016-07-06,9.2432
2016-07-07,9.2668
2016-07-08,9.4553
2016-07-11,9.5495
2016-07-12,9.6594
2016-07-13,9.6359
2016-07-14,9.683
2016-07-15,9.6751
2016-07-18,9.7223
2016-07-19,9.683
2016-07-20,9.738
2016-07-21,9.6909
2016-07-22,9.7223
2016-07-25,9.6751
2016-07-26,9.8087
2016-07-27,9.9107
2016-07-28,9.9579
2016-07-29,9.9893
2016-08-01,9.9029
2016-08-02,9.7851
2016-08-03,9.8087
2016-08-04,9.895
2016-08-05,10.0128
2016-08-08,10.0128
2016-08-09,10.0285
2016-08-10,10.0285
2016-08-11,10.0835
2016-08-12,10.0364
2016-08-15,10.1149
2016-08-16,10.0364
2016-08-17,10.0207
2016-08-18,10.0914
2016-08-19,10.0521
2016-08-22,10.0442
2016-08-23,10.0678
2016-08-24,10.0442
2016-08-25,10.0678
2016-08-26,10.0364
2016-08-29,10.0521
2016-08-30,10.0285
2016-08-31,10.0128
2016-09-01,10.0018
2016-09-02,10.0678
2016-09-06,10.1149
2016-09-07,10.1542
2016-09-08,10.1542
2016-09-09,9.9701
2016-09-12,9.9782
2016-09-13,9.9061
2016-09-14,9.8261
2016-09-15,9.8661
2016-09-16,9.8581
2016-09-19,9.8661
2016-09-20,9.8581
2016-09-21,9.9381
2016-09-22,10.1142
2016-09-23,10.0982
2016-09-26,9.9862
2016-09-27,10.0742
2016-09-28,10.1222
2016-09-29,10.0902
2016-09-30,10.1302
2016-10-03,10.1382
2016-10-04,10.0982
2016-10-05,10.1142
2016-10-06,10.1222
2016-10-07,10.0822
2016-10-10,10.1302
2016-10-11,9.9621
2016-10-12,9.9621
2016-10-13,9.8661
2016-10-14,9.8741
2016-10-17,9.7621
2016-10-18,9.8101
2016-10-19,9.8181
2016-10-20,9.7941
2016-10-21,9.8021
2016-10-24,9.8581
2016-10-25,9.7781
2016-10-26,9.7301
2016-10-27,9.6901
2016-10-28,9.6421
2016-10-31,9.5541
2016-11-01,9.498
2016-11-02,9.378
2016-11-03,9.33
2016-11-04,9.37
2016-11-07,9.5301
2016-11-08,9.5621
2016-11-09,9.7781
2016-11-10,9.9782
2016-11-11,10.1222
2016-11-14,10.2742
2016-11-15,10.3302
2016-11-16,10.3302
2016-11-17,10.3462
2016-11-18,10.3862
2016-11-21,10.4422
2016-11-22,10.5463
2016-11-23,10.6343
2016-11-25,10.7543
2016-11-28,10.6983
2016-11-29,10.6583
2016-11-30,10.5863
2016-12-01,10.5623
2016-12-02,10.5943
2016-12-05,10.6903
2016-12-06,10.8343
2016-12-07,10.9864
2016-12-08,11.1144
2016-12-09,11.2123
2016-12-12,11.1552
2016-12-13,11.1878
2016-12-14,11.0491
2016-12-15,11.0736
2016-12-16,11.0736
2016-12-19,11.0491
2016-12-20,11.1144
2016-12-21,11.1225
2016-12-22,11.0817
2016-12-23,11.0491
2016-12-27,11.0573
2016-12-28,10.9267
2016-12-29,10.9512
2016-12-30,10.9267
2017-01-03,10.9022
2017-01-04,11.0491
2017-01-05,11.0491
2017-01-06,11.0736
2017-01-09,10.992
2017-01-10,11.0246
2017-01-11,11.0736
2017-01-12,11.1225
2017-01-13,11.1144
2017-01-17,11.0817
2017-01-18,11.1144
2017-01-19,11.0736
2017-01-20,11.0817
2017-01-23,11.0573
2017-01-24,11.2286
2017-01-25,11.3102
2017-01-26,11.351
2017-01-27,11.3184
2017-01-30,11.196
2017-01-31,11.2042
2017-02-01,11.3021
2017-02-02,11.3347
2017-02-03,11.4245
2017-02-06,11.3755
2017-02-07,11.3837
2017-02-08,11.3837
2017-02-09,11.5142
2017-02-10,11.6203
2017-02-13,11.6775
2017-02-14,11.7509
2017-02-15,11.7346
2017-02-16,11.7346
2017-02-17,11.7509
2017-02-21,11.7835
2017-02-22,11.7917
2017-02-23,11.7754
2017-02-24,11.7346
2017-02-27,11.7999
2017-02-28,11.6611
2017-03-01,11.8243
2017-03-02,11.7509
2017-03-03,11.6938
2017-03-06,11.6122
2017-03-07,11.4734
2017-03-08,11.449
2017-03-09,11.3592
2017-03-10,11.3592
2017-03-13,11.434
2017-03-14,11.4257
2017-03-15,11.6004
2017-03-16,11.5255
2017-03-17,11.6669
2017-03-20,11.6253
2017-03-21,11.3592
2017-03-22,11.3509
2017-03-23,11.4673
2017-03-24,11.4424
2017-03-27,11.459
2017-03-28,11.5172
2017-03-29,11.5588
2017-03-30,11.6502
2017-03-31,11.6419
2017-04-03,11.617
2017-04-04,11.5338
2017-04-05,11.5089
2017-04-06,11.592
2017-04-07,11.6752
2017-04-10,11.7001
2017-04-11,11.7667
2017-04-12,11.6835
2017-04-13,11.6336
2017-04-17,11.7334
2017-04-18,11.6835
2017-04-19,11.7417
2017-04-20,11.9247
2017-04-21,11.8748
2017-04-24,12.0245
2017-04-25,12.1159
2017-04-26,12.1908
2017-04-27,12.1492
2017-04-28,12.1159
2017-05-01,12.1409
2017-05-02,12.1492
2017-05-03,12.1575
2017-05-04,12.1076
2017-05-05,12.1658
2017-05-08,12.1492
2017-05-09,12.1076
2017-05-10,12.1076
2017-05-11,12.0411
2017-05-12,11.9829
2017-05-15,12.0328
2017-05-16,12.0245
2017-05-17,11.8249
2017-05-18,11.8665
2017-05-19,11.9579
2017-05-22,12.066
2017-05-23,12.1242
2017-05-24,12.0827
2017-05-25,12.0494
2017-05-26,12.0161
2017-05-30,12.0328
2017-05-31,11.9912
2017-06-01,12.1492
2017-06-02,12.2157
2017-06-05,12.2074
2017-06-06,12.1658
2017-06-07,12.1242
2017-06-08,12.2989
2017-06-09,12.2989
2017-06-12,12.2396
2017-06-13,12.2904
2017-06-14,12.2735
2017-06-15,12.1888
2017-06-16,12.1633
2017-06-19,12.2819
2017-06-20,12.1888
2017-06-21,12.0956
2017-06-22,12.1125
2017-06-23,12.1379
2017-06-26,12.2396
2017-06-27,12.1888
2017-06-28,12.3497
2017-06-29,12.2904
2017-06-30,12.3582
2017-07-03,12.4598
2017-07-05,12.4344
2017-07-06,12.2481
2017-07-07,12.4005
2017-07-10,12.4429
2017-07-11,12.4429
2017-07-12,12.5869
2017-07-13,12.5953
2017-07-14,12.6546
2017-07-17,12.68
2017-07-18,12.6546
2017-07-19,12.7224
2017-07-20,12.7563
2017-07-21,12.7563
2017-07-24,12.7732
2017-07-25,12.841
2017-07-26,12.7478
2017-07-27,12.5276
2017-07-28,12.5699
2017-07-31,12.6716
2017-08-01,12.6038
2017-08-02,12.6038
2017-08-03,12.5276
2017-08-04,12.5276
2017-08-07,12.5445
2017-08-08,12.5276
2017-08-09,12.392
2017-08-10,11.9939
2017-08-11,12.0786
2017-08-14,12.265
2017-08-15,12.2057
2017-08-16,12.2819
2017-08-17,12.0786
2017-08-18,12.0617
2017-08-21,12.0363
2017-08-22,12.1549
2017-08-23,12.1295
2017-08-24,12.1379
2017-08-25,12.1379
2017-08-28,12.1718
2017-08-29,12.2311
2017-08-30,12.3582
2017-08-31,12.5276
2017-09-01,12.6716
2017-09-05,12.4344
2017-09-06,12.5445
2017-09-07,12.5784
2017-09-08,12.5615
2017-09-11,12.6038
2017-09-12,12.647
2017-09-13,12.7506
2017-09-14,12.6988
2017-09-15,12.8369
2017-09-18,12.8887
2017-09-19,12.9664
2017-09-20,13.0527
2017-09-21,13.1131
2017-09-22,13.2685
2017-09-25,13.3203
2017-09-26,13.3549
2017-09-27,13.4498
2017-09-28,13.5275
2017-09-29,13.6311
2017-10-02,13.6656
2017-10-03,13.7002
2017-10-04,13.7002
2017-10-05,13.7261
2017-10-06,13.6225
2017-10-09,13.7002
2017-10-10,13.7951
2017-10-11,13.8124
2017-10-12,13.7951
2017-10-13,13.7692
2017-10-16,13.7692
2017-10-17,13.7174
2017-10-18,13.7261
2017-10-19,13.7088
2017-10-20,13.7606
2017-10-23,13.7174
2017-10-24,13.7261
2017-10-25,13.7002
2017-10-26,13.6484
2017-10-27,13.7606
2017-10-30,13.7606
2017-10-31,13.7779
2017-11-01,13.7347
2017-11-02,13.7433
2017-11-03,13.8383
2017-11-06,13.8901
2017-11-07,13.7692
2017-11-08,13.7779
2017-11-09,13.657
2017-11-10,13.6311
2017-11-13,13.3894
2017-11-14,13.2599
2017-11-15,13.1563
2017-11-16,13.3721
2017-11-17,13.493
2017-11-20,13.6225
2017-11-21,13.7347
2017-11-22,13.8038
2017-11-24,13.8124
2017-11-27,13.7865
2017-11-28,13.8383
2017-11-29,13.9505
2017-11-30,13.916
2017-12-01,13.8297
2017-12-04,13.7692
2017-12-05,13.7088
2017-12-06,13.6656
2017-12-07,13.7261
2017-12-08,13.752
2017-12-11,13.7088
2017-12-12,13.647
2017-12-13,13.6558
2017-12-14,13.6205
2017-12-15,13.8589
2017-12-18,13.9383
2017-12-19,14.0177
2017-12-20,14.0884
2017-12-21,14.1502
2017-12-22,14.2119
2017-12-26,14.2296
2017-12-27,14.2208
2017-12-28,14.1943
2017-12-29,14.2737
2018-01-02,14.3002
2018-01-03,14.3973
2018-01-04,14.4768
2018-01-05,14.5562
2018-01-08,14.5827
2018-01-09,14.6974
2018-01-10,14.6445
2018-01-11,14.7945
2018-01-12,14.9623
2018-01-16,14.927
2018-01-17,14.9446
2018-01-18,14.8652
2018-01-19,14.9623
2018-01-22,15.0241
2018-01-23,15.077
2018-01-24,15.077
2018-01-25,15.077
2018-01-26,15.0329
2018-01-29,14.8652
2018-01-30,14.6003
2018-01-31,14.6357
2018-02-01,14.5739
2018-02-02,14.309
2018-02-05,13.6205
2018-02-06,13.7706
2018-02-07,14.0089
2018-02-08,13.5322
2018-02-09,13.7176
2018-02-12,13.9206
2018-02-13,13.9824
2018-02-14,14.1766
2018-02-15,14.2561
2018-02-16,14.2737
2018-02-20,14.2296
2018-02-21,14.159
2018-02-22,14.1766
2018-02-23,14.1148
2018-02-26,14.1148
2018-02-27,14.0795
2018-02-28,14.0001
2018-03-01,13.8853
2018-03-02,13.9206
2018-03-05,14.0531
2018-03-06,14.1148
2018-03-07,14.106
2018-03-08,14.1855
2018-03-09,14.3922
2018-03-12,14.4821
2018-03-13,14.3832
2018-03-14,14.3203
2018-03-15,14.1945
2018-03-16,14.3203
2018-03-19,14.1135
2018-03-20,14.1675
2018-03-21,14.3653
2018-03-22,14.1135
2018-03-23,13.8169
2018-03-26,13.9517
2018-03-27,13.682
2018-03-28,13.8259
2018-03-29,13.9877
2018-04-02,13.8978
2018-04-03,13.8798
2018-04-04,14.0506
2018-04-05,14.2304
2018-04-06,13.8798
2018-04-09,13.9697
2018-04-10,14.2214
2018-04-11,14.2484
2018-04-12,14.3653
2018-04-13,14.3023
2018-04-16,14.4282
2018-04-17,14.4641
2018-04-18,14.6709
2018-04-19,14.617
2018-04-20,14.4462
2018-04-23,14.563
2018-04-24,14.3653
2018-04-25,14.5271
2018-04-26,14.599
2018-04-27,14.6349
2018-04-30,14.4731
2018-05-01,14.2034
2018-05-02,14.1405
2018-05-03,14.1765
2018-05-04,14.3383
2018-05-07,14.3563
2018-05-08,14.3383
2018-05-09,14.4282
2018-05-10,14.4462
2018-05-11,14.4282
2018-05-14,14.4192
2018-05-15,14.4462
2018-05-16,14.5271
2018-05-17,14.6979
2018-05-18,14.9136
2018-05-21,14.9765
2018-05-22,14.8777
2018-05-23,14.9046
2018-05-24,14.8597
2018-05-25,14.6709
2018-05-29,14.4282
2018-05-30,14.608
2018-05-31,14.545
2018-06-01,14.6439
2018-06-04,14.8507
2018-06-05,14.8057
2018-06-06,14.8507
2018-06-07,14.8777
2018-06-08,14.8502
2018-06-11,14.8685
2018-06-12,14.9326
2018-06-13,14.841
2018-06-14,14.896
2018-06-15,14.8639
2018-06-18,14.8319
2018-06-19,14.8777
2018-06-20,14.8227
2018-06-21,14.8044
2018-06-22,14.7769
2018-06-25,14.5481
2018-06-26,14.4565
2018-06-27,14.3649
2018-06-28,14.429
2018-06-29,14.4657
2018-07-02,14.4199
2018-07-03,14.2642
2018-07-05,14.5755
2018-07-06,14.5206
2018-07-09,14.6305
2018-07-10,14.4931
2018-07-11,14.429
2018-07-12,14.429
2018-07-13,14.4016
2018-07-16,14.2734
2018-07-17,14.3649
2018-07-18,14.4473
2018-07-19,14.5206
2018-07-20,14.5297
2018-07-23,14.5755
2018-07-24,14.484
2018-07-25,14.6305
2018-07-26,14.6854
2018-07-27,14.5481
2018-07-30,14.4565
2018-07-31,14.5389
2018-08-01,14.5389
2018-08-02,14.6396
2018-08-03,14.7037
2018-08-06,14.7129
2018-08-07,14.7586
2018-08-08,14.7403
2018-08-09,14.8593
2018-08-10,14.7861
2018-08-13,14.7403
2018-08-14,14.8502
2018-08-15,14.7312
2018-08-16,14.8319
2018-08-17,14.9784
2018-08-20,14.9417
2018-08-21,15.1065
2018-08-22,15.1249
2018-08-23,15.0882
2018-08-24,15.1523
2018-08-27,15.2164
2018-08-28,15.2805
2018-08-29,15.3263
2018-08-30,15.3263
2018-08-31,15.3537
2018-09-04,15.2164
2018-09-05,15.2439
2018-09-06,15.1889
2018-09-07,15.2897
2018-09-10,15.3812
2018-09-11,15.3812
2018-09-12,15.3812
2018-09-13,15.3812
2018-09-14,15.3719
2018-09-17,15.1854
2018-09-18,15.2507
2018-09-19,15.316
2018-09-20,15.5676
2018-09-21,15.521
2018-09-24,15.4651
2018-09-25,15.4744
2018-09-26,15.3346
2018-09-27,15.3532
2018-09-28,15.2414
2018-10-01,15.1575
2018-10-02,15.027
2018-10-03,15.0736
2018-10-04,14.7287
2018-10-05,14.3278
2018-10-08,14.3371
2018-10-09,14.2719
2018-10-10,13.7685
2018-10-11,13.3211
2018-10-12,13.3956
2018-10-15,13.5541
2018-10-16,13.9922
2018-10-17,13.9549
2018-10-18,13.7872
2018-10-19,13.6753
2018-10-22,13.5448
2018-10-23,13.3583
2018-10-24,12.9668
2018-10-25,13.1533
2018-10-26,12.9668
2018-10-29,12.799
2018-10-30,12.9016
2018-10-31,13.0134
2018-11-01,13.2922
2018-11-02,13.1905
2018-11-05,13.2465
2018-11-06,13.3583
2018-11-07,13.6566
2018-11-08,13.6846
2018-11-09,13.4609
2018-11-12,13.2372
2018-11-13,13.1999
2018-11-14,13.0321
2018-11-15,13.1812
2018-11-16,13.1067
2018-11-19,12.855
2018-11-20,12.5287
2018-11-21,12.6499
2018-11-23,12.6965
2018-11-26,12.8363
2018-11-27,12.8736
2018-11-28,13.1439
2018-11-29,13.2092
2018-11-30,13.2651
2018-12-03,13.3677
2018-12-04,12.8922
2018-12-06,12.7245
2018-12-07,12.5194
2018-12-10,12.3702
2018-12-11,12.2397
2018-12-12,12.326
2018-12-13,12.2205
2018-12-14,11.9232
2018-12-17,11.597
2018-12-18,11.5203
2018-12-19,11.2613
2018-12-20,10.8968
2018-12-21,10.657
2018-12-24,10.6282
2018-12-26,11.127
2018-12-27,11.1654
2018-12-28,11.2613
2018-12-31,11.3189
2019-01-02,11.5203
2019-01-03,11.3572
2019-01-04,11.6354
2019-01-07,11.9519
2019-01-08,12.1918
2019-01-09,12.3356
2019-01-10,12.4412
2019-01-11,12.3644
2019-01-14,12.2685
2019-01-15,12.4316
2019-01-16,12.4891
2019-01-17,12.6234
2019-01-18,12.7001
2019-01-22,12.4891
2019-01-23,12.4699
2019-01-24,12.5563
2019-01-25,12.7385
2019-01-28,12.7001
2019-01-29,12.7673
2019-01-30,12.9399
2019-01-31,13.0646
2019-02-01,13.0646
2019-02-04,13.1702
2019-02-05,13.1414
2019-02-06,13.1606
2019-02-07,13.0359
2019-02-08,13.0742
2019-02-11,13.1318
2019-02-12,13.2661
2019-02-13,13.3524
2019-02-14,13.362
2019-02-15,13.4387
2019-02-19,13.5922
2019-02-20,13.6977
2019-02-21,13.6306
2019-02-22,13.7937
2019-02-25,13.8033
2019-02-26,13.7265
2019-02-27,13.7265
2019-02-28,13.6881
2019-03-01,13.7169
2019-03-04,13.6977
2019-03-05,13.7265
2019-03-06,13.4675
2019-03-07,13.2949
2019-03-08,13.2753
2019-03-11,13.4908
2019-03-12,13.5202
2019-03-13,13.6378
2019-03-14,13.628
2019-03-15,13.5888
2019-03-18,13.628
2019-03-19,13.5986
2019-03-20,13.53
2019-03-21,13.7357
2019-03-22,13.3537
2019-03-25,13.3341
2019-03-26,13.3243
2019-03-27,13.3634
2019-03-28,13.432
2019-03-29,13.481
2019-04-01,13.6182
2019-04-02,13.628
2019-04-03,13.7162
2019-04-04,13.7357
2019-04-05,13.8827
2019-04-08,13.9219
2019-04-09,13.8141
2019-04-10,13.9415
2019-04-11,13.9807
2019-04-12,13.9513
2019-04-15,13.9415
2019-04-16,14.0199
2019-04-17,13.9513
2019-04-18,13.9905
2019-04-22,13.9121
2019-04-23,14.0786
2019-04-24,14.108
2019-04-25,14.0003
2019-04-26,14.0297
2019-04-29,14.0982
2019-04-30,14.0493
2019-05-01,14.0297
2019-05-02,13.9807
2019-05-03,14.1766
2019-05-06,14.2158
2019-05-07,13.8729
2019-05-08,13.8827
2019-05-09,13.7553
2019-05-10,13.8141
2019-05-13,13.4124
2019-05-14,13.53
2019-05-15,13.579
2019-05-16,13.677
2019-05-17,13.481
2019-05-20,13.3145
2019-05-21,13.5006
2019-05-22,13.4124
2019-05-23,13.1969
2019-05-24,13.3047
2019-05-28,13.1577
2019-05-29,13.001
2019-05-30,13.0205
2019-05-31,12.8638
2019-06-03,12.8736
2019-06-04,13.2361
2019-06-05,13.2459
2019-06-06,13.2851
2019-06-07,13.3634
2019-06-10,13.5006
2019-06-11,13.53
2019-06-12,13.53
2019-06-13,13.56
2019-06-14,13.54
2019-06-17,13.57
2019-06-18,13.7
2019-06-19,13.69
2019-06-20,13.84
2019-06-21,13.735
2019-06-24,13.63
2019-06-25,13.5
2019-06-26,13.525
2019-06-27,13.73
2019-06-28,13.91
2019-07-01,14.03
2019-07-02,13.92
2019-07-03,14.015
2019-07-04,14.015
2019-07-05,13.95
2019-07-08,13.82
2019-07-09,13.77
2019-07-10,13.87
2019-07-11,13.81
2019-07-12,13.9
2019-07-15,13.86
2019-07-16,13.91
2019-07-17,13.84
2019-07-18,13.87
2019-07-19,13.85
2019-07-22,13.85
2019-07-23,13.97
2019-07-24,14.2
2019-07-25,14.07
2019-07-26,14.12
2019-07-29,14.07
2019-07-30,14.135
2019-07-31,14.115
2019-08-01,13.895
2019-08-02,13.805
2019-08-05,13.26
2019-08-06,13.42
2019-08-07,13.35
2019-08-08,13.625
2019-08-09,13.52
2019-08-12,13.39
2019-08-13,13.445
2019-08-14,13.085
2019-08-15,13.05
2019-08-16,13.29
2019-08-19,13.46
2019-08-20,13.405
2019-08-21,13.525
2019-08-22,13.47
2019-08-23,13.125
2019-08-26,13.26
2019-08-27,13.09
2019-08-28,13.27
2019-08-29,13.39
2019-08-30,13.43
2019-09-02,13.43
2019-09-03,13.39
2019-09-04,13.5
2019-09-05,13.8
2019-09-06,13.825
2019-09-09,13.91
2019-09-10,14.025
2019-09-11,14.285
2019-09-12,14.15
2019-09-13,14.19
2019-09-16,14.195
2019-09-17,14.07
2019-09-18,13.95
2019-09-19,14.005
2019-09-20,14.03
2019-09-23,13.95
2019-09-24,13.8
2019-09-25,13.935
2019-09-26,13.775
2019-09-27,13.73
2019-09-30,13.775
2019-10-01,13.525
2019-10-02,13.33
2019-10-03,13.34
2019-10-04,13.425
2019-10-07,13.415
2019-10-08,13.235
2019-10-09,13.32
2019-10-10,13.385
2019-10-11,13.49
2019-10-14,13.445
2019-10-15,13.59
2019-10-16,13.555
2019-10-17,13.71
2019-10-18,13.705
2019-10-21,13.795
2019-10-22,13.84
2019-10-23,13.835
2019-10-24,13.8
2019-10-25,13.915
2019-10-28,14.025
2019-10-29,14.055
2019-10-30,14.065
2019-10-31,13.97
2019-11-01,14.17
2019-11-04,14.265
2019-11-05,14.345
2019-11-06,14.335
2019-11-07,14.365
2019-11-08,14.405
2019-11-11,14.405
2019-11-12,14.39
2019-11-13,14.35
2019-11-14,14.335
2019-11-15,14.415
2019-11-18,14.365
2019-11-19,14.395
2019-11-20,14.365
2019-11-21,14.285
2019-11-22,14.215
2019-11-25,14.42
