date,close
2016-10-07,19.6392
2016-10-11,19.4391
2016-10-13,19.0484
2016-10-14,19.1532
2016-10-17,19.0198
2016-10-18,19.1913
2016-10-19,19.6696
2016-10-20,19.763
2016-10-21,19.763
2016-10-25,19.9147
2016-10-26,20.0775
2016-10-27,20.2528
2016-10-28,19.9917
2016-11-02,19.7154
2016-11-03,19.8683
2016-11-08,20.249
2016-11-09,21.3067
2016-11-10,22.1391
2016-11-11,22.4121
2016-11-14,22.9705
2016-11-15,23.0315
2016-11-16,22.6503
2016-11-17,22.975
2016-11-18,23.2602
2016-11-21,23.1839
2016-11-22,23.2567
2016-11-23,23.41
2016-11-25,23.4603
2016-11-28,23.0505
2016-11-29,23.1029
2016-11-30,23.5842
2016-12-01,23.9558
2016-12-02,23.7557
2016-12-05,23.944
2016-12-06,24.3781
2016-12-07,24.6419
2016-12-08,25.023
2016-12-09,24.9754
2016-12-12,24.6228
2016-12-13,24.6798
2016-12-14,24.6876
2016-12-15,24.9468
2016-12-16,24.6419
2016-12-19,24.7177
2016-12-20,25.1797
2016-12-21,25.1175
2016-12-22,25.121
2016-12-23,25.1878
2016-12-27,25.2928
2016-12-28,25.0064
2016-12-29,24.701
2016-12-30,24.8156
2017-01-03,24.9001
2017-01-04,25.3023
2017-01-05,24.8919
2017-01-06,25.0733
2017-01-09,24.911
2017-01-10,25.1019
2017-01-11,25.1781
2017-01-12,24.9396
2017-01-13,25.1973
2017-01-17,24.1761
2017-01-18,24.5006
2017-01-19,24.3388
2017-01-20,24.5674
2017-01-23,24.5388
2017-01-24,24.9015
2017-01-25,25.4073
2017-01-26,25.5122
2017-01-27,25.3691
2017-01-30,25.1114
2017-01-31,24.9587
2017-02-01,25.0255
2017-02-02,24.7774
2017-02-03,25.4164
2017-02-06,25.2737
2017-02-07,25.1782
2017-02-08,24.8919
2017-02-09,25.331
2017-02-10,25.3882
2017-02-13,25.6841
2017-02-14,26.1613
2017-02-15,26.3618
2017-02-16,26.3045
2017-02-17,26.1422
2017-02-21,26.314
2017-02-22,26.2759
2017-02-23,26.2568
2017-02-24,25.9609
2017-02-27,26.2568
2017-02-28,26.1422
2017-03-01,27.0585
2017-03-02,26.3808
2017-03-03,26.5592
2017-03-06,26.3938
2017-03-07,26.2705
2017-03-08,26.2089
2017-03-09,26.2377
2017-03-10,26.1136
2017-03-13,26.085
2017-03-14,26.0468
2017-03-15,25.8368
2017-03-16,25.9704
2017-03-17,25.7986
2017-03-20,25.4646
2017-03-21,24.2906
2017-03-22,24.3097
2017-03-23,24.3837
2017-03-24,24.441
2017-03-27,24.2787
2017-03-28,24.6987
2017-03-29,24.5364
2017-03-30,25.0902
2017-03-31,24.7942
2017-04-03,24.6892
2017-04-04,24.651
2017-04-05,24.3359
2017-04-06,24.5746
2017-04-07,24.4505
2017-04-10,24.3168
2017-04-11,24.3168
2017-04-12,23.9922
2017-04-13,23.5913
2017-04-17,24.0495
2017-04-18,23.7631
2017-04-19,23.8013
2017-04-20,24.2405
2017-04-21,24.0973
2017-04-24,24.7083
2017-04-25,24.8229
2017-04-26,24.947
2017-04-27,24.7369
2017-04-28,24.4505
2017-05-01,24.7083
2017-05-02,24.5555
2017-05-03,24.8515
2017-05-04,24.9279
2017-05-05,24.861
2017-05-08,24.947
2017-05-09,24.7751
2017-05-10,24.861
2017-05-11,24.6319
2017-05-12,24.4791
2017-05-15,24.7178
2017-05-16,24.8419
2017-05-17,23.7917
2017-05-18,23.9254
2017-05-19,24.0686
2017-05-22,24.1388
2017-05-23,24.4982
2017-05-24,24.3741
2017-05-25,24.355
2017-05-26,24.2405
2017-05-30,24.0018
2017-05-31,23.7727
2017-06-01,24.0686
2017-06-02,23.8395
2017-06-05,23.8872
2017-06-06,23.7536
2017-06-07,24.0113
2017-06-08,24.546
2017-06-09,25.1666
2017-06-12,25.2047
2017-06-13,25.2334
2017-06-14,25.2525
2017-06-15,25.0806
2017-06-16,25.0424
2017-06-19,25.1856
2017-06-20,24.8992
2017-06-21,24.6224
2017-06-22,24.4468
2017-06-23,24.2456
2017-06-26,24.3989
2017-06-27,24.5713
2017-06-28,24.9736
2017-06-29,25.3568
2017-06-30,25.3281
2017-07-03,25.7975
2017-07-05,25.7783
2017-07-06,25.625
2017-07-07,25.7208
2017-07-10,25.6634
2017-07-11,25.5676
2017-07-12,25.4909
2017-07-13,25.6442
2017-07-14,25.4526
2017-07-17,25.4622
2017-07-18,25.3185
2017-07-19,25.3185
2017-07-20,25.2706
2017-07-21,25.1269
2017-07-24,25.3951
2017-07-25,25.7783
2017-07-26,25.4239
2017-07-27,25.3664
2017-07-28,25.2514
2017-07-31,25.4909
2017-08-01,25.6634
2017-08-02,25.6921
2017-08-03,25.5676
2017-08-04,25.8071
2017-08-07,25.6921
2017-08-08,25.7304
2017-08-09,25.5867
2017-08-10,24.9736
2017-08-11,24.7533
2017-08-14,25.2131
2017-08-15,25.2706
2017-08-16,25.1748
2017-08-17,24.5713
2017-08-18,24.5809
2017-08-21,24.4755
2017-08-22,24.7629
2017-08-23,24.8012
2017-08-24,24.8395
2017-08-25,24.9066
2017-08-28,24.7629
2017-08-29,24.6096
2017-08-30,24.7342
2017-08-31,24.6
2017-09-01,24.8108
2017-09-05,24.1738
2017-09-06,24.2264
2017-09-07,23.6613
2017-09-08,23.8049
2017-09-11,24.3318
2017-09-12,24.7821
2017-09-13,24.9353
2017-09-14,24.7725
2017-09-15,24.8108
2017-09-18,25.2323
2017-09-19,25.4358
2017-09-20,25.6538
2017-09-21,25.8212
2017-09-22,25.802
2017-09-25,25.802
2017-09-26,25.876
2017-09-27,26.3405
2017-09-28,26.3886
2017-09-29,26.5617
2017-10-02,26.706
2017-10-03,26.6579
2017-10-04,26.4078
2017-10-05,26.8214
2017-10-06,26.8791
2017-10-09,26.6867
2017-10-10,26.8502
2017-10-11,26.7444
2017-10-12,26.4655
2017-10-13,26.2828
2017-10-16,26.4848
2017-10-17,26.2732
2017-10-18,26.4367
2017-10-19,26.5329
2017-10-20,26.9368
2017-10-23,26.8502
2017-10-24,27.0425
2017-10-25,26.956
2017-10-26,27.1964
2017-10-27,27.2926
2017-10-30,27.0906
2017-10-31,27.0041
2017-11-01,27.0137
2017-11-02,27.2349
2017-11-03,27.2157
2017-11-06,27.1259
2017-11-07,26.4463
2017-11-08,26.2059
2017-11-09,26.0135
2017-11-10,25.927
2017-11-13,26.1674
2017-11-14,26.254
2017-11-15,26.3501
2017-11-16,26.302
2017-11-17,26.3598
2017-11-20,26.5329
2017-11-21,26.4655
2017-11-22,26.4184
2017-11-24,26.3213
2017-11-27,26.302
2017-11-28,27.1291
2017-11-29,27.9561
2017-11-30,27.9465
2017-12-01,27.9754
2017-12-04,28.5716
2017-12-05,28.235
2017-12-06,28.0812
2017-12-07,28.1678
2017-12-08,28.3312
2017-12-11,28.1581
2017-12-12,28.4851
2017-12-13,28.1004
2017-12-14,27.8119
2017-12-15,28.2447
2017-12-18,28.5812
2017-12-19,28.5332
2017-12-20,28.4178
2017-12-21,28.7477
2017-12-22,28.7091
2017-12-26,28.4713
2017-12-27,28.4221
2017-12-28,28.6029
2017-12-29,28.3518
2018-01-02,28.429
2018-01-03,28.5546
2018-01-04,28.7912
2018-01-05,28.8926
2018-01-08,28.8636
2018-01-09,29.1823
2018-01-10,29.5376
2018-01-11,29.7761
2018-01-12,29.9934
2018-01-16,29.9552
2018-01-17,30.0127
2018-01-18,29.9644
2018-01-19,30.3007
2018-01-22,30.5342
2018-01-23,30.6018
2018-01-24,30.745
2018-01-25,30.6694
2018-01-26,30.8022
2018-01-29,30.7853
2018-01-30,30.4956
2018-01-31,30.5149
2018-02-01,30.8818
2018-02-02,30.4569
2018-02-05,29.0277
2018-02-06,29.4623
2018-02-07,29.6844
2018-02-08,28.3904
2018-02-09,28.9698
2018-02-12,29.3657
2018-02-13,29.4913
2018-02-14,30.3367
2018-02-15,30.4473
2018-02-16,30.5245
2018-02-20,30.3507
2018-02-21,30.6211
2018-02-22,30.0803
2018-02-23,30.5825
2018-02-26,30.7563
2018-02-27,30.37
2018-02-28,29.9934
2018-03-01,29.7654
2018-03-02,30.061
2018-03-05,30.4183
2018-03-06,30.5825
2018-03-07,30.6018
2018-03-08,30.5149
2018-03-09,31.0749
2018-03-12,31.017
2018-03-13,30.708
2018-03-14,30.2541
2018-03-15,30.2252
2018-03-16,30.4183
2018-03-19,30.1383
2018-03-20,30.09
2018-03-21,30.2155
2018-03-22,28.9272
2018-03-23,27.9491
2018-03-26,28.8982
2018-03-27,28.1621
2018-03-28,28.2493
2018-03-29,28.5883
2018-04-02,28.0169
2018-04-03,28.3849
2018-04-04,28.7819
2018-04-05,29.0047
2018-04-06,28.1525
2018-04-09,28.3112
2018-04-10,28.7819
2018-04-11,28.5205
2018-04-12,29.1596
2018-04-13,28.4624
2018-04-16,28.472
2018-04-17,28.0556
2018-04-18,27.9103
2018-04-19,28.4527
2018-04-20,28.656
2018-04-23,28.8013
2018-04-24,28.9369
2018-04-25,28.9659
2018-04-26,28.8982
2018-04-27,29.1693
2018-04-30,28.7723
2018-05-01,28.8885
2018-05-02,28.6754
2018-05-03,28.4333
2018-05-04,28.7335
2018-05-07,28.8691
2018-05-08,29.1631
2018-05-09,29.6051
2018-05-10,29.7794
2018-05-11,29.7988
2018-05-14,29.7407
2018-05-15,29.8763
2018-05-16,29.8182
2018-05-17,29.8763
2018-05-18,29.4792
2018-05-21,29.4889
2018-05-22,29.7988
2018-05-23,29.547
2018-05-24,29.4405
2018-05-25,29.2565
2018-05-29,28.2202
2018-05-30,28.7142
2018-05-31,28.5592
2018-06-01,28.9135
2018-06-04,29.1209
2018-06-05,28.9659
2018-06-06,29.6051
2018-06-07,29.6148
2018-06-08,29.7116
2018-06-11,29.4308
2018-06-12,29.3667
2018-06-13,29.2739
2018-06-14,28.9175
2018-06-15,28.8933
2018-06-18,28.9078
2018-06-19,28.9611
2018-06-20,28.9562
2018-06-21,28.916
2018-06-22,28.5429
2018-06-25,28.3818
2018-06-26,28.1293
2018-06-27,27.7244
2018-06-28,27.7505
2018-06-29,27.6728
2018-07-02,27.9156
2018-07-03,27.7213
2018-07-05,27.7893
2018-07-06,27.9841
2018-07-09,28.6538
2018-07-10,28.3624
2018-07-11,28.207
2018-07-12,27.9933
2018-07-13,27.7213
2018-07-16,28.1973
2018-07-17,28.2604
2018-07-18,28.5761
2018-07-19,28.2167
2018-07-20,28.3721
2018-07-23,28.7995
2018-07-24,28.6149
2018-07-25,28.4401
2018-07-26,28.5586
2018-07-27,28.7121
2018-07-30,28.7121
2018-07-31,28.4887
2018-08-01,28.6538
2018-08-02,28.8675
2018-08-03,28.825
2018-08-06,28.8286
2018-08-07,28.9063
2018-08-08,29.1103
2018-08-09,28.9646
2018-08-10,28.7412
2018-08-13,28.4692
2018-08-14,28.8675
2018-08-15,28.5761
2018-08-16,29.0132
2018-08-17,29.0909
2018-08-20,29.1443
2018-08-21,29.3726
2018-08-22,29.2754
2018-08-23,29.052
2018-08-24,28.984
2018-08-27,29.2269
2018-08-28,29.1783
2018-08-29,29.0132
2018-08-30,28.7703
2018-08-31,28.8237
2018-09-04,28.9937
2018-09-05,29.0715
2018-09-06,28.916
2018-09-07,28.848
2018-09-10,28.7461
2018-09-11,28.7996
2018-09-12,28.2653
2018-09-13,27.935
2018-09-14,28.0682
2018-09-17,27.9609
2018-09-18,27.9121
2018-09-19,28.3706
2018-09-20,28.7413
2018-09-21,28.6145
2018-09-24,28.2438
2018-09-25,28.156
2018-09-26,27.6487
2018-09-27,27.3755
2018-09-28,27.2096
2018-10-01,27.117
2018-10-02,27.0828
2018-10-03,27.5804
2018-10-04,27.7657
2018-10-05,27.5511
2018-10-08,27.8243
2018-10-09,27.6291
2018-10-10,27.1511
2018-10-11,26.3218
2018-10-12,25.834
2018-10-15,25.7657
2018-10-16,25.8877
2018-10-17,26.2243
2018-10-18,25.7267
2018-10-19,25.6389
2018-10-22,24.8975
2018-10-23,24.9072
2018-10-24,24.0877
2018-10-25,24.6731
2018-10-26,24.4682
2018-10-29,24.917
2018-10-30,25.2584
2018-10-31,25.6194
2018-11-01,25.7755
2018-11-02,25.795
2018-11-05,25.9316
2018-11-06,26.0633
2018-11-07,26.1853
2018-11-08,26.3218
2018-11-09,26.2145
2018-11-12,25.9023
2018-11-13,26.1072
2018-11-14,25.6974
2018-11-15,26.0974
2018-11-16,26.0584
2018-11-19,26.0974
2018-11-20,25.6096
2018-11-21,25.5804
2018-11-23,25.4926
2018-11-26,26.0389
2018-11-27,25.8926
2018-11-28,26.1267
2018-11-29,26.0487
2018-11-30,26.2828
2018-12-03,26.3804
2018-12-04,25.0145
2018-12-06,24.7609
2018-12-07,24.3706
2018-12-10,23.7853
2018-12-11,23.4536
2018-12-12,23.5804
2018-12-13,23.0828
2018-12-14,22.7316
2018-12-17,22.595
2018-12-18,22.3036
2018-12-19,21.8155
2018-12-20,21.706
2018-12-21,21.3673
2018-12-24,20.929
2018-12-26,21.9251
2018-12-27,21.9251
2018-12-28,21.9948
2018-12-31,22.1741
2019-01-02,22.5726
2019-01-03,22.4232
2019-01-04,23.1205
2019-01-07,23.25
2019-01-08,23.3496
2019-01-09,23.5189
2019-01-10,23.4492
2019-01-11,23.5289
2019-01-14,23.7082
2019-01-15,23.9074
2019-01-16,24.4852
2019-01-17,24.7342
2019-01-18,25.2821
2019-01-22,25.1426
2019-01-23,25.2124
2019-01-24,25.2622
2019-01-25,25.4913
2019-01-28,25.5511
2019-01-29,25.4415
2019-01-30,25.3817
2019-01-31,25.0729
2019-02-01,25.2423
2019-02-04,25.4614
2019-02-05,25.3419
2019-02-06,25.3319
2019-02-07,25.6806
2019-02-08,25.4365
2019-02-11,25.5859
2019-02-12,25.9296
2019-02-13,25.8599
2019-02-14,25.6009
2019-02-15,26.1786
2019-02-19,26.3779
2019-02-20,26.6369
2019-02-21,26.4775
2019-02-22,26.4775
2019-02-25,26.4974
2019-02-26,26.2783
2019-02-27,26.5273
2019-02-28,26.4576
2019-03-01,26.5671
2019-03-04,26.4874
2019-03-05,26.4775
2019-03-06,26.0292
2019-03-07,25.6507
2019-03-08,25.7005
2019-03-11,25.8599
2019-03-12,25.83
2019-03-13,26.0392
2019-03-14,26.1786
2019-03-15,26.1986
2019-03-18,26.5771
2019-03-19,26.0491
2019-03-20,25.1825
2019-03-21,24.7499
2019-03-22,23.8
2019-03-25,23.75
2019-03-26,24.26
2019-03-27,24.22
2019-03-28,24.53
2019-03-29,24.39
2019-04-01,25.09
2019-04-02,25.13
2019-04-03,25.2
2019-04-04,25.47
2019-04-05,25.47
2019-04-08,25.53
2019-04-09,25.15
2019-04-10,25.32
2019-04-11,25.47
2019-04-12,25.93
2019-04-15,25.6
2019-04-16,25.99
2019-04-17,25.96
2019-04-18,25.79
2019-04-22,25.7
2019-04-23,26.1
2019-04-24,26.08
2019-04-25,26.02
2019-04-26,26.22
2019-04-29,26.53
2019-04-30,26.54
2019-05-01,26.23
2019-05-02,26.5
2019-05-03,26.77
2019-05-06,26.64
2019-05-07,26.13
2019-05-08,25.9
2019-05-09,25.91
2019-05-10,25.98
2019-05-13,25.05
2019-05-14,25.3
2019-05-15,24.89
2019-05-16,25.12
2019-05-17,25.03
2019-05-20,25.1
2019-05-21,25.3
2019-05-22,25.08
2019-05-23,24.64
2019-05-24,24.91
2019-05-28,24.54
2019-05-29,24.71
2019-05-30,24.29
2019-05-31,23.9237
2019-06-03,24.21
2019-06-04,25.01
2019-06-05,24.98
2019-06-06,24.95
2019-06-07,24.74
2019-06-10,24.98
2019-06-11,25.19
2019-06-12,24.83
2019-06-13,24.91
2019-06-14,24.43
2019-06-17,24.43
2019-06-18,24.415
2019-06-19,25.035
2019-06-20,25.035
2019-06-21,24.855
2019-06-24,24.855
2019-06-25,24.565
2019-06-26,24.495
2019-06-27,24.88
2019-06-28,25.3
2019-07-01,25.57
2019-07-02,25.24
2019-07-03,25.45
2019-07-04,25.45
2019-07-05,25.45
2019-07-08,25.45
2019-07-09,25.555
2019-07-10,25.41
2019-07-11,25.48
2019-07-12,25.48
2019-07-15,25.38
2019-07-16,25.435
2019-07-17,25.385
2019-07-18,25.385
2019-07-19,25.7
2019-07-22,25.58
2019-07-23,25.84
2019-07-24,26.365
2019-07-25,26.43
2019-07-26,26.43
2019-07-29,26.53
2019-07-30,26.49
2019-07-31,26.51
2019-08-01,25.35
2019-08-02,25.2
2019-08-05,25.2
2019-08-06,25.2
2019-08-07,25.2
2019-08-08,25.2
2019-08-09,25.2
2019-08-12,24.04
2019-08-13,23.91
2019-08-14,23.325
2019-08-15,23.325
2019-08-16,23.325
2019-08-19,23.775
2019-08-20,23.775
2019-08-21,23.635
2019-08-22,23.635
2019-08-23,23.18
2019-08-26,23.18
2019-08-27,23.18
2019-08-28,23.18
2019-08-29,23.18
2019-08-30,23.18
2019-09-02,23.18
2019-09-03,23.18
2019-09-04,23.18
2019-09-05,23.18
2019-09-06,23.18
2019-09-09,24.485
2019-09-10,24.485
2019-09-11,24.485
2019-09-12,24.485
2019-09-13,24.485
2019-09-16,24.485
2019-09-17,26.21
2019-09-18,26.21
2019-09-19,26.21
2019-09-20,26.21
2019-09-23,26.21
2019-09-24,26.21
2019-09-25,26.21
2019-09-26,25.58
2019-09-27,25.58
2019-09-30,25.625
2019-10-01,25.855
2019-10-02,25.855
2019-10-03,24.585
2019-10-04,24.605
2019-10-07,24.605
2019-10-08,24.38
2019-10-09,24.51
2019-10-10,24.79
2019-10-11,25.41
2019-10-14,25.27
2019-10-15,25.27
2019-10-16,25.685
2019-10-17,25.54
2019-10-18,25.54
2019-10-21,26.07
2019-10-22,26.335
2019-10-23,26.29
2019-10-24,26.29
2019-10-25,26.29
2019-10-28,26.29
2019-10-29,26.82
2019-10-30,26.82
2019-10-31,26.82
2019-11-01,26.55
2019-11-04,26.55
2019-11-05,26.55
2019-11-06,26.55
2019-11-07,26.55
2019-11-08,26.55
2019-11-11,26.55
2019-11-12,26.55
2019-11-13,26.55
2019-11-14,26.55
2019-11-15,26.55
2019-11-18,26.55
2019-11-19,26.55
2019-11-20,26.55
2019-11-21,26.55
2019-11-22,26.55
2019-11-25,26.55
