date,close
2015-04-01,26.15
2015-04-02,26.5
2015-04-06,25.8
2015-04-07,25.24
2015-04-08,25.15
2015-04-09,26.32
2015-04-10,25.29
2015-04-13,25.37
2015-04-14,25.8
2015-04-15,25.12
2015-04-16,24.78
2015-04-17,25.16
2015-04-20,25.14
2015-04-21,24.78
2015-04-22,24.77
2015-04-23,25.05
2015-04-24,25.63
2015-04-27,26.16
2015-04-28,25.15
2015-04-29,24.88
2015-04-30,25.07
2015-05-01,25.96
2015-05-04,25.98
2015-05-05,25.42
2015-05-06,24.54
2015-05-07,24.81
2015-05-08,24.88
2015-05-11,25.68
2015-05-12,26.77
2015-05-13,26.5
2015-05-14,26.23
2015-05-15,26.51
2015-05-18,26.23
2015-05-19,25.94
2015-05-20,26.38
2015-05-21,25.6
2015-05-22,26.1
2015-05-26,26.42
2015-05-27,26.98
2015-05-28,26.66
2015-05-29,26.93
2015-06-01,27.09
2015-06-02,27.63
2015-06-03,28.91
2015-06-04,28.92
2015-06-05,28.69
2015-06-08,29.1
2015-06-09,29.5
2015-06-10,30.16
2015-06-11,29.69
2015-06-12,29.28
2015-06-15,29.41
2015-06-16,30.46
2015-06-17,30.54
2015-06-18,31.35
2015-06-19,31.8
2015-06-22,31.36
2015-06-23,31.82
2015-06-24,31.46
2015-06-25,31.01
2015-06-26,29.54
2015-06-29,28.18
2015-06-30,28.19
2015-07-01,28.29
2015-07-02,27.14
2015-07-06,27.27
2015-07-07,26.83
2015-07-08,26.08
2015-07-09,26.61
2015-07-10,26.98
2015-07-13,26.65
2015-07-14,26.95
2015-07-15,26.43
2015-07-16,26.69
2015-07-17,26.29
2015-07-20,26.6
2015-07-21,26.65
2015-07-22,26.98
2015-07-23,26.91
2015-07-24,26.54
2015-07-27,26.04
2015-07-28,27.12
2015-07-29,27.31
2015-07-30,27.65
2015-07-31,28.44
2015-08-03,28.39
2015-08-04,28.58
2015-08-05,29.47
2015-08-06,26.22
2015-08-07,26.34
2015-08-10,26.22
2015-08-11,26
2015-08-12,26.33
2015-08-13,26.1
2015-08-14,26.21
2015-08-17,27.4
2015-08-18,27.22
2015-08-19,27
2015-08-20,26.25
2015-08-21,25.1
2015-08-24,25.4
2015-08-25,25.18
2015-08-26,25.74
2015-08-27,26.37
2015-08-28,25.91
2015-08-31,25.08
2015-09-01,24.92
2015-09-02,24.64
2015-09-03,24.87
2015-09-04,24.69
2015-09-08,25.77
2015-09-09,25.46
2015-09-10,24.71
2015-09-11,25.21
2015-09-14,25.21
2015-09-15,24.81
2015-09-16,24.25
2015-09-17,25.28
2015-09-18,24.88
2015-09-21,24.62
2015-09-22,24.51
2015-09-23,25.12
2015-09-24,25.61
2015-09-25,25.72
2015-09-28,24.6
2015-09-29,23.59
2015-09-30,25.21
2015-10-01,25.29
2015-10-02,25.67
2015-10-05,26.04
2015-10-06,25.76
2015-10-07,25.78
2015-10-08,26.27
2015-10-09,27.11
2015-10-12,26.74
2015-10-13,26.64
2015-10-14,26.94
2015-10-15,27.41
2015-10-16,27.71
2015-10-19,27.4
2015-10-20,27.15
2015-10-21,26.86
2015-10-22,27.84
2015-10-23,28.17
2015-10-26,28.24
2015-10-27,27.82
2015-10-28,27.51
2015-10-29,27.22
2015-10-30,27.48
2015-11-02,27.59
2015-11-03,27.47
2015-11-04,27.43
2015-11-05,32.41
2015-11-06,30.54
2015-11-09,31.21
2015-11-10,32.21
2015-11-11,32.06
2015-11-12,32.93
2015-11-13,31.32
2015-11-16,31.82
2015-11-17,31.82
2015-11-18,31.95
2015-11-19,32.29
2015-11-20,32.69
2015-11-23,32.17
2015-11-24,31.23
2015-11-25,30.99
2015-11-27,31.61
2015-11-30,31.07
2015-12-01,31.28
2015-12-02,31.16
2015-12-03,31.56
2015-12-04,32.68
2015-12-07,33.94
2015-12-08,33.79
2015-12-09,33.5
2015-12-10,33.9
2015-12-11,33.58
2015-12-14,32.32
2015-12-15,32.63
2015-12-16,34.24
2015-12-17,33.69
2015-12-18,34.13
2015-12-21,33.98
2015-12-22,33.99
2015-12-23,34.01
2015-12-24,33.98
2015-12-28,33.19
2015-12-29,33.3
2015-12-30,32.92
2015-12-31,32.06
2016-01-04,32.81
2016-01-05,31.57
2016-01-06,31.73
2016-01-07,30.5
2016-01-08,29.97
2016-01-11,30.67
2016-01-12,30.25
2016-01-13,29.55
2016-01-14,29.56
2016-01-15,29.17
2016-01-19,28.34
2016-01-20,28.23
2016-01-21,28.15
2016-01-22,29.17
2016-01-25,29.42
2016-01-26,29.32
2016-01-27,28.83
2016-01-28,29.47
2016-01-29,30.49
2016-02-01,30.67
2016-02-02,30.13
2016-02-03,30.27
2016-02-04,28.49
2016-02-05,25.86
2016-02-08,25.94
2016-02-09,24.69
2016-02-10,24.71
2016-02-11,24.25
2016-02-12,24.86
2016-02-16,27.09
2016-02-17,29.1
2016-02-18,28.01
2016-02-19,29.34
2016-02-22,30.16
2016-02-23,29.68
2016-02-24,29.83
2016-02-25,29.52
2016-02-26,31.18
2016-02-29,31.35
2016-03-01,32.23
2016-03-02,32.23
2016-03-03,31.9
2016-03-04,32.03
2016-03-07,32.7
2016-03-08,32.14
2016-03-09,31.28
2016-03-10,31.14
2016-03-11,31.82
2016-03-14,31.76
2016-03-15,31.25
2016-03-16,31.81
2016-03-17,32.01
2016-03-18,31.93
2016-03-21,31.75
2016-03-22,32.2
2016-03-23,31.66
2016-03-24,31.56
2016-03-28,31.89
2016-03-29,31.73
2016-03-30,32.03
2016-03-31,32.33
2016-04-01,32.95
2016-04-04,32.46
2016-04-05,30.1
2016-04-06,30.83
2016-04-07,31.6
2016-04-08,31.62
2016-04-11,30.64
2016-04-12,30.16
2016-04-13,31.42
2016-04-14,31.03
2016-04-15,30.65
2016-04-18,30.7
2016-04-19,30.67
2016-04-20,31
2016-04-21,30.21
2016-04-22,30.2
2016-04-25,30.28
2016-04-26,30.6
2016-04-27,30.78
2016-04-28,30.19
2016-04-29,30.37
2016-05-02,31.3
2016-05-03,30.04
2016-05-04,30.64
2016-05-05,29.58
2016-05-06,30.21
2016-05-09,30.21
2016-05-10,30.85
2016-05-11,30.86
2016-05-12,30.18
2016-05-13,30.22
2016-05-16,31.08
2016-05-17,29.8
2016-05-18,30.48
2016-05-19,30.54
2016-05-20,31.53
2016-05-23,31.24
2016-05-24,31.67
2016-05-25,31.7
2016-05-26,32.07
2016-05-27,32.54
2016-05-31,32.53
2016-06-01,33.31
2016-06-02,33.33
2016-06-03,33.24
2016-06-06,32.98
2016-06-07,32.21
2016-06-08,32.09
2016-06-09,31.95
2016-06-10,31.66
2016-06-13,32.45
2016-06-14,32.74
2016-06-15,32.63
2016-06-16,32.32
2016-06-17,31.88
2016-06-20,32.37
2016-06-21,32.43
2016-06-22,32.11
2016-06-23,32.48
2016-06-24,31.16
2016-06-27,30.48
2016-06-28,30.83
2016-06-29,31.5
2016-06-30,31.19
2016-07-01,31.26
2016-07-05,30.61
2016-07-06,29.83
2016-07-07,30.02
2016-07-08,30.72
2016-07-11,30.52
2016-07-12,30.79
2016-07-13,30.11
2016-07-14,29.27
2016-07-15,29.31
2016-07-18,29.36
2016-07-19,28.99
2016-07-20,29.73
2016-07-21,29.45
2016-07-22,29.5
2016-07-25,29.18
2016-07-26,29.7
2016-07-27,29.71
2016-07-28,30.01
2016-07-29,29.92
2016-08-01,30.34
2016-08-02,29.34
2016-08-03,28.31
2016-08-04,31.78
2016-08-05,33.35
2016-08-08,33.33
2016-08-09,33.46
2016-08-10,33.03
2016-08-11,32.98
2016-08-12,32.63
2016-08-15,32.77
2016-08-16,32.98
2016-08-17,32.25
2016-08-18,31.91
2016-08-19,32.1
2016-08-22,32.31
2016-08-23,32.9
2016-08-24,32.78
2016-08-25,32.91
2016-08-26,32.88
2016-08-29,32.3
2016-08-30,32.32
2016-08-31,32.38
2016-09-01,32.6
2016-09-02,32.68
2016-09-06,33.23
2016-09-07,32.4
2016-09-08,32.59
2016-09-09,32.1
2016-09-12,32.68
2016-09-13,32.47
2016-09-14,32.54
2016-09-15,33.15
2016-09-16,33.31
2016-09-19,33.55
2016-09-20,33.43
2016-09-21,34.55
2016-09-22,35
2016-09-23,34.29
2016-09-26,33.76
2016-09-27,34.29
2016-09-28,34.34
2016-09-29,34.17
2016-09-30,34.53
2016-10-03,34.75
2016-10-04,34.76
2016-10-05,34.72
2016-10-06,35.1
2016-10-07,35.48
2016-10-10,35.96
2016-10-11,35.67
2016-10-12,35.78
2016-10-13,35.88
2016-10-14,35.64
2016-10-17,35.22
2016-10-18,35.51
2016-10-19,36.22
2016-10-20,35.58
2016-10-21,36.4
2016-10-24,36.82
2016-10-25,36.66
2016-10-26,36.32
2016-10-27,36.39
2016-10-28,36.33
2016-10-31,35.79
2016-11-01,35.3
2016-11-02,35.21
2016-11-03,33.28
2016-11-04,31.8
2016-11-07,32.86
2016-11-08,33.7
2016-11-09,33.07
2016-11-10,32.44
2016-11-11,33.14
2016-11-14,32.79
2016-11-15,33.29
2016-11-16,33.25
2016-11-17,33.92
2016-11-18,34.39
2016-11-21,35.32
2016-11-22,36.12
2016-11-23,36.45
2016-11-25,36.82
2016-11-28,36.39
2016-11-29,36.22
2016-11-30,35.34
2016-12-01,33.73
2016-12-02,33.29
2016-12-05,34.74
2016-12-06,36.37
2016-12-07,36.04
2016-12-08,36.61
2016-12-09,36.72
2016-12-12,35.99
2016-12-13,35.85
2016-12-14,35.22
2016-12-15,35.25
2016-12-16,34.98
2016-12-19,34.95
2016-12-20,34.81
2016-12-21,35
2016-12-22,34.67
2016-12-23,34.47
2016-12-27,35.05
2016-12-28,34.79
2016-12-29,34.89
2016-12-30,34.95
2017-01-03,35.72
2017-01-04,35.33
2017-01-05,34.83
2017-01-06,35.38
2017-01-09,35.38
2017-01-10,35.21
2017-01-11,35.27
2017-01-12,34.41
2017-01-13,35.18
2017-01-17,35.2
2017-01-18,34.9
2017-01-19,35.2
2017-01-20,35.2
2017-01-23,34.95
2017-01-24,34.94
2017-01-25,36.16
2017-01-26,35.96
2017-01-27,36.42
2017-01-30,36.08
2017-01-31,35.73
2017-02-01,35.89
2017-02-02,35.99
2017-02-03,36.07
2017-02-06,36.19
2017-02-07,36.1
2017-02-08,35.77
2017-02-09,36.05
2017-02-10,36.01
2017-02-13,36.08
2017-02-14,36.34
2017-02-15,37.46
2017-02-16,35.88
2017-02-17,36.69
2017-02-21,36.73
2017-02-22,36.76
2017-02-23,36.54
2017-02-24,36.96
2017-02-27,37.18
2017-02-28,36.85
2017-03-01,36.56
2017-03-02,36.05
2017-03-03,36.29
2017-03-06,36.6
2017-03-07,36.27
2017-03-08,36.61
2017-03-09,36.55
2017-03-10,36.58
2017-03-13,37.7
2017-03-14,37.54
2017-03-15,37.59
2017-03-16,37.47
2017-03-17,37.18
2017-03-20,37.15
2017-03-21,36.53
2017-03-22,36.68
2017-03-23,36.65
2017-03-24,36.39
2017-03-27,36.46
2017-03-28,36.3
2017-03-29,37.08
2017-03-30,37.12
2017-03-31,37.9
2017-04-03,37.58
2017-04-04,37.04
2017-04-05,37.08
2017-04-06,37.15
2017-04-07,37.32
2017-04-10,36.94
2017-04-11,36.78
2017-04-12,36.29
2017-04-13,36.09
2017-04-17,36.88
2017-04-18,36.97
2017-04-19,37.62
2017-04-20,37.75
2017-04-21,37.62
2017-04-24,38.25
2017-04-25,38.8
2017-04-26,38.91
2017-04-27,39.04
2017-04-28,38.92
2017-05-01,39.69
2017-05-02,39.35
2017-05-03,38.45
2017-05-04,38.87
2017-05-05,38.9
2017-05-08,39.21
2017-05-09,39.18
2017-05-10,39.28
2017-05-11,38.95
2017-05-12,38.76
2017-05-15,39.06
2017-05-16,40.29
2017-05-17,38.63
2017-05-18,39.9
2017-05-19,40.17
2017-05-22,40.72
2017-05-23,40.53
2017-05-24,41.45
2017-05-25,41.42
2017-05-26,42.15
2017-05-30,41.7
2017-05-31,41.14
2017-06-01,41.56
2017-06-02,41.96
2017-06-05,42.35
2017-06-06,42.28
2017-06-07,42.79
2017-06-08,43.59
2017-06-09,42.39
2017-06-12,41.81
2017-06-13,42.09
2017-06-14,41.81
2017-06-15,41.53
2017-06-16,42.1
2017-06-19,42.41
2017-06-20,41.94
2017-06-21,42.74
2017-06-22,43.11
2017-06-23,43.27
2017-06-26,42.57
2017-06-27,41.51
2017-06-28,42.96
2017-06-29,42.38
2017-06-30,42.42
2017-07-03,41.84
2017-07-05,42.28
2017-07-06,41.84
2017-07-07,42.08
2017-07-10,42.18
2017-07-11,42.43
2017-07-12,42.8
2017-07-13,42.35
2017-07-14,42.22
2017-07-17,42.81
2017-07-18,43.7
2017-07-19,44
2017-07-20,43.18
2017-07-21,43.05
2017-07-24,43.6
2017-07-25,43.55
2017-07-26,43.79
2017-07-27,43.36
2017-07-28,43.23
2017-07-31,42.98
2017-08-01,43.11
2017-08-02,42.8
2017-08-03,42.94
2017-08-04,42.57
2017-08-07,42.68
2017-08-08,42.45
2017-08-09,44
2017-08-10,41.29
2017-08-11,41.56
2017-08-14,42.34
2017-08-15,41.69
2017-08-16,42.26
2017-08-17,41.19
2017-08-18,41.81
2017-08-21,41.45
2017-08-22,41.87
2017-08-23,42.35
2017-08-24,42.54
2017-08-25,42.48
2017-08-28,42.72
2017-08-29,42.76
2017-08-30,43.88
2017-08-31,44.82
2017-09-01,44.95
2017-09-05,45.18
2017-09-06,43.7
2017-09-07,44.03
2017-09-08,43.52
2017-09-11,43.98
2017-09-12,43.8
2017-09-13,43.94
2017-09-14,43.8
2017-09-15,43.81
2017-09-18,44.41
2017-09-19,44.87
2017-09-20,44.73
2017-09-21,44.72
2017-09-22,45.3
2017-09-25,43.15
2017-09-26,42.55
2017-09-27,42.93
2017-09-28,43.29
2017-09-29,43.51
2017-10-02,43.44
2017-10-03,43.63
2017-10-04,43.41
2017-10-05,43.61
2017-10-06,44.22
2017-10-09,44.1
2017-10-10,43.78
2017-10-11,43.92
2017-10-12,44.13
2017-10-13,44.23
2017-10-16,43.87
2017-10-17,43.85
2017-10-18,44.41
2017-10-19,44.2
2017-10-20,45
2017-10-23,44.98
2017-10-24,45.4
2017-10-25,45.46
2017-10-26,45.75
2017-10-27,46.54
2017-10-30,46.32
2017-10-31,46.7
2017-11-01,46.83
2017-11-02,46.72
2017-11-03,46.86
2017-11-06,47.22
2017-11-07,48.61
2017-11-08,48.02
2017-11-09,47.98
2017-11-10,48.15
2017-11-13,48.57
2017-11-14,48.65
2017-11-15,48.91
2017-11-16,49.33
2017-11-17,49.55
2017-11-20,50.18
2017-11-21,50.49
2017-11-22,50.43
2017-11-24,51.06
2017-11-27,50.89
2017-11-28,50.45
2017-11-29,48.78
2017-11-30,48.65
2017-12-01,48
2017-12-04,47.32
2017-12-05,46.09
2017-12-06,46.78
2017-12-07,48.15
2017-12-08,48.88
2017-12-11,48.95
2017-12-12,48.21
2017-12-13,48.42
2017-12-14,48.21
2017-12-15,48.97
2017-12-18,50.36
2017-12-19,50.81
2017-12-20,50.4
2017-12-21,49.73
2017-12-22,49.87
2017-12-26,50
2017-12-27,50.02
2017-12-28,50.48
2017-12-29,50.28
2018-01-02,49.07
2018-01-03,50.01
2018-01-04,50.55
2018-01-05,51.05
2018-01-08,51.08
2018-01-09,51.2
2018-01-10,50.92
2018-01-11,51.3
2018-01-12,51.43
2018-01-16,50.13
2018-01-17,51.13
2018-01-18,51.23
2018-01-19,51.67
2018-01-22,52.32
2018-01-23,53.1
2018-01-24,53.74
2018-01-25,54.55
2018-01-26,55.27
2018-01-29,54.89
2018-01-30,54.61
2018-01-31,55.23
2018-02-01,56.01
2018-02-02,55.26
2018-02-05,52.51
2018-02-06,53.45
2018-02-07,53.77
2018-02-08,51.36
2018-02-09,52.05
2018-02-12,52.59
2018-02-13,53.22
2018-02-14,54.77
2018-02-15,55.77
2018-02-16,55.78
2018-02-20,56.24
2018-02-21,55.7
2018-02-22,55.43
2018-02-23,61.48
2018-02-26,60.88
2018-02-27,60.36
2018-02-28,59.81
2018-03-01,59.36
2018-03-02,60.69
2018-03-05,61.03
2018-03-06,60.91
2018-03-07,62.66
2018-03-08,63.27
2018-03-09,63.98
2018-03-12,63.66
2018-03-13,62.57
2018-03-14,63.34
2018-03-15,63.21
2018-03-16,62.42
2018-03-19,61.92
2018-03-20,62.49
2018-03-21,62.29
2018-03-22,61.11
2018-03-23,61.01
2018-03-26,62.54
2018-03-27,60.02
2018-03-28,58.93
2018-03-29,61.42
2018-04-02,59.12
2018-04-03,59.25
2018-04-04,60.57
2018-04-05,60.93
2018-04-06,59.86
2018-04-09,60.63
2018-04-10,61.19
2018-04-11,61.3
2018-04-12,61.84
2018-04-13,61.57
2018-04-16,62.13
2018-04-17,64.24
2018-04-18,64.82
2018-04-19,64.87
2018-04-20,63.77
2018-04-23,63.68
2018-04-24,62.55
2018-04-25,63.35
2018-04-26,64.75
2018-04-27,64.34
2018-04-30,64.56
2018-05-01,64.03
2018-05-02,64.55
2018-05-03,65.05
2018-05-04,65.78
2018-05-07,66.23
2018-05-08,65.96
2018-05-09,68.99
2018-05-10,68.85
2018-05-11,69.43
2018-05-14,68.68
2018-05-15,69.15
2018-05-16,69.81
2018-05-17,70.65
2018-05-18,71.34
2018-05-21,70.79
2018-05-22,70.65
2018-05-23,70.89
2018-05-24,70.76
2018-05-25,71.01
2018-05-29,71.09
2018-05-30,72.13
2018-05-31,71.59
2018-06-01,73.61
2018-06-04,73.83
2018-06-05,73.86
2018-06-06,74.13
2018-06-07,72.48
2018-06-08,72.64
2018-06-11,72.14
2018-06-12,73.13
2018-06-13,72.97
2018-06-14,73.55
2018-06-15,73.35
2018-06-18,74.74
2018-06-19,73.8
2018-06-20,74.69
2018-06-21,73.58
2018-06-22,73.29
2018-06-25,70.57
2018-06-26,70.74
2018-06-27,68.79
2018-06-28,69.76
2018-06-29,70.6
2018-07-02,72.46
2018-07-03,71.71
2018-07-05,72.82
2018-07-06,73.78
2018-07-09,74.72
2018-07-10,74.79
2018-07-11,75.19
2018-07-12,76.91
2018-07-13,76.78
2018-07-16,77.16
2018-07-17,78.2
2018-07-18,78.46
2018-07-19,78.22
2018-07-20,78.45
2018-07-23,79.54
2018-07-24,78.44
2018-07-25,79.62
2018-07-26,78.89
2018-07-27,76.81
2018-07-30,73.35
2018-07-31,73.62
2018-08-01,75
2018-08-02,76.55
2018-08-03,75.94
2018-08-06,76.12
2018-08-07,76.78
2018-08-08,76.26
2018-08-09,76.65
2018-08-10,76.04
2018-08-13,75.28
2018-08-14,75.86
2018-08-15,73.68
2018-08-16,73.95
2018-08-17,73.75
2018-08-20,73.08
2018-08-21,73.98
2018-08-22,75.2
2018-08-23,76.55
2018-08-24,78.92
2018-08-27,80.14
2018-08-28,81.35
2018-08-29,80.74
2018-08-30,80.27
2018-08-31,81.46
2018-09-04,81.75
2018-09-05,79.34
2018-09-06,79.45
2018-09-07,80.35
2018-09-10,81.61
2018-09-11,82.9
2018-09-12,82.95
2018-09-13,84
2018-09-14,83.78
2018-09-17,81.4
2018-09-18,82.29
2018-09-19,81.85
2018-09-20,81.58
2018-09-21,80.4
2018-09-24,80.59
2018-09-25,81.96
2018-09-26,82.59
2018-09-27,83.2
2018-09-28,83.39
2018-10-01,83.07
2018-10-02,81.67
2018-10-03,82.09
2018-10-04,79.47
2018-10-05,78.6
2018-10-08,75.97
2018-10-09,75.68
2018-10-10,70.79
2018-10-11,72
2018-10-12,75.44
2018-10-15,74.85
2018-10-16,79.15
2018-10-17,78.48
2018-10-18,76.31
2018-10-19,74.8
2018-10-22,75.92
2018-10-23,74.25
2018-10-24,69.89
2018-10-25,72.8
2018-10-26,72.08
2018-10-29,67.75
2018-10-30,70.39
2018-10-31,73.17
2018-11-01,74.4
2018-11-02,73.62
2018-11-05,73
2018-11-06,72.5
2018-11-07,66.48
2018-11-08,66.87
2018-11-09,64.46
2018-11-12,63.15
2018-11-13,63.56
2018-11-14,62.09
2018-11-15,64.56
2018-11-16,63.53
2018-11-19,59.25
2018-11-20,60.1
2018-11-21,60.53
2018-11-23,60.34
2018-11-26,62.96
2018-11-27,61.7
2018-11-28,66.1
2018-11-29,65.86
2018-11-30,65.26
2018-12-03,66.89
2018-12-04,64.79
2018-12-06,65.88
2018-12-07,63.72
2018-12-10,64.72
2018-12-11,63.47
2018-12-12,65.22
2018-12-13,63.62
2018-12-14,62.6
2018-12-17,61.09
2018-12-18,61.99
2018-12-19,62.15
2018-12-20,61.92
2018-12-21,59.98
2018-12-24,59.69
2018-12-26,63.79
2018-12-27,63.53
2018-12-28,63.93
2018-12-31,65.62
2019-01-02,62.82
2019-01-03,60.23
2019-01-04,62.6
2019-01-07,63.65
2019-01-08,63.09
2019-01-09,63.5
2019-01-10,63.92
2019-01-11,63.06
2019-01-14,62.24
2019-01-15,62.87
2019-01-16,63.42
2019-01-17,64.41
2019-01-18,65.31
2019-01-22,63.47
2019-01-23,64.07
2019-01-24,64.94
2019-01-25,66.4
2019-01-28,65.87
2019-01-29,65.29
2019-01-30,67.06
2019-01-31,68.63
2019-02-01,68.3
2019-02-04,69.79
2019-02-05,69.63
2019-02-06,69.79
2019-02-07,69.52
2019-02-08,69.5
2019-02-11,69.72
2019-02-12,70.8
2019-02-13,71.5
2019-02-14,71.25
2019-02-15,72.86
2019-02-19,72.68
2019-02-20,72.39
2019-02-21,75.85
2019-02-22,76
2019-02-25,75.35
2019-02-26,75.1
2019-02-27,76.15
2019-02-28,74.65
2019-03-01,74.95
2019-03-04,73.7
2019-03-05,74.19
2019-03-06,73.67
2019-03-07,73.27
2019-03-08,73.12
2019-03-11,74.27
2019-03-12,75.03
2019-03-13,75.43
2019-03-14,75.17
2019-03-15,75.39
2019-03-18,74.7
2019-03-19,75.93
2019-03-20,75.85
2019-03-21,77.48
2019-03-22,74.99
2019-03-25,74.48
2019-03-26,75.84
2019-03-27,74.21
2019-03-28,75.11
2019-03-29,75.19
2019-04-01,75.58
2019-04-02,75.8
2019-04-03,76.16
2019-04-04,74.56
2019-04-05,74.55
2019-04-08,74.98
2019-04-09,74.99
2019-04-10,75.95
2019-04-11,79.55
2019-04-12,79.17
2019-04-15,79.47
2019-04-16,79.15
2019-04-17,77.5
2019-04-18,78.27
2019-04-22,79.16
2019-04-23,80.35
2019-04-24,80.39
2019-04-25,80.7
2019-04-26,81.75
2019-04-29,81.18
2019-04-30,81.5
2019-05-01,81.1
2019-05-02,81.23
2019-05-03,79.38
2019-05-06,79.31
2019-05-07,78.59
2019-05-08,78.7
2019-05-09,78.32
2019-05-10,77.91
2019-05-13,74.84
2019-05-14,74.35
2019-05-15,75.5
2019-05-16,76.28
2019-05-17,74.96
2019-05-20,74.21
2019-05-21,75.6
2019-05-22,75.43
2019-05-23,74.53
2019-05-24,74.79
2019-05-28,75.28
2019-05-29,74.04
2019-05-30,73.82
2019-05-31,74.4
2019-06-03,70.29
2019-06-04,71.49
2019-06-05,72.41
2019-06-06,72.31
2019-06-07,73.2
2019-06-10,73.36
2019-06-11,72.34
2019-06-12,71.8
2019-06-13,70.945
2019-06-14,70.09
2019-06-17,71.4
2019-06-18,71.56
2019-06-19,72.095
2019-06-20,72.36
2019-06-21,72.17
2019-06-24,72.2
2019-06-25,69.64
2019-06-26,68.31
2019-06-27,69.755
2019-06-28,70.22
2019-07-01,70.775
2019-07-02,70.75
2019-07-03,71.8
2019-07-04,71.8
2019-07-05,71.49
2019-07-08,70.29
2019-07-09,70.695
2019-07-10,70.055
2019-07-11,71.275
2019-07-12,72.815
2019-07-15,72.94
2019-07-16,73.595
2019-07-17,74.74
2019-07-18,74.16
2019-07-19,72.445
2019-07-22,74.31
2019-07-23,74.905
2019-07-24,75.32
2019-07-25,74.3
2019-07-26,74.715
2019-07-29,73.84
2019-07-30,73.15
2019-07-31,73.51
2019-08-01,74.25
2019-08-02,70.515
2019-08-05,65.045
2019-08-06,65.05
2019-08-07,64.74
2019-08-08,65.975
2019-08-09,63.51
2019-08-12,62.38
2019-08-13,64.03
2019-08-14,62.445
2019-08-15,62.8
2019-08-16,63.61
2019-08-19,64.155
2019-08-20,63.25
2019-08-21,64.205
2019-08-22,63.805
2019-08-23,62.795
2019-08-26,63.195
2019-08-27,63.97
2019-08-28,63.29
2019-08-29,63.66
2019-08-30,63.42
2019-09-02,63.3
2019-09-03,62.645
2019-09-04,63.38
2019-09-05,65.13
2019-09-06,64.45
2019-09-09,65.69
2019-09-10,65.425
2019-09-11,65.935
2019-09-12,65.67
2019-09-13,66.26
2019-09-16,66.66
2019-09-17,67.045
2019-09-18,66.32
2019-09-19,67.12
2019-09-20,66.745
2019-09-23,66.57
2019-09-24,65.72
2019-09-25,66.49
2019-09-26,65.91
2019-09-27,65.28
2019-09-30,66.055
2019-10-01,63.035
2019-10-02,62.7
2019-10-03,63.51
2019-10-04,64.375
2019-10-07,64.305
2019-10-08,61.52
2019-10-09,61.55
2019-10-10,60.395
2019-10-11,61.91
2019-10-14,62.17
2019-10-15,63.19
2019-10-16,64.34
2019-10-17,64.56
2019-10-18,63.58
2019-10-21,62.4
2019-10-22,62.88
2019-10-23,63.34
2019-10-24,64.765
2019-10-25,65.455
2019-10-28,65.725
2019-10-29,64.63
2019-10-30,65.365
2019-10-31,64.96
2019-11-01,65.285
2019-11-04,64.72
2019-11-05,62.21
2019-11-06,63.04
2019-11-07,73.09
2019-11-08,68.985
2019-11-11,69
2019-11-12,68.03
2019-11-13,68.33
2019-11-14,67.755
2019-11-15,68.085
2019-11-18,68.34
2019-11-19,68.24
2019-11-20,69.375
2019-11-21,68.735
2019-11-22,69.195
2019-11-25,69.35
