date,close
2014-06-13,40.2133
2014-06-16,39.9163
2014-06-17,40.7623
2014-06-18,40.5103
2014-06-19,40.5463
2014-06-20,40.5643
2014-06-23,40.7803
2014-06-24,40.1413
2014-06-25,40.3663
2014-06-26,39.8623
2014-06-27,41.5544
2014-06-30,41.1313
2014-07-01,41.3834
2014-07-02,41.1763
2014-07-03,41.5364
2014-07-07,41.1133
2014-07-08,40.5373
2014-07-09,41.0613
2014-07-10,40.8535
2014-07-11,40.0133
2014-07-14,40.3295
2014-07-15,40.1579
2014-07-16,39.5887
2014-07-17,39.8417
2014-07-18,39.8417
2014-07-21,39.2815
2014-07-22,39.3448
2014-07-23,39.5797
2014-07-24,40.1669
2014-07-25,39.4351
2014-07-28,40.0043
2014-07-29,39.661
2014-07-30,39.9591
2014-07-31,39.5255
2014-08-01,39.1008
2014-08-04,39.8326
2014-08-05,39.8326
2014-08-06,40.0675
2014-08-07,39.8868
2014-08-08,41.5763
2014-08-11,41.766
2014-08-12,41.3504
2014-08-13,41.6937
2014-08-14,42.2809
2014-08-15,41.9015
2014-08-18,42.5791
2014-08-19,42.8862
2014-08-20,42.9856
2014-08-21,42.5971
2014-08-22,42.6875
2014-08-25,42.8049
2014-08-26,43.338
2014-08-27,43.3289
2014-08-28,42.6423
2014-08-29,41.8744
2014-09-02,42.0099
2014-09-03,41.3775
2014-09-04,41.4859
2014-09-05,41.9647
2014-09-08,41.8563
2014-09-09,41.8925
2014-09-10,41.8381
2014-09-11,42.2552
2014-09-12,42.7357
2014-09-15,42.3458
2014-09-16,42.9171
2014-09-17,42.3368
2014-09-18,42.2642
2014-09-19,41.4028
2014-09-22,40.8315
2014-09-23,40.1968
2014-09-24,40.5142
2014-09-25,40.4416
2014-09-26,40.7227
2014-09-29,40.6502
2014-09-30,39.0361
2014-10-01,38.7641
2014-10-02,38.7913
2014-10-03,40.3147
2014-10-06,39.825
2014-10-07,39.3807
2014-10-08,40.7046
2014-10-09,40.1968
2014-10-10,40.2603
2014-10-13,39.4261
2014-10-14,40.1333
2014-10-15,39.0361
2014-10-16,38.6734
2014-10-17,40.1968
2014-10-20,41.1217
2014-10-21,41.8018
2014-10-22,41.3484
2014-10-23,41.5298
2014-10-24,41.3303
2014-10-27,40.9041
2014-10-28,41.1761
2014-10-29,40.6411
2014-10-30,45.1115
2014-10-31,41.3937
2014-11-03,41.3575
2014-11-04,40.7499
2014-11-05,40.3419
2014-11-06,41.7202
2014-11-07,42.7448
2014-11-10,42.6179
2014-11-11,42.6813
2014-11-12,43.8783
2014-11-13,45.1115
2014-11-14,45.1477
2014-11-17,43.1801
2014-11-18,43.7332
2014-11-19,44.0596
2014-11-20,45.6283
2014-11-21,45.5648
2014-11-24,45.7371
2014-11-25,45.4651
2014-11-26,45.1568
2014-11-28,46.0636
2014-12-01,43.1347
2014-12-02,43.4521
2014-12-03,44.0143
2014-12-04,43.4793
2014-12-05,36.2705
2014-12-08,37.404
2014-12-09,37.3405
2014-12-10,36.2433
2014-12-11,36.8781
2014-12-12,36.4046
2014-12-15,35.3301
2014-12-16,34.9477
2014-12-17,36.2042
2014-12-18,36.2316
2014-12-19,34.9568
2014-12-22,35.4394
2014-12-23,35.1571
2014-12-24,35.7945
2014-12-26,35.4576
2014-12-29,35.5942
2014-12-30,36.5594
2014-12-31,36.441
2015-01-02,35.7763
2015-01-05,36.186
2015-01-06,35.7945
2015-01-07,37.907
2015-01-08,39.8465
2015-01-09,39.7828
2015-01-12,40.4566
2015-01-13,40.6387
2015-01-14,41.3216
2015-01-15,40.7298
2015-01-16,41.4764
2015-01-20,40.1925
2015-01-21,40.5476
2015-01-22,41.1304
2015-01-23,42.5782
2015-01-26,43.2065
2015-01-27,43.3431
2015-01-28,41.9772
2015-01-29,42.6146
2015-01-30,41.8042
2015-02-02,41.9681
2015-02-03,42.9789
2015-02-04,43.2338
2015-02-05,43.2065
2015-02-06,43.3249
2015-02-09,42.7603
2015-02-10,43.3886
2015-02-11,43.507
2015-02-12,43.7802
2015-02-13,42.815
2015-02-17,43.762
2015-02-18,44.1626
2015-02-19,43.8985
2015-02-20,43.9532
2015-02-23,43.8257
2015-02-24,44.2355
2015-02-25,43.7893
2015-02-26,43.4615
2015-02-27,43.4433
2015-03-02,44.5086
2015-03-03,43.425
2015-03-04,43.1701
2015-03-05,43.5434
2015-03-06,44.1808
2015-03-09,46.4026
2015-03-10,44.7363
2015-03-11,45.4829
2015-03-12,45.9291
2015-03-13,45.5831
2015-03-16,45.6833
2015-03-17,45.3919
2015-03-18,45.9494
2015-03-19,45.7392
2015-03-20,45.8306
2015-03-23,46.0774
2015-03-24,45.5655
2015-03-25,44.8617
2015-03-26,44.5418
2015-03-27,44.7794
2015-03-30,44.8251
2015-03-31,43.902
2015-04-01,44.231
2015-04-02,44.7886
2015-04-06,45.1359
2015-04-07,44.3316
2015-04-08,44.2859
2015-04-09,43.3901
2015-04-10,43.8105
2015-04-13,42.9879
2015-04-14,42.668
2015-04-15,42.5492
2015-04-16,42.6863
2015-04-17,42.0007
2015-04-20,42.7045
2015-04-21,42.997
2015-04-22,43.0976
2015-04-23,43.6277
2015-04-24,43.4815
2015-04-27,42.6131
2015-04-28,42.6863
2015-04-29,41.434
2015-04-30,41.6534
2015-05-01,42.1653
2015-05-04,42.668
2015-05-05,42.9239
2015-05-06,42.5217
2015-05-07,43.2438
2015-05-08,43.8654
2015-05-11,44.0116
2015-05-12,43.8745
2015-05-13,43.6826
2015-05-14,42.1013
2015-05-15,42.3389
2015-05-18,42.1104
2015-05-19,41.2969
2015-05-20,41.2421
2015-05-21,42.0099
2015-05-22,41.7265
2015-05-26,42.0099
2015-05-27,41.4066
2015-05-28,41.2055
2015-05-29,40.1269
2015-06-01,41.0318
2015-06-02,42.3389
2015-06-03,42.3481
2015-06-04,41.9642
2015-06-05,41.37
2015-06-08,41.8636
2015-06-09,42.0464
2015-06-10,42.8449
2015-06-11,43.0101
2015-06-12,42.8266
2015-06-15,42.8358
2015-06-16,42.6155
2015-06-17,42.7256
2015-06-18,42.5971
2015-06-19,42.7073
2015-06-22,42.4686
2015-06-23,42.8816
2015-06-24,43.1019
2015-06-25,42.4227
2015-06-26,42.4594
2015-06-29,40.789
2015-06-30,41.2938
2015-07-01,41.3213
2015-07-02,41.5324
2015-07-06,41.5691
2015-07-07,42.6155
2015-07-08,41.8996
2015-07-09,41.9363
2015-07-10,42.6889
2015-07-13,43.2304
2015-07-14,42.5512
2015-07-15,40.7155
2015-07-16,40.4585
2015-07-17,39.4856
2015-07-20,39.3755
2015-07-21,39.5866
2015-07-22,39.9537
2015-07-23,39.7059
2015-07-24,38.6963
2015-07-27,38.375
2015-07-28,39.6784
2015-07-29,39.5407
2015-07-30,39.4581
2015-07-31,39.6325
2015-08-03,39.3296
2015-08-04,39.3388
2015-08-05,39.7151
2015-08-06,38.7972
2015-08-07,38.4485
2015-08-10,39.7793
2015-08-11,38.99
2015-08-12,38.9074
2015-08-13,38.8798
2015-08-14,39.5223
2015-08-17,39.4122
2015-08-18,39.7793
2015-08-19,39.6692
2015-08-20,38.5953
2015-08-21,37.7325
2015-08-24,37.4939
2015-08-25,37.1451
2015-08-26,37.6224
2015-08-27,38.5494
2015-08-28,44.5888
2015-08-31,44.0473
2015-09-01,43.0101
2015-09-02,43.2121
2015-09-03,42.6155
2015-09-04,42.1382
2015-09-08,43.0927
2015-09-09,43.1941
2015-09-10,41.4892
2015-09-11,41.2127
2015-09-14,40.798
2015-09-15,41.0376
2015-09-16,41.9961
2015-09-17,41.6275
2015-09-18,41.4431
2015-09-21,41.9316
2015-09-22,42.7886
2015-09-23,43.1941
2015-09-24,43.913
2015-09-25,45.1479
2015-09-28,44.8806
2015-09-29,43.6549
2015-09-30,44.1618
2015-10-01,44.171
2015-10-02,44.7977
2015-10-05,45.1939
2015-10-06,44.8161
2015-10-07,45.6363
2015-10-08,45.6179
2015-10-09,46.0879
2015-10-12,45.6363
2015-10-13,45.1663
2015-10-14,43.4798
2015-10-15,43.5351
2015-10-16,44.0696
2015-10-19,43.8853
2015-10-20,43.4706
2015-10-21,43.2863
2015-10-22,43.3508
2015-10-23,42.5398
2015-10-26,43.0928
2015-10-27,43.0282
2015-10-28,44.5673
2015-10-29,44.0512
2015-10-30,42.4845
2015-11-02,43.102
2015-11-03,43.7471
2015-11-04,43.5351
2015-11-05,44.1433
2015-11-06,44.2724
2015-11-09,43.3877
2015-11-10,43.9314
2015-11-11,42.5214
2015-11-12,41.5998
2015-11-13,38.2176
2015-11-16,38.8812
2015-11-17,40.1437
2015-11-18,40.4386
2015-11-19,40.0147
2015-11-20,40.8441
2015-11-23,42.3647
2015-11-24,43.3047
2015-11-25,43.5351
2015-11-27,43.6641
2015-11-30,41.4616
2015-12-01,41.4984
2015-12-02,41.6182
2015-12-03,39.388
2015-12-04,36.8998
2015-12-07,37.0565
2015-12-08,36.1717
2015-12-09,35.711
2015-12-10,35.6188
2015-12-11,35.3423
2015-12-14,35.2133
2015-12-15,35.5931
2015-12-16,35.7412
2015-12-17,34.8706
2015-12-18,35.3337
2015-12-21,35.7783
2015-12-22,36.334
2015-12-23,36.7693
2015-12-24,36.2692
2015-12-28,36.3247
2015-12-29,36.9082
2015-12-30,36.1488
2015-12-31,35.6949
2016-01-04,35.5097
2016-01-05,35.4912
2016-01-06,35.0188
2016-01-07,34.8058
2016-01-08,34.2686
2016-01-11,34.0093
2016-01-12,35.7135
2016-01-13,34.4631
2016-01-14,33.9167
2016-01-15,33.3054
2016-01-19,33.2313
2016-01-20,33.4814
2016-01-21,33.6388
2016-01-22,34.0741
2016-01-25,33.4258
2016-01-26,34.6113
2016-01-27,34.3427
2016-01-28,34.5372
2016-01-29,35.9172
2016-02-01,36.3062
2016-02-02,36.3433
2016-02-03,36.1395
2016-02-04,34.9633
2016-02-05,34.5835
2016-02-08,34.3983
2016-02-09,33.6573
2016-02-10,33.9259
2016-02-11,33.5184
2016-02-12,33.574
2016-02-16,34.8429
2016-02-17,34.991
2016-02-18,35.2133
2016-02-19,34.9633
2016-02-22,35.2967
2016-02-23,35.8246
2016-02-24,36.8527
2016-02-25,36.899
2016-02-26,37.3528
2016-02-29,37.4639
2016-03-01,38.6309
2016-03-02,38.529
2016-03-03,38.7976
2016-03-04,39.7331
2016-03-07,42.1411
2016-03-08,41.2891
2016-03-09,41.5576
2016-03-10,42.2801
2016-03-11,42.243
2016-03-14,41.5762
2016-03-15,40.863
2016-03-16,40.8165
2016-03-17,41.6633
2016-03-18,41.5517
2016-03-21,42.0914
2016-03-22,41.6913
2016-03-23,40.742
2016-03-24,41.1515
2016-03-28,41.9891
2016-03-29,42.2589
2016-03-30,42.2589
2016-03-31,42.1473
2016-04-01,42.0635
2016-04-04,42.0356
2016-04-05,41.1701
2016-04-06,41.4307
2016-04-07,41.2725
2016-04-08,41.4307
2016-04-11,41.7192
2016-04-12,42.2682
2016-04-13,42.9848
2016-04-14,42.4264
2016-04-15,43.0965
2016-04-18,43.0686
2016-04-19,43.4036
2016-04-20,43.7014
2016-04-21,43.2733
2016-04-22,43.0406
2016-04-25,43.6362
2016-04-26,44.3714
2016-04-27,43.8317
2016-04-28,43.6642
2016-04-29,42.6777
2016-05-02,43.2175
2016-05-03,42.8266
2016-05-04,42.7335
2016-05-05,42.0821
2016-05-06,42.4451
2016-05-09,43.4594
2016-05-10,42.7894
2016-05-11,41.4493
2016-05-12,41.3469
2016-05-13,40.742
2016-05-16,41.3842
2016-05-17,41.0119
2016-05-18,38.9553
2016-05-19,39.951
2016-05-20,40.6118
2016-05-23,39.0763
2016-05-24,40.3326
2016-05-25,40.6304
2016-05-26,41.561
2016-05-27,47.4145
2016-05-31,48.6708
2016-06-01,48.7825
2016-06-02,48.7174
2016-06-03,49.3967
2016-06-06,48.4103
2016-06-07,49.1834
2016-06-08,49.5852
2016-06-09,49.417
2016-06-10,49.2021
2016-06-13,48.0435
2016-06-14,47.3615
2016-06-15,47.6511
2016-06-16,47.2026
2016-06-17,46.9223
2016-06-20,47.2587
2016-06-21,46.3337
2016-06-22,46.3524
2016-06-23,46.0254
2016-06-24,46.0534
2016-06-27,45.8198
2016-06-28,46.4178
2016-06-29,47.1279
2016-06-30,46.8196
2016-07-01,46.8009
2016-07-05,46.6981
2016-07-06,46.8009
2016-07-07,46.9691
2016-07-08,47.7446
2016-07-11,49.0993
2016-07-12,49.2675
2016-07-13,48.7163
2016-07-14,47.9781
2016-07-15,47.9968
2016-07-18,49.1367
2016-07-19,48.8844
2016-07-20,49.3516
2016-07-21,48.9779
2016-07-22,49.7814
2016-07-25,50.2766
2016-07-26,50.1832
2016-07-27,49.2862
2016-07-28,49.2769
2016-07-29,49.688
2016-08-01,50.5382
2016-08-02,47.8193
2016-08-03,49.0246
2016-08-04,49.118
2016-08-05,50.1084
2016-08-08,50.1738
2016-08-09,50.1084
2016-08-10,50.4261
2016-08-11,51.2016
2016-08-12,51.6314
2016-08-15,52.0986
2016-08-16,51.3137
2016-08-17,50.9213
2016-08-18,50.912
2016-08-19,49.9402
2016-08-22,49.8001
2016-08-23,51.9117
2016-08-24,51.6875
2016-08-25,49.4637
2016-08-26,47.2494
2016-08-29,47.8567
2016-08-30,46.7261
2016-08-31,46.0814
2016-09-01,46.1562
2016-09-02,46.614
2016-09-06,45.9973
2016-09-07,46.3633
2016-09-08,46.1193
2016-09-09,45.3124
2016-09-12,45.6877
2016-09-13,44.4679
2016-09-14,44.5992
2016-09-15,44.9464
2016-09-16,44.3647
2016-09-19,44.1019
2016-09-20,44.2896
2016-09-21,45.0496
2016-09-22,44.8714
2016-09-23,43.6327
2016-09-26,43.37
2016-09-27,44.4866
2016-09-28,43.8955
2016-09-29,44.862
2016-09-30,44.8057
2016-10-03,44.862
2016-10-04,44.0738
2016-10-05,43.6515
2016-10-06,43.9893
2016-10-07,44.1957
2016-10-10,43.6234
2016-10-11,43.1448
2016-10-12,43.5858
2016-10-13,42.4317
2016-10-14,42.047
2016-10-17,41.5966
2016-10-18,41.8593
2016-10-19,42.0282
2016-10-20,41.8593
2016-10-21,41.925
2016-10-24,42.1502
2016-10-25,41.1274
2016-10-26,40.6207
2016-10-27,40.0577
2016-10-28,40.4893
2016-10-31,40.7239
2016-11-01,40.2266
2016-11-02,40.8271
2016-11-03,40.4612
2016-11-04,40.9491
2016-11-07,42.0376
2016-11-08,41.9719
2016-11-09,43.7172
2016-11-10,45.181
2016-11-11,47.1609
2016-11-14,48.1368
2016-11-15,47.4893
2016-11-16,47.5269
2016-11-17,47.9022
2016-11-18,47.9116
2016-11-21,48.118
2016-11-22,49.7507
2016-11-23,49.3472
2016-11-25,49.1783
2016-11-28,48.4933
2016-11-29,48.5966
2016-11-30,47.4893
2016-12-01,47.6395
2016-12-02,48.2212
2016-12-05,48.5872
2016-12-06,50.5483
2016-12-07,51.1301
2016-12-08,52.0778
2016-12-09,51.496
2016-12-12,50.8298
2016-12-13,51.374
2016-12-14,51.0161
2016-12-15,51.8827
2016-12-16,52.0146
2016-12-19,52.429
2016-12-20,52.7681
2016-12-21,51.7885
2016-12-22,47.9642
2016-12-23,48.3221
2016-12-27,48.6518
2016-12-28,47.9359
2016-12-29,47.7381
2016-12-30,47.2954
2017-01-03,46.636
2017-01-04,47.8983
2017-01-05,46.702
2017-01-06,46.3346
2017-01-09,47.3237
2017-01-10,48.5011
2017-01-11,47.757
2017-01-12,47.5686
2017-01-13,47.5309
2017-01-17,47.286
2017-01-18,47.3142
2017-01-19,46.3535
2017-01-20,46.3629
2017-01-23,45.8731
2017-01-24,46.344
2017-01-25,46.5889
2017-01-26,46.4194
2017-01-27,45.8448
2017-01-30,45.7412
2017-01-31,47.0976
2017-02-01,46.6737
2017-02-02,47.0034
2017-02-03,47.578
2017-02-06,46.7679
2017-02-07,47.4084
2017-02-08,48.2468
2017-02-09,49.8952
2017-02-10,50.0553
2017-02-13,48.5482
2017-02-14,48.9909
2017-02-15,48.6707
2017-02-16,48.5388
2017-02-17,49.0851
2017-02-21,49.8481
2017-02-22,49.6032
2017-02-23,48.3692
2017-02-24,49.2641
2017-02-27,50.1307
2017-02-28,48.3598
2017-03-01,48.9627
2017-03-02,49.217
2017-03-03,51.0821
2017-03-06,50.4604
2017-03-07,48.7931
2017-03-08,48.8308
2017-03-09,48.4823
2017-03-10,48.2845
2017-03-13,46.6172
2017-03-14,45.8636
2017-03-15,46.8862
2017-03-16,47.3218
2017-03-17,47.3502
2017-03-20,46.1288
2017-03-21,45.1441
2017-03-22,45.6932
2017-03-23,45.8731
2017-03-24,45.5986
2017-03-27,45.5512
2017-03-28,46.1193
2017-03-29,46.7347
2017-03-30,46.5548
2017-03-31,46.0909
2017-04-03,45.1914
2017-04-04,45.0305
2017-04-05,44.3772
2017-04-06,45.5133
2017-04-07,45.4281
2017-04-10,45.627
2017-04-11,46.517
2017-04-12,45.4092
2017-04-13,44.6801
2017-04-17,45.5228
2017-04-18,45.9868
2017-04-19,46.1004
2017-04-20,47.1608
2017-04-21,47.0472
2017-04-24,47.2744
2017-04-25,46.9336
2017-04-26,48.8272
2017-04-27,49.1396
2017-04-28,47.8046
2017-05-01,46.8957
2017-05-02,47.4543
2017-05-03,47.4354
2017-05-04,46.5454
2017-05-05,46.9809
2017-05-08,47.1892
2017-05-09,47.5206
2017-05-10,47.8993
2017-05-11,46.5927
2017-05-12,44.9831
2017-05-15,44.5003
2017-05-16,44.1594
2017-05-17,44.0931
2017-05-18,43.9984
2017-05-19,44.9737
2017-05-22,45.1725
2017-05-23,44.4529
2017-05-24,44.4813
2017-05-25,45.7974
2017-05-26,47.1419
2017-05-30,47.2365
2017-05-31,46.2329
2017-06-01,46.9904
2017-06-02,47.3028
2017-06-05,46.9998
2017-06-06,45.6743
2017-06-07,46.8735
2017-06-08,46.4833
2017-06-09,48.0536
2017-06-12,47.9965
2017-06-13,47.8823
2017-06-14,47.3684
2017-06-15,46.3976
2017-06-16,45.5791
2017-06-19,45.8456
2017-06-20,44.5893
2017-06-21,44.3323
2017-06-22,44.7511
2017-06-23,44.7321
2017-06-26,45.1984
2017-06-27,45.7409
2017-06-28,45.2745
2017-06-29,45.5315
2017-06-30,45.9693
2017-07-03,46.8069
2017-07-05,45.7504
2017-07-06,44.7225
2017-07-07,44.3609
2017-07-10,44.2086
2017-07-11,44.3989
2017-07-12,44.6749
2017-07-13,45.7504
2017-07-14,45.5791
2017-07-17,46.2358
2017-07-18,45.8075
2017-07-19,45.9503
2017-07-20,45.9503
2017-07-21,45.8646
2017-07-24,45.265
2017-07-25,47.159
2017-07-26,46.4928
2017-07-27,47.8347
2017-07-28,47.9965
2017-07-31,47.2732
2017-08-01,48.3106
2017-08-02,47.711
2017-08-03,48.0346
2017-08-04,48.3106
2017-08-07,48.8246
2017-08-08,48.5295
2017-08-09,48.8912
2017-08-10,47.5873
2017-08-11,47.8538
2017-08-14,48.6152
2017-08-15,47.5492
2017-08-16,48.1012
2017-08-17,47.3494
2017-08-18,47.0638
2017-08-21,46.7212
2017-08-22,48.1869
2017-08-23,47.7681
2017-08-24,47.6729
2017-08-25,47.2161
2017-08-28,46.2739
2017-08-29,45.8075
2017-08-30,45.2745
2017-08-31,45.3031
2017-09-01,45.4839
2017-09-05,45.4649
2017-09-06,45.2079
2017-09-07,45.648
2017-09-08,45.7341
2017-09-11,45.9925
2017-09-12,46.3178
2017-09-13,46.777
2017-09-14,47.2267
2017-09-15,47.8582
2017-09-18,46.9301
2017-09-19,46.7292
2017-09-20,46.9014
2017-09-21,47.1693
2017-09-22,47.3702
2017-09-25,49.0159
2017-09-26,48.9681
2017-09-27,50.7094
2017-09-28,51.2452
2017-09-29,51.2548
2017-10-02,49.6761
2017-10-03,49.7622
2017-10-04,49.8961
2017-10-05,50.3363
2017-10-06,51.1113
2017-10-09,50.4415
2017-10-10,50.5372
2017-10-11,50.3267
2017-10-12,49.8483
2017-10-13,49.2168
2017-10-16,49.1403
2017-10-17,49.2742
2017-10-18,49.3603
2017-10-19,49.7909
2017-10-20,50.2502
2017-10-23,50.585
2017-10-24,49.944
2017-10-25,49.7048
2017-10-26,50.2023
2017-10-27,49.5804
2017-10-30,49.0063
2017-10-31,49.0924
2017-11-01,49.5613
2017-11-02,50.3554
2017-11-03,50.786
2017-11-06,49.9823
2017-11-07,49.7431
2017-11-08,51.0539
2017-11-09,50.9964
2017-11-10,51.3696
2017-11-13,51.2739
2017-11-14,51.1974
2017-11-15,50.6042
2017-11-16,51.5514
2017-11-17,52.6708
2017-11-20,53.2927
2017-11-21,52.422
2017-11-22,52.4603
2017-11-24,51.9532
2017-11-27,52.4699
2017-11-28,54.1443
2017-11-29,56.0961
2017-11-30,56.5458
2017-12-01,55.6942
2017-12-04,56.3831
2017-12-05,56.2683
2017-12-06,55.4838
2017-12-07,56.4118
2017-12-08,56.9763
2017-12-11,55.4742
2017-12-12,53.1301
2017-12-13,53.4267
2017-12-14,51.3699
2017-12-15,51.8697
2017-12-18,53.3498
2017-12-19,53.0518
2017-12-20,52.8116
2017-12-21,52.975
2017-12-22,53.3882
2017-12-26,54.2051
2017-12-27,54.1571
2017-12-28,53.6093
2017-12-29,53.9649
2018-01-02,53.7246
2018-01-03,52.802
2018-01-04,54.4454
2018-01-05,55.6852
2018-01-08,55.6083
2018-01-09,54.7914
2018-01-10,54.407
2018-01-11,55.2335
2018-01-12,55.1374
2018-01-16,55.6083
2018-01-17,56.531
2018-01-18,56.8577
2018-01-19,58.7991
2018-01-22,60.1543
2018-01-23,59.8275
2018-01-24,59.3758
2018-01-25,59.7218
2018-01-26,60.8078
2018-01-29,61.7208
2018-01-30,59.5392
2018-01-31,58.4147
2018-02-01,57.3287
2018-02-02,55.493
2018-02-05,53.5804
2018-02-06,54.974
2018-02-07,55.7044
2018-02-08,54.6088
2018-02-09,54.9836
2018-02-12,54.1379
2018-02-13,53.7342
2018-02-14,55.5411
2018-02-15,56.4637
2018-02-16,54.4935
2018-02-20,52.9942
2018-02-21,52.7251
2018-02-22,53.888
2018-02-23,54.7722
2018-02-26,54.58
2018-02-27,53.9168
2018-02-28,54.0129
2018-03-01,54.2436
2018-03-02,54.0994
2018-03-05,53.1768
2018-03-06,53.8592
2018-03-07,52.3791
2018-03-08,51.7928
2018-03-09,46.5645
2018-03-12,45.5169
2018-03-13,45.6227
2018-03-14,44.5366
2018-03-15,44.6808
2018-03-16,45.0941
2018-03-19,44.6424
2018-03-20,45.171
2018-03-21,43.96
2018-03-22,42.5766
2018-03-23,41.7156
2018-03-26,42.3347
2018-03-27,41.3576
2018-03-28,41.0287
2018-03-29,42.1122
2018-04-02,41.7156
2018-04-03,41.8703
2018-04-04,42.9055
2018-04-05,42.9732
2018-04-06,41.6575
2018-04-09,41.5704
2018-04-10,40.9029
2018-04-11,40.9223
2018-04-12,41.0867
2018-04-13,40.6514
2018-04-16,41.3963
2018-04-17,42.296
2018-04-18,42.3154
2018-04-19,40.9997
2018-04-20,40.6707
2018-04-23,40.574
2018-04-24,40.8932
2018-04-25,41.0771
2018-04-26,41.2996
2018-04-27,41.8026
2018-04-30,41.0674
2018-05-01,40.8352
2018-05-02,40.8932
2018-05-03,40.961
2018-05-04,39.9742
2018-05-07,39.6936
2018-05-08,38.939
2018-05-09,39.1035
2018-05-10,39.6162
2018-05-11,40.158
2018-05-14,40.8062
2018-05-15,41.2609
2018-05-16,41.6478
2018-05-17,41.2415
2018-05-18,40.2838
2018-05-21,40.0613
2018-05-22,39.1809
2018-05-23,39.1228
2018-05-24,40.3225
2018-05-25,40.4095
2018-05-29,40.1483
2018-05-30,40.9513
2018-05-31,39.5775
2018-06-01,37.4298
2018-06-04,39.0842
2018-06-05,38.2909
2018-06-06,40.0613
2018-06-07,41.3092
2018-06-08,41.3673
2018-06-11,41.8703
2018-06-12,40.8449
2018-06-13,40.8158
2018-06-14,40.4846
2018-06-15,40.1728
2018-06-18,40.2702
2018-06-19,39.7246
2018-06-20,39.5297
2018-06-21,40.7866
2018-06-22,40.28
2018-06-25,41.1374
2018-06-26,41.2641
2018-06-27,41.1082
2018-06-28,40.923
2018-06-29,40.7087
2018-07-02,40.3969
2018-07-03,39.7343
2018-07-05,39.783
2018-07-06,39.6271
2018-07-09,40.1143
2018-07-10,40.0266
2018-07-11,39.8805
2018-07-12,40.1241
2018-07-13,40.7769
2018-07-16,40.582
2018-07-17,41.2251
2018-07-18,41.6636
2018-07-19,42.8133
2018-07-20,42.2579
2018-07-23,42.4723
2018-07-24,42.0728
2018-07-25,42.482
2018-07-26,42.9107
2018-07-27,41.9461
2018-07-30,42.3261
2018-07-31,42.3164
2018-08-01,42.3359
2018-08-02,44.0312
2018-08-03,44.3041
2018-08-06,45.4538
2018-08-07,45.8825
2018-08-08,46.1943
2018-08-09,46.3502
2018-08-10,46.1164
2018-08-13,46.1261
2018-08-14,46.7789
2018-08-15,45.9118
2018-08-16,45.9897
2018-08-17,46.7887
2018-08-20,47.461
2018-08-21,47.2369
2018-08-22,47.6948
2018-08-23,48.1041
2018-08-24,48.8446
2018-08-27,47.9482
2018-08-28,47.6656
2018-08-29,47.763
2018-08-30,46.6328
2018-08-31,41.9461
2018-09-04,41.722
2018-09-05,42.482
2018-09-06,42.8912
2018-09-07,41.9266
2018-09-10,42.8718
2018-09-11,41.9169
2018-09-12,41.1277
2018-09-13,40.5781
2018-09-14,40.8136
2018-09-17,40.4505
2018-09-18,40.4113
2018-09-19,40.2346
2018-09-20,40.6468
2018-09-21,40.4113
2018-09-24,40.4211
2018-09-25,40.637
2018-09-26,41.216
2018-09-27,40.6468
2018-09-28,41.0099
2018-10-01,40.686
2018-10-02,40.4407
2018-10-03,40.1856
2018-10-04,40.323
2018-10-05,41.0197
2018-10-08,42.0599
2018-10-09,41.3534
2018-10-10,42.0305
2018-10-11,41.0099
2018-10-12,41.8931
2018-10-15,42.894
2018-10-16,43.6399
2018-10-17,42.8057
2018-10-18,39.4986
2018-10-19,38.743
2018-10-22,40.4407
2018-10-23,40.6664
2018-10-24,40.372
2018-10-25,41.0099
2018-10-26,39.8912
2018-10-29,40.5977
2018-10-30,42.4426
2018-10-31,40.7449
2018-11-01,42.1384
2018-11-02,41.9225
2018-11-05,42.3936
2018-11-06,41.7655
2018-11-07,42.9627
2018-11-08,44.0618
2018-11-09,42.0207
2018-11-12,42.6193
2018-11-13,43.1786
2018-11-14,41.7459
2018-11-15,41.2945
2018-11-16,40.7547
2018-11-19,42.266
2018-11-20,40.0187
2018-11-21,40.2346
2018-11-23,40.7449
2018-11-26,42.2954
2018-11-27,42.6291
2018-11-28,42.9627
2018-11-29,43.7674
2018-11-30,42.7468
2018-12-03,43.316
2018-12-04,41.1276
2018-12-06,39.5477
2018-12-07,30.4213
2018-12-10,29.0867
2018-12-11,29.3811
2018-12-12,29.2731
2018-12-13,29.4417
2018-12-14,28.2521
2018-12-17,28.3314
2018-12-18,28.7874
2018-12-19,28.4702
2018-12-20,26.8643
2018-12-21,26.8147
2018-12-24,26.5074
2018-12-26,28.1034
2018-12-27,28.1728
2018-12-28,27.806
2018-12-31,28.6685
2019-01-02,29.1938
2019-01-03,28.8766
2019-01-04,29.8283
2019-01-07,29.8679
2019-01-08,29.5705
2019-01-09,30.3834
2019-01-10,30.2843
2019-01-11,31.0773
2019-01-14,31.0872
2019-01-15,31.0971
2019-01-16,30.6015
2019-01-17,31.2954
2019-01-18,31.6027
2019-01-22,31.9695
2019-01-23,32.0686
2019-01-24,31.6919
2019-01-25,32.2173
2019-01-28,31.5928
2019-01-29,31.7811
2019-01-30,30.8493
2019-01-31,31.2657
2019-02-01,31.0476
2019-02-04,31.7415
2019-02-05,31.7316
2019-02-06,31.7018
2019-02-07,31.9298
2019-02-08,30.6213
2019-02-11,30.4131
2019-02-12,31.2657
2019-02-13,31.6622
2019-02-14,31.8803
2019-02-15,31.9893
2019-02-19,32.0686
2019-02-20,32.3164
2019-02-21,31.1467
2019-02-22,31.0079
2019-02-25,31.7811
2019-02-26,31.7514
2019-02-27,31.2954
2019-02-28,31.2558
2019-03-01,31.1764
2019-03-04,31.226
2019-03-05,31.7316
2019-03-06,31.6225
2019-03-07,31.5631
2019-03-08,35.8653
2019-03-11,36.0834
2019-03-12,35.2408
2019-03-13,35.1615
2019-03-14,35.0425
2019-03-15,34.9037
2019-03-18,34.1404
2019-03-19,34.5964
2019-03-20,34.19
2019-03-21,35.25
2019-03-22,35.05
2019-03-25,35.91
2019-03-26,36.69
2019-03-27,37.71
2019-03-28,37.61
2019-03-29,38.02
2019-04-01,38.61
2019-04-02,38.08
2019-04-03,38.16
2019-04-04,38.27
2019-04-05,38.37
2019-04-08,39.04
2019-04-09,38.6
2019-04-10,38.93
2019-04-11,39.3
2019-04-12,38.24
2019-04-15,39.33
2019-04-16,38.75
2019-04-17,38.66
2019-04-18,39.07
2019-04-22,37.73
2019-04-23,37.87
2019-04-24,39.04
2019-04-25,38.67
2019-04-26,38.08
2019-04-29,37.53
2019-04-30,37.16
2019-05-01,36.79
2019-05-02,37.02
2019-05-03,37.56
2019-05-06,38.32
2019-05-07,36.98
2019-05-08,37.7
2019-05-09,37.8
2019-05-10,36.52
2019-05-13,34.16
2019-05-14,33.98
2019-05-15,34.03
2019-05-16,33.08
2019-05-17,31.91
2019-05-20,31.57
2019-05-21,31.66
2019-05-22,30.64
2019-05-23,29.31
2019-05-24,28.95
2019-05-28,26.97
2019-05-29,26.44
2019-05-30,26.01
2019-05-31,27.6
2019-06-03,27.57
2019-06-04,28.56
2019-06-05,27.52
2019-06-06,26.78
2019-06-07,26.8
2019-06-10,28.6
2019-06-11,29.31
2019-06-12,28.94
2019-06-13,29.145
2019-06-14,28.85
2019-06-17,29.525
2019-06-18,29.77
2019-06-19,30.075
2019-06-20,29.405
2019-06-21,29.08
2019-06-24,27.46
2019-06-25,27.82
2019-06-26,28.695
2019-06-27,28.925
2019-06-28,28.42
2019-07-01,27.99
2019-07-02,27.23
2019-07-03,27.1
2019-07-04,27.1
2019-07-05,27.08
2019-07-08,27.46
2019-07-09,27.07
2019-07-10,26.165
2019-07-11,25.13
2019-07-12,24.89
2019-07-15,23.695
2019-07-16,24.16
2019-07-17,25.22
2019-07-18,26.13
2019-07-19,26.225
2019-07-22,25.78
2019-07-23,25.58
2019-07-24,26.37
2019-07-25,25.825
2019-07-26,25.54
2019-07-29,25.38
2019-07-30,24.66
2019-07-31,25.615
2019-08-01,24.515
2019-08-02,24.82
2019-08-05,24.045
2019-08-06,24.205
2019-08-07,23.785
2019-08-08,24.145
2019-08-09,22.345
2019-08-12,21.99
2019-08-13,21.85
2019-08-14,21.58
2019-08-15,20.185
2019-08-16,20.465
2019-08-19,21.22
2019-08-20,20.535
2019-08-21,20.765
2019-08-22,21.385
2019-08-23,20.65
2019-08-26,21.055
2019-08-27,21.005
2019-08-28,21.415
2019-08-29,22.025
2019-08-30,22.75
2019-09-02,22.75
2019-09-03,22.8
2019-09-04,22.35
2019-09-05,23.185
2019-09-06,22.745
2019-09-09,24.215
2019-09-10,24.44
2019-09-11,24.265
2019-09-12,23.025
2019-09-13,22.79
2019-09-16,22.2
2019-09-17,22.095
2019-09-18,22.265
2019-09-19,22.91
2019-09-20,22.88
2019-09-23,24.29
2019-09-24,23.96
2019-09-25,24.27
2019-09-26,23.805
2019-09-27,23.795
2019-09-30,24.485
2019-10-01,24.095
2019-10-02,22.12
2019-10-03,21.9
2019-10-04,21.54
2019-10-07,21.17
2019-10-08,20.465
2019-10-09,20.795
2019-10-10,21.005
2019-10-11,22.225
2019-10-14,21.98
2019-10-15,22.24
2019-10-16,21.785
2019-10-17,21.275
2019-10-18,20.57
2019-10-21,20.345
2019-10-22,20.355
2019-10-23,22.095
2019-10-24,23.265
2019-10-25,23.365
2019-10-28,22.715
2019-10-29,22.59
2019-10-30,21.9
2019-10-31,21.615
2019-11-01,21.5
2019-11-04,21.85
2019-11-05,22.475
2019-11-06,22.34
2019-11-07,22.085
2019-11-08,21.575
2019-11-11,21.305
2019-11-12,21.49
2019-11-13,21.51
2019-11-14,21.055
2019-11-15,21.05
2019-11-18,20.685
2019-11-19,19.365
2019-11-20,19.43
2019-11-21,19.67
2019-11-22,19.415
2019-11-25,20.66
