date,close
2014-06-13,44.59
2014-06-16,45.12
2014-06-17,46.47
2014-06-18,47.65
2014-06-19,47.1
2014-06-20,47.28
2014-06-23,47.96
2014-06-24,48.24
2014-06-25,48.87
2014-06-26,48.32
2014-06-27,48.92
2014-06-30,49.12
2014-07-01,50.11
2014-07-02,49.46
2014-07-03,50.51
2014-07-07,48.58
2014-07-08,47.56
2014-07-09,48.44
2014-07-10,47.6
2014-07-11,47
2014-07-14,46.88
2014-07-15,46.27
2014-07-16,45.6
2014-07-17,44.69
2014-07-18,46.29
2014-07-21,45.74
2014-07-22,46.65
2014-07-23,46.44
2014-07-24,46.26
2014-07-25,45.9
2014-07-28,45.26
2014-07-29,46.6
2014-07-30,52.05
2014-07-31,50.63
2014-08-01,49.28
2014-08-04,50.79
2014-08-05,51.2
2014-08-06,51.982
2014-08-07,51.23
2014-08-08,51.81
2014-08-11,52.78
2014-08-12,51.7
2014-08-13,52.29
2014-08-14,52.39
2014-08-15,51.82
2014-08-18,53.65
2014-08-19,55.94
2014-08-20,56.03
2014-08-21,56.33
2014-08-22,58.73
2014-08-25,57.08
2014-08-26,58.93
2014-08-27,57.7
2014-08-28,57.25
2014-08-29,58.01
2014-09-02,58.04
2014-09-03,57.77
2014-09-04,57.79
2014-09-05,56.73
2014-09-08,55.97
2014-09-09,54.84
2014-09-10,55.48
2014-09-11,55.8
2014-09-12,54.65
2014-09-15,54.46
2014-09-16,54.26
2014-09-17,54.48
2014-09-18,54.6
2014-09-19,52.96
2014-09-22,53
2014-09-23,51.3
2014-09-24,52.71
2014-09-25,52.32
2014-09-26,52.78
2014-09-29,51.75
2014-09-30,50.75
2014-10-01,49.08
2014-10-02,49.95
2014-10-03,50.2
2014-10-06,49.19
2014-10-07,48.83
2014-10-08,49.69
2014-10-09,48.42
2014-10-10,48.14
2014-10-13,48.19
2014-10-14,49.11
2014-10-15,51.04
2014-10-16,50.84
2014-10-17,49.55
2014-10-20,50.12
2014-10-21,51.65
2014-10-22,50.64
2014-10-23,51.93
2014-10-24,50.9
2014-10-27,51.8
2014-10-28,53.09
2014-10-29,55.51
2014-10-30,55.06
2014-10-31,56
2014-11-03,55.85
2014-11-04,55.65
2014-11-05,55.7
2014-11-06,56.17
2014-11-07,55.21
2014-11-10,55.64
2014-11-11,55.38
2014-11-12,56.5
2014-11-13,55.62
2014-11-14,55.18
2014-11-17,53.6
2014-11-18,54.12
2014-11-19,53.07
2014-11-20,55.71
2014-11-21,55.54
2014-11-24,56.54
2014-11-25,56.71
2014-11-26,56.75
2014-11-28,54.93
2014-12-01,53.84
2014-12-02,54.45
2014-12-03,55.19
2014-12-04,54.55
2014-12-05,56.42
2014-12-08,55.01
2014-12-09,58.63
2014-12-10,58.37
2014-12-11,58.59
2014-12-12,58.26
2014-12-15,56.48
2014-12-16,55.89
2014-12-17,57.08
2014-12-18,59.63
2014-12-19,60.32
2014-12-22,61.98
2014-12-23,62.86
2014-12-24,63.86
2014-12-26,65.37
2014-12-29,64.1
2014-12-30,63.36
2014-12-31,62.68
2015-01-02,61.52
2015-01-05,58.94
2015-01-06,56.71
2015-01-07,53.43
2015-01-08,52.76
2015-01-09,53.91
2015-01-12,53.7
2015-01-13,54.47
2015-01-14,54.3
2015-01-15,54.02
2015-01-16,53.92
2015-01-20,53.71
2015-01-21,53.99
2015-01-22,54.84
2015-01-23,55.13
2015-01-26,56.06
2015-01-27,55.3
2015-01-28,55.8
2015-01-29,56.5
2015-01-30,55.35
2015-02-02,55.55
2015-02-03,56.55
2015-02-04,56.2
2015-02-05,56.34
2015-02-06,57.4
2015-02-09,56.27
2015-02-10,56.85
2015-02-11,58.11
2015-02-12,59.43
2015-02-13,58.65
2015-02-17,57.91
2015-02-18,58.32
2015-02-19,59.45
2015-02-20,59.04
2015-02-23,58.89
2015-02-24,59.5
2015-02-25,58.53
2015-02-26,60.81
2015-02-27,59.97
2015-03-02,58.84
2015-03-03,57.87
2015-03-04,57.69
2015-03-05,56.13
2015-03-06,53.91
2015-03-09,54.45
2015-03-10,53.5
2015-03-11,54.44
2015-03-12,56.36
2015-03-13,57.15
2015-03-16,57.75
2015-03-17,58.64
2015-03-18,60.98
2015-03-19,60.76
2015-03-20,60.76
2015-03-23,61.4
2015-03-24,60.06
2015-03-25,58.59
2015-03-26,57.84
2015-03-27,58.57
2015-03-30,59.76
2015-03-31,62.13
2015-04-01,61.29
2015-04-02,61.45
2015-04-06,61.79
2015-04-07,61.14
2015-04-08,61.75
2015-04-09,61.35
2015-04-10,61.82
2015-04-13,62.17
2015-04-14,62.63
2015-04-15,63.51
2015-04-16,63.39
2015-04-17,62.23
2015-04-20,46.11
2015-04-21,45.57
2015-04-22,44.64
2015-04-23,44.66
2015-04-24,43.44
2015-04-27,43.31
2015-04-28,43.26
2015-04-29,40.87
2015-04-30,39.83
2015-05-01,40.51
2015-05-04,40.39
2015-05-05,39.97
2015-05-06,40.21
2015-05-07,39.95
2015-05-08,40.37
2015-05-11,40.71
2015-05-12,40.7
2015-05-13,40.78
2015-05-14,41.78
2015-05-15,41.4
2015-05-18,42.2
2015-05-19,42.25
2015-05-20,42
2015-05-21,42.81
2015-05-22,43.1
2015-05-26,42.89
2015-05-27,43.17
2015-05-28,43.4
2015-05-29,43.63
2015-06-01,43.39
2015-06-02,43.45
2015-06-03,43.61
2015-06-04,42.99
2015-06-05,43.68
2015-06-08,42.92
2015-06-09,42.26
2015-06-10,43.8
2015-06-11,44.02
2015-06-12,44.7
2015-06-15,45.14
2015-06-16,45.69
2015-06-17,46.57
2015-06-18,47.51
2015-06-19,47.52
2015-06-22,46.98
2015-06-23,46.77
2015-06-24,46.61
2015-06-25,46.8
2015-06-26,46.51
2015-06-29,45.71
2015-06-30,46.7
2015-07-01,46.88
2015-07-02,46.11
2015-07-06,45.95
2015-07-07,45.84
2015-07-08,44.13
2015-07-09,43.46
2015-07-10,44.86
2015-07-13,43.85
2015-07-14,41.99
2015-07-15,41.26
2015-07-16,41.47
2015-07-17,40.78
2015-07-20,40
2015-07-21,40.23
2015-07-22,39.12
2015-07-23,38.58
2015-07-24,38.07
2015-07-27,37.84
2015-07-28,38.53
2015-07-29,39.21
2015-07-30,44.42
2015-07-31,43.89
2015-08-03,43.9
2015-08-04,41.74
2015-08-05,41.65
2015-08-06,41.34
2015-08-07,41.45
2015-08-10,42.92
2015-08-11,42.16
2015-08-12,42.55
2015-08-13,41.73
2015-08-14,42.16
2015-08-17,42.25
2015-08-18,40.68
2015-08-19,40.02
2015-08-20,39.08
2015-08-21,38.92
2015-08-24,37.46
2015-08-25,37.15
2015-08-26,37.56
2015-08-27,37.72
2015-08-28,38.01
2015-08-31,38.85
2015-09-01,37.92
2015-09-02,37.65
2015-09-03,37.17
2015-09-04,36.52
2015-09-08,37.53
2015-09-09,35.5
2015-09-10,35.67
2015-09-11,35.5
2015-09-14,35.61
2015-09-15,36.24
2015-09-16,37.37
2015-09-17,37.15
2015-09-18,36.73
2015-09-21,35.74
2015-09-22,35.34
2015-09-23,34.47
2015-09-24,33.56
2015-09-25,34.07
2015-09-28,34.24
2015-09-29,34.41
2015-09-30,35
2015-10-01,35.05
2015-10-02,36.06
2015-10-05,38.28
2015-10-06,38.25
2015-10-07,39.68
2015-10-08,39.52
2015-10-09,38.49
2015-10-12,36.94
2015-10-13,35.76
2015-10-14,35.31
2015-10-15,36.55
2015-10-16,35.99
2015-10-19,35.76
2015-10-20,35.78
2015-10-21,34.95
2015-10-22,34.89
2015-10-23,35.54
2015-10-26,34.38
2015-10-27,32.48
2015-10-28,33.94
2015-10-29,34.06
2015-10-30,33.79
2015-11-02,33.76
2015-11-03,35.25
2015-11-04,24.34
2015-11-05,24.79
2015-11-06,28.26
2015-11-09,27.38
2015-11-10,27.68
2015-11-11,27.64
2015-11-12,26.26
2015-11-13,26.32
2015-11-16,27.56
2015-11-17,27.84
2015-11-18,29.99
2015-11-19,29.58
2015-11-20,29.62
2015-11-23,29.55
2015-11-24,30.69
2015-11-25,30.32
2015-11-27,30.54
2015-11-30,30.09
2015-12-01,30.03
2015-12-02,29.86
2015-12-03,29.66
2015-12-04,29.98
2015-12-07,29.54
2015-12-08,29.51
2015-12-09,28.96
2015-12-10,28.86
2015-12-11,27.78
2015-12-14,27.63
2015-12-15,27.99
2015-12-16,29.05
2015-12-17,28.71
2015-12-18,27.61
2015-12-21,29.78
2015-12-22,29.85
2015-12-23,30.28
2015-12-24,30.44
2015-12-28,29.99
2015-12-29,30.16
2015-12-30,30.25
2015-12-31,29.52
2016-01-04,28.55
2016-01-05,28.48
2016-01-06,28.26
2016-01-07,26.07
2016-01-08,24.53
2016-01-11,24.52
2016-01-12,24.45
2016-01-13,23.24
2016-01-14,23.59
2016-01-15,22.92
2016-01-19,21.67
2016-01-20,21.62
2016-01-21,24.33
2016-01-22,24.14
2016-01-25,23.1
2016-01-26,24.8
2016-01-27,23.99
2016-01-28,24
2016-01-29,25.67
2016-02-01,24.92
2016-02-02,24.69
2016-02-03,24.92
2016-02-04,25.46
2016-02-05,24.72
2016-02-08,24.51
2016-02-09,24.17
2016-02-10,24.05
2016-02-11,23.92
2016-02-12,24.64
2016-02-16,25.44
2016-02-17,26.07
2016-02-18,25.75
2016-02-19,26
2016-02-22,26.41
2016-02-23,26.47
2016-02-24,26.95
2016-02-25,30.3
2016-02-26,30
2016-02-29,32.05
2016-03-01,31.64
2016-03-02,33.05
2016-03-03,33.6
2016-03-04,34.08
2016-03-07,35.18
2016-03-08,33.63
2016-03-09,33.03
2016-03-10,32.98
2016-03-11,32.9
2016-03-14,32.34
2016-03-15,31.77
2016-03-16,32.25
2016-03-17,33.02
2016-03-18,32.64
2016-03-21,32.48
2016-03-22,31.65
2016-03-23,30.75
2016-03-24,31.28
2016-03-28,30.9
2016-03-29,32.38
2016-03-30,31.61
2016-03-31,32.21
2016-04-01,32.4
2016-04-04,31.49
2016-04-05,30.48
2016-04-06,30.68
2016-04-07,29.86
2016-04-08,30.48
2016-04-11,29.6
2016-04-12,29.74
2016-04-13,30.24
2016-04-14,30.36
2016-04-15,30.38
2016-04-18,30.45
2016-04-19,30.24
2016-04-20,30.54
2016-04-21,29.99
2016-04-22,29.71
2016-04-25,29.94
2016-04-26,30.03
2016-04-27,29.69
2016-04-28,29.6
2016-04-29,29.04
2016-05-02,29.21
2016-05-03,28.05
2016-05-04,33.13
2016-05-05,34.84
2016-05-06,34.26
2016-05-09,33.56
2016-05-10,34.37
2016-05-11,33.19
2016-05-12,33.12
2016-05-13,32.97
2016-05-16,33.46
2016-05-17,32.83
2016-05-18,32.94
2016-05-19,33
2016-05-20,33.63
2016-05-23,33.36
2016-05-24,34.25
2016-05-25,34.41
2016-05-26,34.47
2016-05-27,35.21
2016-05-31,35.39
2016-06-01,37.15
2016-06-02,37.07
2016-06-03,37.06
2016-06-06,37.61
2016-06-07,37.46
2016-06-08,37.76
2016-06-09,37.09
2016-06-10,36.12
2016-06-13,35.43
2016-06-14,35.53
2016-06-15,35.88
2016-06-16,36.04
2016-06-17,35.62
2016-06-20,35.67
2016-06-21,35.68
2016-06-22,35.37
2016-06-23,36.01
2016-06-24,32.81
2016-06-27,30.79
2016-06-28,32.19
2016-06-29,33.07
2016-06-30,33.83
2016-07-01,33.33
2016-07-05,32.64
2016-07-06,32.29
2016-07-07,32.39
2016-07-08,32.94
2016-07-11,33.78
2016-07-12,34.05
2016-07-13,35.57
2016-07-14,35.03
2016-07-15,35.46
2016-07-18,35.68
2016-07-19,35.77
2016-07-20,35.74
2016-07-21,35.24
2016-07-22,35.58
2016-07-25,35.33
2016-07-26,35.71
2016-07-27,35.98
2016-07-28,35.25
2016-07-29,34.88
2016-08-01,35.64
2016-08-02,34.29
2016-08-03,32.25
2016-08-04,32.52
2016-08-05,32.68
2016-08-08,32.99
2016-08-09,33.09
2016-08-10,32.45
2016-08-11,32.31
2016-08-12,32
2016-08-15,32.45
2016-08-16,32.23
2016-08-17,31.66
2016-08-18,31.67
2016-08-19,31.46
2016-08-22,31.7
2016-08-23,31.62
2016-08-24,33.3
2016-08-25,33.3
2016-08-26,33.62
2016-08-29,34.06
2016-08-30,33.43
2016-08-31,32.6
2016-09-01,33.16
2016-09-02,33.3
2016-09-06,33.14
2016-09-07,34.55
2016-09-08,34.38
2016-09-09,33.38
2016-09-12,33.61
2016-09-13,32.8
2016-09-14,32.38
2016-09-15,32.64
2016-09-16,33.6
2016-09-19,35.6
2016-09-20,35.02
2016-09-21,35.33
2016-09-22,36.35
2016-09-23,35.89
2016-09-26,35.39
2016-09-27,36.09
2016-09-28,36.65
2016-09-29,35.62
2016-09-30,35.95
2016-10-03,35.53
2016-10-04,35.34
2016-10-05,36.72
2016-10-06,36.17
2016-10-07,35.69
2016-10-10,36.36
2016-10-11,35.35
2016-10-12,35.68
2016-10-13,34.25
2016-10-14,34.75
2016-10-17,34.55
2016-10-18,34.75
2016-10-19,34.3
2016-10-20,33.95
2016-10-21,34.45
2016-10-24,34.85
2016-10-25,34.5
2016-10-26,34.65
2016-10-27,33.65
2016-10-28,33.7
2016-10-31,33.55
2016-11-01,33.15
2016-11-02,30.55
2016-11-03,30.05
2016-11-04,30.05
2016-11-07,31.1
2016-11-08,31.1
2016-11-09,33.05
2016-11-10,33.5
2016-11-11,34.9
2016-11-14,34.5
2016-11-15,34.9
2016-11-16,35.35
2016-11-17,35.35
2016-11-18,35.35
2016-11-21,36.35
2016-11-22,37.45
2016-11-23,37.2
2016-11-25,37.25
2016-11-28,36.8
2016-11-29,36.8
2016-11-30,36.4
2016-12-01,36.2
2016-12-02,36.35
2016-12-05,37.05
2016-12-06,37.7
2016-12-07,39.05
2016-12-08,39.8
2016-12-09,39.8
2016-12-12,39.4
2016-12-13,39.25
2016-12-14,38.35
2016-12-15,38.5
2016-12-16,37.9
2016-12-19,37.6
2016-12-20,36.35
2016-12-21,37.25
2016-12-22,36.7
2016-12-23,36.5
2016-12-27,36.8
2016-12-28,36.3
2016-12-29,36.4
2016-12-30,36
2017-01-03,37.2
2017-01-04,38.325
2017-01-05,37.95
2017-01-06,38.2
2017-01-09,37.95
2017-01-10,38.35
2017-01-11,38.35
2017-01-12,37.75
2017-01-13,38.35
2017-01-17,36.95
2017-01-18,37.9
2017-01-19,37.2
2017-01-20,37.3
2017-01-23,37.35
2017-01-24,37.35
2017-01-25,37.9
2017-01-26,37.05
2017-01-27,37.2
2017-01-30,36.75
2017-01-31,37.1
2017-02-01,37.95
2017-02-02,38.05
2017-02-03,38.4
2017-02-06,37.2
2017-02-07,36.7
2017-02-08,36.4
2017-02-09,37.3
2017-02-10,37.05
2017-02-13,37.55
2017-02-14,37.85
2017-02-15,38.05
2017-02-16,37.45
2017-02-17,38.3
2017-02-21,38.4
2017-02-22,38.85
2017-02-23,35.9
2017-02-24,35.1
2017-02-27,34.75
2017-02-28,34.5
2017-03-01,35.4
2017-03-02,35.2
2017-03-03,34.55
2017-03-06,34.6
2017-03-07,34.5
2017-03-08,34
2017-03-09,33.8
2017-03-10,34.4
2017-03-13,34.45
2017-03-14,34.55
2017-03-15,35.45
2017-03-16,35.65
2017-03-17,36.8
2017-03-20,35.4
2017-03-21,33.75
2017-03-22,33.4
2017-03-23,34.45
2017-03-24,34.2
2017-03-27,33.95
2017-03-28,35
2017-03-29,35
2017-03-30,35.8
2017-03-31,35.75
2017-04-03,33.9
2017-04-04,33.9
2017-04-05,33.05
2017-04-06,33.75
2017-04-07,33.75
2017-04-10,33.1
2017-04-11,33.5
2017-04-12,32.4
2017-04-13,32
2017-04-17,32.45
2017-04-18,32.95
2017-04-19,33.35
2017-04-20,34.15
2017-04-21,34.05
2017-04-24,34.85
2017-04-25,36.45
2017-04-26,37.1
2017-04-27,37.4
2017-04-28,36.65
2017-05-01,36.55
2017-05-02,36.15
2017-05-03,35.65
2017-05-04,35.65
2017-05-05,36.15
2017-05-08,36.15
2017-05-09,36.35
2017-05-10,34.05
2017-05-11,34.025
2017-05-12,34.1
2017-05-15,34.8
2017-05-16,34.95
2017-05-17,33.7
2017-05-18,35.25
2017-05-19,34.9
2017-05-22,35.2
2017-05-23,35.3
2017-05-24,35.2
2017-05-25,35.3
2017-05-26,35.35
2017-05-30,35.25
2017-05-31,34.75
2017-06-01,35.65
2017-06-02,36.9
2017-06-05,36.9
2017-06-06,37.05
2017-06-07,37.4
2017-06-08,38.7
2017-06-09,37.75
2017-06-12,37.1
2017-06-13,37
2017-06-14,36.95
2017-06-15,36.4
2017-06-16,35.9
2017-06-19,36.45
2017-06-20,36.2
2017-06-21,35.85
2017-06-22,36.65
2017-06-23,37.4
2017-06-26,36.75
2017-06-27,36.1
2017-06-28,39.3
2017-06-29,38.05
2017-06-30,37.8
2017-07-03,37.55
2017-07-05,37.1
2017-07-06,36.65
2017-07-07,37.8
2017-07-10,38.25
2017-07-11,38.7
2017-07-12,39.15
2017-07-13,39.25
2017-07-14,39.3
2017-07-17,39.25
2017-07-18,38.4
2017-07-19,39.1
2017-07-20,39.25
2017-07-21,39.4
2017-07-24,39.6
2017-07-25,39.25
2017-07-26,39.05
2017-07-27,39.6
2017-07-28,39.25
2017-07-31,39.5
2017-08-01,39.2
2017-08-02,37.05
2017-08-03,35.2
2017-08-04,34.05
2017-08-07,34.55
2017-08-08,34.35
2017-08-09,33.4
2017-08-10,32.85
2017-08-11,33.3
2017-08-14,34.15
2017-08-15,33.6
2017-08-16,33.4
2017-08-17,32.6
2017-08-18,32.95
2017-08-21,32.65
2017-08-22,33.1
2017-08-23,33.2
2017-08-24,32.9
2017-08-25,33.7
2017-08-28,34.1
2017-08-29,33.95
2017-08-30,34.2
2017-08-31,34.45
2017-09-01,34.7
2017-09-05,34.45
2017-09-06,33.95
2017-09-07,33.6
2017-09-08,33.75
2017-09-11,34.95
2017-09-12,35.4
2017-09-13,35.5
2017-09-14,35.95
2017-09-15,36.35
2017-09-18,37.25
2017-09-19,37.15
2017-09-20,37.35
2017-09-21,37.2
2017-09-22,37.15
2017-09-25,36.55
2017-09-26,36.75
2017-09-27,38
2017-09-28,38.4
2017-09-29,38.25
2017-10-02,38.35
2017-10-03,38.45
2017-10-04,38.65
2017-10-05,38.3
2017-10-06,38.3
2017-10-09,38.05
2017-10-10,38.4
2017-10-11,38
2017-10-12,37.8
2017-10-13,40.1
2017-10-16,40.4
2017-10-17,39.45
2017-10-18,39
2017-10-19,37.65
2017-10-20,37.45
2017-10-23,37.55
2017-10-24,37.65
2017-10-25,38.8
2017-10-26,37.95
2017-10-27,46.25
2017-10-30,51.2
2017-10-31,51.8
2017-11-01,51.45
2017-11-02,51.5
2017-11-03,50.9
2017-11-06,51.7
2017-11-07,51
2017-11-08,52.575
2017-11-09,52.75
2017-11-10,53
2017-11-13,52.1
2017-11-14,51.95
2017-11-15,51.6
2017-11-16,51.85
2017-11-17,51.8
2017-11-20,52.6
2017-11-21,53.65
2017-11-22,53.1
2017-11-24,53.4
2017-11-27,52.65
2017-11-28,53.3
2017-11-29,51.75
2017-11-30,52.3
2017-12-01,51.45
2017-12-04,50.05
2017-12-05,50.5
2017-12-06,51.2
2017-12-07,51
2017-12-08,49.75
2017-12-11,49.5
2017-12-12,49.45
2017-12-13,49
2017-12-14,47.7
2017-12-15,47.7
2017-12-18,48.65
2017-12-19,47.45
2017-12-20,47.5
2017-12-21,47.6
2017-12-22,47.15
2017-12-26,47.25
2017-12-27,47
2017-12-28,47.35
2017-12-29,47
2018-01-02,48.15
2018-01-03,49.95
2018-01-04,50.75
2018-01-05,50.7
2018-01-08,50.8
2018-01-09,51.45
2018-01-10,51.15
2018-01-11,51.85
2018-01-12,52.45
2018-01-16,52.75
2018-01-17,53.9
2018-01-18,53.8
2018-01-19,54.4
2018-01-22,53.6
2018-01-23,54.7
2018-01-24,53.55
2018-01-25,54.05
2018-01-26,53.9
2018-01-29,54.2
2018-01-30,53.85
2018-01-31,53.9
2018-02-01,53
2018-02-02,51.9
2018-02-05,50.15
2018-02-06,50.65
2018-02-07,50.05
2018-02-08,49.8
2018-02-09,50.7
2018-02-12,51.1
2018-02-13,50.7
2018-02-14,51.65
2018-02-15,54.05
2018-02-16,51.95
2018-02-20,51.95
2018-02-21,54
2018-02-22,60.35
2018-02-23,60
2018-02-26,62.1
2018-02-27,61.3
2018-02-28,59.35
2018-03-01,59
2018-03-02,59.55
2018-03-05,60.15
2018-03-06,60.5
2018-03-07,60.85
2018-03-08,59.55
2018-03-09,60.85
2018-03-12,62.3
2018-03-13,61
2018-03-14,59.95
2018-03-15,59.7
2018-03-16,58.95
2018-03-19,59.35
2018-03-20,61.3
2018-03-21,60.65
2018-03-22,59.65
2018-03-23,58.4
2018-03-26,60.1
2018-03-27,57.95
2018-03-28,57.35
2018-03-29,58.4
2018-04-02,56.8
2018-04-03,58.3
2018-04-04,58.15
2018-04-05,58.95
2018-04-06,57.45
2018-04-09,58.3
2018-04-10,60.85
2018-04-11,61.35
2018-04-12,61.1
2018-04-13,60.8
2018-04-16,64
2018-04-17,63.55
2018-04-18,64.4
2018-04-19,63.15
2018-04-20,63.45
2018-04-23,63.4
2018-04-24,62.5
2018-04-25,60.65
2018-04-26,52.65
2018-04-27,50.575
2018-04-30,50.5
2018-05-01,51.1
2018-05-02,50.9
2018-05-03,51
2018-05-04,51.4
2018-05-07,51.45
2018-05-08,52.2
2018-05-09,53.3
2018-05-10,53.75
2018-05-11,53.8
2018-05-14,53.1
2018-05-15,51.95
2018-05-16,52.85
2018-05-17,53.45
2018-05-18,53.35
2018-05-21,53.95
2018-05-22,53.75
2018-05-23,53.65
2018-05-24,54.15
2018-05-25,55.3
2018-05-29,55.1
2018-05-30,54.4
2018-05-31,53.65
2018-06-01,54.6
2018-06-04,56
2018-06-05,57.3
2018-06-06,56.95
2018-06-07,56.3
2018-06-08,56.45
2018-06-11,56.5
2018-06-12,55.3
2018-06-13,54.95
2018-06-14,55.6
2018-06-15,55.05
2018-06-18,55.55
2018-06-19,54.2
2018-06-20,53.7
2018-06-21,53.35
2018-06-22,53.65
2018-06-25,52.75
2018-06-26,53.9
2018-06-27,54.25
2018-06-28,53.95
2018-06-29,54.35
2018-07-02,55.35
2018-07-03,54.85
2018-07-05,55.95
2018-07-06,56.15
2018-07-09,57
2018-07-10,56.75
2018-07-11,55.85
2018-07-12,56.8
2018-07-13,56.2
2018-07-16,56.05
2018-07-17,56.95
2018-07-18,57.35
2018-07-19,57.9
2018-07-20,57.95
2018-07-23,58.1
2018-07-24,58.4
2018-07-25,58.4
2018-07-26,68.45
2018-07-27,69.15
2018-07-30,67.4
2018-07-31,65.1
2018-08-01,66.2
2018-08-02,67.4
2018-08-03,66.7
2018-08-06,67.8
2018-08-07,67.45
2018-08-08,67.45
2018-08-09,67.2
2018-08-10,67.25
2018-08-13,66.95
2018-08-14,67.5
2018-08-15,66.15
2018-08-16,66.25
2018-08-17,66.35
2018-08-20,66.2
2018-08-21,67.6
2018-08-22,67.1
2018-08-23,68.1
2018-08-24,67.25
2018-08-27,68.25
2018-08-28,68.05
2018-08-29,68
2018-08-30,67.95
2018-08-31,68.2
2018-09-04,66.1
2018-09-05,66.3
2018-09-06,65.85
2018-09-07,65.45
2018-09-10,65.65
2018-09-11,64.85
2018-09-12,63.8
2018-09-13,64.25
2018-09-14,64.3
2018-09-17,64.25
2018-09-18,64.1
2018-09-19,62.65
2018-09-20,64.65
2018-09-21,65.6
2018-09-24,64.95
2018-09-25,65.55
2018-09-26,64.6
2018-09-27,64.1
2018-09-28,64.35
2018-10-01,62.87
2018-10-02,62.05
2018-10-03,61.78
2018-10-04,60.38
2018-10-05,59.14
2018-10-08,58.55
2018-10-09,58.23
2018-10-10,55.34
2018-10-11,52.67
2018-10-12,52.38
2018-10-15,53.49
2018-10-16,56.35
2018-10-17,55.39
2018-10-18,52.99
2018-10-19,52.2
2018-10-22,52.93
2018-10-23,51.78
2018-10-24,48.82
2018-10-25,49.56
2018-10-26,50.16
2018-10-29,48.86
2018-10-30,50.39
2018-10-31,50.54
2018-11-01,46.01
2018-11-02,44
2018-11-05,46.65
2018-11-06,47.72
2018-11-07,48.88
2018-11-08,48.88
2018-11-09,46.56
2018-11-12,45.82
2018-11-13,44.83
2018-11-14,44.68
2018-11-15,45.84
2018-11-16,46.15
2018-11-19,45.32
2018-11-20,44.55
2018-11-21,44.88
2018-11-23,45.24
2018-11-26,47.47
2018-11-27,47.21
2018-11-28,49.23
2018-11-29,48.48
2018-11-30,49.72
2018-12-03,50.14
2018-12-04,47.07
2018-12-06,45.69
2018-12-07,43.88
2018-12-10,43.66
2018-12-11,43.68
2018-12-12,44.98
2018-12-13,43.52
2018-12-14,43.83
2018-12-17,43.13
2018-12-18,43.54
2018-12-19,43.56
2018-12-20,42.22
2018-12-21,40
2018-12-24,38.89
2018-12-26,40.6
2018-12-27,40.32
2018-12-28,40.07
2018-12-31,40.64
2019-01-02,41.24
2019-01-03,38.15
2019-01-04,40.75
2019-01-07,41.74
2019-01-08,42.02
2019-01-09,43.47
2019-01-10,44.75
2019-01-11,43.3
2019-01-14,43.52
2019-01-15,44.5
2019-01-16,43.66
2019-01-17,42.65
2019-01-18,42.91
2019-01-22,41.2
2019-01-23,40.51
2019-01-24,41.78
2019-01-25,41.43
2019-01-28,40.37
2019-01-29,40.33
2019-01-30,41.81
2019-01-31,42.52
2019-02-01,43.02
2019-02-04,43.78
2019-02-05,44.22
2019-02-06,44.64
2019-02-07,44.42
2019-02-08,44.41
2019-02-11,43.91
2019-02-12,45.59
2019-02-13,46.02
2019-02-14,46.48
2019-02-15,47.15
2019-02-19,47.92
2019-02-20,43.77
2019-02-21,44.62
2019-02-22,44.39
2019-02-25,45.68
2019-02-26,45.55
2019-02-27,45.58
2019-02-28,45.81
2019-03-01,45.86
2019-03-04,45.72
2019-03-05,46
2019-03-06,45.68
2019-03-07,44.96
2019-03-08,44.46
2019-03-11,45.46
2019-03-12,45.24
2019-03-13,45.15
2019-03-14,45.21
2019-03-15,47.86
2019-03-18,48.06
2019-03-19,47.85
2019-03-20,47.64
2019-03-21,47.64
2019-03-22,43.08
2019-03-25,42.87
2019-03-26,43.1
2019-03-27,43.1
2019-03-28,43.53
2019-03-29,43.91
2019-04-01,44.42
2019-04-02,44.55
2019-04-03,45.9
2019-04-04,46.05
2019-04-05,46.71
2019-04-08,47.13
2019-04-09,55.92
2019-04-10,56.16
2019-04-11,55.13
2019-04-12,55.71
2019-04-15,55.88
2019-04-16,56.82
2019-04-17,56.61
2019-04-18,56.94
2019-04-22,56.44
2019-04-23,57.19
2019-04-24,56.9
2019-04-25,55.75
2019-04-26,55.87
2019-04-29,56.19
2019-04-30,56.25
2019-05-01,55.53
2019-05-02,55
2019-05-03,55.15
2019-05-06,54.45
2019-05-07,53.27
2019-05-08,53.24
2019-05-09,52.62
2019-05-10,52.7
2019-05-13,50.57
2019-05-14,50.62
2019-05-15,50.94
2019-05-16,50.7
2019-05-17,48.58
2019-05-20,47.28
2019-05-21,48.53
2019-05-22,48.02
2019-05-23,46
2019-05-24,46.8
2019-05-28,46.19
2019-05-29,46.4
2019-05-30,46.84
2019-05-31,44.1
2019-06-03,44.05
2019-06-04,45.87
2019-06-05,45.72
2019-06-06,45.69
2019-06-07,46.95
2019-06-10,47.77
2019-06-11,47.22
2019-06-12,46.77
2019-06-13,47.4
2019-06-14,47.115
2019-06-17,48.37
2019-06-18,48.56
2019-06-19,49.49
2019-06-20,49.645
2019-06-21,50.545
2019-06-24,49.385
2019-06-25,49.35
2019-06-26,49.31
2019-06-27,50.015
2019-06-28,52.51
2019-07-01,51.265
2019-07-02,49.55
2019-07-03,49.745
2019-07-04,49.745
2019-07-05,49.3
2019-07-08,48.115
2019-07-09,48.74
2019-07-10,48.6
2019-07-11,48.28
2019-07-12,49.41
2019-07-15,48.515
2019-07-16,47.22
2019-07-17,47.28
2019-07-18,47.01
2019-07-19,48.15
2019-07-22,51.24
2019-07-23,51.08
2019-07-24,51.55
2019-07-25,50.81
2019-07-26,53.015
2019-07-29,53.18
2019-07-30,53.61
2019-07-31,53.5
2019-08-01,52.7
2019-08-02,51.09
2019-08-05,49
2019-08-06,49.87
2019-08-07,49.505
2019-08-08,50.48
2019-08-09,50.13
2019-08-12,49.215
2019-08-13,49.54
2019-08-14,48.73
2019-08-15,48.45
2019-08-16,49.67
2019-08-19,52.14
2019-08-20,50.68
2019-08-21,51.03
2019-08-22,50.9
2019-08-23,48.86
2019-08-26,49.18
2019-08-27,47.99
2019-08-28,48.6
2019-08-29,49.405
2019-08-30,49.23
2019-09-02,49.25
2019-09-03,48.58
2019-09-04,49.07
2019-09-05,51.1
2019-09-06,50.615
2019-09-09,51.595
2019-09-10,53.085
2019-09-11,55.385
2019-09-12,54.97
2019-09-13,54.645
2019-09-16,54.11
2019-09-17,53.72
2019-09-18,52.17
2019-09-19,53.12
2019-09-20,52.48
2019-09-23,51.595
2019-09-24,50.61
2019-09-25,51.73
2019-09-26,49.625
2019-09-27,49.085
2019-09-30,48.42
2019-10-01,47.105
2019-10-02,47.185
2019-10-03,47.2
2019-10-04,47.69
2019-10-07,47.405
2019-10-08,46.6
2019-10-09,46.635
2019-10-10,47.5
2019-10-11,47.85
2019-10-14,47.595
2019-10-15,47.565
2019-10-16,46.91
2019-10-17,47.21
2019-10-18,45.975
2019-10-21,47.065
2019-10-22,46.86
2019-10-23,47.105
2019-10-24,47.17
2019-10-25,45.82
2019-10-28,47.36
2019-10-29,47.49
2019-10-30,46.84
2019-10-31,47.66
2019-11-01,48.79
2019-11-04,50.245
2019-11-05,50.68
2019-11-06,49.975
2019-11-07,50.505
2019-11-08,49.99
2019-11-11,49.58
2019-11-12,49.57
2019-11-13,48.65
2019-11-14,48.445
2019-11-15,48.805
2019-11-18,48.59
2019-11-19,48.885
2019-11-20,48.83
2019-11-21,48.535
2019-11-22,48.78
2019-11-25,50.425
