date,close
2014-06-13,34.21
2014-06-16,34.27
2014-06-17,34.2
2014-06-18,34.49
2014-06-19,34.54
2014-06-20,34.37
2014-06-23,34.35
2014-06-24,34.41
2014-06-25,34.6
2014-06-26,34.35
2014-06-27,35.62
2014-06-30,35.28
2014-07-01,35.96
2014-07-02,35.52
2014-07-03,36.17
2014-07-07,36
2014-07-08,35.7
2014-07-09,35.65
2014-07-10,35.32
2014-07-11,35.52
2014-07-14,35.54
2014-07-15,34.98
2014-07-16,35.04
2014-07-17,35.72
2014-07-18,35.72
2014-07-21,35.04
2014-07-22,35.29
2014-07-23,35.89
2014-07-24,35.48
2014-07-25,35.73
2014-07-28,36.08
2014-07-29,36.06
2014-07-30,35.94
2014-07-31,35.57
2014-08-01,34.98
2014-08-04,35.37
2014-08-05,36.23
2014-08-06,36.01
2014-08-07,35.61
2014-08-08,36.32
2014-08-11,35.87
2014-08-12,36.05
2014-08-13,36.42
2014-08-14,36.4
2014-08-15,36.22
2014-08-18,36.99
2014-08-19,37.1
2014-08-20,36.58
2014-08-21,36.6
2014-08-22,36.16
2014-08-25,36.15
2014-08-26,36.17
2014-08-27,35.91
2014-08-28,35.5
2014-08-29,35.69
2014-09-02,36.1
2014-09-03,36.01
2014-09-04,36.02
2014-09-05,35.96
2014-09-08,36.02
2014-09-09,35.8
2014-09-10,35.69
2014-09-11,35.76
2014-09-12,35.65
2014-09-15,36
2014-09-16,36.32
2014-09-17,35.77
2014-09-18,35.69
2014-09-19,34.54
2014-09-22,34.12
2014-09-23,34.1
2014-09-24,34.27
2014-09-25,34.29
2014-09-26,34.62
2014-09-29,34.81
2014-09-30,34.92
2014-10-01,34.43
2014-10-02,35.08
2014-10-03,35.33
2014-10-06,35.34
2014-10-07,34.62
2014-10-08,35.18
2014-10-09,35.17
2014-10-10,35.32
2014-10-13,35.03
2014-10-14,35.46
2014-10-15,35.62
2014-10-16,34.98
2014-10-17,34.15
2014-10-20,34.18
2014-10-21,34.4
2014-10-22,34.63
2014-10-23,35.44
2014-10-24,36
2014-10-27,36.38
2014-10-28,37.58
2014-10-29,37.66
2014-10-30,37.14
2014-10-31,37.72
2014-11-03,34.74
2014-11-04,35.49
2014-11-05,36.42
2014-11-06,37.09
2014-11-07,36.82
2014-11-10,36.66
2014-11-11,37.1
2014-11-12,37.05
2014-11-13,37.14
2014-11-14,37.13
2014-11-17,37
2014-11-18,37.6
2014-11-19,36.41
2014-11-20,36.68
2014-11-21,37.06
2014-11-24,38.01
2014-11-25,37.38
2014-11-26,37.37
2014-11-28,36.93
2014-12-01,36.76
2014-12-02,37.13
2014-12-03,37.01
2014-12-04,36.69
2014-12-05,37.25
2014-12-08,36.86
2014-12-09,38.25
2014-12-10,37.39
2014-12-11,36.99
2014-12-12,36.66
2014-12-15,36.5
2014-12-16,37.03
2014-12-17,37.96
2014-12-18,38.17
2014-12-19,37.78
2014-12-22,38.57
2014-12-23,37.81
2014-12-24,38.11
2014-12-26,38.41
2014-12-29,38.88
2014-12-30,38.58
2014-12-31,37.42
2015-01-02,36.92
2015-01-05,37.16
2015-01-06,37.13
2015-01-07,37.56
2015-01-08,38.56
2015-01-09,38.35
2015-01-12,38.33
2015-01-13,38.5
2015-01-14,37.89
2015-01-15,37.14
2015-01-16,37.61
2015-01-20,37.39
2015-01-21,36.99
2015-01-22,38.14
2015-01-23,37.76
2015-01-26,37.83
2015-01-27,37.71
2015-01-28,37
2015-01-29,39.52
2015-01-30,39.6
2015-02-02,41.19
2015-02-03,41.25
2015-02-04,41.71
2015-02-05,42.74
2015-02-06,43.03
2015-02-09,42.15
2015-02-10,42.71
2015-02-11,43.34
2015-02-12,43.53
2015-02-13,42.94
2015-02-17,42.5
2015-02-18,43.31
2015-02-19,43.48
2015-02-20,43.63
2015-02-23,44.03
2015-02-24,44.11
2015-02-25,44.14
2015-02-26,45.25
2015-02-27,44.46
2015-03-02,44.28
2015-03-03,44.02
2015-03-04,44.2
2015-03-05,44.48
2015-03-06,43.64
2015-03-09,44.33
2015-03-10,43.66
2015-03-11,43.73
2015-03-12,45.38
2015-03-13,44.47
2015-03-16,43.81
2015-03-17,43.66
2015-03-18,44.16
2015-03-19,44.51
2015-03-20,44.29
2015-03-23,44.82
2015-03-24,44.62
2015-03-25,43.8
2015-03-26,43.44
2015-03-27,44.21
2015-03-30,44.97
2015-03-31,44.92
2015-04-01,44.46
2015-04-02,44.31
2015-04-06,44.35
2015-04-07,44.28
2015-04-08,44.93
2015-04-09,44.67
2015-04-10,44.76
2015-04-13,43.36
2015-04-14,41.75
2015-04-15,41.67
2015-04-16,41.13
2015-04-17,40.83
2015-04-20,42.69
2015-04-21,42.54
2015-04-22,42.33
2015-04-23,42.61
2015-04-24,43.35
2015-04-27,41.68
2015-04-28,41.64
2015-04-29,40.62
2015-04-30,40.53
2015-05-01,40.85
2015-05-04,40.83
2015-05-05,40.11
2015-05-06,40.31
2015-05-07,40.73
2015-05-08,40.68
2015-05-11,41.05
2015-05-12,40.72
2015-05-13,40.95
2015-05-14,41.72
2015-05-15,41.55
2015-05-18,42.01
2015-05-19,41.66
2015-05-20,42.08
2015-05-21,41.7
2015-05-22,41.39
2015-05-26,41.37
2015-05-27,41.59
2015-05-28,41.73
2015-05-29,41.32
2015-06-01,41.89
2015-06-02,42.24
2015-06-03,43.03
2015-06-04,41.99
2015-06-05,42.5
2015-06-08,42.47
2015-06-09,42.65
2015-06-10,43.44
2015-06-11,43.4
2015-06-12,42.84
2015-06-15,42.59
2015-06-16,42.6
2015-06-17,42.45
2015-06-18,42.8
2015-06-19,42.53
2015-06-22,42.36
2015-06-23,42.31
2015-06-24,42.04
2015-06-25,42.11
2015-06-26,42
2015-06-29,41.34
2015-06-30,41.36
2015-07-01,41.05
2015-07-02,40.37
2015-07-06,40.31
2015-07-07,40.03
2015-07-08,39.07
2015-07-09,38.71
2015-07-10,39.22
2015-07-13,39.68
2015-07-14,39.73
2015-07-15,39.53
2015-07-16,39.49
2015-07-17,39.26
2015-07-20,39.13
2015-07-21,39.25
2015-07-22,39.39
2015-07-23,39.12
2015-07-24,38.51
2015-07-27,38.1
2015-07-28,39.07
2015-07-29,39.25
2015-07-30,39.8
2015-07-31,40.01
2015-08-03,39.83
2015-08-04,40.08
2015-08-05,40.2
2015-08-06,39.58
2015-08-07,39.64
2015-08-10,39.59
2015-08-11,39.47
2015-08-12,38.95
2015-08-13,38.82
2015-08-14,39.22
2015-08-17,39.57
2015-08-18,39.45
2015-08-19,38.99
2015-08-20,38.19
2015-08-21,37.42
2015-08-24,36.02
2015-08-25,35.45
2015-08-26,35.98
2015-08-27,36.12
2015-08-28,35.95
2015-08-31,36.11
2015-09-01,35.34
2015-09-02,36.02
2015-09-03,35.99
2015-09-04,35.91
2015-09-08,36.34
2015-09-09,35.82
2015-09-10,35.57
2015-09-11,35.68
2015-09-14,35.17
2015-09-15,35.59
2015-09-16,35.17
2015-09-17,35.17
2015-09-18,34.68
2015-09-21,34.96
2015-09-22,34.9
2015-09-23,34.96
2015-09-24,34.86
2015-09-25,34.35
2015-09-28,33.42
2015-09-29,33.5
2015-09-30,32.32
2015-10-01,33.03
2015-10-02,34.12
2015-10-05,33.38
2015-10-06,32.06
2015-10-07,31.48
2015-10-08,31.82
2015-10-09,32.1
2015-10-12,32.61
2015-10-13,32.32
2015-10-14,32.22
2015-10-15,32.45
2015-10-16,32.24
2015-10-19,32.19
2015-10-20,32
2015-10-21,31.88
2015-10-22,31.51
2015-10-23,32.06
2015-10-26,32.4
2015-10-27,32.66
2015-10-28,33.94
2015-10-29,34.02
2015-10-30,33.78
2015-11-02,34.37
2015-11-03,34.06
2015-11-04,32.67
2015-11-05,32.72
2015-11-06,34
2015-11-09,33.22
2015-11-10,33.01
2015-11-11,33.08
2015-11-12,32.43
2015-11-13,32.33
2015-11-16,32.42
2015-11-17,32.9
2015-11-18,33.17
2015-11-19,33.24
2015-11-20,33.33
2015-11-23,31.91
2015-11-24,31.55
2015-11-25,32.11
2015-11-27,32.36
2015-11-30,32.24
2015-12-01,32.57
2015-12-02,32.57
2015-12-03,32.23
2015-12-04,32.27
2015-12-07,32.24
2015-12-08,32.03
2015-12-09,31.27
2015-12-10,31.62
2015-12-11,31.38
2015-12-14,31.53
2015-12-15,31.59
2015-12-16,31.61
2015-12-17,31.4
2015-12-18,31.1
2015-12-21,30.85
2015-12-22,31.69
2015-12-23,31.87
2015-12-24,31.92
2015-12-28,32.68
2015-12-29,32.93
2015-12-30,32.91
2015-12-31,32.24
2016-01-04,31.25
2016-01-05,31.47
2016-01-06,31.21
2016-01-07,30.88
2016-01-08,30.35
2016-01-11,30.66
2016-01-12,30.85
2016-01-13,30.49
2016-01-14,30.29
2016-01-15,30
2016-01-19,30.42
2016-01-20,30.21
2016-01-21,29.84
2016-01-22,30.17
2016-01-25,30.27
2016-01-26,31.36
2016-01-27,30.99
2016-01-28,30.48
2016-01-29,31.64
2016-02-01,34.49
2016-02-02,33.5
2016-02-03,33.55
2016-02-04,33.52
2016-02-05,32.77
2016-02-08,32.48
2016-02-09,32.04
2016-02-10,31.95
2016-02-11,31.22
2016-02-12,31.82
2016-02-16,31.97
2016-02-17,31.94
2016-02-18,31.97
2016-02-19,32
2016-02-22,31.68
2016-02-23,31.75
2016-02-24,31.65
2016-02-25,32.09
2016-02-26,32.52
2016-02-29,32.08
2016-03-01,32.31
2016-03-02,32.72
2016-03-03,33.04
2016-03-04,33.5
2016-03-07,34
2016-03-08,33.54
2016-03-09,33.52
2016-03-10,33.58
2016-03-11,34.18
2016-03-14,34.24
2016-03-15,33.48
2016-03-16,32.98
2016-03-17,33.36
2016-03-18,33.82
2016-03-21,33.62
2016-03-22,33.68
2016-03-23,33.29
2016-03-24,33.23
2016-03-28,33.73
2016-03-29,34.75
2016-03-30,34.72
2016-03-31,34.98
2016-04-01,35.29
2016-04-04,34.94
2016-04-05,34.26
2016-04-06,34.7
2016-04-07,34.09
2016-04-08,34.06
2016-04-11,34.29
2016-04-12,34.99
2016-04-13,35.32
2016-04-14,35.15
2016-04-15,34.2
2016-04-18,34.1
2016-04-19,33.65
2016-04-20,33.4
2016-04-21,33.4
2016-04-22,33.25
2016-04-25,32.81
2016-04-26,33.17
2016-04-27,33.28
2016-04-28,33.34
2016-04-29,32.43
2016-05-02,27.65
2016-05-03,27.55
2016-05-04,27.79
2016-05-05,28.01
2016-05-06,27.8
2016-05-09,27.3
2016-05-10,27.49
2016-05-11,26.89
2016-05-12,26.58
2016-05-13,26.13
2016-05-16,27.73
2016-05-17,27.3
2016-05-18,27.31
2016-05-19,27.5
2016-05-20,27.63
2016-05-23,27.5
2016-05-24,27.93
2016-05-25,28.09
2016-05-26,27.67
2016-05-27,28
2016-05-31,28
2016-06-01,28.5
2016-06-02,28.65
2016-06-03,28.49
2016-06-06,29.02
2016-06-07,29.08
2016-06-08,29.44
2016-06-09,29.72
2016-06-10,29.58
2016-06-13,29.06
2016-06-14,29.31
2016-06-15,29.49
2016-06-16,29.47
2016-06-17,29.66
2016-06-20,30
2016-06-21,29.86
2016-06-22,29.82
2016-06-23,30.17
2016-06-24,28.76
2016-06-27,28.41
2016-06-28,28.22
2016-06-29,28.8
2016-06-30,28.99
2016-07-01,29.87
2016-07-05,29.58
2016-07-06,29.22
2016-07-07,29.53
2016-07-08,30.22
2016-07-11,30.42
2016-07-12,30.55
2016-07-13,30.42
2016-07-14,30.46
2016-07-15,29.97
2016-07-18,29.89
2016-07-19,29.55
2016-07-20,29.75
2016-07-21,29.76
2016-07-22,29.57
2016-07-25,29.4
2016-07-26,29.61
2016-07-27,30.05
2016-07-28,29.84
2016-07-29,30.32
2016-08-01,33.52
2016-08-02,34.5
2016-08-03,34.26
2016-08-04,34.82
2016-08-05,35.41
2016-08-08,35.35
2016-08-09,35.73
2016-08-10,36
2016-08-11,35.99
2016-08-12,36.25
2016-08-15,35.75
2016-08-16,35.59
2016-08-17,35.3
2016-08-18,35.71
2016-08-19,36.09
2016-08-22,36.13
2016-08-23,36.15
2016-08-24,36.11
2016-08-25,36.04
2016-08-26,36.3
2016-08-29,36.84
2016-08-30,37.13
2016-08-31,37.16
2016-09-01,37.32
2016-09-02,37.8
2016-09-06,37.75
2016-09-07,37.75
2016-09-08,37.43
2016-09-09,36.18
2016-09-12,37.05
2016-09-13,36.17
2016-09-14,36.19
2016-09-15,37.17
2016-09-16,37.39
2016-09-19,37.23
2016-09-20,36.88
2016-09-21,37.16
2016-09-22,37.68
2016-09-23,37.48
2016-09-26,37.02
2016-09-27,36.74
2016-09-28,36.58
2016-09-29,35.71
2016-09-30,36.21
2016-10-03,36.53
2016-10-04,36.38
2016-10-05,36.29
2016-10-06,36.45
2016-10-07,36.55
2016-10-10,36.71
2016-10-11,36.65
2016-10-12,36.44
2016-10-13,36.12
2016-10-14,34.15
2016-10-17,34.47
2016-10-18,34.47
2016-10-19,34.6
2016-10-20,34.66
2016-10-21,34.22
2016-10-24,34.37
2016-10-25,33.72
2016-10-26,33.3
2016-10-27,33.04
2016-10-28,33.14
2016-10-31,33.41
2016-11-01,33.15
2016-11-02,33.11
2016-11-03,33.21
2016-11-04,34.25
2016-11-07,36.84
2016-11-08,37.84
2016-11-09,37.81
2016-11-10,38.54
2016-11-11,38.96
2016-11-14,38.52
2016-11-15,38.87
2016-11-16,39.26
2016-11-17,39.28
2016-11-18,38.95
2016-11-21,38.83
2016-11-22,38.91
2016-11-23,39.46
2016-11-25,39.89
2016-11-28,39.59
2016-11-29,39.61
2016-11-30,39.63
2016-12-01,39.07
2016-12-02,39.68
2016-12-05,39.76
2016-12-06,39.98
2016-12-07,39.91
2016-12-08,40.01
2016-12-09,40.04
2016-12-12,40.37
2016-12-13,40.36
2016-12-14,40.22
2016-12-15,41.04
2016-12-16,40.92
2016-12-19,40.2
2016-12-20,40.99
2016-12-21,40.93
2016-12-22,40.38
2016-12-23,40.62
2016-12-27,40.6
2016-12-28,39.9
2016-12-29,39.97
2016-12-30,40.2
2017-01-03,39.6
2017-01-04,39.89
2017-01-05,39.41
2017-01-06,39.63
2017-01-09,39.96
2017-01-10,40.46
2017-01-11,40.07
2017-01-12,40.03
2017-01-13,40.45
2017-01-17,39.51
2017-01-18,39.52
2017-01-19,40.02
2017-01-20,40.08
2017-01-23,39.7
2017-01-24,39.32
2017-01-25,39.68
2017-01-26,39.23
2017-01-27,39.81
2017-01-30,39.14
2017-01-31,39.86
2017-02-01,40.66
2017-02-02,40.76
2017-02-03,41.34
2017-02-06,38
2017-02-07,37.15
2017-02-08,36.9
2017-02-09,37.39
2017-02-10,37.63
2017-02-13,37.86
2017-02-14,37.91
2017-02-15,37.9
2017-02-16,37.64
2017-02-17,37.75
2017-02-21,38.13
2017-02-22,37.66
2017-02-23,37.5
2017-02-24,37.53
2017-02-27,37.59
2017-02-28,37.33
2017-03-01,38.6
2017-03-02,39.04
2017-03-03,38.76
2017-03-06,38.4
2017-03-07,38.44
2017-03-08,38.32
2017-03-09,38.53
2017-03-10,38.97
2017-03-13,39.62
2017-03-14,38.49
2017-03-15,39.13
2017-03-16,38.95
2017-03-17,39.66
2017-03-20,39.01
2017-03-21,38.76
2017-03-22,38.83
2017-03-23,39.29
2017-03-24,39.59
2017-03-27,39.57
2017-03-28,39.73
2017-03-29,40.43
2017-03-30,40.64
2017-03-31,40.57
2017-04-03,41.05
2017-04-04,40.75
2017-04-05,40.55
2017-04-06,40.62
2017-04-07,40.68
2017-04-10,40.57
2017-04-11,40.9
2017-04-12,40.48
2017-04-13,40.15
2017-04-17,40.62
2017-04-18,40.62
2017-04-19,41
2017-04-20,40.84
2017-04-21,41
2017-04-24,41.85
2017-04-25,42.08
2017-04-26,42.61
2017-04-27,42.06
2017-04-28,41.88
2017-05-01,42.73
2017-05-02,42.85
2017-05-03,42.58
2017-05-04,42.34
2017-05-05,43.2
2017-05-08,42.94
2017-05-09,42.38
2017-05-10,42.3
2017-05-11,41.96
2017-05-12,41.29
2017-05-15,41.71
2017-05-16,41.29
2017-05-17,40.48
2017-05-18,40.3
2017-05-19,40.03
2017-05-22,40.28
2017-05-23,40.13
2017-05-24,40.67
2017-05-25,40.88
2017-05-26,41.2
2017-05-30,41
2017-05-31,40.78
2017-06-01,41.96
2017-06-02,42.45
2017-06-05,41.82
2017-06-06,41.47
2017-06-07,41.49
2017-06-08,41.99
2017-06-09,41.37
2017-06-12,40.59
2017-06-13,41.27
2017-06-14,40.9
2017-06-15,40.64
2017-06-16,40.89
2017-06-19,41.43
2017-06-20,40.59
2017-06-21,40.09
2017-06-22,39.18
2017-06-23,39.31
2017-06-26,39.65
2017-06-27,38.93
2017-06-28,39.18
2017-06-29,39.22
2017-06-30,39.49
2017-07-03,39.93
2017-07-05,39.48
2017-07-06,38.56
2017-07-07,38.99
2017-07-10,38.81
2017-07-11,38.99
2017-07-12,39.33
2017-07-13,40.09
2017-07-14,40.26
2017-07-17,40.25
2017-07-18,39.96
2017-07-19,40.39
2017-07-20,40.4
2017-07-21,39.79
2017-07-24,39.96
2017-07-25,39.9
2017-07-26,39.58
2017-07-27,39.49
2017-07-28,42
2017-07-31,41.13
2017-08-01,40.38
2017-08-02,40.38
2017-08-03,40.76
2017-08-04,41.19
2017-08-07,42.39
2017-08-08,42.92
2017-08-09,42.52
2017-08-10,41.68
2017-08-11,42.5
2017-08-14,42.55
2017-08-15,42.6
2017-08-16,43.06
2017-08-17,41.86
2017-08-18,41.58
2017-08-21,41.42
2017-08-22,41.72
2017-08-23,41.32
2017-08-24,41.66
2017-08-25,41.5
2017-08-28,41.78
2017-08-29,41.45
2017-08-30,41.84
2017-08-31,43.02
2017-09-01,43.61
2017-09-05,43.35
2017-09-06,42.8
2017-09-07,42.44
2017-09-08,42.29
2017-09-11,43.53
2017-09-12,43.03
2017-09-13,43.14
2017-09-14,57.77
2017-09-15,42.29
2017-09-18,42.25
2017-09-19,41.93
2017-09-20,41.83
2017-09-21,42.02
2017-09-22,43.03
2017-09-25,43
2017-09-26,42.92
2017-09-27,43.41
2017-09-28,43.25
2017-09-29,44.87
2017-10-02,46.12
2017-10-03,45.89
2017-10-04,45.75
2017-10-05,46.38
2017-10-06,46.31
2017-10-09,46
2017-10-10,45.77
2017-10-11,46.2
2017-10-12,46.05
2017-10-13,45.62
2017-10-16,45.43
2017-10-17,44.96
2017-10-18,45.58
2017-10-19,45.11
2017-10-20,45.66
2017-10-23,46.1
2017-10-24,46.49
2017-10-25,46.75
2017-10-26,46.93
2017-10-27,47.88
2017-10-30,47.11
2017-10-31,47.56
2017-11-01,46.64
2017-11-02,46.52
2017-11-03,47.12
2017-11-06,46.83
2017-11-07,51.51
2017-11-08,54.22
2017-11-09,54.92
2017-11-10,54.52
2017-11-13,54.6
2017-11-14,54.47
2017-11-15,56.06
2017-11-16,57.32
2017-11-17,57.99
2017-11-20,57.7
2017-11-21,58.99
2017-11-22,58.38
2017-11-24,58.77
2017-11-27,58.51
2017-11-28,58.63
2017-11-29,58.12
2017-11-30,57.8
2017-12-01,57.61
2017-12-04,56.34
2017-12-05,57.36
2017-12-06,57.11
2017-12-07,56.56
2017-12-08,56.48
2017-12-11,56.62
2017-12-12,57.12
2017-12-13,58.17
2017-12-14,57.1
2017-12-15,57.84
2017-12-18,58.34
2017-12-19,57.77
2017-12-20,57.67
2017-12-21,58.52
2017-12-22,58.46
2017-12-26,58.24
2017-12-27,58.26
2017-12-28,58.32
2017-12-29,58.08
2018-01-02,63.1
2018-01-03,62.63
2018-01-04,61.76
2018-01-05,62.7
2018-01-08,62.63
2018-01-09,63.39
2018-01-10,63.83
2018-01-11,64.76
2018-01-12,64.12
2018-01-16,63.94
2018-01-17,65.09
2018-01-18,64.21
2018-01-19,64.39
2018-01-22,65.83
2018-01-23,65.59
2018-01-24,65.51
2018-01-25,66.58
2018-01-26,66.48
2018-01-29,65.92
2018-01-30,65.03
2018-01-31,64.65
2018-02-01,64.59
2018-02-02,63.45
2018-02-05,60.72
2018-02-06,66.4
2018-02-07,69.73
2018-02-08,68.87
2018-02-09,68.7
2018-02-12,68.84
2018-02-13,69.23
2018-02-14,69.62
2018-02-15,70.29
2018-02-16,69.56
2018-02-20,69.09
2018-02-21,68.87
2018-02-22,69.25
2018-02-23,69.99
2018-02-26,71.19
2018-02-27,70.94
2018-02-28,70.9
2018-03-01,70.03
2018-03-02,71.57
2018-03-05,71.36
2018-03-06,72.5
2018-03-07,72.69
2018-03-08,73.15
2018-03-09,73.96
2018-03-12,73.9
2018-03-13,74.41
2018-03-14,74.28
2018-03-15,73.18
2018-03-16,73.58
2018-03-19,72.98
2018-03-20,73.55
2018-03-21,73.75
2018-03-22,73.23
2018-03-23,72.55
2018-03-26,73.98
2018-03-27,72.24
2018-03-28,72.84
2018-03-29,73.16
2018-04-02,72.16
2018-04-03,71.91
2018-04-04,72.09
2018-04-05,72.8
2018-04-06,71.53
2018-04-09,71.93
2018-04-10,73.21
2018-04-11,73.37
2018-04-12,73.32
2018-04-13,73.32
2018-04-16,74.75
2018-04-17,75.3
2018-04-18,75.75
2018-04-19,75.74
2018-04-20,76.08
2018-04-23,76.43
2018-04-24,76.24
2018-04-25,76.69
2018-04-26,78.32
2018-04-27,79.01
2018-04-30,78.04
2018-05-01,76.91
2018-05-02,78.07
2018-05-03,77.99
2018-05-04,79.93
2018-05-07,78.03
2018-05-08,82.55
2018-05-09,82.56
2018-05-10,85.91
2018-05-11,86.75
2018-05-14,87.36
2018-05-15,87.69
2018-05-16,89.04
2018-05-17,89.57
2018-05-18,88.91
2018-05-21,90.92
2018-05-22,89.17
2018-05-23,90.77
2018-05-24,90.38
2018-05-25,90.66
2018-05-29,90.23
2018-05-30,91.43
2018-05-31,90.35
2018-06-01,91.01
2018-06-04,94.2
2018-06-05,95.42
2018-06-06,95.68
2018-06-07,92.79
2018-06-08,94.04
2018-06-11,93.47
2018-06-12,92
2018-06-13,91.75
2018-06-14,95.75
2018-06-15,91.13
2018-06-18,93.61
2018-06-19,92.82
2018-06-20,91.87
2018-06-21,93.53
2018-06-22,93.04
2018-06-25,89.55
2018-06-26,92.12
2018-06-27,88.57
2018-06-28,89.4
2018-06-29,89.68
2018-07-02,89.96
2018-07-03,90.82
2018-07-05,91.68
2018-07-06,93.01
2018-07-09,92.81
2018-07-10,93.02
2018-07-11,93.35
2018-07-12,94.97
2018-07-13,94.55
2018-07-16,94.56
2018-07-17,96.96
2018-07-18,96.96
2018-07-19,98.84
2018-07-20,98.65
2018-07-23,99.73
2018-07-24,99.07
2018-07-25,100.16
2018-07-26,99.65
2018-07-27,98.83
2018-07-30,96.16
2018-07-31,97.64
2018-08-01,96.92
2018-08-02,97.35
2018-08-03,96.71
2018-08-06,97.11
2018-08-07,105.51
2018-08-08,101.77
2018-08-09,99.96
2018-08-10,99.74
2018-08-13,100.11
2018-08-14,103.3
2018-08-15,103.38
2018-08-16,103.32
2018-08-17,103.51
2018-08-20,103.88
2018-08-21,104.9
2018-08-22,106
2018-08-23,106.79
2018-08-24,106.86
2018-08-27,107.79
2018-08-28,109.05
2018-08-29,109.69
2018-08-30,109.4
2018-08-31,111.64
2018-09-04,112.56
2018-09-05,111.11
2018-09-06,111.14
2018-09-07,112.02
2018-09-10,112.06
2018-09-11,111.59
2018-09-12,111.21
2018-09-13,111.86
2018-09-14,114.45
2018-09-17,108.68
2018-09-18,109.78
2018-09-19,109.77
2018-09-20,111.08
2018-09-21,111.57
2018-09-24,112.77
2018-09-25,113.63
2018-09-26,112.96
2018-09-27,113.15
2018-09-28,114.58
2018-10-01,116.63
2018-10-02,113.06
2018-10-03,112.27
2018-10-04,109
2018-10-05,108.71
2018-10-08,109.5
2018-10-09,108
2018-10-10,105.67
2018-10-11,106.4
2018-10-12,106.48
2018-10-15,107.02
2018-10-16,111.34
2018-10-17,110.59
2018-10-18,108.51
2018-10-19,106.31
2018-10-22,107.47
2018-10-23,106.52
2018-10-24,103.71
2018-10-25,102.39
2018-10-26,103.37
2018-10-29,100.62
2018-10-30,104.33
2018-10-31,104.47
2018-11-01,106.8
2018-11-02,105.34
2018-11-05,105.45
2018-11-06,108.81
2018-11-07,115.09
2018-11-08,115.08
2018-11-09,111.61
2018-11-12,105.26
2018-11-13,106.32
2018-11-14,106.31
2018-11-15,108.27
2018-11-16,110.8
2018-11-19,102.85
2018-11-20,102.13
2018-11-21,102.18
2018-11-23,102.14
2018-11-26,104.1
2018-11-27,102.71
2018-11-28,107.18
2018-11-29,106.5
2018-11-30,107.28
2018-12-03,108.4
2018-12-04,104.8
2018-12-06,105.2
2018-12-07,103.17
2018-12-10,104.2
2018-12-11,103.24
2018-12-12,103.8
2018-12-13,102.94
2018-12-14,102.85
2018-12-17,101.45
2018-12-18,101.22
2018-12-19,98.3
2018-12-20,96.16
2018-12-21,92.17
2018-12-24,90.66
2018-12-26,94.53
2018-12-27,94.75
2018-12-28,95.73
2018-12-31,100.05
2019-01-02,97.3
2019-01-03,95.23
2019-01-04,98.72
2019-01-07,98.71
2019-01-08,99.7
2019-01-09,102.12
2019-01-10,101.91
2019-01-11,99.78
2019-01-14,97.58
2019-01-15,98.96
2019-01-16,98.91
2019-01-17,99.57
2019-01-18,100.92
2019-01-22,98.14
2019-01-23,97.49
2019-01-24,97.34
2019-01-25,97.01
2019-01-28,96.35
2019-01-29,95.95
2019-01-30,97.33
2019-01-31,98.91
2019-02-01,96.68
2019-02-04,97.17
2019-02-05,84.61
2019-02-06,85.35
2019-02-07,85.03
2019-02-08,83.25
2019-02-11,84.06
2019-02-12,85.31
2019-02-13,86.01
2019-02-14,86.17
2019-02-15,88
2019-02-19,87.86
2019-02-20,89.01
2019-02-21,88.62
2019-02-22,89.6
2019-02-25,89.48
2019-02-26,87.53
2019-02-27,87.13
2019-02-28,86.87
2019-03-01,88.13
2019-03-04,86.39
2019-03-05,85.71
2019-03-06,84.13
2019-03-07,84.57
2019-03-08,85.89
2019-03-11,87.3
2019-03-12,87.94
2019-03-13,87.3
2019-03-14,86.75
2019-03-15,86.69
2019-03-18,85.09
2019-03-19,86.84
2019-03-20,86.75
2019-03-21,88.14
2019-03-22,84.52
2019-03-25,85.38
2019-03-26,85.7
2019-03-27,85.42
2019-03-28,85.67
2019-03-29,87.48
2019-04-01,89.75
2019-04-02,88.5
2019-04-03,90.54
2019-04-04,88.86
2019-04-05,89.4
2019-04-08,89.43
2019-04-09,88.17
2019-04-10,88.8
2019-04-11,88.63
2019-04-12,87.54
2019-04-15,87.09
2019-04-16,84.91
2019-04-17,81.74
2019-04-18,82.12
2019-04-22,83.29
2019-04-23,85.36
2019-04-24,84.67
2019-04-25,85.18
2019-04-26,86.48
2019-04-29,87.61
2019-04-30,87.28
2019-05-01,89.23
2019-05-02,90.67
2019-05-03,93.42
2019-05-06,93.86
2019-05-07,97.99
2019-05-08,96.5
2019-05-09,96.84
2019-05-10,97.07
2019-05-13,94.49
2019-05-14,99.93
2019-05-15,99.47
2019-05-16,101.79
2019-05-17,100.07
2019-05-20,100.13
2019-05-21,101.17
2019-05-22,102.47
2019-05-23,99.05
2019-05-24,101.01
2019-05-28,98.36
2019-05-29,97.99
2019-05-30,98.06
2019-05-31,96.99
2019-06-03,97.45
2019-06-04,101.03
2019-06-05,103.24
2019-06-06,103.2
2019-06-07,103.72
2019-06-10,107.45
2019-06-11,108.12
2019-06-12,110.07
2019-06-13,111.755
2019-06-14,112.56
2019-06-17,113.1
2019-06-18,113.99
2019-06-19,116.91
2019-06-20,117.95
2019-06-21,117.21
2019-06-24,116.225
2019-06-25,116.89
2019-06-26,116.76
2019-06-27,119.145
2019-06-28,120.09
2019-07-01,120.235
2019-07-02,119.22
2019-07-03,119.75
2019-07-04,119.75
2019-07-05,120.25
2019-07-08,120.6
2019-07-09,120.495
2019-07-10,121.23
2019-07-11,121.03
2019-07-12,122.445
2019-07-15,123.65
2019-07-16,122.84
2019-07-17,121.93
2019-07-18,122.9
2019-07-19,122.06
2019-07-22,122.455
2019-07-23,122.73
2019-07-24,124.815
2019-07-25,122.95
2019-07-26,122.995
2019-07-29,123.74
2019-07-30,123.4
2019-07-31,121.8
2019-08-01,122.46
2019-08-02,121.9
2019-08-05,116.95
2019-08-06,131
2019-08-07,129.59
2019-08-08,133.825
2019-08-09,133.21
2019-08-12,133.36
2019-08-13,137.32
2019-08-14,135.25
2019-08-15,136.28
2019-08-16,138.73
2019-08-19,136.73
2019-08-20,134.86
2019-08-21,135.43
2019-08-22,134.09
2019-08-23,129.775
2019-08-26,133.06
2019-08-27,131.9
2019-08-28,135.115
2019-08-29,133.52
2019-08-30,133.5
2019-09-02,133.57
2019-09-03,131.14
2019-09-04,128.8
2019-09-05,129.9
2019-09-06,127.545
2019-09-09,121.05
2019-09-10,120.935
2019-09-11,123.175
2019-09-12,125.94
2019-09-13,125.3
2019-09-16,126.02
2019-09-17,126.985
2019-09-18,127.955
2019-09-19,128.45
2019-09-20,129.78
2019-09-23,128.51
2019-09-24,126.82
2019-09-25,126.99
2019-09-26,125.92
2019-09-27,124.275
2019-09-30,126.4
2019-10-01,124.35
2019-10-02,123.39
2019-10-03,125.42
2019-10-04,125.865
2019-10-07,124.75
2019-10-08,121.81
2019-10-09,124.67
2019-10-10,125.43
2019-10-11,128.52
2019-10-14,125.77
2019-10-15,126.95
2019-10-16,124.9
2019-10-17,127.575
2019-10-18,127.26
2019-10-21,127.21
2019-10-22,123.46
2019-10-23,120.575
2019-10-24,120.17
2019-10-25,119.405
2019-10-28,123.23
2019-10-29,123.87
2019-10-30,122.58
2019-10-31,120.75
2019-11-01,129.64
2019-11-04,121.05
2019-11-05,121.65
2019-11-06,121.52
2019-11-07,119.54
2019-11-08,119.075
2019-11-11,118.73
2019-11-12,120.705
2019-11-13,119.98
2019-11-14,120.055
2019-11-15,120.415
2019-11-18,118.92
2019-11-19,120.89
2019-11-20,119.79
2019-11-21,119.66
2019-11-22,118.44
2019-11-25,120.425
