date,close
2014-06-13,43.6939
2014-06-16,43.6939
2014-06-17,43.62
2014-06-18,44.211
2014-06-19,44.9866
2014-06-20,45.0235
2014-06-23,44.6542
2014-06-24,44.3218
2014-06-25,44.8145
2014-06-26,44.6657
2014-06-27,44.5541
2014-06-30,44.7773
2014-07-01,45.5583
2014-07-02,45.4467
2014-07-03,45.2979
2014-07-07,44.9632
2014-07-08,44.8145
2014-07-09,45.112
2014-07-10,44.331
2014-07-11,44.4054
2014-07-14,44.926
2014-07-15,45.0748
2014-07-16,45.1492
2014-07-17,44.8516
2014-07-18,45.0748
2014-07-21,45.0004
2014-07-22,45.1492
2014-07-23,45.1864
2014-07-24,44.9632
2014-07-25,45.112
2014-07-28,45.3723
2014-07-29,45.2607
2014-07-30,45.2979
2014-07-31,44.6285
2014-08-01,44.5913
2014-08-04,44.6657
2014-08-05,43.9591
2014-08-06,43.7173
2014-08-07,43.5872
2014-08-08,43.6615
2014-08-11,44.0706
2014-08-12,43.9963
2014-08-13,44.3682
2014-08-14,44.4425
2014-08-15,44.5169
2014-08-18,44.6657
2014-08-19,44.7029
2014-08-20,44.4425
2014-08-21,44.6657
2014-08-22,44.331
2014-08-25,44.4797
2014-08-26,44.2566
2014-08-27,44.0706
2014-08-28,43.9591
2014-08-29,43.8847
2014-09-02,44.331
2014-09-03,44.3682
2014-09-04,44.2194
2014-09-05,44.0335
2014-09-08,43.9963
2014-09-09,43.6244
2014-09-10,44.1078
2014-09-11,43.9963
2014-09-12,43.8475
2014-09-15,43.8847
2014-09-16,43.9591
2014-09-17,43.5872
2014-09-18,43.8475
2014-09-19,43.9219
2014-09-22,43.8847
2014-09-23,43.8103
2014-09-24,44.0706
2014-09-25,43.9591
2014-09-26,43.0665
2014-09-29,44.0335
2014-09-30,43.7731
2014-10-01,43.0665
2014-10-02,42.2483
2014-10-03,42.769
2014-10-06,42.6574
2014-10-07,42.3971
2014-10-08,42.6574
2014-10-09,41.5789
2014-10-10,40.9838
2014-10-13,40.6119
2014-10-14,40.8723
2014-10-15,40.6491
2014-10-16,40.5004
2014-10-17,40.6863
2014-10-20,41.5045
2014-10-21,41.4301
2014-10-22,41.4673
2014-10-23,41.7276
2014-10-24,41.8764
2014-10-27,41.9508
2014-10-28,42.1739
2014-10-29,42.3971
2014-10-30,42.7318
2014-10-31,44.8516
2014-11-03,45.1492
2014-11-04,43.9591
2014-11-05,43.7359
2014-11-06,43.1781
2014-11-07,43.0293
2014-11-10,43.364
2014-11-11,43.6244
2014-11-12,43.4012
2014-11-13,43.7731
2014-11-14,43.7731
2014-11-17,43.0665
2014-11-18,43.6615
2014-11-19,43.4012
2014-11-20,42.9549
2014-11-21,43.2711
2014-11-24,43.364
2014-11-25,43.4756
2014-11-26,43.364
2014-11-28,43.2153
2014-12-01,43.4384
2014-12-02,43.7917
2014-12-03,43.7545
2014-12-04,43.6615
2014-12-05,43.6987
2014-12-08,42.9921
2014-12-09,43.2153
2014-12-10,42.5458
2014-12-11,42.6574
2014-12-12,42.2483
2014-12-15,41.4301
2014-12-16,41.4673
2014-12-17,42.1644
2014-12-18,42.8378
2014-12-19,43.0623
2014-12-22,42.9501
2014-12-23,43.0249
2014-12-24,42.9501
2014-12-26,43.2494
2014-12-29,42.8004
2014-12-30,42.2766
2014-12-31,42.0522
2015-01-02,42.127
2015-01-05,41.6406
2015-01-06,40.9672
2015-01-07,41.5658
2015-01-08,42.0709
2015-01-09,41.6406
2015-01-12,41.491
2015-01-13,41.8277
2015-01-14,41.7529
2015-01-15,42.0522
2015-01-16,42.4263
2015-01-20,42.763
2015-01-21,42.8378
2015-01-22,43.0249
2015-01-23,42.8752
2015-01-26,43.3616
2015-01-27,43.4364
2015-01-28,43.3616
2015-01-29,43.7357
2015-01-30,42.9875
2015-02-02,43.4364
2015-02-03,43.3616
2015-02-04,43.5861
2015-02-05,43.9602
2015-02-06,43.5861
2015-02-09,43.1745
2015-02-10,43.7357
2015-02-11,43.8106
2015-02-12,44.1099
2015-02-13,44.6337
2015-02-17,44.5962
2015-02-18,45.3819
2015-02-19,45.7186
2015-02-20,46.1302
2015-02-23,45.8683
2015-02-24,46.0928
2015-02-25,45.9805
2015-02-26,46.3921
2015-02-27,46.205
2015-03-02,46.3172
2015-03-03,46.0928
2015-03-04,45.8683
2015-03-05,46.1302
2015-03-06,46.0553
2015-03-09,45.9057
2015-03-10,45.2323
2015-03-11,45.6438
2015-03-12,46.6539
2015-03-13,46.6914
2015-03-16,46.8784
2015-03-17,46.9907
2015-03-18,47.7202
2015-03-19,47.1777
2015-03-20,47.926
2015-03-23,48.1505
2015-03-24,48.0382
2015-03-25,47.926
2015-03-26,47.4396
2015-03-27,47.6267
2015-03-30,47.8138
2015-03-31,46.8784
2015-04-01,47.0655
2015-04-02,47.477
2015-04-06,48.0382
2015-04-07,48.2627
2015-04-08,48.3375
2015-04-09,48.3375
2015-04-10,48.4124
2015-04-13,48.0756
2015-04-14,48.3937
2015-04-15,48.6368
2015-04-16,48.7491
2015-04-17,48.3562
2015-04-20,48.5246
2015-04-21,49.2729
2015-04-22,49.647
2015-04-23,49.6096
2015-04-24,49.7966
2015-04-27,49.6844
2015-04-28,49.834
2015-04-29,49.3851
2015-04-30,48.1131
2015-05-01,48.7117
2015-05-04,48.9361
2015-05-05,48.0008
2015-05-06,47.9634
2015-05-07,48.0382
2015-05-08,49.1606
2015-05-11,48.3749
2015-05-12,48.3562
2015-05-13,48.6743
2015-05-14,48.9174
2015-05-15,49.1606
2015-05-18,49.5722
2015-05-19,49.6096
2015-05-20,49.6096
2015-05-21,49.7779
2015-05-22,49.6844
2015-05-26,49.0484
2015-05-27,49.3851
2015-05-28,49.2729
2015-05-29,48.8239
2015-06-01,49.0484
2015-06-02,48.9361
2015-06-03,49.1232
2015-06-04,48.7865
2015-06-05,48.4872
2015-06-08,48.2253
2015-06-09,47.7389
2015-06-10,48.5246
2015-06-11,48.7491
2015-06-12,48.4872
2015-06-15,48.6368
2015-06-16,48.4124
2015-06-17,48.0008
2015-06-18,48.0382
2015-06-19,48.0756
2015-06-22,48.8239
2015-06-23,49.3851
2015-06-24,48.8613
2015-06-25,48.9579
2015-06-26,49.1835
2015-06-29,47.9427
2015-06-30,48.1683
2015-07-01,48.5067
2015-07-02,48.5067
2015-07-06,48.1683
2015-07-07,48.2811
2015-07-08,46.2882
2015-07-09,46.8522
2015-07-10,47.6042
2015-07-13,48.2435
2015-07-14,48.5443
2015-07-15,48.5067
2015-07-16,48.6947
2015-07-17,48.8075
2015-07-20,48.8075
2015-07-21,48.6571
2015-07-22,48.4315
2015-07-23,48.3939
2015-07-24,47.9427
2015-07-27,47.7547
2015-07-28,47.9803
2015-07-29,48.1683
2015-07-30,48.2435
2015-07-31,48.6195
2015-08-03,48.4315
2015-08-04,48.3563
2015-08-05,48.6571
2015-08-06,48.5067
2015-08-07,48.6571
2015-08-10,49.3715
2015-08-11,48.5067
2015-08-12,48.2059
2015-08-13,48.5819
2015-08-14,48.5819
2015-08-17,48.6947
2015-08-18,48.3563
2015-08-19,47.8299
2015-08-20,46.401
2015-08-21,44.8217
2015-08-24,43.2424
2015-08-25,43.5056
2015-08-26,45.2353
2015-08-27,46.0626
2015-08-28,46.2882
2015-08-31,45.5737
2015-09-01,43.5056
2015-09-02,44.2953
2015-09-03,44.6337
2015-09-04,43.2048
2015-09-08,44.2201
2015-09-09,44.1449
2015-09-10,44.1073
2015-09-11,44.1449
2015-09-14,44.032
2015-09-15,44.3705
2015-09-16,44.7465
2015-09-17,44.7089
2015-09-18,43.28
2015-09-21,43.5432
2015-09-22,42.904
2015-09-23,42.904
2015-09-24,42.6032
2015-09-25,43.656
2015-09-28,42.6032
2015-09-29,42.0767
2015-09-30,42.9792
2015-10-01,43.28
2015-10-02,43.8064
2015-10-05,44.8969
2015-10-06,44.5209
2015-10-07,45.2353
2015-10-08,45.3857
2015-10-09,45.4985
2015-10-12,45.5737
2015-10-13,45.0849
2015-10-14,44.5585
2015-10-15,45.6865
2015-10-16,45.9122
2015-10-19,45.6865
2015-10-20,45.4233
2015-10-21,46.025
2015-10-22,46.589
2015-10-23,47.0402
2015-10-26,47.0026
2015-10-27,46.6266
2015-10-28,47.0778
2015-10-29,46.5514
2015-10-30,46.3258
2015-11-02,46.6642
2015-11-03,46.6266
2015-11-04,46.401
2015-11-05,46.7394
2015-11-06,46.6266
2015-11-09,46.4386
2015-11-10,46.9274
2015-11-11,47.1154
2015-11-12,46.6642
2015-11-13,46.4386
2015-11-16,46.8898
2015-11-17,47.0026
2015-11-18,47.2282
2015-11-19,47.2282
2015-11-20,47.4538
2015-11-23,47.2282
2015-11-24,47.4538
2015-11-25,47.153
2015-11-27,46.9274
2015-11-30,46.5514
2015-12-01,47.2658
2015-12-02,46.8898
2015-12-03,46.4386
2015-12-04,46.7018
2015-12-07,46.589
2015-12-08,45.9874
2015-12-09,45.4609
2015-12-10,45.8745
2015-12-11,45.1601
2015-12-14,45.5737
2015-12-15,45.3857
2015-12-16,46.5138
2015-12-17,46.0626
2015-12-18,45.4797
2015-12-21,45.6416
2015-12-22,45.9824
2015-12-23,46.4748
2015-12-24,45.9067
2015-12-28,45.9446
2015-12-29,46.6264
2015-12-30,46.3612
2015-12-31,45.9067
2016-01-04,45.187
2016-01-05,45.7552
2016-01-06,44.9598
2016-01-07,44.278
2016-01-08,43.3311
2016-01-11,43.6341
2016-01-12,43.4068
2016-01-13,43.0281
2016-01-14,43.5583
2016-01-15,42.3273
2016-01-19,42.6872
2016-01-20,41.0585
2016-01-21,40.907
2016-01-22,42.7629
2016-01-25,41.8539
2016-01-26,42.422
2016-01-27,42.4599
2016-01-28,42.5357
2016-01-29,43.5583
2016-02-01,43.2932
2016-02-02,42.8387
2016-02-03,42.3084
2016-02-04,42.1948
2016-02-05,41.4751
2016-02-08,41.3994
2016-02-09,40.6039
2016-02-10,39.8843
2016-02-11,39.0889
2016-02-12,39.4298
2016-02-16,40.8691
2016-02-17,41.21
2016-02-18,41.21
2016-02-19,41.0206
2016-02-22,41.7024
2016-02-23,41.0206
2016-02-24,41.4372
2016-02-25,41.9296
2016-02-26,41.8918
2016-02-29,41.2478
2016-03-01,42.2705
2016-03-02,42.8765
2016-03-03,43.1796
2016-03-04,43.6341
2016-03-07,43.1796
2016-03-08,42.7629
2016-03-09,42.725
2016-03-10,42.5357
2016-03-11,43.672
2016-03-14,43.8613
2016-03-15,43.2932
2016-03-16,43.3689
2016-03-17,43.5205
2016-03-18,43.3689
2016-03-21,43.5583
2016-03-22,43.8235
2016-03-23,43.2553
2016-03-24,42.9902
2016-03-28,43.6341
2016-03-29,44.0886
2016-03-30,43.9371
2016-03-31,43.2174
2016-04-01,42.1569
2016-04-04,42.1569
2016-04-05,41.2478
2016-04-06,41.9296
2016-04-07,41.7024
2016-04-08,42.9144
2016-04-11,42.6493
2016-04-12,43.6341
2016-04-13,44.8461
2016-04-14,45.0355
2016-04-15,44.6189
2016-04-18,44.9598
2016-04-19,45.6416
2016-04-20,45.9067
2016-04-21,45.9067
2016-04-22,46.2476
2016-04-25,45.9446
2016-04-26,45.7552
2016-04-27,45.7173
2016-04-28,43.6341
2016-04-29,43.2553
2016-05-02,44.0507
2016-05-03,43.6341
2016-05-04,43.2553
2016-05-05,43.4826
2016-05-06,43.7098
2016-05-09,43.672
2016-05-10,44.7704
2016-05-11,43.9371
2016-05-12,44.278
2016-05-13,43.672
2016-05-16,44.278
2016-05-17,43.975
2016-05-18,44.0129
2016-05-19,43.7098
2016-05-20,44.0129
2016-05-23,43.8235
2016-05-24,44.1454
2016-05-25,44.4674
2016-05-26,44.4295
2016-05-27,44.2969
2016-05-31,44.6568
2016-06-01,44.6189
2016-06-02,44.2401
2016-06-03,44.4295
2016-06-06,44.884
2016-06-07,45.187
2016-06-08,45.4522
2016-06-09,44.9219
2016-06-10,44.1265
2016-06-13,43.3311
2016-06-14,43.1417
2016-06-15,43.5583
2016-06-16,43.3689
2016-06-17,43.2932
2016-06-20,44.278
2016-06-21,44.5497
2016-06-22,44.168
2016-06-23,45.1605
2016-06-24,43.29
2016-06-27,43.0609
2016-06-28,43.7099
2016-06-29,44.2825
2016-06-30,43.9008
2016-07-01,43.8244
2016-07-05,43.8244
2016-07-06,43.8244
2016-07-07,43.8626
2016-07-08,44.168
2016-07-11,45.2369
2016-07-12,45.5041
2016-07-13,45.4277
2016-07-14,45.5041
2016-07-15,45.3514
2016-07-18,45.4659
2016-07-19,45.1605
2016-07-20,45.5423
2016-07-21,45.1987
2016-07-22,45.275
2016-07-25,45.1223
2016-07-26,45.1605
2016-07-27,45.2369
2016-07-28,45.2369
2016-07-29,46.0385
2016-08-01,46.1912
2016-08-02,45.6186
2016-08-03,45.3896
2016-08-04,46.0385
2016-08-05,46.1912
2016-08-08,46.3821
2016-08-09,46.802
2016-08-10,46.9547
2016-08-11,47.2983
2016-08-12,47.0692
2016-08-15,47.3365
2016-08-16,46.9165
2016-08-17,47.2983
2016-08-18,47.0692
2016-08-19,46.9547
2016-08-22,47.2219
2016-08-23,47.2601
2016-08-24,47.2219
2016-08-25,46.9929
2016-08-26,46.6493
2016-08-29,46.802
2016-08-30,46.802
2016-08-31,46.8784
2016-09-01,47.2219
2016-09-02,47.5655
2016-09-06,47.8327
2016-09-07,48.0618
2016-09-08,47.8327
2016-09-09,47.0692
2016-09-12,47.451
2016-09-13,46.6112
2016-09-14,46.3058
2016-09-15,46.5348
2016-09-16,46.1531
2016-09-19,46.3058
2016-09-20,46.9547
2016-09-21,48.329
2016-09-22,48.9398
2016-09-23,48.2527
2016-09-26,47.8327
2016-09-27,48.3672
2016-09-28,48.2908
2016-09-29,47.9473
2016-09-30,47.8709
2016-10-03,47.7182
2016-10-04,47.451
2016-10-05,47.7564
2016-10-06,47.5273
2016-10-07,47.5273
2016-10-10,47.68
2016-10-11,47.2601
2016-10-12,47.1838
2016-10-13,47.1074
2016-10-14,47.1074
2016-10-17,47.1456
2016-10-18,47.4128
2016-10-19,47.5655
2016-10-20,47.9854
2016-10-21,47.9854
2016-10-24,48.0618
2016-10-25,48.1
2016-10-26,48.0236
2016-10-27,48.1
2016-10-28,48.1763
2016-10-31,48.2145
2016-11-01,48.0236
2016-11-02,47.7182
2016-11-03,47.8327
2016-11-04,47.2601
2016-11-07,47.5941
2016-11-08,47.5369
2016-11-09,47.1361
2016-11-10,47.1742
2016-11-11,47.241
2016-11-14,47.2983
2016-11-15,47.3746
2016-11-16,47.1456
2016-11-17,47.8518
2016-11-18,47.1361
2016-11-21,47.5178
2016-11-22,47.6323
2016-11-23,47.6323
2016-11-25,47.2315
2016-11-28,47.6419
2016-11-29,47.6896
2016-11-30,47.6132
2016-12-01,47.2124
2016-12-02,47.3556
2016-12-05,47.2983
2016-12-06,47.5083
2016-12-07,48.2145
2016-12-08,48.768
2016-12-09,48.9112
2016-12-12,48.434
2016-12-13,49.0066
2016-12-14,48.2527
2016-12-15,48.2527
2016-12-16,47.8327
2016-12-19,48.2431
2016-12-20,48.2908
2016-12-21,48.0335
2016-12-22,47.9563
2016-12-23,48.0432
2016-12-27,47.7439
2016-12-28,47.6763
2016-12-29,47.1936
2016-12-30,47.1743
2017-01-03,47.5605
2017-01-04,48.5163
2017-01-05,48.7963
2017-01-06,48.7191
2017-01-09,48.7673
2017-01-10,48.5839
2017-01-11,48.9025
2017-01-12,48.8253
2017-01-13,49.1342
2017-01-17,48.5839
2017-01-18,48.5742
2017-01-19,48.4391
2017-01-20,48.748
2017-01-23,48.777
2017-01-24,48.9025
2017-01-25,49.4142
2017-01-26,49.4818
2017-01-27,49.0763
2017-01-30,48.9411
2017-01-31,48.8253
2017-02-01,49.0859
2017-02-02,49.0666
2017-02-03,49.2887
2017-02-06,49.2115
2017-02-07,49.1825
2017-02-08,49.3273
2017-02-09,49.2597
2017-02-10,49.6073
2017-02-13,49.8004
2017-02-14,49.4432
2017-02-15,49.3949
2017-02-16,49.4528
2017-02-17,49.4239
2017-02-21,49.839
2017-02-22,49.897
2017-02-23,49.8487
2017-02-24,49.7425
2017-02-27,49.588
2017-02-28,49.4625
2017-03-01,50.0418
2017-03-02,49.5687
2017-03-03,49.5977
2017-03-06,49.4818
2017-03-07,49.3659
2017-03-08,49.2115
2017-03-09,49.2115
2017-03-10,49.5687
2017-03-13,49.8197
2017-03-14,49.4721
2017-03-15,49.9742
2017-03-16,49.8776
2017-03-17,50.0418
2017-03-20,50.058
2017-03-21,49.6652
2017-03-22,49.7328
2017-03-23,49.7714
2017-03-24,50.0804
2017-03-27,50.1094
2017-03-28,50.5342
2017-03-29,50.4666
2017-03-30,50.1866
2017-03-31,49.7232
2017-04-03,49.9742
2017-04-04,49.8004
2017-04-05,49.4528
2017-04-06,49.2018
2017-04-07,49.308
2017-04-10,49.1921
2017-04-11,49.4432
2017-04-12,49.279
2017-04-13,48.8639
2017-04-17,49.3852
2017-04-18,49.2308
2017-04-19,49.2018
2017-04-20,49.5011
2017-04-21,49.6845
2017-04-24,50.0321
2017-04-25,50.2156
2017-04-26,50.2735
2017-04-27,50.3121
2017-04-28,50.0707
2017-05-01,50.2638
2017-05-02,50.4183
2017-05-03,50.5438
2017-05-04,50.6694
2017-05-05,50.9494
2017-05-08,50.9687
2017-05-09,50.8045
2017-05-10,50.5728
2017-05-11,50.4376
2017-05-12,50.5632
2017-05-15,50.708
2017-05-16,50.7466
2017-05-17,50.6694
2017-05-18,50.8045
2017-05-19,51.2197
2017-05-22,51.1907
2017-05-23,51.2583
2017-05-24,51.1811
2017-05-25,51.3162
2017-05-26,51.3452
2017-05-30,51.4514
2017-05-31,51.4514
2017-06-01,51.9148
2017-06-02,53.0059
2017-06-05,52.8031
2017-06-06,52.8417
2017-06-07,52.8224
2017-06-08,52.6969
2017-06-09,52.2238
2017-06-12,52.3879
2017-06-13,52.6776
2017-06-14,52.6486
2017-06-15,52.1369
2017-06-16,52.3493
2017-06-19,52.5135
2017-06-20,52.5312
2017-06-21,52.4535
2017-06-22,52.5604
2017-06-23,52.5215
2017-06-26,52.3757
2017-06-27,52.2494
2017-06-28,52.4826
2017-06-29,51.9579
2017-06-30,52.1328
2017-07-03,51.8801
2017-07-05,51.8899
2017-07-06,51.5109
2017-07-07,51.4817
2017-07-10,51.3457
2017-07-11,51.6955
2017-07-12,52.0551
2017-07-13,51.987
2017-07-14,52.1134
2017-07-17,52.0453
2017-07-18,52.3174
2017-07-19,52.5312
2017-07-20,52.7255
2017-07-21,52.8227
2017-07-24,52.7158
2017-07-25,52.5312
2017-07-26,52.7061
2017-07-27,52.881
2017-07-28,53.0365
2017-07-31,53.2114
2017-08-01,53.5807
2017-08-02,53.4932
2017-08-03,53.6292
2017-08-04,53.5807
2017-08-07,53.5612
2017-08-08,53.5029
2017-08-09,53.1725
2017-08-10,52.6187
2017-08-11,52.5409
2017-08-14,52.9296
2017-08-15,52.8616
2017-08-16,53.0365
2017-08-17,52.677
2017-08-18,52.9102
2017-08-21,52.7936
2017-08-22,52.9005
2017-08-23,52.9199
2017-08-24,52.6478
2017-08-25,52.8227
2017-08-28,52.881
2017-08-29,52.7741
2017-08-30,52.745
2017-08-31,53.1628
2017-09-01,52.949
2017-09-05,52.7158
2017-09-06,52.9393
2017-09-07,53.2503
2017-09-08,53.4155
2017-09-11,53.6584
2017-09-12,53.6973
2017-09-13,53.5904
2017-09-14,53.6001
2017-09-15,53.6778
2017-09-18,53.6875
2017-09-19,53.9985
2017-09-20,54.0179
2017-09-21,53.8042
2017-09-22,53.8625
2017-09-25,53.9791
2017-09-26,53.9791
2017-09-27,54.086
2017-09-28,54.1248
2017-09-29,54.1345
2017-10-02,54.1345
2017-10-03,54.4552
2017-10-04,54.4649
2017-10-05,54.4358
2017-10-06,54.4066
2017-10-09,54.4746
2017-10-10,54.8633
2017-10-11,55.1451
2017-10-12,55.0771
2017-10-13,55.7573
2017-10-16,56.01
2017-10-17,55.9517
2017-10-18,55.8934
2017-10-19,55.767
2017-10-20,55.8934
2017-10-23,56.0294
2017-10-24,56.4958
2017-10-25,56.0391
2017-10-26,56.3403
2017-10-27,56.7679
2017-10-30,56.7485
2017-10-31,56.9914
2017-11-01,57.3121
2017-11-02,57.3801
2017-11-03,57.5161
2017-11-06,57.5064
2017-11-07,57.9631
2017-11-08,58.3227
2017-11-09,57.8368
2017-11-10,57.4092
2017-11-13,57.1566
2017-11-14,56.8554
2017-11-15,56.4375
2017-11-16,57.3121
2017-11-17,57.0303
2017-11-20,57.3121
2017-11-21,57.8368
2017-11-22,57.8757
2017-11-24,58.3518
2017-11-27,58.0992
2017-11-28,58.2741
2017-11-29,58.1575
2017-11-30,58.2158
2017-12-01,57.9534
2017-12-04,57.3412
2017-12-05,57.487
2017-12-06,57.2732
2017-12-07,57.6424
2017-12-08,57.9145
2017-12-11,58.1089
2017-12-12,58.2158
2017-12-13,58.449
2017-12-14,58.1769
2017-12-15,58.206
2017-12-18,58.9057
2017-12-19,58.6952
2017-12-20,58.774
2017-12-21,58.8133
2017-12-22,59.089
2017-12-26,59.1186
2017-12-27,59.0398
2017-12-28,58.902
2017-12-29,59.0103
2018-01-02,59.3647
2018-01-03,60.182
2018-01-04,60.9205
2018-01-05,61.0879
2018-01-08,61.4424
2018-01-09,61.4818
2018-01-10,61.8756
2018-01-11,62.2892
2018-01-12,62.4861
2018-01-16,62.4861
2018-01-17,62.9883
2018-01-18,62.4566
2018-01-19,62.8504
2018-01-22,63.1163
2018-01-23,63.5003
2018-01-24,63.52
2018-01-25,63.2147
2018-01-26,63.6775
2018-01-29,63.136
2018-01-30,62.3286
2018-01-31,61.9741
2018-02-01,62.2793
2018-02-02,61.3636
2018-02-05,58.4589
2018-02-06,59.8768
2018-02-07,59.3451
2018-02-08,57.5825
2018-02-09,58.1635
2018-02-12,59.2958
2018-02-13,58.5672
2018-02-14,59.4534
2018-02-15,59.7389
2018-02-16,60.6546
2018-02-20,60.1623
2018-02-21,59.5617
2018-02-22,59.8374
2018-02-23,60.7137
2018-02-26,61.5014
2018-02-27,60.6645
2018-02-28,60.1328
2018-03-01,58.3899
2018-03-02,59.0497
2018-03-05,59.3155
2018-03-06,59.6798
2018-03-07,59.1777
2018-03-08,59.542
2018-03-09,59.6897
2018-03-12,59.7488
2018-03-13,59.6503
2018-03-14,59.9063
2018-03-15,60.0245
2018-03-16,59.7586
2018-03-19,58.7444
2018-03-20,59.0792
2018-03-21,59.158
2018-03-22,58.6164
2018-03-23,57.3856
2018-03-26,58.2029
2018-03-27,58.3407
2018-03-28,59.0004
2018-03-29,59.7488
2018-04-02,58.5475
2018-04-03,59.286
2018-04-04,59.3451
2018-04-05,59.6405
2018-04-06,58.705
2018-04-09,59.2269
2018-04-10,59.5518
2018-04-11,59.4041
2018-04-12,59.3057
2018-04-13,59.3057
2018-04-16,59.4731
2018-04-17,59.6995
2018-04-18,60.1032
2018-04-19,59.8768
2018-04-20,59.7586
2018-04-23,59.6798
2018-04-24,59.4632
2018-04-25,59.6503
2018-04-26,60.0146
2018-04-27,59.8472
2018-04-30,59.7094
2018-05-01,59.6601
2018-05-02,59.3057
2018-05-03,59.3647
2018-05-04,59.798
2018-05-07,59.8669
2018-05-08,60.054
2018-05-09,59.542
2018-05-10,59.8866
2018-05-11,60.3396
2018-05-14,60.6743
2018-05-15,60.054
2018-05-16,60.2312
2018-05-17,60.2214
2018-05-18,60.0737
2018-05-21,60.1426
2018-05-22,60.0048
2018-05-23,59.7685
2018-05-24,59.4041
2018-05-25,59.2072
2018-05-29,58.8133
2018-05-30,59.2269
2018-05-31,58.8232
2018-06-01,59.2269
2018-06-04,59.5814
2018-06-05,59.4731
2018-06-06,59.7291
2018-06-07,59.7291
2018-06-08,59.9063
2018-06-11,60.0934
2018-06-12,59.7192
2018-06-13,59.7685
2018-06-14,59.7094
2018-06-15,59.3943
2018-06-18,58.961
2018-06-19,58.3363
2018-06-20,58.3562
2018-06-21,58.1379
2018-06-22,58.4256
2018-06-25,57.6318
2018-06-26,57.9692
2018-06-27,57.5822
2018-06-28,57.6516
2018-06-29,57.4631
2018-07-02,56.5502
2018-07-03,56.4807
2018-07-05,56.3914
2018-07-06,56.7586
2018-07-09,57.5425
2018-07-10,57.3242
2018-07-11,56.5304
2018-07-12,56.5899
2018-07-13,57.1158
2018-07-16,57.1357
2018-07-17,57.6417
2018-07-18,57.5524
2018-07-19,57.5623
2018-07-20,57.7409
2018-07-23,58.0287
2018-07-24,58.2669
2018-07-25,58.6439
2018-07-26,58.7928
2018-07-27,58.9714
2018-07-30,58.5249
2018-07-31,58.0783
2018-08-01,58.4554
2018-08-02,58.1279
2018-08-03,58.118
2018-08-06,57.6814
2018-08-07,58.1676
2018-08-08,58.1081
2018-08-09,57.8898
2018-08-10,57.0563
2018-08-13,56.7189
2018-08-14,56.9471
2018-08-15,56.2525
2018-08-16,56.5601
2018-08-17,56.7487
2018-08-20,56.9769
2018-08-21,56.967
2018-08-22,57.2051
2018-08-23,56.967
2018-08-24,57.1654
2018-08-27,58.0287
2018-08-28,57.8501
2018-08-29,58.0585
2018-08-30,57.6516
2018-08-31,57.7707
2018-09-04,57.0563
2018-09-05,56.451
2018-09-06,56.58
2018-09-07,56.2327
2018-09-10,56.3617
2018-09-11,56.4807
2018-09-12,56.5899
2018-09-13,57.0265
2018-09-14,57.6715
2018-09-17,57.7013
2018-09-18,59.0805
2018-09-19,59.2889
2018-09-20,59.4477
2018-09-21,59.5767
2018-09-24,59.3088
2018-09-25,59.7553
2018-09-26,60.043
2018-09-27,59.8843
2018-09-28,59.7652
2018-10-01,60.172
2018-10-02,60.0331
2018-10-03,59.5072
2018-10-04,58.7035
2018-10-05,58.7134
2018-10-08,58.9714
2018-10-09,58.634
2018-10-10,57.1952
2018-10-11,56.1632
2018-10-12,56.2922
2018-10-15,56.1235
2018-10-16,57.1654
2018-10-17,57.1257
2018-10-18,56.0938
2018-10-19,56.2128
2018-10-22,55.8655
2018-10-23,55.2205
2018-10-24,53.4543
2018-10-25,54.2481
2018-10-26,53.5535
2018-10-29,53.0574
2018-10-30,53.8909
2018-10-31,54.4168
2018-11-01,54.2878
2018-11-02,54.5954
2018-11-05,54.397
2018-11-06,55.0122
2018-11-07,55.5877
2018-11-08,55.2305
2018-11-09,54.6748
2018-11-12,53.9306
2018-11-13,53.7321
2018-11-14,53.9207
2018-11-15,54.2382
2018-11-16,54.2779
2018-11-19,54.0397
2018-11-20,53.0474
2018-11-21,53.8611
2018-11-23,53.6627
2018-11-26,54.387
2018-11-27,54.3374
2018-11-28,55.0519
2018-11-29,54.8633
2018-11-30,54.9129
2018-12-03,55.6572
2018-12-04,53.6031
2018-12-06,53.5237
2018-12-07,53.1268
2018-12-10,52.72
2018-12-11,52.6803
2018-12-12,53.3154
2018-12-13,53.1566
2018-12-14,52.5513
2018-12-17,52.1345
2018-12-18,52.28
2018-12-19,51.51
2018-12-20,51.24
2018-12-21,49.66
2018-12-24,49.12
2018-12-26,50.05
2018-12-27,50.72
2018-12-28,50.78
2018-12-31,50.69
2019-01-02,51.04
2019-01-03,50.75
2019-01-04,52.47
2019-01-07,52.6
2019-01-08,52.85
2019-01-09,53.14
2019-01-10,53.46
2019-01-11,52.84
2019-01-14,52.65
2019-01-15,53.29
2019-01-16,53.55
2019-01-17,53.44
2019-01-18,54.15
2019-01-22,53.18
2019-01-23,53.03
2019-01-24,53.34
2019-01-25,53.92
2019-01-28,53.53
2019-01-29,53.58
2019-01-30,54.18
2019-01-31,54.28
2019-02-01,54.06
2019-02-04,54.18
2019-02-05,54.4
2019-02-06,53.95
2019-02-07,53.2
2019-02-08,52.73
2019-02-11,52.78
2019-02-12,53.71
2019-02-13,53.84
2019-02-14,53.8
2019-02-15,54.49
2019-02-19,54.58
2019-02-20,54.64
2019-02-21,54.56
2019-02-22,54.68
2019-02-25,54.99
2019-02-26,55.18
2019-02-27,54.89
2019-02-28,54.36
2019-03-01,54.52
2019-03-04,54.35
2019-03-05,54.4
2019-03-06,54.08
2019-03-07,53.44
2019-03-08,53.35
2019-03-11,53.93
2019-03-12,54.06
2019-03-13,54.27
2019-03-14,53.69
2019-03-15,54.31
2019-03-18,54.46
2019-03-19,54.48
2019-03-20,54.51
2019-03-21,54.87
2019-03-22,54.28
2019-03-25,54.31
2019-03-26,54.91
2019-03-27,54.72
2019-03-28,54.75
2019-03-29,54.72
2019-04-01,55.41
2019-04-02,55.03
2019-04-03,55.36
2019-04-04,55.33
2019-04-05,55.37
2019-04-08,55.24
2019-04-09,54.94
2019-04-10,54.95
2019-04-11,54.78
2019-04-12,55.06
2019-04-15,55.05
2019-04-16,55.27
2019-04-17,55.27
2019-04-18,55.35
2019-04-22,55.15
2019-04-23,55.46
2019-04-24,54.78
2019-04-25,54.9
2019-04-26,55.4
2019-04-29,55.62
2019-04-30,55.42
2019-05-01,55.23
2019-05-02,55.25
2019-05-03,55.96
2019-05-06,55.39
2019-05-07,54.38
2019-05-08,54.05
2019-05-09,53.7
2019-05-10,54.07
2019-05-13,52.85
2019-05-14,53.59
2019-05-15,53.67
2019-05-16,53.89
2019-05-17,53.69
2019-05-20,53.4
2019-05-21,53.77
2019-05-22,53.33
2019-05-23,52.93
2019-05-24,53.75
2019-05-28,53.3
2019-05-29,53.05
2019-05-30,53.29
2019-05-31,52.72
2019-06-03,53.03
2019-06-04,53.64
2019-06-05,53.67
2019-06-06,53.73
2019-06-07,54.38
2019-06-10,54.63
2019-06-11,54.81
2019-06-12,54.2
2019-06-13,54.12
2019-06-14,54.04
2019-06-17,53.65
2019-06-18,53.975
2019-06-19,54.45
2019-06-20,54.98
2019-06-21,54.575
2019-06-24,54.415
2019-06-25,54.3
2019-06-26,54.15
2019-06-27,54.405
2019-06-28,54.55
2019-07-01,55.345
2019-07-02,55.52
2019-07-03,55.715
2019-07-04,55.715
2019-07-05,55.42
2019-07-08,55.095
2019-07-09,54.63
2019-07-10,55
2019-07-11,55.04
2019-07-12,55.1
2019-07-15,55.095
2019-07-16,54.735
2019-07-17,54.705
2019-07-18,54.485
2019-07-19,54.705
2019-07-22,54.725
2019-07-23,55.175
2019-07-24,55.27
2019-07-25,54.675
2019-07-26,54.815
2019-07-29,54.755
2019-07-30,54.355
2019-07-31,54.28
2019-08-01,54.315
2019-08-02,54.04
2019-08-05,52.78
2019-08-06,53.385
2019-08-07,53.77
2019-08-08,54.115
2019-08-09,53.595
2019-08-12,53.07
2019-08-13,53.58
2019-08-14,52.405
2019-08-15,52.915
2019-08-16,53.435
2019-08-19,53.43
2019-08-20,53.285
2019-08-21,53.48
2019-08-22,53.43
2019-08-23,52.78
2019-08-26,53.54
2019-08-27,53.43
2019-08-28,53.4
2019-08-29,53.71
2019-08-30,53.955
2019-09-02,53.945
2019-09-03,53.945
2019-09-04,54.28
2019-09-05,54.645
2019-09-06,54.805
2019-09-09,55.16
2019-09-10,55.27
2019-09-11,55.815
2019-09-12,56.24
2019-09-13,56.885
2019-09-16,56.555
2019-09-17,56.75
2019-09-18,56.635
2019-09-19,57.04
2019-09-20,56.97
2019-09-23,56.855
2019-09-24,57.015
2019-09-25,57.19
2019-09-26,57.255
2019-09-27,56.485
2019-09-30,56.685
2019-10-01,56.48
2019-10-02,55.735
2019-10-03,56.03
2019-10-04,56.72
2019-10-07,56.435
2019-10-08,56.04
2019-10-09,56.495
2019-10-10,56.44
2019-10-11,57.2
2019-10-14,56.925
2019-10-15,57.84
2019-10-16,57.625
2019-10-17,57.45
2019-10-18,57.395
2019-10-21,57.815
2019-10-22,57.845
2019-10-23,58.085
2019-10-24,58.135
2019-10-25,58.125
2019-10-28,58.265
2019-10-29,58.505
2019-10-30,58.645
2019-10-31,58.6
2019-11-01,59.255
2019-11-04,59.645
2019-11-05,59.685
2019-11-06,59.635
2019-11-07,59.97
2019-11-08,59.895
2019-11-11,59.745
2019-11-12,59.875
2019-11-13,59.67
2019-11-14,59.425
2019-11-15,59.745
2019-11-18,59.795
2019-11-19,59.62
2019-11-20,59.445
2019-11-21,59.485
2019-11-22,59.56
2019-11-25,59.97
