date,close
2014-06-13,47.8026
2014-06-16,47.8933
2014-06-17,48.2
2014-06-18,48.1303
2014-06-19,48.0466
2014-06-20,48.7995
2014-06-23,49.0157
2014-06-24,48.4092
2014-06-25,48.6601
2014-06-26,48.7717
2014-06-27,49.4758
2014-06-30,50.64
2014-07-01,50.9398
2014-07-02,51.0583
2014-07-03,52.0203
2014-07-07,51.6055
2014-07-08,51.6508
2014-07-09,52.1876
2014-07-10,52.09
2014-07-11,52.0133
2014-07-14,52.2155
2014-07-15,51.7484
2014-07-16,51.6717
2014-07-17,51.5951
2014-07-18,51.9367
2014-07-21,52.0203
2014-07-22,51.9506
2014-07-23,51.0722
2014-07-24,50.9049
2014-07-25,49.915
2014-07-28,50.0753
2014-07-29,49.7755
2014-07-30,50.1171
2014-07-31,49.8383
2014-08-01,49.9366
2014-08-04,50.3123
2014-08-05,49.915
2014-08-06,50.1102
2014-08-07,49.9359
2014-08-08,50.4308
2014-08-11,50.6121
2014-08-12,50.7655
2014-08-13,50.8422
2014-08-14,51.2704
2014-08-15,51.9934
2014-08-18,52.2039
2014-08-19,52.6181
2014-08-20,52.4356
2014-08-21,52.7444
2014-08-22,52.6321
2014-08-25,53.0042
2014-08-26,53.3271
2014-08-27,53.6464
2014-08-28,53.5798
2014-08-29,53.6429
2014-09-02,54.1554
2014-09-03,54.5555
2014-09-04,54.4712
2014-09-05,54.9696
2014-09-08,55.2083
2014-09-09,55.1521
2014-09-10,55.2223
2014-09-11,55.2013
2014-09-12,54.9486
2014-09-15,54.2817
2014-09-16,54.9486
2014-09-17,55.8541
2014-09-18,56.7596
2014-09-19,56.6964
2014-09-22,56.2191
2014-09-23,56.1559
2014-09-24,56.5209
2014-09-25,55.826
2014-09-26,56.198
2014-09-29,56.0471
2014-09-30,55.2995
2014-10-01,53.7272
2014-10-02,53.8044
2014-10-03,53.5236
2014-10-06,53.3481
2014-10-07,53.0042
2014-10-08,53.2358
2014-10-09,51.6985
2014-10-10,47.7817
2014-10-13,46.0549
2014-10-14,46.6234
2014-10-15,47.3535
2014-10-16,47.894
2014-10-17,48.0414
2014-10-20,48.8276
2014-10-21,50.1051
2014-10-22,49.347
2014-10-23,49.8384
2014-10-24,53.2779
2014-10-27,52.6883
2014-10-28,53.4183
2014-10-29,53.5587
2014-10-30,53.6008
2014-10-31,55.5593
2014-11-03,56.1208
2014-11-04,56.177
2014-11-05,57.0544
2014-11-06,56.7385
2014-11-07,56.1559
2014-11-10,56.5139
2014-11-11,56.2893
2014-11-12,55.9664
2014-11-13,56.1147
2014-11-14,56.7434
2014-11-17,55.818
2014-11-18,57.0118
2014-11-19,57.2237
2014-11-20,57.0012
2014-11-21,57.5805
2014-11-24,59.131
2014-11-25,59.463
2014-11-26,59.1599
2014-11-28,61.0093
2014-12-01,60.4997
2014-12-02,60.4822
2014-12-03,62.3975
2014-12-04,61.7912
2014-12-05,62.0812
2014-12-08,61.1147
2014-12-09,61.3959
2014-12-10,60.7369
2014-12-11,60.7545
2014-12-12,60.2976
2014-12-15,59.1818
2014-12-16,58.6195
2014-12-17,59.5245
2014-12-18,61.1323
2014-12-19,61.2553
2014-12-22,63.3991
2014-12-23,63.812
2014-12-24,63.2761
2014-12-26,63.1267
2014-12-29,62.9422
2014-12-30,62.5468
2014-12-31,61.7825
2015-01-02,61.7561
2015-01-05,60.3767
2015-01-06,58.5932
2015-01-07,59.5684
2015-01-08,60.5612
2015-01-09,60.7721
2015-01-12,58.9446
2015-01-13,57.9782
2015-01-14,57.5916
2015-01-15,58.7513
2015-01-16,59.5992
2015-01-20,60.5437
2015-01-21,60.9829
2015-01-22,62.336
2015-01-23,57.3192
2015-01-26,57.4949
2015-01-27,55.6499
2015-01-28,55.1403
2015-01-29,55.6938
2015-01-30,54.0069
2015-02-02,54.354
2015-02-03,55.7641
2015-02-04,55.4874
2015-02-05,55.5884
2015-02-06,55.0085
2015-02-09,54.6571
2015-02-10,56.0628
2015-02-11,56.1946
2015-02-12,56.5577
2015-02-13,56.354
2015-02-17,56.6108
2015-02-18,56.9296
2015-02-19,57.2572
2015-02-20,57.5317
2015-02-23,57.0934
2015-02-24,58.6918
2015-02-25,58.3376
2015-02-26,58.0099
2015-02-27,57.5185
2015-03-02,58.1782
2015-03-03,56.5798
2015-03-04,55.9201
2015-03-05,55.1054
2015-03-06,54.0694
2015-03-09,54.3439
2015-03-10,53.2636
2015-03-11,53.3787
2015-03-12,53.4938
2015-03-13,53.7595
2015-03-16,54.8309
2015-03-17,54.3483
2015-03-18,54.7158
2015-03-19,55.1054
2015-03-20,56.2655
2015-03-23,56.0264
2015-03-24,55.7607
2015-03-25,52.5729
2015-03-26,51.7405
2015-03-27,52.2452
2015-03-30,52.6039
2015-03-31,51.6165
2015-04-01,51.1383
2015-04-02,51.4394
2015-04-06,51.4837
2015-04-07,51.1472
2015-04-08,51.404
2015-04-09,52.1921
2015-04-10,52.3515
2015-04-13,52.2452
2015-04-14,52.564
2015-04-15,53.1662
2015-04-16,52.5374
2015-04-17,51.3553
2015-04-20,51.8556
2015-04-21,52.5463
2015-04-22,53.3964
2015-04-23,52.9979
2015-04-24,52.1478
2015-04-27,52.6703
2015-04-28,52.9271
2015-04-29,52.4755
2015-04-30,52.0681
2015-05-01,53.206
2015-05-04,53.3831
2015-05-05,51.7936
2015-05-06,51.5899
2015-05-07,52.1213
2015-05-08,52.9536
2015-05-11,52.7854
2015-05-12,52.0061
2015-05-13,52.139
2015-05-14,53.0053
2015-05-15,53.5054
2015-05-18,53.3447
2015-05-19,52.7641
2015-05-20,52.7641
2015-05-21,52.8356
2015-05-22,52.7954
2015-05-26,52.0229
2015-05-27,53.5679
2015-05-28,53.8269
2015-05-29,53.2821
2015-06-01,53.3982
2015-06-02,53.0053
2015-06-03,52.3712
2015-06-04,51.1298
2015-06-05,50.8797
2015-06-08,49.9866
2015-06-09,49.7008
2015-06-10,50.1563
2015-06-11,50.4421
2015-06-12,49.9152
2015-06-15,50.3974
2015-06-16,51.0851
2015-06-17,51.0226
2015-06-18,51.9827
2015-06-19,51.7907
2015-06-22,51.9871
2015-06-23,51.1566
2015-06-24,51.0941
2015-06-25,51.2102
2015-06-26,51.036
2015-06-29,49.7946
2015-06-30,50.201
2015-07-01,50.719
2015-07-02,51.1387
2015-07-06,50.1697
2015-07-07,50.1027
2015-07-08,48.9417
2015-07-09,48.8792
2015-07-10,49.2185
2015-07-13,50.2992
2015-07-14,49.683
2015-07-15,48.906
2015-07-16,46.959
2015-07-17,46.3785
2015-07-20,46.5303
2015-07-21,46.2803
2015-07-22,46.1463
2015-07-23,47.1912
2015-07-24,45.7712
2015-07-27,45.5836
2015-07-28,46.3696
2015-07-29,46.2088
2015-07-30,46.4946
2015-07-31,47.3788
2015-08-03,46.9233
2015-08-04,46.3071
2015-08-05,47.0126
2015-08-06,46.3964
2015-08-07,46.7536
2015-08-10,48.3612
2015-08-11,47.343
2015-08-12,47.5842
2015-08-13,46.4658
2015-08-14,46.1772
2015-08-17,46.7454
2015-08-18,45.2663
2015-08-19,45.104
2015-08-20,43.688
2015-08-21,43.0206
2015-08-24,42.3622
2015-08-25,41.776
2015-08-26,43.3904
2015-08-27,44.7252
2015-08-28,44.9957
2015-08-31,45.1942
2015-09-01,43.3182
2015-09-02,43.8864
2015-09-03,44.0397
2015-09-04,42.8763
2015-09-08,44.9146
2015-09-09,44.5087
2015-09-10,46.4298
2015-09-11,46.1862
2015-09-14,47.0611
2015-09-15,47.4219
2015-09-16,47.972
2015-09-17,46.2764
2015-09-18,45.4737
2015-09-21,44.3734
2015-09-22,44.5538
2015-09-23,43.1829
2015-09-24,43.4715
2015-09-25,43.8413
2015-09-28,43.7331
2015-09-29,43.4535
2015-09-30,45.0949
2015-10-01,44.7342
2015-10-02,45.4828
2015-10-05,46.6552
2015-10-06,47.3226
2015-10-07,47.503
2015-10-08,48.0622
2015-10-09,47.972
2015-10-12,47.6383
2015-10-13,46.529
2015-10-14,47.4309
2015-10-15,47.485
2015-10-16,47.7736
2015-10-19,47.9089
2015-10-20,48.5763
2015-10-21,57.7035
2015-10-22,58.5332
2015-10-23,58.9391
2015-10-26,58.885
2015-10-27,58.9301
2015-10-28,59.354
2015-10-29,59.8139
2015-10-30,60.5355
2015-11-02,60.0214
2015-11-03,59.9763
2015-11-04,60.2739
2015-11-05,60.4272
2015-11-06,60.2919
2015-11-09,60.3551
2015-11-10,60.2108
2015-11-11,60.337
2015-11-12,59.8644
2015-11-13,59.7008
2015-11-16,60.3098
2015-11-17,60.6188
2015-11-18,60.9915
2015-11-19,60.8097
2015-11-20,60.9188
2015-11-23,60.5916
2015-11-24,60.4098
2015-11-25,60.328
2015-11-27,60.4825
2015-11-30,60.4189
2015-12-01,61.7187
2015-12-02,61.5551
2015-12-03,60.5461
2015-12-04,61.4187
2015-12-07,61.3369
2015-12-08,62.4731
2015-12-09,61.4278
2015-12-10,62.255
2015-12-11,61.6914
2015-12-14,61.4733
2015-12-15,62.6095
2015-12-16,62.7867
2015-12-17,61.855
2015-12-18,60.7734
2015-12-21,62.1459
2015-12-22,62.7913
2015-12-23,62.9458
2015-12-24,63.1821
2015-12-28,63.0821
2015-12-29,63.5366
2015-12-30,63.3457
2015-12-31,63.0367
2016-01-04,62.4368
2016-01-05,62.4822
2016-01-06,60.5189
2016-01-07,59.9371
2016-01-08,59.3008
2016-01-11,59.5463
2016-01-12,59.7644
2016-01-13,58.8827
2016-01-14,60.5916
2016-01-15,58.6737
2016-01-19,58.4646
2016-01-20,59.1372
2016-01-21,58.7464
2016-01-22,59.1645
2016-01-25,58.7645
2016-01-26,59.2099
2016-01-27,58.5646
2016-01-28,59.4917
2016-01-29,60.8915
2016-02-01,61.0097
2016-02-02,60.1371
2016-02-03,60.7188
2016-02-04,60.7915
2016-02-05,59.5463
2016-02-08,58.301
2016-02-09,58.1374
2016-02-10,58.2919
2016-02-11,57.6229
2016-02-12,58.4569
2016-02-16,59.3274
2016-02-17,60.0881
2016-02-18,59.4282
2016-02-19,60.198
2016-02-22,60.6104
2016-02-23,60.1889
2016-02-24,60.7937
2016-02-25,61.8109
2016-02-26,62.2874
2016-02-29,62.0766
2016-03-01,63.213
2016-03-02,62.6998
2016-03-03,62.9564
2016-03-04,62.599
2016-03-07,63.0847
2016-03-08,62.0675
2016-03-09,62.3699
2016-03-10,62.9564
2016-03-11,63.4329
2016-03-14,63.7445
2016-03-15,63.8544
2016-03-16,64.2851
2016-03-17,64.9358
2016-03-18,65.229
2016-03-21,65.3023
2016-03-22,65.4673
2016-03-23,65.0641
2016-03-24,64.8808
2016-03-28,64.9358
2016-03-29,66.3104
2016-03-30,66.4937
2016-03-31,66.7228
2016-04-01,66.9427
2016-04-04,66.7411
2016-04-05,66.3195
2016-04-06,66.6586
2016-04-07,66.0813
2016-04-08,66.0446
2016-04-11,66.1363
2016-04-12,66.1179
2016-04-13,66.8052
2016-04-14,66.4295
2016-04-15,66.4662
2016-04-18,66.6678
2016-04-19,67.0068
2016-04-20,66.8694
2016-04-21,65.9713
2016-04-22,65.8888
2016-04-25,65.6047
2016-04-26,65.8338
2016-04-27,66.1912
2016-04-28,64.8991
2016-04-29,64.0927
2016-05-02,64.2118
2016-05-03,63.8086
2016-05-04,63.3229
2016-05-05,63.5887
2016-05-06,63.5612
2016-05-09,63.3596
2016-05-10,64.0102
2016-05-11,63.8728
2016-05-12,63.5404
2016-05-13,63.3373
2016-05-16,62.691
2016-05-17,62.571
2016-05-18,62.9772
2016-05-19,62.6725
2016-05-20,64.2513
2016-05-23,64.3991
2016-05-24,65.5439
2016-05-25,66.2272
2016-05-26,66.4026
2016-05-27,67.3905
2016-05-31,67.3351
2016-06-01,67.5198
2016-06-02,67.649
2016-06-03,67.4921
2016-06-06,67.1597
2016-06-07,67.3628
2016-06-08,67.5659
2016-06-09,67.7783
2016-06-10,67.0951
2016-06-13,66.9473
2016-06-14,67.0581
2016-06-15,67.3166
2016-06-16,67.2058
2016-06-17,67.4274
2016-06-20,67.9999
2016-06-21,68.1938
2016-06-22,68.6
2016-06-23,69.1078
2016-06-24,66.9843
2016-06-27,65.8025
2016-06-28,66.4672
2016-06-29,66.5503
2016-06-30,67.6306
2016-07-01,66.9381
2016-07-05,66.578
2016-07-06,66.7165
2016-07-07,66.698
2016-07-08,68.0922
2016-07-11,68.6739
2016-07-12,69.5602
2016-07-13,69.7541
2016-07-14,69.4494
2016-07-15,69.3663
2016-07-18,70.105
2016-07-19,70.1234
2016-07-20,70.7882
2016-07-21,69.9295
2016-07-22,70.225
2016-07-25,70.622
2016-07-26,71.0836
2016-07-27,71.0929
2016-07-28,71.5084
2016-07-29,69.9018
2016-08-01,70.7051
2016-08-02,69.9111
2016-08-03,70.2527
2016-08-04,70.9082
2016-08-05,71.6745
2016-08-08,71.1113
2016-08-09,71.4714
2016-08-10,64.1405
2016-08-11,62.801
2016-08-12,63.5173
2016-08-15,64.5964
2016-08-16,64.3638
2016-08-17,64.7824
2016-08-18,64.8661
2016-08-19,66.001
2016-08-22,65.601
2016-08-23,63.3033
2016-08-24,62.4847
2016-08-25,62.6056
2016-08-26,62.8103
2016-08-29,63.9359
2016-08-30,63.5917
2016-08-31,64.4289
2016-09-01,65.8057
2016-09-02,65.3033
2016-09-06,65.6196
2016-09-07,65.8615
2016-09-08,65.5452
2016-09-09,64.587
2016-09-12,65.694
2016-09-13,64.2149
2016-09-14,64.094
2016-09-15,65.3592
2016-09-16,65.3312
2016-09-19,64.8289
2016-09-20,64.3545
2016-09-21,64.9219
2016-09-22,64.6615
2016-09-23,64.4847
2016-09-26,64.187
2016-09-27,65.1173
2016-09-28,64.9778
2016-09-29,63.9731
2016-09-30,64.8475
2016-10-03,65.4987
2016-10-04,65.3964
2016-10-05,66.2429
2016-10-06,66.7824
2016-10-07,67.601
2016-10-10,68.4104
2016-10-11,67.3406
2016-10-12,67.0708
2016-10-13,66.3638
2016-10-14,66.9499
2016-10-17,66.9685
2016-10-18,67.0615
2016-10-19,66.922
2016-10-20,66.9685
2016-10-21,68.5034
2016-10-24,69.3592
2016-10-25,69.6755
2016-10-26,70.0383
2016-10-27,69.5081
2016-10-28,69.4522
2016-10-31,69.8709
2016-11-01,68.7452
2016-11-02,69.5174
2016-11-03,69.4708
2016-11-04,69.322
2016-11-07,70.2709
2016-11-08,70.2616
2016-11-09,70.2243
2016-11-10,69.8121
2016-11-11,70.7022
2016-11-14,70.7209
2016-11-15,72.8478
2016-11-16,72.8009
2016-11-17,74.0658
2016-11-18,74.9934
2016-11-21,75.8554
2016-11-22,77.8042
2016-11-23,76.6705
2016-11-25,77.0828
2016-11-28,77.3077
2016-11-29,76.53
2016-11-30,74.806
2016-12-01,71.1425
2016-12-02,71.4517
2016-12-05,72.1732
2016-12-06,73.1945
2016-12-07,74.2626
2016-12-08,73.8784
2016-12-09,72.3418
2016-12-12,72.4449
2016-12-13,73.0539
2016-12-14,72.904
2016-12-15,74.3563
2016-12-16,73.26
2016-12-19,74.3656
2016-12-20,73.9065
2016-12-21,74.0002
2016-12-22,74.1595
2016-12-23,74.1314
2016-12-27,74.9747
2016-12-28,74.731
2016-12-29,74.2907
2016-12-30,73.7191
2017-01-03,74.4031
2017-01-04,74.1408
2017-01-05,73.4755
2017-01-06,74.1408
2017-01-09,74.5718
2017-01-10,74.3282
2017-01-11,75.2089
2017-01-12,75.0496
2017-01-13,76.3051
2017-01-17,74.9559
2017-01-18,76.4831
2017-01-19,76.0334
2017-01-20,76.4176
2017-01-23,76.9235
2017-01-24,77.5794
2017-01-25,79.3315
2017-01-26,78.001
2017-01-27,80.7275
2017-01-30,80.8118
2017-01-31,79.7437
2017-02-01,80.6151
2017-02-02,81.8519
2017-02-03,82.0674
2017-02-06,81.5146
2017-02-07,82.1329
2017-02-08,81.3928
2017-02-09,81.271
2017-02-10,81.1773
2017-02-13,82.2332
2017-02-14,82.0164
2017-02-15,82.6669
2017-02-16,83.4683
2017-02-17,83.4024
2017-02-21,85.2786
2017-02-22,85.1089
2017-02-23,84.76
2017-02-24,85.1277
2017-02-27,85.0617
2017-02-28,84.9674
2017-03-01,86.212
2017-03-02,85.5426
2017-03-03,85.2503
2017-03-06,85.6274
2017-03-07,85.8348
2017-03-08,86.3157
2017-03-09,86.542
2017-03-10,87.8713
2017-03-13,87.5508
2017-03-14,87.5602
2017-03-15,88.2579
2017-03-16,88.8142
2017-03-17,89.2762
2017-03-20,89.6816
2017-03-21,88.8047
2017-03-22,90.1058
2017-03-23,89.7853
2017-03-24,90.2473
2017-03-27,90.3227
2017-03-28,90.1813
2017-03-29,89.9927
2017-03-30,90.1718
2017-03-31,89.6344
2017-04-03,90.483
2017-04-04,90.945
2017-04-05,90.2567
2017-04-06,90.6715
2017-04-07,91.0204
2017-04-10,90.8224
2017-04-11,90.0398
2017-04-12,89.7664
2017-04-13,89.8796
2017-04-17,90.0398
2017-04-18,89.1913
2017-04-19,92.0103
2017-04-20,92.8777
2017-04-21,92.7458
2017-04-24,95.0651
2017-04-25,95.8948
2017-04-26,95.0368
2017-04-27,97.6673
2017-04-28,92.6043
2017-05-01,93.5
2017-05-02,94.0186
2017-05-03,93.764
2017-05-04,95.0462
2017-05-05,95.1688
2017-05-08,94.754
2017-05-09,95.0462
2017-05-10,94.9991
2017-05-11,95.037
2017-05-12,94.8285
2017-05-15,95.9754
2017-05-16,96.9992
2017-05-17,94.6768
2017-05-18,95.5963
2017-05-19,96.4778
2017-05-22,97.3594
2017-05-23,97.1508
2017-05-24,97.8997
2017-05-25,99.3879
2017-05-26,99.2836
2017-05-30,99.094
2017-05-31,98.5822
2017-06-01,99.2931
2017-06-02,100.3642
2017-06-05,100.8571
2017-06-06,102.1842
2017-06-07,103.0089
2017-06-08,103.2553
2017-06-09,96.6674
2017-06-12,95.8712
2017-06-13,96.1366
2017-06-14,93.4161
2017-06-15,92.0132
2017-06-16,92.6104
2017-06-19,95.7574
2017-06-20,92.4966
2017-06-21,92.9042
2017-06-22,91.634
2017-06-23,92.8473
2017-06-26,91.0179
2017-06-27,88.9799
2017-06-28,90.7525
2017-06-29,87.6907
2017-06-30,86.7428
2017-07-03,86.7807
2017-07-05,87.4822
2017-07-06,87.6623
2017-07-07,89.6434
2017-07-10,90.6482
2017-07-11,91.8805
2017-07-12,92.6104
2017-07-13,92.5156
2017-07-14,94.4493
2017-07-17,93.9659
2017-07-18,94.6294
2017-07-19,96.1081
2017-07-20,96.402
2017-07-21,94.6863
2017-07-24,94.9896
2017-07-25,93.9564
2017-07-26,95.6057
2017-07-27,94.7242
2017-07-28,89.4823
2017-07-31,87.8045
2017-08-01,87.8045
2017-08-02,85.321
2017-08-03,84.3257
2017-08-04,84.2024
2017-08-07,87.2168
2017-08-08,85.9561
2017-08-09,86.7144
2017-08-10,83.5484
2017-08-11,86.2109
2017-08-14,87.3179
2017-08-15,86.8598
2017-08-16,87.6805
2017-08-17,85.6669
2017-08-18,86.1345
2017-08-21,84.9417
2017-08-22,87.5087
2017-08-23,87.2701
2017-08-24,86.1727
2017-08-25,86.3445
2017-08-28,87.356
2017-08-29,88.1672
2017-08-30,89.2551
2017-08-31,89.4078
2017-09-01,89.7799
2017-09-05,89.3791
2017-09-06,90.1807
2017-09-07,90.9633
2017-09-08,90.0376
2017-09-11,92.7287
2017-09-12,93.473
2017-09-13,92.3183
2017-09-14,93.0054
2017-09-15,94.1315
2017-09-18,96.2978
2017-09-19,97.3475
2017-09-20,95.1049
2017-09-21,94.9713
2017-09-22,95.9924
2017-09-25,94.4846
2017-09-26,94.6373
2017-09-27,99.4087
2017-09-28,100.1245
2017-09-29,101.1551
2017-10-02,100.1531
2017-10-03,98.1395
2017-10-04,98.2922
2017-10-05,97.023
2017-10-06,97.7865
2017-10-09,99.1988
2017-10-10,99.676
2017-10-11,99.8096
2017-10-12,100.029
2017-10-13,100.4871
2017-10-16,102.4243
2017-10-17,103.0732
2017-10-18,103.1496
2017-10-19,103.1114
2017-10-20,103.3882
2017-10-23,102.8728
2017-10-24,102.7679
2017-10-25,101.8327
2017-10-26,103.8748
2017-10-27,103.1305
2017-10-30,102.4434
2017-10-31,103.913
2017-11-01,100.344
2017-11-02,101.5177
2017-11-03,101.4414
2017-11-06,100.6875
2017-11-07,102.5865
2017-11-08,102.1857
2017-11-09,97.7197
2017-11-10,97.7578
2017-11-13,97.2711
2017-11-14,98.0486
2017-11-15,98.8165
2017-11-16,100.5634
2017-11-17,97.5687
2017-11-20,98.3941
2017-11-21,100.525
2017-11-22,100.2754
2017-11-24,100.8225
2017-11-27,100.1986
2017-11-28,102.8574
2017-11-29,96.3209
2017-11-30,98.135
2017-12-01,99.6995
2017-12-04,96.8296
2017-12-05,98.5189
2017-12-06,98.6149
2017-12-07,100.381
2017-12-08,99.8051
2017-12-11,99.6803
2017-12-12,98.922
2017-12-13,99.6995
2017-12-14,100.2274
2017-12-15,101.3889
2017-12-18,106.7544
2017-12-19,107.1384
2017-12-20,107.935
2017-12-21,104.2588
2017-12-22,104.9307
2017-12-26,103.3278
2017-12-27,102.9726
2017-12-28,103.5197
2017-12-29,100.8513
2018-01-02,101.8688
2018-01-03,103.059
2018-01-04,103.2414
2018-01-05,105.449
2018-01-08,105.737
2018-01-09,104.8155
2018-01-10,102.0128
2018-01-11,101.9744
2018-01-12,102.9822
2018-01-16,103.3374
2018-01-17,108.9333
2018-01-18,110.0467
2018-01-19,110.4018
2018-01-22,109.9891
2018-01-23,111.3521
2018-01-24,110.3155
2018-01-25,108.5493
2018-01-26,108.8853
2018-01-29,107.6279
2018-01-30,105.0171
2018-01-31,105.3914
2018-02-01,106.6872
2018-02-02,102.2431
2018-02-05,97.1367
2018-02-06,101.0049
2018-02-07,98.5381
2018-02-08,94.5835
2018-02-09,96.8488
2018-02-12,99.7379
2018-02-13,100.0259
2018-02-14,103.7424
2018-02-15,105.0938
2018-02-16,103.7906
2018-02-20,106.7155
2018-02-21,105.8661
2018-02-22,105.1324
2018-02-23,106.6383
2018-02-26,110.6926
2018-02-27,109.5246
2018-02-28,109.3798
2018-03-01,107.3526
2018-03-02,109.0902
2018-03-05,109.8818
2018-03-06,112.0441
2018-03-07,113.3762
2018-03-08,112.9418
2018-03-09,116.9479
2018-03-12,118.1449
2018-03-13,116.3011
2018-03-14,116.2625
2018-03-15,116.6197
2018-03-16,116.4363
2018-03-19,111.9572
2018-03-20,113.1252
2018-03-21,113.9651
2018-03-22,109.0033
2018-03-23,104.4277
2018-03-26,109.4281
2018-03-27,104.0706
2018-03-28,102.8736
2018-03-29,105.229
2018-04-02,101.6766
2018-04-03,103.8389
2018-04-04,105.4606
2018-04-05,104.9394
2018-04-06,100.4603
2018-04-09,100.19
2018-04-10,104.8042
2018-04-11,102.9412
2018-04-12,105.3351
2018-04-13,103.8582
2018-04-16,105.0745
2018-04-17,106.7831
2018-04-18,104.4857
2018-04-19,98.742
2018-04-20,97.9601
2018-04-23,97.4968
2018-04-24,96.1067
2018-04-25,95.2283
2018-04-26,97.3327
2018-04-27,98.6359
2018-04-30,98.2111
2018-05-01,98.7807
2018-05-02,98.6262
2018-05-03,99.4178
2018-05-04,102.9605
2018-05-07,103.0087
2018-05-08,103.1921
2018-05-09,105.3834
2018-05-10,107.2078
2018-05-11,107.2175
2018-05-14,109.5597
2018-05-15,108.199
2018-05-16,110.4732
2018-05-17,110.0553
2018-05-18,106.3136
2018-05-21,108.3059
2018-05-22,110.4246
2018-05-23,110.1136
2018-05-24,110.3372
2018-05-25,111.105
2018-05-29,110.4538
2018-05-30,110.8037
2018-05-31,110.0456
2018-06-01,112.5822
2018-06-04,112.971
2018-06-05,114.8078
2018-06-06,114.1275
2018-06-07,112.6697
2018-06-08,110.9883
2018-06-11,109.307
2018-06-12,110.3955
2018-06-13,109.7832
2018-06-14,109.9484
2018-06-15,109.6666
2018-06-18,108.8988
2018-06-19,107.4701
2018-06-20,106.6829
2018-06-21,107.2077
2018-06-22,103.5632
2018-06-25,101.2112
2018-06-26,101.6486
2018-06-27,97.8097
2018-06-28,98.9468
2018-06-29,99.6465
2018-07-02,100.8808
2018-07-03,98.7427
2018-07-05,100.5212
2018-07-06,101.9207
2018-07-09,102.9801
2018-07-10,103.0773
2018-07-11,100.356
2018-07-12,101.6097
2018-07-13,101.911
2018-07-16,101.2307
2018-07-17,102.912
2018-07-18,107.13
2018-07-19,105.4389
2018-07-20,103.9131
2018-07-23,103.9325
2018-07-24,101.0266
2018-07-25,101.5028
2018-07-26,102.2706
2018-07-27,104.5448
2018-07-30,103.3105
2018-07-31,114.1178
2018-08-01,113.4277
2018-08-02,115.1382
2018-08-03,116.2267
2018-08-06,114.9439
2018-08-07,114.837
2018-08-08,114.8467
2018-08-09,113.4861
2018-08-10,111.0175
2018-08-13,112.8835
2018-08-14,112.8052
2018-08-15,110.2913
2018-08-16,109.7924
2018-08-17,109.9489
2018-08-20,108.5109
2018-08-21,110.8195
2018-08-22,111.5238
2018-08-23,111.4455
2018-08-24,112.9226
2018-08-27,114.9181
2018-08-28,114.8007
2018-08-29,114.1845
2018-08-30,114.204
2018-08-31,113.6758
2018-09-04,115.6126
2018-09-05,116.2387
2018-09-06,104.9405
2018-09-07,101.9081
2018-09-10,103.3852
2018-09-11,103.3167
2018-09-12,100.6561
2018-09-13,101.8886
2018-09-14,102.1918
2018-09-17,101.018
2018-09-18,101.331
2018-09-19,100.2159
2018-09-20,101.6538
2018-09-21,102.2407
2018-09-24,102.1038
2018-09-25,100.1278
2018-09-26,98.3866
2018-09-27,98.7095
2018-09-28,99.492
2018-10-01,98.5627
2018-10-02,98.7681
2018-10-03,100.568
2018-10-04,99.1399
2018-10-05,97.1737
2018-10-08,97.0563
2018-10-09,96.9878
2018-10-10,91.8034
2018-10-11,89.7688
2018-10-12,91.1578
2018-10-15,89.1036
2018-10-16,90.9328
2018-10-17,91.7741
2018-10-18,89.3481
2018-10-19,88.8297
2018-10-22,88.3113
2018-10-23,88.5167
2018-10-24,84.1246
2018-10-25,87.0885
2018-10-26,85.3082
2018-10-29,83.2736
2018-10-30,89.6025
2018-10-31,89.5438
2018-11-01,92.8501
2018-11-02,91.2556
2018-11-05,90.4926
2018-11-06,92.9772
2018-11-07,94.4054
2018-11-08,94.9336
2018-11-09,93.2022
2018-11-12,90.2774
2018-11-13,91.3828
2018-11-14,90.3068
2018-11-15,93.1372
2018-11-16,95.5633
2018-11-19,91.0563
2018-11-20,93.1766
2018-11-21,93.4331
2018-11-23,93.009
2018-11-26,94.508
2018-11-27,95.0011
2018-11-28,97.368
2018-11-29,95.3562
2018-11-30,97.2004
2018-12-03,99.7546
2018-12-04,94.5968
2018-12-06,94.2417
2018-12-07,90.9182
2018-12-10,91.007
2018-12-11,91.4508
2018-12-12,92.2496
2018-12-13,91.4015
2018-12-14,88.2752
2018-12-17,87.7131
2018-12-18,88.7782
2018-12-19,85.7407
2018-12-20,84.715
2018-12-21,84.4882
2018-12-24,80.1094
2018-12-26,84.8629
2018-12-27,87.0819
2018-12-28,87.4073
2018-12-31,88.2555
2019-01-02,89.6559
2019-01-03,84.6262
2019-01-04,90.0405
2019-01-07,91.3226
2019-01-08,89.8729
2019-01-09,92.1904
2019-01-10,92.4173
2019-01-11,92.7328
2019-01-14,91.1549
2019-01-15,91.2437
2019-01-16,89.7052
2019-01-17,91.6382
2019-01-18,94.4094
2019-01-22,91.9242
2019-01-23,90.5829
2019-01-24,96.9341
2019-01-25,99.9913
2019-01-28,100.2773
2019-01-29,99.5968
2019-01-30,104.518
2019-01-31,105.0999
2019-02-01,105.4845
2019-02-04,105.5535
2019-02-05,105.307
2019-02-06,106.3326
2019-02-07,104.0249
2019-02-08,104.1432
2019-02-11,104.163
2019-02-12,105.7212
2019-02-13,106.3918
2019-02-14,106.4017
2019-02-15,107.4445
2019-02-19,107.514
2019-02-20,112.0922
2019-02-21,112.2114
2019-02-22,113.701
2019-02-25,114.9623
2019-02-26,115.3198
2019-02-27,114.1082
2019-02-28,114.6942
2019-03-01,114.9822
2019-03-04,115.9058
2019-03-05,114.4459
2019-03-06,113.711
2019-03-07,113.8401
2019-03-08,113.1648
2019-03-11,116.1242
2019-03-12,115.866
2019-03-13,116.0746
2019-03-14,116.3824
2019-03-15,118.7957
2019-03-18,119.0539
2019-03-19,119.332
2019-03-20,119.1036
2019-03-21,122.9469
2019-03-22,119.6994
2019-03-25,118.5772
2019-03-26,119.2128
2019-03-27,117.2862
2019-03-28,116.6605
2019-03-29,118.5871
2019-04-01,121.3182
2019-04-02,121.1096
2019-04-03,123.215
2019-04-04,123.1356
2019-04-05,123.4832
2019-04-08,123.8606
2019-04-09,121.2884
2019-04-10,122.4901
2019-04-11,122.063
2019-04-12,122.5794
2019-04-15,121.4076
2019-04-16,123.4931
2019-04-17,122.8674
2019-04-18,123.3441
2019-04-22,122.2219
2019-04-23,122.3113
2019-04-24,124.7742
2019-04-25,124.5458
2019-04-26,124.9232
2019-04-29,125.1814
2019-04-30,126.6015
2019-05-01,125.092
2019-05-02,127.2868
2019-05-03,127.5847
2019-05-06,123.7513
2019-05-07,116.154
2019-05-08,113.7606
2019-05-09,113.3435
2019-05-10,113.2343
2019-05-13,108.0801
2019-05-14,109.57
2019-05-15,110.35
2019-05-16,108.78
2019-05-17,108.6
2019-05-20,105.61
2019-05-21,106.83
2019-05-22,105.89
2019-05-23,104.53
2019-05-24,103.81
2019-05-28,102.74
2019-05-29,103.39
2019-05-30,104.5
2019-05-31,103.07
2019-06-03,101.78
2019-06-04,105.32
2019-06-05,106.31
2019-06-06,107.86
2019-06-07,109.42
2019-06-10,113.46
2019-06-11,114.23
2019-06-12,110.1
2019-06-13,110.73
2019-06-14,110.26
2019-06-17,108.31
2019-06-18,111.35
2019-06-19,112.195
2019-06-20,113.535
2019-06-21,113.26
2019-06-24,113.53
2019-06-25,113.7
2019-06-26,116.865
2019-06-27,117.95
2019-06-28,118.34
2019-07-01,121.315
2019-07-02,119.32
2019-07-03,118.99
2019-07-04,118.99
2019-07-05,117.815
2019-07-08,117.43
2019-07-09,117.58
2019-07-10,119.31
2019-07-11,119.855
2019-07-12,123
2019-07-15,123.75
2019-07-16,122.61
2019-07-17,125.63
2019-07-18,133.445
2019-07-19,131.945
2019-07-22,137.16
2019-07-23,140.255
2019-07-24,142.61
2019-07-25,139.65
2019-07-26,139.6
2019-07-29,139.59
2019-07-30,139.8
2019-07-31,136.28
2019-08-01,136.975
2019-08-02,133.24
2019-08-05,126.79
2019-08-06,135.41
2019-08-07,134.405
2019-08-08,137.24
2019-08-09,136.215
2019-08-12,134.345
2019-08-13,135.025
2019-08-14,131.33
2019-08-15,132.315
2019-08-16,136.15
2019-08-19,140.49
2019-08-20,140.46
2019-08-21,141.86
2019-08-22,143.59
2019-08-23,138.66
2019-08-26,140.95
2019-08-27,142.42
2019-08-28,143.48
2019-08-29,146.275
2019-08-30,148.17
2019-09-02,147.91
2019-09-03,149.86
2019-09-04,150.63
2019-09-05,151.205
2019-09-06,150.98
2019-09-09,150.23
2019-09-10,148.34
2019-09-11,150.53
2019-09-12,149.58
2019-09-13,150.43
2019-09-16,151.32
2019-09-17,152.52
2019-09-18,157.87
2019-09-19,157.225
2019-09-20,155.49
2019-09-23,157.73
2019-09-24,156.63
2019-09-25,160.61
2019-09-26,161.65
2019-09-27,158.44
2019-09-30,159.345
2019-10-01,158.41
2019-10-02,155.04
2019-10-03,156.775
2019-10-04,161.09
2019-10-07,161.53
2019-10-08,154.7
2019-10-09,157.42
2019-10-10,157.35
2019-10-11,160.19
2019-10-14,159.07
2019-10-15,162.71
2019-10-16,159.71
2019-10-17,161.495
2019-10-18,159.72
2019-10-21,164.07
2019-10-22,162.995
2019-10-23,158.675
2019-10-24,168.83
2019-10-25,169.995
2019-10-28,175
2019-10-29,170.66
2019-10-30,173.65
2019-10-31,168.59
2019-11-01,172.39
2019-11-04,173.98
2019-11-05,171.735
2019-11-06,172.37
2019-11-07,171.75
2019-11-08,174.15
2019-11-11,174.275
2019-11-12,174.4
2019-11-13,176.46
2019-11-14,176.66
2019-11-15,177.62
2019-11-18,176.75
2019-11-19,176.05
2019-11-20,173.79
2019-11-21,161.45
2019-11-22,158.21
2019-11-25,163.03
