date,close
2014-06-13,138.578
2014-06-16,138.6754
2014-06-17,136.6551
2014-06-18,138.0463
2014-06-19,138.064
2014-06-20,137.9134
2014-06-23,139.1894
2014-06-24,137.5058
2014-06-25,138.2501
2014-06-26,138.8083
2014-06-27,138.4185
2014-06-30,137.7627
2014-07-01,139.1894
2014-07-02,138.9147
2014-07-03,138.6754
2014-07-07,138.9413
2014-07-08,138.8261
2014-07-09,136.7969
2014-07-10,133.6424
2014-07-11,132.9069
2014-07-14,133.4917
2014-07-15,131.4094
2014-07-16,131.0992
2014-07-17,132.136
2014-07-18,133.8019
2014-07-21,133.8373
2014-07-22,133.5803
2014-07-23,135.4412
2014-07-24,135.2108
2014-07-25,135.193
2014-07-28,134.0145
2014-07-29,133.6069
2014-07-30,132.4993
2014-07-31,131.0727
2014-08-01,132.1891
2014-08-04,133.793
2014-08-05,132.9512
2014-08-06,132.0474
2014-08-07,131.5866
2014-08-08,135.4589
2014-08-11,136.8589
2014-08-12,137.5678
2014-08-13,137.9488
2014-08-14,137.0361
2014-08-15,135.9374
2014-08-18,138.2501
2014-08-19,135.4943
2014-08-20,137.2399
2014-08-21,137.4792
2014-08-22,137.2399
2014-08-25,137.2577
2014-08-26,134.7943
2014-08-27,135.8045
2014-08-28,135.8222
2014-08-29,137.4083
2014-09-02,139.6413
2014-09-03,140.9173
2014-09-04,138.7375
2014-09-05,139.9691
2014-09-08,139.0919
2014-09-09,137.2399
2014-09-10,136.1235
2014-09-11,135.5741
2014-09-12,135.6007
2014-09-15,136.8678
2014-09-16,137.3286
2014-09-17,136.983
2014-09-18,137.6387
2014-09-19,137.7893
2014-09-22,135.6007
2014-09-23,133.5183
2014-09-24,136.9298
2014-09-25,134.369
2014-09-26,136.1235
2014-09-29,134.4044
2014-09-30,135.9196
2014-10-01,134.9272
2014-10-02,133.7753
2014-10-03,134.75
2014-10-06,135.3082
2014-10-07,133.9525
2014-10-08,137.9931
2014-10-09,137.2577
2014-10-10,132.9069
2014-10-13,132.9158
2014-10-14,132.898
2014-10-15,131.9233
2014-10-16,133.8019
2014-10-17,134.0145
2014-10-20,134.3247
2014-10-21,135.5918
2014-10-22,135.2462
2014-10-23,132.6499
2014-10-24,134.3778
2014-10-27,133.474
2014-10-28,134.5905
2014-10-29,136.6463
2014-10-30,141.9983
2014-10-31,142.6629
2014-11-03,142.2996
2014-11-04,143.3629
2014-11-05,143.292
2014-11-06,143.611
2014-11-07,143.7085
2014-11-10,141.7414
2014-11-11,142.6806
2014-11-12,143.4161
2014-11-13,141.9983
2014-11-14,141.2186
2014-11-17,141.7768
2014-11-18,142.7249
2014-11-19,141.4046
2014-11-20,143.1591
2014-11-21,147.9795
2014-11-24,148.6973
2014-11-25,148.2542
2014-11-26,149.9733
2014-11-28,146.7922
2014-12-01,145.8529
2014-12-02,148.4226
2014-12-03,150.6113
2014-12-04,149.6277
2014-12-05,149.5568
2014-12-08,149.5745
2014-12-09,150.0087
2014-12-10,144.9579
2014-12-11,141.7414
2014-12-12,136.3273
2014-12-15,135.007
2014-12-16,134.3335
2014-12-17,140.554
2014-12-18,144.0541
2014-12-19,140.9704
2014-12-22,141.5287
2014-12-23,143.2389
2014-12-24,142.0869
2014-12-26,143.2477
2014-12-29,144.1161
2014-12-30,142.4857
2014-12-31,141.9363
2015-01-02,141.2008
2015-01-05,137.3463
2015-01-06,137.1513
2015-01-07,137.8071
2015-01-08,139.083
2015-01-09,137.5235
2015-01-12,134.2892
2015-01-13,134.3424
2015-01-14,129.8321
2015-01-15,130.2131
2015-01-16,129.008
2015-01-20,129.0435
2015-01-21,129.9473
2015-01-22,132.1537
2015-01-23,132.7385
2015-01-26,135.0424
2015-01-27,134.4664
2015-01-28,130.3638
2015-01-29,129.5929
2015-01-30,127.7055
2015-02-02,130.5942
2015-02-03,134.9538
2015-02-04,134.7145
2015-02-05,136.3538
2015-02-06,133.9259
2015-02-09,136.4602
2015-02-10,131.8081
2015-02-11,132.2157
2015-02-12,133.2082
2015-02-13,133.3854
2015-02-17,135.2019
2015-02-18,132.3752
2015-02-19,131.7372
2015-02-20,132.3043
2015-02-23,131.4891
2015-02-24,130.9397
2015-02-25,130.8777
2015-02-26,130.0714
2015-02-27,128.6802
2015-03-02,129.6106
2015-03-03,132.2689
2015-03-04,131.7815
2015-03-05,132.3486
2015-03-06,128.6359
2015-03-09,127.9093
2015-03-10,124.6041
2015-03-11,123.8332
2015-03-12,125.1623
2015-03-13,123.08
2015-03-16,122.2205
2015-03-17,121.485
2015-03-18,123.9927
2015-03-19,123.3015
2015-03-20,123.1686
2015-03-23,122.4331
2015-03-24,123.1509
2015-03-25,122.7167
2015-03-26,120.0318
2015-03-27,122.7699
2015-03-30,124.7902
2015-03-31,124.6129
2015-04-01,129.9827
2015-04-02,133.6955
2015-04-06,132.9158
2015-04-07,132.1271
2015-04-08,132.8449
2015-04-09,134.5728
2015-04-10,133.5449
2015-04-13,132.1005
2015-04-14,132.9866
2015-04-15,133.8196
2015-04-16,134.4576
2015-04-17,134.1045
2015-04-20,133.4482
2015-04-21,133.9787
2015-04-22,134.2304
2015-04-23,135.2733
2015-04-24,135.3542
2015-04-27,136.3702
2015-04-28,136.8017
2015-04-29,135.9836
2015-04-30,137.1524
2015-05-01,138.456
2015-05-04,140.5329
2015-05-05,139.6068
2015-05-06,139.1483
2015-05-07,137.7008
2015-05-08,136.2713
2015-05-11,138.6628
2015-05-12,136.9636
2015-05-13,137.1973
2015-05-14,136.0375
2015-05-15,135.2104
2015-05-18,131.713
2015-05-19,131.4343
2015-05-20,131.0657
2015-05-21,130.6791
2015-05-22,131.9108
2015-05-26,128.9349
2015-05-27,126.7412
2015-05-28,127.4425
2015-05-29,126.894
2015-06-01,127.3795
2015-06-02,129.2856
2015-06-03,128.2966
2015-06-04,126.4985
2015-06-05,126.1029
2015-06-08,126.1838
2015-06-09,125.0599
2015-06-10,124.6374
2015-06-11,123.9181
2015-06-12,124.2418
2015-06-15,122.7943
2015-06-16,122.7404
2015-06-17,122.9471
2015-06-18,124.2688
2015-06-19,123.8822
2015-06-22,125.9141
2015-06-23,126.8581
2015-06-24,127.9909
2015-06-25,127.7032
2015-06-26,129.3035
2015-06-29,125.5365
2015-06-30,124.8981
2015-07-01,125.995
2015-07-02,125.3656
2015-07-06,123.9361
2015-07-07,123.7293
2015-07-08,122.129
2015-07-09,123.3337
2015-07-10,125.4735
2015-07-13,127.4784
2015-07-14,126.2197
2015-07-15,124.9341
2015-07-16,124.7543
2015-07-17,123.1719
2015-07-20,123.2079
2015-07-21,122.5426
2015-07-22,121.4637
2015-07-23,119.9712
2015-07-24,118.4878
2015-07-27,117.0403
2015-07-28,117.3909
2015-07-29,117.0313
2015-07-30,118.0832
2015-07-31,118.5867
2015-08-03,118.1641
2015-08-04,118.4428
2015-08-05,118.0382
2015-08-06,117.8135
2015-08-07,116.7796
2015-08-10,118.4878
2015-08-11,114.9634
2015-08-12,111.9156
2015-08-13,111.0076
2015-08-14,104.7501
2015-08-17,103.3026
2015-08-18,103.833
2015-08-19,103.842
2015-08-20,101.8731
2015-08-21,99.1129
2015-08-24,94.6086
2015-08-25,92.5228
2015-08-26,94.24
2015-08-27,99.976
2015-08-28,100.6683
2015-08-31,98.8792
2015-09-01,96.3168
2015-09-02,97.162
2015-09-03,97.6385
2015-09-04,96.5506
2015-09-08,97.5755
2015-09-09,96.1011
2015-09-10,97.0631
2015-09-11,99.6883
2015-09-14,99.5804
2015-09-15,98.097
2015-09-16,98.8972
2015-09-17,97.8093
2015-09-18,97.153
2015-09-21,97.5216
2015-09-22,95.1211
2015-09-23,94.1591
2015-09-24,93.7275
2015-09-25,91.5248
2015-09-28,90.5358
2015-09-29,93.3859
2015-09-30,95.6246
2015-10-01,95.0312
2015-10-02,95.8763
2015-10-05,100.2997
2015-10-06,100.7492
2015-10-07,103.2576
2015-10-08,103.7431
2015-10-09,105.0288
2015-10-12,102.8081
2015-10-13,103.5004
2015-10-14,102.9519
2015-10-15,103.1228
2015-10-16,102.844
2015-10-19,102.6193
2015-10-20,103.3925
2015-10-21,100.3806
2015-10-22,102.925
2015-10-23,102.6642
2015-10-26,103.1947
2015-10-27,102.0439
2015-10-28,102.6103
2015-10-29,102.3226
2015-10-30,101.7562
2015-11-02,102.88
2015-11-03,103.4734
2015-11-04,102.4754
2015-11-05,102.2776
2015-11-06,102.4844
2015-11-09,100.7582
2015-11-10,101.4505
2015-11-11,103.3835
2015-11-12,100.2368
2015-11-13,98.5645
2015-11-16,100.7852
2015-11-17,99.8412
2015-11-18,100.6054
2015-11-19,99.8861
2015-11-20,100.5694
2015-11-23,99.7692
2015-11-24,101.2347
2015-11-25,98.2588
2015-11-27,95.4268
2015-11-30,94.9503
2015-12-01,96.3618
2015-12-02,93.8984
2015-12-03,92.9813
2015-12-04,95.4358
2015-12-07,95.2739
2015-12-08,93.242
2015-12-09,92.9004
2015-12-10,90.7247
2015-12-11,88.9984
2015-12-14,88.3241
2015-12-15,89.8526
2015-12-16,91.2731
2015-12-17,92.0553
2015-12-18,86.4361
2015-12-21,87.2183
2015-12-22,87.7308
2015-12-23,89.2592
2015-12-24,89.8885
2015-12-28,88.8456
2015-12-29,89.439
2015-12-30,87.6229
2015-12-31,87.497
2016-01-04,85.1415
2016-01-05,85.1325
2016-01-06,84.0356
2016-01-07,80.7001
2016-01-08,80.4483
2016-01-11,79.4684
2016-01-12,82.1656
2016-01-13,79.9808
2016-01-14,80.808
2016-01-15,78.6772
2016-01-19,78.7491
2016-01-20,79.2166
2016-01-21,78.3176
2016-01-22,81.8958
2016-01-25,81.1586
2016-01-26,82.3274
2016-01-27,84.8448
2016-01-28,88.0904
2016-01-29,91.1292
2016-02-01,91.0124
2016-02-02,87.2543
2016-02-03,88.0994
2016-02-04,89.9245
2016-02-05,89.2682
2016-02-08,87.7218
2016-02-09,88.5489
2016-02-10,93.6916
2016-02-11,94.5637
2016-02-12,99.5715
2016-02-16,99.2118
2016-02-17,101.6843
2016-02-18,99.7872
2016-02-19,101.5494
2016-02-22,103.86
2016-02-23,103.833
2016-02-24,105.748
2016-02-25,107.4652
2016-02-26,106.6111
2016-02-29,105.4064
2016-03-01,107.7709
2016-03-02,113.2372
2016-03-03,114.7746
2016-03-04,116.6177
2016-03-07,114.8915
2016-03-08,112.6349
2016-03-09,116.1862
2016-03-10,115.9165
2016-03-11,116.375
2016-03-14,116.33
2016-03-15,114.3251
2016-03-16,114.0464
2016-03-17,119.6925
2016-03-18,120.5466
2016-03-21,118.272
2016-03-22,115.1343
2016-03-23,113.7947
2016-03-24,111.4751
2016-03-28,111.3852
2016-03-29,114.2622
2016-03-30,117.8584
2016-03-31,117.7865
2016-04-01,115.0713
2016-04-04,115.2871
2016-04-05,113.3541
2016-04-06,112.0685
2016-04-07,110.3872
2016-04-08,112.9406
2016-04-11,124.4306
2016-04-12,130.0498
2016-04-13,129.0608
2016-04-14,128.253
2016-04-15,126.9189
2016-04-18,127.6316
2016-04-19,130.7751
2016-04-20,131.3234
2016-04-21,131.2686
2016-04-22,130.1537
2016-04-25,129.1485
2016-04-26,131.3417
2016-04-27,132.8769
2016-04-28,132.8129
2016-04-29,132.886
2016-05-02,132.4931
2016-05-03,127.6865
2016-05-04,123.9398
2016-05-05,124.8811
2016-05-06,127.9515
2016-05-09,125.7583
2016-05-10,130.0075
2016-05-11,130.7568
2016-05-12,131.1589
2016-05-13,132.091
2016-05-16,134.2567
2016-05-17,133.9826
2016-05-18,132.3834
2016-05-19,127.6408
2016-05-20,127.4763
2016-05-23,128.8196
2016-05-24,128.9932
2016-05-25,131.6432
2016-05-26,132.9317
2016-05-27,130.108
2016-05-31,128.1159
2016-06-01,130.702
2016-06-02,132.3377
2016-06-03,136.8337
2016-06-06,137.6652
2016-06-07,139.3832
2016-06-08,139.6299
2016-06-09,141.2291
2016-06-10,134.4943
2016-06-13,132.6393
2016-06-14,131.8077
2016-06-15,135.6183
2016-06-16,137.0347
2016-06-17,138.0399
2016-06-20,138.7527
2016-06-21,138.5973
2016-06-22,138.2227
2016-06-23,139.7579
2016-06-24,133.7359
2016-06-27,131.826
2016-06-28,136.395
2016-06-29,139.0999
2016-06-30,141.0281
2016-07-01,140.6534
2016-07-05,137.3454
2016-07-06,137.382
2016-07-07,137.254
2016-07-08,142.8557
2016-07-11,144.0071
2016-07-12,141.8413
2016-07-13,144.4914
2016-07-14,145.2955
2016-07-15,142.6272
2016-07-18,145.3138
2016-07-19,144.9209
2016-07-20,145.7616
2016-07-21,145.6062
2016-07-22,147.973
2016-07-25,147.4704
2016-07-26,148.0918
2016-07-27,147.0318
2016-07-28,146.3007
2016-07-29,146.5109
2016-08-01,146.4287
2016-08-02,145.1493
2016-08-03,145.4143
2016-08-04,145.5971
2016-08-05,146.0814
2016-08-08,146.5109
2016-08-09,144.5005
2016-08-10,147.5983
2016-08-11,148.503
2016-08-12,145.2042
2016-08-15,145.4052
2016-08-16,144.135
2016-08-17,143.2577
2016-08-18,143.4496
2016-08-19,145.8164
2016-08-22,146.2093
2016-08-23,146.0723
2016-08-24,147.0592
2016-08-25,146.5566
2016-08-26,143.4679
2016-08-29,145.5788
2016-08-30,144.2447
2016-08-31,143.1755
2016-09-01,146.9038
2016-09-02,148.174
2016-09-06,149.6544
2016-09-07,148.9325
2016-09-08,147.3242
2016-09-09,141.2108
2016-09-12,142.2891
2016-09-13,138.8166
2016-09-14,139.5111
2016-09-15,140.7265
2016-09-16,138.1313
2016-09-19,139.2735
2016-09-20,140.6351
2016-09-21,143.5045
2016-09-22,145.9535
2016-09-23,143.3491
2016-09-26,140.3884
2016-09-27,139.7853
2016-09-28,140.1142
2016-09-29,137.9302
2016-09-30,139.0999
2016-10-03,138.707
2016-10-04,135.6731
2016-10-05,134.3298
2016-10-06,133.6902
2016-10-07,133.9003
2016-10-10,135.7645
2016-10-11,134.3664
2016-10-12,134.8324
2016-10-13,133.3978
2016-10-14,134.01
2016-10-17,132.7124
2016-10-18,135.8559
2016-10-19,138.0399
2016-10-20,138.5973
2016-10-21,137.9942
2016-10-24,137.5464
2016-10-25,137.1444
2016-10-26,137.6652
2016-10-27,135.3899
2016-10-28,135.5269
2016-10-31,135.865
2016-11-01,136.3037
2016-11-02,134.4669
2016-11-03,134.2933
2016-11-04,142.3896
2016-11-07,149.0422
2016-11-08,148.6309
2016-11-09,148.6766
2016-11-10,145.7068
2016-11-11,141.686
2016-11-14,139.4929
2016-11-15,140.233
2016-11-16,138.6704
2016-11-17,136.2397
2016-11-18,139.5385
2016-11-21,137.3911
2016-11-22,138.2227
2016-11-23,136.7606
2016-11-25,139.5294
2016-11-28,138.0856
2016-11-29,140.1873
2016-11-30,143.1846
2016-12-01,145.4143
2016-12-02,141.7134
2016-12-05,144.2447
2016-12-06,144.1167
2016-12-07,144.7564
2016-12-08,143.7878
2016-12-09,146.1271
2016-12-12,142.3165
2016-12-13,144.4457
2016-12-14,142.6272
2016-12-15,143.3126
2016-12-16,143.2852
2016-12-19,142.3439
2016-12-20,143.6233
2016-12-21,144.6741
2016-12-22,143.2029
2016-12-23,142.3531
2016-12-27,142.6546
2016-12-28,144.4822
2016-12-29,144.0619
2016-12-30,144.2538
2017-01-03,147.5709
2017-01-04,149.6727
2017-01-05,150.0291
2017-01-06,150.4951
2017-01-09,149.1335
2017-01-10,150.7784
2017-01-11,149.4808
2017-01-12,149.2523
2017-01-13,147.3516
2017-01-17,146.8673
2017-01-18,147.7537
2017-01-19,145.3047
2017-01-20,146.319
2017-01-23,149.9742
2017-01-24,151.4637
2017-01-25,153.6112
2017-01-26,150.7693
2017-01-27,151.811
2017-01-30,149.9285
2017-01-31,149.5722
2017-02-01,149.2249
2017-02-02,148.2928
2017-02-03,149.828
2017-02-06,148.4573
2017-02-07,152.4689
2017-02-08,153.7483
2017-02-09,155.3383
2017-02-10,157.2756
2017-02-13,154.9088
2017-02-14,152.4324
2017-02-15,153.4558
2017-02-16,152.2953
2017-02-17,151.9115
2017-02-21,155.9871
2017-02-22,156.1699
2017-02-23,155.4571
2017-02-24,153.2365
2017-02-27,152.1217
2017-02-28,150.4311
2017-03-01,153.0081
2017-03-02,150.9246
2017-03-03,153.0995
2017-03-06,151.482
2017-03-07,148.8137
2017-03-08,146.648
2017-03-09,145.5514
2017-03-10,144.5828
2017-03-13,144.7016
2017-03-14,143.9979
2017-03-15,146.3556
2017-03-16,149.5173
2017-03-17,149.8646
2017-03-20,149.8189
2017-03-21,146.4926
2017-03-22,147.443
2017-03-23,149.9285
2017-03-24,150.0565
2017-03-27,149.7366
2017-03-28,151.8019
2017-03-29,151.1531
2017-03-30,150.9886
2017-03-31,149.2249
2017-04-03,149.3163
2017-04-04,150.8972
2017-04-05,150.2027
2017-04-06,147.7811
2017-04-07,146.3738
2017-04-10,146.2368
2017-04-11,146.2642
2017-04-12,145.1493
2017-04-13,143.0509
2017-04-17,145.1565
2017-04-18,143.5188
2017-04-19,142.5362
2017-04-20,145.5776
2017-04-21,143.2381
2017-04-24,142.6391
2017-04-25,142.7421
2017-04-26,142.8918
2017-04-27,142.2086
2017-04-28,143.7995
2017-05-01,145.8771
2017-05-02,147.234
2017-05-03,147.1873
2017-05-04,146.9814
2017-05-05,147.2434
2017-05-08,147.2153
2017-05-09,149.3584
2017-05-10,152.3062
2017-05-11,153.1672
2017-05-12,156.5268
2017-05-15,160.3263
2017-05-16,159.7461
2017-05-17,160.7849
2017-05-18,159.4185
2017-05-19,161.4493
2017-05-22,162.7782
2017-05-23,162.0482
2017-05-24,160.9627
2017-05-25,158.9693
2017-05-26,158.1552
2017-05-30,156.9854
2017-05-31,156.7701
2017-06-01,157.7621
2017-06-02,156.9947
2017-06-05,158.3423
2017-06-06,160.9627
2017-06-07,162.2822
2017-06-08,161.3557
2017-06-09,162.4881
2017-06-12,161.7675
2017-06-13,166.456
2017-06-14,168.4119
2017-06-15,167.3263
2017-06-16,167.1111
2017-06-19,169.8998
2017-06-20,170.3303
2017-06-21,171.2194
2017-06-22,169.2822
2017-06-23,168.7768
2017-06-26,168.7207
2017-06-27,168.3744
2017-06-28,168.5242
2017-06-29,168.9546
2017-06-30,167.8784
2017-07-03,171.0509
2017-07-05,170.6672
2017-07-06,169.3477
2017-07-07,170.349
2017-07-10,170.6391
2017-07-11,172.6792
2017-07-12,173.9894
2017-07-13,173.4934
2017-07-14,174.5322
2017-07-17,173.5589
2017-07-18,174.3357
2017-07-19,173.6525
2017-07-20,173.2782
2017-07-21,173.6899
2017-07-24,172.1833
2017-07-25,173.456
2017-07-26,175.3557
2017-07-27,175.9827
2017-07-28,176.7875
2017-07-31,173.2595
2017-08-01,177.5268
2017-08-02,175.9172
2017-08-03,177.2929
2017-08-04,176.9747
2017-08-07,175.9079
2017-08-08,182.9359
2017-08-09,187.8397
2017-08-10,181.1391
2017-08-11,182.2715
2017-08-14,184.7047
2017-08-15,186.4079
2017-08-16,187.7555
2017-08-17,186.464
2017-08-18,189.0188
2017-08-21,191.2555
2017-08-22,190.0389
2017-08-23,188.841
2017-08-24,190.1699
2017-08-25,192.7996
2017-08-28,189.7581
2017-08-29,189.3932
2017-08-30,188.6071
2017-08-31,189.8236
2017-09-01,191.6392
2017-09-05,188.083
2017-09-06,193.4921
2017-09-07,190.1793
2017-09-08,190.4974
2017-09-11,194.9801
2017-09-12,194.7929
2017-09-13,197.6565
2017-09-14,197.5442
2017-09-15,199.1913
2017-09-18,198.0683
2017-09-19,190.6472
2017-09-20,190.8343
2017-09-21,191.3678
2017-09-22,189.3932
2017-09-25,189.5148
2017-09-26,190.591
2017-09-27,191.0589
2017-09-28,190.8718
2017-09-29,191.8637
2017-10-02,197.4132
2017-10-03,198.1151
2017-10-04,195.448
2017-10-05,195.8878
2017-10-06,192.9493
2017-10-09,190.4413
2017-10-10,189.0937
2017-10-11,190.5162
2017-10-12,191.845
2017-10-13,195.2702
2017-10-16,194.9707
2017-10-17,193.8571
2017-10-18,194.5215
2017-10-19,193.3704
2017-10-20,195.2327
2017-10-23,194.0442
2017-10-24,194.8303
2017-10-25,193.2207
2017-10-26,193.726
2017-10-27,197.1418
2017-10-30,196.2341
2017-10-31,196.0001
2017-11-01,195.214
2017-11-02,193.7541
2017-11-03,194.0162
2017-11-06,198.0964
2017-11-07,194.1378
2017-11-08,193.1833
2017-11-09,195.4012
2017-11-10,193.3049
2017-11-13,197.3157
2017-11-14,199.1899
2017-11-15,199.1605
2017-11-16,200.073
2017-11-17,204.7044
2017-11-20,206.0193
2017-11-21,208.0897
2017-11-22,208.3252
2017-11-24,209.7774
2017-11-27,209.2377
2017-11-28,210.111
2017-11-29,209.6008
2017-11-30,207.0692
2017-12-01,207.2556
2017-12-04,205.1852
2017-12-05,203.4386
2017-12-06,201.4467
2017-12-07,203.0363
2017-12-08,205.146
2017-12-11,204.9105
2017-12-12,206.6571
2017-12-13,204.2236
2017-12-14,193.0474
2017-12-15,188.3964
2017-12-18,198.454
2017-12-19,200.7893
2017-12-20,201.064
2017-12-21,196.3247
2017-12-22,202.9578
2017-12-26,202.4574
2017-12-27,202.7125
2017-12-28,203.3601
2017-12-29,203.5367
2018-01-02,209.5713
2018-01-03,213.3785
2018-01-04,215.2821
2018-01-05,218.9813
2018-01-08,215.4685
2018-01-09,215.9984
2018-01-10,216.0867
2018-01-11,216.0573
2018-01-12,218.6968
2018-01-16,219.7369
2018-01-17,221.2578
2018-01-18,224.0052
2018-01-19,225.6733
2018-01-22,226.0167
2018-01-23,228.5778
2018-01-24,232.0906
2018-01-25,230.0202
2018-01-26,231.7962
2018-01-29,232.6204
2018-01-30,231.4822
2018-01-31,227.2825
2018-02-01,227.0667
2018-02-02,219.7957
2018-02-05,213.7514
2018-02-06,217.7352
2018-02-07,215.6746
2018-02-08,205.0478
2018-02-09,207.0397
2018-02-12,210.3661
2018-02-13,212.9468
2018-02-14,216.0965
2018-02-15,218.3239
2018-02-16,214.1242
2018-02-20,212.6622
2018-02-21,213.4276
2018-02-22,215.2625
2018-02-23,213.8593
2018-02-26,213.6042
2018-02-27,212.6916
2018-02-28,212.3875
2018-03-01,211.8478
2018-03-02,213.3491
2018-03-05,219.0893
2018-03-06,220.306
2018-03-07,219.0598
2018-03-08,216.8324
2018-03-09,216.96
2018-03-12,216.4399
2018-03-13,216.4301
2018-03-14,211.838
2018-03-15,211.4357
2018-03-16,211.9459
2018-03-19,214.0457
2018-03-20,218.216
2018-03-21,219.2855
2018-03-22,213.771
2018-03-23,213.6336
2018-03-26,219.7859
2018-03-27,217.5193
2018-03-28,220.4335
2018-03-29,222.7787
2018-04-02,224.8883
2018-04-03,228.7838
2018-04-04,229.5099
2018-04-05,232.6695
2018-04-06,230.2753
2018-04-09,228.6759
2018-04-10,232.6401
2018-04-11,231.7766
2018-04-12,229.0488
2018-04-13,226.6644
2018-04-16,225.0159
2018-04-17,228.54
2018-04-18,229.21
2018-04-19,230.38
2018-04-20,230.94
2018-04-23,232.66
2018-04-24,234.63
2018-04-25,231.89
2018-04-26,234.04
2018-04-27,234.71
2018-04-30,232.49
2018-05-01,229.42
2018-05-02,229.71
2018-05-03,223.15
2018-05-04,228.02
2018-05-07,228.6
2018-05-08,230.05
2018-05-09,226.5
2018-05-10,228
2018-05-11,227.01
2018-05-14,226.12
2018-05-15,224.97
2018-05-16,221.56
2018-05-17,223.26
2018-05-18,221.43
2018-05-21,223.25
2018-05-22,222.97
2018-05-23,218.6
2018-05-24,219.56
2018-05-25,224.19
2018-05-29,218.14
2018-05-30,220.77
2018-05-31,221.42
2018-06-01,226.55
2018-06-04,228.74
2018-06-05,227.46
2018-06-06,231.21
2018-06-07,228.41
2018-06-08,230
2018-06-11,228.78
2018-06-12,231.22
2018-06-13,229.98
2018-06-14,225.95
2018-06-15,223.54
2018-06-18,223.33
2018-06-19,223.5
2018-06-20,222.48
2018-06-21,219.85
2018-06-22,220.53
2018-06-25,219.24
2018-06-26,222.05
2018-06-27,219.52
2018-06-28,221.32
2018-06-29,225.12
2018-07-02,224.47
2018-07-03,228.7
2018-07-05,227.13
2018-07-06,228.54
2018-07-09,230.07
2018-07-10,229.78
2018-07-11,228.7
2018-07-12,228.84
2018-07-13,227.33
2018-07-16,229.09
2018-07-17,228.08
2018-07-18,228.44
2018-07-19,226.74
2018-07-20,229.57
2018-07-23,227.98
2018-07-24,229.95
2018-07-25,232.42
2018-07-26,229.82
2018-07-27,229.54
2018-07-30,229.47
2018-07-31,228.77
2018-08-01,228.58
2018-08-02,226.25
2018-08-03,230.8
2018-08-06,229.31
2018-08-07,231.17
2018-08-08,230.02
2018-08-09,230.07
2018-08-10,226.46
2018-08-13,224.62
2018-08-14,225.77
2018-08-15,222.25
2018-08-16,222.6
2018-08-17,221.76
2018-08-20,222.35
2018-08-21,219.84
2018-08-22,220.4
2018-08-23,221.7
2018-08-24,222.61
2018-08-27,223.5
2018-08-28,222.04
2018-08-29,221.95
2018-08-30,216.45
2018-08-31,218.02
2018-09-04,211.79
2018-09-05,210.39
2018-09-06,209.81
2018-09-07,209.85
2018-09-10,210.36
2018-09-11,208.44
2018-09-12,212.4
2018-09-13,212.65
2018-09-14,213.34
2018-09-17,215.11
2018-09-18,216.73
2018-09-19,220.5
2018-09-20,226.39
2018-09-21,227
2018-09-24,224.7
2018-09-25,226.94
2018-09-26,226.58
2018-09-27,227
2018-09-28,223.08
2018-10-01,226.66
2018-10-02,226.32
2018-10-03,226.74
2018-10-04,223.06
2018-10-05,221.76
2018-10-08,220.07
2018-10-09,222.28
2018-10-10,217.17
2018-10-11,214.29
2018-10-12,217.85
2018-10-15,218.43
2018-10-16,224.74
2018-10-17,223.68
2018-10-18,220.02
2018-10-19,219.16
2018-10-22,217.4
2018-10-23,218.16
2018-10-24,213.9
2018-10-25,215.23
2018-10-26,215.73
2018-10-29,215.77
2018-10-30,220.53
2018-10-31,225.71
2018-11-01,229.24
2018-11-02,229.21
2018-11-05,229.82
2018-11-06,230
2018-11-07,228.85
2018-11-08,224.93
2018-11-09,224.23
2018-11-12,220.6
2018-11-13,223.59
2018-11-14,219.97
2018-11-15,225.47
2018-11-16,226.08
2018-11-19,226.2
2018-11-20,217.56
2018-11-21,223.67
2018-11-23,218.04
2018-11-26,221.9
2018-11-27,221.46
2018-11-28,225.08
2018-11-29,224.38
2018-11-30,219.29
2018-12-03,224.14
2018-12-04,222.69
2018-12-06,222.04
2018-12-07,220.68
2018-12-10,216.16
2018-12-11,221.19
2018-12-12,217.78
2018-12-13,218.54
2018-12-14,217.94
2018-12-17,215.68
2018-12-18,215.1
2018-12-19,215.83
2018-12-20,216.36
2018-12-21,213.67
2018-12-24,213.26
2018-12-26,217.9
2018-12-27,219.68
2018-12-28,221.77
2018-12-31,221.67
2019-01-02,226.45
2019-01-03,222.67
2019-01-04,228.5
2019-01-07,226.75
2019-01-08,227.49
2019-01-09,226.35
2019-01-10,230.47
2019-01-11,229.76
2019-01-14,230.85
2019-01-15,229.97
2019-01-16,232.14
2019-01-17,233.59
2019-01-18,232.05
2019-01-22,232.29
2019-01-23,234.41
2019-01-24,234.73
2019-01-25,236.23
2019-01-28,236.57
2019-01-29,239.68
2019-01-30,236.3
2019-01-31,242.78
2019-02-01,242.95
2019-02-04,246.42
2019-02-05,248.49
2019-02-06,246.79
2019-02-07,237.45
2019-02-08,239.61
2019-02-11,236.5
2019-02-12,240.13
2019-02-13,240.14
2019-02-14,236.34
2019-02-15,239.08
2019-02-19,239.71
2019-02-20,240.97
2019-02-21,239.13
2019-02-22,242.61
2019-02-25,241.8
2019-02-26,241.81
2019-02-27,243.44
2019-02-28,243.09
2019-03-01,239.1
2019-03-04,241.59
2019-03-05,237.93
2019-03-06,240.6
2019-03-07,236.25
2019-03-08,235.61
2019-03-11,242.41
2019-03-12,240.34
2019-03-13,243.57
2019-03-14,246.47
2019-03-15,248.19
2019-03-18,250.7
2019-03-19,249.31
2019-03-20,248.11
2019-03-21,244.27
2019-03-22,241.43
2019-03-25,239.88
2019-03-26,240.78
2019-03-27,239.29
2019-03-28,238.99
2019-03-29,239.95
2019-04-01,242.56
2019-04-02,243.1
2019-04-03,243.54
2019-04-04,243.47
2019-04-05,245.28
2019-04-08,245.47
2019-04-09,240.05
2019-04-10,241.63
2019-04-11,241
2019-04-12,241.85
2019-04-15,233.99
2019-04-16,234.6
2019-04-17,232.36
2019-04-18,231.34
2019-04-22,233.18
2019-04-23,233.76
2019-04-24,233.27
2019-04-25,233.7
2019-04-26,236.39
2019-04-29,237.39
2019-04-30,236.9
2019-05-01,236.8
2019-05-02,237.8
2019-05-03,238.17
2019-05-06,237.44
2019-05-07,234.26
2019-05-08,226.47
2019-05-09,225.23
2019-05-10,223.85
2019-05-13,215.78
2019-05-14,218.59
2019-05-15,216.38
2019-05-16,217.51
2019-05-17,217.83
2019-05-20,220.29
2019-05-21,223.93
2019-05-22,225.54
2019-05-23,223.76
2019-05-24,221.08
2019-05-28,219.6
2019-05-29,219.71
2019-05-30,221.78
2019-05-31,223.8
2019-06-03,222.33
2019-06-04,223.84
2019-06-05,222.39
2019-06-06,224.74
2019-06-07,228.97
2019-06-10,228.88
2019-06-11,227.93
2019-06-12,223.6
2019-06-13,220.67
2019-06-14,220.49
2019-06-17,219.41
2019-06-18,220.525
2019-06-19,219.62
2019-06-20,222.605
2019-06-21,226.855
2019-06-24,227.14
2019-06-25,227.31
2019-06-26,228
2019-06-27,230.49
2019-06-28,228.365
2019-07-01,230.93
2019-07-02,233.04
2019-07-03,235.04
2019-07-04,235.04
2019-07-05,238.17
2019-07-08,238.98
2019-07-09,238.035
2019-07-10,235.85
2019-07-11,236.3
2019-07-12,235.565
2019-07-15,233.845
2019-07-16,236.295
2019-07-17,235.18
2019-07-18,236.33
2019-07-19,230.59
2019-07-22,228.02
2019-07-23,226.69
2019-07-24,228.34
2019-07-25,228.205
2019-07-26,229.86
2019-07-29,224.29
2019-07-30,219.23
2019-07-31,218.39
2019-08-01,216.94
2019-08-02,214.75
2019-08-05,209.205
2019-08-06,210.24
2019-08-07,213.505
2019-08-08,214.72
2019-08-09,207.675
2019-08-12,202.46
2019-08-13,207.81
2019-08-14,201.51
2019-08-15,202.27
2019-08-16,206.78
2019-08-19,206.72
2019-08-20,205.32
2019-08-21,206.16
2019-08-22,203.76
2019-08-23,201.49
2019-08-26,200.75
2019-08-27,201.28
2019-08-28,201.55
2019-08-29,203.75
2019-08-30,206.835
2019-09-02,206.87
2019-09-03,205.03
2019-09-04,205.37
2019-09-05,211.74
2019-09-06,212.81
2019-09-09,211.93
2019-09-10,212
2019-09-11,213.61
2019-09-12,214.9
2019-09-13,215.49
2019-09-16,216.35
2019-09-17,213.91
2019-09-18,214.225
2019-09-19,212.02
2019-09-20,209.81
2019-09-23,207.41
2019-09-24,206.9
2019-09-25,209.69
2019-09-26,211.81
2019-09-27,211.785
2019-09-30,208.73
2019-10-01,203.9
2019-10-02,202.02
2019-10-03,203.535
2019-10-04,207.76
2019-10-07,207.515
2019-10-08,205.02
2019-10-09,204.14
2019-10-10,203.18
2019-10-11,208.845
2019-10-14,208.625
2019-10-15,209.98
2019-10-16,209.36
2019-10-17,209.285
2019-10-18,209.79
2019-10-21,209.84
2019-10-22,207.715
2019-10-23,211.975
2019-10-24,214.64
2019-10-25,212.51
2019-10-28,213.82
2019-10-29,213.84
2019-10-30,211.53
2019-10-31,213.95
2019-11-01,216.185
2019-11-04,214.42
2019-11-05,212.625
2019-11-06,212.44
2019-11-07,216.85
2019-11-08,206.45
2019-11-11,205.69
2019-11-12,203.87
2019-11-13,204.615
2019-11-14,203.9
2019-11-15,210.49
2019-11-18,210.25
2019-11-19,207.78
2019-11-20,206.98
2019-11-21,207.87
2019-11-22,207.48
2019-11-25,209.635
