date,close
2014-06-13,8.71
2014-06-16,8.87
2014-06-17,9.21
2014-06-18,9.3
2014-06-19,9.16
2014-06-20,9.21
2014-06-23,9.36
2014-06-24,9.63
2014-06-25,9.97
2014-06-26,10.29
2014-06-27,10.73
2014-06-30,10.81
2014-07-01,10.81
2014-07-02,10.8
2014-07-03,10.65
2014-07-07,10.78
2014-07-08,10.06
2014-07-09,9.85
2014-07-10,9.96
2014-07-11,10.12
2014-07-14,9.98
2014-07-15,9.7
2014-07-16,9.72
2014-07-17,9.42
2014-07-18,10.17
2014-07-21,11.01
2014-07-22,11.14
2014-07-23,13.1
2014-07-24,12.98
2014-07-25,12.63
2014-07-28,11.9
2014-07-29,11.46
2014-07-30,11.03
2014-07-31,10.1
2014-08-01,9.75
2014-08-04,10.17
2014-08-05,9.93
2014-08-06,9.91
2014-08-07,9.72
2014-08-08,9.96
2014-08-11,8.97
2014-08-12,8.68
2014-08-13,9.58
2014-08-14,9.39
2014-08-15,9.37
2014-08-18,9.86
2014-08-19,9.94
2014-08-20,9.93
2014-08-21,10.58
2014-08-22,10.71
2014-08-25,10.53
2014-08-26,10.32
2014-08-27,10.75
2014-08-28,10.63
2014-08-29,10.59
2014-09-02,11.04
2014-09-03,10.94
2014-09-04,10.75
2014-09-05,10.62
2014-09-08,10.54
2014-09-09,10.34
2014-09-10,10.17
2014-09-11,10.44
2014-09-12,10.67
2014-09-15,10.51
2014-09-16,10.5
2014-09-17,10.41
2014-09-18,10.22
2014-09-19,10.22
2014-09-22,10.12
2014-09-23,9.77
2014-09-24,10.29
2014-09-25,10.44
2014-09-26,10.1
2014-09-29,9.96
2014-09-30,9.85
2014-10-01,9.8
2014-10-02,10.45
2014-10-03,11.03
2014-10-06,11.15
2014-10-07,10.34
2014-10-08,10.52
2014-10-09,10.09
2014-10-10,10.04
2014-10-13,10.52
2014-10-14,10.94
2014-10-15,11.24
2014-10-16,11.84
2014-10-17,12.31
2014-10-20,12.19
2014-10-21,11.55
2014-10-22,10.95
2014-10-23,11.2
2014-10-24,11.31
2014-10-27,11.31
2014-10-28,11.38
2014-10-29,11.2
2014-10-30,11.43
2014-10-31,11.36
2014-11-03,11.65
2014-11-04,11.53
2014-11-05,11.23
2014-11-06,11.07
2014-11-07,11.23
2014-11-10,11.24
2014-11-11,11.3
2014-11-12,11.1
2014-11-13,11.01
2014-11-14,11
2014-11-17,9.93
2014-11-18,9.86
2014-11-19,9.44
2014-11-20,9.95
2014-11-21,9.98
2014-11-24,10.18
2014-11-25,10.04
2014-11-26,9.89
2014-11-28,9.68
2014-12-01,9.25
2014-12-02,9.4
2014-12-03,9.24
2014-12-04,8.78
2014-12-05,8.89
2014-12-08,8.57
2014-12-09,8.56
2014-12-10,8.21
2014-12-11,8.22
2014-12-12,8.49
2014-12-15,8.26
2014-12-16,8.34
2014-12-17,8.78
2014-12-18,9.01
2014-12-19,9.48
2014-12-22,9.45
2014-12-23,9.2
2014-12-24,9.11
2014-12-26,9.36
2014-12-29,9.275
2014-12-30,9.18
2014-12-31,9.18
2015-01-02,9.32
2015-01-05,9.28
2015-01-06,9.23
2015-01-07,9.34
2015-01-08,9.36
2015-01-09,9.49
2015-01-12,9.3
2015-01-13,8.965
2015-01-14,9.07
2015-01-15,8.78
2015-01-16,8.77
2015-01-20,8.94
2015-01-21,8.66
2015-01-22,8.5
2015-01-23,8.61
2015-01-26,8.88
2015-01-27,8.94
2015-01-28,8.5
2015-01-29,8.5
2015-01-30,8.34
2015-02-02,8.21
2015-02-03,8.29
2015-02-04,8.03
2015-02-05,8.23
2015-02-06,8.2
2015-02-09,7.91
2015-02-10,7.66
2015-02-11,6.81
2015-02-12,6.95
2015-02-13,6.8
2015-02-17,6.785
2015-02-18,6.99
2015-02-19,6.85
2015-02-20,6.88
2015-02-23,6.82
2015-02-24,6.45
2015-02-25,6.94
2015-02-26,7.03
2015-02-27,7.075
2015-03-02,7.17
2015-03-03,7.05
2015-03-04,7.36
2015-03-05,7.56
2015-03-06,7.35
2015-03-09,7.14
2015-03-10,7.09
2015-03-11,7.17
2015-03-12,7.3
2015-03-13,7.04
2015-03-16,8.42
2015-03-17,8.56
2015-03-18,8.38
2015-03-19,9.45
2015-03-20,9.09
2015-03-23,8.855
2015-03-24,8.73
2015-03-25,8.19
2015-03-26,8.09
2015-03-27,8.285
2015-03-30,8.33
2015-03-31,8.16
2015-04-01,8.47
2015-04-02,8.685
2015-04-06,9.07
2015-04-07,9.08
2015-04-08,9.72
2015-04-09,9.96
2015-04-10,9.78
2015-04-13,9.88
2015-04-14,10.48
2015-04-15,10.385
2015-04-16,10.325
2015-04-17,10.04
2015-04-20,10.32
2015-04-21,10.475
2015-04-22,10.385
2015-04-23,10.6
2015-04-24,10.35
2015-04-27,10.055
2015-04-28,9.71
2015-04-29,9.85
2015-04-30,8.16
2015-05-01,8.42
2015-05-04,8.46
2015-05-05,8.27
2015-05-06,8.09
2015-05-07,8.08
2015-05-08,8.01
2015-05-11,8.01
2015-05-12,8.1
2015-05-13,7.86
2015-05-14,7.99
2015-05-15,7.97
2015-05-18,8.11
2015-05-19,8.26
2015-05-20,8.21
2015-05-21,8.26
2015-05-22,8.83
2015-05-26,8.36
2015-05-27,8.39
2015-05-28,8.58
2015-05-29,8.41
2015-06-01,8.34
2015-06-02,8.42
2015-06-03,8.6
2015-06-04,9.03
2015-06-05,8.7
2015-06-08,8.755
2015-06-09,8.83
2015-06-10,8.855
2015-06-11,8.93
2015-06-12,8.62
2015-06-15,8.5
2015-06-16,8.63
2015-06-17,8.68
2015-06-18,8.73
2015-06-19,8.92
2015-06-22,8.98
2015-06-23,9.09
2015-06-24,8.795
2015-06-25,8.38
2015-06-26,8.5
2015-06-29,7.99
2015-06-30,8.16
2015-07-01,8.14
2015-07-02,7.92
2015-07-06,7.87
2015-07-07,7.65
2015-07-08,7.04
2015-07-09,7.27
2015-07-10,7.46
2015-07-13,7.6
2015-07-14,7.88
2015-07-15,7.76
2015-07-16,7.71
2015-07-17,7.67
2015-07-20,7.5
2015-07-21,7.31
2015-07-22,7.32
2015-07-23,7.23
2015-07-24,7.06
2015-07-27,7.18
2015-07-28,7.4
2015-07-29,7.4
2015-07-30,7.21
2015-07-31,7.29
2015-08-03,7.25
2015-08-04,7.15
2015-08-05,7.18
2015-08-06,6.8
2015-08-07,6.49
2015-08-10,8.19
2015-08-11,7.82
2015-08-12,7.82
2015-08-13,7.34
2015-08-14,7.37
2015-08-17,7.88
2015-08-18,7.44
2015-08-19,7.64
2015-08-20,7.05
2015-08-21,7.035
2015-08-24,6.54
2015-08-25,6.59
2015-08-26,6.8
2015-08-27,6.98
2015-08-28,7.73
2015-08-31,7.49
2015-09-01,7.1
2015-09-02,7.23
2015-09-03,7.09
2015-09-04,7.11
2015-09-08,7.15
2015-09-09,6.9
2015-09-10,7.11
2015-09-11,7.34
2015-09-14,7.35
2015-09-15,7.47
2015-09-16,7.47
2015-09-17,7.64
2015-09-18,7.39
2015-09-21,7.29
2015-09-22,7.19
2015-09-23,7.08
2015-09-24,7.17
2015-09-25,6.57
2015-09-28,6.12
2015-09-29,5.69
2015-09-30,5.78
2015-10-01,5.68
2015-10-02,5.91
2015-10-05,6.15
2015-10-06,5.82
2015-10-07,6.02
2015-10-08,5.96
2015-10-09,6.16
2015-10-12,5.91
2015-10-13,5.65
2015-10-14,5.9
2015-10-15,6.29
2015-10-16,6.23
2015-10-19,6.26
2015-10-20,6.28
2015-10-21,6.24
2015-10-22,6.39
2015-10-23,6.61
2015-10-26,6.57
2015-10-27,6.43
2015-10-28,6.67
2015-10-29,6.46
2015-10-30,6.33
2015-11-02,6.66
2015-11-03,6.6
2015-11-04,6.58
2015-11-05,6.82
2015-11-06,6.73
2015-11-09,7.02
2015-11-10,6.94
2015-11-11,7.11
2015-11-12,7.05
2015-11-13,7.08
2015-11-16,6.94
2015-11-17,6.87
2015-11-18,6.73
2015-11-19,6.81
2015-11-20,6.8
2015-11-23,6.88
2015-11-24,7.07
2015-11-25,7.23
2015-11-27,7.36
2015-11-30,7.41
2015-12-01,7.35
2015-12-02,7.3
2015-12-03,6.94
2015-12-04,7.12
2015-12-07,6.77
2015-12-08,6.71
2015-12-09,6.7
2015-12-10,6.69
2015-12-11,6.22
2015-12-14,6.14
2015-12-15,6.26
2015-12-16,6.63
2015-12-17,6.62
2015-12-18,6.87
2015-12-21,6.89
2015-12-22,6.95
2015-12-23,6.94
2015-12-24,7.07
2015-12-28,7.03
2015-12-29,7.08
2015-12-30,7
2015-12-31,6.72
2016-01-04,6.4
2016-01-05,6.3
2016-01-06,6.12
2016-01-07,5.75
2016-01-08,5.76
2016-01-11,5.35
2016-01-12,5.54
2016-01-13,5.17
2016-01-14,5.16
2016-01-15,5.21
2016-01-19,4.92
2016-01-20,4.99
2016-01-21,5.06
2016-01-22,5.07
2016-01-25,5.14
2016-01-26,5.24
2016-01-27,5.37
2016-01-28,5.78
2016-01-29,6.68
2016-02-01,6.73
2016-02-02,6.5
2016-02-03,6.04
2016-02-04,6.26
2016-02-05,6.01
2016-02-08,6
2016-02-09,5.84
2016-02-10,5.78
2016-02-11,6.19
2016-02-12,6.27
2016-02-16,6.57
2016-02-17,6.92
2016-02-18,6.45
2016-02-19,6.45
2016-02-22,6.68
2016-02-23,6.44
2016-02-24,6.45
2016-02-25,6.48
2016-02-26,6.5
2016-02-29,6.3
2016-03-01,6.58
2016-03-02,6.97
2016-03-03,7.04
2016-03-04,7
2016-03-07,7.48
2016-03-08,6.9
2016-03-09,7.02
2016-03-10,6.7
2016-03-11,6.88
2016-03-14,6.68
2016-03-15,6.54
2016-03-16,6.58
2016-03-17,6.98
2016-03-18,7.12
2016-03-21,7.25
2016-03-22,7.85
2016-03-23,7.62
2016-03-24,7.9
2016-03-28,8.02
2016-03-29,8.14
2016-03-30,8.63
2016-03-31,8.71
2016-04-01,9.25
2016-04-04,9.66
2016-04-05,8.89
2016-04-06,9.48
2016-04-07,9.34
2016-04-08,9.21
2016-04-11,9.05
2016-04-12,9.3
2016-04-13,9.28
2016-04-14,9.53
2016-04-15,9.49
2016-04-18,10.07
2016-04-19,10
2016-04-20,9.74
2016-04-21,10.19
2016-04-22,10.33
2016-04-25,10.49
2016-04-26,10.47
2016-04-27,10.93
2016-04-28,11.18
2016-04-29,10.48
2016-05-02,10.88
2016-05-03,10.36
2016-05-04,9.39
2016-05-05,9.08
2016-05-06,8.96
2016-05-09,9.52
2016-05-10,9.38
2016-05-11,9.49
2016-05-12,9.39
2016-05-13,9.33
2016-05-16,9.93
2016-05-17,10.06
2016-05-18,10.31
2016-05-19,10.1
2016-05-20,10.45
2016-05-23,10.81
2016-05-24,11.13
2016-05-25,11.16
2016-05-26,10.69
2016-05-27,10.61
2016-05-31,11.32
2016-06-01,11.23
2016-06-02,11.39
2016-06-03,11.08
2016-06-06,11.33
2016-06-07,11.09
2016-06-08,11.24
2016-06-09,11.01
2016-06-10,10.62
2016-06-13,10.2
2016-06-14,10.27
2016-06-15,10.69
2016-06-16,10.74
2016-06-17,10.47
2016-06-20,11.2
2016-06-21,11.26
2016-06-22,10.2
2016-06-23,9.85
2016-06-24,9.17
2016-06-27,8.29
2016-06-28,9.21
2016-06-29,9.43
2016-06-30,9.24
2016-07-01,9.35
2016-07-05,9.17
2016-07-06,9.2
2016-07-07,9.08
2016-07-08,9.11
2016-07-11,9.12
2016-07-12,9.08
2016-07-13,8.68
2016-07-14,8.81
2016-07-15,8.88
2016-07-18,9.09
2016-07-19,8.81
2016-07-20,9.22
2016-07-21,9.05
2016-07-22,9.13
2016-07-25,9.15
2016-07-26,9.55
2016-07-27,9.65
2016-07-28,9.62
2016-07-29,9.88
2016-08-01,10.42
2016-08-02,10.16
2016-08-03,9.6
2016-08-04,9.64
2016-08-05,9.85
2016-08-08,9.35
2016-08-09,9.05
2016-08-10,8.78
2016-08-11,8.96
2016-08-12,8.95
2016-08-15,8.88
2016-08-16,8.76
2016-08-17,8.58
2016-08-18,8.69
2016-08-19,8.57
2016-08-22,9.06
2016-08-23,9.14
2016-08-24,8.57
2016-08-25,8.67
2016-08-26,8.86
2016-08-29,9.27
2016-08-30,9.45
2016-08-31,9.17
2016-09-01,9.14
2016-09-02,9.08
2016-09-06,9
2016-09-07,9.05
2016-09-08,8.94
2016-09-09,8.52
2016-09-12,9.27
2016-09-13,9.22
2016-09-14,9.47
2016-09-15,9.48
2016-09-16,9.24
2016-09-19,9.21
2016-09-20,9.37
2016-09-21,9.8
2016-09-22,9.74
2016-09-23,9.5
2016-09-26,9.44
2016-09-27,9.59
2016-09-28,9.54
2016-09-29,9.26
2016-09-30,9.32
2016-10-03,9.52
2016-10-04,9.4
2016-10-05,9.43
2016-10-06,9.36
2016-10-07,9.34
2016-10-10,9.5
2016-10-11,9.07
2016-10-12,8.84
2016-10-13,8.75
2016-10-14,8.54
2016-10-17,8.15
2016-10-18,8.27
2016-10-19,8.17
2016-10-20,8.39
2016-10-21,8.36
2016-10-24,6.99
2016-10-25,6.82
2016-10-26,6.8
2016-10-27,6.41
2016-10-28,6.43
2016-10-31,6.47
2016-11-01,6.59
2016-11-02,6.5
2016-11-03,5.98
2016-11-04,6.34
2016-11-07,6.57
2016-11-08,6.57
2016-11-09,7.43
2016-11-10,7.8
2016-11-11,7.82
2016-11-14,8.33
2016-11-15,8.05
2016-11-16,7.77
2016-11-17,8.02
2016-11-18,7.98
2016-11-21,7.96
2016-11-22,7.76
2016-11-23,7.75
2016-11-25,7.68
2016-11-28,7.15
2016-11-29,7.15
2016-11-30,7.08
2016-12-01,6.82
2016-12-02,6.86
2016-12-05,7.08
2016-12-06,7.31
2016-12-07,6.97
2016-12-08,7.13
2016-12-09,7.14
2016-12-12,7.03
2016-12-13,7.06
2016-12-14,6.94
2016-12-15,6.94
2016-12-16,6.92
2016-12-19,6.95
2016-12-20,6.93
2016-12-21,7.03
2016-12-22,6.91
2016-12-23,7.31
2016-12-27,7.19
2016-12-28,7.04
2016-12-29,6.92
2016-12-30,6.94
2017-01-03,7.07
2017-01-04,7.33
2017-01-05,7.38
2017-01-06,7.28
2017-01-09,7.25
2017-01-10,7.18
2017-01-11,7.05
2017-01-12,7.03
2017-01-13,6.98
2017-01-17,6.7
2017-01-18,6.74
2017-01-19,6.58
2017-01-20,6.28
2017-01-23,5.98
2017-01-24,6.19
2017-01-25,6.35
2017-01-26,6.21
2017-01-27,6.38
2017-01-30,6.15
2017-01-31,6.6
2017-02-01,6.52
2017-02-02,6.58
2017-02-03,6.71
2017-02-06,6.52
2017-02-07,6.38
2017-02-08,6.39
2017-02-09,6.5
2017-02-10,6.39
2017-02-13,6.81
2017-02-14,6.86
2017-02-15,7.01
2017-02-16,7
2017-02-17,6.96
2017-02-21,6.8
2017-02-22,6.6
2017-02-23,6.9
2017-02-24,6.68
2017-02-27,7.17
2017-02-28,7.05
2017-03-01,7.07
2017-03-02,6.88
2017-03-03,6.95
2017-03-06,6.84
2017-03-07,6.64
2017-03-08,6.65
2017-03-09,6.61
2017-03-10,6.68
2017-03-13,6.7
2017-03-14,6.61
2017-03-15,6.87
2017-03-16,6.21
2017-03-17,6.13
2017-03-20,6.1
2017-03-21,5.86
2017-03-22,5.92
2017-03-23,5.95
2017-03-24,6.05
2017-03-27,6.26
2017-03-28,6.4
2017-03-29,6.57
2017-03-30,6.54
2017-03-31,6.62
2017-04-03,6.36
2017-04-04,6.25
2017-04-05,6.04
2017-04-06,6.07
2017-04-07,6.26
2017-04-10,6.17
2017-04-11,6.15
2017-04-12,6.07
2017-04-13,6.09
2017-04-17,6.14
2017-04-18,6.12
2017-04-19,6.1
2017-04-20,6.13
2017-04-21,6.27
2017-04-24,6.53
2017-04-25,6.79
2017-04-26,6.67
2017-04-27,6.43
2017-04-28,6.29
2017-05-01,6.37
2017-05-02,6.29
2017-05-03,6.31
2017-05-04,6.56
2017-05-05,6.47
2017-05-08,6.29
2017-05-09,6.38
2017-05-10,6.39
2017-05-11,6.75
2017-05-12,7.14
2017-05-15,7.35
2017-05-16,7.34
2017-05-17,7.22
2017-05-18,7.37
2017-05-19,7.17
2017-05-22,7.09
2017-05-23,7.13
2017-05-24,8.68
2017-05-25,7.99
2017-05-26,7.88
2017-05-30,7.57
2017-05-31,7.55
2017-06-01,7.64
2017-06-02,7.74
2017-06-05,7.47
2017-06-06,7.48
2017-06-07,7.39
2017-06-08,8.19
2017-06-09,8.1
2017-06-12,8.18
2017-06-13,8.2
2017-06-14,8
2017-06-15,7.76
2017-06-16,7.84
2017-06-19,7.99
2017-06-20,7.97
2017-06-21,8.06
2017-06-22,8.08
2017-06-23,8.2
2017-06-26,8.38
2017-06-27,8.12
2017-06-28,8.23
2017-06-29,7.92
2017-06-30,7.84
2017-07-03,8.03
2017-07-05,8.06
2017-07-06,7.77
2017-07-07,7.88
2017-07-10,7.72
2017-07-11,7.8
2017-07-12,7.86
2017-07-13,7.96
2017-07-14,7.96
2017-07-17,7.77
2017-07-18,7.83
2017-07-19,6.78
2017-07-20,6.01
2017-07-21,6.01
2017-07-24,5.96
2017-07-25,5.97
2017-07-26,5.94
2017-07-27,5.51
2017-07-28,5.52
2017-07-31,5.56
2017-08-01,5.56
2017-08-02,5.39
2017-08-03,5.48
2017-08-04,5.63
2017-08-07,5.64
2017-08-08,5.43
2017-08-09,5.63
2017-08-10,5.49
2017-08-11,5.56
2017-08-14,5.64
2017-08-15,5.64
2017-08-16,5.52
2017-08-17,5.36
2017-08-18,5.45
2017-08-21,5.46
2017-08-22,5.56
2017-08-23,5.55
2017-08-24,5.79
2017-08-25,5.61
2017-08-28,5.73
2017-08-29,5.95
2017-08-30,5.86
2017-08-31,5.94
2017-09-01,5.94
2017-09-05,5.81
2017-09-06,5.99
2017-09-07,6.08
2017-09-08,6.05
2017-09-11,6.03
2017-09-12,6
2017-09-13,5.92
2017-09-14,5.92
2017-09-15,5.97
2017-09-18,6
2017-09-19,6.07
2017-09-20,6.05
2017-09-21,6.29
2017-09-22,6.15
2017-09-25,6.29
2017-09-26,6.31
2017-09-27,6.37
2017-09-28,6.31
2017-09-29,6.34
2017-10-02,6.58
2017-10-03,6.51
2017-10-04,6.48
2017-10-05,6.68
2017-10-06,6.65
2017-10-09,6.51
2017-10-10,6.44
2017-10-11,6.29
2017-10-12,6.33
2017-10-13,6.24
2017-10-16,6.21
2017-10-17,6.24
2017-10-18,6.32
2017-10-19,6.25
2017-10-20,6.23
2017-10-23,5.92
2017-10-24,5.79
2017-10-25,5.68
2017-10-26,5.62
2017-10-27,5.83
2017-10-30,5.82
2017-10-31,5.83
2017-11-01,5.7
2017-11-02,5.75
2017-11-03,5.77
2017-11-06,5.66
2017-11-07,5.31
2017-11-08,5.33
2017-11-09,4.43
2017-11-10,4.74
2017-11-13,4.55
2017-11-14,4.31
2017-11-15,4.48
2017-11-16,4.64
2017-11-17,4.72
2017-11-20,4.56
2017-11-21,4.64
2017-11-22,4.59
2017-11-24,4.59
2017-11-27,4.52
2017-11-28,4.63
2017-11-29,4.49
2017-11-30,4.59
2017-12-01,4.58
2017-12-04,4.49
2017-12-05,4.38
2017-12-06,4.38
2017-12-07,4.38
2017-12-08,4.5
2017-12-11,4.5
2017-12-12,4.25
2017-12-13,4.46
2017-12-14,4.28
2017-12-15,4.4
2017-12-18,4.3
2017-12-19,4.33
2017-12-20,4.27
2017-12-21,4.33
2017-12-22,4.32
2017-12-26,4.28
2017-12-27,4.26
2017-12-28,4.14
2017-12-29,4.13
2018-01-02,4.68
2018-01-03,4.57
2018-01-04,4.58
2018-01-05,4.48
2018-01-08,4.32
2018-01-09,4.36
2018-01-10,4.35
2018-01-11,4.47
2018-01-12,4.48
2018-01-16,4.38
2018-01-17,4.4
2018-01-18,4.33
2018-01-19,4.39
2018-01-22,4.64
2018-01-23,5.69
2018-01-24,5.09
2018-01-25,5.135
2018-01-26,5.05
2018-01-29,4.85
2018-01-30,4.72
2018-01-31,4.56
2018-02-01,4.42
2018-02-02,4.25
2018-02-05,4.1
2018-02-06,4.22
2018-02-07,4.26
2018-02-08,4.06
2018-02-09,4.07
2018-02-12,4.05
2018-02-13,4.12
2018-02-14,4.18
2018-02-15,4.11
2018-02-16,4.2
2018-02-20,4.22
2018-02-21,4.22
2018-02-22,4.18
2018-02-23,4.24
2018-02-26,4.28
2018-02-27,4.13
2018-02-28,4.1
2018-03-01,4.08
2018-03-02,4.21
2018-03-05,4.29
2018-03-06,4.39
2018-03-07,4.44
2018-03-08,4.46
2018-03-09,4.51
2018-03-12,4.68
2018-03-13,4.54
2018-03-14,4.47
2018-03-15,4.84
2018-03-16,5.15
2018-03-19,5.11
2018-03-20,5
2018-03-21,5.1
2018-03-22,5.25
2018-03-23,4.77
2018-03-26,4.73
2018-03-27,4.73
2018-03-28,4.71
2018-03-29,4.71
2018-04-02,4.42
2018-04-03,4.62
2018-04-04,4.78
2018-04-05,4.8
2018-04-06,4.62
2018-04-09,4.67
2018-04-10,4.76
2018-04-11,4.9
2018-04-12,5.16
2018-04-13,5.06
2018-04-16,4.9
2018-04-17,5.02
2018-04-18,4.9
2018-04-19,4.63
2018-04-20,4.64
2018-04-23,4.67
2018-04-24,4.56
2018-04-25,4.46
2018-04-26,4.47
2018-04-27,4.44
2018-04-30,4.39
2018-05-01,4.45
2018-05-02,4.5
2018-05-03,4.47
2018-05-04,4.54
2018-05-07,4.61
2018-05-08,4.68
2018-05-09,4.83
2018-05-10,4.39
2018-05-11,4.56
2018-05-14,4.73
2018-05-15,5
2018-05-16,5.1
2018-05-17,5.04
2018-05-18,4.99
2018-05-21,4.81
2018-05-22,4.84
2018-05-23,4.86
2018-05-24,4.84
2018-05-25,4.9
2018-05-29,4.59
2018-05-30,4.68
2018-05-31,4.76
2018-06-01,4.65
2018-06-04,4.62
2018-06-05,4.56
2018-06-06,4.55
2018-06-07,4.46
2018-06-08,4.44
2018-06-11,4.48
2018-06-12,4.5
2018-06-13,4.5
2018-06-14,4.55
2018-06-15,4.49
2018-06-18,4.43
2018-06-19,4.26
2018-06-20,4.35
2018-06-21,4.19
2018-06-22,4.24
2018-06-25,4.09
2018-06-26,4.07
2018-06-27,3.89
2018-06-28,3.88
2018-06-29,3.92
2018-07-02,4.13
2018-07-03,4.2
2018-07-05,4.14
2018-07-06,4.41
2018-07-09,4.46
2018-07-10,4.44
2018-07-11,4.47
2018-07-12,4.47
2018-07-13,4.27
2018-07-16,4.13
2018-07-17,4.29
2018-07-18,4.29
2018-07-19,4.32
2018-07-20,4.32
2018-07-23,4.31
2018-07-24,4.25
2018-07-25,4.25
2018-07-26,4.13
2018-07-27,3.98
2018-07-30,4.06
2018-07-31,4.01
2018-08-01,3.95
2018-08-02,3.97
2018-08-03,3.94
2018-08-06,3.92
2018-08-07,4.02
2018-08-08,4.48
2018-08-09,4.36
2018-08-10,4.46
2018-08-13,4.42
2018-08-14,4.49
2018-08-15,4.43
2018-08-16,4.5
2018-08-17,4.43
2018-08-20,4.39
2018-08-21,4.54
2018-08-22,4.83
2018-08-23,4.97
2018-08-24,5.06
2018-08-27,5.04
2018-08-28,4.83
2018-08-29,5
2018-08-30,5.06
2018-08-31,5.26
2018-09-04,5.43
2018-09-05,5.54
2018-09-06,5.31
2018-09-07,5.38
2018-09-10,5.45
2018-09-11,5.44
2018-09-12,5.39
2018-09-13,5.26
2018-09-14,5.05
2018-09-17,4.82
2018-09-18,4.87
2018-09-19,4.82
2018-09-20,4.9
2018-09-21,4.73
2018-09-24,4.84
2018-09-25,5.05
2018-09-26,5.25
2018-09-27,5.58
2018-09-28,5.56
2018-10-01,5.35
2018-10-02,6.11
2018-10-03,6.07
2018-10-04,5.68
2018-10-05,5.5
2018-10-08,5.37
2018-10-09,5.27
2018-10-10,5.09
2018-10-11,5.21
2018-10-12,5.29
2018-10-15,5.34
2018-10-16,5.58
2018-10-17,5.54
2018-10-18,5.52
2018-10-19,5.44
2018-10-22,5.26
2018-10-23,5.22
2018-10-24,4.79
2018-10-25,5.01
2018-10-26,5.04
2018-10-29,4.93
2018-10-30,4.97
2018-10-31,4.93
2018-11-01,5.06
2018-11-02,5.15
2018-11-05,5.14
2018-11-06,5.03
2018-11-07,5.23
2018-11-08,5.19
2018-11-09,5.29
2018-11-12,4.92
2018-11-13,4.84
2018-11-14,4.91
2018-11-15,5.03
2018-11-16,5.12
2018-11-19,5.01
2018-11-20,5.03
2018-11-21,5.13
2018-11-23,5.17
2018-11-26,5.3
2018-11-27,5.26
2018-11-28,5.43
2018-11-29,5.35
2018-11-30,5.35
2018-12-03,5.41
2018-12-04,5.22
2018-12-06,5.26
2018-12-07,5.16
2018-12-10,5.19
2018-12-11,5.19
2018-12-12,5.31
2018-12-13,5.1
2018-12-14,4.86
2018-12-17,4.72
2018-12-18,4.52
2018-12-19,4.45
2018-12-20,4.25
2018-12-21,3.89
2018-12-24,3.92
2018-12-26,4.07
2018-12-27,3.96
2018-12-28,4
2018-12-31,4
2019-01-02,4.22
2019-01-03,4.28
2019-01-04,4.6
2019-01-07,4.93
2019-01-08,4.75
2019-01-09,4.74
2019-01-10,4.76
2019-01-11,4.84
2019-01-14,4.51
2019-01-15,4.73
2019-01-16,4.91
2019-01-17,5.08
2019-01-18,5.09
2019-01-22,5
2019-01-23,4.78
2019-01-24,5.01
2019-01-25,5.1
2019-01-28,4.81
2019-01-29,4.71
2019-01-30,5.04
2019-01-31,5.01
2019-02-01,4.96
2019-02-04,4.85
2019-02-05,4.69
2019-02-06,4.68
2019-02-07,4.68
2019-02-08,4.61
2019-02-11,4.63
2019-02-12,4.69
2019-02-13,4.68
2019-02-14,3.69
2019-02-15,3.7
2019-02-19,3.69
2019-02-20,3.75
2019-02-21,3.71
2019-02-22,3.73
2019-02-25,3.78
2019-02-26,3.74
2019-02-27,3.73
2019-02-28,3.66
2019-03-01,3.79
2019-03-04,3.67
2019-03-05,3.61
2019-03-06,3.42
2019-03-07,3.55
2019-03-08,3.34
2019-03-11,3.52
2019-03-12,3.56
2019-03-13,3.65
2019-03-14,3.62
2019-03-15,3.52
2019-03-18,3.52
2019-03-19,3.6
2019-03-20,3.6
2019-03-21,3.72
2019-03-22,3.62
2019-03-25,3.62
2019-03-26,3.73
2019-03-27,3.62
2019-03-28,3.64
2019-03-29,3.73
2019-04-01,3.69
2019-04-02,3.7
2019-04-03,3.86
2019-04-04,3.89
2019-04-05,3.96
2019-04-08,4.03
2019-04-09,3.93
2019-04-10,4.04
2019-04-11,4.08
2019-04-12,4.1
2019-04-15,3.99
2019-04-16,3.93
2019-04-17,3.72
2019-04-18,3.73
2019-04-22,3.8
2019-04-23,3.86
2019-04-24,3.8
2019-04-25,3.84
2019-04-26,3.92
2019-04-29,3.82
2019-04-30,3.76
2019-05-01,3.68
2019-05-02,3.74
2019-05-03,3.89
2019-05-06,3.95
2019-05-07,3.71
2019-05-08,3.9
2019-05-09,3.87
2019-05-10,3.73
2019-05-13,3.57
2019-05-14,3.54
2019-05-15,3.49
2019-05-16,3.42
2019-05-17,3.34
2019-05-20,3.31
2019-05-21,3.45
2019-05-22,3.35
2019-05-23,3.25
2019-05-24,3.26
2019-05-28,3.14
2019-05-29,3.06
2019-05-30,2.81
2019-05-31,2.39
2019-06-03,2.37
2019-06-04,2.5
2019-06-05,2.37
2019-06-06,2.29
2019-06-07,2.45
2019-06-10,2.49
2019-06-11,2.43
2019-06-12,2.49
2019-06-13,2.505
2019-06-14,2.425
2019-06-17,2.55
2019-06-18,2.645
2019-06-19,2.615
2019-06-20,2.665
2019-06-21,2.645
2019-06-24,2.415
2019-06-25,2.535
2019-06-26,3.035
2019-06-27,2.885
2019-06-28,2.955
2019-07-01,3.005
2019-07-02,2.995
2019-07-03,3.015
2019-07-04,3.015
2019-07-05,3.005
2019-07-08,2.985
2019-07-09,3.005
2019-07-10,3.005
2019-07-11,2.945
2019-07-12,2.995
2019-07-15,2.95
2019-07-16,2.995
2019-07-17,2.695
2019-07-18,2.875
2019-07-19,2.795
2019-07-22,2.815
2019-07-23,2.685
2019-07-24,2.765
2019-07-25,2.685
2019-07-26,2.785
2019-07-29,2.795
2019-07-30,2.825
2019-07-31,2.775
2019-08-01,2.745
2019-08-02,2.655
2019-08-05,2.715
2019-08-06,2.555
2019-08-07,2.525
2019-08-08,2.55
2019-08-09,2.505
2019-08-12,2.375
2019-08-13,2.365
2019-08-14,2.285
2019-08-15,2.19
2019-08-16,2.385
2019-08-19,2.445
2019-08-20,2.425
2019-08-21,2.365
2019-08-22,2.305
2019-08-23,2.185
2019-08-26,2.175
2019-08-27,2.135
2019-08-28,2.205
2019-08-29,2.195
2019-08-30,2.17
2019-09-02,2.165
2019-09-03,2.075
2019-09-04,2.075
2019-09-05,2.145
2019-09-06,2.115
2019-09-09,2.19
2019-09-10,2.415
2019-09-11,2.61
2019-09-12,2.625
2019-09-13,2.575
2019-09-16,2.685
2019-09-17,2.515
2019-09-18,2.515
2019-09-19,2.435
2019-09-20,2.485
2019-09-23,2.335
2019-09-24,2.205
2019-09-25,2.155
2019-09-26,2.1
2019-09-27,2.115
2019-09-30,2.045
2019-10-01,1.975
2019-10-02,2.045
2019-10-03,2.06
2019-10-04,2.1
2019-10-07,2.095
2019-10-08,2.045
2019-10-09,2.055
2019-10-10,2.165
2019-10-11,2.19
2019-10-14,2.125
2019-10-15,2.25
2019-10-16,2.505
2019-10-17,2.365
2019-10-18,2.26
2019-10-21,2.315
2019-10-22,2.265
2019-10-23,2.32
2019-10-24,2.305
2019-10-25,2.37
2019-10-28,2.305
2019-10-29,2.195
2019-10-30,2.195
2019-10-31,2.135
2019-11-01,2.275
2019-11-04,2.385
2019-11-05,2.515
2019-11-06,2.505
2019-11-07,2.575
2019-11-08,2.525
2019-11-11,2.45
2019-11-12,2.43
2019-11-13,2.285
2019-11-14,2.205
2019-11-15,2.355
2019-11-18,2.285
2019-11-19,2.375
2019-11-20,2.445
2019-11-21,2.495
2019-11-22,2.485
2019-11-25,2.615
