date,close
2014-06-13,7.8037
2014-06-16,7.7549
2014-06-17,7.7468
2014-06-18,7.763
2014-06-19,7.7468
2014-06-20,7.7468
2014-06-23,7.7875
2014-06-24,7.7875
2014-06-25,7.8119
2014-06-26,7.8444
2014-06-27,7.8607
2014-06-30,7.8444
2014-07-01,7.8159
2014-07-02,7.7061
2014-07-03,7.6247
2014-07-07,7.6491
2014-07-08,7.6817
2014-07-09,7.6328
2014-07-10,7.6328
2014-07-11,7.6623
2014-07-14,7.6459
2014-07-15,7.6132
2014-07-16,7.6459
2014-07-17,7.6868
2014-07-18,7.6868
2014-07-21,7.7113
2014-07-22,7.6786
2014-07-23,7.7194
2014-07-24,7.7113
2014-07-25,7.7194
2014-07-28,7.7276
2014-07-29,7.7358
2014-07-30,7.6459
2014-07-31,7.6132
2014-08-01,7.6132
2014-08-04,7.6132
2014-08-05,7.6051
2014-08-06,7.6296
2014-08-07,7.6541
2014-08-08,7.6541
2014-08-11,7.6704
2014-08-12,7.6541
2014-08-13,7.6836
2014-08-14,7.6754
2014-08-15,7.6754
2014-08-18,7.6754
2014-08-19,7.6836
2014-08-20,7.7
2014-08-21,7.6918
2014-08-22,7.6918
2014-08-25,7.7
2014-08-26,7.6836
2014-08-27,7.741
2014-08-28,7.7902
2014-08-29,7.7984
2014-09-02,7.8148
2014-09-03,7.8476
2014-09-04,7.8394
2014-09-05,7.823
2014-09-08,7.8148
2014-09-09,7.8148
2014-09-10,7.8312
2014-09-11,7.8185
2014-09-12,7.7526
2014-09-15,7.7444
2014-09-16,7.7279
2014-09-17,7.7032
2014-09-18,7.7773
2014-09-19,7.7773
2014-09-22,7.7197
2014-09-23,7.7362
2014-09-24,7.7115
2014-09-25,7.7279
2014-09-26,7.695
2014-09-29,7.7032
2014-09-30,7.7444
2014-10-01,7.7691
2014-10-02,7.7773
2014-10-03,7.7855
2014-10-06,7.7773
2014-10-07,7.8102
2014-10-08,7.8267
2014-10-09,7.802
2014-10-10,7.7975
2014-10-13,7.8222
2014-10-14,7.814
2014-10-15,7.8057
2014-10-16,7.7923
2014-10-17,7.847
2014-10-20,7.8553
2014-10-21,7.8635
2014-10-22,7.8801
2014-10-23,7.9214
2014-10-24,7.9131
2014-10-27,7.9214
2014-10-28,7.9131
2014-10-29,7.9131
2014-10-30,7.9544
2014-10-31,7.9618
2014-11-03,7.9544
2014-11-04,7.9874
2014-11-05,7.9544
2014-11-06,7.9957
2014-11-07,8.004
2014-11-10,7.9916
2014-11-11,7.9709
2014-11-12,7.9745
2014-11-13,7.958
2014-11-14,7.9165
2014-11-17,7.8875
2014-11-18,7.8916
2014-11-19,7.8834
2014-11-20,7.8751
2014-11-21,7.8419
2014-11-24,7.8419
2014-11-25,7.8834
2014-11-26,7.9165
2014-11-28,7.9331
2014-12-01,7.9372
2014-12-02,7.958
2014-12-03,7.958
2014-12-04,7.9953
2014-12-05,7.9911
2014-12-08,8.0326
2014-12-09,7.991
2014-12-10,7.9911
2014-12-11,7.954
2014-12-12,7.9374
2014-12-15,7.9207
2014-12-16,7.9623
2014-12-17,7.979
2014-12-18,8.0372
2014-12-19,8.0455
2014-12-22,8.0289
2014-12-23,7.9873
2014-12-24,7.9873
2014-12-26,8.0122
2014-12-29,8.0122
2014-12-30,7.9873
2014-12-31,8.0289
2015-01-02,8.0289
2015-01-05,8.0871
2015-01-06,8.1287
2015-01-07,8.1703
2015-01-08,8.1454
2015-01-09,8.2119
2015-01-12,8.2452
2015-01-13,8.2072
2015-01-14,8.2323
2015-01-15,8.3074
2015-01-16,8.3325
2015-01-20,8.3158
2015-01-21,8.3158
2015-01-22,8.3325
2015-01-23,8.3241
2015-01-26,8.3629
2015-01-27,8.4159
2015-01-28,8.4076
2015-01-29,8.4493
2015-01-30,8.4994
2015-02-02,8.5328
2015-02-03,8.4577
2015-02-04,8.441
2015-02-05,8.4326
2015-02-06,8.2991
2015-02-09,8.249
2015-02-10,8.2072
2015-02-11,8.2445
2015-02-12,8.278
2015-02-13,8.2613
2015-02-17,8.1537
2015-02-18,8.2445
2015-02-19,8.278
2015-02-20,8.3534
2015-02-23,8.278
2015-02-24,8.3367
2015-02-25,8.3702
2015-02-26,8.3534
2015-02-27,8.3786
2015-03-02,8.3534
2015-03-03,8.3618
2015-03-04,8.3869
2015-03-05,8.3953
2015-03-06,8.2696
2015-03-09,8.278
2015-03-10,8.345
2015-03-11,8.3446
2015-03-12,8.3236
2015-03-13,8.3572
2015-03-16,8.3236
2015-03-17,8.2395
2015-03-18,8.3152
2015-03-19,8.29
2015-03-20,8.3068
2015-03-23,8.3488
2015-03-24,8.3909
2015-03-25,8.3236
2015-03-26,8.2648
2015-03-27,8.2984
2015-03-30,8.3068
2015-03-31,8.3236
2015-04-01,8.3656
2015-04-02,8.3236
2015-04-06,8.3236
2015-04-07,8.332
2015-04-08,8.3488
2015-04-09,8.332
2015-04-10,8.3236
2015-04-13,8.3274
2015-04-14,8.3527
2015-04-15,8.3696
2015-04-16,8.4033
2015-04-17,8.4118
2015-04-20,8.4287
2015-04-21,8.4371
2015-04-22,8.3949
2015-04-23,8.3527
2015-04-24,8.3358
2015-04-27,8.3105
2015-04-28,8.3358
2015-04-29,8.3358
2015-04-30,8.3274
2015-05-01,8.3021
2015-05-04,8.2937
2015-05-05,8.2515
2015-05-06,8.2262
2015-05-07,8.2093
2015-05-08,8.2515
2015-05-11,8.2177
2015-05-12,8.2346
2015-05-13,8.213
2015-05-14,8.2215
2015-05-15,8.2723
2015-05-18,8.2215
2015-05-19,8.213
2015-05-20,8.213
2015-05-21,8.213
2015-05-22,8.1791
2015-05-26,8.1876
2015-05-27,8.1961
2015-05-28,8.1707
2015-05-29,8.213
2015-06-01,8.2299
2015-06-02,8.2299
2015-06-03,8.1707
2015-06-04,8.1876
2015-06-05,8.0267
2015-06-08,7.9421
2015-06-09,7.8997
2015-06-10,7.9421
2015-06-11,7.9697
2015-06-12,8.0546
2015-06-15,8.1141
2015-06-16,8.1651
2015-06-17,8.1821
2015-06-18,8.2161
2015-06-19,8.2331
2015-06-22,8.2416
2015-06-23,8.1736
2015-06-24,8.1566
2015-06-25,8.1736
2015-06-26,8.1651
2015-06-29,8.1566
2015-06-30,8.1821
2015-07-01,8.1736
2015-07-02,8.1821
2015-07-06,8.2076
2015-07-07,8.2331
2015-07-08,8.2416
2015-07-09,8.2246
2015-07-10,8.2416
2015-07-13,8.2352
2015-07-14,8.1926
2015-07-15,8.2181
2015-07-16,8.2309
2015-07-17,8.2267
2015-07-20,8.2267
2015-07-21,8.2096
2015-07-22,8.1926
2015-07-23,8.2267
2015-07-24,8.184
2015-07-27,8.2195
2015-07-28,8.2096
2015-07-29,8.2352
2015-07-30,8.2608
2015-07-31,8.3034
2015-08-03,8.2778
2015-08-04,8.2522
2015-08-05,8.1926
2015-08-06,8.2437
2015-08-07,8.2522
2015-08-10,8.2437
2015-08-11,8.3034
2015-08-12,8.2884
2015-08-13,8.2799
2015-08-14,8.2713
2015-08-17,8.2799
2015-08-18,8.3312
2015-08-19,8.3055
2015-08-20,8.3141
2015-08-21,8.3226
2015-08-24,8.2799
2015-08-25,8.2542
2015-08-26,8.2542
2015-08-27,8.3226
2015-08-28,8.2995
2015-08-31,8.3055
2015-09-01,8.297
2015-09-02,8.3098
2015-09-03,8.3312
2015-09-04,8.3483
2015-09-08,8.3055
2015-09-09,8.3397
2015-09-10,8.3483
2015-09-11,8.359
2015-09-14,8.3161
2015-09-15,8.2646
2015-09-16,8.3419
2015-09-17,8.3676
2015-09-18,8.3848
2015-09-21,8.359
2015-09-22,8.3848
2015-09-23,8.4105
2015-09-24,8.3933
2015-09-25,8.4105
2015-09-28,8.4019
2015-09-29,8.4277
2015-09-30,8.4191
2015-10-01,8.4191
2015-10-02,8.4448
2015-10-05,8.4534
2015-10-06,8.462
2015-10-07,8.4363
2015-10-08,8.462
2015-10-09,8.462
2015-10-12,8.4792
2015-10-13,8.5244
2015-10-14,8.4985
2015-10-15,8.4555
2015-10-16,8.4555
2015-10-19,8.4555
2015-10-20,8.4641
2015-10-21,8.4985
2015-10-22,8.533
2015-10-23,8.5846
2015-10-26,8.5932
2015-10-27,8.6277
2015-10-28,8.6105
2015-10-29,8.6277
2015-10-30,8.6707
2015-11-02,8.6363
2015-11-03,8.6105
2015-11-04,8.6363
2015-11-05,8.5588
2015-11-06,8.4813
2015-11-09,8.4296
2015-11-10,8.4491
2015-11-11,8.4664
2015-11-12,8.4923
2015-11-13,8.4836
2015-11-16,8.5096
2015-11-17,8.4664
2015-11-18,8.5355
2015-11-19,8.5182
2015-11-20,8.5612
2015-11-23,8.5873
2015-11-24,8.5355
2015-11-25,8.6046
2015-11-27,8.6435
2015-11-30,8.6564
2015-12-01,8.6564
2015-12-02,8.6737
2015-12-03,8.6046
2015-12-04,8.6392
2015-12-07,8.57
2015-12-08,8.6651
2015-12-09,8.6823
2015-12-10,8.6996
2015-12-11,8.6514
2015-12-14,8.5821
2015-12-15,8.5647
2015-12-16,8.5734
2015-12-17,8.6774
2015-12-18,8.7183
2015-12-21,8.7294
2015-12-22,8.7034
2015-12-23,8.7468
2015-12-24,8.7728
2015-12-28,8.8335
2015-12-29,8.7815
2015-12-30,8.8681
2015-12-31,8.8248
2016-01-04,8.8248
2016-01-05,8.8421
2016-01-06,8.8855
2016-01-07,8.8855
2016-01-08,8.8855
2016-01-11,8.8335
2016-01-12,8.8248
2016-01-13,8.7922
2016-01-14,8.7922
2016-01-15,8.7748
2016-01-19,8.7922
2016-01-20,8.7313
2016-01-21,8.7922
2016-01-22,8.8705
2016-01-25,8.8618
2016-01-26,8.8531
2016-01-27,8.8879
2016-01-28,8.94
2016-01-29,8.94
2016-02-01,8.9313
2016-02-02,8.9748
2016-02-03,8.9487
2016-02-04,9.0096
2016-02-05,8.9922
2016-02-08,8.9835
2016-02-09,9.0444
2016-02-10,9.0466
2016-02-11,9.0204
2016-02-12,8.9419
2016-02-16,8.8459
2016-02-17,8.8721
2016-02-18,8.907
2016-02-19,8.9419
2016-02-22,8.8983
2016-02-23,8.9593
2016-02-24,8.9942
2016-02-25,8.9506
2016-02-26,8.9419
2016-02-29,8.9942
2016-03-01,8.9855
2016-03-02,8.9768
2016-03-03,8.9419
2016-03-04,8.8721
2016-03-07,8.8895
2016-03-08,8.907
2016-03-09,8.8895
2016-03-10,8.9244
2016-03-11,8.9091
2016-03-14,8.8916
2016-03-15,8.9004
2016-03-16,8.9441
2016-03-17,8.9791
2016-03-18,8.9529
2016-03-21,8.9879
2016-03-22,9.0491
2016-03-23,9.0229
2016-03-24,9.0404
2016-03-28,8.9704
2016-03-29,9.0929
2016-03-30,9.1017
2016-03-31,9.1717
2016-04-01,9.1367
2016-04-04,9.1017
2016-04-05,9.1804
2016-04-06,9.1717
2016-04-07,9.1804
2016-04-08,9.1629
2016-04-11,9.1979
2016-04-12,9.233
2016-04-13,9.2001
2016-04-14,9.2089
2016-04-15,9.2001
2016-04-18,9.2352
2016-04-19,9.2615
2016-04-20,9.2703
2016-04-21,9.2703
2016-04-22,9.2791
2016-04-25,9.2001
2016-04-26,9.1474
2016-04-27,9.2177
2016-04-28,9.1825
2016-04-29,9.2352
2016-05-02,9.1738
2016-05-03,9.244
2016-05-04,9.1825
2016-05-05,9.2352
2016-05-06,9.244
2016-05-09,9.2528
2016-05-10,9.2177
2016-05-11,9.2992
2016-05-12,9.2992
2016-05-13,9.2992
2016-05-16,9.2992
2016-05-17,9.2552
2016-05-18,9.1583
2016-05-19,9.079
2016-05-20,9.0967
2016-05-23,9.1671
2016-05-24,9.1231
2016-05-25,9.1495
2016-05-26,9.2728
2016-05-27,9.2023
2016-05-31,9.1583
2016-06-01,9.2023
2016-06-02,9.2199
2016-06-03,9.2199
2016-06-06,9.2199
2016-06-07,9.2728
2016-06-08,9.2904
2016-06-09,9.2904
2016-06-10,9.3438
2016-06-13,9.3985
2016-06-14,9.3455
2016-06-15,9.3279
2016-06-16,9.425
2016-06-17,9.3985
2016-06-20,9.3544
2016-06-21,9.425
2016-06-22,9.3985
2016-06-23,9.3897
2016-06-24,9.4957
2016-06-27,9.425
2016-06-28,9.531
2016-06-29,9.5575
2016-06-30,9.5575
2016-07-01,9.5487
2016-07-05,9.584
2016-07-06,9.5664
2016-07-07,9.5929
2016-07-08,9.5664
2016-07-11,9.5399
2016-07-12,9.4428
2016-07-13,9.2944
2016-07-14,9.1969
2016-07-15,9.2412
2016-07-18,9.3741
2016-07-19,9.4273
2016-07-20,9.4716
2016-07-21,9.5159
2016-07-22,9.4893
2016-07-25,9.4007
2016-07-26,9.4184
2016-07-27,9.4538
2016-07-28,9.4627
2016-07-29,9.4627
2016-08-01,9.4893
2016-08-02,9.4716
2016-08-03,9.5336
2016-08-04,9.5247
2016-08-05,9.5159
2016-08-08,9.5425
2016-08-09,9.5247
2016-08-10,9.5603
2016-08-11,9.5269
2016-08-12,9.5625
2016-08-15,9.518
2016-08-16,9.4914
2016-08-17,9.5092
2016-08-18,9.5269
2016-08-19,9.5625
2016-08-22,9.5358
2016-08-23,9.4647
2016-08-24,9.4647
2016-08-25,9.4381
2016-08-26,9.4203
2016-08-29,9.518
2016-08-30,9.4469
2016-08-31,9.4558
2016-09-01,9.5092
2016-09-02,9.4647
2016-09-06,9.5092
2016-09-07,9.5803
2016-09-08,9.5625
2016-09-09,9.3758
2016-09-12,9.4114
2016-09-13,9.3601
2016-09-14,9.4047
2016-09-15,9.4315
2016-09-16,9.3601
2016-09-19,9.3601
2016-09-20,9.3423
2016-09-21,9.378
2016-09-22,9.3958
2016-09-23,9.3601
2016-09-26,9.4047
2016-09-27,9.476
2016-09-28,9.5117
2016-09-29,9.4493
2016-09-30,9.4404
2016-10-03,9.4582
2016-10-04,9.3423
2016-10-05,9.2799
2016-10-06,9.2532
2016-10-07,9.2443
2016-10-10,9.3512
2016-10-11,9.3156
2016-10-12,9.2552
2016-10-13,9.1658
2016-10-14,9.0227
2016-10-17,8.9154
2016-10-18,8.9422
2016-10-19,9.1121
2016-10-20,9.1479
2016-10-21,9.139
2016-10-24,9.1121
2016-10-25,9.0853
2016-10-26,9.0138
2016-10-27,8.8796
2016-10-28,8.9512
2016-10-31,8.9243
2016-11-01,8.9601
2016-11-02,8.9333
2016-11-03,8.9869
2016-11-04,8.9512
2016-11-07,8.9386
2016-11-08,8.9422
2016-11-09,8.8886
2016-11-10,8.6576
2016-11-11,8.6576
2016-11-14,8.523
2016-11-15,8.5678
2016-11-16,8.6396
2016-11-17,8.5499
2016-11-18,8.4781
2016-11-21,8.5858
2016-11-22,8.5499
2016-11-23,8.532
2016-11-25,8.4871
2016-11-28,8.523
2016-11-29,8.5589
2016-11-30,8.4871
2016-12-01,8.4153
2016-12-02,8.4422
2016-12-05,8.3884
2016-12-06,8.4961
2016-12-07,8.6037
2016-12-08,8.523
2016-12-09,8.5409
2016-12-12,8.523
2016-12-13,8.5902
2016-12-14,8.5722
2016-12-15,8.5452
2016-12-16,8.5452
2016-12-19,8.5542
2016-12-20,8.5722
2016-12-21,8.5812
2016-12-22,8.5452
2016-12-23,8.5272
2016-12-27,8.5182
2016-12-28,8.5182
2016-12-29,8.6623
2016-12-30,8.6083
2017-01-03,8.6263
2017-01-04,8.6353
2017-01-05,8.6893
2017-01-06,8.6983
2017-01-09,8.7433
2017-01-10,8.6893
2017-01-11,8.7096
2017-01-12,8.7638
2017-01-13,8.7638
2017-01-17,8.7548
2017-01-18,8.7277
2017-01-19,8.7006
2017-01-20,8.6916
2017-01-23,8.6916
2017-01-24,8.7006
2017-01-25,8.7458
2017-01-26,8.7458
2017-01-27,8.7909
2017-01-30,8.809
2017-01-31,8.8
2017-02-01,8.818
2017-02-02,8.8
2017-02-03,8.809
2017-02-06,8.8
2017-02-07,8.809
2017-02-08,8.9084
2017-02-09,8.9084
2017-02-10,8.9265
2017-02-13,8.9015
2017-02-14,8.8562
2017-02-15,8.82
2017-02-16,8.7928
2017-02-17,8.7928
2017-02-21,8.8109
2017-02-22,8.8471
2017-02-23,8.8743
2017-02-24,8.9197
2017-02-27,8.9287
2017-02-28,8.9469
2017-03-01,8.9106
2017-03-02,8.8381
2017-03-03,8.7928
2017-03-06,8.8018
2017-03-07,8.8064
2017-03-08,8.7293
2017-03-09,8.6205
2017-03-10,8.6568
2017-03-13,8.6682
2017-03-14,8.6863
2017-03-15,8.7318
2017-03-16,8.7227
2017-03-17,8.8501
2017-03-20,8.841
2017-03-21,8.7682
2017-03-22,8.7773
2017-03-23,8.8228
2017-03-24,8.7682
2017-03-27,8.7864
2017-03-28,8.7773
2017-03-29,8.841
2017-03-30,8.8319
2017-03-31,8.8955
2017-04-03,8.9592
2017-04-04,8.9683
2017-04-05,8.9137
2017-04-06,8.9137
2017-04-07,8.9046
2017-04-10,9.0047
2017-04-11,8.9842
2017-04-12,8.9978
2017-04-13,9.0161
2017-04-17,9.007
2017-04-18,9.0344
2017-04-19,9.0344
2017-04-20,9.0526
2017-04-21,9.0709
2017-04-24,9.0617
2017-04-25,8.9887
2017-04-26,9.0115
2017-04-27,9.0709
2017-04-28,9.1256
2017-05-01,9.1347
2017-05-02,9.1439
2017-05-03,9.153
2017-05-04,9.1439
2017-05-05,9.1439
2017-05-08,9.1028
2017-05-09,9.0891
2017-05-10,9.0982
2017-05-11,9.0639
2017-05-12,9.128
2017-05-15,9.1463
2017-05-16,9.1097
2017-05-17,9.1371
2017-05-18,9.1188
2017-05-19,9.1005
2017-05-22,9.1188
2017-05-23,9.1646
2017-05-24,9.1646
2017-05-25,9.1097
2017-05-26,9.1555
2017-05-30,9.1921
2017-05-31,9.2058
2017-06-01,9.2195
2017-06-02,9.2836
2017-06-05,9.2104
2017-06-06,9.2195
2017-06-07,9.247
2017-06-08,9.2562
2017-06-09,9.2653
2017-06-12,9.2287
2017-06-13,9.2769
2017-06-14,9.2402
2017-06-15,9.2218
2017-06-16,9.2677
2017-06-19,9.2126
2017-06-20,9.2402
2017-06-21,9.2494
2017-06-22,9.2402
2017-06-23,9.2218
2017-06-26,9.2126
2017-06-27,9.2126
2017-06-28,9.2402
2017-06-29,9.1116
2017-06-30,9.1483
2017-07-03,9.231
2017-07-05,9.1943
2017-07-06,9.1667
2017-07-07,9.1575
2017-07-10,9.2218
2017-07-11,9.2402
2017-07-12,9.2333
2017-07-13,9.307
2017-07-14,9.3346
2017-07-17,9.3346
2017-07-18,9.307
2017-07-19,9.307
2017-07-20,9.307
2017-07-21,9.3346
2017-07-24,9.2701
2017-07-25,9.2701
2017-07-26,9.2978
2017-07-27,9.3438
2017-07-28,9.3715
2017-07-31,9.3715
2017-08-01,9.3807
2017-08-02,9.3254
2017-08-03,9.4084
2017-08-04,9.3715
2017-08-07,9.3715
2017-08-08,9.3715
2017-08-09,9.3438
2017-08-10,9.3715
2017-08-11,9.3646
2017-08-14,9.3831
2017-08-15,9.3646
2017-08-16,9.4108
2017-08-17,9.4662
2017-08-18,9.4385
2017-08-21,9.4385
2017-08-22,9.42
2017-08-23,9.4662
2017-08-24,9.4385
2017-08-25,9.4015
2017-08-28,9.42
2017-08-29,9.457
2017-08-30,9.4847
2017-08-31,9.5587
2017-09-01,9.4755
2017-09-05,9.5125
2017-09-06,9.5864
2017-09-07,9.5679
2017-09-08,9.5125
2017-09-11,9.5217
2017-09-12,9.5217
2017-09-13,9.5217
2017-09-14,9.6168
2017-09-15,9.5426
2017-09-18,9.5704
2017-09-19,9.5982
2017-09-20,9.5055
2017-09-21,9.5055
2017-09-22,9.5148
2017-09-25,9.5704
2017-09-26,9.5797
2017-09-27,9.4962
2017-09-28,9.4777
2017-09-29,9.4962
2017-10-02,9.5055
2017-10-03,9.5333
2017-10-04,9.4962
2017-10-05,9.5148
2017-10-06,9.524
2017-10-09,9.524
2017-10-10,9.5426
2017-10-11,9.5333
2017-10-12,9.6125
2017-10-13,9.6125
2017-10-16,9.6219
2017-10-17,9.6032
2017-10-18,9.6219
2017-10-19,9.6405
2017-10-20,9.5845
2017-10-23,9.6219
2017-10-24,9.5379
2017-10-25,9.5099
2017-10-26,9.3699
2017-10-27,9.3792
2017-10-30,9.4632
2017-10-31,9.4445
2017-11-01,9.4819
2017-11-02,9.4632
2017-11-03,9.4912
2017-11-06,9.4725
2017-11-07,9.4819
2017-11-08,9.4725
2017-11-09,9.5285
2017-11-10,9.5005
2017-11-13,9.5379
2017-11-14,9.4955
2017-11-15,9.5331
2017-11-16,9.5049
2017-11-17,9.5519
2017-11-20,9.5049
2017-11-21,9.5143
2017-11-22,9.4861
2017-11-24,9.4767
2017-11-27,9.4767
2017-11-28,9.4767
2017-11-29,9.5049
2017-11-30,9.4861
2017-12-01,9.4955
2017-12-04,9.4861
2017-12-05,9.5519
2017-12-06,9.5612
2017-12-07,9.5894
2017-12-08,9.6176
2017-12-11,9.6176
2017-12-12,9.5049
2017-12-13,9.58
2017-12-14,9.5199
2017-12-15,9.5105
2017-12-18,9.4822
2017-12-19,9.4916
2017-12-20,9.4539
2017-12-21,9.435
2017-12-22,9.4492
2017-12-26,9.4728
2017-12-27,9.5766
2017-12-28,9.586
2017-12-29,9.5577
2018-01-02,9.5577
2018-01-03,9.5624
2018-01-04,9.6049
2018-01-05,9.6332
2018-01-08,9.6426
2018-01-09,9.586
2018-01-10,9.5954
2018-01-11,9.5687
2018-01-12,9.5498
2018-01-16,9.5403
2018-01-17,9.5213
2018-01-18,9.5118
2018-01-19,9.5213
2018-01-22,9.4928
2018-01-23,9.4833
2018-01-24,9.3694
2018-01-25,9.3979
2018-01-26,9.284
2018-01-29,9.1226
2018-01-30,9.1321
2018-01-31,9.1036
2018-02-01,9.1131
2018-02-02,9.0561
2018-02-05,9.0182
2018-02-06,9.0561
2018-02-07,9.1131
2018-02-08,9.0941
2018-02-09,9.0277
2018-02-12,9.0656
2018-02-13,9.1036
2018-02-14,9.076
2018-02-15,9.0474
2018-02-16,9.095
2018-02-20,9.095
2018-02-21,9.1046
2018-02-22,9.0284
2018-02-23,9.0093
2018-02-26,9.076
2018-02-27,9.0474
2018-02-28,9.0093
2018-03-01,9.0188
2018-03-02,8.9998
2018-03-05,9.0236
2018-03-06,8.9998
2018-03-07,8.9903
2018-03-08,8.9712
2018-03-09,9.0093
2018-03-12,8.9998
2018-03-13,8.9903
2018-03-14,9.0008
2018-03-15,8.9817
2018-03-16,8.9626
2018-03-19,8.953
2018-03-20,8.9339
2018-03-21,8.9721
2018-03-22,9.0295
2018-03-23,8.9721
2018-03-26,8.9721
2018-03-27,9.0008
2018-03-28,9.039
2018-03-29,9.0486
2018-04-02,9.0581
2018-04-03,9.0581
2018-04-04,9.0581
2018-04-05,9.0486
2018-04-06,9.0486
2018-04-09,9.0486
2018-04-10,9.0486
2018-04-11,9.0581
2018-04-12,9.0399
2018-04-13,9.0687
2018-04-16,9.0687
2018-04-17,9.0591
2018-04-18,9.0399
2018-04-19,9.0878
2018-04-20,9.0878
2018-04-23,9.0878
2018-04-24,9.0687
2018-04-25,9.083
2018-04-26,9.0974
2018-04-27,9.1262
2018-04-30,9.1262
2018-05-01,9.1454
2018-05-02,9.1262
2018-05-03,9.1454
2018-05-04,9.0974
2018-05-07,9.1166
2018-05-08,9.1454
2018-05-09,9.107
2018-05-10,9.0974
2018-05-11,9.0974
2018-05-14,9.108
2018-05-15,9.0888
2018-05-16,9.0311
2018-05-17,9.0599
2018-05-18,9.0888
2018-05-21,9.0791
2018-05-22,9.0791
2018-05-23,9.0503
2018-05-24,9.0888
2018-05-25,9.1176
2018-05-29,9.1561
2018-05-30,9.1849
2018-05-31,9.1753
2018-06-01,9.1946
2018-06-04,9.1465
2018-06-05,9.1657
2018-06-06,9.1561
2018-06-07,9.2138
2018-06-08,9.2234
2018-06-11,9.2234
2018-06-12,9.1849
2018-06-13,9.1946
2018-06-14,9.2534
2018-06-15,9.2534
2018-06-18,9.2245
2018-06-19,9.2438
2018-06-20,9.2245
2018-06-21,9.2341
2018-06-22,9.2052
2018-06-25,9.1569
2018-06-26,9.1666
2018-06-27,9.1762
2018-06-28,9.2245
2018-06-29,9.2245
2018-07-02,9.2534
2018-07-03,9.2727
2018-07-05,9.1666
2018-07-06,9.1859
2018-07-09,9.1955
2018-07-10,9.1859
2018-07-11,9.1859
2018-07-12,9.1965
2018-07-13,9.1965
2018-07-16,9.1868
2018-07-17,9.1965
2018-07-18,9.1934
2018-07-19,9.2062
2018-07-20,9.2159
2018-07-23,9.1868
2018-07-24,9.1772
2018-07-25,9.1772
2018-07-26,9.1868
2018-07-27,9.1578
2018-07-30,9.1772
2018-07-31,9.1481
2018-08-01,9.1578
2018-08-02,9.1772
2018-08-03,9.1578
2018-08-06,9.1578
2018-08-07,9.1481
2018-08-08,9.1675
2018-08-09,9.1675
2018-08-10,9.1868
2018-08-13,9.2159
2018-08-14,9.1974
2018-08-15,9.2169
2018-08-16,9.2266
2018-08-17,9.2848
2018-08-20,9.2751
2018-08-21,9.2848
2018-08-22,9.2751
2018-08-23,9.2654
2018-08-24,9.2363
2018-08-27,9.2363
2018-08-28,9.2169
2018-08-29,9.2169
2018-08-30,9.2266
2018-08-31,9.2071
2018-09-04,9.2169
2018-09-05,9.2266
2018-09-06,9.246
2018-09-07,9.178
2018-09-10,9.2266
2018-09-11,9.2363
2018-09-12,9.2266
2018-09-13,9.2568
2018-09-14,9.2275
2018-09-17,9.2275
2018-09-18,9.1983
2018-09-19,9.1983
2018-09-20,9.1496
2018-09-21,9.1009
2018-09-24,9.1496
2018-09-25,9.1106
2018-09-26,9.1009
2018-09-27,9.1691
2018-09-28,9.1204
2018-10-01,9.1009
2018-10-02,9.1204
2018-10-03,9.1106
2018-10-04,9.0424
2018-10-05,9.0229
2018-10-08,8.9742
2018-10-09,8.9157
2018-10-10,8.8865
2018-10-11,8.945
2018-10-12,8.9362
2018-10-15,8.9166
2018-10-16,8.9459
2018-10-17,8.9948
2018-10-18,8.9264
2018-10-19,9.0242
2018-10-22,8.9753
2018-10-23,9.0535
2018-10-24,8.9948
2018-10-25,8.9948
2018-10-26,8.9851
2018-10-29,8.9753
2018-10-30,8.9753
2018-10-31,8.9753
2018-11-01,8.9948
2018-11-02,8.9753
2018-11-05,9.0339
2018-11-06,9.0046
2018-11-07,9.0633
2018-11-08,9.0535
2018-11-09,9.0437
2018-11-12,9.0633
2018-11-13,9.0926
2018-11-14,9.0347
2018-11-15,9.0543
2018-11-16,9.0543
2018-11-19,9.0151
2018-11-20,8.9661
2018-11-21,8.9759
2018-11-23,8.9759
2018-11-26,8.9759
2018-11-27,8.9759
2018-11-28,9.0053
2018-11-29,9.0347
2018-11-30,9.0641
2018-12-03,9.1426
2018-12-04,9.2015
2018-12-06,9.2505
2018-12-07,9.2211
2018-12-10,9.2407
2018-12-11,9.2211
2018-12-12,9.1819
2018-12-13,9.1336
2018-12-14,9.1927
2018-12-17,9.114
2018-12-18,9.1533
2018-12-19,9.114
2018-12-20,9.0844
2018-12-21,9.1829
2018-12-24,9.1336
2018-12-26,9.1238
2018-12-27,9.0844
2018-12-28,9.114
2018-12-31,9.1238
2019-01-02,9.2616
2019-01-03,9.3108
2019-01-04,9.3108
2019-01-07,9.3502
2019-01-08,9.3502
2019-01-09,9.36
2019-01-10,9.4486
2019-01-11,9.4092
2019-01-14,9.4497
2019-01-15,9.4793
2019-01-16,9.43
2019-01-17,9.4596
2019-01-18,9.4398
2019-01-22,9.4793
2019-01-23,9.4596
2019-01-24,9.4991
2019-01-25,9.4596
2019-01-28,9.509
2019-01-29,9.4497
2019-01-30,9.4843
2019-01-31,9.5485
2019-02-01,9.509
2019-02-04,9.43
2019-02-05,9.4201
2019-02-06,9.4793
2019-02-07,9.4793
2019-02-08,9.4892
2019-02-11,9.5386
2019-02-12,9.4695
2019-02-13,9.4793
2019-02-14,9.5199
2019-02-15,9.5001
2019-02-19,9.5497
2019-02-20,9.5992
2019-02-21,9.6091
2019-02-22,9.5893
2019-02-25,9.5497
2019-02-26,9.6685
2019-02-27,9.6091
2019-02-28,9.5992
2019-03-01,9.5695
2019-03-04,9.6091
2019-03-05,9.5893
2019-03-06,9.6388
2019-03-07,9.6685
2019-03-08,9.6091
2019-03-11,9.6884
2019-03-12,9.6784
2019-03-13,9.6586
2019-03-14,9.6199
2019-03-15,9.5901
2019-03-18,9.5503
2019-03-19,9.5901
2019-03-20,9.6894
2019-03-21,9.7193
2019-03-22,9.7093
2019-03-25,9.7888
2019-03-26,9.8087
2019-03-27,9.8584
2019-03-28,9.8882
2019-03-29,9.9379
2019-04-01,9.8783
2019-04-02,9.7689
2019-04-03,9.7789
2019-04-04,9.7689
2019-04-05,9.7988
2019-04-08,9.8981
2019-04-09,9.8683
2019-04-10,9.8683
2019-04-11,9.9081
2019-04-12,9.9091
2019-04-15,9.919
2019-04-16,9.7396
2019-04-17,9.8193
2019-04-18,9.8193
2019-04-22,9.8493
2019-04-23,9.8393
2019-04-24,9.8592
2019-04-25,9.8692
2019-04-26,9.919
2019-04-29,9.939
2019-04-30,9.939
2019-05-01,9.9091
2019-05-02,9.9091
2019-05-03,9.8991
2019-05-06,9.9589
2019-05-07,9.939
2019-05-08,9.9489
2019-05-09,9.929
2019-05-10,9.9589
2019-05-13,9.929
2019-05-14,9.92
2019-05-15,9.96
2019-05-16,9.96
2019-05-17,9.98
2019-05-20,9.95
2019-05-21,9.99
2019-05-22,9.96
2019-05-23,9.93
2019-05-24,10
2019-05-28,10.05
2019-05-29,10.01
2019-05-30,10.08
2019-05-31,10.07
2019-06-03,10.15
2019-06-04,10.19
2019-06-05,10.1
2019-06-06,10.09
2019-06-07,10.12
2019-06-10,10.09
2019-06-11,10.11
2019-06-12,10.15
2019-06-13,10.15
2019-06-14,10.16
2019-06-17,10.16
2019-06-18,10.09
2019-06-19,10.09
2019-06-20,10.1
2019-06-21,10.12
2019-06-24,10.22
2019-06-25,10.17
2019-06-26,10.16
2019-06-27,10.185
2019-06-28,10.175
2019-07-01,10.18
2019-07-02,10.2
2019-07-03,10.18
2019-07-04,10.18
2019-07-05,10.14
2019-07-08,10.15
2019-07-09,10.2
2019-07-10,10.23
2019-07-11,10.27
2019-07-12,10.2
2019-07-15,10.175
2019-07-16,10.19
2019-07-17,10.165
2019-07-18,10.17
2019-07-19,10.17
2019-07-22,10.21
2019-07-23,10.16
2019-07-24,10.195
2019-07-25,10.19
2019-07-26,10.2
2019-07-29,10.23
2019-07-30,10.28
2019-07-31,10.315
2019-08-01,10.295
2019-08-02,10.305
2019-08-05,10.345
2019-08-06,10.315
2019-08-07,10.36
2019-08-08,10.38
2019-08-09,10.415
2019-08-12,10.455
2019-08-13,10.47
2019-08-14,10.415
2019-08-15,10.37
2019-08-16,10.435
2019-08-19,10.475
2019-08-20,10.485
2019-08-21,10.505
2019-08-22,10.485
2019-08-23,10.485
2019-08-26,10.52
2019-08-27,10.495
2019-08-28,10.48
2019-08-29,10.58
2019-08-30,10.535
2019-09-02,10.535
2019-09-03,10.575
2019-09-04,10.585
2019-09-05,10.56
2019-09-06,10.535
2019-09-09,10.485
2019-09-10,10.535
2019-09-11,10.475
2019-09-12,10.47
2019-09-13,10.245
2019-09-16,10.275
2019-09-17,10.35
2019-09-18,10.38
2019-09-19,10.375
2019-09-20,10.425
2019-09-23,10.455
2019-09-24,10.455
2019-09-25,10.45
2019-09-26,10.485
2019-09-27,10.47
2019-09-30,10.5
2019-10-01,10.48
2019-10-02,10.48
2019-10-03,10.53
2019-10-04,10.51
2019-10-07,10.46
2019-10-08,10.505
2019-10-09,10.465
2019-10-10,10.515
2019-10-11,10.5
2019-10-14,10.505
2019-10-15,10.48
2019-10-16,10.395
2019-10-17,10.445
2019-10-18,10.455
2019-10-21,10.355
2019-10-22,10.415
2019-10-23,10.425
2019-10-24,10.42
2019-10-25,10.435
2019-10-28,10.415
2019-10-29,10.43
2019-10-30,10.43
2019-10-31,10.44
2019-11-01,10.465
2019-11-04,10.44
2019-11-05,10.45
2019-11-06,10.47
2019-11-07,10.41
2019-11-08,10.44
2019-11-11,10.47
2019-11-12,10.425
2019-11-13,10.465
2019-11-14,10.4
2019-11-15,10.42
2019-11-18,10.47
2019-11-19,10.455
2019-11-20,10.5
2019-11-21,10.46
2019-11-22,10.495
2019-11-25,10.5
