date,close
2016-04-18,31.2
2016-04-19,32.53
2016-04-20,32.58
2016-04-21,32.79
2016-04-22,32.68
2016-04-25,33.05
2016-04-26,33.3
2016-04-27,33.37
2016-04-28,32.72
2016-04-29,32.77
2016-05-02,32.96
2016-05-03,32.87
2016-05-04,32.25
2016-05-05,32.3
2016-05-06,32.7
2016-05-09,32.41
2016-05-10,32.69
2016-05-11,32.27
2016-05-12,32.18
2016-05-13,31.74
2016-05-16,31.95
2016-05-17,31.31
2016-05-18,31.5
2016-05-19,31.21
2016-05-20,31.51
2016-05-23,31.27
2016-05-24,31.84
2016-05-25,31.9
2016-05-26,31.72
2016-05-27,31.99
2016-05-31,31.89
2016-06-01,32.42
2016-06-02,32.18
2016-06-03,32.15
2016-06-06,31.8
2016-06-07,31.69
2016-06-08,31.91
2016-06-09,32.31
2016-06-10,31.88
2016-06-13,31.13
2016-06-14,31
2016-06-15,31.08
2016-06-16,31.26
2016-06-17,30.85
2016-06-20,30.87
2016-06-21,30.24
2016-06-22,30.25
2016-06-23,31.43
2016-06-24,30.56
2016-06-27,29.49
2016-06-28,30.12
2016-06-29,30.72
2016-06-30,31.36
2016-07-01,31.62
2016-07-05,31.66
2016-07-06,31.74
2016-07-07,31.91
2016-07-08,32.44
2016-07-11,32.66
2016-07-12,32.4
2016-07-13,32.66
2016-07-14,33.16
2016-07-15,33.2
2016-07-18,33.4
2016-07-19,33.77
2016-07-20,33.99
2016-07-21,34.18
2016-07-22,34.72
2016-07-25,33.95
2016-07-26,35.3
2016-07-27,35.77
2016-07-28,35.23
2016-07-29,35.75
2016-08-01,35.22
2016-08-02,34.55
2016-08-03,34.3
2016-08-04,34.15
2016-08-05,34.27
2016-08-08,33.64
2016-08-09,33.48
2016-08-10,33.69
2016-08-11,34.09
2016-08-12,33.91
2016-08-15,33.83
2016-08-16,33.94
2016-08-17,33.8
2016-08-18,33.16
2016-08-19,33.02
2016-08-22,32.91
2016-08-23,33.05
2016-08-24,32.59
2016-08-25,33.08
2016-08-26,33.31
2016-08-29,33.46
2016-08-30,33.52
2016-08-31,33.51
2016-09-01,33.54
2016-09-02,33.82
2016-09-06,33.8
2016-09-07,34.25
2016-09-08,34.25
2016-09-09,33.61
2016-09-12,34
2016-09-13,33.51
2016-09-14,33.59
2016-09-15,33.77
2016-09-16,33.195
2016-09-19,33.41
2016-09-20,33.41
2016-09-21,33.77
2016-09-22,33.95
2016-09-23,34
2016-09-26,33.6
2016-09-27,33.68
2016-09-28,33.55
2016-09-29,33.58
2016-09-30,33.98
2016-10-03,34.34
2016-10-04,34.06
2016-10-05,33.64
2016-10-06,33.66
2016-10-07,33.53
2016-10-10,33.33
2016-10-11,32.71
2016-10-12,32.62
2016-10-13,32.59
2016-10-14,32.57
2016-10-17,32.62
2016-10-18,32.95
2016-10-19,33.38
2016-10-20,33.4
2016-10-21,33.57
2016-10-24,33.75
2016-10-25,34.04
2016-10-26,34.01
2016-10-27,33.07
2016-10-28,33.1
2016-10-31,33.27
2016-11-01,32.98
2016-11-02,32.63
2016-11-03,32.37
2016-11-04,32.47
2016-11-07,33.14
2016-11-08,33.54
2016-11-09,33.91
2016-11-10,34.24
2016-11-11,34.6
2016-11-14,35.41
2016-11-15,36.02
2016-11-16,35.84
2016-11-17,36.06
2016-11-18,36.43
2016-11-21,36.47
2016-11-22,36.63
2016-11-23,36.49
2016-11-25,36.51
2016-11-28,35.9
2016-11-29,36.24
2016-11-30,36.3
2016-12-01,36.41
2016-12-02,34.42
2016-12-05,34.58
2016-12-06,35.06
2016-12-07,35.75
2016-12-08,35.89
2016-12-09,35.8
2016-12-12,34.79
2016-12-13,35.23
2016-12-14,35.47
2016-12-15,34.93
2016-12-16,34.67
2016-12-19,34.69
2016-12-20,35.13
2016-12-21,35.18
2016-12-22,35
2016-12-23,34.91
2016-12-27,34.93
2016-12-28,34.54
2016-12-29,34.49
2016-12-30,34.52
2017-01-03,34.5
2017-01-04,34.84
2017-01-05,35.46
2017-01-06,35.02
2017-01-09,35.25
2017-01-10,35.6
2017-01-11,35.3
2017-01-12,35.09
2017-01-13,35.59
2017-01-17,35.19
2017-01-18,35.72
2017-01-19,35.31
2017-01-20,35.52
2017-01-23,35.27
2017-01-24,35.2
2017-01-25,35.34
2017-01-26,36.05
2017-01-27,36.45
2017-01-30,36.26
2017-01-31,36.24
2017-02-01,36.79
2017-02-02,36.44
2017-02-03,36.74
2017-02-06,36.89
2017-02-07,36.56
2017-02-08,36.4
2017-02-09,36.38
2017-02-10,36.25
2017-02-13,36.22
2017-02-14,35.92
2017-02-15,37.54
2017-02-16,37.93
2017-02-17,38.02
2017-02-21,38.93
2017-02-22,39.42
2017-02-23,38.89
2017-02-24,39.05
2017-02-27,39.35
2017-02-28,39.33
2017-03-01,39.64
2017-03-02,39.32
2017-03-03,38.99
2017-03-06,38.84
2017-03-07,38.88
2017-03-08,38.87
2017-03-09,38.53
2017-03-10,38.52
2017-03-13,39.83
2017-03-14,39.74
2017-03-15,39.23
2017-03-16,39.21
2017-03-17,39.57
2017-03-20,39.47
2017-03-21,38.81
2017-03-22,38.21
2017-03-23,38.78
2017-03-24,38.33
2017-03-27,38.35
2017-03-28,38.58
2017-03-29,38.66
2017-03-30,39.19
2017-03-31,38.92
2017-04-03,38.54
2017-04-04,39
2017-04-05,39.29
2017-04-06,39.48
2017-04-07,39.52
2017-04-10,39.25
2017-04-11,38.97
2017-04-12,38.94
2017-04-13,39
2017-04-17,38.83
2017-04-18,38.5
2017-04-19,38.45
2017-04-20,39.18
2017-04-21,39.71
2017-04-24,40.79
2017-04-25,40.74
2017-04-26,39.74
2017-04-27,38.45
2017-04-28,38.1
2017-05-01,38.39
2017-05-02,37.49
2017-05-03,37.56
2017-05-04,37.34
2017-05-05,37.69
2017-05-08,37.29
2017-05-09,37.33
2017-05-10,36.89
2017-05-11,37.03
2017-05-12,36.6
2017-05-15,36.63
2017-05-16,36.72
2017-05-17,36.43
2017-05-18,37.98
2017-05-19,38.63
2017-05-22,38.75
2017-05-23,39.29
2017-05-24,40.2
2017-05-25,40.55
2017-05-26,41.78
2017-05-30,41.28
2017-05-31,41.67
2017-06-01,43.01
2017-06-02,42.9
2017-06-05,42.04
2017-06-06,41.64
2017-06-07,41.54
2017-06-08,41.83
2017-06-09,40.25
2017-06-12,39.97
2017-06-13,40.52
2017-06-14,39.74
2017-06-15,39.95
2017-06-16,39.99
2017-06-19,40.13
2017-06-20,39.71
2017-06-21,40.24
2017-06-22,40.04
2017-06-23,40.83
2017-06-26,40.79
2017-06-27,40.73
2017-06-28,41.44
2017-06-29,41.39
2017-06-30,41.98
2017-07-03,41.3
2017-07-05,41.28
2017-07-06,41.14
2017-07-07,41.31
2017-07-10,40.84
2017-07-11,41.2
2017-07-12,41.42
2017-07-13,41.99
2017-07-14,42.33
2017-07-17,42.07
2017-07-18,41.76
2017-07-19,42.16
2017-07-20,42.46
2017-07-21,42.69
2017-07-24,42.1
2017-07-25,42.24
2017-07-26,42.61
2017-07-27,45.82
2017-07-28,45.76
2017-07-31,46.13
2017-08-01,45.64
2017-08-02,44.83
2017-08-03,44.55
2017-08-04,44
2017-08-07,43.89
2017-08-08,43.95
2017-08-09,43.01
2017-08-10,42.7
2017-08-11,43.24
2017-08-14,43.41
2017-08-15,43.43
2017-08-16,43.27
2017-08-17,42.3
2017-08-18,42.08
2017-08-21,42.59
2017-08-22,43.61
2017-08-23,43.3
2017-08-24,43.37
2017-08-25,43.39
2017-08-28,43.34
2017-08-29,43.45
2017-08-30,44.15
2017-08-31,44.7
2017-09-01,44.53
2017-09-05,43.21
2017-09-06,43.3
2017-09-07,43.02
2017-09-08,42.56
2017-09-11,42.72
2017-09-12,43
2017-09-13,41.8
2017-09-14,41.66
2017-09-15,42.28
2017-09-18,42
2017-09-19,42.04
2017-09-20,42.17
2017-09-21,42.18
2017-09-22,42.63
2017-09-25,42.22
2017-09-26,41.46
2017-09-27,42.26
2017-09-28,41.53
2017-09-29,41.9
2017-10-02,41.64
2017-10-03,42.41
2017-10-04,43.5
2017-10-05,43.67
2017-10-06,43.77
2017-10-09,43.81
2017-10-10,43.14
2017-10-11,44.09
2017-10-12,43.85
2017-10-13,43.45
2017-10-16,43.25
2017-10-17,43.41
2017-10-18,43.55
2017-10-19,43.72
2017-10-20,43.76
2017-10-23,43.25
2017-10-24,43.22
2017-10-25,41.8
2017-10-26,42.12
2017-10-27,42.06
2017-10-30,42.1
2017-10-31,41.71
2017-11-01,41.6
2017-11-02,41.06
2017-11-03,40.85
2017-11-06,40.94
2017-11-07,41.14
2017-11-08,40.89
2017-11-09,40.48
2017-11-10,41.02
2017-11-13,41.83
2017-11-14,40.48
2017-11-15,40.81
2017-11-16,40.78
2017-11-17,41.22
2017-11-20,41
2017-11-21,41.09
2017-11-22,40.83
2017-11-24,40.75
2017-11-27,40.86
2017-11-28,40.5
2017-11-29,40.81
2017-11-30,40.77
2017-12-01,42.12
2017-12-04,42.65
2017-12-05,42.79
2017-12-06,41.8
2017-12-07,42.36
2017-12-08,42.34
2017-12-11,42.63
2017-12-12,42.79
2017-12-13,42.31
2017-12-14,42.25
2017-12-15,39.79
2017-12-18,40.15
2017-12-19,39.61
2017-12-20,39.21
2017-12-21,39.33
2017-12-22,39.77
2017-12-26,40.16
2017-12-27,39.85
2017-12-28,39.8
2017-12-29,39.66
2018-01-02,38.9
2018-01-03,38.82
2018-01-04,39.69
2018-01-05,39.94
2018-01-08,39.86
2018-01-09,39.76
2018-01-10,40.99
2018-01-11,41.1
2018-01-12,41.06
2018-01-16,40.38
2018-01-17,40.54
2018-01-18,40.83
2018-01-19,41.71
2018-01-22,41.93
2018-01-23,42.31
2018-01-24,42.45
2018-01-25,42.87
2018-01-26,43.92
2018-01-29,44.34
2018-01-30,43.86
2018-01-31,45.01
2018-02-01,44.65
2018-02-02,44.4
2018-02-05,43.16
2018-02-06,42.9
2018-02-07,42.88
2018-02-08,41.35
2018-02-09,40.9
2018-02-12,41.34
2018-02-13,41.37
2018-02-14,42.17
2018-02-15,42.18
2018-02-16,42.03
2018-02-20,42.02
2018-02-21,41.82
2018-02-22,41.72
2018-02-23,42.29
2018-02-26,42.4
2018-02-27,41.61
2018-02-28,41.95
2018-03-01,43.09
2018-03-02,43.02
2018-03-05,42.69
2018-03-06,43.72
2018-03-07,43.77
2018-03-08,43.41
2018-03-09,43.72
2018-03-12,43.22
2018-03-13,42.98
2018-03-14,42.71
2018-03-15,42.25
2018-03-16,42.48
2018-03-19,41.61
2018-03-20,41.72
2018-03-21,42.31
2018-03-22,41.11
2018-03-23,40.77
2018-03-26,41.63
2018-03-27,40.65
2018-03-28,40.83
2018-03-29,41.1
2018-04-02,40.16
2018-04-03,40.45
2018-04-04,41.15
2018-04-05,41.18
2018-04-06,41.02
2018-04-09,41.06
2018-04-10,40.81
2018-04-11,40.7
2018-04-12,40.63
2018-04-13,40.08
2018-04-16,40.4
2018-04-17,40.48
2018-04-18,41.09
2018-04-19,41.64
2018-04-20,41.66
2018-04-23,41.58
2018-04-24,41.49
2018-04-25,41.53
2018-04-26,42.21
2018-04-27,41.87
2018-04-30,41.77
2018-05-01,41.76
2018-05-02,41.08
2018-05-03,41.78
2018-05-04,42.25
2018-05-07,42.56
2018-05-08,42.11
2018-05-09,43.28
2018-05-10,43.8
2018-05-11,43.94
2018-05-14,44.38
2018-05-15,44.55
2018-05-16,45.7
2018-05-17,45.23
2018-05-18,46.45
2018-05-21,46.35
2018-05-22,45.77
2018-05-23,45.9
2018-05-24,45.72
2018-05-25,46.01
2018-05-29,45.75
2018-05-30,45.87
2018-05-31,46.25
2018-06-01,46.25
2018-06-04,45.8
2018-06-05,45.43
2018-06-06,46.14
2018-06-07,46.11
2018-06-08,46.03
2018-06-11,45.69
2018-06-12,45.9
2018-06-13,46.02
2018-06-14,46.37
2018-06-15,47.53
2018-06-18,47.85
2018-06-19,47.07
2018-06-20,47.43
2018-06-21,45.65
2018-06-22,46.22
2018-06-25,45.96
2018-06-26,45.32
2018-06-27,44.28
2018-06-28,45.34
2018-06-29,45.05
2018-07-02,46.06
2018-07-03,45.52
2018-07-05,46.32
2018-07-06,46.53
2018-07-09,47.01
2018-07-10,47.03
2018-07-11,46.83
2018-07-12,47.24
2018-07-13,47.42
2018-07-16,47.45
2018-07-17,47.76
2018-07-18,48.16
2018-07-19,48.15
2018-07-20,48.49
2018-07-23,47.75
2018-07-24,46.7
2018-07-25,47.8
2018-07-26,47.98
2018-07-27,47.49
2018-07-30,47.26
2018-07-31,47.14
2018-08-01,46.37
2018-08-02,46.97
2018-08-03,46.8
2018-08-06,47.07
2018-08-07,47
2018-08-08,47.12
2018-08-09,46.85
2018-08-10,46.63
2018-08-13,46.58
2018-08-14,46.25
2018-08-15,46.16
2018-08-16,46.02
2018-08-17,46.19
2018-08-20,46.15
2018-08-21,46.27
2018-08-22,46.26
2018-08-23,45.5
2018-08-24,45.53
2018-08-27,46.05
2018-08-28,45.99
2018-08-29,46.73
2018-08-30,46.71
2018-08-31,46.74
2018-09-04,47.35
2018-09-05,46.02
2018-09-06,46.11
2018-09-07,46.27
2018-09-10,46.73
2018-09-11,46.54
2018-09-12,46.67
2018-09-13,47.03
2018-09-14,46.92
2018-09-17,46.55
2018-09-18,46.84
2018-09-19,46.52
2018-09-20,46.37
2018-09-21,46.08
2018-09-24,41.81
2018-09-25,42.2
2018-09-26,43.13
2018-09-27,43.18
2018-09-28,43.44
2018-10-01,42.91
2018-10-02,43.05
2018-10-03,43.65
2018-10-04,43.35
2018-10-05,42.93
2018-10-08,43.13
2018-10-09,42.05
2018-10-10,40.83
2018-10-11,40.66
2018-10-12,41.2
2018-10-15,41.86
2018-10-16,43
2018-10-17,42.93
2018-10-18,42.53
2018-10-19,41.99
2018-10-22,41.72
2018-10-23,41.03
2018-10-24,38.73
2018-10-25,39.9
2018-10-26,38.63
2018-10-29,38.58
2018-10-30,39.56
2018-10-31,41.24
2018-11-01,41.11
2018-11-02,40.86
2018-11-05,40.51
2018-11-06,41.86
2018-11-07,41.43
2018-11-08,40.71
2018-11-09,40.63
2018-11-12,39.84
2018-11-13,40.24
2018-11-14,40.63
2018-11-15,40.72
2018-11-16,40.27
2018-11-19,38.76
2018-11-20,37.32
2018-11-21,38.53
2018-11-23,38.49
2018-11-26,38.46
2018-11-27,37.66
2018-11-28,38.29
2018-11-29,39.62
2018-11-30,39.79
2018-12-03,39.96
2018-12-04,39.12
2018-12-06,39.08
2018-12-07,38.64
2018-12-10,39.24
2018-12-11,39.21
2018-12-12,39.54
2018-12-13,38.75
2018-12-14,38.79
2018-12-17,38.56
2018-12-18,38.92
2018-12-19,37.65
2018-12-20,37.01
2018-12-21,35.77
2018-12-24,35.43
2018-12-26,36.47
2018-12-27,36.47
2018-12-28,36.55
2018-12-31,36.8
2019-01-02,37.42
2019-01-03,37.25
2019-01-04,38.25
2019-01-07,38.26
2019-01-08,38.68
2019-01-09,37.84
2019-01-10,37.99
2019-01-11,38.01
2019-01-14,37.67
2019-01-15,37.99
2019-01-16,38.47
2019-01-17,39.06
2019-01-18,39.13
2019-01-22,37.81
2019-01-23,37.89
2019-01-24,37.84
2019-01-25,38.67
2019-01-28,38.58
2019-01-29,38.72
2019-01-30,39.62
2019-01-31,39.78
2019-02-01,40.47
2019-02-04,40.85
2019-02-05,40.99
2019-02-06,40.05
2019-02-07,39.56
2019-02-08,39.65
2019-02-11,39.61
2019-02-12,39.98
2019-02-13,40.08
2019-02-14,40.35
2019-02-15,40.73
2019-02-19,40.37
2019-02-20,40.38
2019-02-21,40.45
2019-02-22,40.53
2019-02-25,40.29
2019-02-26,40.09
2019-02-27,40
2019-02-28,40.9
2019-03-01,40.76
2019-03-04,40.24
2019-03-05,40.24
2019-03-06,40.24
2019-03-07,40.33
2019-03-08,40.1
2019-03-11,40.74
2019-03-12,41.04
2019-03-13,40.97
2019-03-14,41.17
2019-03-15,41.55
2019-03-18,40.92
2019-03-19,40.66
2019-03-20,39.66
2019-03-21,39.61
2019-03-22,38.82
2019-03-25,38.38
2019-03-26,38.21
2019-03-27,37.97
2019-03-28,37.99
2019-03-29,38.18
2019-04-01,39.12
2019-04-02,39.19
2019-04-03,39.39
2019-04-04,39.95
2019-04-05,39.6
2019-04-08,39.58
2019-04-09,39.35
2019-04-10,39.54
2019-04-11,39.76
2019-04-12,40.28
2019-04-15,39.72
2019-04-16,39.83
2019-04-17,39.77
2019-04-18,39.95
2019-04-22,40.59
2019-04-23,40.97
2019-04-24,38.89
2019-04-25,39.09
2019-04-26,39.75
2019-04-29,39.97
2019-04-30,39.94
2019-05-01,40.29
2019-05-02,39.8
2019-05-03,40.19
2019-05-06,39.73
2019-05-07,38.59
2019-05-08,39.08
2019-05-09,39.2
2019-05-10,39.58
2019-05-13,38.79
2019-05-14,38.49
2019-05-15,38.13
2019-05-16,38.09
2019-05-17,38.14
2019-05-20,37.99
2019-05-21,38.34
2019-05-22,37.84
2019-05-23,37.01
2019-05-24,37.1
2019-05-28,36.93
2019-05-29,36.76
2019-05-30,36.65
2019-05-31,36.02
2019-06-03,35.88
2019-06-04,36.27
2019-06-05,35.79
2019-06-06,35.75
2019-06-07,35.69
2019-06-10,36.19
2019-06-11,36.26
2019-06-12,36.26
2019-06-13,36.63
2019-06-14,36.58
2019-06-17,36.86
2019-06-18,37.37
2019-06-19,37.69
2019-06-20,37.56
2019-06-21,37.57
2019-06-24,36.945
2019-06-25,36.96
2019-06-26,37.02
2019-06-27,37.45
2019-06-28,37.59
2019-07-01,38.23
2019-07-02,38.28
2019-07-03,38.83
2019-07-04,38.83
2019-07-05,39.15
2019-07-08,39.02
2019-07-09,39.425
2019-07-10,39.545
2019-07-11,39.58
2019-07-12,39.94
2019-07-15,39.67
2019-07-16,39.815
2019-07-17,39.535
2019-07-18,39.415
2019-07-19,39.665
2019-07-22,39.45
2019-07-23,39.465
2019-07-24,40.12
2019-07-25,40.15
2019-07-26,40.825
2019-07-29,40.32
2019-07-30,40.66
2019-07-31,41.58
2019-08-01,41.705
2019-08-02,41.77
2019-08-05,40.37
2019-08-06,40.625
2019-08-07,40.765
2019-08-08,41.35
2019-08-09,40.73
2019-08-12,40.015
2019-08-13,40.04
2019-08-14,39.475
2019-08-15,39.59
2019-08-16,40.12
2019-08-19,40.495
2019-08-20,40.245
2019-08-21,40.48
2019-08-22,40.19
2019-08-23,39.21
2019-08-26,39.6
2019-08-27,39.5
2019-08-28,40.425
2019-08-29,40.36
2019-08-30,40.46
2019-09-02,40.5
2019-09-03,40.305
2019-09-04,40.95
2019-09-05,41.27
2019-09-06,41.2
2019-09-09,41.34
2019-09-10,41.57
2019-09-11,42.22
2019-09-12,41.955
2019-09-13,41.84
2019-09-16,41.56
2019-09-17,41.85
2019-09-18,41.705
2019-09-19,41.24
2019-09-20,41.3
2019-09-23,41.335
2019-09-24,40.805
2019-09-25,41.66
2019-09-26,41.33
2019-09-27,41.35
2019-09-30,41.54
2019-10-01,41.07
2019-10-02,41.075
2019-10-03,41.81
2019-10-04,41.96
2019-10-07,41.885
2019-10-08,41.78
2019-10-09,41.785
2019-10-10,42.11
2019-10-11,42.34
2019-10-14,42.57
2019-10-15,43
2019-10-16,42.91
2019-10-17,43.33
2019-10-18,43.35
2019-10-21,43.245
2019-10-22,43.235
2019-10-23,43.625
2019-10-24,43.61
2019-10-25,43.415
2019-10-28,43.625
2019-10-29,43.31
2019-10-30,43.485
2019-10-31,44.86
2019-11-01,45.505
2019-11-04,45.655
2019-11-05,46.04
2019-11-06,45.275
2019-11-07,45.81
2019-11-08,46.18
2019-11-11,46.765
2019-11-12,46.795
2019-11-13,47.125
2019-11-14,47.64
2019-11-15,46.985
2019-11-18,46.755
2019-11-19,47.205
2019-11-20,46.89
2019-11-21,47.815
2019-11-22,47.81
2019-11-25,47.865
