date,close
2014-06-13,51.0134
2014-06-16,51.3582
2014-06-17,52.0478
2014-06-18,52.4118
2014-06-19,52.316
2014-06-20,52.5938
2014-06-23,52.7757
2014-06-24,52.0478
2014-06-25,52.2202
2014-06-26,52.8045
2014-06-27,52.2202
2014-06-30,52.6704
2014-07-01,53.1206
2014-07-02,52.747
2014-07-03,53.2738
2014-07-07,52.929
2014-07-08,52.3543
2014-07-09,52.4214
2014-07-10,51.9424
2014-07-11,52.0478
2014-07-14,51.9329
2014-07-15,52.68
2014-07-16,44.7301
2014-07-17,45.7454
2014-07-18,45.3239
2014-07-21,44.8354
2014-07-22,43.8393
2014-07-23,44.0979
2014-07-24,44.845
2014-07-25,45.3239
2014-07-28,44.9695
2014-07-29,45.0462
2014-07-30,44.9885
2014-07-31,44.8829
2014-08-01,45.3824
2014-08-04,45.3824
2014-08-05,45.1518
2014-08-06,45.2959
2014-08-07,44.3737
2014-08-08,44.5754
2014-08-11,44.489
2014-08-12,44.1527
2014-08-13,44.1527
2014-08-14,45.2671
2014-08-15,46.5448
2014-08-18,46.2662
2014-08-19,46.4968
2014-08-20,46.4295
2014-08-21,46.8042
2014-08-22,46.9483
2014-08-25,47.0444
2014-08-26,47.2269
2014-08-27,46.8907
2014-08-28,46.5352
2014-08-29,46.9771
2014-09-02,46.9867
2014-09-03,46.8811
2014-09-04,47.3326
2014-09-05,47.6496
2014-09-08,47.5535
2014-09-09,46.9867
2014-09-10,46.9291
2014-09-11,47.054
2014-09-12,46.9483
2014-09-15,46.4103
2014-09-16,46.0357
2014-09-17,46.4295
2014-09-18,46.6889
2014-09-19,46.3335
2014-09-22,45.8916
2014-09-23,45.7186
2014-09-24,46.2662
2014-09-25,46.247
2014-09-26,47.5631
2014-09-29,47.6304
2014-09-30,47.4383
2014-10-01,47.3134
2014-10-02,47.2749
2014-10-03,47.7072
2014-10-06,47.4383
2014-10-07,46.5929
2014-10-08,47.2461
2014-10-09,46.4392
2014-10-10,45.6514
2014-10-13,45.2863
2014-10-14,45.2287
2014-10-15,44.537
2014-10-16,45.5065
2014-10-17,45.3344
2014-10-20,44.5658
2014-10-21,45.6418
2014-10-22,45.0366
2014-10-23,45.2287
2014-10-24,45.709
2014-10-27,45.9588
2014-10-28,46.6902
2014-10-29,49.2434
2014-10-30,50.2358
2014-10-31,49.07
2014-11-03,48.7424
2014-11-04,48.8388
2014-11-05,49.2434
2014-11-06,49.889
2014-11-07,49.6674
2014-11-10,49.7155
2014-11-11,49.7637
2014-11-12,50.2358
2014-11-13,49.7541
2014-11-14,49.6288
2014-11-17,49.6192
2014-11-18,49.5614
2014-11-19,49.6577
2014-11-20,49.4554
2014-11-21,49.2627
2014-11-24,49.5903
2014-11-25,49.9179
2014-11-26,50.679
2014-11-28,49.6481
2014-12-01,48.5208
2014-12-02,48.9544
2014-12-03,49.4458
2014-12-04,49.4361
2014-12-05,49.9179
2014-12-08,50.1009
2014-12-09,50.3514
2014-12-10,48.8484
2014-12-11,49.1374
2014-12-12,48.3763
2014-12-15,48.7039
2014-12-16,48.5016
2014-12-17,49.2531
2014-12-18,50.0238
2014-12-19,50.2454
2014-12-22,50.4092
2014-12-23,50.9777
2014-12-24,50.679
2014-12-26,50.5827
2014-12-29,50.9295
2014-12-30,50.8524
2014-12-31,50.2165
2015-01-02,50.1973
2015-01-05,48.6942
2015-01-06,47.3646
2015-01-07,47.8657
2015-01-08,48.781
2015-01-09,47.9138
2015-01-12,47.2876
2015-01-13,46.6035
2015-01-14,46.0158
2015-01-15,45.8809
2015-01-16,46.6324
2015-01-20,46.3434
2015-01-21,47.0563
2015-01-22,50.0046
2015-01-23,49.3398
2015-01-26,49.783
2015-01-27,49.783
2015-01-28,48.5657
2015-01-29,49.5801
2015-01-30,49.1937
2015-02-02,50.2661
2015-02-03,51.0582
2015-02-04,50.7491
2015-02-05,52.7682
2015-02-06,53.3576
2015-02-09,53.4735
2015-02-10,53.9276
2015-02-11,53.7923
2015-02-12,54.8647
2015-02-13,54.4976
2015-02-17,54.5748
2015-02-18,53.8986
2015-02-19,53.9952
2015-02-20,54.7101
2015-02-23,54.6618
2015-02-24,54.3043
2015-02-25,54.6135
2015-02-26,55.0965
2015-02-27,55.0676
2015-03-02,55.512
2015-03-03,55.512
2015-03-04,55.3864
2015-03-05,55.7438
2015-03-06,55.937
2015-03-09,56.0143
2015-03-10,55.5796
2015-03-11,56.4781
2015-03-12,57.647
2015-03-13,55.1062
2015-03-16,55.367
2015-03-17,55.483
2015-03-18,55.2994
2015-03-19,55.1062
2015-03-20,55.5892
2015-03-23,55.512
2015-03-24,55.3477
2015-03-25,54.4879
2015-03-26,54.8164
2015-03-27,54.6328
2015-03-30,55.4153
2015-03-31,55.1545
2015-04-01,54.826
2015-04-02,55.2125
2015-04-06,55.0386
2015-04-07,55.0482
2015-04-08,55.0869
2015-04-09,55.3767
2015-04-10,55.0676
2015-04-13,55.2415
2015-04-14,55.1931
2015-04-15,55.3477
2015-04-16,56.4877
2015-04-17,56.8935
2015-04-20,57.0094
2015-04-21,56.8065
2015-04-22,57.3765
2015-04-23,57.3572
2015-04-24,56.8162
2015-04-27,56.5457
2015-04-28,57.2528
2015-04-29,57.2431
2015-04-30,56.4585
2015-05-01,56.2939
2015-05-04,56.5844
2015-05-05,56.5457
2015-05-06,56.7394
2015-05-07,56.5844
2015-05-08,57.4465
2015-05-11,57.4271
2015-05-12,57.9405
2015-05-13,58.4732
2015-05-14,59.1221
2015-05-15,58.1826
2015-05-18,59.0253
2015-05-19,59.8873
2015-05-20,59.219
2015-05-21,59.3352
2015-05-22,59.1027
2015-05-26,58.7444
2015-05-27,59.7323
2015-05-28,59.4514
2015-05-29,58.6475
2015-06-01,58.4151
2015-06-02,59.0349
2015-06-03,60.0423
2015-06-04,59.8582
2015-06-05,60.9334
2015-06-08,60.6912
2015-06-09,61.5436
2015-06-10,62.2506
2015-06-11,62.3669
2015-06-12,61.9794
2015-06-15,61.776
2015-06-16,61.9794
2015-06-17,61.4951
2015-06-18,61.3789
2015-06-19,60.6428
2015-06-22,61.4855
2015-06-23,62.3862
2015-06-24,61.8438
2015-06-25,61.7082
2015-06-26,62.3087
2015-06-29,61.1852
2015-06-30,61.0496
2015-07-01,62.1635
2015-07-02,61.5629
2015-07-06,61.4951
2015-07-07,60.6815
2015-07-08,59.7808
2015-07-09,60.5459
2015-07-10,61.5242
2015-07-13,62.2313
2015-07-14,62.5799
2015-07-15,62.6574
2015-07-16,61.9407
2015-07-17,61.6792
2015-07-20,61.7663
2015-07-21,61.3014
2015-07-22,62.3669
2015-07-23,61.776
2015-07-24,61.592
2015-07-27,60.5847
2015-07-28,60.7012
2015-07-29,61.4488
2015-07-30,62.0896
2015-07-31,61.9342
2015-08-03,61.7692
2015-08-04,62.0216
2015-08-05,62.1867
2015-08-06,61.7012
2015-08-07,61.7401
2015-08-10,63.2158
2015-08-11,62.0022
2015-08-12,61.0701
2015-08-13,61.1672
2015-08-14,62.5265
2015-08-17,62.5071
2015-08-18,62.2741
2015-08-19,61.5556
2015-08-20,59.6817
2015-08-21,58.4293
2015-08-24,55.7884
2015-08-25,54.9534
2015-08-26,57.0991
2015-08-27,58.604
2015-08-28,58.6623
2015-08-31,58.5555
2015-09-01,57.0311
2015-09-02,58.0603
2015-09-03,59.0992
2015-09-04,58.4293
2015-09-08,59.9342
2015-09-09,59.3905
2015-09-10,60.1283
2015-09-11,60.1186
2015-09-14,60.7983
2015-09-15,61.643
2015-09-16,62.2158
2015-09-17,61.3905
2015-09-18,60.5264
2015-09-21,61.1866
2015-09-22,60.1283
2015-09-23,60.4973
2015-09-24,60.7497
2015-09-25,60.9342
2015-09-28,60.1769
2015-09-29,59.973
2015-09-30,60.9439
2015-10-01,60.7206
2015-10-02,60.7303
2015-10-05,62.1964
2015-10-06,62.0119
2015-10-07,62.5071
2015-10-08,62.8566
2015-10-09,62.2158
2015-10-12,62.7886
2015-10-13,62.2255
2015-10-14,60.672
2015-10-15,60.9633
2015-10-16,61.4391
2015-10-19,61.9148
2015-10-20,62.6624
2015-10-21,61.643
2015-10-22,62.3614
2015-10-23,63.5654
2015-10-26,63.6624
2015-10-27,62.7575
2015-10-28,65.492
2015-10-29,65.0151
2015-10-30,63.5554
2015-11-02,64.1004
2015-11-03,63.789
2015-11-04,63.9155
2015-11-05,65.2098
2015-11-06,66.9906
2015-11-09,66.1537
2015-11-10,64.1004
2015-11-11,64.2755
2015-11-12,63.3511
2015-11-13,63.3608
2015-11-16,64.4021
2015-11-17,64.149
2015-11-18,65.3655
2015-11-19,65.1416
2015-11-20,65.7352
2015-11-23,66.3581
2015-11-24,66.8446
2015-11-25,66.6111
2015-11-27,66.9419
2015-11-30,67.0101
2015-12-01,67.4188
2015-12-02,67.195
2015-12-03,65.5504
2015-12-04,67.2631
2015-12-07,66.3289
2015-12-08,65.3265
2015-12-09,65.1027
2015-12-10,65.1903
2015-12-11,63.7695
2015-12-14,64.0323
2015-12-15,65.6477
2015-12-16,66.6792
2015-12-17,64.7329
2015-12-18,63.2343
2015-12-21,64.0809
2015-12-22,64.0517
2015-12-23,64.8886
2015-12-24,65.1027
2015-12-28,64.9081
2015-12-29,65.3752
2015-12-30,64.4799
2015-12-31,64.2853
2016-01-04,62.5531
2016-01-05,63.0689
2016-01-06,62.5239
2016-01-07,61.58
2016-01-08,60.5971
2016-01-11,60.1495
2016-01-12,60.3538
2016-01-13,59.225
2016-01-14,61.2686
2016-01-15,61.6384
2016-01-19,61.7065
2016-01-20,62.4558
2016-01-21,62.232
2016-01-22,64.2464
2016-01-25,61.5897
2016-01-26,64.8477
2016-01-27,63.9405
2016-01-28,64.9355
2016-01-29,66.3304
2016-02-01,66.1743
2016-02-02,64.2234
2016-02-03,65.4427
2016-02-04,65.3354
2016-02-05,61.7458
2016-02-08,58.439
2016-02-09,56.4784
2016-02-10,57.2002
2016-02-11,55.2005
2016-02-12,56.9563
2016-02-16,58.3415
2016-02-17,59.3754
2016-02-18,58.0586
2016-02-19,58.3902
2016-02-22,59.8241
2016-02-23,58.2732
2016-02-24,58.3024
2016-02-25,60.7508
2016-02-26,62.0189
2016-02-29,60.029
2016-03-01,63.3845
2016-03-02,64.6623
2016-03-03,65.7646
2016-03-04,66.2231
2016-03-07,65.1208
2016-03-08,64.2039
2016-03-09,63.5113
2016-03-10,63.3455
2016-03-11,65.1403
2016-03-14,65.2866
2016-03-15,64.5258
2016-03-16,64.1454
2016-03-17,63.6089
2016-03-18,64.2527
2016-03-21,65.1403
2016-03-22,65.5207
2016-03-23,65.1891
2016-03-24,65.0233
2016-03-28,65.0915
2016-03-29,64.955
2016-03-30,65.3744
2016-03-31,65.0038
2016-04-01,64.9257
2016-04-04,65.4134
2016-04-05,64.6916
2016-04-06,65.3061
2016-04-07,63.1114
2016-04-08,62.8773
2016-04-11,63.3065
2016-04-12,64.1746
2016-04-13,65.8426
2016-04-14,68.1642
2016-04-15,69.0909
2016-04-18,69.5688
2016-04-19,69.5688
2016-04-20,70.2712
2016-04-21,69.3738
2016-04-22,69.1884
2016-04-25,69.0031
2016-04-26,69.4626
2016-04-27,69.4919
2016-04-28,68.8369
2016-04-29,68.7489
2016-05-02,69.2964
2016-05-03,68.1623
2016-05-04,66.9598
2016-05-05,66.6469
2016-05-06,66.7349
2016-05-09,66.3341
2016-05-10,67.4486
2016-05-11,66.8327
2016-05-12,66.4319
2016-05-13,66.0701
2016-05-16,66.4416
2016-05-17,65.9724
2016-05-18,68.309
2016-05-19,68.3285
2016-05-20,68.9347
2016-05-23,68.2112
2016-05-24,69.6777
2016-05-25,70.6651
2016-05-26,70.7238
2016-05-27,70.8704
2016-05-31,70.7922
2016-06-01,69.6875
2016-06-02,69.8732
2016-06-03,68.8662
2016-06-06,68.9249
2016-06-07,68.3285
2016-06-08,68.964
2016-06-09,68.3578
2016-06-10,67.4975
2016-06-13,67.1651
2016-06-14,66.4025
2016-06-15,66.7838
2016-06-16,66.6763
2016-06-17,66.8034
2016-06-20,67.5659
2016-06-21,68.2405
2016-06-22,68.6511
2016-06-23,70.1274
2016-06-24,66.5981
2016-06-27,62.8145
2016-06-28,66.0995
2016-06-29,67.2531
2016-06-30,68.4263
2016-07-01,67.1944
2016-07-05,66.0603
2016-07-06,65.4346
2016-07-07,66.7349
2016-07-08,67.7321
2016-07-11,68.8173
2016-07-12,70.0199
2016-07-13,69.8439
2016-07-14,69.6875
2016-07-15,70.1958
2016-07-18,69.5115
2016-07-19,69.0227
2016-07-20,69.1204
2016-07-21,68.7
2016-07-22,69.619
2016-07-25,70.4403
2016-07-26,70.1561
2016-07-27,70.4011
2016-07-28,70.2443
2016-07-29,70.2247
2016-08-01,69.5976
2016-08-02,69.7348
2016-08-03,69.9896
2016-08-04,69.9504
2016-08-05,72.057
2016-08-08,71.8708
2016-08-09,71.7631
2016-08-10,70.646
2016-08-11,71.0184
2016-08-12,70.5971
2016-08-15,71.7435
2016-08-16,71.6847
2016-08-17,71.8218
2016-08-18,72.106
2016-08-19,72.2432
2016-08-22,72.3216
2016-08-23,71.9296
2016-08-24,72.008
2016-08-25,72.6841
2016-08-26,73.4288
2016-08-29,74.1441
2016-08-30,75.0455
2016-08-31,75.408
2016-09-01,75.3297
2016-09-02,75.5746
2016-09-06,73.8403
2016-09-07,74.7809
2016-09-08,75.2023
2016-09-09,74.2518
2016-09-12,75.1337
2016-09-13,73.8991
2016-09-14,73.6345
2016-09-15,74.7124
2016-09-16,74.585
2016-09-19,74.6634
2016-09-20,75.2513
2016-09-21,75.6432
2016-09-22,75.9078
2016-09-23,76.1625
2016-09-26,75.4766
2016-09-27,76.0743
2016-09-28,76.5153
2016-09-29,75.3199
2016-09-30,75.555
2016-10-03,74.8005
2016-10-04,75.3101
2016-10-05,76.6132
2016-10-06,76.7994
2016-10-07,76.917
2016-10-10,77.0836
2016-10-11,75.9665
2016-10-12,75.5746
2016-10-13,72.4979
2016-10-14,71.8414
2016-10-17,71.7141
2016-10-18,72.7821
2016-10-19,75.0161
2016-10-20,74.5556
2016-10-21,74.4086
2016-10-24,74.9573
2016-10-25,74.1129
2016-10-26,74.054
2016-10-27,73.9951
2016-10-28,73.2587
2016-10-31,73.0819
2016-11-01,72.9641
2016-11-02,72.3063
2016-11-03,71.4913
2016-11-04,71.5207
2016-11-07,73.406
2016-11-08,72.9936
2016-11-09,76.6266
2016-11-10,81.0451
2016-11-11,80.8781
2016-11-14,83.1561
2016-11-15,81.8306
2016-11-16,79.8275
2016-11-17,81.7127
2016-11-18,81.3887
2016-11-21,80.397
2016-11-22,80.6327
2016-11-23,80.8781
2016-11-25,81.1432
2016-11-28,79.1598
2016-11-29,80.0534
2016-11-30,80.4167
2016-12-01,81.7815
2016-12-02,81.86
2016-12-05,82.9892
2016-12-06,84.0889
2016-12-07,86.7007
2016-12-08,88.9689
2016-12-09,87.4273
2016-12-12,86.5633
2016-12-13,87.4372
2016-12-14,86.9069
2016-12-15,87.987
2016-12-16,87.172
2016-12-19,88.478
2016-12-20,89.8722
2016-12-21,89.6366
2016-12-22,89.5482
2016-12-23,89.9115
2016-12-27,90.4025
2016-12-28,90.2061
2016-12-29,89.8231
2016-12-30,90.4712
2017-01-03,90.9032
2017-01-04,91.2371
2017-01-05,90.4025
2017-01-06,91.0701
2017-01-09,90.3534
2017-01-10,90.6283
2017-01-11,90.8148
2017-01-12,90.1864
2017-01-13,91.2665
2017-01-17,90.0588
2017-01-18,90.4614
2017-01-19,90.4417
2017-01-20,90.8836
2017-01-23,90.9818
2017-01-24,91.7785
2017-01-25,93.6276
2017-01-26,94.0801
2017-01-27,93.2637
2017-01-30,92.4965
2017-01-31,92.7818
2017-02-01,92.349
2017-02-02,91.9654
2017-02-03,93.4211
2017-02-06,93.0867
2017-02-07,92.5752
2017-02-08,91.7195
2017-02-09,93.4211
2017-02-10,93.2834
2017-02-13,94.7981
2017-02-14,94.8375
2017-02-15,95.1915
2017-02-16,94.1883
2017-02-17,94.0309
2017-02-21,94.1489
2017-02-22,94.1489
2017-02-23,94.208
2017-02-24,93.726
2017-02-27,93.8145
2017-02-28,92.29
2017-03-01,95.3096
2017-03-02,94.2276
2017-03-03,95.2702
2017-03-06,95.3686
2017-03-07,93.5785
2017-03-08,94.326
2017-03-09,94.6998
2017-03-10,94.6211
2017-03-13,94.5817
2017-03-14,94.5916
2017-03-15,92.9588
2017-03-16,93.8244
2017-03-17,93.5293
2017-03-20,92.2506
2017-03-21,89.7228
2017-03-22,89.6146
2017-03-23,89.2408
2017-03-24,89.4277
2017-03-27,88.8572
2017-03-28,91.208
2017-03-29,90.5195
2017-03-30,93.0375
2017-03-31,92.2703
2017-04-03,91.9064
2017-04-04,91.5031
2017-04-05,90.3326
2017-04-06,91.3064
2017-04-07,90.4605
2017-04-10,90.608
2017-04-11,90.5785
2017-04-12,90.4605
2017-04-13,88.6999
2017-04-17,88.9261
2017-04-18,88.1196
2017-04-19,87.9228
2017-04-20,89.0146
2017-04-21,89.1031
2017-04-24,91.0506
2017-04-25,91.8094
2017-04-26,92.2528
2017-04-27,92.1937
2017-04-28,91.1097
2017-05-01,92.3316
2017-05-02,91.7305
2017-05-03,92.1148
2017-05-04,93.317
2017-05-05,93.1593
2017-05-08,92.5484
2017-05-09,91.4842
2017-05-10,90.8338
2017-05-11,89.671
2017-05-12,89.5824
2017-05-15,90.3904
2017-05-16,91.2477
2017-05-17,88.4393
2017-05-18,88.932
2017-05-19,88.8926
2017-05-22,89.4937
2017-05-23,91.3856
2017-05-24,91.5926
2017-05-25,91.8685
2017-05-26,91.2772
2017-05-30,91.8094
2017-05-31,90.755
2017-06-01,93.5239
2017-06-02,92.5977
2017-06-05,93.5831
2017-06-06,92.9229
2017-06-07,94.6374
2017-06-08,96.5097
2017-06-09,98.6874
2017-06-12,98.786
2017-06-13,99.1013
2017-06-14,99.4068
2017-06-15,99.2491
2017-06-16,99.3181
2017-06-19,99.9684
2017-06-20,99.3476
2017-06-21,98.3819
2017-06-22,98.4115
2017-06-23,97.6528
2017-06-26,98.0666
2017-06-27,97.4557
2017-06-28,99.2392
2017-06-29,99.0914
2017-06-30,98.6382
2017-07-03,101.2297
2017-07-05,101.0425
2017-07-06,100.5104
2017-07-07,101.7619
2017-07-10,101.9195
2017-07-11,100.54
2017-07-12,100.6779
2017-07-13,99.8699
2017-07-14,99.7319
2017-07-17,99.2885
2017-07-18,98.9042
2017-07-19,98.5298
2017-07-20,98.9042
2017-07-21,98.3622
2017-07-24,98.9042
2017-07-25,100.8191
2017-07-26,98.9931
2017-07-27,98.8944
2017-07-28,98.5094
2017-07-31,99.0326
2017-08-01,100.2565
2017-08-02,100.2269
2017-08-03,99.5557
2017-08-04,100.2565
2017-08-07,100.3848
2017-08-08,100.2861
2017-08-09,99.0523
2017-08-10,96.555
2017-08-11,96.1108
2017-08-14,97.3743
2017-08-15,97.473
2017-08-16,96.9992
2017-08-17,94.8276
2017-08-18,95.0645
2017-08-21,94.9954
2017-08-22,95.7555
2017-08-23,95.6963
2017-08-24,96.2688
2017-08-25,96.8807
2017-08-28,96.5649
2017-08-29,95.2718
2017-08-30,95.8048
2017-08-31,95.795
2017-09-01,96.1207
2017-09-05,92.9917
2017-09-06,93.2385
2017-09-07,91.2939
2017-09-08,92.6857
2017-09-11,94.7882
2017-09-12,96.8117
2017-09-13,96.5451
2017-09-14,94.5019
2017-09-15,95.2521
2017-09-18,96.2885
2017-09-19,96.5649
2017-09-20,98.3416
2017-09-21,99.4965
2017-09-22,99.6347
2017-09-25,99.0128
2017-09-26,99.6445
2017-09-27,101.362
2017-09-28,102.2997
2017-09-29,103.1091
2017-10-02,103.652
2017-10-03,103.81
2017-10-04,103.1585
2017-10-05,103.1782
2017-10-06,103.6323
2017-10-09,103.3066
2017-10-10,102.7834
2017-10-11,102.0727
2017-10-12,100.8488
2017-10-13,93.7419
2017-10-16,95.41
2017-10-17,95.2126
2017-10-18,95.5186
2017-10-19,96.1898
2017-10-20,98.9931
2017-10-23,97.9764
2017-10-24,98.3613
2017-10-25,98.4602
2017-10-26,98.4503
2017-10-27,98.1834
2017-10-30,96.3838
2017-10-31,96.3047
2017-11-01,95.7708
2017-11-02,92.8342
2017-11-03,93.3879
2017-11-06,93.3681
2017-11-07,92.6463
2017-11-08,90.9358
2017-11-09,89.9668
2017-11-10,89.2055
2017-11-13,90.5601
2017-11-14,91.005
2017-11-15,90.9951
2017-11-16,90.4711
2017-11-17,91.272
2017-11-20,92.0037
2017-11-21,91.7466
2017-11-22,91.9344
2017-11-24,91.8949
2017-11-27,91.2324
2017-11-28,93.6648
2017-11-29,95.3951
2017-11-30,94.4657
2017-12-01,94.6041
2017-12-04,94.7326
2017-12-05,92.7452
2017-12-06,91.8652
2017-12-07,91.7466
2017-12-08,91.7466
2017-12-11,90.6589
2017-12-12,90.5502
2017-12-13,87.8113
2017-12-14,87.5444
2017-12-15,86.5853
2017-12-18,87.8113
2017-12-19,87.4059
2017-12-20,87.0203
2017-12-21,86.9017
2017-12-22,86.2194
2017-12-26,85.8536
2017-12-27,85.646
2017-12-28,86.1799
2017-12-29,85.6657
2018-01-02,84.0046
2018-01-03,86.8226
2018-01-04,87.4752
2018-01-05,87.1489
2018-01-08,87.3367
2018-01-09,87.2082
2018-01-10,88.9781
2018-01-11,91.272
2018-01-12,90.036
2018-01-16,86.3183
2018-01-17,87.4059
2018-01-18,85.0033
2018-01-19,88.9187
2018-01-22,88.8693
2018-01-23,89.947
2018-01-24,89.5805
2018-01-25,89.6598
2018-01-26,89.9768
2018-01-29,89.739
2018-01-30,89.4022
2018-01-31,88.7088
2018-02-01,89.6994
2018-02-02,89.422
2018-02-05,87.3715
2018-02-06,88.7583
2018-02-07,89.3131
2018-02-08,87.9361
2018-02-09,88.7385
2018-02-12,89.7192
2018-02-13,90.3136
2018-02-14,94.2562
2018-02-15,94.1571
2018-02-16,94.6227
2018-02-20,94.3949
2018-02-21,94.7119
2018-02-22,92.7505
2018-02-23,94.385
2018-02-26,94.6624
2018-02-27,93.6817
2018-02-28,91.9283
2018-03-01,92.0174
2018-03-02,93.2359
2018-03-05,93.2755
2018-03-06,96.5247
2018-03-07,97.446
2018-03-08,97.1092
2018-03-09,97.8521
2018-03-12,97.3271
2018-03-13,96.1285
2018-03-14,94.91
2018-03-15,94.6921
2018-03-16,95.7322
2018-03-19,95.861
2018-03-20,94.8902
2018-03-21,95.9898
2018-03-22,91.2448
2018-03-23,89.2933
2018-03-26,90.9773
2018-03-27,89.5508
2018-03-28,90.6504
2018-03-29,91.7401
2018-04-02,89.8777
2018-04-03,90.2343
2018-04-04,90.7098
2018-04-05,90.9476
2018-04-06,88.9862
2018-04-09,88.8178
2018-04-10,89.7787
2018-04-11,88.6692
2018-04-12,89.3923
2018-04-13,90.5414
2018-04-16,90.3136
2018-04-17,88.9862
2018-04-18,89.9471
2018-04-19,91.6014
2018-04-20,92.1165
2018-04-23,92.9189
2018-04-24,93.3151
2018-04-25,92.9082
2018-04-26,92.6799
2018-04-27,93.2357
2018-04-30,92.1738
2018-05-01,92.7792
2018-05-02,93.0968
2018-05-03,93.464
2018-05-04,94.1786
2018-05-07,95.191
2018-05-08,95.8758
2018-05-09,96.4018
2018-05-10,96.8187
2018-05-11,96.6897
2018-05-14,96.6003
2018-05-15,97.2256
2018-05-16,98.3769
2018-05-17,98.2975
2018-05-18,97.2951
2018-05-21,99.0022
2018-05-22,99.5977
2018-05-23,99.0518
2018-05-24,99.8657
2018-05-25,99.161
2018-05-29,97.3646
2018-05-30,99.6275
2018-05-31,98.8533
2018-06-01,100.7986
2018-06-04,100.9673
2018-06-05,99.7466
2018-06-06,101.5529
2018-06-07,101.4934
2018-06-08,102.605
2018-06-11,100.9376
2018-06-12,100.5703
2018-06-13,99.2702
2018-06-14,99.3099
2018-06-15,98.8434
2018-06-18,99.0022
2018-06-19,99.9153
2018-06-20,100.0741
2018-06-21,100.1833
2018-06-22,99.5282
2018-06-25,98.496
2018-06-26,97.4043
2018-06-27,95.7269
2018-06-28,96.8981
2018-06-29,96.0644
2018-07-02,97.3844
2018-07-03,97.4936
2018-07-05,97.9799
2018-07-06,98.7838
2018-07-09,100.62
2018-07-10,98.5456
2018-07-11,98.3273
2018-07-12,97.6226
2018-07-13,97.0073
2018-07-16,96.3621
2018-07-17,96.6797
2018-07-18,97.2653
2018-07-19,97.8211
2018-07-20,98.3174
2018-07-23,99.4389
2018-07-24,98.4861
2018-07-25,98.5259
2018-07-26,99.2318
2018-07-27,98.9335
2018-07-30,98.1779
2018-07-31,98.2972
2018-08-01,99.4804
2018-08-02,101.3696
2018-08-03,101.3099
2018-08-06,100.9023
2018-08-07,100.604
2018-08-08,100.6736
2018-08-09,100.5045
2018-08-10,100.0869
2018-08-13,100.2758
2018-08-14,102.2446
2018-08-15,102.4136
2018-08-16,103.3085
2018-08-17,103.9051
2018-08-20,104.4619
2018-08-21,105.5954
2018-08-22,105.2871
2018-08-23,104.3227
2018-08-24,103.6068
2018-08-27,101.3398
2018-08-28,100.8426
2018-08-29,100.3256
2018-08-30,99.9278
2018-08-31,101.0116
2018-09-04,101.9761
2018-09-05,101.5983
2018-09-06,102.2147
2018-09-07,102.4136
2018-09-10,102.8014
2018-09-11,103.4477
2018-09-12,100.9818
2018-09-13,99.192
2018-09-14,99.7091
2018-09-17,97.9889
2018-09-18,97.7602
2018-09-19,99.7588
2018-09-20,100.2162
2018-09-21,100.4051
2018-09-24,99.4207
2018-09-25,99.5102
2018-09-26,96.8057
2018-09-27,95.4236
2018-09-28,95.4535
2018-10-01,94.2305
2018-10-02,93.0671
2018-10-03,95.5628
2018-10-04,94.8569
2018-10-05,93.2461
2018-10-08,93.5444
2018-10-09,93.7532
2018-10-10,92.3512
2018-10-11,90.3228
2018-10-12,92.5899
2018-10-15,90.81
2018-10-16,90.2333
2018-10-17,91.0387
2018-10-18,89.4677
2018-10-19,89.3683
2018-10-22,86.9124
2018-10-23,87.668
2018-10-24,84.7089
2018-10-25,86.9507
2018-10-26,86.3031
2018-10-29,89.1825
2018-10-30,91.0656
2018-10-31,90.6571
2018-11-01,92.5003
2018-11-02,91.8627
2018-11-05,92.6797
2018-11-06,92.9387
2018-11-07,92.5701
2018-11-08,93.1081
2018-11-09,92.5601
2018-11-12,91.4342
2018-11-13,93.0981
2018-11-14,91.8926
2018-11-15,94.1144
2018-11-16,93.6162
2018-11-19,93.3074
2018-11-20,91.3346
2018-11-21,93.4269
2018-11-23,93.6959
2018-11-26,95.4595
2018-11-27,94.0646
2018-11-28,94.3236
2018-11-29,95.8381
2018-11-30,98.7872
2018-12-03,99.2755
2018-12-04,96.5255
2018-12-06,96.4259
2018-12-07,94.1244
2018-12-10,92.2313
2018-12-11,90.4977
2018-12-12,90.9062
2018-12-13,89.3419
2018-12-14,88.6345
2018-12-17,87.0205
2018-12-18,85.0876
2018-12-19,82.8856
2018-12-20,81.1719
2018-12-21,80.1656
2018-12-24,79.9365
2018-12-26,83.8222
2018-12-27,83.3639
2018-12-28,87.6183
2018-12-31,86.5821
2019-01-02,87.1799
2019-01-03,84.8783
2019-01-04,87.0802
2019-01-07,87.14
2019-01-08,86.2533
2019-01-09,86.9308
2019-01-10,85.7352
2019-01-11,84.1809
2019-01-14,84.0314
2019-01-15,93.9849
2019-01-16,95.2502
2019-01-17,95.3299
2019-01-18,95.6687
2019-01-22,95.3698
2019-01-23,95.1406
2019-01-24,94.9912
2019-01-25,96.7647
2019-01-28,96.8145
2019-01-29,95.7086
2019-01-30,96.8765
2019-01-31,96.4572
2019-02-01,98.2241
2019-02-04,99.0925
2019-02-05,99.1823
2019-02-06,99.6216
2019-02-07,100.48
2019-02-08,100.3503
2019-02-11,100.2205
2019-02-12,100.7196
2019-02-13,100.2205
2019-02-14,99.362
2019-02-15,101.4483
2019-02-19,101.8176
2019-02-20,103.0055
2019-02-21,103.1053
2019-02-22,103.4846
2019-02-25,103.4747
2019-02-26,103.0953
2019-02-27,104.7524
2019-02-28,104.7923
2019-03-01,105.2515
2019-03-04,104.5827
2019-03-05,104.7723
2019-03-06,102.8458
2019-03-07,101.3485
2019-03-08,101.5381
2019-03-11,102.4565
2019-03-12,102.2968
2019-03-13,102.6362
2019-03-14,102.736
2019-03-15,103.3748
2019-03-18,105.2315
2019-03-19,103.814
2019-03-20,101.7178
2019-03-21,101.3584
2019-03-22,97.9246
2019-03-25,98.9328
2019-03-26,100.4501
2019-03-27,100.2704
2019-03-28,100.3702
2019-03-29,100.2804
2019-04-01,102.3267
2019-04-02,103.5146
2019-04-03,104.0536
2019-04-04,104.413
2019-04-05,104.5827
2019-04-08,104.0836
2019-04-09,102.5064
2019-04-10,103.1752
2019-04-11,102.3766
2019-04-12,101.618
2019-04-15,101.4483
2019-04-16,102.8158
2019-04-17,103.0255
2019-04-18,103.4347
2019-04-22,103.6444
2019-04-23,106.07
2019-04-24,106.27
2019-04-25,106.12
2019-04-26,106.36
2019-04-29,106.28
2019-04-30,105.62
2019-05-01,103.16
2019-05-02,104.02
2019-05-03,105.52
2019-05-06,105.16
2019-05-07,103.6
2019-05-08,102.56
2019-05-09,102.99
2019-05-10,103.31
2019-05-13,98.84
2019-05-14,100.27
2019-05-15,99.43
2019-05-16,100.7
2019-05-17,99.96
2019-05-20,100.16
2019-05-21,100.94
2019-05-22,99.92
2019-05-23,99.08
2019-05-24,100.52
2019-05-28,99.41
2019-05-29,99.34
2019-05-30,97.99
2019-05-31,97.02
2019-06-03,95.76
2019-06-04,98.7
2019-06-05,98.51
2019-06-06,98.75
2019-06-07,97.94
2019-06-10,98.88
2019-06-11,97.84
2019-06-12,96.62
2019-06-13,96.49
2019-06-14,96.545
2019-06-17,95.48
2019-06-18,95.86
2019-06-19,96.06
2019-06-20,95.86
2019-06-21,95.755
2019-06-24,95.475
2019-06-25,95.925
2019-06-26,95.87
2019-06-27,95.945
2019-06-28,97.015
2019-07-01,98.97
2019-07-02,97.88
2019-07-03,99.41
2019-07-04,99.41
2019-07-05,100.24
2019-07-08,99.305
2019-07-09,100.77
2019-07-10,100.5
2019-07-11,100.92
2019-07-12,100.675
2019-07-15,98.5
2019-07-16,94.21
2019-07-17,94.705
2019-07-18,95.815
2019-07-19,96.985
2019-07-22,96.59
2019-07-23,96.915
2019-07-24,98.225
2019-07-25,98.54
2019-07-26,100.19
2019-07-29,99.64
2019-07-30,99.955
2019-07-31,99.36
2019-08-01,95.69
2019-08-02,96.44
2019-08-05,93.15
2019-08-06,93.745
2019-08-07,91.7
2019-08-08,93.18
2019-08-09,94.38
2019-08-12,93.37
2019-08-13,93.6
2019-08-14,91.53
2019-08-15,90.62
2019-08-16,92.145
2019-08-19,92.28
2019-08-20,89.95
2019-08-21,90.69
2019-08-22,91.77
2019-08-23,88.69
2019-08-26,89.805
2019-08-27,88.73
2019-08-28,88.405
2019-08-29,89.86
2019-08-30,89.84
2019-09-02,89.74
2019-09-03,88.03
2019-09-04,88.65
2019-09-05,89.665
2019-09-06,89.18
2019-09-09,91.15
2019-09-10,92.56
2019-09-11,93.96
2019-09-12,93.82
2019-09-13,95.75
2019-09-16,96.235
2019-09-17,95.64
2019-09-18,96.28
2019-09-19,95.37
2019-09-20,95.23
2019-09-23,94.96
2019-09-24,95.13
2019-09-25,96.23
2019-09-26,96.615
2019-09-27,97.395
2019-09-30,96.78
2019-10-01,94.75
2019-10-02,91.72
2019-10-03,92.44
2019-10-04,94.81
2019-10-07,94.885
2019-10-08,92.61
2019-10-09,93.34
2019-10-10,94.23
2019-10-11,96.88
2019-10-14,97.55
2019-10-15,104.58
2019-10-16,103.235
2019-10-17,103.44
2019-10-18,104.29
2019-10-21,104.95
2019-10-22,106.17
2019-10-23,106.465
2019-10-24,106.31
2019-10-25,107.62
2019-10-28,107.52
2019-10-29,107.75
2019-10-30,107.085
2019-10-31,106.31
2019-11-01,108.2
2019-11-04,109.55
2019-11-05,109.83
2019-11-06,109.54
2019-11-07,109.97
2019-11-08,110.13
2019-11-11,109.495
2019-11-12,109.86
2019-11-13,108.84
2019-11-14,108.985
2019-11-15,108.77
2019-11-18,108.155
2019-11-19,109.04
2019-11-20,108.555
2019-11-21,107.765
2019-11-22,108.34
2019-11-25,109.005
