date,close
2014-07-18,11.25
2014-07-21,11.51
2014-07-22,11.44
2014-07-23,11.02
2014-07-24,10.99
2014-07-25,10.67
2014-07-28,11.15
2014-07-29,11.42
2014-07-30,11.47
2014-07-31,11.32
2014-08-01,11.42
2014-08-04,11.74
2014-08-05,11.91
2014-08-06,11.89
2014-08-07,11.67
2014-08-08,11.95
2014-08-11,12.36
2014-08-12,12.14
2014-08-13,12.19
2014-08-14,12.32
2014-08-15,12.16
2014-08-18,12.05
2014-08-19,11.81
2014-08-20,11.57
2014-08-21,12.45
2014-08-22,12.6
2014-08-25,12.5
2014-08-26,12.48
2014-08-27,12.4
2014-08-28,12.33
2014-08-29,12.41
2014-09-02,13.13
2014-09-03,13.59
2014-09-04,14.2
2014-09-05,13.99
2014-09-08,13.65
2014-09-09,13
2014-09-10,13.15
2014-09-11,13.13
2014-09-12,13.09
2014-09-15,13.02
2014-09-16,12.75
2014-09-17,12.9
2014-09-18,13.38
2014-09-19,13.34
2014-09-22,13.3
2014-09-23,13.44
2014-09-24,13.28
2014-09-25,12.97
2014-09-26,13.82
2014-09-29,13.72
2014-09-30,14.07
2014-10-01,13.81
2014-10-02,13.57
2014-10-03,13.59
2014-10-06,13.95
2014-10-07,13.55
2014-10-08,13.56
2014-10-09,13.01
2014-10-10,13.3
2014-10-13,13.16
2014-10-14,13.39
2014-10-15,13.21
2014-10-16,13.62
2014-10-17,12.63
2014-10-20,13.24
2014-10-21,13.07
2014-10-22,12.72
2014-10-23,12.79
2014-10-24,12.54
2014-10-27,12.19
2014-10-28,12.98
2014-10-29,12.73
2014-10-30,13.54
2014-10-31,12.94
2014-11-03,13.42
2014-11-04,13.48
2014-11-05,13.46
2014-11-06,13.42
2014-11-07,14.12
2014-11-10,14
2014-11-11,13.42
2014-11-12,13.54
2014-11-13,13.28
2014-11-14,13.13
2014-11-17,13.12
2014-11-18,12.99
2014-11-19,12.8
2014-11-20,13
2014-11-21,13.05
2014-11-24,13.5
2014-11-25,13.28
2014-11-26,13.65
2014-11-28,13.8
2014-12-01,12.9
2014-12-02,13.17
2014-12-03,13.25
2014-12-04,13.3
2014-12-05,13.25
2014-12-08,13.15
2014-12-09,13.81
2014-12-10,13.46
2014-12-11,13.47
2014-12-12,13.33
2014-12-15,13.34
2014-12-16,13.44
2014-12-17,13.87
2014-12-18,13.69
2014-12-19,15.02
2014-12-22,14.55
2014-12-23,14.62
2014-12-24,14.65
2014-12-26,14.85
2014-12-29,15.26
2014-12-30,15
2014-12-31,15.62
2015-01-02,15.5
2015-01-05,14.94
2015-01-06,14.43
2015-01-07,13.99
2015-01-08,13.95
2015-01-09,14.02
2015-01-12,13.65
2015-01-13,13.91
2015-01-14,14.19
2015-01-15,13.74
2015-01-16,14.4
2015-01-20,14.11
2015-01-21,13.63
2015-01-22,13.8
2015-01-23,13.94
2015-01-26,14.45
2015-01-27,14.34
2015-01-28,14.04
2015-01-29,14.14
2015-01-30,13.88
2015-02-02,13.3
2015-02-03,14
2015-02-04,14.11
2015-02-05,14.48
2015-02-06,14.3
2015-02-09,14.15
2015-02-10,13.96
2015-02-11,14.26
2015-02-12,14.4
2015-02-13,14.37
2015-02-17,14.21
2015-02-18,14.21
2015-02-19,14.17
2015-02-20,14.25
2015-02-23,14.3
2015-02-24,14.67
2015-02-25,14.92
2015-02-26,15.73
2015-02-27,16.69
2015-03-02,17.52
2015-03-03,17.81
2015-03-04,17.64
2015-03-05,18.46
2015-03-06,18.31
2015-03-09,17.78
2015-03-10,17.78
2015-03-11,18.02
2015-03-12,17.85
2015-03-13,17.39
2015-03-16,17.89
2015-03-17,18.3
2015-03-18,17.95
2015-03-19,17.8
2015-03-20,17.81
2015-03-23,17.84
2015-03-24,18.02
2015-03-25,17.54
2015-03-26,18.5
2015-03-27,21.07
2015-03-30,21.06
2015-03-31,21.06
2015-04-01,21.17
2015-04-02,20.95
2015-04-06,20.94
2015-04-07,22.61
2015-04-08,24.33
2015-04-09,24.87
2015-04-10,24.33
2015-04-13,24.21
2015-04-14,23.86
2015-04-15,23.18
2015-04-16,23.78
2015-04-17,23.08
2015-04-20,23.03
2015-04-21,22.77
2015-04-22,22.33
2015-04-23,22.84
2015-04-24,22.19
2015-04-27,21.6
2015-04-28,22.28
2015-04-29,21.58
2015-04-30,21.01
2015-05-01,21.18
2015-05-04,21.21
2015-05-05,21.14
2015-05-06,20.69
2015-05-07,21.35
2015-05-08,21.24
2015-05-11,21.85
2015-05-12,21.68
2015-05-13,23
2015-05-14,22.96
2015-05-15,24.38
2015-05-18,23.98
2015-05-19,23.57
2015-05-20,26.01
2015-05-21,25.77
2015-05-22,24.89
2015-05-26,25.02
2015-05-27,25.68
2015-05-28,25.72
2015-05-29,26.04
2015-06-01,26.24
2015-06-02,26.25
2015-06-03,27.82
2015-06-04,27.81
2015-06-05,28.31
2015-06-08,28.52
2015-06-09,27.15
2015-06-10,29.28
2015-06-11,29.01
2015-06-12,29.88
2015-06-15,31.65
2015-06-16,31.24
2015-06-17,31.12
2015-06-18,31.63
2015-06-19,31.21
2015-06-22,31.17
2015-06-23,30.8
2015-06-24,30.5
2015-06-25,31
2015-06-26,30.75
2015-06-29,29.8
2015-06-30,30.43
2015-07-01,30.61
2015-07-02,30.37
2015-07-06,30.26
2015-07-07,28.98
2015-07-08,28.31
2015-07-09,29.11
2015-07-10,31.3
2015-07-13,32.82
2015-07-14,33.4
2015-07-15,32.01
2015-07-16,33.97
2015-07-17,34.12
2015-07-20,33.33
2015-07-21,33.05
2015-07-22,33.2
2015-07-23,34.2
2015-07-24,32.92
2015-07-27,30.81
2015-07-28,32.44
2015-07-29,32.46
2015-07-30,32.21
2015-07-31,31.8
2015-08-03,31.5
2015-08-04,31.42
2015-08-05,31.72
2015-08-06,31.76
2015-08-07,31.11
2015-08-10,32.24
2015-08-11,30.77
2015-08-12,29.34
2015-08-13,29.99
2015-08-14,31.26
2015-08-17,31.82
2015-08-18,31.12
2015-08-19,31.05
2015-08-20,31.22
2015-08-21,32.66
2015-08-24,29.4
2015-08-25,27.69
2015-08-26,26.39
2015-08-27,27
2015-08-28,27.56
2015-08-31,27.2
2015-09-01,26.2
2015-09-02,27.04
2015-09-03,27.67
2015-09-04,27.44
2015-09-08,28.72
2015-09-09,28.65
2015-09-10,29.29
2015-09-11,29.6
2015-09-14,29.88
2015-09-15,31.23
2015-09-16,31.87
2015-09-17,32.98
2015-09-18,32.71
2015-09-21,32.3
2015-09-22,31.96
2015-09-23,33.49
2015-09-24,32.59
2015-09-25,31.79
2015-09-28,30.48
2015-09-29,30.43
2015-09-30,30.59
2015-10-01,29.97
2015-10-02,30.91
2015-10-05,31.65
2015-10-06,31.82
2015-10-07,31.11
2015-10-08,31.15
2015-10-09,31.92
2015-10-12,32.06
2015-10-13,31.7
2015-10-14,31.48
2015-10-15,33.69
2015-10-16,34.78
2015-10-19,34.99
2015-10-20,33.57
2015-10-21,32.99
2015-10-22,33.36
2015-10-23,34.06
2015-10-26,33.73
2015-10-27,33.6
2015-10-28,34.52
2015-10-29,34.15
2015-10-30,34.57
2015-11-02,34.11
2015-11-03,34.03
2015-11-04,35.34
2015-11-05,34.24
2015-11-06,35.08
2015-11-09,34.2
2015-11-10,34.18
2015-11-11,34.21
2015-11-12,34.21
2015-11-13,34.05
2015-11-16,34.85
2015-11-17,37.94
2015-11-18,36.24
2015-11-19,36.09
2015-11-20,36.95
2015-11-23,37.45
2015-11-24,36.4
2015-11-25,35.69
2015-11-27,36.22
2015-11-30,35.16
2015-12-01,35.01
2015-12-02,35
2015-12-03,35.05
2015-12-04,35.92
2015-12-07,36.19
2015-12-08,36.99
2015-12-09,36.7
2015-12-10,36.96
2015-12-11,35.2
2015-12-14,35.17
2015-12-15,35.35
2015-12-16,36.02
2015-12-17,37.8
2015-12-18,35.66
2015-12-21,35.17
2015-12-22,34.19
2015-12-23,33.6
2015-12-24,34.71
2015-12-28,36.32
2015-12-29,37.59
2015-12-30,37.55
2015-12-31,37.51
2016-01-04,36.78
2016-01-05,37.54
2016-01-06,37.69
2016-01-07,36.3
2016-01-08,35.51
2016-01-11,33.35
2016-01-12,33.6
2016-01-13,32.3
2016-01-14,32.41
2016-01-15,31.99
2016-01-19,31.51
2016-01-20,31.03
2016-01-21,31.32
2016-01-22,31.65
2016-01-25,30.62
2016-01-26,29.63
2016-01-27,29.23
2016-01-28,29.48
2016-01-29,30.42
2016-02-01,31.03
2016-02-02,30.05
2016-02-03,28.64
2016-02-04,29.18
2016-02-05,26.24
2016-02-08,23.5
2016-02-09,23.32
2016-02-10,23.89
2016-02-11,23.52
2016-02-12,23.13
2016-02-16,25.03
2016-02-17,25.66
2016-02-18,26.23
2016-02-19,28.11
2016-02-22,29.24
2016-02-23,29.01
2016-02-24,29.69
2016-02-25,30.85
2016-02-26,31.38
2016-02-29,30.85
2016-03-01,31.9
2016-03-02,30.2
2016-03-03,29.94
2016-03-04,30.5
2016-03-07,30.36
2016-03-08,29.35
2016-03-09,29.18
2016-03-10,28.72
2016-03-11,28.98
2016-03-14,29.99
2016-03-15,31.14
2016-03-16,30.76
2016-03-17,31.35
2016-03-18,31.87
2016-03-21,30.99
2016-03-22,30.67
2016-03-23,29.92
2016-03-24,29.09
2016-03-28,29.67
2016-03-29,31.43
2016-03-30,30.98
2016-03-31,30.86
2016-04-01,31.82
2016-04-04,32.33
2016-04-05,32.43
2016-04-06,32.27
2016-04-07,31.17
2016-04-08,31.21
2016-04-11,31.4
2016-04-12,30.85
2016-04-13,32.97
2016-04-14,33.52
2016-04-15,33.97
2016-04-18,34.01
2016-04-19,33.31
2016-04-20,33.97
2016-04-21,34.5
2016-04-22,35.74
2016-04-25,34.85
2016-04-26,35.71
2016-04-27,35.25
2016-04-28,34.66
2016-04-29,35.49
2016-05-02,35.14
2016-05-03,34.31
2016-05-04,34.4
2016-05-05,34.8
2016-05-06,35.32
2016-05-09,36.06
2016-05-10,38.2
2016-05-11,38.35
2016-05-12,39.58
2016-05-13,38.08
2016-05-16,37.95
2016-05-17,36.97
2016-05-18,37.24
2016-05-19,37.29
2016-05-20,37.61
2016-05-23,38.43
2016-05-24,38.35
2016-05-25,37.87
2016-05-26,38.11
2016-05-27,38.74
2016-05-31,40.14
2016-06-01,39.01
2016-06-02,38.76
2016-06-03,38.34
2016-06-06,38.83
2016-06-07,40.38
2016-06-08,40.07
2016-06-09,39.41
2016-06-10,38.66
2016-06-13,38.85
2016-06-14,39.64
2016-06-15,39.6
2016-06-16,39.67
2016-06-17,39.06
2016-06-20,39.96
2016-06-21,39.83
2016-06-22,39.7
2016-06-23,40.14
2016-06-24,38
2016-06-27,37.02
2016-06-28,37.5
2016-06-29,39.26
2016-06-30,39.35
2016-07-01,39.4
2016-07-05,39.54
2016-07-06,39.55
2016-07-07,39.28
2016-07-08,40.03
2016-07-11,40.12
2016-07-12,41.34
2016-07-13,42.52
2016-07-14,42.02
2016-07-15,41.14
2016-07-18,40.66
2016-07-19,40.03
2016-07-20,40.72
2016-07-21,39.44
2016-07-22,40.2
2016-07-25,40.59
2016-07-26,40.94
2016-07-27,41.37
2016-07-28,42.1
2016-07-29,42.19
2016-08-01,43.1
2016-08-02,43.27
2016-08-03,43.38
2016-08-04,42.6
2016-08-05,43.07
2016-08-08,43.82
2016-08-09,43.02
2016-08-10,42.33
2016-08-11,43.91
2016-08-12,42.3
2016-08-15,41.13
2016-08-16,40.24
2016-08-17,41.21
2016-08-18,41
2016-08-19,40.64
2016-08-22,40.16
2016-08-23,40.38
2016-08-24,40.26
2016-08-25,39.28
2016-08-26,39.37
2016-08-29,38.42
2016-08-30,38.99
2016-08-31,39.05
2016-09-01,39.38
2016-09-02,40.19
2016-09-06,39.95
2016-09-07,40.01
2016-09-08,39.41
2016-09-09,38.99
2016-09-12,39.58
2016-09-13,39.34
2016-09-14,40.64
2016-09-15,41.84
2016-09-16,40
2016-09-19,40.07
2016-09-20,40.12
2016-09-21,41.12
2016-09-22,41.4
2016-09-23,41.88
2016-09-26,40.4
2016-09-27,40.62
2016-09-28,41.74
2016-09-29,41.13
2016-09-30,42.12
2016-10-03,42.34
2016-10-04,43.14
2016-10-05,44.26
2016-10-06,43.98
2016-10-07,43.99
2016-10-10,44.87
2016-10-11,43.92
2016-10-12,43.98
2016-10-13,43.5
2016-10-14,43.69
2016-10-17,43.66
2016-10-18,44.34
2016-10-19,44.76
2016-10-20,44.27
2016-10-21,44.25
2016-10-24,47.13
2016-10-25,46.39
2016-10-26,45.47
2016-10-27,44.03
2016-10-28,43.7
2016-10-31,43.5
2016-11-01,42.77
2016-11-02,41.36
2016-11-03,41.9
2016-11-04,41.79
2016-11-07,43.17
2016-11-08,43.01
2016-11-09,44.08
2016-11-10,43.37
2016-11-11,44.51
2016-11-14,45.49
2016-11-15,40.52
2016-11-16,38.8
2016-11-17,38.96
2016-11-18,38.43
2016-11-21,37.74
2016-11-22,37.58
2016-11-23,36.4
2016-11-25,36.32
2016-11-28,36.35
2016-11-29,35.39
2016-11-30,34.26
2016-12-01,33.2
2016-12-02,33
2016-12-05,32.89
2016-12-06,32.45
2016-12-07,32.49
2016-12-08,33.37
2016-12-09,33.33
2016-12-12,32.83
2016-12-13,33.5
2016-12-14,33.56
2016-12-15,33.74
2016-12-16,33.62
2016-12-19,33.64
2016-12-20,33.79
2016-12-21,33.45
2016-12-22,32.61
2016-12-23,32.58
2016-12-27,32.91
2016-12-28,32.36
2016-12-29,32.71
2016-12-30,33.35
2017-01-03,32.99
2017-01-04,32.92
2017-01-05,32.44
2017-01-06,32.15
2017-01-09,31.68
2017-01-10,31.41
2017-01-11,30.96
2017-01-12,32.92
2017-01-13,34.51
2017-01-17,34.49
2017-01-18,34.9
2017-01-19,34.86
2017-01-20,34.69
2017-01-23,34.06
2017-01-24,34.33
2017-01-25,35.3
2017-01-26,35.08
2017-01-27,34.02
2017-01-30,33.86
2017-01-31,33.15
2017-02-01,32.77
2017-02-02,32.3
2017-02-03,33.43
2017-02-06,33.21
2017-02-07,33.31
2017-02-08,33.31
2017-02-09,33.66
2017-02-10,34.66
2017-02-13,34.57
2017-02-14,34.78
2017-02-15,35.51
2017-02-16,35.96
2017-02-17,34.52
2017-02-21,35.63
2017-02-22,36.49
2017-02-23,37.04
2017-02-24,37.15
2017-02-27,36.96
2017-02-28,36.3
2017-03-01,37.31
2017-03-02,36.74
2017-03-03,36.4
2017-03-06,36.15
2017-03-07,35.54
2017-03-08,36.3
2017-03-09,36.62
2017-03-10,36.76
2017-03-13,36.59
2017-03-14,36.19
2017-03-15,36.07
2017-03-16,35.89
2017-03-17,35.78
2017-03-20,35.77
2017-03-21,34.66
2017-03-22,34.91
2017-03-23,35.31
2017-03-24,36.11
2017-03-27,36.21
2017-03-28,36.8
2017-03-29,36.4
2017-03-30,36.4
2017-03-31,36.4
2017-04-03,36.09
2017-04-04,35.65
2017-04-05,34.62
2017-04-06,34.07
2017-04-07,33.99
2017-04-10,33.83
2017-04-11,33.98
2017-04-12,33.95
2017-04-13,33.83
2017-04-17,34.09
2017-04-18,34.17
2017-04-19,35.09
2017-04-20,35.08
2017-04-21,34.96
2017-04-24,35.44
2017-04-25,35.55
2017-04-26,36.53
2017-04-27,37.04
2017-04-28,37.89
2017-05-01,37.53
2017-05-02,37.29
2017-05-03,37.14
2017-05-04,37.14
2017-05-05,37.41
2017-05-08,37.04
2017-05-09,37.35
2017-05-10,37.44
2017-05-11,37.03
2017-05-12,36.99
2017-05-15,37.49
2017-05-16,38.31
2017-05-17,37.75
2017-05-18,37.27
2017-05-19,38.9
2017-05-22,37.3
2017-05-23,37
2017-05-24,38.21
2017-05-25,39.6
2017-05-26,39.86
2017-05-30,38.69
2017-05-31,39.16
2017-06-01,40.98
2017-06-02,41.38
2017-06-05,41.23
2017-06-06,42.81
2017-06-07,42.76
2017-06-08,43.94
2017-06-09,43.33
2017-06-12,42.32
2017-06-13,42.3
2017-06-14,42.16
2017-06-15,42.03
2017-06-16,41.63
2017-06-19,42.54
2017-06-20,42.99
2017-06-21,43.29
2017-06-22,43.25
2017-06-23,43.21
2017-06-26,43.71
2017-06-27,42.39
2017-06-28,43.15
2017-06-29,42.94
2017-06-30,43.44
2017-07-03,42.51
2017-07-05,43.23
2017-07-06,42.81
2017-07-07,40.85
2017-07-10,40.3
2017-07-11,41.05
2017-07-12,41.59
2017-07-13,41.45
2017-07-14,43.18
2017-07-17,42.79
2017-07-18,43.08
2017-07-19,44.29
2017-07-20,44.51
2017-07-21,45.35
2017-07-24,45.69
2017-07-25,46.61
2017-07-26,47.34
2017-07-27,45.25
2017-07-28,45.73
2017-07-31,45.97
2017-08-01,43.73
2017-08-02,43.44
2017-08-03,43.47
2017-08-04,43.73
2017-08-07,43.42
2017-08-08,43.22
2017-08-09,43.37
2017-08-10,42.92
2017-08-11,42.96
2017-08-14,43.68
2017-08-15,42.45
2017-08-16,42.9
2017-08-17,42.26
2017-08-18,39.56
2017-08-21,38.91
2017-08-22,39.23
2017-08-23,39.22
2017-08-24,39.48
2017-08-25,39.48
2017-08-28,38.81
2017-08-29,38.49
2017-08-30,38.49
2017-08-31,38.89
2017-09-01,38.69
2017-09-05,37.75
2017-09-06,37.6
2017-09-07,37.07
2017-09-08,37.84
2017-09-11,38.82
2017-09-12,38.75
2017-09-13,39
2017-09-14,38.85
2017-09-15,38.85
2017-09-18,39
2017-09-19,37.93
2017-09-20,37.79
2017-09-21,38.45
2017-09-22,38.34
2017-09-25,38.53
2017-09-26,38.16
2017-09-27,38.99
2017-09-28,39.7
2017-09-29,40.07
2017-10-02,41.3
2017-10-03,40.97
2017-10-04,41.2
2017-10-05,41.05
2017-10-06,41.1
2017-10-09,41.52
2017-10-10,41.48
2017-10-11,41.9
2017-10-12,42.45
2017-10-13,42
2017-10-16,41.2
2017-10-17,42.02
2017-10-18,41.86
2017-10-19,40.6
2017-10-20,40.71
2017-10-23,40.39
2017-10-24,39.92
2017-10-25,38.31
2017-10-26,38.13
2017-10-27,37.8
2017-10-30,37.47
2017-10-31,37.72
2017-11-01,36.91
2017-11-02,36.25
2017-11-03,36.6
2017-11-06,37.22
2017-11-07,35.88
2017-11-08,36.06
2017-11-09,36.3
2017-11-10,35.94
2017-11-13,35.69
2017-11-14,35.29
2017-11-15,35.15
2017-11-16,35.81
2017-11-17,40.58
2017-11-20,40.74
2017-11-21,40.75
2017-11-22,40.25
2017-11-24,41.44
2017-11-27,39.72
2017-11-28,40.09
2017-11-29,39.92
2017-11-30,40
2017-12-01,39.31
2017-12-04,38.11
2017-12-05,38.67
2017-12-06,39.07
2017-12-07,39.17
2017-12-08,39.11
2017-12-11,40.75
2017-12-12,40.78
2017-12-13,41.91
2017-12-14,41.62
2017-12-15,42.37
2017-12-18,43.17
2017-12-19,44.36
2017-12-20,44.8
2017-12-21,44.5
2017-12-22,44.99
2017-12-26,44.8
2017-12-27,45.28
2017-12-28,45.69
2017-12-29,46.46
2018-01-02,45.12
2018-01-03,44.97
2018-01-04,45.36
2018-01-05,45.42
2018-01-08,46.41
2018-01-09,46.8
2018-01-10,46.73
2018-01-11,47.3
2018-01-12,47.28
2018-01-16,48.14
2018-01-17,46.77
2018-01-18,46.95
2018-01-19,48.27
2018-01-22,47.62
2018-01-23,48.09
2018-01-24,47.89
2018-01-25,45.88
2018-01-26,46.75
2018-01-29,46.17
2018-01-30,45.38
2018-01-31,45.44
2018-02-01,45.23
2018-02-02,44.88
2018-02-05,43.84
2018-02-06,44.56
2018-02-07,44.2
2018-02-08,43.19
2018-02-09,42.69
2018-02-12,44.21
2018-02-13,45.5
2018-02-14,46.38
2018-02-15,47.14
2018-02-16,51.39
2018-02-20,52.45
2018-02-21,51.63
2018-02-22,51.5
2018-02-23,52.22
2018-02-26,51.71
2018-02-27,51.6
2018-02-28,52.08
2018-03-01,52.19
2018-03-02,52.13
2018-03-05,52.31
2018-03-06,52.04
2018-03-07,52.98
2018-03-08,53.37
2018-03-09,54.04
2018-03-12,54.44
2018-03-13,53.5
2018-03-14,53.05
2018-03-15,53.13
2018-03-16,53.29
2018-03-19,52.02
2018-03-20,53.63
2018-03-21,53.52
2018-03-22,51.79
2018-03-23,50.69
2018-03-26,52.3
2018-03-27,51.63
2018-03-28,50.75
2018-03-29,51.54
2018-04-02,49.94
2018-04-03,48.83
2018-04-04,48.18
2018-04-05,48.35
2018-04-06,47.76
2018-04-09,45.92
2018-04-10,45.75
2018-04-11,44.79
2018-04-12,45.18
2018-04-13,44.77
2018-04-16,44.65
2018-04-17,45.36
2018-04-18,44.78
2018-04-19,44.88
2018-04-20,44.1
2018-04-23,44.37
2018-04-24,43.94
2018-04-25,44.17
2018-04-26,45.22
2018-04-27,44.36
2018-04-30,45.01
2018-05-01,44.8
2018-05-02,45.02
2018-05-03,45.97
2018-05-04,46
2018-05-07,47.23
2018-05-08,47.69
2018-05-09,47.36
2018-05-10,47.5
2018-05-11,51.83
2018-05-14,50.65
2018-05-15,50.46
2018-05-16,50.9
2018-05-17,50.81
2018-05-18,51.27
2018-05-21,50.47
2018-05-22,50
2018-05-23,50.33
2018-05-24,50.71
2018-05-25,51.15
2018-05-29,51.11
2018-05-30,52.05
2018-05-31,51.5
2018-06-01,52.31
2018-06-04,53.22
2018-06-05,53.72
2018-06-06,53.79
2018-06-07,53.64
2018-06-08,54.27
2018-06-11,53.78
2018-06-12,55.11
2018-06-13,54.67
2018-06-14,55.23
2018-06-15,55.89
2018-06-18,57
2018-06-19,57
2018-06-20,52.82
2018-06-21,56.04
2018-06-22,56.5
2018-06-25,55.66
2018-06-26,55.49
2018-06-27,54.77
2018-06-28,55.01
2018-06-29,56.79
2018-07-02,56.81
2018-07-03,56.34
2018-07-05,55.86
2018-07-06,55.89
2018-07-09,56.76
2018-07-10,56.96
2018-07-11,57.05
2018-07-12,58.82
2018-07-13,58.95
2018-07-16,57.68
2018-07-17,57.86
2018-07-18,58.65
2018-07-19,59.45
2018-07-20,58.79
2018-07-23,58.48
2018-07-24,56.69
2018-07-25,57.31
2018-07-26,57.61
2018-07-27,56.2
2018-07-30,55.07
2018-07-31,55.44
2018-08-01,55.91
2018-08-02,56.82
2018-08-03,56.69
2018-08-06,57.26
2018-08-07,57.38
2018-08-08,59.32
2018-08-09,58.18
2018-08-10,58.21
2018-08-13,57.87
2018-08-14,59.39
2018-08-15,57.55
2018-08-16,57.77
2018-08-17,58.35
2018-08-20,57.94
2018-08-21,56.86
2018-08-22,56.99
2018-08-23,59.04
2018-08-24,61.85
2018-08-27,62.13
2018-08-28,64.38
2018-08-29,64.51
2018-08-30,65.33
2018-08-31,64.88
2018-09-04,64.79
2018-09-05,61.7
2018-09-06,58.98
2018-09-07,59.45
2018-09-10,59.5
2018-09-11,59.24
2018-09-12,58.69
2018-09-13,59.64
2018-09-14,59.17
2018-09-17,58.57
2018-09-18,59.63
2018-09-19,59.65
2018-09-20,58.64
2018-09-21,56.47
2018-09-24,57.39
2018-09-25,58.38
2018-09-26,58.57
2018-09-27,59.15
2018-09-28,58.99
2018-10-01,59.1
2018-10-02,56.87
2018-10-03,57.85
2018-10-04,56.1
2018-10-05,55.81
2018-10-08,54.74
2018-10-09,54
2018-10-10,50.92
2018-10-11,49.24
2018-10-12,51.17
2018-10-15,50.27
2018-10-16,51.66
2018-10-17,51.59
2018-10-18,50.87
2018-10-19,50.69
2018-10-22,50.09
2018-10-23,49.68
2018-10-24,47.21
2018-10-25,49.12
2018-10-26,48.21
2018-10-29,47.06
2018-10-30,48.52
2018-10-31,51.48
2018-11-01,53.33
2018-11-02,53.42
2018-11-05,52.74
2018-11-06,53.32
2018-11-07,55.31
2018-11-08,54.1
2018-11-09,53.69
2018-11-12,52.61
2018-11-13,52.06
2018-11-14,50.79
2018-11-15,52.89
2018-11-16,53.29
2018-11-19,51.37
2018-11-20,50.45
2018-11-21,52.66
2018-11-23,52.5
2018-11-26,54.34
2018-11-27,54.53
2018-11-28,56.5
2018-11-29,57.3
2018-11-30,58.65
2018-12-03,59.67
2018-12-04,57.91
2018-12-06,57.33
2018-12-07,53.75
2018-12-10,53.76
2018-12-11,54.36
2018-12-12,56.9
2018-12-13,56.34
2018-12-14,55.23
2018-12-17,54.53
2018-12-18,56.31
2018-12-19,55.14
2018-12-20,55.04
2018-12-21,54.48
2018-12-24,52.71
2018-12-26,55.89
2018-12-27,57.07
2018-12-28,56.78
2018-12-31,56.32
2019-01-02,54.47
2019-01-03,52.1
2019-01-04,53.83
2019-01-07,57.25
2019-01-08,57.39
2019-01-09,60.83
2019-01-10,61.06
2019-01-11,60.25
2019-01-14,61.4
2019-01-15,63.54
2019-01-16,64.85
2019-01-17,64.12
2019-01-18,65
2019-01-22,64
2019-01-23,63.24
2019-01-24,64.67
2019-01-25,68.04
2019-01-28,68.29
2019-01-29,68.85
2019-01-30,68.03
2019-01-31,67.6
2019-02-01,67.52
2019-02-04,68.43
2019-02-05,67.64
2019-02-06,67.24
2019-02-07,66.5
2019-02-08,66.73
2019-02-11,67.51
2019-02-12,68
2019-02-13,68.4
2019-02-14,68.26
2019-02-15,70.78
2019-02-19,71.23
2019-02-20,69.42
2019-02-21,69.75
2019-02-22,71.99
2019-02-25,71.87
2019-02-26,70.18
2019-02-27,69.41
2019-02-28,68.89
2019-03-01,70.58
2019-03-04,71.29
2019-03-05,71.12
2019-03-06,69.11
2019-03-07,69.2
2019-03-08,68.64
2019-03-11,69.86
2019-03-12,70.29
2019-03-13,71.58
2019-03-14,70.91
2019-03-15,72.32
2019-03-18,70.88
2019-03-19,71.44
2019-03-20,71.17
2019-03-21,72.99
2019-03-22,69.91
2019-03-25,69.87
2019-03-26,71.23
2019-03-27,69.13
2019-03-28,71.17
2019-03-29,71.4
2019-04-01,69.77
2019-04-02,72.64
2019-04-03,74.51
2019-04-04,72.02
2019-04-05,74.6
2019-04-08,73.91
2019-04-09,76.37
2019-04-10,78.79
2019-04-11,79.82
2019-04-12,81.59
2019-04-15,80.74
2019-04-16,80.97
2019-04-17,78.37
2019-04-18,78.6
2019-04-22,80.09
2019-04-23,83.65
2019-04-24,82.81
2019-04-25,80.84
2019-04-26,83
2019-04-29,82.03
2019-04-30,83.99
2019-05-01,82.92
2019-05-02,82.9
2019-05-03,84.35
2019-05-06,82.79
2019-05-07,81.07
2019-05-08,83.19
2019-05-09,80
2019-05-10,85.49
2019-05-13,79.61
2019-05-14,81.16
2019-05-15,83.21
2019-05-16,86.42
2019-05-17,84.04
2019-05-20,84.62
2019-05-21,87.39
2019-05-22,89.34
2019-05-23,88.46
2019-05-24,89.46
2019-05-28,92.85
2019-05-29,88.35
2019-05-30,90.77
2019-05-31,92.84
2019-06-03,87.44
2019-06-04,89.88
2019-06-05,90.76
2019-06-06,91.49
2019-06-07,93.17
2019-06-10,96.12
2019-06-11,96.05
2019-06-12,99.6
2019-06-13,101.36
2019-06-14,99.67
2019-06-17,101.49
2019-06-18,101.94
2019-06-19,100.66
2019-06-20,103.515
2019-06-21,104.45
2019-06-24,101.72
2019-06-25,101.36
2019-06-26,98.43
2019-06-27,99.68
2019-06-28,100.385
2019-07-01,102.29
2019-07-02,103.01
2019-07-03,103.915
2019-07-04,103.915
2019-07-05,104.57
2019-07-08,105.46
2019-07-09,105.275
2019-07-10,109.18
2019-07-11,108.09
2019-07-12,107.955
2019-07-15,107.48
2019-07-16,107.06
2019-07-17,106.715
2019-07-18,106.02
2019-07-19,104.79
2019-07-22,105.545
2019-07-23,104.33
2019-07-24,105.58
2019-07-25,107.975
2019-07-26,110.675
2019-07-29,111.23
2019-07-30,107.26
2019-07-31,106.05
2019-08-01,109.99
2019-08-02,108.58
2019-08-05,103.55
2019-08-06,104.89
2019-08-07,102.905
2019-08-08,107.295
2019-08-09,107.79
2019-08-12,103.44
2019-08-13,105.22
2019-08-14,100.93
2019-08-15,101.335
2019-08-16,98.575
2019-08-19,91.72
2019-08-20,90.16
2019-08-21,93.705
2019-08-22,96.87
2019-08-23,95.42
2019-08-26,95.71
2019-08-27,93.56
2019-08-28,92.905
2019-08-29,95
2019-08-30,95.005
2019-09-02,94.99
2019-09-03,91.43
2019-09-04,93.91
2019-09-05,95.02
2019-09-06,93.46
2019-09-09,89.99
2019-09-10,87.24
2019-09-11,87.46
2019-09-12,87.9
2019-09-13,86.79
2019-09-16,88.74
2019-09-17,91.45
2019-09-18,93.16
2019-09-19,93.29
2019-09-20,95.43
2019-09-23,91.45
2019-09-24,90.39
2019-09-25,90.87
2019-09-26,93.01
2019-09-27,91.985
2019-09-30,91.47
2019-10-01,92.03
2019-10-02,90.62
2019-10-03,93.96
2019-10-04,94.49
2019-10-07,96.69
2019-10-08,92.73
2019-10-09,95.37
2019-10-10,95.82
2019-10-11,98.84
2019-10-14,99.025
2019-10-15,100.265
2019-10-16,100.21
2019-10-17,99.96
2019-10-18,98.045
2019-10-21,96.18
2019-10-22,91.26
2019-10-23,88.92
2019-10-24,91.18
2019-10-25,88.26
2019-10-28,92.33
2019-10-29,90.74
2019-10-30,92.475
2019-10-31,93.25
2019-11-01,93.58
2019-11-04,94.13
2019-11-05,95.88
2019-11-06,96.285
2019-11-07,98.585
2019-11-08,98.93
2019-11-11,100.9
2019-11-12,104.24
2019-11-13,105.03
2019-11-14,108.96
2019-11-15,99.735
2019-11-18,94.195
2019-11-19,95.93
2019-11-20,99.53
2019-11-21,99.985
2019-11-22,102.06
2019-11-25,105.15
