date,close
2014-06-13,55.0759
2014-06-16,55.4154
2014-06-17,55.2268
2014-06-18,55.5739
2014-06-19,56.1172
2014-06-20,55.838
2014-06-23,56.1021
2014-06-24,55.506
2014-06-25,55.7173
2014-06-26,55.9135
2014-06-27,55.5739
2014-06-30,56.1247
2014-07-01,56.751
2014-07-02,56.9397
2014-07-03,56.8567
2014-07-07,56.419
2014-07-08,56.5247
2014-07-09,56.419
2014-07-10,56.7661
2014-07-11,56.5398
2014-07-14,56.5322
2014-07-15,57.1057
2014-07-16,57.1208
2014-07-17,56.8039
2014-07-18,57.5282
2014-07-21,57.649
2014-07-22,57.6263
2014-07-23,57.7622
2014-07-24,57.7697
2014-07-25,57.5056
2014-07-28,56.4562
2014-07-29,57.7833
2014-07-30,56.6092
2014-07-31,55.8238
2014-08-01,54.8129
2014-08-04,55.4972
2014-08-05,55.4972
2014-08-06,55.3339
2014-08-07,55.3806
2014-08-08,55.5516
2014-08-11,55.7072
2014-08-12,55.6216
2014-08-13,55.8705
2014-08-14,56.6947
2014-08-15,57.0369
2014-08-18,57.0057
2014-08-19,57.0291
2014-08-20,57.69
2014-08-21,57.2079
2014-08-22,57.1457
2014-08-25,57.5034
2014-08-26,57.2002
2014-08-27,57.4179
2014-08-28,58.04
2014-08-29,58.1177
2014-09-02,57.8611
2014-09-03,58.2033
2014-09-04,57.9622
2014-09-05,58.3588
2014-09-08,57.3168
2014-09-09,56.7958
2014-09-10,56.9824
2014-09-11,57.0057
2014-09-12,56.5703
2014-09-15,56.5081
2014-09-16,56.1815
2014-09-17,56.2282
2014-09-18,56.5781
2014-09-19,56.3292
2014-09-22,56.6092
2014-09-23,56.0493
2014-09-24,56.0415
2014-09-25,55.5983
2014-09-26,55.7227
2014-09-29,56.1659
2014-09-30,55.8938
2014-10-01,55.5361
2014-10-02,54.7896
2014-10-03,55.225
2014-10-06,55.2017
2014-10-07,54.6963
2014-10-08,55.6372
2014-10-09,54.533
2014-10-10,54.4397
2014-10-13,54.2453
2014-10-14,54.3308
2014-10-15,54.1986
2014-10-16,54.0898
2014-10-17,54.774
2014-10-20,55.1784
2014-10-21,55.3495
2014-10-22,55.3184
2014-10-23,55.9016
2014-10-24,56.2126
2014-10-27,56.3992
2014-10-28,56.9746
2014-10-29,56.4537
2014-10-30,57.2002
2014-10-31,57.8456
2014-11-03,57.2935
2014-11-04,57.1302
2014-11-05,57.8844
2014-11-06,56.617
2014-11-07,57.1068
2014-11-10,57.5112
2014-11-11,58.3432
2014-11-12,57.7678
2014-11-13,57.6045
2014-11-14,57.2624
2014-11-17,57.4645
2014-11-18,58.1955
2014-11-19,58.7103
2014-11-20,58.0705
2014-11-21,57.9836
2014-11-24,58.4023
2014-11-25,58.6155
2014-11-26,58.7735
2014-11-28,57.3439
2014-12-01,57.8415
2014-12-02,57.8968
2014-12-03,57.6361
2014-12-04,57.6203
2014-12-05,57.2886
2014-12-08,57.2254
2014-12-09,56.5382
2014-12-10,56.0564
2014-12-11,55.7641
2014-12-12,54.4372
2014-12-15,53.2998
2014-12-16,53.9475
2014-12-17,54.9348
2014-12-18,56.5303
2014-12-19,56.396
2014-12-22,56.6962
2014-12-23,56.1512
2014-12-24,57.0279
2014-12-26,57.1938
2014-12-29,56.7515
2014-12-30,56.0406
2014-12-31,55.8115
2015-01-02,55.2428
2015-01-05,54.7768
2015-01-06,53.7184
2015-01-07,55.2507
2015-01-08,55.5825
2015-01-09,55.2665
2015-01-12,55.3139
2015-01-13,55.4403
2015-01-14,54.7294
2015-01-15,54.7847
2015-01-16,55.2981
2015-01-20,55.7404
2015-01-21,55.9142
2015-01-22,55.7404
2015-01-23,55.6852
2015-01-26,55.93
2015-01-27,56.6251
2015-01-28,56.5224
2015-01-29,56.8226
2015-01-30,55.5588
2015-02-02,55.6378
2015-02-03,56.0406
2015-02-04,55.3929
2015-02-05,55.6536
2015-02-06,54.4609
2015-02-09,53.5367
2015-02-10,54.1133
2015-02-11,54.1212
2015-02-12,54.5399
2015-02-13,54.1765
2015-02-17,53.4183
2015-02-18,53.6789
2015-02-19,54.2792
2015-02-20,54.9111
2015-02-23,54.9032
2015-02-24,55.4008
2015-02-25,55.3139
2015-02-26,54.0975
2015-02-27,54.1528
2015-03-02,53.7421
2015-03-03,53.829
2015-03-04,52.6363
2015-03-05,53.0944
2015-03-06,51.5068
2015-03-09,51.8938
2015-03-10,50.8196
2015-03-11,50.3773
2015-03-12,50.5827
2015-03-13,49.8718
2015-03-16,49.9903
2015-03-17,50.709
2015-03-18,52.3203
2015-03-19,51.7437
2015-03-20,52.7548
2015-03-23,52.7074
2015-03-24,52.4783
2015-03-25,52.4388
2015-03-26,51.7516
2015-03-27,51.9807
2015-03-30,51.9096
2015-03-31,51.0329
2015-04-01,51.7595
2015-04-02,51.6806
2015-04-06,52.0597
2015-04-07,52.3361
2015-04-08,52.2414
2015-04-09,52.5257
2015-04-10,52.4546
2015-04-13,52.0755
2015-04-14,52.8101
2015-04-15,52.5494
2015-04-16,53.1102
2015-04-17,52.5731
2015-04-20,52.6679
2015-04-21,52.8338
2015-04-22,52.7943
2015-04-23,53.0944
2015-04-24,54.1212
2015-04-27,53.987
2015-04-28,54.374
2015-04-29,53.7184
2015-04-30,53.2603
2015-05-01,53.3867
2015-05-04,53.6631
2015-05-05,52.4309
2015-05-06,52.4072
2015-05-07,52.3519
2015-05-08,55.077
2015-05-11,55.385
2015-05-12,55.0849
2015-05-13,54.6978
2015-05-14,55.1796
2015-05-15,55.6457
2015-05-18,55.3613
2015-05-19,55.1796
2015-05-20,55.2981
2015-05-21,56.1986
2015-05-22,56.2854
2015-05-26,55.5114
2015-05-27,56.3486
2015-05-28,56.633
2015-05-29,56.6172
2015-06-01,56.3249
2015-06-02,56.0722
2015-06-03,55.3932
2015-06-04,54.4726
2015-06-05,53.5112
2015-06-08,53.6741
2015-06-09,53.1853
2015-06-10,54.0163
2015-06-11,54.4644
2015-06-12,54.0978
2015-06-15,54.3015
2015-06-16,54.8392
2015-06-17,55.1162
2015-06-18,55.6702
2015-06-19,55.2058
2015-06-22,55.2791
2015-06-23,54.8718
2015-06-24,54.8636
2015-06-25,55.0347
2015-06-26,54.5296
2015-06-29,53.2423
2015-06-30,52.6068
2015-07-01,52.281
2015-07-02,53.2179
2015-07-06,52.6639
2015-07-07,52.8676
2015-07-08,52.5905
2015-07-09,52.7616
2015-07-10,54.1222
2015-07-13,53.8045
2015-07-14,54.2444
2015-07-15,54.6437
2015-07-16,55.0755
2015-07-17,54.6111
2015-07-20,54.6274
2015-07-21,53.9186
2015-07-22,53.389
2015-07-23,53.0386
2015-07-24,52.8268
2015-07-27,53.0875
2015-07-28,53.0875
2015-07-29,53.5927
2015-07-30,53.7149
2015-07-31,54.277
2015-08-03,54.2037
2015-08-04,54.1467
2015-08-05,54.4237
2015-08-06,54.7414
2015-08-07,54.5866
2015-08-10,54.6762
2015-08-11,54.5622
2015-08-12,55.2628
2015-08-13,55.2873
2015-08-14,55.7435
2015-08-17,55.9798
2015-08-18,56.1916
2015-08-19,56.0857
2015-08-20,55.6295
2015-08-21,54.3911
2015-08-24,52.4846
2015-08-25,52.9653
2015-08-26,53.2749
2015-08-27,54.0163
2015-08-28,54.3015
2015-08-31,53.9186
2015-09-01,53.0305
2015-09-02,53.2912
2015-09-03,53.2831
2015-09-04,52.4683
2015-09-08,54.0652
2015-09-09,53.723
2015-09-10,54.4644
2015-09-11,53.9023
2015-09-14,53.4786
2015-09-15,53.4216
2015-09-16,54.2037
2015-09-17,54.3666
2015-09-18,54.1304
2015-09-21,54.2119
2015-09-22,53.6986
2015-09-23,53.6578
2015-09-24,54.4807
2015-09-25,55.1488
2015-09-28,55.4258
2015-09-29,55.8087
2015-09-30,56.7294
2015-10-01,56.8679
2015-10-02,58.3181
2015-10-05,58.0492
2015-10-06,58.0329
2015-10-07,58.0003
2015-10-08,58.644
2015-10-09,57.1286
2015-10-12,57.153
2015-10-13,56.6642
2015-10-14,57.3078
2015-10-15,58.3995
2015-10-16,58.5788
2015-10-19,58.6358
2015-10-20,58.8069
2015-10-21,58.481
2015-10-22,58.8232
2015-10-23,58.424
2015-10-26,59.0106
2015-10-27,58.4892
2015-10-28,58.4566
2015-10-29,58.1959
2015-10-30,58.3344
2015-11-02,58.4321
2015-11-03,58.0981
2015-11-04,58.0818
2015-11-05,57.8863
2015-11-06,55.2384
2015-11-09,55.3036
2015-11-10,56.1509
2015-11-11,56.4198
2015-11-12,56.656
2015-11-13,56.1672
2015-11-16,57.0797
2015-11-17,57.0797
2015-11-18,57.6093
2015-11-19,58.3995
2015-11-20,58.8313
2015-11-23,57.9107
2015-11-24,58.0616
2015-11-25,58.3762
2015-11-27,58.0616
2015-11-30,57.4904
2015-12-01,57.7056
2015-12-02,57.0269
2015-12-03,56.5136
2015-12-04,56.7537
2015-12-07,56.8116
2015-12-08,56.7951
2015-12-09,57.0103
2015-12-10,56.9275
2015-12-11,56.7951
2015-12-14,56.5385
2015-12-15,56.5385
2015-12-16,57.6394
2015-12-17,57.2586
2015-12-18,56.4888
2015-12-21,56.7371
2015-12-22,56.6709
2015-12-23,57.8795
2015-12-24,58.0699
2015-12-28,57.954
2015-12-29,58.6824
2015-12-30,58.5169
2015-12-31,57.5649
2016-01-04,57.0682
2016-01-05,57.1676
2016-01-06,57.7056
2016-01-07,57.3331
2016-01-08,56.5964
2016-01-11,57.2007
2016-01-12,56.3895
2016-01-13,56.1991
2016-01-14,56.7288
2016-01-15,55.3961
2016-01-19,55.9259
2016-01-20,54.4855
2016-01-21,54.8829
2016-01-22,56.6543
2016-01-25,56.3977
2016-01-26,56.9689
2016-01-27,57.2586
2016-01-28,57.8298
2016-01-29,58.6162
2016-02-01,59.6592
2016-02-02,59.204
2016-02-03,59.4109
2016-02-04,59.0218
2016-02-05,58.0616
2016-02-08,57.5401
2016-02-09,57.2007
2016-02-10,57.2917
2016-02-11,56.2901
2016-02-12,56.8779
2016-02-16,57.0682
2016-02-17,57.0765
2016-02-18,57.6394
2016-02-19,57.7139
2016-02-22,57.5484
2016-02-23,56.6461
2016-02-24,56.3398
2016-02-25,57.1179
2016-02-26,56.0004
2016-02-29,55.6941
2016-03-01,56.2239
2016-03-02,56.1577
2016-03-03,56.0501
2016-03-04,56.3315
2016-03-07,56.0335
2016-03-08,56.315
2016-03-09,56.8944
2016-03-10,57.3414
2016-03-11,57.9623
2016-03-14,57.7222
2016-03-15,57.5484
2016-03-16,57.8547
2016-03-17,59.0301
2016-03-18,58.7569
2016-03-21,58.7569
2016-03-22,57.9043
2016-03-23,57.8629
2016-03-24,58.3017
2016-03-28,58.401
2016-03-29,59.5185
2016-03-30,59.5516
2016-03-31,59.1212
2016-04-01,58.3596
2016-04-04,58.6659
2016-04-05,58.2023
2016-04-06,58.4507
2016-04-07,58.401
2016-04-08,58.7073
2016-04-11,58.6493
2016-04-12,59.055
2016-04-13,59.0632
2016-04-14,59.0136
2016-04-15,59.1957
2016-04-18,59.7917
2016-04-19,60.5119
2016-04-20,59.3695
2016-04-21,57.5153
2016-04-22,57.3497
2016-04-25,58.4175
2016-04-26,59.0467
2016-04-27,59.4026
2016-04-28,59.2702
2016-04-29,59.6096
2016-05-02,60.0483
2016-05-03,59.9738
2016-05-04,60.0483
2016-05-05,59.8083
2016-05-06,60.1808
2016-05-09,60.4291
2016-05-10,60.7519
2016-05-11,60.4539
2016-05-12,60.8182
2016-05-13,60.4788
2016-05-16,60.8099
2016-05-17,60.5698
2016-05-18,60.2553
2016-05-19,59.7586
2016-05-20,59.9407
2016-05-23,59.5516
2016-05-24,60.7933
2016-05-25,60.785
2016-05-26,61.1576
2016-05-27,61.6128
2016-05-31,61.1317
2016-06-01,60.6841
2016-06-02,60.0708
2016-06-03,61.2037
2016-06-06,60.9226
2016-06-07,61.2037
2016-06-08,61.5274
2016-06-09,61.57
2016-06-10,60.2496
2016-06-13,59.8834
2016-06-14,58.7675
2016-06-15,58.8697
2016-06-16,59.2445
2016-06-17,59.7385
2016-06-20,61.2292
2016-06-21,62.0896
2016-06-22,62.0981
2016-06-23,62.6348
2016-06-24,58.1456
2016-06-27,57.626
2016-06-28,59.4915
2016-06-29,61.4933
2016-06-30,63.3162
2016-07-01,63.3418
2016-07-05,63.444
2016-07-06,62.7455
2016-07-07,61.4848
2016-07-08,62.2259
2016-07-11,62.6518
2016-07-12,62.1151
2016-07-13,62.7199
2016-07-14,62.3707
2016-07-15,62.1407
2016-07-18,62.3962
2016-07-19,61.817
2016-07-20,62.2003
2016-07-21,62.3196
2016-07-22,62.1492
2016-07-25,62.8136
2016-07-26,62.7114
2016-07-27,62.2259
2016-07-28,62.4644
2016-07-29,61.7148
2016-08-01,61.8596
2016-08-02,61.9448
2016-08-03,61.1185
2016-08-04,61.11
2016-08-05,60.3093
2016-08-08,60.3008
2016-08-09,60.2837
2016-08-10,60.5819
2016-08-11,60.9993
2016-08-12,60.897
2016-08-15,60.7011
2016-08-16,60.3945
2016-08-17,60.5478
2016-08-18,61.3315
2016-08-19,60.6841
2016-08-22,60.9737
2016-08-23,60.7352
2016-08-24,60.5563
2016-08-25,60.8033
2016-08-26,59.7897
2016-08-29,60.1048
2016-08-30,59.1508
2016-08-31,59.1934
2016-09-01,59.5
2016-09-02,61.0333
2016-09-06,61.4507
2016-09-07,61.0504
2016-09-08,61.1355
2016-09-09,59.4574
2016-09-12,60.1985
2016-09-13,58.9549
2016-09-14,59.1252
2016-09-15,59.4745
2016-09-16,59.27
2016-09-19,59.9856
2016-09-20,59.8919
2016-09-21,60.1133
2016-09-22,61.0418
2016-09-23,60.0793
2016-09-26,60.4541
2016-09-27,60.897
2016-09-28,61.2207
2016-09-29,61.1441
2016-09-30,60.5733
2016-10-03,60.5478
2016-10-04,59.5426
2016-10-05,58.7504
2016-10-06,57.609
2016-10-07,55.6072
2016-10-10,55.7009
2016-10-11,54.815
2016-10-12,55.1302
2016-10-13,55.4113
2016-10-14,55.3942
2016-10-17,55.2324
2016-10-18,55.7776
2016-10-19,55.8372
2016-10-20,55.7179
2016-10-21,55.6753
2016-10-24,54.8917
2016-10-25,55.1131
2016-10-26,55.0705
2016-10-27,55.2409
2016-10-28,55.0791
2016-10-31,55.7264
2016-11-01,54.9683
2016-11-02,54.3295
2016-11-03,54.6106
2016-11-04,54.3465
2016-11-07,54.2698
2016-11-08,54.602
2016-11-09,53.7076
2016-11-10,51.1862
2016-11-11,51.4588
2016-11-14,49.5166
2016-11-15,50.1385
2016-11-16,49.917
2016-11-17,49.9255
2016-11-18,49.4059
2016-11-21,50.3003
2016-11-22,50.4065
2016-11-23,49.6449
2016-11-25,50.1901
2016-11-28,50.5017
2016-11-29,50.4844
2016-11-30,49.3939
2016-12-01,49.039
2016-12-02,49.8266
2016-12-05,49.5929
2016-12-06,49.5756
2016-12-07,49.9651
2016-12-08,50.2074
2016-12-09,50.8133
2016-12-12,50.9258
2016-12-13,51.1162
2016-12-14,50.1728
2016-12-15,50.069
2016-12-16,50.5363
2016-12-19,50.7614
2016-12-20,50.3892
2016-12-21,50.1122
2016-12-22,50.0603
2016-12-23,50.3719
2016-12-27,50.3373
2016-12-28,50.043
2016-12-29,50.77
2016-12-30,50.4844
2017-01-03,49.9218
2017-01-04,49.8526
2017-01-05,50.5883
2017-01-06,50.4931
2017-01-09,49.8959
2017-01-10,49.1948
2017-01-11,49.6189
2017-01-12,50.3979
2017-01-13,50.7094
2017-01-17,51.4018
2017-01-18,50.4584
2017-01-19,50.0517
2017-01-20,50.4844
2017-01-23,50.8219
2017-01-24,50.6575
2017-01-25,50.545
2017-01-26,50.0863
2017-01-27,50.0949
2017-01-30,49.8612
2017-01-31,50.6056
2017-02-01,50.2248
2017-02-02,50.2248
2017-02-03,50.2074
2017-02-06,50.32
2017-02-07,50.995
2017-02-08,51.8
2017-02-09,51.8173
2017-02-10,51.8259
2017-02-13,51.8346
2017-02-14,51.7134
2017-02-15,51.5836
2017-02-16,51.8779
2017-02-17,51.8346
2017-02-21,52.4664
2017-02-22,52.3971
2017-02-23,52.752
2017-02-24,52.8732
2017-02-27,52.6741
2017-02-28,52.6655
2017-03-01,51.9384
2017-03-02,52.4491
2017-03-03,52.1288
2017-03-06,51.9298
2017-03-07,51.8519
2017-03-08,51.5143
2017-03-09,51.6355
2017-03-10,51.9211
2017-03-13,52.0683
2017-03-14,52.025
2017-03-15,52.3798
2017-03-16,52.5876
2017-03-17,53.2626
2017-03-20,53.2021
2017-03-21,54.3099
2017-03-22,54.3618
2017-03-23,54.6301
2017-03-24,54.9936
2017-03-27,55.3052
2017-03-28,54.76
2017-03-29,54.6907
2017-03-30,54.3445
2017-03-31,54.9417
2017-04-03,54.7253
2017-04-04,54.6301
2017-04-05,54.8811
2017-04-06,55.0542
2017-04-07,55.0542
2017-04-10,55.2793
2017-04-11,55.6341
2017-04-12,56.3525
2017-04-13,56.0063
2017-04-17,56.3178
2017-04-18,56.1534
2017-04-19,55.4697
2017-04-20,55.0456
2017-04-21,55.5476
2017-04-24,56.3265
2017-04-25,56.2226
2017-04-26,55.7812
2017-04-27,56.3005
2017-04-28,56.1447
2017-05-01,55.963
2017-05-02,56.4909
2017-05-03,56.5083
2017-05-04,56.6987
2017-05-05,57.2266
2017-05-08,57.6421
2017-05-09,57.5555
2017-05-10,58.0662
2017-05-11,57.72
2017-05-12,57.9709
2017-05-15,58.5076
2017-05-16,58.5854
2017-05-17,64.7188
2017-05-18,64.5292
2017-05-19,65.3636
2017-05-22,60.299
2017-05-23,61.003
2017-05-24,61.255
2017-05-25,61.4289
2017-05-26,60.8292
2017-05-30,61.1073
2017-05-31,61.163
2017-06-01,61.0023
2017-06-02,60.3594
2017-06-05,60.2791
2017-06-06,59.5915
2017-06-07,59.6987
2017-06-08,59.6987
2017-06-09,58.1986
2017-06-12,57.7879
2017-06-13,58.5201
2017-06-14,58.5826
2017-06-15,58.3683
2017-06-16,58.904
2017-06-19,58.654
2017-06-20,58.1183
2017-06-21,57.5736
2017-06-22,57.1897
2017-06-23,57.3325
2017-06-26,57.8058
2017-06-27,56.9754
2017-06-28,56.7789
2017-06-29,56.1896
2017-06-30,56.0914
2017-07-03,55.7164
2017-07-05,55.2878
2017-07-06,54.8503
2017-07-07,54.6181
2017-07-10,54.261
2017-07-11,53.9395
2017-07-12,54.4485
2017-07-13,54.7431
2017-07-14,55.0556
2017-07-17,55.1003
2017-07-18,55.5378
2017-07-19,55.6271
2017-07-20,56.0646
2017-07-21,56.1807
2017-07-24,55.1985
2017-07-25,55.1807
2017-07-26,55.9932
2017-07-27,55.9218
2017-07-28,55.5467
2017-07-31,55.8146
2017-08-01,56.4039
2017-08-02,56.5468
2017-08-03,56.895
2017-08-04,56.4039
2017-08-07,56.5021
2017-08-08,56.3236
2017-08-09,56.52
2017-08-10,56.5825
2017-08-11,56.145
2017-08-14,56.5914
2017-08-15,56.4753
2017-08-16,56.4128
2017-08-17,56.1093
2017-08-18,56.0557
2017-08-21,56.2968
2017-08-22,56.5111
2017-08-23,56.5021
2017-08-24,56.5825
2017-08-25,56.6271
2017-08-28,56.7611
2017-08-29,56.4486
2017-08-30,56.4396
2017-08-31,56.9932
2017-09-01,56.9396
2017-09-05,57.2075
2017-09-06,57.2432
2017-09-07,58.1272
2017-09-08,58.1718
2017-09-11,58.0736
2017-09-12,57.404
2017-09-13,57.0914
2017-09-14,57.6986
2017-09-15,58.3772
2017-09-18,57.6361
2017-09-19,58.0111
2017-09-20,57.7611
2017-09-21,57.8325
2017-09-22,57.52
2017-09-25,57.77
2017-09-26,57.3325
2017-09-27,55.886
2017-09-28,56.0646
2017-09-29,55.9932
2017-10-02,56.2075
2017-10-03,55.7789
2017-10-04,56.0289
2017-10-05,55.7075
2017-10-06,55.5914
2017-10-09,55.9128
2017-10-10,56.3236
2017-10-11,56.5378
2017-10-12,56.3325
2017-10-13,56.011
2017-10-16,55.0378
2017-10-17,55.4485
2017-10-18,55.9218
2017-10-19,55.761
2017-10-20,55.3682
2017-10-23,55.8503
2017-10-24,55.0199
2017-10-25,54.4038
2017-10-26,54.2163
2017-10-27,54.5021
2017-10-30,54.261
2017-10-31,54.511
2017-11-01,54.0645
2017-11-02,54.2699
2017-11-03,54.3413
2017-11-06,54.7074
2017-11-07,54.9039
2017-11-08,55.2253
2017-11-09,54.002
2017-11-10,53.5288
2017-11-13,52.8591
2017-11-14,52.8502
2017-11-15,52.9931
2017-11-16,52.9484
2017-11-17,52.627
2017-11-20,52.5109
2017-11-21,52.4305
2017-11-22,53.3089
2017-11-24,53.1
2017-11-27,53.7177
2017-11-28,53.7177
2017-11-29,54.2992
2017-11-30,54.608
2017-12-01,54.5444
2017-12-04,54.4627
2017-12-05,54.1356
2017-12-06,53.8903
2017-12-07,54.2174
2017-12-08,54.1175
2017-12-11,53.8994
2017-12-12,53.7177
2017-12-13,53.5542
2017-12-14,52.9637
2017-12-15,52.6821
2017-12-18,53.0909
2017-12-19,53.0636
2017-12-20,52.9637
2017-12-21,52.6457
2017-12-22,52.6094
2017-12-26,52.5731
2017-12-27,52.9001
2017-12-28,53.2362
2017-12-29,53.427
2018-01-02,53.4543
2018-01-03,52.3823
2018-01-04,52.782
2018-01-05,53.536
2018-01-08,53.5996
2018-01-09,52.246
2018-01-10,51.6373
2018-01-11,51.8826
2018-01-12,52.3096
2018-01-16,52.9728
2018-01-17,52.9819
2018-01-18,52.6185
2018-01-19,52.3459
2018-01-22,52.5912
2018-01-23,52.4822
2018-01-24,52.4005
2018-01-25,52.1279
2018-01-26,52.3187
2018-01-29,51.7736
2018-01-30,51.8917
2018-01-31,52.4005
2018-02-01,51.7827
2018-02-02,50.9197
2018-02-05,48.8029
2018-02-06,48.7938
2018-02-07,48.5213
2018-02-08,47.7037
2018-02-09,47.7854
2018-02-12,47.8672
2018-02-13,47.2494
2018-02-14,47.6128
2018-02-15,48.1852
2018-02-16,48.5031
2018-02-20,48.2578
2018-02-21,47.2494
2018-02-22,48.1942
2018-02-23,49.1118
2018-02-26,49.0119
2018-02-27,48.0126
2018-02-28,46.8679
2018-03-01,47.1949
2018-03-02,47.1858
2018-03-05,47.9853
2018-03-06,48.3033
2018-03-07,49.4661
2018-03-08,50.0294
2018-03-09,49.7023
2018-03-12,49.9203
2018-03-13,49.7205
2018-03-14,49.8477
2018-03-15,49.2572
2018-03-16,49.7114
2018-03-19,49.3026
2018-03-20,48.6757
2018-03-21,48.8574
2018-03-22,48.4395
2018-03-23,48.4123
2018-03-26,49.239
2018-03-27,49.6478
2018-03-28,51.5011
2018-03-29,51.2649
2018-04-02,50.9287
2018-04-03,51.3921
2018-04-04,51.9553
2018-04-05,52.891
2018-04-06,52.7457
2018-04-09,53.5633
2018-04-10,53.1908
2018-04-11,53.4361
2018-04-12,53.1091
2018-04-13,53.4906
2018-04-16,53.2362
2018-04-17,53.4997
2018-04-18,53.1272
2018-04-19,52.3369
2018-04-20,51.8917
2018-04-23,50.9378
2018-04-24,51.1468
2018-04-25,51.3466
2018-04-26,52.6821
2018-04-27,53.1
2018-04-30,52.8547
2018-05-01,52.7275
2018-05-02,52.4277
2018-05-03,52.6367
2018-05-04,52.5731
2018-05-07,52.4913
2018-05-08,51.7736
2018-05-09,52.2097
2018-05-10,52.2733
2018-05-11,52.2278
2018-05-14,52.4822
2018-05-15,51.4466
2018-05-16,51.3194
2018-05-17,52.9183
2018-05-18,53.9812
2018-05-21,54.1811
2018-05-22,54.0448
2018-05-23,53.6996
2018-05-24,53.6178
2018-05-25,53.2272
2018-05-29,53.1181
2018-05-30,53.2272
2018-05-31,52.5498
2018-06-01,52.3332
2018-06-04,52.531
2018-06-05,51.966
2018-06-06,52.3426
2018-06-07,52.2956
2018-06-08,52.3144
2018-06-11,52.2861
2018-06-12,52.8699
2018-06-13,52.2202
2018-06-14,52.3426
2018-06-15,52.0225
2018-06-18,51.7212
2018-06-19,51.7306
2018-06-20,51.9095
2018-06-21,51.7306
2018-06-22,52.3709
2018-06-25,52.3521
2018-06-26,52.2861
2018-06-27,52.0696
2018-06-28,52.2673
2018-06-29,52.5875
2018-07-02,52.8229
2018-07-03,53.5385
2018-07-05,54.3482
2018-07-06,55.1674
2018-07-09,53.981
2018-07-10,53.8586
2018-07-11,53.3596
2018-07-12,54.0752
2018-07-13,53.8586
2018-07-16,53.2842
2018-07-17,52.7475
2018-07-18,52.1355
2018-07-19,52.2297
2018-07-20,52.7287
2018-07-23,52.0978
2018-07-24,51.5705
2018-07-25,51.3916
2018-07-26,51.4858
2018-07-27,51.3163
2018-07-30,50.6384
2018-07-31,50.9209
2018-08-01,49.6874
2018-08-02,49.7721
2018-08-03,50.0546
2018-08-06,49.6403
2018-08-07,49.9039
2018-08-08,49.7062
2018-08-09,49.7533
2018-08-10,49.5744
2018-08-13,49.7721
2018-08-14,49.7439
2018-08-15,49.7439
2018-08-16,49.8851
2018-08-17,50.516
2018-08-20,50.6101
2018-08-21,50.676
2018-08-22,50.2617
2018-08-23,50.0358
2018-08-24,49.9981
2018-08-27,50.0452
2018-08-28,50.0169
2018-08-29,50.2052
2018-08-30,49.9887
2018-08-31,49.9039
2018-09-04,49.4426
2018-09-05,49.5556
2018-09-06,50.064
2018-09-07,49.3296
2018-09-10,49.838
2018-09-11,49.7062
2018-09-12,49.678
2018-09-13,49.8192
2018-09-14,49.3672
2018-09-17,49.8851
2018-09-18,49.8192
2018-09-19,48.3597
2018-09-20,49.3861
2018-09-21,49.0283
2018-09-24,48.4539
2018-09-25,47.823
2018-09-26,47.5971
2018-09-27,48.3033
2018-09-28,48.8305
2018-10-01,48.5575
2018-10-02,49.0848
2018-10-03,48.7552
2018-10-04,48.2562
2018-10-05,49.0471
2018-10-08,48.9906
2018-10-09,49.0942
2018-10-10,50.29
2018-10-11,49.7533
2018-10-12,49.4426
2018-10-15,50.2429
2018-10-16,51.0715
2018-10-17,51.0338
2018-10-18,50.7043
2018-10-19,51.5235
2018-10-22,51.2222
2018-10-23,51.5235
2018-10-24,51.5141
2018-10-25,51.1562
2018-10-26,50.742
2018-10-29,51.2127
2018-10-30,51.6082
2018-10-31,50.3747
2018-11-01,51.2881
2018-11-02,50.742
2018-11-05,51.5611
2018-11-06,51.9848
2018-11-07,52.3991
2018-11-08,52.1167
2018-11-09,52.1826
2018-11-12,52.4274
2018-11-13,52.3897
2018-11-14,52.5404
2018-11-15,50.5066
2018-11-16,50.0263
2018-11-19,50.4501
2018-11-20,51.1468
2018-11-21,51.2252
2018-11-23,50.5241
2018-11-26,51.302
2018-11-27,51.5709
2018-11-28,51.4653
2018-11-29,51.1291
2018-11-30,51.3308
2018-12-03,50.9851
2018-12-04,50.8891
2018-12-06,50.8506
2018-12-07,50.9563
2018-12-10,49.5926
2018-12-11,49.9671
2018-12-12,51.1099
2018-12-13,51.398
2018-12-14,50.6874
2018-12-17,49.7462
2018-12-18,44.8676
2018-12-19,46.4042
2018-12-20,47.7871
2018-12-21,46.8364
2018-12-24,45.9336
2018-12-26,46.2217
2018-12-27,45.9913
2018-12-28,46.5483
2018-12-31,46.0777
2019-01-02,46.8172
2019-01-03,47.0476
2019-01-04,47.8063
2019-01-07,47.7967
2019-01-08,48.3057
2019-01-09,48.5554
2019-01-10,49.2661
2019-01-11,49.4677
2019-01-14,48.5074
2019-01-15,49.1508
2019-01-16,49.4869
2019-01-17,49.4005
2019-01-18,49.9383
2019-01-22,49.8039
2019-01-23,50.3609
2019-01-24,50.8506
2019-01-25,50.188
2019-01-28,50.3224
2019-01-29,51.206
2019-01-30,51.8398
2019-01-31,52.3296
2019-02-01,52.6081
2019-02-04,52.4448
2019-02-05,52.7713
2019-02-06,52.5217
2019-02-07,52.8386
2019-02-08,52.6081
2019-02-11,52.3584
2019-02-12,52.3392
2019-02-13,52.2431
2019-02-14,52.2047
2019-02-15,52.1567
2019-02-19,52.9346
2019-02-20,53.3379
2019-02-21,53.7221
2019-02-22,53.9814
2019-02-25,53.8373
2019-02-26,54.6632
2019-02-27,54.5
2019-02-28,54.2599
2019-03-01,54.2407
2019-03-04,54.0774
2019-03-05,53.8757
2019-03-06,53.6165
2019-03-07,54.4712
2019-03-08,54.9513
2019-03-11,55.0762
2019-03-12,55.4123
2019-03-13,55.6812
2019-03-14,55.5756
2019-03-15,55.9693
2019-03-18,56.2958
2019-03-19,56.0846
2019-03-20,56.1422
2019-03-21,55.8253
2019-03-22,55.8925
2019-03-25,55.8733
2019-03-26,56.5935
2019-03-27,56.2574
2019-03-28,53.9718
2019-03-29,53.6261
2019-04-01,53.2035
2019-04-02,53.2035
2019-04-03,53.2323
2019-04-04,52.9826
2019-04-05,52.3872
2019-04-08,52.2912
2019-04-09,52.0319
2019-04-10,52.2912
2019-04-11,51.811
2019-04-12,51.6477
2019-04-15,51.6765
2019-04-16,51.158
2019-04-17,51.2348
2019-04-18,51.0811
2019-04-22,51.0427
2019-04-23,50.9755
2019-04-24,51.398
2019-04-25,51.5517
2019-04-26,51.715
2019-04-29,51.763
2019-04-30,52.5505
2019-05-01,51.7822
2019-05-02,51.5805
2019-05-03,52.272
2019-05-06,52.0319
2019-05-07,52.1663
2019-05-08,51.4653
2019-05-09,51.7918
2019-05-10,52.8002
2019-05-13,53.0787
2019-05-14,52.3104
2019-05-15,51.9935
2019-05-16,49.7846
2019-05-17,50.1496
2019-05-20,49.8039
2019-05-21,50.092
2019-05-22,49.4581
2019-05-23,49.2276
2019-05-24,49.7366
2019-05-28,49.2661
2019-05-29,49.0644
2019-05-30,48.95
2019-05-31,50.28
2019-06-03,50.6
2019-06-04,50.1
2019-06-05,50.76
2019-06-06,51.52
2019-06-07,51.83
2019-06-10,51.65
2019-06-11,51.76
2019-06-12,52.13
2019-06-13,51.85
2019-06-14,52.54
2019-06-17,52.3
2019-06-18,52.93
2019-06-19,53.09
2019-06-20,53.66
2019-06-21,54.02
2019-06-24,53.85
2019-06-25,53.3
2019-06-26,52.71
2019-06-27,52.73
2019-06-28,53.025
2019-07-01,53.07
2019-07-02,54.36
2019-07-03,54.3
2019-07-04,54.3
2019-07-05,53.85
2019-07-08,53.46
2019-07-09,53.355
2019-07-10,53.555
2019-07-11,52.71
2019-07-12,52.61
2019-07-15,52.53
2019-07-16,51.66
2019-07-17,51.64
2019-07-18,52.345
2019-07-19,51.915
2019-07-22,51.86
2019-07-23,52.29
2019-07-24,52.55
2019-07-25,52.31
2019-07-26,52.34
2019-07-29,52.465
2019-07-30,51.66
2019-07-31,51.405
2019-08-01,51.99
2019-08-02,51.85
2019-08-05,50.67
2019-08-06,50.79
2019-08-07,51.355
2019-08-08,51.45
2019-08-09,51.11
2019-08-12,51.13
2019-08-13,50.895
2019-08-14,50.48
2019-08-15,51.655
2019-08-16,52.29
2019-08-19,52.51
2019-08-20,51.63
2019-08-21,51.9
2019-08-22,52.035
2019-08-23,51.85
2019-08-26,52.015
2019-08-27,52.415
2019-08-28,51.9
2019-08-29,52.055
2019-08-30,52.32
2019-09-02,52.32
2019-09-03,52.88
2019-09-04,52.945
2019-09-05,52.085
2019-09-06,51.7
2019-09-09,50.6
2019-09-10,50.57
2019-09-11,51.03
2019-09-12,51.305
2019-09-13,51.42
2019-09-16,51.78
2019-09-17,52.37
2019-09-18,52.66
2019-09-19,53.19
2019-09-20,53.29
2019-09-23,53.5
2019-09-24,53.945
2019-09-25,53.15
2019-09-26,54.625
2019-09-27,53.985
2019-09-30,54.195
2019-10-01,54.08
2019-10-02,52.925
2019-10-03,52.92
2019-10-04,53.76
2019-10-07,54.135
2019-10-08,53.85
2019-10-09,53.605
2019-10-10,53.84
2019-10-11,55.82
2019-10-14,55.345
2019-10-15,56.81
2019-10-16,56.995
2019-10-17,57.75
2019-10-18,58.17
2019-10-21,57.97
2019-10-22,58.435
2019-10-23,59.475
2019-10-24,58.99
2019-10-25,57.93
2019-10-28,57.635
2019-10-29,57.475
2019-10-30,57.955
2019-10-31,58.35
2019-11-01,58.07
2019-11-04,57.595
2019-11-05,57.275
2019-11-06,57.48
2019-11-07,56.9
2019-11-08,56.9
2019-11-11,56.86
2019-11-12,56.76
2019-11-13,57.03
2019-11-14,57.34
2019-11-15,57.74
2019-11-18,58.415
2019-11-19,58.165
2019-11-20,57.575
2019-11-21,57.4
2019-11-22,57.795
2019-11-25,58.95
