date,close
2014-06-13,9.59
2014-06-16,9.4
2014-06-17,9.49
2014-06-18,9.91
2014-06-19,10.5
2014-06-20,10.47
2014-06-23,10.75
2014-06-24,10.42
2014-06-25,10.39
2014-06-26,10.55
2014-06-27,10.54
2014-06-30,10.81
2014-07-01,10.66
2014-07-02,10.72
2014-07-03,10.83
2014-07-07,10.53
2014-07-08,10.55
2014-07-09,10.84
2014-07-10,10.73
2014-07-11,10.94
2014-07-14,10.25
2014-07-15,9.89
2014-07-16,10.07
2014-07-17,10.5
2014-07-18,10.5
2014-07-21,10.47
2014-07-22,10.29
2014-07-23,10.17
2014-07-24,10.11
2014-07-25,10.51
2014-07-28,10.65
2014-07-29,10.71
2014-07-30,10.74
2014-07-31,10.6
2014-08-01,10.64
2014-08-04,10.46
2014-08-05,10.41
2014-08-06,10.7
2014-08-07,10.72
2014-08-08,10.77
2014-08-11,10.93
2014-08-12,10.93
2014-08-13,10.36
2014-08-14,9.89
2014-08-15,9.86
2014-08-18,9.96
2014-08-19,9.82
2014-08-20,9.88
2014-08-21,9.72
2014-08-22,9.85
2014-08-25,9.69
2014-08-26,10.09
2014-08-27,10.01
2014-08-28,10.16
2014-08-29,10.24
2014-09-02,9.89
2014-09-03,9.89
2014-09-04,9.41
2014-09-05,9.6
2014-09-08,9.25
2014-09-09,9.29
2014-09-10,9.28
2014-09-11,9.31
2014-09-12,9.17
2014-09-15,9.15
2014-09-16,9.21
2014-09-17,8.99
2014-09-18,8.78
2014-09-19,8.39
2014-09-22,8.09
2014-09-23,8.32
2014-09-24,8.2
2014-09-25,8.24
2014-09-26,8.16
2014-09-29,8.07
2014-09-30,7.8
2014-10-01,7.81
2014-10-02,7.84
2014-10-03,7.35
2014-10-06,7.42
2014-10-07,7.15
2014-10-08,7.68
2014-10-09,7.36
2014-10-10,7.22
2014-10-13,7.4
2014-10-14,7.25
2014-10-15,7.38
2014-10-16,7.6
2014-10-17,7.17
2014-10-20,7.33
2014-10-21,7.33
2014-10-22,6.88
2014-10-23,6.65
2014-10-24,6.76
2014-10-27,6.4
2014-10-28,6.66
2014-10-29,6.26
2014-10-30,4.78
2014-10-31,5.13
2014-11-03,5.35
2014-11-04,5.01
2014-11-05,4.63
2014-11-06,4.83
2014-11-07,5.33
2014-11-10,4.92
2014-11-11,5.19
2014-11-12,4.92
2014-11-13,4.78
2014-11-14,5.28
2014-11-17,5.11
2014-11-18,5.47
2014-11-19,5.07
2014-11-20,5.18
2014-11-21,5.25
2014-11-24,4.92
2014-11-25,5
2014-11-26,4.81
2014-11-28,4.07
2014-12-01,4.31
2014-12-02,4.03
2014-12-03,4.29
2014-12-04,4.16
2014-12-05,4.08
2014-12-08,4.04
2014-12-09,4.58
2014-12-10,4.61
2014-12-11,4.55
2014-12-12,4.8
2014-12-15,4.39
2014-12-16,4.32
2014-12-17,4.65
2014-12-18,4.88
2014-12-19,5.12
2014-12-22,4.61
2014-12-23,4.56
2014-12-24,4.77
2014-12-26,4.88
2014-12-29,4.69
2014-12-30,5.05
2014-12-31,5.02
2015-01-02,5.22
2015-01-05,5.54
2015-01-06,6.36
2015-01-07,6.19
2015-01-08,5.91
2015-01-09,6.24
2015-01-12,6.78
2015-01-13,6.52
2015-01-14,5.9
2015-01-15,5.91
2015-01-16,6.24
2015-01-20,6.43
2015-01-21,6.41
2015-01-22,6.29
2015-01-23,5.94
2015-01-26,6.17
2015-01-27,6.58
2015-01-28,6.08
2015-01-29,5.86
2015-01-30,6.19
2015-02-02,6.34
2015-02-03,6.2
2015-02-04,6.25
2015-02-05,6.32
2015-02-06,6.06
2015-02-09,6.19
2015-02-10,6.18
2015-02-11,5.98
2015-02-12,5.91
2015-02-13,6.08
2015-02-17,5.93
2015-02-18,6.12
2015-02-19,5.86
2015-02-20,5.57
2015-02-23,5.4
2015-02-24,5.72
2015-02-25,6
2015-02-26,6.08
2015-02-27,6.18
2015-03-02,6.08
2015-03-03,5.98
2015-03-04,5.86
2015-03-05,5.84
2015-03-06,5.5
2015-03-09,5
2015-03-10,4.88
2015-03-11,5.08
2015-03-12,5.05
2015-03-13,5.21
2015-03-16,5.18
2015-03-17,5.09
2015-03-18,5.42
2015-03-19,5.58
2015-03-20,5.63
2015-03-23,6.13
2015-03-24,6.01
2015-03-25,5.97
2015-03-26,5.8
2015-03-27,5.87
2015-03-30,5.58
2015-03-31,5.41
2015-04-01,5.53
2015-04-02,5.49
2015-04-06,5.68
2015-04-07,5.35
2015-04-08,5.13
2015-04-09,5.03
2015-04-10,5.14
2015-04-13,5.05
2015-04-14,5.02
2015-04-15,5.27
2015-04-16,5.13
2015-04-17,5.09
2015-04-20,5.06
2015-04-21,4.98
2015-04-22,4.85
2015-04-23,4.89
2015-04-24,4.81
2015-04-27,5.06
2015-04-28,5.13
2015-04-29,5.08
2015-04-30,4.87
2015-05-01,5.01
2015-05-04,5.12
2015-05-05,4.99
2015-05-06,4.85
2015-05-07,4.72
2015-05-08,4.96
2015-05-11,5.02
2015-05-12,5.1
2015-05-13,5.25
2015-05-14,5.35
2015-05-15,5.37
2015-05-18,5.39
2015-05-19,5.21
2015-05-20,5.24
2015-05-21,5.22
2015-05-22,5.23
2015-05-26,4.96
2015-05-27,4.89
2015-05-28,5.02
2015-05-29,4.96
2015-06-01,4.99
2015-06-02,5.1
2015-06-03,4.94
2015-06-04,4.91
2015-06-05,4.82
2015-06-08,4.89
2015-06-09,4.88
2015-06-10,4.88
2015-06-11,4.78
2015-06-12,4.76
2015-06-15,5.1
2015-06-16,5.05
2015-06-17,5.18
2015-06-18,5.32
2015-06-19,5.19
2015-06-22,5.31
2015-06-23,5.13
2015-06-24,5.06
2015-06-25,5.13
2015-06-26,4.93
2015-06-29,4.86
2015-06-30,4.83
2015-07-01,4.64
2015-07-02,4.72
2015-07-06,4.87
2015-07-07,4.69
2015-07-08,4.64
2015-07-09,4.57
2015-07-10,4.43
2015-07-13,4.61
2015-07-14,4.54
2015-07-15,4.4
2015-07-16,4.59
2015-07-17,4.22
2015-07-20,3.68
2015-07-21,3.84
2015-07-22,3.77
2015-07-23,3.51
2015-07-24,3.59
2015-07-27,3.08
2015-07-28,3.19
2015-07-29,3.15
2015-07-30,3.02
2015-07-31,3.07
2015-08-03,3.02
2015-08-04,2.95
2015-08-05,2.86
2015-08-06,3.02
2015-08-07,3.03
2015-08-10,3.36
2015-08-11,3.58
2015-08-12,4
2015-08-13,3.74
2015-08-14,3.76
2015-08-17,4.01
2015-08-18,3.82
2015-08-19,3.95
2015-08-20,4
2015-08-21,3.72
2015-08-24,3.44
2015-08-25,3.28
2015-08-26,3.11
2015-08-27,3.39
2015-08-28,3.52
2015-08-31,3.46
2015-09-01,3.26
2015-09-02,3.14
2015-09-03,3.04
2015-09-04,3
2015-09-08,3.02
2015-09-09,2.89
2015-09-10,2.81
2015-09-11,2.86
2015-09-14,2.88
2015-09-15,2.98
2015-09-16,3.13
2015-09-17,3.19
2015-09-18,3.24
2015-09-21,3.24
2015-09-22,3.09
2015-09-23,2.97
2015-09-24,3.29
2015-09-25,3.23
2015-09-28,2.99
2015-09-29,2.97
2015-09-30,3.2
2015-10-01,3.12
2015-10-02,3.58
2015-10-05,3.6
2015-10-06,3.85
2015-10-07,3.83
2015-10-08,3.67
2015-10-09,3.86
2015-10-12,3.71
2015-10-13,3.89
2015-10-14,4.04
2015-10-15,4.22
2015-10-16,4.06
2015-10-19,3.74
2015-10-20,3.9
2015-10-21,3.66
2015-10-22,3.69
2015-10-23,3.69
2015-10-26,3.72
2015-10-27,3.62
2015-10-28,3.68
2015-10-29,3.39
2015-10-30,3.31
2015-11-02,3.36
2015-11-03,3.43
2015-11-04,3.21
2015-11-05,3.12
2015-11-06,2.97
2015-11-09,3.04
2015-11-10,2.9
2015-11-11,2.88
2015-11-12,2.82
2015-11-13,2.96
2015-11-16,3
2015-11-17,2.85
2015-11-18,2.98
2015-11-19,3.23
2015-11-20,3.11
2015-11-23,3.02
2015-11-24,3.26
2015-11-25,3.26
2015-11-27,3.22
2015-11-30,3.34
2015-12-01,3.49
2015-12-02,3.35
2015-12-03,3.43
2015-12-04,3.62
2015-12-07,3.4
2015-12-08,3.31
2015-12-09,3.42
2015-12-10,3.44
2015-12-11,3.36
2015-12-14,3.27
2015-12-15,3.19
2015-12-16,3.42
2015-12-17,3.05
2015-12-18,3.15
2015-12-21,3.26
2015-12-22,3.3
2015-12-23,3.42
2015-12-24,3.63
2015-12-28,3.35
2015-12-29,3.39
2015-12-30,3.24
2015-12-31,3.27
2016-01-04,3.42
2016-01-05,3.36
2016-01-06,3.37
2016-01-07,3.3
2016-01-08,3.18
2016-01-11,2.93
2016-01-12,2.8
2016-01-13,2.81
2016-01-14,2.75
2016-01-15,2.73
2016-01-19,2.51
2016-01-20,2.62
2016-01-21,2.62
2016-01-22,2.69
2016-01-25,2.69
2016-01-26,2.87
2016-01-27,2.92
2016-01-28,2.84
2016-01-29,2.99
2016-02-01,3.1
2016-02-02,3
2016-02-03,3.21
2016-02-04,3.38
2016-02-05,3.59
2016-02-08,3.82
2016-02-09,3.65
2016-02-10,3.68
2016-02-11,4.04
2016-02-12,4.33
2016-02-16,4.14
2016-02-17,4.26
2016-02-18,4.56
2016-02-19,4.39
2016-02-22,4.35
2016-02-23,4.36
2016-02-24,4.4
2016-02-25,4.64
2016-02-26,4.62
2016-02-29,4.64
2016-03-01,4.33
2016-03-02,4.45
2016-03-03,4.75
2016-03-04,4.88
2016-03-07,5.36
2016-03-08,5.29
2016-03-09,5.32
2016-03-10,5.74
2016-03-11,5.74
2016-03-14,5.64
2016-03-15,5.77
2016-03-16,6.25
2016-03-17,6.42
2016-03-18,6.73
2016-03-21,6.88
2016-03-22,6.79
2016-03-23,6.36
2016-03-24,6.65
2016-03-28,6.57
2016-03-29,6.89
2016-03-30,6.75
2016-03-31,6.48
2016-04-01,6.51
2016-04-04,6.28
2016-04-05,6.43
2016-04-06,6.4
2016-04-07,6.56
2016-04-08,6.87
2016-04-11,7.55
2016-04-12,7.72
2016-04-13,7.74
2016-04-14,7.56
2016-04-15,8.22
2016-04-18,8.52
2016-04-19,9.87
2016-04-20,9.51
2016-04-21,9.62
2016-04-22,8.9
2016-04-25,8.97
2016-04-26,9.64
2016-04-27,9.96
2016-04-28,10.02
2016-04-29,10.64
2016-05-02,10.1
2016-05-03,9.9
2016-05-04,9.42
2016-05-05,9.81
2016-05-06,10.36
2016-05-09,9.4
2016-05-10,9.88
2016-05-11,10.47
2016-05-12,10.78
2016-05-13,10.7
2016-05-16,11.23
2016-05-17,12.08
2016-05-18,11.19
2016-05-19,11.48
2016-05-20,11.47
2016-05-23,11.41
2016-05-24,10.49
2016-05-25,11.02
2016-05-26,10.91
2016-05-27,10.35
2016-05-31,10.42
2016-06-01,10.32
2016-06-02,10.46
2016-06-03,11.76
2016-06-06,11.86
2016-06-07,11.59
2016-06-08,12.4
2016-06-09,12.86
2016-06-10,12.46
2016-06-13,12.59
2016-06-14,12.26
2016-06-15,12.9
2016-06-16,12.43
2016-06-17,12.25
2016-06-20,12.74
2016-06-21,12.43
2016-06-22,12.46
2016-06-23,12.4
2016-06-24,13.07
2016-06-27,12.46
2016-06-28,12.59
2016-06-29,13.12
2016-06-30,13.58
2016-07-01,14.8
2016-07-05,14.94
2016-07-06,15.32
2016-07-07,14.85
2016-07-08,15.97
2016-07-11,16.45
2016-07-12,15.41
2016-07-13,16.91
2016-07-14,16.94
2016-07-15,16.77
2016-07-18,16.83
2016-07-19,16.67
2016-07-20,15.08
2016-07-21,15.89
2016-07-22,15.59
2016-07-25,14.93
2016-07-26,15.65
2016-07-27,16.53
2016-07-28,16.54
2016-07-29,17.34
2016-08-01,17.88
2016-08-02,18.04
2016-08-03,18.2
2016-08-04,18.3
2016-08-05,17.83
2016-08-08,18.16
2016-08-09,18.42
2016-08-10,18.25
2016-08-11,18.33
2016-08-12,18.1
2016-08-15,17.49
2016-08-16,17.03
2016-08-17,16.45
2016-08-18,16.34
2016-08-19,15.12
2016-08-22,14.63
2016-08-23,14.36
2016-08-24,13.12
2016-08-25,13.49
2016-08-26,13.19
2016-08-29,13.3
2016-08-30,12.36
2016-08-31,12.02
2016-09-01,11.79
2016-09-02,12.37
2016-09-06,13.32
2016-09-07,13.35
2016-09-08,13.37
2016-09-09,12.31
2016-09-12,12.28
2016-09-13,11.81
2016-09-14,11.81
2016-09-15,11.66
2016-09-16,11.33
2016-09-19,11.59
2016-09-20,11.58
2016-09-21,12.66
2016-09-22,11.96
2016-09-23,11.25
2016-09-26,10.84
2016-09-27,10.48
2016-09-28,10.8
2016-09-29,10.48
2016-09-30,10.3
2016-10-03,9.97
2016-10-04,8.94
2016-10-05,8.65
2016-10-06,8.14
2016-10-07,8.23
2016-10-10,8.2
2016-10-11,7.76
2016-10-12,7.9
2016-10-13,8.02
2016-10-14,7.85
2016-10-17,7.85
2016-10-18,8.23
2016-10-19,8.51
2016-10-20,8.36
2016-10-21,8.24
2016-10-24,8.02
2016-10-25,8.3
2016-10-26,7.99
2016-10-27,7.75
2016-10-28,7.78
2016-10-31,8.05
2016-11-01,8.62
2016-11-02,8.74
2016-11-03,8.7
2016-11-04,8.42
2016-11-07,8.06
2016-11-08,8.14
2016-11-09,9.38
2016-11-10,8.82
2016-11-11,8.02
2016-11-14,8.36
2016-11-15,9.01
2016-11-16,8.8
2016-11-17,8.7
2016-11-18,8.51
2016-11-21,8.74
2016-11-22,8.94
2016-11-23,8.2
2016-11-25,8.3
2016-11-28,8.62
2016-11-29,8.88
2016-11-30,8.87
2016-12-01,8.89
2016-12-02,9.82
2016-12-05,9.66
2016-12-06,9.59
2016-12-07,9.85
2016-12-08,9.47
2016-12-09,8.79
2016-12-12,8.66
2016-12-13,8.74
2016-12-14,8.19
2016-12-15,7.35
2016-12-16,7.22
2016-12-19,7.07
2016-12-20,7.09
2016-12-21,7.01
2016-12-22,6.89
2016-12-23,6.87
2016-12-27,7.44
2016-12-28,7.43
2016-12-29,8.2
2016-12-30,7.63
2017-01-03,8.08
2017-01-04,8.37
2017-01-05,9.22
2017-01-06,8.79
2017-01-09,8.88
2017-01-10,9.02
2017-01-11,8.94
2017-01-12,8.79
2017-01-13,9.18
2017-01-17,9.49
2017-01-18,9.02
2017-01-19,9.02
2017-01-20,9.11
2017-01-23,9.42
2017-01-24,9.19
2017-01-25,9.11
2017-01-26,8.92
2017-01-27,9.21
2017-01-30,9.09
2017-01-31,9.6
2017-02-01,9.72
2017-02-02,9.82
2017-02-03,9.96
2017-02-06,10.69
2017-02-07,10.57
2017-02-08,10.73
2017-02-09,10.2
2017-02-10,10.6
2017-02-13,10.33
2017-02-14,10.41
2017-02-15,10.02
2017-02-16,10.23
2017-02-17,10.06
2017-02-21,9.79
2017-02-22,9.33
2017-02-23,9.62
2017-02-24,9.56
2017-02-27,8.99
2017-02-28,9.08
2017-03-01,9.1
2017-03-02,8.24
2017-03-03,8.21
2017-03-06,7.87
2017-03-07,7.76
2017-03-08,7.6
2017-03-09,7.5
2017-03-10,7.84
2017-03-13,7.67
2017-03-14,7.23
2017-03-15,7.93
2017-03-16,7.91
2017-03-17,7.87
2017-03-20,7.97
2017-03-21,8.01
2017-03-22,7.91
2017-03-23,7.93
2017-03-24,7.87
2017-03-27,8.1
2017-03-28,7.97
2017-03-29,7.99
2017-03-30,7.9
2017-03-31,8.12
2017-04-03,8.41
2017-04-04,8.62
2017-04-05,8.66
2017-04-06,8.72
2017-04-07,8.75
2017-04-10,8.67
2017-04-11,9.19
2017-04-12,9.23
2017-04-13,9.35
2017-04-17,9.21
2017-04-18,9.2
2017-04-19,8.67
2017-04-20,8.79
2017-04-21,8.77
2017-04-24,8.51
2017-04-25,8.11
2017-04-26,8.29
2017-04-27,8.06
2017-04-28,8.13
2017-05-01,7.95
2017-05-02,7.96
2017-05-03,7.84
2017-05-04,7.16
2017-05-05,7.48
2017-05-08,7.58
2017-05-09,7.44
2017-05-10,7.88
2017-05-11,8.36
2017-05-12,8.71
2017-05-15,8.82
2017-05-16,8.95
2017-05-17,9.22
2017-05-18,8.77
2017-05-19,8.92
2017-05-22,9.08
2017-05-23,8.71
2017-05-24,8.89
2017-05-25,8.69
2017-05-26,8.71
2017-05-30,8.46
2017-05-31,8.37
2017-06-01,8.24
2017-06-02,8.23
2017-06-05,8.22
2017-06-06,8.94
2017-06-07,8.72
2017-06-08,8.58
2017-06-09,8.31
2017-06-12,8.2
2017-06-13,8.44
2017-06-14,7.95
2017-06-15,7.77
2017-06-16,7.67
2017-06-19,7.72
2017-06-20,7.76
2017-06-21,7.89
2017-06-22,8.16
2017-06-23,8.39
2017-06-26,8.37
2017-06-27,8.28
2017-06-28,8.47
2017-06-29,8.14
2017-06-30,8.31
2017-07-03,7.68
2017-07-05,7.55
2017-07-06,7.38
2017-07-07,7.19
2017-07-10,7.63
2017-07-11,7.8
2017-07-12,7.73
2017-07-13,7.54
2017-07-14,7.76
2017-07-17,7.94
2017-07-18,8
2017-07-19,7.87
2017-07-20,7.94
2017-07-21,8
2017-07-24,7.68
2017-07-25,7.88
2017-07-26,8.22
2017-07-27,7.98
2017-07-28,8.2
2017-07-31,8.23
2017-08-01,8.19
2017-08-02,7.84
2017-08-03,7.69
2017-08-04,6.24
2017-08-07,6.09
2017-08-08,6.09
2017-08-09,6.22
2017-08-10,6.74
2017-08-11,6.52
2017-08-14,6.28
2017-08-15,6.22
2017-08-16,6.52
2017-08-17,6.55
2017-08-18,6.43
2017-08-21,6.41
2017-08-22,6.26
2017-08-23,6.36
2017-08-24,6.41
2017-08-25,6.48
2017-08-28,6.99
2017-08-29,6.85
2017-08-30,6.64
2017-08-31,7.07
2017-09-01,7.11
2017-09-05,7.45
2017-09-06,7.34
2017-09-07,7.52
2017-09-08,7.19
2017-09-11,7
2017-09-12,7.26
2017-09-13,7.02
2017-09-14,7.12
2017-09-15,7.01
2017-09-18,6.85
2017-09-19,7.04
2017-09-20,6.86
2017-09-21,6.85
2017-09-22,7.14
2017-09-25,7.29
2017-09-26,7.17
2017-09-27,7.1
2017-09-28,6.97
2017-09-29,6.84
2017-10-02,6.91
2017-10-03,6.83
2017-10-04,7.01
2017-10-05,7
2017-10-06,7.35
2017-10-09,7.42
2017-10-10,7.26
2017-10-11,7.33
2017-10-12,7.24
2017-10-13,7.27
2017-10-16,7.14
2017-10-17,7.01
2017-10-18,6.91
2017-10-19,7.01
2017-10-20,7
2017-10-23,7.03
2017-10-24,6.94
2017-10-25,6.9
2017-10-26,6.6
2017-10-27,6.71
2017-10-30,6.86
2017-10-31,6.75
2017-11-01,6.86
2017-11-02,6.92
2017-11-03,6.46
2017-11-06,6.83
2017-11-07,6.78
2017-11-08,7.04
2017-11-09,6.81
2017-11-10,6.63
2017-11-13,6.57
2017-11-14,6.46
2017-11-15,6.77
2017-11-16,6.57
2017-11-17,6.79
2017-11-20,6.66
2017-11-21,6.73
2017-11-22,6.88
2017-11-24,6.72
2017-11-27,6.66
2017-11-28,6.66
2017-11-29,6.59
2017-11-30,6.67
2017-12-01,6.72
2017-12-04,6.61
2017-12-05,6.54
2017-12-06,6.43
2017-12-07,6.28
2017-12-08,6.49
2017-12-11,6.64
2017-12-12,6.62
2017-12-13,7.35
2017-12-14,7.26
2017-12-15,7.26
2017-12-18,7.56
2017-12-19,7.65
2017-12-20,7.81
2017-12-21,7.64
2017-12-22,6.93
2017-12-26,7.03
2017-12-27,6.97
2017-12-28,6.87
2017-12-29,6.74
2018-01-02,7.22
2018-01-03,7.04
2018-01-04,7.05
2018-01-05,6.96
2018-01-08,6.92
2018-01-09,6.76
2018-01-10,6.89
2018-01-11,6.97
2018-01-12,6.79
2018-01-16,7.35
2018-01-17,7.24
2018-01-18,6.92
2018-01-19,6.88
2018-01-22,6.99
2018-01-23,7.02
2018-01-24,7.1
2018-01-25,6.51
2018-01-26,6.5
2018-01-29,6.31
2018-01-30,6.06
2018-01-31,6.12
2018-02-01,6.04
2018-02-02,5.66
2018-02-05,5.74
2018-02-06,5.66
2018-02-07,5.5
2018-02-08,5.43
2018-02-09,5.14
2018-02-12,5.6
2018-02-13,5.68
2018-02-14,5.99
2018-02-15,6
2018-02-16,5.78
2018-02-20,5.55
2018-02-21,5.49
2018-02-22,5.54
2018-02-23,5.57
2018-02-26,5.6
2018-02-27,5.38
2018-02-28,5.31
2018-03-01,5.51
2018-03-02,5.54
2018-03-05,5.63
2018-03-06,5.96
2018-03-07,5.71
2018-03-08,5.75
2018-03-09,5.83
2018-03-12,5.97
2018-03-13,6.06
2018-03-14,5.98
2018-03-15,5.88
2018-03-16,5.94
2018-03-19,5.97
2018-03-20,5.76
2018-03-21,6.13
2018-03-22,6.16
2018-03-23,6.36
2018-03-26,6.22
2018-03-27,6.17
2018-03-28,6.02
2018-03-29,6.11
2018-04-02,6.23
2018-04-03,6.14
2018-04-04,6.12
2018-04-05,6.17
2018-04-06,6.12
2018-04-09,6.23
2018-04-10,6.34
2018-04-11,6.61
2018-04-12,6.52
2018-04-13,6.66
2018-04-16,6.58
2018-04-17,6.71
2018-04-18,6.85
2018-04-19,6.86
2018-04-20,6.76
2018-04-23,6.47
2018-04-24,6.56
2018-04-25,6.64
2018-04-26,6.74
2018-04-27,6.77
2018-04-30,6.48
2018-05-01,6.55
2018-05-02,6.74
2018-05-03,6.8
2018-05-04,6.85
2018-05-07,6.79
2018-05-08,6.85
2018-05-09,6.84
2018-05-10,7.23
2018-05-11,7.17
2018-05-14,7.09
2018-05-15,7
2018-05-16,7.15
2018-05-17,7.14
2018-05-18,7.09
2018-05-21,7.29
2018-05-22,7.31
2018-05-23,7.28
2018-05-24,7.36
2018-05-25,7.2
2018-05-29,7.08
2018-05-30,7.15
2018-05-31,7.09
2018-06-01,7.13
2018-06-04,7.05
2018-06-05,7.15
2018-06-06,7.28
2018-06-07,7.47
2018-06-08,7.3
2018-06-11,7.58
2018-06-12,7.67
2018-06-13,7.77
2018-06-14,7.97
2018-06-15,7.46
2018-06-18,7.43
2018-06-19,7.34
2018-06-20,7.36
2018-06-21,7.36
2018-06-22,7.65
2018-06-25,7.47
2018-06-26,7.55
2018-06-27,7.46
2018-06-28,7.39
2018-06-29,7.63
2018-07-02,7.6
2018-07-03,8
2018-07-05,8.04
2018-07-06,8.26
2018-07-09,8.19
2018-07-10,8.01
2018-07-11,7.61
2018-07-12,7.62
2018-07-13,7.7
2018-07-16,7.43
2018-07-17,6.78
2018-07-18,6.85
2018-07-19,6.69
2018-07-20,6.62
2018-07-23,6.4
2018-07-24,6.53
2018-07-25,6.68
2018-07-26,6.49
2018-07-27,6.43
2018-07-30,6.5
2018-07-31,6.64
2018-08-01,6.53
2018-08-02,6.55
2018-08-03,6.58
2018-08-06,6.59
2018-08-07,6.39
2018-08-08,6.35
2018-08-09,6.49
2018-08-10,6.48
2018-08-13,5.49
2018-08-14,5.62
2018-08-15,5.14
2018-08-16,5.07
2018-08-17,5.25
2018-08-20,5.43
2018-08-21,5.51
2018-08-22,5.54
2018-08-23,5.23
2018-08-24,5.51
2018-08-27,5.85
2018-08-28,5.64
2018-08-29,5.68
2018-08-30,5.47
2018-08-31,5.56
2018-09-04,5.31
2018-09-05,5.28
2018-09-06,5.32
2018-09-07,5.45
2018-09-10,5.33
2018-09-11,5.28
2018-09-12,5.61
2018-09-13,5.54
2018-09-14,5.46
2018-09-17,5.68
2018-09-18,5.71
2018-09-19,5.88
2018-09-20,5.73
2018-09-21,5.7
2018-09-24,5.6
2018-09-25,5.68
2018-09-26,5.56
2018-09-27,5.51
2018-09-28,5.68
2018-10-01,5.65
2018-10-02,5.8
2018-10-03,5.68
2018-10-04,5.72
2018-10-05,5.67
2018-10-08,5.79
2018-10-09,5.69
2018-10-10,5.72
2018-10-11,6.22
2018-10-12,6.16
2018-10-15,6.3
2018-10-16,6.27
2018-10-17,6.24
2018-10-18,6.27
2018-10-19,6.25
2018-10-22,6.22
2018-10-23,6.2
2018-10-24,6.07
2018-10-25,5.7
2018-10-26,5.71
2018-10-29,5.59
2018-10-30,5.69
2018-10-31,5.55
2018-11-01,5.8
2018-11-02,5.92
2018-11-05,5.87
2018-11-06,5.7
2018-11-07,5.5
2018-11-08,5.54
2018-11-09,5.4
2018-11-12,5.09
2018-11-13,4.87
2018-11-14,5.2
2018-11-15,5.33
2018-11-16,5.41
2018-11-19,5.27
2018-11-20,5.24
2018-11-21,5.56
2018-11-23,5.09
2018-11-26,4.86
2018-11-27,4.78
2018-11-28,4.95
2018-11-29,4.88
2018-11-30,4.8
2018-12-03,4.91
2018-12-04,4.94
2018-12-06,4.91
2018-12-07,5.14
2018-12-10,5.13
2018-12-11,5.11
2018-12-12,5.31
2018-12-13,5.28
2018-12-14,5.15
2018-12-17,5.45
2018-12-18,5.71
2018-12-19,5.2
2018-12-20,5.58
2018-12-21,5.55
2018-12-24,5.76
2018-12-26,5.87
2018-12-27,5.97
2018-12-28,5.75
2018-12-31,5.89
2019-01-02,6.02
2019-01-03,6.3
2019-01-04,6.21
2019-01-07,6.06
2019-01-08,6.13
2019-01-09,6.21
2019-01-10,6.06
2019-01-11,5.98
2019-01-14,5.98
2019-01-15,5.38
2019-01-16,5.25
2019-01-17,5.25
2019-01-18,5.15
2019-01-22,5.16
2019-01-23,5.17
2019-01-24,5.26
2019-01-25,5.55
2019-01-28,5.61
2019-01-29,5.81
2019-01-30,5.99
2019-01-31,6.12
2019-02-01,6
2019-02-04,6.05
2019-02-05,6.11
2019-02-06,6.04
2019-02-07,5.86
2019-02-08,6.03
2019-02-11,5.99
2019-02-12,5.93
2019-02-13,5.92
2019-02-14,6.05
2019-02-15,6.19
2019-02-19,6.61
2019-02-20,6.66
2019-02-21,6.55
2019-02-22,6.58
2019-02-25,6.92
2019-02-26,7.03
2019-02-27,6.78
2019-02-28,6.74
2019-03-01,6.35
2019-03-04,6.4
2019-03-05,6.46
2019-03-06,6.31
2019-03-07,6.49
2019-03-08,6.78
2019-03-11,6.63
2019-03-12,6.87
2019-03-13,6.96
2019-03-14,6.62
2019-03-15,6.72
2019-03-18,6.65
2019-03-19,6.77
2019-03-20,6.9
2019-03-21,6.94
2019-03-22,6.89
2019-03-25,7.15
2019-03-26,7.12
2019-03-27,6.9
2019-03-28,6.62
2019-03-29,6.58
2019-04-01,6.32
2019-04-02,6.3
2019-04-03,6.34
2019-04-04,6.55
2019-04-05,6.45
2019-04-08,6.54
2019-04-09,6.6
2019-04-10,6.48
2019-04-11,6.3
2019-04-12,6.27
2019-04-15,6.28
2019-04-16,6.07
2019-04-17,6.04
2019-04-18,6.07
2019-04-22,5.9
2019-04-23,5.95
2019-04-24,5.99
2019-04-25,6.01
2019-04-26,6.32
2019-04-29,6.08
2019-04-30,6.14
2019-05-01,5.97
2019-05-02,5.74
2019-05-03,5.83
2019-05-06,5.83
2019-05-07,6.03
2019-05-08,5.84
2019-05-09,6
2019-05-10,5.88
2019-05-13,6.07
2019-05-14,5.93
2019-05-15,5.93
2019-05-16,5.8
2019-05-17,5.86
2019-05-20,5.81
2019-05-21,5.77
2019-05-22,5.53
2019-05-23,5.6
2019-05-24,5.67
2019-05-28,5.55
2019-05-29,5.54
2019-05-30,5.74
2019-05-31,6.08
2019-06-03,6.45
2019-06-04,6.39
2019-06-05,6.36
2019-06-06,6.49
2019-06-07,6.44
2019-06-10,6.3
2019-06-11,6.47
2019-06-12,6.56
2019-06-13,6.635
2019-06-14,6.555
2019-06-17,6.725
2019-06-18,6.715
2019-06-19,6.9
2019-06-20,7.32
2019-06-21,7.465
2019-06-24,7.975
2019-06-25,7.895
2019-06-26,7.85
2019-06-27,7.775
2019-06-28,7.84
2019-07-01,7.46
2019-07-02,7.93
2019-07-03,7.87
2019-07-04,7.87
2019-07-05,7.825
2019-07-08,7.815
2019-07-09,7.91
2019-07-10,8.115
2019-07-11,7.93
2019-07-12,7.845
2019-07-15,7.885
2019-07-16,8.575
2019-07-17,9.3
2019-07-18,9.905
2019-07-19,9.9
2019-07-22,10.13
2019-07-23,9.995
2019-07-24,10.26
2019-07-25,9.655
2019-07-26,9.815
2019-07-29,9.985
2019-07-30,10.055
2019-07-31,9.41
2019-08-01,9.845
2019-08-02,9.54
2019-08-05,10.03
2019-08-06,9.88
2019-08-07,10.495
2019-08-08,10.795
2019-08-09,10.735
2019-08-12,10.7
2019-08-13,10.275
2019-08-14,10.205
2019-08-15,10.255
2019-08-16,9.885
2019-08-19,10
2019-08-20,10.495
2019-08-21,10.435
2019-08-22,10.305
2019-08-23,10.985
2019-08-26,10.925
2019-08-27,11.23
2019-08-28,11.22
2019-08-29,10.735
2019-08-30,10.885
2019-09-02,10.875
2019-09-03,11.285
2019-09-04,11.29
2019-09-05,10.275
2019-09-06,9.865
2019-09-09,9.725
2019-09-10,9.775
2019-09-11,9.96
2019-09-12,9.775
2019-09-13,9.33
2019-09-16,9.645
2019-09-17,9.795
2019-09-18,9.64
2019-09-19,9.95
2019-09-20,10.095
2019-09-23,10.52
2019-09-24,10.545
2019-09-25,10.005
2019-09-26,9.915
2019-09-27,9.615
2019-09-30,9.095
2019-10-01,9.235
2019-10-02,9.475
2019-10-03,9.48
2019-10-04,9.665
2019-10-07,9.52
2019-10-08,9.84
2019-10-09,9.655
2019-10-10,9.77
2019-10-11,9.225
2019-10-14,9.455
2019-10-15,9.175
2019-10-16,9.935
2019-10-17,10.365
2019-10-18,10.255
2019-10-21,9.965
2019-10-22,9.91
2019-10-23,10.055
2019-10-24,10.445
2019-10-25,10.725
2019-10-28,10.3
2019-10-29,10.32
2019-10-30,10.35
2019-10-31,10.675
2019-11-01,10.98
2019-11-04,10.665
2019-11-05,10.135
2019-11-06,10.175
2019-11-07,9.695
2019-11-08,9.81
2019-11-11,10.245
2019-11-12,10.595
2019-11-13,10.505
2019-11-14,10.755
2019-11-15,10.605
2019-11-18,10.835
2019-11-19,10.825
2019-11-20,10.975
2019-11-21,10.525
2019-11-22,10.52
2019-11-25,10.425
