date,close
2014-06-13,16.31
2014-06-16,16.5
2014-06-17,16.45
2014-06-18,16.66
2014-06-19,16.7
2014-06-20,17.1
2014-06-23,16.99
2014-06-24,16.55
2014-06-25,17.09
2014-06-26,17.28
2014-06-27,17.14
2014-06-30,17.54
2014-07-01,17.55
2014-07-02,17.72
2014-07-03,17.86
2014-07-07,17.34
2014-07-08,17.32
2014-07-09,18.01
2014-07-10,17.68
2014-07-11,17.54
2014-07-14,18.07
2014-07-15,17.54
2014-07-16,18.38
2014-07-17,17.95
2014-07-18,18.07
2014-07-21,17.97
2014-07-22,17.97
2014-07-23,17.91
2014-07-24,17.8
2014-07-25,17.62
2014-07-28,17.09
2014-07-29,16.89
2014-07-30,16.46
2014-07-31,14.71
2014-08-01,14.94
2014-08-04,14.98
2014-08-05,14.45
2014-08-06,14.92
2014-08-07,14.64
2014-08-08,14.83
2014-08-11,15.11
2014-08-12,14.81
2014-08-13,15.22
2014-08-14,14.58
2014-08-15,14.66
2014-08-18,14.93
2014-08-19,14.95
2014-08-20,14.75
2014-08-21,14.71
2014-08-22,14.39
2014-08-25,14.96
2014-08-26,15.24
2014-08-27,15.42
2014-08-28,15.34
2014-08-29,15.38
2014-09-02,14.89
2014-09-03,15.13
2014-09-04,14.83
2014-09-05,15.2
2014-09-08,14.37
2014-09-09,14.04
2014-09-10,14.11
2014-09-11,14.41
2014-09-12,14.06
2014-09-15,14.18
2014-09-16,14.61
2014-09-17,14.42
2014-09-18,14.37
2014-09-19,14.25
2014-09-22,13.73
2014-09-23,13.7
2014-09-24,13.89
2014-09-25,13.97
2014-09-26,14.28
2014-09-29,14.3
2014-09-30,14.02
2014-10-01,13.06
2014-10-02,12.6
2014-10-03,12.41
2014-10-06,12.3
2014-10-07,12.02
2014-10-08,12.01
2014-10-09,11.44
2014-10-10,11.1
2014-10-13,10.72
2014-10-14,9.95
2014-10-15,10.27
2014-10-16,10.85
2014-10-17,10.76
2014-10-20,10.85
2014-10-21,11.69
2014-10-22,11.05
2014-10-23,11.61
2014-10-24,11.06
2014-10-27,10.23
2014-10-28,9.08
2014-10-29,9.24
2014-10-30,7.9
2014-10-31,9.18
2014-11-03,9.18
2014-11-04,8.23
2014-11-05,8.3
2014-11-06,8.31
2014-11-07,8.4
2014-11-10,8.47
2014-11-11,8.61
2014-11-12,8.19
2014-11-13,7.9
2014-11-14,8.2
2014-11-17,7.48
2014-11-18,7.33
2014-11-19,7
2014-11-20,7.43
2014-11-21,7.57
2014-11-24,7.51
2014-11-25,7.27
2014-11-26,7.01
2014-11-28,6.04
2014-12-01,5.83
2014-12-02,5.79
2014-12-03,6.18
2014-12-04,5.83
2014-12-05,5.79
2014-12-08,5.08
2014-12-09,5.26
2014-12-10,4.75
2014-12-11,4.35
2014-12-12,4.22
2014-12-15,4.28
2014-12-16,4.79
2014-12-17,5.15
2014-12-18,5.56
2014-12-19,5.99
2014-12-22,5.67
2014-12-23,5.47
2014-12-24,5.6
2014-12-26,5.46
2014-12-29,5.66
2014-12-30,5.6
2014-12-31,5.54
2015-01-02,5.57
2015-01-05,5.12
2015-01-06,5.02
2015-01-07,4.89
2015-01-08,4.96
2015-01-09,4.96
2015-01-12,4.58
2015-01-13,4.45
2015-01-14,3.94
2015-01-15,3.74
2015-01-16,3.92
2015-01-20,3.83
2015-01-21,4.08
2015-01-22,4.41
2015-01-23,4.41
2015-01-26,4.51
2015-01-27,4.49
2015-01-28,4.03
2015-01-29,4.1
2015-01-30,4.14
2015-02-02,4.36
2015-02-03,4.82
2015-02-04,4.56
2015-02-05,4.82
2015-02-06,5.1
2015-02-09,5.66
2015-02-10,5.34
2015-02-11,5.16
2015-02-12,5.2
2015-02-13,5.74
2015-02-17,6.4
2015-02-18,6.1
2015-02-19,6.08
2015-02-20,5.87
2015-02-23,5.56
2015-02-24,5.41
2015-02-25,5.41
2015-02-26,5.23
2015-02-27,5.32
2015-03-02,5.32
2015-03-03,5.83
2015-03-04,5.87
2015-03-05,5.86
2015-03-06,5.7
2015-03-09,5.27
2015-03-10,4.94
2015-03-11,4.98
2015-03-12,4.83
2015-03-13,4.63
2015-03-16,4.68
2015-03-17,4.65
2015-03-18,4.97
2015-03-19,4.66
2015-03-20,4.88
2015-03-23,4.91
2015-03-24,4.96
2015-03-25,5.09
2015-03-26,5.32
2015-03-27,4.89
2015-03-30,4.92
2015-03-31,5.42
2015-04-01,5.09
2015-04-02,5.42
2015-04-06,6.05
2015-04-07,6.02
2015-04-08,5.8
2015-04-09,5.98
2015-04-10,6.01
2015-04-13,6.09
2015-04-14,6.56
2015-04-15,6.98
2015-04-16,6.67
2015-04-17,6.57
2015-04-20,6.59
2015-04-21,6.5
2015-04-22,6.26
2015-04-23,6.24
2015-04-24,6.15
2015-04-27,6.12
2015-04-28,6.25
2015-04-29,6.54
2015-04-30,7.45
2015-05-01,7.55
2015-05-04,7.97
2015-05-05,8.08
2015-05-06,7.92
2015-05-07,7.71
2015-05-08,7.95
2015-05-11,7.7
2015-05-12,8.03
2015-05-13,7.85
2015-05-14,7.65
2015-05-15,7.49
2015-05-18,7.49
2015-05-19,7.25
2015-05-20,7.31
2015-05-21,7.61
2015-05-22,7.4
2015-05-26,7.17
2015-05-27,7.27
2015-05-28,7.05
2015-05-29,7.02
2015-06-01,6.84
2015-06-02,6.92
2015-06-03,7.16
2015-06-04,6.83
2015-06-05,7.1
2015-06-08,7.15
2015-06-09,6.97
2015-06-10,7.55
2015-06-11,7.15
2015-06-12,6.99
2015-06-15,6.88
2015-06-16,6.88
2015-06-17,6.8
2015-06-18,6.51
2015-06-19,6.15
2015-06-22,6.31
2015-06-23,6.48
2015-06-24,6.2
2015-06-25,6.16
2015-06-26,6.58
2015-06-29,6.52
2015-06-30,6.34
2015-07-01,5.4
2015-07-02,5.46
2015-07-06,5.06
2015-07-07,4.96
2015-07-08,4.49
2015-07-09,4.79
2015-07-10,4.71
2015-07-13,4.61
2015-07-14,4.78
2015-07-15,4.51
2015-07-16,4.57
2015-07-17,4.25
2015-07-20,4.07
2015-07-21,4.15
2015-07-22,3.99
2015-07-23,4.16
2015-07-24,3.75
2015-07-27,3.58
2015-07-28,3.68
2015-07-29,3.9
2015-07-30,3.8
2015-07-31,3.66
2015-08-03,3.59
2015-08-04,3.39
2015-08-05,3.38
2015-08-06,3.76
2015-08-07,3.38
2015-08-10,3.74
2015-08-11,3.72
2015-08-12,3.69
2015-08-13,3.38
2015-08-14,3.26
2015-08-17,3.06
2015-08-18,3.01
2015-08-19,2.83
2015-08-20,2.78
2015-08-21,2.45
2015-08-24,2.49
2015-08-25,2.57
2015-08-26,2.83
2015-08-27,2.98
2015-08-28,3.12
2015-08-31,3.31
2015-09-01,3.02
2015-09-02,3.05
2015-09-03,3.06
2015-09-04,2.95
2015-09-08,2.95
2015-09-09,2.62
2015-09-10,2.58
2015-09-11,2.5
2015-09-14,2.36
2015-09-15,2.42
2015-09-16,2.67
2015-09-17,2.79
2015-09-18,2.61
2015-09-21,2.62
2015-09-22,2.56
2015-09-23,2.42
2015-09-24,2.48
2015-09-25,2.25
2015-09-28,2.16
2015-09-29,2.14
2015-09-30,2.1
2015-10-01,2.1
2015-10-02,2.2
2015-10-05,2.46
2015-10-06,2.78
2015-10-07,2.88
2015-10-08,3.3
2015-10-09,3.32
2015-10-12,3.05
2015-10-13,2.92
2015-10-14,2.99
2015-10-15,3.07
2015-10-16,2.87
2015-10-19,2.67
2015-10-20,3.01
2015-10-21,2.75
2015-10-22,2.89
2015-10-23,2.91
2015-10-26,2.67
2015-10-27,2.66
2015-10-28,2.78
2015-10-29,2.36
2015-10-30,2.31
2015-11-02,2.34
2015-11-03,2.61
2015-11-04,2.74
2015-11-05,2.68
2015-11-06,2.9
2015-11-09,2.76
2015-11-10,2.88
2015-11-11,2.71
2015-11-12,2.7
2015-11-13,2.8
2015-11-16,2.72
2015-11-17,2.71
2015-11-18,2.68
2015-11-19,2.51
2015-11-20,2.47
2015-11-23,2.5
2015-11-24,2.65
2015-11-25,2.74
2015-11-27,2.52
2015-11-30,2.53
2015-12-01,2.66
2015-12-02,2.54
2015-12-03,2.66
2015-12-04,2.63
2015-12-07,2.41
2015-12-08,2.4
2015-12-09,2.41
2015-12-10,2.41
2015-12-11,2.33
2015-12-14,2.17
2015-12-15,2.21
2015-12-16,2.2
2015-12-17,2.24
2015-12-18,2.2
2015-12-21,2.13
2015-12-22,2.17
2015-12-23,2.34
2015-12-24,2.42
2015-12-28,2.2
2015-12-29,2.18
2015-12-30,2.13
2015-12-31,2.17
2016-01-04,2.26
2016-01-05,2.25
2016-01-06,2.11
2016-01-07,2.05
2016-01-08,1.99
2016-01-11,1.77
2016-01-12,1.51
2016-01-13,1.41
2016-01-14,1.49
2016-01-15,1.36
2016-01-19,1.22
2016-01-20,1.06
2016-01-21,1.14
2016-01-22,1.23
2016-01-25,1.12
2016-01-26,1.25
2016-01-27,1.28
2016-01-28,1.31
2016-01-29,1.37
2016-02-01,1.34
2016-02-02,1.28
2016-02-03,1.3
2016-02-04,1.36
2016-02-05,1.48
2016-02-08,1.33
2016-02-09,1.23
2016-02-10,1.15
2016-02-11,1.08
2016-02-12,1.18
2016-02-16,1.15
2016-02-17,1.26
2016-02-18,1.25
2016-02-19,1.18
2016-02-22,1.26
2016-02-23,1.21
2016-02-24,1.23
2016-02-25,1.24
2016-02-26,1.32
2016-02-29,1.37
2016-03-01,1.49
2016-03-02,1.62
2016-03-03,1.87
2016-03-04,2.17
2016-03-07,2.24
2016-03-08,2.05
2016-03-09,2.1
2016-03-10,2.12
2016-03-11,2.15
2016-03-14,2.12
2016-03-15,2.08
2016-03-16,2.08
2016-03-17,2.24
2016-03-18,2.46
2016-03-21,2.43
2016-03-22,2.36
2016-03-23,2.09
2016-03-24,2.03
2016-03-28,2.1
2016-03-29,2.1
2016-03-30,2.15
2016-03-31,2.2
2016-04-01,2.16
2016-04-04,2.08
2016-04-05,2.05
2016-04-06,2.23
2016-04-07,2.16
2016-04-08,2.32
2016-04-11,2.26
2016-04-12,2.54
2016-04-13,2.56
2016-04-14,2.58
2016-04-15,2.54
2016-04-18,2.62
2016-04-19,2.76
2016-04-20,2.78
2016-04-21,2.84
2016-04-22,2.98
2016-04-25,2.78
2016-04-26,2.84
2016-04-27,2.9
2016-04-28,2.88
2016-04-29,3.11
2016-05-02,3.15
2016-05-03,2.99
2016-05-04,3.04
2016-05-05,3.05
2016-05-06,3.08
2016-05-09,2.69
2016-05-10,2.85
2016-05-11,2.77
2016-05-12,2.82
2016-05-13,2.81
2016-05-16,2.93
2016-05-17,3.02
2016-05-18,2.95
2016-05-19,2.76
2016-05-20,2.89
2016-05-23,2.97
2016-05-24,3.01
2016-05-25,3.54
2016-05-26,4.03
2016-05-27,3.51
2016-05-31,3.57
2016-06-01,3.62
2016-06-02,3.6
2016-06-03,3.61
2016-06-06,4.03
2016-06-07,4.32
2016-06-08,4.41
2016-06-09,4.44
2016-06-10,4.22
2016-06-13,4.26
2016-06-14,4.23
2016-06-15,4.04
2016-06-16,4.07
2016-06-17,4.04
2016-06-20,4.14
2016-06-21,4.32
2016-06-22,4.46
2016-06-23,4.71
2016-06-24,4.39
2016-06-27,3.8
2016-06-28,4.23
2016-06-29,4.59
2016-06-30,4.6
2016-07-01,4.8
2016-07-05,4.58
2016-07-06,4.55
2016-07-07,4.41
2016-07-08,4.65
2016-07-11,4.42
2016-07-12,4.75
2016-07-13,4.45
2016-07-14,4.36
2016-07-15,4.37
2016-07-18,4.39
2016-07-19,4.33
2016-07-20,4.29
2016-07-21,4.1
2016-07-22,4.08
2016-07-25,3.9
2016-07-26,3.84
2016-07-27,3.55
2016-07-28,3.12
2016-07-29,3.15
2016-08-01,2.81
2016-08-02,2.77
2016-08-03,2.91
2016-08-04,3.13
2016-08-05,3.19
2016-08-08,3.52
2016-08-09,3.46
2016-08-10,3.31
2016-08-11,3.29
2016-08-12,3.41
2016-08-15,3.53
2016-08-16,3.52
2016-08-17,3.44
2016-08-18,3.76
2016-08-19,3.59
2016-08-22,3.47
2016-08-23,3.61
2016-08-24,3.45
2016-08-25,3.52
2016-08-26,3.49
2016-08-29,3.51
2016-08-30,3.47
2016-08-31,3.33
2016-09-01,3.28
2016-09-02,3.6
2016-09-06,3.78
2016-09-07,3.65
2016-09-08,4.03
2016-09-09,3.75
2016-09-12,3.76
2016-09-13,3.47
2016-09-14,3.29
2016-09-15,3.32
2016-09-16,3.28
2016-09-19,3.4
2016-09-20,3.2
2016-09-21,3.44
2016-09-22,3.53
2016-09-23,3.46
2016-09-26,3.42
2016-09-27,3.25
2016-09-28,3.58
2016-09-29,3.89
2016-09-30,4.04
2016-10-03,4.06
2016-10-04,4.1
2016-10-05,4.38
2016-10-06,4.45
2016-10-07,4.36
2016-10-10,4.5
2016-10-11,4.5
2016-10-12,4.45
2016-10-13,4.35
2016-10-14,4.3
2016-10-17,4.2
2016-10-18,4.2
2016-10-19,4.3
2016-10-20,4.25
2016-10-21,4.25
2016-10-24,4.25
2016-10-25,4.25
2016-10-26,4.15
2016-10-27,4.1
2016-10-28,3.75
2016-10-31,3.55
2016-11-01,3.75
2016-11-02,3.6
2016-11-03,3.55
2016-11-04,3.35
2016-11-07,3.65
2016-11-08,3.8
2016-11-09,3.95
2016-11-10,4
2016-11-11,3.95
2016-11-14,3.9
2016-11-15,4.4
2016-11-16,4.45
2016-11-17,4.4
2016-11-18,4.4
2016-11-21,4.5
2016-11-22,4.4
2016-11-23,4.75
2016-11-25,4.65
2016-11-28,4.55
2016-11-29,4.6
2016-11-30,5
2016-12-01,5.25
2016-12-02,5.7
2016-12-05,6.25
2016-12-06,6.7
2016-12-07,5.65
2016-12-08,5.9
2016-12-09,5.8
2016-12-12,5.95
2016-12-13,5.9
2016-12-14,5.7
2016-12-15,5.95
2016-12-16,5.75
2016-12-19,5.9
2016-12-20,6.15
2016-12-21,6.25
2016-12-22,6.55
2016-12-23,6.95
2016-12-27,6.95
2016-12-28,7.05
2016-12-29,6.75
2016-12-30,6.85
2017-01-03,7.1
2017-01-04,7.1
2017-01-05,7.15
2017-01-06,6.9
2017-01-09,6.6
2017-01-10,6.3
2017-01-11,6.3
2017-01-12,6.15
2017-01-13,6.1
2017-01-17,6
2017-01-18,6.1
2017-01-19,5.95
2017-01-20,6.1
2017-01-23,5.8
2017-01-24,6.05
2017-01-25,6.3
2017-01-26,6.4
2017-01-27,6.2
2017-01-30,5.95
2017-01-31,6.3
2017-02-01,6.4
2017-02-02,5.95
2017-02-03,6.5
2017-02-06,6.25
2017-02-07,6.15
2017-02-08,6.15
2017-02-09,6.45
2017-02-10,6.35
2017-02-13,6.5
2017-02-14,6.4
2017-02-15,6.4
2017-02-16,6.5
2017-02-17,5.95
2017-02-21,6.1
2017-02-22,5.75
2017-02-23,5.65
2017-02-24,5.45
2017-02-27,5.7
2017-02-28,5.25
2017-03-01,5.25
2017-03-02,5.45
2017-03-03,5.4
2017-03-06,5.22
2017-03-07,5.1
2017-03-08,4.75
2017-03-09,4.55
2017-03-10,4.55
2017-03-13,4.45
2017-03-14,4.35
2017-03-15,4.5
2017-03-16,4.35
2017-03-17,4.35
2017-03-20,4.3
2017-03-21,4.2
2017-03-22,4
2017-03-23,4.05
2017-03-24,4
2017-03-27,3.8
2017-03-28,3.85
2017-03-29,3.75
2017-03-30,3.85
2017-03-31,4
2017-04-03,3.85
2017-04-04,3.9
2017-04-05,4.05
2017-04-06,4.05
2017-04-07,3.95
2017-04-10,4.2
2017-04-11,4.4
2017-04-12,4.25
2017-04-13,3.95
2017-04-17,3.95
2017-04-18,3.85
2017-04-19,3.55
2017-04-20,3.5
2017-04-21,3.5
2017-04-24,3.5
2017-04-25,3.5
2017-04-26,3.55
2017-04-27,3.2
2017-04-28,3.05
2017-05-01,3
2017-05-02,2.8
2017-05-03,2.9
2017-05-04,2.8
2017-05-05,3
2017-05-08,3.1
2017-05-09,3.1
2017-05-10,3.1
2017-05-11,2.95
2017-05-12,2.85
2017-05-15,3.05
2017-05-16,2.85
2017-05-17,2.75
2017-05-18,2.75
2017-05-19,2.9
2017-05-22,2.9
2017-05-23,2.8
2017-05-24,2.8
2017-05-25,2.6
2017-05-26,2.6
2017-05-30,2.35
2017-05-31,2.45
2017-06-01,2.5
2017-06-02,2.45
2017-06-05,2.5
2017-06-06,2.5
2017-06-07,2.35
2017-06-08,2.3
2017-06-09,2.15
2017-06-12,2.25
2017-06-13,2.2
2017-06-14,2.15
2017-06-15,2.1
2017-06-16,2.05
2017-06-19,2.2
2017-06-20,2.15
2017-06-21,1.9
2017-06-22,1.8
2017-06-23,1.8
2017-06-26,1.8
2017-06-27,1.85
2017-06-28,1.95
2017-06-29,1.95
2017-06-30,2.05
2017-07-03,2.2
2017-07-05,2
2017-07-06,1.95
2017-07-07,1.85
2017-07-10,1.95
2017-07-11,2.1
2017-07-12,2.25
2017-07-13,2.4
2017-07-14,2.5
2017-07-17,2.5
2017-07-18,2.45
2017-07-19,2.5
2017-07-20,2.5
2017-07-21,2.35
2017-07-24,2.2
2017-07-25,2.3
2017-07-26,2.25
2017-07-27,2.25
2017-07-28,2.3
2017-07-31,2.2
2017-08-01,2.1
2017-08-02,2.05
2017-08-03,2.2
2017-08-04,2.25
2017-08-07,2.2
2017-08-08,2.15
2017-08-09,2.2
2017-08-10,2.1
2017-08-11,2.05
2017-08-14,1.9
2017-08-15,1.9
2017-08-16,1.8
2017-08-17,1.85
2017-08-18,1.85
2017-08-21,1.8
2017-08-22,1.75
2017-08-23,1.75
2017-08-24,1.8
2017-08-25,1.8
2017-08-28,1.75
2017-08-29,1.75
2017-08-30,1.7
2017-08-31,1.7
2017-09-01,1.75
2017-09-05,1.8
2017-09-06,2
2017-09-07,2.05
2017-09-08,1.9
2017-09-11,1.85
2017-09-12,2.05
2017-09-13,2.1
2017-09-14,2.15
2017-09-15,2.2
2017-09-18,2.25
2017-09-19,2.25
2017-09-20,2.35
2017-09-21,2.5
2017-09-22,2.5
2017-09-25,2.5
2017-09-26,2.5
2017-09-27,2.6
2017-09-28,2.45
2017-09-29,2.55
2017-10-02,2.6
2017-10-03,2.55
2017-10-04,2.55
2017-10-05,2.5
2017-10-06,2.4
2017-10-09,2.25
2017-10-10,2.25
2017-10-11,2.15
2017-10-12,2.2
2017-10-13,2.1
2017-10-16,2.05
2017-10-17,2.05
2017-10-18,1.9
2017-10-19,1.85
2017-10-20,1.95
2017-10-23,1.95
2017-10-24,1.8
2017-10-25,1.9
2017-10-26,1.85
2017-10-27,1.9
2017-10-30,1.85
2017-10-31,1.9
2017-11-01,2
2017-11-02,2.1
2017-11-03,2.15
2017-11-06,2.25
2017-11-07,2.2
2017-11-08,2.2
2017-11-09,2.15
2017-11-10,2.2
2017-11-13,2.2
2017-11-14,2.15
2017-11-15,2
2017-11-16,2
2017-11-17,2
2017-11-20,2
2017-11-21,2
2017-11-22,2.05
2017-11-24,2.1
2017-11-27,2
2017-11-28,2
2017-11-29,2.05
2017-11-30,2.1
2017-12-01,2.15
2017-12-04,2.1
2017-12-05,2.1
2017-12-06,2
2017-12-07,2
2017-12-08,2.05
2017-12-11,2.2
2017-12-12,2.25
2017-12-13,2.2
2017-12-14,2.3
2017-12-15,2.25
2017-12-18,2.4
2017-12-19,2.45
2017-12-20,2.45
2017-12-21,2.5
2017-12-22,2.45
2017-12-26,2.75
2017-12-27,2.8
2017-12-28,2.8
2017-12-29,3.05
2018-01-02,3.2
2018-01-03,3.35
2018-01-04,3.8
2018-01-05,3.55
2018-01-08,3.3
2018-01-09,3.5
2018-01-10,3.5
2018-01-11,3.75
2018-01-12,4
2018-01-16,3.65
2018-01-17,3.8
2018-01-18,3.7
2018-01-19,3.7
2018-01-22,3.75
2018-01-23,3.8
2018-01-24,3.75
2018-01-25,3.85
2018-01-26,3.5
2018-01-29,3.2
2018-01-30,3.2
2018-01-31,3.25
2018-02-01,3.5
2018-02-02,3.25
2018-02-05,3.05
2018-02-06,3.15
2018-02-07,3
2018-02-08,2.8
2018-02-09,2.75
2018-02-12,2.75
2018-02-13,2.55
2018-02-14,2.95
2018-02-15,2.9
2018-02-16,2.75
2018-02-20,2.85
2018-02-21,2.75
2018-02-22,2.8
2018-02-23,2.95
2018-02-26,3.1
2018-02-27,3
2018-02-28,2.75
2018-03-01,2.8
2018-03-02,2.8
2018-03-05,3
2018-03-06,2.85
2018-03-07,2.95
2018-03-08,2.9
2018-03-09,3.1
2018-03-12,3.15
2018-03-13,3.15
2018-03-14,3.05
2018-03-15,2.95
2018-03-16,3.15
2018-03-19,3.1
2018-03-20,3
2018-03-21,3.25
2018-03-22,2.95
2018-03-23,3.05
2018-03-26,2.75
2018-03-27,2.7
2018-03-28,2.5
2018-03-29,2.7
2018-04-02,2.5
2018-04-03,2.55
2018-04-04,2.55
2018-04-05,2.7
2018-04-06,2.6
2018-04-09,2.55
2018-04-10,2.7
2018-04-11,2.85
2018-04-12,2.95
2018-04-13,2.95
2018-04-16,3
2018-04-17,3.2
2018-04-18,3.2
2018-04-19,3.3
2018-04-20,3.2
2018-04-23,3.35
2018-04-24,3.25
2018-04-25,3.35
2018-04-26,3.55
2018-04-27,3.5
2018-04-30,3.45
2018-05-01,3.45
2018-05-02,3.85
2018-05-03,4.15
2018-05-04,4.5
2018-05-07,4.6
2018-05-08,4.6
2018-05-09,4.9
2018-05-10,5
2018-05-11,5.05
2018-05-14,5.1
2018-05-15,5.35
2018-05-16,5.65
2018-05-17,5.95
2018-05-18,5.85
2018-05-21,6.2
2018-05-22,5.65
2018-05-23,6
2018-05-24,5.7
2018-05-25,5.05
2018-05-29,5.3
2018-05-30,5.65
2018-05-31,5.5
2018-06-01,5.4
2018-06-04,5.05
2018-06-05,5.4
2018-06-06,5.2
2018-06-07,5.5
2018-06-08,5.2
2018-06-11,5.15
2018-06-12,5.15
2018-06-13,5.2
2018-06-14,5.1
2018-06-15,4.75
2018-06-18,4.7
2018-06-19,4.8
2018-06-20,4.8
2018-06-21,4.7
2018-06-22,5.15
2018-06-25,4.95
2018-06-26,5.25
2018-06-27,5.55
2018-06-28,5.6
2018-06-29,5.85
2018-07-02,5.3
2018-07-03,5.3
2018-07-05,5.45
2018-07-06,5.6
2018-07-09,5.85
2018-07-10,5.85
2018-07-11,5.65
2018-07-12,5.6
2018-07-13,5.55
2018-07-16,5.25
2018-07-17,5.2
2018-07-18,5.25
2018-07-19,5.2
2018-07-20,5.1
2018-07-23,4.9
2018-07-24,4.85
2018-07-25,4.85
2018-07-26,5
2018-07-27,4.85
2018-07-30,4.95
2018-07-31,3.3
2018-08-01,3.3
2018-08-02,3.2
2018-08-03,3.2
2018-08-06,3.5
2018-08-07,3.3
2018-08-08,3.25
2018-08-09,3.2
2018-08-10,3.35
2018-08-13,3.1
2018-08-14,3.15
2018-08-15,3
2018-08-16,3
2018-08-17,3.1
2018-08-20,3.15
2018-08-21,3.15
2018-08-22,3.6
2018-08-23,3.5
2018-08-24,3.4
2018-08-27,3.4
2018-08-28,3.15
2018-08-29,3.35
2018-08-30,3.25
2018-08-31,3.2
2018-09-04,3.25
2018-09-05,3.1
2018-09-06,2.9
2018-09-07,2.95
2018-09-10,3.05
2018-09-11,3.1
2018-09-12,3.15
2018-09-13,3
2018-09-14,3.05
2018-09-17,3.05
2018-09-18,3.15
2018-09-19,3.25
2018-09-20,3.35
2018-09-21,3.4
2018-09-24,3.45
2018-09-25,3.4
2018-09-26,3.05
2018-09-27,3
2018-09-28,2.95
2018-10-01,3.03
2018-10-02,2.86
2018-10-03,3.02
2018-10-04,3
2018-10-05,3
2018-10-08,3.04
2018-10-09,3.19
2018-10-10,3.05
2018-10-11,2.95
2018-10-12,3.03
2018-10-15,2.92
2018-10-16,3.02
2018-10-17,2.78
2018-10-18,2.74
2018-10-19,2.54
2018-10-22,2.55
2018-10-23,2.42
2018-10-24,2.18
2018-10-25,2.37
2018-10-26,2.39
2018-10-29,2.24
2018-10-30,2.96
2018-10-31,2.97
2018-11-01,3.06
2018-11-02,3.1
2018-11-05,3.17
2018-11-06,3.07
2018-11-07,3.19
2018-11-08,2.95
2018-11-09,2.84
2018-11-12,2.63
2018-11-13,2.6
2018-11-14,2.73
2018-11-15,2.77
2018-11-16,2.77
2018-11-19,2.76
2018-11-20,2.66
2018-11-21,2.79
2018-11-23,2.61
2018-11-26,2.63
2018-11-27,2.59
2018-11-28,2.56
2018-11-29,2.56
2018-11-30,2.53
2018-12-03,2.67
2018-12-04,2.38
2018-12-06,2.19
2018-12-07,2.17
2018-12-10,2.1
2018-12-11,2.08
2018-12-12,2.06
2018-12-13,1.91
2018-12-14,1.72
2018-12-17,1.8
2018-12-18,1.66
2018-12-19,1.55
2018-12-20,1.51
2018-12-21,1.44
2018-12-24,1.49
2018-12-26,1.41
2018-12-27,1.3
2018-12-28,1.3
2018-12-31,1.23
2019-01-02,1.48
2019-01-03,1.38
2019-01-04,1.46
2019-01-07,1.59
2019-01-08,1.7
2019-01-09,1.88
2019-01-10,1.89
2019-01-11,1.87
2019-01-14,1.61
2019-01-15,1.66
2019-01-16,1.7
2019-01-17,1.65
2019-01-18,1.73
2019-01-22,1.57
2019-01-23,1.43
2019-01-24,1.38
2019-01-25,1.43
2019-01-28,1.39
2019-01-29,1.39
2019-01-30,1.48
2019-01-31,1.48
2019-02-01,1.62
2019-02-04,1.74
2019-02-05,1.67
2019-02-06,1.67
2019-02-07,1.55
2019-02-08,1.5
2019-02-11,1.58
2019-02-12,1.57
2019-02-13,1.67
2019-02-14,1.68
2019-02-15,1.69
2019-02-19,1.89
2019-02-20,2.11
2019-02-21,1.84
2019-02-22,2.04
2019-02-25,1.9
2019-02-26,1.9
2019-02-27,1.89
2019-02-28,1.77
2019-03-01,1.77
2019-03-04,1.79
2019-03-05,1.79
2019-03-06,1.63
2019-03-07,1.66
2019-03-08,1.51
2019-03-11,1.63
2019-03-12,1.71
2019-03-13,1.76
2019-03-14,1.86
2019-03-15,2
2019-03-18,2.02
2019-03-19,2.04
2019-03-20,2.14
2019-03-21,2.14
2019-03-22,1.91
2019-03-25,1.85
2019-03-26,1.91
2019-03-27,1.87
2019-03-28,1.85
2019-03-29,1.77
2019-04-01,1.84
2019-04-02,1.84
2019-04-03,1.96
2019-04-04,1.98
2019-04-05,2.1
2019-04-08,2.12
2019-04-09,1.92
2019-04-10,1.95
2019-04-11,1.92
2019-04-12,1.92
2019-04-15,1.9
2019-04-16,1.99
2019-04-17,2.06
2019-04-18,2.05
2019-04-22,2.18
2019-04-23,2.27
2019-04-24,2.07
2019-04-25,2.01
2019-04-26,1.93
2019-04-29,1.91
2019-04-30,1.74
2019-05-01,1.76
2019-05-02,1.53
2019-05-03,1.6
2019-05-06,1.59
2019-05-07,1.53
2019-05-08,1.47
2019-05-09,1.35
2019-05-10,1.25
2019-05-13,1.09
2019-05-14,1.07
2019-05-15,1.02
2019-05-16,0.9372
2019-05-17,0.7902
2019-05-20,0.6431
2019-05-21,0.7254
2019-05-22,0.5557
2019-05-23,0.415
2019-05-24,0.4113
2019-05-28,0.3852
2019-05-29,0.3203
2019-05-30,0.3302
2019-05-31,0.315
2019-06-03,0.3195
2019-06-04,0.341
2019-06-05,0.3321
2019-06-06,0.3331
2019-06-07,0.382
2019-06-10,0.3747
2019-06-11,0.3504
2019-06-12,0.3213
2019-06-13,0.3207
2019-06-14,0.2781
2019-06-17,0.2814
2019-06-18,0.3186
2019-06-19,0.2977
2019-06-20,0.2979
2019-06-21,0.3008
2019-06-24,0.2799
2019-06-25,0.2587
2019-06-26,0.2805
2019-06-27,0.2597
2019-06-28,0.26
2019-07-01,0.2751
2019-07-02,0.2301
2019-07-03,0.2295
2019-07-04,0.2295
2019-07-05,0.253
2019-07-08,0.2536
2019-07-09,0.2311
2019-07-10,0.2715
2019-07-11,0.2791
2019-07-12,0.268
2019-07-15,0.2451
2019-07-16,0.2403
2019-07-17,0.232
2019-07-18,0.221
2019-07-19,0.225
2019-07-22,0.2154
2019-07-23,0.2096
2019-07-24,0.1868
2019-07-25,0.1838
2019-07-26,0.1885
2019-07-29,0.1908
2019-07-30,0.225
2019-07-31,0.2098
2019-08-01,0.2083
2019-08-02,0.1918
2019-08-05,0.1828
2019-08-06,0.1786
2019-08-07,0.174
2019-08-08,0.1779
2019-08-09,0.178
2019-08-12,0.1751
2019-08-13,0.1685
2019-08-14,0.1663
2019-08-15,0.1663
2019-08-16,0.1663
2019-08-19,0.1663
2019-08-20,0.1663
2019-08-21,0.1663
2019-08-22,0.1663
2019-08-23,0.1663
2019-08-26,0.1663
2019-08-27,0.1663
2019-08-28,0.1663
2019-08-29,0.1663
2019-08-30,0.1663
2019-09-02,0.1663
2019-09-03,0.1663
2019-09-04,0.1663
2019-09-05,0.1663
2019-09-06,0.1663
2019-09-09,0.1663
2019-09-10,0.1663
2019-09-11,0.1663
2019-09-12,0.1663
2019-09-13,0.1663
2019-09-16,0.1663
2019-09-17,0.1663
2019-09-18,0.1663
2019-09-19,0.1663
2019-09-20,0.1663
2019-09-23,0.1663
2019-09-24,0.1663
2019-09-25,0.1663
2019-09-26,0.1663
2019-09-27,0.1663
2019-09-30,0.1663
2019-10-01,0.1663
2019-10-02,0.1663
2019-10-03,0.1663
2019-10-04,0.1663
2019-10-07,0.1663
2019-10-08,0.1663
2019-10-09,0.1663
2019-10-10,0.1663
2019-10-11,0.1663
2019-10-14,0.1663
2019-10-15,0.1663
2019-10-16,0.1663
2019-10-17,0.1663
2019-10-18,0.1663
2019-10-21,0.1663
2019-10-22,0.1663
2019-10-23,0.1663
2019-10-24,0.1663
2019-10-25,0.1663
2019-10-28,0.1663
2019-10-29,0.1663
2019-10-30,0.1663
2019-10-31,0.1663
2019-11-01,0.1663
2019-11-04,0.1663
2019-11-05,0.1663
2019-11-06,0.1663
2019-11-07,0.1663
2019-11-08,0.1663
2019-11-11,0.1663
2019-11-12,0.1663
2019-11-13,0.1663
2019-11-14,0.1663
2019-11-15,0.1663
2019-11-18,0.1663
2019-11-19,0.1663
2019-11-20,0.1663
2019-11-21,0.1663
2019-11-22,0.1663
2019-11-25,0.1663
