date,close
2014-06-13,100.5498
2014-06-16,99.8879
2014-06-17,100.1661
2014-06-18,101.0774
2014-06-19,100.9815
2014-06-20,101.0007
2014-06-23,100.8951
2014-06-24,100.4827
2014-06-25,100.9143
2014-06-26,100.8951
2014-06-27,100.8856
2014-06-30,101.298
2014-07-01,103.3221
2014-07-02,103.0823
2014-07-03,102.9672
2014-07-07,101.6338
2014-07-08,101.5091
2014-07-09,101.8832
2014-07-10,102.3053
2014-07-11,102.6122
2014-07-14,102.8233
2014-07-15,102.7273
2014-07-16,101.9311
2014-07-17,101.0103
2014-07-18,101.4036
2014-07-21,101.1158
2014-07-22,101.9503
2014-07-23,102.1422
2014-07-24,102.0271
2014-07-25,101.6434
2014-07-28,102.43
2014-07-29,101.4611
2014-07-30,104.4636
2014-07-31,103.3509
2014-08-01,101.8256
2014-08-04,102.5355
2014-08-05,102.0271
2014-08-06,100.8472
2014-08-07,99.8591
2014-08-08,101.0582
2014-08-11,100.9047
2014-08-12,100.2524
2014-08-13,101.6671
2014-08-14,102.1002
2014-08-15,102.2446
2014-08-18,102.9279
2014-08-19,103.2839
2014-08-20,103.4379
2014-08-21,104.1597
2014-08-22,104.2945
2014-08-25,104.8719
2014-08-26,105.0355
2014-08-27,105.0836
2014-08-28,104.7468
2014-08-29,105.3627
2014-09-02,105.7862
2014-09-03,105.8343
2014-09-04,105.4782
2014-09-05,105.5648
2014-09-08,105.6226
2014-09-09,105.5648
2014-09-10,105.382
2014-09-11,106.0653
2014-09-12,105.4782
2014-09-15,104.6024
2014-09-16,105.382
2014-09-17,104.8911
2014-09-18,105.1991
2014-09-19,104.2752
2014-09-22,103.4764
2014-09-23,102.1676
2014-09-24,102.7065
2014-09-25,102.2638
2014-09-26,102.1964
2014-09-29,102.5237
2014-09-30,101.0897
2014-10-01,101.2341
2014-10-02,101.7634
2014-10-03,102.7643
2014-10-06,105.074
2014-10-07,103.871
2014-10-08,105.815
2014-10-09,104.2945
2014-10-10,102.976
2014-10-13,101.4362
2014-10-14,101.4073
2014-10-15,100.6085
2014-10-16,100.0984
2014-10-17,102.2446
2014-10-20,103.1011
2014-10-21,105.1606
2014-10-22,104.8045
2014-10-23,105.9402
2014-10-24,106.7293
2014-10-27,106.8063
2014-10-28,107.8264
2014-10-29,108.0093
2014-10-30,110.6578
2014-10-31,109.8282
2014-11-03,109.4625
2014-11-04,109.27
2014-11-05,108.9717
2014-11-06,109.9341
2014-11-07,109.6165
2014-11-10,109.8378
2014-11-11,110.0303
2014-11-12,110.4937
2014-11-13,110.6578
2014-11-14,110.8412
2014-11-17,111.2755
2014-11-18,111.15
2014-11-19,111.1211
2014-11-20,111.3527
2014-11-21,112.3084
2014-11-24,114.2099
2014-11-25,114.2775
2014-11-26,114.818
2014-11-28,115.0111
2014-12-01,113.9397
2014-12-02,114.5188
2014-12-03,114.4802
2014-12-04,114.7312
2014-12-05,114.4995
2014-12-08,113.8335
2014-12-09,113.3701
2014-12-10,111.0728
2014-12-11,111.2755
2014-12-12,110.7543
2014-12-15,108.4377
2014-12-16,108.1481
2014-12-17,110.3199
2014-12-18,112.2022
2014-12-19,113.4667
2014-12-22,113.2736
2014-12-23,112.4918
2014-12-24,112.762
2014-12-26,112.7331
2014-12-29,112.54
2014-12-30,112.1829
2014-12-31,110.8315
2015-01-02,110.6674
2015-01-05,108.2349
2015-01-06,106.7291
2015-01-07,107.5689
2015-01-08,108.1288
2015-01-09,107.762
2015-01-12,106.9994
2015-01-13,107.1925
2015-01-14,107.1635
2015-01-15,106.6712
2015-01-16,106.4299
2015-01-20,106.9029
2015-01-21,106.594
2015-01-22,107.3373
2015-01-23,107.8295
2015-01-26,108.9106
2015-01-27,107.8681
2015-01-28,107.0863
2015-01-29,107.984
2015-01-30,105.7542
2015-02-02,105.7446
2015-02-03,106.5843
2015-02-04,106.121
2015-02-05,106.9608
2015-02-06,106.6616
2015-02-09,105.6094
2015-02-10,106.3044
2015-02-11,107.4338
2015-02-12,107.7234
2015-02-13,108.177
2015-02-17,110.5323
2015-02-18,112.2215
2015-02-19,112.125
2015-02-20,115.986
2015-02-23,117.3277
2015-02-24,118.7177
2015-02-25,116.7968
2015-02-26,117.0092
2015-02-27,117.7933
2015-03-02,118.9742
2015-03-03,118.4902
2015-03-04,117.2899
2015-03-05,118.0546
2015-03-06,116.7963
2015-03-09,116.9705
2015-03-10,116.0509
2015-03-11,115.5282
2015-03-12,116.1574
2015-03-13,115.112
2015-03-16,116.2445
2015-03-17,116.0412
2015-03-18,115.9444
2015-03-19,116.0703
2015-03-20,116.138
2015-03-23,115.867
2015-03-24,117.1254
2015-03-25,116.3219
2015-03-26,115.3346
2015-03-27,116.0509
2015-03-30,117.1544
2015-03-31,116.9608
2015-04-01,115.7702
2015-04-02,116.8834
2015-04-06,117.8223
2015-04-07,117.0673
2015-04-08,117.1157
2015-04-09,117.5803
2015-04-10,117.2706
2015-04-13,117.0866
2015-04-14,115.9444
2015-04-15,115.6637
2015-04-16,116.1671
2015-04-17,116.3316
2015-04-20,117.6287
2015-04-21,118.8193
2015-04-22,119.0807
2015-04-23,119.8647
2015-04-24,120.9779
2015-04-27,119.3324
2015-04-28,119.3517
2015-04-29,118.0256
2015-04-30,119.0226
2015-05-01,118.6838
2015-05-04,120.6198
2015-05-05,119.1
2015-05-06,118.7806
2015-05-07,118.8484
2015-05-08,120.3197
2015-05-11,121.2586
2015-05-12,122.4234
2015-05-13,122.8795
2015-05-14,125.4711
2015-05-15,124.6072
2015-05-18,124.8596
2015-05-19,124.2384
2015-05-20,123.9181
2015-05-21,125.1217
2015-05-22,125.9078
2015-05-26,123.7046
2015-05-27,125.209
2015-05-28,125.0149
2015-05-29,124.9566
2015-06-01,125.5778
2015-06-02,125.2284
2015-06-03,125.2964
2015-06-04,125.7331
2015-06-05,127.3444
2015-06-08,126.8591
2015-06-09,127.2473
2015-06-10,127.8394
2015-06-11,127.8685
2015-06-12,127.0629
2015-06-15,127.1405
2015-06-16,127.7132
2015-06-17,128.5576
2015-06-18,129.3438
2015-06-19,130.4406
2015-06-22,131.683
2015-06-23,131.9839
2015-06-24,130.9453
2015-06-25,130.6153
2015-06-26,132.741
2015-06-29,131.1297
2015-06-30,131.4695
2015-07-01,132.2751
2015-07-02,131.8674
2015-07-06,133.5369
2015-07-07,132.8768
2015-07-08,130.9842
2015-07-09,130.528
2015-07-10,131.9548
2015-07-13,134.0998
2015-07-14,133.8183
2015-07-15,132.8866
2015-07-16,132.4692
2015-07-17,132.8283
2015-07-20,133.3233
2015-07-21,133.8766
2015-07-22,134.5948
2015-07-23,134.4492
2015-07-24,133.9154
2015-07-27,133.5077
2015-07-28,134.7016
2015-07-29,136.1381
2015-07-30,129.4797
2015-07-31,130.0524
2015-08-03,129.3147
2015-08-04,129.14
2015-08-05,130.033
2015-08-06,129.8
2015-08-07,130.2853
2015-08-10,130.46
2015-08-11,128.6547
2015-08-12,128.4795
2015-08-13,128.6158
2015-08-14,130.2214
2015-08-17,131.4086
2015-08-18,131.5545
2015-08-19,130.9999
2015-08-20,127.7983
2015-08-21,124.4119
2015-08-24,121.95
2015-08-25,122.2224
2015-08-26,124.3827
2015-08-27,129.5207
2015-08-28,128.9271
2015-08-31,127.2826
2015-09-01,123.1469
2015-09-02,124.6552
2015-09-03,125.6964
2015-09-04,125.4531
2015-09-08,128.6547
2015-09-09,129.2093
2015-09-10,130.8247
2015-09-11,133.9484
2015-09-14,132.6152
2015-09-15,133.9484
2015-09-16,134.3668
2015-09-17,134.2987
2015-09-18,133.0239
2015-09-21,131.4864
2015-09-22,129.6862
2015-09-23,129.3553
2015-09-24,127.3312
2015-09-25,126.436
2015-09-28,121.5704
2015-09-29,120.4222
2015-09-30,120.8698
2015-10-01,121.1325
2015-10-02,123.9546
2015-10-05,124.7428
2015-10-06,119.9259
2015-10-07,121.5704
2015-10-08,121.7845
2015-10-09,122.4073
2015-10-12,123.215
2015-10-13,122.0473
2015-10-14,121.5607
2015-10-15,121.5218
2015-10-16,123.3415
2015-10-19,124.4217
2015-10-20,123.4388
2015-10-21,124.1297
2015-10-22,121.3564
2015-10-23,122.7966
2015-10-26,122.8841
2015-10-27,123.9448
2015-10-28,126.4165
2015-10-29,128.9661
2015-10-30,129.4234
2015-11-02,129.6862
2015-11-03,129.7835
2015-11-04,129.657
2015-11-05,129.6472
2015-11-06,129.4137
2015-11-09,129.4915
2015-11-10,128.6037
2015-11-11,128.233
2015-11-12,125.2965
2015-11-13,125.3452
2015-11-16,127.6086
2015-11-17,127.5403
2015-11-18,128.2037
2015-11-19,127.833
2015-11-20,128.7403
2015-11-23,129.2964
2015-11-24,127.9794
2015-11-25,127.4623
2015-11-27,128.194
2015-11-30,128.4867
2015-12-01,130.7696
2015-12-02,130.2623
2015-12-03,126.5842
2015-12-04,130.3403
2015-12-07,128.6525
2015-12-08,128.0964
2015-12-09,126.4769
2015-12-10,126.3501
2015-12-11,125.5306
2015-12-14,125.6477
2015-12-15,127.5208
2015-12-16,128.7794
2015-12-17,128.6428
2015-12-18,127.4818
2015-12-21,127.7647
2015-12-22,128.5452
2015-12-23,128.8086
2015-12-24,129.5598
2015-12-28,129.9793
2015-12-29,131.0135
2015-12-30,129.9013
2015-12-31,128.2428
2016-01-04,124.8672
2016-01-05,125.1891
2016-01-06,128.194
2016-01-07,125.5696
2016-01-08,125.2769
2016-01-11,122.9257
2016-01-12,126.233
2016-01-13,126.194
2016-01-14,126.0184
2016-01-15,126.6233
2016-01-19,129.2964
2016-01-20,129.2867
2016-01-21,129.4428
2016-01-22,132.6037
2016-01-25,131.472
2016-01-26,133.8427
2016-01-27,131.6281
2016-01-28,130.155
2016-01-29,132.3793
2016-02-01,134.6622
2016-02-02,133.8622
2016-02-03,134.1159
2016-02-04,133.4525
2016-02-05,131.5306
2016-02-08,130.0281
2016-02-09,130.7598
2016-02-10,130.9159
2016-02-11,128.4379
2016-02-12,129.4037
2016-02-16,130.0086
2016-02-17,131.9403
2016-02-18,131.2574
2016-02-19,131.2184
2016-02-22,129.5208
2016-02-23,128.6037
2016-02-24,129.2281
2016-02-25,139.5012
2016-02-26,141.589
2016-02-29,139.3354
2016-03-01,141.2573
2016-03-02,142.7926
2016-03-03,143.5553
2016-03-04,143.7411
2016-03-07,142.7828
2016-03-08,143.5944
2016-03-09,144.5821
2016-03-10,143.9856
2016-03-11,145.208
2016-03-14,143.6042
2016-03-15,144.5332
2016-03-16,143.4771
2016-03-17,142.3818
2016-03-18,146.3325
2016-03-21,148.3275
2016-03-22,148.7382
2016-03-23,151.3198
2016-03-24,151.2025
2016-03-28,151.6816
2016-03-29,155.0065
2016-03-30,152.4933
2016-03-31,153.5396
2016-04-01,155.1238
2016-04-04,153.1974
2016-04-05,152.0532
2016-04-06,154.3415
2016-04-07,153.9895
2016-04-08,153.5592
2016-04-11,152.2097
2016-04-12,153.0996
2016-04-13,153.7743
2016-04-14,152.0924
2016-04-15,153.4419
2016-04-18,154.322
2016-04-19,153.0605
2016-04-20,154.9772
2016-04-21,155.1238
2016-04-22,155.0749
2016-04-25,154.4589
2016-04-26,155.0749
2016-04-27,156.708
2016-04-28,154.2731
2016-04-29,152.3368
2016-05-02,155.1727
2016-05-03,153.9797
2016-05-04,153.1094
2016-05-05,156.5125
2016-05-06,157.5686
2016-05-09,158.3705
2016-05-10,159.0159
2016-05-11,156.9524
2016-05-12,158.7262
2016-05-13,156.0117
2016-05-16,158.687
2016-05-17,154.7475
2016-05-18,154.6593
2016-05-19,154.9141
2016-05-20,155.9725
2016-05-23,155.1983
2016-05-24,156.7173
2016-05-25,157.4326
2016-05-26,156.7075
2016-05-27,158.099
2016-05-31,157.8736
2016-06-01,159.912
2016-06-02,162.8519
2016-06-03,162.4011
2016-06-06,164.1944
2016-06-07,164.9294
2016-06-08,167.742
2016-06-09,169.2511
2016-06-10,171.2895
2016-06-13,169.7705
2016-06-14,170.2115
2016-06-15,167.8203
2016-06-16,168.0065
2016-06-17,167.6244
2016-06-20,168.9767
2016-06-21,170.2507
2016-06-22,171.3581
2016-06-23,173.1122
2016-06-24,167.8203
2016-06-27,165.635
2016-06-28,167.9673
2016-06-29,170.2213
2016-06-30,173.759
2016-07-01,175.5621
2016-07-05,175.1211
2016-07-06,174.4842
2016-07-07,175.5523
2016-07-08,178.4531
2016-07-11,179.2958
2016-07-12,178.0905
2016-07-13,177.0713
2016-07-14,176.4637
2016-07-15,175.4053
2016-07-18,175.1995
2016-07-19,175.2387
2016-07-20,175.4543
2016-07-21,174.5136
2016-07-22,174.2686
2016-07-25,172.6222
2016-07-26,173.9942
2016-07-27,171.2405
2016-07-28,176.9537
2016-07-29,176.6989
2016-08-01,176.7185
2016-08-02,176.3461
2016-08-03,176.4245
2016-08-04,176.2677
2016-08-05,176.6401
2016-08-08,175.6895
2016-08-09,176.2579
2016-08-10,177.5319
2016-08-11,178.2192
2016-08-12,178.1996
2016-08-15,178.6217
2016-08-16,176.4323
2016-08-17,178.3861
2016-08-18,180.4185
2016-08-19,179.2992
2016-08-22,179.1225
2016-08-23,178.8377
2016-08-24,177.1981
2016-08-25,177.6203
2016-08-26,179.0734
2016-08-29,181.0959
2016-08-30,181.1548
2016-08-31,179.7606
2016-09-01,180.7523
2016-09-02,182.2152
2016-09-06,183.1577
2016-09-07,184.7679
2016-09-08,184.925
2016-09-09,177.2374
2016-09-12,179.3483
2016-09-13,176.0788
2016-09-14,173.7127
2016-09-15,173.3003
2016-09-16,169.6676
2016-09-19,172.1614
2016-09-20,171.1894
2016-09-21,170.9341
2016-09-22,173.8894
2016-09-23,168.4305
2016-09-26,164.2087
2016-09-27,165.2101
2016-09-28,164.9647
2016-09-29,161.5185
2016-09-30,164.9941
2016-10-03,164.1498
2016-10-04,162.2745
2016-10-05,164.7978
2016-10-06,165.9858
2016-10-07,164.7781
2016-10-10,165.9759
2016-10-11,161.7934
2016-10-12,162.3629
2016-10-13,164.6505
2016-10-14,165.7403
2016-10-17,165.6127
2016-10-18,164.5425
2016-10-19,165.053
2016-10-20,166.0152
2016-10-21,164.7487
2016-10-24,164.9647
2016-10-25,159.8494
2016-10-26,154.6262
2016-10-27,136.8749
2016-10-28,139.6633
2016-10-31,140.5273
2016-11-01,137.3658
2016-11-02,138.5833
2016-11-03,139.3982
2016-11-04,140.3309
2016-11-07,143.6593
2016-11-08,142.3633
2016-11-09,143.2567
2016-11-10,140.7177
2016-11-11,140.7964
2016-11-14,139.8123
2016-11-15,145.6382
2016-11-16,147.4588
2016-11-17,146.022
2016-11-18,148.6595
2016-11-21,147.9903
2016-11-22,147.449
2016-11-23,148.8956
2016-11-25,150.7556
2016-11-28,147.7049
2016-11-29,147.262
2016-11-30,145.5792
2016-12-01,143.7094
2016-12-02,150.1061
2016-12-05,151.7594
2016-12-06,150.9623
2016-12-07,151.9759
2016-12-08,154.1213
2016-12-09,153.5505
2016-12-12,155.932
2016-12-13,153.8359
2016-12-14,154.1311
2016-12-15,153.6883
2016-12-16,154.7905
2016-12-19,157.5755
2016-12-20,157.0244
2016-12-21,157.8412
2016-12-22,157.2015
2016-12-23,158.8647
2016-12-27,158.9631
2016-12-28,157.4475
2016-12-29,159.0123
2016-12-30,158.5891
2017-01-03,156.3355
2017-01-04,160.2621
2017-01-05,159.4847
2017-01-06,162.6928
2017-01-09,162.3484
2017-01-10,165.2122
2017-01-11,165.3204
2017-01-12,165.0153
2017-01-13,166.6785
2017-01-17,164.5036
2017-01-18,163.7754
2017-01-19,163.3916
2017-01-20,162.7716
2017-01-23,161.1183
2017-01-24,161.9154
2017-01-25,163.8639
2017-01-26,162.0237
2017-01-27,163.549
2017-01-30,162.9192
2017-01-31,165.0645
2017-02-01,165.1039
2017-02-02,166.4029
2017-02-03,168.1251
2017-02-06,167.4166
2017-02-07,169.493
2017-02-08,169.2962
2017-02-09,170.1426
2017-02-10,170.1524
2017-02-13,173.0063
2017-02-14,174.079
2017-02-15,174.2069
2017-02-16,175.2206
2017-02-17,177.051
2017-02-21,181.5877
2017-02-22,181.0858
2017-02-23,180.9973
2017-02-24,186.774
2017-02-27,189.746
2017-02-28,188.1419
2017-03-01,192.2134
2017-03-02,191.2473
2017-03-03,191.6022
2017-03-06,190.2811
2017-03-07,189.4136
2017-03-08,188.9897
2017-03-09,191.0797
2017-03-10,190.8529
2017-03-13,192.8345
2017-03-14,191.3656
2017-03-15,194.3133
2017-03-16,192.5092
2017-03-17,193.3472
2017-03-20,192.6965
2017-03-21,190.7346
2017-03-22,191.9965
2017-03-23,192.036
2017-03-24,192.1148
2017-03-27,192.3712
2017-03-28,192.1247
2017-03-29,191.9078
2017-03-30,191.8289
2017-03-31,190.991
2017-04-03,190.991
2017-04-04,190.2023
2017-04-05,189.7783
2017-04-06,191.2571
2017-04-07,191.1783
2017-04-10,191.267
2017-04-11,194.0767
2017-04-12,193.4458
2017-04-13,192.4205
2017-04-17,194.4513
2017-04-18,194.4612
2017-04-19,195.8118
2017-04-20,196.7681
2017-04-21,196.6991
2017-04-24,198.8483
2017-04-25,198.9469
2017-04-26,200.3172
2017-04-27,203.541
2017-04-28,203.9649
2017-05-01,207.3365
2017-05-02,207.3957
2017-05-03,206.5084
2017-05-04,199.9623
2017-05-05,197.5075
2017-05-08,192.2331
2017-05-09,191.6515
2017-05-10,192.3909
2017-05-11,191.4724
2017-05-12,191.0576
2017-05-15,192.3513
2017-05-16,191.8765
2017-05-17,190.996
2017-05-18,191.4313
2017-05-19,194.4883
2017-05-22,196.6747
2017-05-23,197.5255
2017-05-24,198.03
2017-05-25,199.1776
2017-05-26,199.0589
2017-05-30,198.6038
2017-05-31,197.8816
2017-06-01,201.9576
2017-06-02,204.8068
2017-06-05,202.8776
2017-06-06,201.3046
2017-06-07,203.867
2017-06-08,201.829
2017-06-09,197.8618
2017-06-12,198.1586
2017-06-13,199.7514
2017-06-14,199.2865
2017-06-15,197.7233
2017-06-16,198.683
2017-06-19,201.2354
2017-06-20,201.3442
2017-06-21,201.275
2017-06-22,202.1653
2017-06-23,203.9065
2017-06-26,205.252
2017-06-27,203.5306
2017-06-28,205.1036
2017-06-29,203.5504
2017-06-30,205.5389
2017-07-03,204.7178
2017-07-05,205.5686
2017-07-06,202.5512
2017-07-07,209.14
2017-07-10,206.2512
2017-07-11,205.3608
2017-07-12,206.4787
2017-07-13,206.9932
2017-07-14,208.8333
2017-07-17,208.7541
2017-07-18,208.5167
2017-07-19,209.6247
2017-07-20,210.2975
2017-07-21,208.9124
2017-07-24,211.9397
2017-07-25,213.2852
2017-07-26,209.7632
2017-07-27,208.1704
2017-07-28,207.8539
2017-07-31,205.0047
2017-08-01,202.2346
2017-08-02,200.8397
2017-08-03,214.5614
2017-08-04,211.9694
2017-08-07,212.3058
2017-08-08,210.7229
2017-08-09,208.3485
2017-08-10,201.8191
2017-08-11,203.484
2017-08-14,207.0019
2017-08-15,207.0118
2017-08-16,212.8485
2017-08-17,209.9847
2017-08-18,208.7559
2017-08-21,209.8558
2017-08-22,211.0747
2017-08-23,205.7533
2017-08-24,205.7929
2017-08-25,205.1389
2017-08-28,205.5055
2017-08-29,203.7515
2017-08-30,205.7037
2017-08-31,209.836
2017-09-01,208.6072
2017-09-05,209.0334
2017-09-06,223.3726
2017-09-07,225.0869
2017-09-08,230.6462
2017-09-11,231.7363
2017-09-12,233.4011
2017-09-13,231.8552
2017-09-14,232.1822
2017-09-15,233.1038
2017-09-18,237.5631
2017-09-19,237.5829
2017-09-20,234.7191
2017-09-21,234.9173
2017-09-22,239.5847
2017-09-25,240.3675
2017-09-26,238.6036
2017-09-27,239.0496
2017-09-28,238.3163
2017-09-29,239.7829
2017-10-02,242.508
2017-10-03,242.0423
2017-10-04,243.8557
2017-10-05,244.1927
2017-10-06,243.826
2017-10-09,241.418
2017-10-10,238.2469
2017-10-11,237.7217
2017-10-12,237.8604
2017-10-13,236.5523
2017-10-16,236.8694
2017-10-17,238.5838
2017-10-18,238.4649
2017-10-19,239.8027
2017-10-20,240.863
2017-10-23,240.7937
2017-10-24,239.0793
2017-10-25,240.2883
2017-10-26,239.1189
2017-10-27,240.5955
2017-10-30,234.62
2017-10-31,234.838
2017-11-01,239.5252
2017-11-02,252.4969
2017-11-03,254.0924
2017-11-06,254.2608
2017-11-07,257.9571
2017-11-08,257.2436
2017-11-09,254.8158
2017-11-10,250.6042
2017-11-13,254.6176
2017-11-14,254.5679
2017-11-15,253.4665
2017-11-16,261.4047
2017-11-17,264.1532
2017-11-20,264.5799
2017-11-21,265.5325
2017-11-22,264.4906
2017-11-24,265.6417
2017-11-27,265.8699
2017-11-28,268.1025
2017-11-29,262.3672
2017-11-30,263.4686
2017-12-01,263.5281
2017-12-04,251.0255
2017-12-05,249.805
2017-12-06,248.1677
2017-12-07,249.2493
2017-12-08,250.8072
2017-12-11,250.2316
2017-12-12,247.9296
2017-12-13,249.9637
2017-12-14,247.4235
2017-12-15,250.2217
2017-12-18,249.9637
2017-12-19,252.2658
2017-12-20,253.7939
2017-12-21,247.9891
2017-12-22,247.5128
2017-12-26,245.9748
2017-12-27,247.7212
2017-12-28,249.5668
2017-12-29,246.8976
2018-01-02,252.7619
2018-01-03,254.6572
2018-01-04,252.0475
2018-01-05,255.7388
2018-01-08,256.6814
2018-01-09,260.1147
2018-01-10,255.9273
2018-01-11,258.6461
2018-01-12,261.1467
2018-01-16,260.8986
2018-01-17,270.2061
2018-01-18,273.173
2018-01-19,274.2844
2018-01-22,272.6273
2018-01-23,271.7838
2018-01-24,272.9547
2018-01-25,276.001
2018-01-26,282.3912
2018-01-29,285.4276
2018-01-30,279.3847
2018-01-31,275.6041
2018-02-01,276.5269
2018-02-02,270.2557
2018-02-05,259.43
2018-02-06,259.9262
2018-02-07,261.0574
2018-02-08,247.2151
2018-02-09,250.7972
2018-02-12,253.2283
2018-02-13,252.9802
2018-02-14,258.9438
2018-02-15,263.5579
2018-02-16,265.8203
2018-02-20,266.9912
2018-02-21,267.914
2018-02-22,247.5128
2018-02-23,253.2978
2018-02-26,254.2801
2018-02-27,251.7597
2018-02-28,247.8998
2018-03-01,241.1233
2018-03-02,244.0446
2018-03-05,248.9133
2018-03-06,252.699
2018-03-07,256.0078
2018-03-08,259.7438
2018-03-09,267.5438
2018-03-12,264.6822
2018-03-13,265.646
2018-03-14,263.9966
2018-03-15,264.235
2018-03-16,263.0725
2018-03-19,260.4692
2018-03-20,263.5892
2018-03-21,258.3925
2018-03-22,255.1732
2018-03-23,251.2483
2018-03-26,257.4784
2018-03-27,256.0078
2018-03-28,251.4868
2018-03-29,253.3548
2018-04-02,248.4463
2018-04-03,249.738
2018-04-04,251.0297
2018-04-05,250.4534
2018-04-06,245.1077
2018-04-09,246.6777
2018-04-10,253.9907
2018-04-11,253.6728
2018-04-12,256.5742
2018-04-13,255.8786
2018-04-16,260.8468
2018-04-17,264.7617
2018-04-18,266.9874
2018-04-19,267.9214
2018-04-20,269.3025
2018-04-23,269.9683
2018-04-24,261.6914
2018-04-25,262.8042
2018-04-26,267.4047
2018-04-27,268.9945
2018-04-30,266.1726
2018-05-01,268.6567
2018-05-02,267.8717
2018-05-03,264.4536
2018-05-04,269.3621
2018-05-07,270.6539
2018-05-08,266.0037
2018-05-09,265.3876
2018-05-10,266.8383
2018-05-11,263.9866
2018-05-14,263.937
2018-05-15,257.9974
2018-05-16,257.7785
2018-05-17,258.1566
2018-05-18,263.0018
2018-05-21,265.1706
2018-05-22,260.8229
2018-05-23,264.5438
2018-05-24,265.3199
2018-05-25,264.5538
2018-05-29,260.4548
2018-05-30,265.5487
2018-05-31,265.7974
2018-06-01,267.6977
2018-06-04,270.8217
2018-06-05,275.6768
2018-06-06,277.388
2018-06-07,276.1046
2018-06-08,281.8352
2018-06-11,282.4421
2018-06-12,283.4171
2018-06-13,282.9893
2018-06-14,282.7107
2018-06-15,280.6513
2018-06-18,278.4326
2018-06-19,274.9405
2018-06-20,275.9056
2018-06-21,278.1441
2018-06-22,280.2732
2018-06-25,274.5326
2018-06-26,274.3934
2018-06-27,267.8668
2018-06-28,268.0061
2018-06-29,266.8421
2018-07-02,266.2352
2018-07-03,268.603
2018-07-05,269.7074
2018-07-06,272.8811
2018-07-09,276.8905
2018-07-10,276.8707
2018-07-11,274.7416
2018-07-12,276.6816
2018-07-13,274.274
2018-07-16,271.2594
2018-07-17,276.2041
2018-07-18,274.9206
2018-07-19,275.9852
2018-07-20,274.075
2018-07-23,277.1791
2018-07-24,273.7964
2018-07-25,277.2985
2018-07-26,277.4775
2018-07-27,273.7467
2018-07-30,269.389
2018-07-31,271.3191
2018-08-01,269.4288
2018-08-02,247.7499
2018-08-03,244.6061
2018-08-06,240.3678
2018-08-07,235.9504
2018-08-08,231.4336
2018-08-09,230.8764
2018-08-10,226.9665
2018-08-13,230.5083
2018-08-14,230.1894
2018-08-15,234.1449
2018-08-16,236.1078
2018-08-17,237.2835
2018-08-20,240.0733
2018-08-21,242.6937
2018-08-22,246.6891
2018-08-23,245.4636
2018-08-24,246.729
2018-08-27,247.2471
2018-08-28,246.5197
2018-08-29,247.5958
2018-08-30,247.9047
2018-08-31,246.5297
2018-09-04,246.1013
2018-09-05,241.6376
2018-09-06,247.0976
2018-09-07,247.2471
2018-09-10,251.8602
2018-09-11,254.1319
2018-09-12,261.5947
2018-09-13,266.3473
2018-09-14,269.446
2018-09-17,266.168
2018-09-18,267.9614
2018-09-19,269.6054
2018-09-20,269.0475
2018-09-21,268.7685
2018-09-24,267.9913
2018-09-25,269.5755
2018-09-26,268.0212
2018-09-27,264.2948
2018-09-28,265.1218
2018-10-01,264.534
2018-10-02,263.7369
2018-10-03,259.7514
2018-10-04,253.1356
2018-10-05,252.6872
2018-10-08,249.6384
2018-10-09,248.8712
2018-10-10,247.0976
2018-10-11,243.6602
2018-10-12,247.3467
2018-10-15,248.2235
2018-10-16,248.7815
2018-10-17,247.9645
2018-10-18,244.3277
2018-10-19,242.5044
2018-10-22,239.605
2018-10-23,238.9075
2018-10-24,233.6368
2018-10-25,239.047
2018-10-26,234.7029
2018-10-29,236.3867
2018-10-30,241.7073
2018-10-31,239.864
2018-11-01,262.5313
2018-11-02,255.198
2018-11-05,257.2207
2018-11-06,256.4634
2018-11-07,262.3519
2018-11-08,263.5476
2018-11-09,264.9126
2018-11-12,258.3067
2018-11-13,257.4598
2018-11-14,255.3248
2018-11-15,260.0538
2018-11-16,261.5603
2018-11-19,252.4814
2018-11-20,252.9104
2018-11-21,253.8981
2018-11-23,252.0724
2018-11-26,257.4299
2018-11-27,257.839
2018-11-28,266.6584
2018-11-29,270.8786
2018-11-30,274.7795
2018-12-03,274.989
2018-12-04,265.561
2018-12-06,267.4266
2018-12-07,256.0431
2018-12-10,256.5719
2018-12-11,254.7561
2018-12-12,257.9188
2018-12-13,255.8336
2018-12-14,246.8546
2018-12-17,245.1785
2018-12-18,245.3581
2018-12-19,244.5699
2018-12-20,238.1149
2018-12-21,237.6161
2018-12-24,229.0062
2018-12-26,238.5539
2018-12-27,248.371
2018-12-28,253.9081
2018-12-31,257.8789
2019-01-02,251.7931
2019-01-03,245.6274
2019-01-04,250.5559
2019-01-07,249.5982
2019-01-08,252.252
2019-01-09,259.0162
2019-01-10,262.0092
2019-01-11,255.3947
2019-01-14,249.3587
2019-01-15,255.5144
2019-01-16,248.0618
2019-01-17,254.1077
2019-01-18,257.3202
2019-01-22,256.9311
2019-01-23,259.974
2019-01-24,265.3814
2019-01-25,268.2048
2019-01-28,267.2371
2019-01-29,267.247
2019-01-30,272.0059
2019-01-31,272.8639
2019-02-01,271.0681
2019-02-04,271.557
2019-02-05,272.7741
2019-02-06,271.9161
2019-02-07,270.26
2019-02-08,273.5024
2019-02-11,274.9491
2019-02-12,277.2537
2019-02-13,280.9251
2019-02-14,280.8653
2019-02-15,285.2251
2019-02-19,281.3442
2019-02-20,285.8137
2019-02-21,274.5899
2019-02-22,284.7562
2019-02-25,289.4752
2019-02-26,287.7093
2019-02-27,289.7346
2019-02-28,289.5049
2019-03-01,294.1695
2019-03-04,292.2717
2019-03-05,293.2406
2019-03-06,286.8081
2019-03-07,287.2176
2019-03-08,286.5584
2019-03-11,291.5426
2019-03-12,296.0973
2019-03-13,297.0962
2019-03-14,298.5145
2019-03-15,302.5498
2019-03-18,300.7419
2019-03-19,301.0716
2019-03-20,301.4511
2019-03-21,304.6075
2019-03-22,301.3412
2019-03-25,299.2437
2019-03-26,303.6885
2019-03-27,299.4335
2019-03-28,299.7631
2019-03-29,301.8107
2019-04-01,301.9106
2019-04-02,302.38
2019-04-03,301.9805
2019-04-04,301.8507
2019-04-05,301.9306
2019-04-08,302.9993
2019-04-09,303.0093
2019-04-10,304.4976
2019-04-11,304.8871
2019-04-12,304.7773
2019-04-15,302.39
2019-04-16,293.6901
2019-04-17,277.4289
2019-04-18,276.7297
2019-04-22,274.2226
2019-04-23,279.8261
2019-04-24,278.5576
2019-04-25,280.9848
2019-04-26,281.714
2019-04-29,280.2557
2019-04-30,285.8492
2019-05-01,280.2856
2019-05-02,297.6855
2019-05-03,300.0128
2019-05-06,298.6544
2019-05-07,293.9898
2019-05-08,295.9974
2019-05-09,300.9917
2019-05-10,302.4799
2019-05-13,293.7301
2019-05-14,297.51
2019-05-15,295.6
2019-05-16,301.51
2019-05-17,296
2019-05-20,291.73
2019-05-21,295.38
2019-05-22,297.75
2019-05-23,291.93
2019-05-24,295.61
2019-05-28,289.63
2019-05-29,288.69
2019-05-30,290.9
2019-05-31,288.3
2019-06-03,289.67
2019-06-04,292.84
2019-06-05,298.16
2019-06-06,301.76
2019-06-07,305.28
2019-06-10,310.95
2019-06-11,309.57
2019-06-12,315.79
2019-06-13,321.18
2019-06-14,321.38
2019-06-17,325.29
2019-06-18,330.77
2019-06-19,334.01
2019-06-20,334.175
2019-06-21,334.78
2019-06-24,332.085
2019-06-25,336.18
2019-06-26,327.94
2019-06-27,328.105
2019-06-28,328.87
2019-07-01,334.875
2019-07-02,330.55
2019-07-03,333.37
2019-07-04,333.37
2019-07-05,333.655
2019-07-08,332.69
2019-07-09,334.49
2019-07-10,332.715
2019-07-11,333.8
2019-07-12,334.465
2019-07-15,334.77
2019-07-16,331.47
2019-07-17,334.06
2019-07-18,340.62
2019-07-19,335.415
2019-07-22,339.31
2019-07-23,341.32
2019-07-24,346.2
2019-07-25,346.2
2019-07-26,347.435
2019-07-29,350.685
2019-07-30,346.7
2019-07-31,339.51
2019-08-01,359.82
2019-08-02,360.64
2019-08-05,350.47
2019-08-06,363.13
2019-08-07,357.06
2019-08-08,366.035
2019-08-09,372.24
2019-08-12,364.885
2019-08-13,370.92
2019-08-14,365.85
2019-08-15,369.165
2019-08-16,370.225
2019-08-19,369.92
2019-08-20,367.76
2019-08-21,367.645
2019-08-22,366.44
2019-08-23,355.74
2019-08-26,359.34
2019-08-27,360.77
2019-08-28,359.365
2019-08-29,363.26
2019-08-30,364.205
2019-09-02,363.63
2019-09-03,360.555
2019-09-04,355.8
2019-09-05,356.05
2019-09-06,355.79
2019-09-09,340.5
2019-09-10,338.17
2019-09-11,338.44
2019-09-12,337.43
2019-09-13,331
2019-09-16,328.63
2019-09-17,338.76
2019-09-18,340.72
2019-09-19,341.56
2019-09-20,343.94
2019-09-23,348.415
2019-09-24,343.05
2019-09-25,342.98
2019-09-26,339.855
2019-09-27,335.255
2019-09-30,339.445
2019-10-01,331.75
2019-10-02,324.83
2019-10-03,332.32
2019-10-04,330.65
2019-10-07,328.775
2019-10-08,317.36
2019-10-09,318.14
2019-10-10,316.66
2019-10-11,322.915
2019-10-14,325.11
2019-10-15,328.12
2019-10-16,323.26
2019-10-17,327.96
2019-10-18,328.21
2019-10-21,330.23
2019-10-22,322.16
2019-10-23,321.465
2019-10-24,321.055
2019-10-25,322.21
2019-10-28,327.09
2019-10-29,328.2
2019-10-30,330.47
2019-10-31,347.37
2019-11-01,346.08
2019-11-04,348.86
2019-11-05,335.1
2019-11-06,335.66
2019-11-07,334.85
2019-11-08,331.745
2019-11-11,327.63
2019-11-12,331.58
2019-11-13,336.39
2019-11-14,342.52
2019-11-15,346.65
2019-11-18,344.58
2019-11-19,353.69
2019-11-20,353.21
2019-11-21,350.625
2019-11-22,346.955
2019-11-25,347.79
