date,close
2014-06-13,29.784
2014-06-16,29.801
2014-06-17,29.8606
2014-06-18,29.6053
2014-06-19,29.4776
2014-06-20,29.4266
2014-06-23,29.0777
2014-06-24,28.8734
2014-06-25,28.9075
2014-06-26,28.8564
2014-06-27,28.8564
2014-06-30,28.7713
2014-07-01,29.0777
2014-07-02,29.1287
2014-07-03,29.3244
2014-07-07,29.2479
2014-07-08,29.0521
2014-07-09,29.0351
2014-07-10,28.8734
2014-07-11,28.9075
2014-07-14,28.8649
2014-07-15,28.533
2014-07-16,28.6777
2014-07-17,28.4054
2014-07-18,29.0096
2014-07-21,28.9755
2014-07-22,29.0266
2014-07-23,28.065
2014-07-24,28.031
2014-07-25,25.0015
2014-07-28,25.7419
2014-07-29,25.3334
2014-07-30,25.2908
2014-07-31,24.9419
2014-08-01,25.4015
2014-08-04,25.2143
2014-08-05,25.393
2014-08-06,25.7078
2014-08-07,25.5376
2014-08-08,25.9886
2014-08-11,26.0397
2014-08-12,26.0482
2014-08-13,25.9801
2014-08-14,26.0312
2014-08-15,26.1588
2014-08-18,26.2099
2014-08-19,26.4074
2014-08-20,26.5878
2014-08-21,26.6393
2014-08-22,26.665
2014-08-25,26.4847
2014-08-26,26.5448
2014-08-27,26.4933
2014-08-28,26.7423
2014-08-29,26.5276
2014-09-02,26.416
2014-09-03,26.4675
2014-09-04,26.9399
2014-09-05,26.8797
2014-09-08,26.6908
2014-09-09,26.7423
2014-09-10,26.4847
2014-09-11,26.2786
2014-09-12,26.0982
2014-09-15,26.1154
2014-09-16,26.4933
2014-09-17,26.5448
2014-09-18,26.9828
2014-09-19,26.5878
2014-09-22,26.2528
2014-09-23,26.2185
2014-09-24,26.3902
2014-09-25,26.0725
2014-09-26,26.3387
2014-09-29,26.2013
2014-09-30,25.9694
2014-10-01,25.4542
2014-10-02,25.4628
2014-10-03,25.4885
2014-10-06,25.0935
2014-10-07,24.3979
2014-10-08,24.8788
2014-10-09,23.9341
2014-10-10,22.4313
2014-10-13,22.2767
2014-10-14,22.311
2014-10-15,22.1393
2014-10-16,22.3196
2014-10-17,22.5515
2014-10-20,22.895
2014-10-21,23.7023
2014-10-22,23.4189
2014-10-23,23.7538
2014-10-24,24.6813
2014-10-27,24.4923
2014-10-28,24.8444
2014-10-29,24.7929
2014-10-30,24.3893
2014-10-31,25.1965
2014-11-03,25.3683
2014-11-04,25.1879
2014-11-05,25.5486
2014-11-06,25.4799
2014-11-07,25.4155
2014-11-10,25.5143
2014-11-11,25.3254
2014-11-12,25.291
2014-11-13,25.1622
2014-11-14,25.3941
2014-11-17,25.2223
2014-11-18,25.4217
2014-11-19,24.9535
2014-11-20,24.9969
2014-11-21,25.0836
2014-11-24,25.1833
2014-11-25,25.1183
2014-11-26,25.7339
2014-11-28,25.6385
2014-12-01,25.2657
2014-12-02,25.8119
2014-12-03,26.809
2014-12-04,26.9651
2014-12-05,27.1905
2014-12-08,26.9737
2014-12-09,26.913
2014-12-10,26.5706
2014-12-11,26.6963
2014-12-12,26.5532
2014-12-15,26.5662
2014-12-16,26.4275
2014-12-17,26.6963
2014-12-18,27.0518
2014-12-19,26.9824
2014-12-22,27.5026
2014-12-23,27.4506
2014-12-24,27.7194
2014-12-26,27.4376
2014-12-29,27.2772
2014-12-30,27.0995
2014-12-31,27.6327
2015-01-02,27.4333
2015-01-05,27.0128
2015-01-06,26.8957
2015-01-07,27.52
2015-01-08,28.1616
2015-01-09,28.6038
2015-01-12,28.4044
2015-01-13,28.0489
2015-01-14,27.9622
2015-01-15,27.4766
2015-01-16,27.7584
2015-01-20,28.0142
2015-01-21,28.4997
2015-01-22,28.6211
2015-01-23,29.2714
2015-01-26,29.4101
2015-01-27,29.2714
2015-01-28,29.2454
2015-01-29,29.3494
2015-01-30,28.6905
2015-02-02,28.7252
2015-02-03,29.4968
2015-02-04,29.3841
2015-02-05,29.6096
2015-02-06,29.4578
2015-02-09,29.2454
2015-02-10,29.809
2015-02-11,29.8783
2015-02-12,29.9694
2015-02-13,30.2772
2015-02-17,30.3296
2015-02-18,30.2597
2015-02-19,30.1723
2015-02-20,30.2422
2015-02-23,30.1242
2015-02-24,30.3864
2015-02-25,30.1373
2015-02-26,30.1548
2015-02-27,30.063
2015-03-02,31.09
2015-03-03,30.6705
2015-03-04,30.9327
2015-03-05,31.125
2015-03-06,31.1774
2015-03-09,31.2386
2015-03-10,30.7754
2015-03-11,30.6443
2015-03-12,30.7317
2015-03-13,30.8103
2015-03-16,31.6057
2015-03-17,31.6625
2015-03-18,31.5096
2015-03-19,31.278
2015-03-20,31.6319
2015-03-23,31.5096
2015-03-24,30.9939
2015-03-25,29.6304
2015-03-26,29.6304
2015-03-27,30.2772
2015-03-30,30.57
2015-03-31,30.4258
2015-04-01,30.5525
2015-04-02,30.4345
2015-04-06,30.5612
2015-04-07,30.4345
2015-04-08,30.5918
2015-04-09,30.7929
2015-04-10,30.736
2015-04-13,30.6617
2015-04-14,30.3296
2015-04-15,30.6574
2015-04-16,30.5918
2015-04-17,30.2247
2015-04-20,30.7579
2015-04-21,30.7579
2015-04-22,30.5918
2015-04-23,30.3646
2015-04-24,28.6514
2015-04-27,28.9355
2015-04-28,28.9617
2015-04-29,28.7214
2015-04-30,28.6951
2015-05-01,28.9268
2015-05-04,28.9224
2015-05-05,28.2144
2015-05-06,28.1969
2015-05-07,28.2144
2015-05-08,28.4417
2015-05-11,28.7782
2015-05-12,28.3018
2015-05-13,28.4242
2015-05-14,29.8095
2015-05-15,29.8838
2015-05-18,30.0324
2015-05-19,30.0589
2015-05-20,30.1822
2015-05-21,30.1911
2015-05-22,30.31
2015-05-26,29.9311
2015-05-27,30.3497
2015-05-28,30.5964
2015-05-29,30.9049
2015-06-01,30.5524
2015-06-02,29.9619
2015-06-03,30.1338
2015-06-04,29.9796
2015-06-05,30.0412
2015-06-08,29.8121
2015-06-09,29.6359
2015-06-10,30.0853
2015-06-11,30.2571
2015-06-12,29.9179
2015-06-15,30.1206
2015-06-16,30.0324
2015-06-17,30.1602
2015-06-18,30.3321
2015-06-19,31.3367
2015-06-22,31.416
2015-06-23,31.2573
2015-06-24,31.1428
2015-06-25,31.1384
2015-06-26,30.6229
2015-06-29,30.2924
2015-06-30,30.4686
2015-07-01,30.4026
2015-07-02,30.4554
2015-07-06,30.1073
2015-07-07,29.7152
2015-07-08,28.9529
2015-07-09,28.2259
2015-07-10,28.4374
2015-07-13,28.314
2015-07-14,28.5608
2015-07-15,28.4198
2015-07-16,28.1202
2015-07-17,27.7941
2015-07-20,27.4328
2015-07-21,27.5562
2015-07-22,26.6397
2015-07-23,27.0803
2015-07-24,29.583
2015-07-27,29.8297
2015-07-28,30.3673
2015-07-29,30.3849
2015-07-30,30.3232
2015-07-31,29.9972
2015-08-03,29.6359
2015-08-04,29.5742
2015-08-05,30.2263
2015-08-06,29.8474
2015-08-07,30.1382
2015-08-10,30.5259
2015-08-11,29.7416
2015-08-12,30.3321
2015-08-13,29.8297
2015-08-14,29.6711
2015-08-17,29.8121
2015-08-18,29.4565
2015-08-19,29.2609
2015-08-20,28.4518
2015-08-21,27.9983
2015-08-24,27.3315
2015-08-25,27.3048
2015-08-26,28.8341
2015-08-27,29.6877
2015-08-28,30.3189
2015-08-31,29.9366
2015-09-01,28.6563
2015-09-02,29.2964
2015-09-03,29.5987
2015-09-04,29.332
2015-09-08,30.2033
2015-09-09,29.9544
2015-09-10,30.0522
2015-09-11,30.2478
2015-09-14,30.5412
2015-09-15,30.4434
2015-09-16,30.4256
2015-09-17,30.2923
2015-09-18,29.8032
2015-09-21,29.4476
2015-09-22,29.4476
2015-09-23,29.0208
2015-09-24,28.8252
2015-09-25,28.9052
2015-09-28,28.4518
2015-09-29,28.5674
2015-09-30,29.6965
2015-10-01,29.0475
2015-10-02,29.5987
2015-10-05,30.3011
2015-10-06,30.4701
2015-10-07,30.9502
2015-10-08,31.3948
2015-10-09,30.888
2015-10-12,30.9947
2015-10-13,30.8613
2015-10-14,34.0799
2015-10-15,34.6045
2015-10-16,35.3336
2015-10-19,35.2357
2015-10-20,35.1557
2015-10-21,35.0668
2015-10-22,34.7823
2015-10-23,33.742
2015-10-26,33.9199
2015-10-27,34.1866
2015-10-28,37.3518
2015-10-29,36.2671
2015-10-30,36.4361
2015-11-02,36.7384
2015-11-03,36.6494
2015-11-04,36.5161
2015-11-05,36.196
2015-11-06,36.0626
2015-11-09,35.5825
2015-11-10,35.1202
2015-11-11,35.2357
2015-11-12,34.969
2015-11-13,34.5245
2015-11-16,34.809
2015-11-17,34.6656
2015-11-18,35.3107
2015-11-19,35.5258
2015-11-20,35.8304
2015-11-23,34.4595
2015-11-24,34.6925
2015-11-25,34.7911
2015-11-27,35.0867
2015-11-30,34.7373
2015-12-01,34.6656
2015-12-02,34.6656
2015-12-03,33.0976
2015-12-04,34.1818
2015-12-07,33.7428
2015-12-08,32.793
2015-12-09,33.25
2015-12-10,33.9309
2015-12-11,33.8592
2015-12-14,34.1011
2015-12-15,34.3072
2015-12-16,34.3431
2015-12-17,33.68
2015-12-18,33.3664
2015-12-21,33.7428
2015-12-22,33.4247
2015-12-23,33.68
2015-12-24,33.9309
2015-12-28,33.904
2015-12-29,34.7552
2015-12-30,34.4147
2015-12-31,34.0474
2016-01-04,32.8557
2016-01-05,32.4615
2016-01-06,31.5207
2016-01-07,30.6964
2016-01-08,28.9672
2016-01-11,29.6212
2016-01-12,29.7019
2016-01-13,28.77
2016-01-14,28.9492
2016-01-15,28.6625
2016-01-19,27.8382
2016-01-20,27.9189
2016-01-21,27.8024
2016-01-22,28.8417
2016-01-25,28.34
2016-01-26,29.003
2016-01-27,28.7163
2016-01-28,28.8731
2016-01-29,29.9259
2016-02-01,30.0155
2016-02-02,29.0209
2016-02-03,28.994
2016-02-04,28.7521
2016-02-05,28.0174
2016-02-08,27.5425
2016-02-09,27.883
2016-02-10,27.9099
2016-02-11,28.6715
2016-02-12,29.0747
2016-02-16,30.2232
2016-02-17,30.4402
2016-02-18,29.8434
2016-02-19,29.8343
2016-02-22,30.2503
2016-02-23,29.6444
2016-02-24,30.2775
2016-02-25,30.7748
2016-02-26,30.6573
2016-02-29,30.6211
2016-03-01,30.9467
2016-03-02,31.4893
2016-03-03,30.8834
2016-03-04,31.1728
2016-03-07,30.802
2016-03-08,30.0242
2016-03-09,30.5126
2016-03-10,30.5397
2016-03-11,31.3265
2016-03-14,31.1095
2016-03-15,31.1547
2016-03-16,31.6521
2016-03-17,31.8872
2016-03-18,31.9053
2016-03-21,31.9415
2016-03-22,32.0771
2016-03-23,31.9595
2016-03-24,32.2128
2016-03-28,32.1495
2016-03-29,32.7101
2016-03-30,33.0448
2016-03-31,33.2618
2016-04-01,33.1081
2016-04-04,33.1261
2016-04-05,32.8006
2016-04-06,33.2799
2016-04-07,32.891
2016-04-08,33.1442
2016-04-11,33.0267
2016-04-12,32.8729
2016-04-13,33.7501
2016-04-14,33.2889
2016-04-15,33.0628
2016-04-18,33.2075
2016-04-19,32.4479
2016-04-20,32.8548
2016-04-21,33.0267
2016-04-22,33.7411
2016-04-25,33.9762
2016-04-26,33.8677
2016-04-27,34.0576
2016-04-28,33.3613
2016-04-29,32.3032
2016-05-02,32.9272
2016-05-03,32.6197
2016-05-04,32.1856
2016-05-05,32.2761
2016-05-06,32.4298
2016-05-09,32.4298
2016-05-10,33.0176
2016-05-11,32.9181
2016-05-12,32.4841
2016-05-13,32.5383
2016-05-16,32.882
2016-05-17,32.3257
2016-05-18,32.7087
2016-05-19,32.5446
2016-05-20,33.2376
2016-05-23,33.3744
2016-05-24,34.1768
2016-05-25,34.2315
2016-05-26,34.1768
2016-05-27,34.3683
2016-05-31,34.6145
2016-06-01,34.9063
2016-06-02,34.8151
2016-06-03,34.5507
2016-06-06,34.3592
2016-06-07,34.268
2016-06-08,34.5325
2016-06-09,34.5233
2016-06-10,34.3136
2016-06-13,34.0948
2016-06-14,34.0583
2016-06-15,33.7938
2016-06-16,33.8121
2016-06-17,33.2194
2016-06-20,33.7483
2016-06-21,34.1404
2016-06-22,33.8759
2016-06-23,34.5507
2016-06-24,32.0066
2016-06-27,30.8576
2016-06-28,31.3956
2016-06-29,31.9519
2016-06-30,32.5446
2016-07-01,32.3713
2016-07-05,32.2072
2016-07-06,32.4534
2016-07-07,33.0279
2016-07-08,33.6297
2016-07-11,33.8668
2016-07-12,34.4048
2016-07-13,34.4048
2016-07-14,34.6054
2016-07-15,34.4504
2016-07-18,34.7604
2016-07-19,34.4777
2016-07-20,34.8698
2016-07-21,34.3866
2016-07-22,34.9702
2016-07-25,35.3987
2016-07-26,37.3045
2016-07-27,37.6055
2016-07-28,37.0857
2016-07-29,37.186
2016-08-01,37.4687
2016-08-02,36.6298
2016-08-03,36.9398
2016-08-04,37.2316
2016-08-05,37.1404
2016-08-08,36.9763
2016-08-09,37.2863
2016-08-10,37.3137
2016-08-11,37.1586
2016-08-12,37.3045
2016-08-15,37.3775
2016-08-16,37.0558
2016-08-17,37.2488
2016-08-18,37.4143
2016-08-19,37.6809
2016-08-22,37.6349
2016-08-23,37.6625
2016-08-24,37.5705
2016-08-25,37.6073
2016-08-26,37.7636
2016-08-29,37.5338
2016-08-30,37.5889
2016-08-31,37.4327
2016-09-01,37.8739
2016-09-02,37.8004
2016-09-06,37.2764
2016-09-07,36.4307
2016-09-08,36.449
2016-09-09,35.1713
2016-09-12,35.5849
2016-09-13,35.0885
2016-09-14,35.3919
2016-09-15,35.8423
2016-09-16,35.6769
2016-09-19,35.5573
2016-09-20,35.539
2016-09-21,35.686
2016-09-22,36.0813
2016-09-23,35.8515
2016-09-26,35.5298
2016-09-27,36.0629
2016-09-28,36.1181
2016-09-29,36.302
2016-09-30,36.7064
2016-10-03,36.5502
2016-10-04,36.4307
2016-10-05,36.541
2016-10-06,36.8351
2016-10-07,36.9546
2016-10-10,35.5482
2016-10-11,34.9874
2016-10-12,34.8127
2016-10-13,34.5461
2016-10-14,35.1161
2016-10-17,35.1161
2016-10-18,35.7596
2016-10-19,35.9526
2016-10-20,35.9434
2016-10-21,36.6145
2016-10-24,37.1109
2016-10-25,36.7984
2016-10-26,36.6789
2016-10-27,36.4215
2016-10-28,36.2468
2016-10-31,36.4307
2016-11-01,36.2376
2016-11-02,36.0354
2016-11-03,36.017
2016-11-04,35.8055
2016-11-07,36.5777
2016-11-08,36.495
2016-11-09,36.3203
2016-11-10,35.6309
2016-11-11,35.7964
2016-11-14,35.7504
2016-11-15,36.2284
2016-11-16,36.5777
2016-11-17,36.5318
2016-11-18,36.8535
2016-11-21,37.0649
2016-11-22,36.8351
2016-11-23,36.734
2016-11-25,36.9546
2016-11-28,36.7064
2016-11-29,36.8455
2016-11-30,36.4005
2016-12-01,35.0101
2016-12-02,35.1028
2016-12-05,35.4458
2016-12-06,35.7517
2016-12-07,36.4932
2016-12-08,36.5581
2016-12-09,36.2893
2016-12-12,35.9
2016-12-13,36.0946
2016-12-14,35.8166
2016-12-15,36.3634
2016-12-16,35.9927
2016-12-19,36.2059
2016-12-20,36.382
2016-12-21,36.3171
2016-12-22,36.2986
2016-12-23,36.3913
2016-12-27,36.521
2016-12-28,36.1132
2016-12-29,36.1688
2016-12-30,35.7517
2017-01-03,35.798
2017-01-04,36.1781
2017-01-05,35.6312
2017-01-06,36.8362
2017-01-09,37.6797
2017-01-10,37.9022
2017-01-11,37.726
2017-01-12,37.5128
2017-01-13,38.4398
2017-01-17,37.7538
2017-01-18,38.208
2017-01-19,37.6148
2017-01-20,38.3656
2017-01-23,38.3656
2017-01-24,38.9589
2017-01-25,39.1442
2017-01-26,38.9032
2017-01-27,41.443
2017-01-30,41.7211
2017-01-31,41.2298
2017-02-01,41.4894
2017-02-02,41.2854
2017-02-03,41.4059
2017-02-06,41.5635
2017-02-07,42.1475
2017-02-08,41.8416
2017-02-09,41.6006
2017-02-10,41.7767
2017-02-13,41.7396
2017-02-14,41.3689
2017-02-15,41.7118
2017-02-16,41.7396
2017-02-17,41.8138
2017-02-21,42.0548
2017-02-22,42.0363
2017-02-23,41.5821
2017-02-24,41.7674
2017-02-27,41.6748
2017-02-28,41.3666
2017-03-01,41.6841
2017-03-02,41.2546
2017-03-03,41.3853
2017-03-06,41.6841
2017-03-07,41.7681
2017-03-08,41.8709
2017-03-09,41.8615
2017-03-10,42.0389
2017-03-13,42.7486
2017-03-14,42.5525
2017-03-15,42.954
2017-03-16,42.3564
2017-03-17,42.5992
2017-03-20,42.7673
2017-03-21,42.0203
2017-03-22,42.5619
2017-03-23,42.151
2017-03-24,42.235
2017-03-27,42.1043
2017-03-28,41.9456
2017-03-29,41.8055
2017-03-30,41.9456
2017-03-31,41.9829
2017-04-03,41.5534
2017-04-04,41.5814
2017-04-05,41.432
2017-04-06,41.544
2017-04-07,42.0389
2017-04-10,41.7121
2017-04-11,41.376
2017-04-12,40.797
2017-04-13,40.8717
2017-04-17,41.1892
2017-04-18,41.4787
2017-04-19,41.6374
2017-04-20,42.4405
2017-04-21,41.9456
2017-04-24,41.7868
2017-04-25,42.1323
2017-04-26,41.7588
2017-04-27,42.095
2017-04-28,41.2265
2017-05-01,41.7495
2017-05-02,42.095
2017-05-03,41.9175
2017-05-04,42.3751
2017-05-05,42.4965
2017-05-08,42.6646
2017-05-09,42.8607
2017-05-10,43.0661
2017-05-11,42.6926
2017-05-12,42.9821
2017-05-15,43.7197
2017-05-16,43.8318
2017-05-17,42.4965
2017-05-18,43.3742
2017-05-19,43.7478
2017-05-22,43.5984
2017-05-23,43.7384
2017-05-24,44.0559
2017-05-25,44.5788
2017-05-26,44.5415
2017-05-30,44.8518
2017-05-31,44.9458
2017-06-01,45.2467
2017-06-02,45.5288
2017-06-05,45.6134
2017-06-06,45.651
2017-06-07,46.0929
2017-06-08,46.4597
2017-06-09,44.2688
2017-06-12,43.9303
2017-06-13,44.3252
2017-06-14,44.2124
2017-06-15,44.0619
2017-06-16,43.4883
2017-06-19,43.714
2017-06-20,42.9148
2017-06-21,43.2627
2017-06-22,43.0182
2017-06-23,43.178
2017-06-26,43.0464
2017-06-27,42.0591
2017-06-28,42.36
2017-06-29,41.7864
2017-06-30,42.219
2017-07-03,41.5513
2017-07-05,42.2848
2017-07-06,42.2566
2017-07-07,43.0088
2017-07-10,43.2815
2017-07-11,43.4037
2017-07-12,43.9115
2017-07-13,43.8833
2017-07-14,44.2876
2017-07-17,44.1371
2017-07-18,44.1371
2017-07-19,44.297
2017-07-20,44.9834
2017-07-21,42.407
2017-07-24,41.8616
2017-07-25,41.9557
2017-07-26,42.4916
2017-07-27,42.8584
2017-07-28,42.7549
2017-07-31,42.7267
2017-08-01,42.943
2017-08-02,42.8301
2017-08-03,42.2848
2017-08-04,42.0403
2017-08-07,43.0276
2017-08-08,42.5763
2017-08-09,41.9557
2017-08-10,41.2787
2017-08-11,41.7394
2017-08-14,42.7267
2017-08-15,42.6233
2017-08-16,42.9618
2017-08-17,41.3633
2017-08-18,41.2505
2017-08-21,41.1
2017-08-22,41.7394
2017-08-23,42.1531
2017-08-24,42.943
2017-08-25,42.3506
2017-08-28,42.4446
2017-08-29,42.4162
2017-08-30,43.1839
2017-08-31,44.2266
2017-09-01,44.5394
2017-09-05,44.018
2017-09-06,44.1318
2017-09-07,43.9422
2017-09-08,43.4778
2017-09-11,44.0939
2017-09-12,44.2076
2017-09-13,44.3972
2017-09-14,44.3593
2017-09-15,44.5488
2017-09-18,44.8332
2017-09-19,44.7005
2017-09-20,44.018
2017-09-21,44.0086
2017-09-22,44.4825
2017-09-25,44.2645
2017-09-26,44.3214
2017-09-27,44.8995
2017-09-28,45.1744
2017-09-29,45.2218
2017-10-02,45.4209
2017-10-03,45.5915
2017-10-04,45.8948
2017-10-05,45.9422
2017-10-06,46.037
2017-10-09,46.2644
2017-10-10,46.4256
2017-10-11,46.5962
2017-10-12,46.5772
2017-10-13,46.7763
2017-10-16,46.9185
2017-10-17,47.2597
2017-10-18,47.2502
2017-10-19,47.4777
2017-10-20,49.3734
2017-10-23,49.2881
2017-10-24,49.6103
2017-10-25,48.7668
2017-10-26,49.2976
2017-10-27,49.3544
2017-10-30,49.6293
2017-10-31,49.7999
2017-11-01,49.6009
2017-11-02,49.6103
2017-11-03,50.6625
2017-11-06,51.9326
2017-11-07,51.8567
2017-11-08,52.4444
2017-11-09,51.0037
2017-11-10,50.7478
2017-11-13,50.6719
2017-11-14,50.8615
2017-11-15,50.4445
2017-11-16,50.7478
2017-11-17,50.7193
2017-11-20,51.07
2017-11-21,51.3828
2017-11-22,50.7288
2017-11-24,51.0416
2017-11-27,50.5108
2017-11-28,51.0511
2017-11-29,49.7247
2017-11-30,49.9346
2017-12-01,49.5339
2017-12-04,49.0567
2017-12-05,49.2762
2017-12-06,49.1426
2017-12-07,49.7724
2017-12-08,49.5148
2017-12-11,49.801
2017-12-12,49.0949
2017-12-13,48.8468
2017-12-14,48.9327
2017-12-15,50.0587
2017-12-18,51.0606
2017-12-19,50.7362
2017-12-20,50.9461
2017-12-21,50.6026
2017-12-22,50.7171
2017-12-26,50.2877
2017-12-27,50.0396
2017-12-28,50.4117
2017-12-29,49.8869
2018-01-02,50.5453
2018-01-03,51.2228
2018-01-04,51.9003
2018-01-05,50.8221
2018-01-08,51.5568
2018-01-09,51.3564
2018-01-10,51.1465
2018-01-11,52.0912
2018-01-12,52.5301
2018-01-16,51.8431
2018-01-17,53.179
2018-01-18,53.2553
2018-01-19,53.9901
2018-01-22,54.763
2018-01-23,55.3451
2018-01-24,53.7706
2018-01-25,52.5969
2018-01-26,56.3089
2018-01-29,63.2365
2018-01-30,58.8853
2018-01-31,58.2078
2018-02-01,58.3414
2018-02-02,57.7688
2018-02-05,55.8413
2018-02-06,56.7669
2018-02-07,54.2096
2018-02-08,53.0549
2018-02-09,55.2974
2018-02-12,56.0608
2018-02-13,55.6695
2018-02-14,56.4329
2018-02-15,58.4082
2018-02-16,58.4559
2018-02-20,59.2765
2018-02-21,58.9234
2018-02-22,58.2459
2018-02-23,59.162
2018-02-26,59.6582
2018-02-27,59.3051
2018-02-28,58.5462
2018-03-01,58.5077
2018-03-02,58.8248
2018-03-05,59.3051
2018-03-06,60.3139
2018-03-07,60.3331
2018-03-08,59.7375
2018-03-09,60.9672
2018-03-12,60.996
2018-03-13,59.7471
2018-03-14,59.5741
2018-03-15,59.92
2018-03-16,60.1602
2018-03-19,58.9305
2018-03-20,59.2859
2018-03-21,59.0073
2018-03-22,57.6815
2018-03-23,56.5094
2018-03-26,58.6038
2018-03-27,57.0763
2018-03-28,56.6343
2018-03-29,57.8544
2018-04-02,55.1548
2018-04-03,56.5863
2018-04-04,56.8745
2018-04-05,55.5872
2018-04-06,54.5784
2018-04-09,54.6264
2018-04-10,55.7024
2018-04-11,55.4623
2018-04-12,56.2981
2018-04-13,55.4623
2018-04-16,55.8177
2018-04-17,56.6728
2018-04-18,56.2693
2018-04-19,53.9443
2018-04-20,52.2631
2018-04-23,51.6866
2018-04-24,51.6674
2018-04-25,52.2631
2018-04-26,53.0893
2018-04-27,52.3495
2018-04-30,52.3591
2018-05-01,53.1181
2018-05-02,52.6666
2018-05-03,53.1469
2018-05-04,53.8002
2018-05-07,54.1941
2018-05-08,54.2325
2018-05-09,55.078
2018-05-10,55.6928
2018-05-11,55.3374
2018-05-14,56.1155
2018-05-15,55.4623
2018-05-16,56.1924
2018-05-17,55.7313
2018-05-18,55.6544
2018-05-21,55.981
2018-05-22,56.1828
2018-05-23,56.6151
2018-05-24,56.5191
2018-05-25,56.8553
2018-05-29,56.5575
2018-05-30,56.7994
2018-05-31,56.751
2018-06-01,58.1444
2018-06-04,58.8604
2018-06-05,59.3732
2018-06-06,59.4023
2018-06-07,59.1604
2018-06-08,58.783
2018-06-11,58.7927
2018-06-12,58.8894
2018-06-13,58.5895
2018-06-14,59.441
2018-06-15,59.5668
2018-06-18,59.141
2018-06-19,58.3959
2018-06-20,58.6959
2018-06-21,57.9992
2018-06-22,58.4346
2018-06-25,56.6542
2018-06-26,57.5057
2018-06-27,56.1124
2018-06-28,56.3736
2018-06-29,56.7607
2018-07-02,57.2058
2018-07-03,55.8898
2018-07-05,58.1831
2018-07-06,58.5508
2018-07-09,58.6959
2018-07-10,59.3345
2018-07-11,57.767
2018-07-12,59.0055
2018-07-13,58.7056
2018-07-16,58.7056
2018-07-17,59.3152
2018-07-18,59.8087
2018-07-19,59.4797
2018-07-20,59.4603
2018-07-23,58.8604
2018-07-24,57.409
2018-07-25,56.8961
2018-07-26,57.0509
2018-07-27,58.9668
2018-07-30,59.0152
2018-07-31,59.1604
2018-08-01,58.754
2018-08-02,60.2054
2018-08-03,60.5634
2018-08-06,60.9118
2018-08-07,61.3085
2018-08-08,61.4246
2018-08-09,61.0182
2018-08-10,59.3926
2018-08-13,59.4216
2018-08-14,58.7636
2018-08-15,58.5024
2018-08-16,58.2024
2018-08-17,58.0476
2018-08-20,58.5798
2018-08-21,59.7603
2018-08-22,59.5861
2018-08-23,59.6732
2018-08-24,59.7506
2018-08-27,60.2151
2018-08-28,60.2344
2018-08-29,60.7414
2018-08-30,59.0744
2018-08-31,58.9477
2018-09-04,59.3376
2018-09-05,58.8697
2018-09-06,58.7722
2018-09-07,57.2905
2018-09-10,57.7486
2018-09-11,58.5188
2018-09-12,56.1207
2018-09-13,56.2669
2018-09-14,56.4521
2018-09-17,55.8185
2018-09-18,56.8518
2018-09-19,56.6666
2018-09-20,58.0801
2018-09-21,58.0216
2018-09-24,58.2263
2018-09-25,56.6081
2018-09-26,55.0971
2018-09-27,54.9314
2018-09-28,54.9704
2018-10-01,55.0386
2018-10-02,55.2043
2018-10-03,55.5553
2018-10-04,54.3075
2018-10-05,52.0654
2018-10-08,51.2563
2018-10-09,51.5293
2018-10-10,49.5016
2018-10-11,50.223
2018-10-12,50.4959
2018-10-15,50.0183
2018-10-16,51.6462
2018-10-17,51.5293
2018-10-18,50.067
2018-10-19,49.8526
2018-10-22,50.028
2018-10-23,49.7746
2018-10-24,45.7193
2018-10-25,46.9183
2018-10-26,47.0451
2018-10-29,47.3473
2018-10-30,48.5268
2018-10-31,48.7608
2018-11-01,51.7827
2018-11-02,50.6032
2018-11-05,50.1158
2018-11-06,50.379
2018-11-07,51.3148
2018-11-08,51.8802
2018-11-09,50.7786
2018-11-12,50.0183
2018-11-13,50.145
2018-11-14,50.3887
2018-11-15,52.0849
2018-11-16,51.9777
2018-11-19,50.6909
2018-11-20,50.7396
2018-11-21,51.1686
2018-11-23,51.4318
2018-11-26,52.0362
2018-11-27,54.2003
2018-11-28,55.2619
2018-11-29,54.3968
2018-11-30,54.967
2018-12-03,56.117
2018-12-04,53.8857
2018-12-06,53.5515
2018-12-07,51.9984
2018-12-10,52.4211
2018-12-11,52.1852
2018-12-12,53.2566
2018-12-13,52.4703
2018-12-14,51.8805
2018-12-17,51.3104
2018-12-18,51.1924
2018-12-19,48.5286
2018-12-20,47.988
2018-12-21,47.3982
2018-12-24,45.8648
2018-12-26,48.4794
2018-12-27,49.1184
2018-12-28,49.2756
2018-12-31,49.9834
2019-01-02,49.9735
2019-01-03,47.1328
2019-01-04,49.2068
2019-01-07,49.718
2019-01-08,48.9709
2019-01-09,50.2979
2019-01-10,50.8385
2019-01-11,51.9591
2019-01-14,50.2488
2019-01-15,50.8091
2019-01-16,51.1728
2019-01-17,51.8117
2019-01-18,52.6963
2019-01-22,51.0056
2019-01-23,51.1433
2019-01-24,53.6105
2019-01-25,55.311
2019-01-28,54.6524
2019-01-29,54.043
2019-01-30,53.5318
2019-01-31,53.3451
2019-02-01,53.6793
2019-02-04,54.1118
2019-02-05,54.2494
2019-02-06,55.2225
2019-02-07,53.9152
2019-02-08,53.7874
2019-02-11,53.7579
2019-02-12,54.6819
2019-02-13,54.5148
2019-02-14,54.8392
2019-02-15,54.8982
2019-02-19,54.5738
2019-02-20,54.967
2019-02-21,54.3182
2019-02-22,54.9473
2019-02-25,55.5174
2019-02-26,54.6721
2019-02-27,53.7007
2019-02-28,53.9485
2019-03-01,54.563
2019-03-04,54.8703
2019-03-05,54.2161
2019-03-06,53.1457
2019-03-07,51.9067
2019-03-08,51.4905
2019-03-11,52.8781
2019-03-12,52.6699
2019-03-13,52.4717
2019-03-14,52.4122
2019-03-15,53.6611
2019-03-18,53.4827
2019-03-19,53.7701
2019-03-20,53.3836
2019-03-21,54.7712
2019-03-22,53.7305
2019-03-25,53.3637
2019-03-26,53.8593
2019-03-27,52.6402
2019-03-28,52.2636
2019-03-29,52.6997
2019-04-01,54.2756
2019-04-02,54.4738
2019-04-03,56.3273
2019-04-04,56.4264
2019-04-05,56.8129
2019-04-08,57.4374
2019-04-09,56.7436
2019-04-10,57.6257
2019-04-11,57.4572
2019-04-12,58.7754
2019-04-15,58.4979
2019-04-16,59.3602
2019-04-17,59.043
2019-04-18,59.2413
2019-04-22,58.5871
2019-04-23,59.1025
2019-04-24,59.6576
2019-04-25,59.1422
2019-04-26,59.0034
2019-04-29,58.9142
2019-04-30,59.4692
2019-05-01,59.3503
2019-05-02,59.8558
2019-05-03,60.0144
2019-05-06,58.5871
2019-05-07,57.7545
2019-05-08,56.7931
2019-05-09,56.5949
2019-05-10,56.4561
2019-05-13,52.9474
2019-05-14,53.6214
2019-05-15,54.3053
2019-05-16,53.9188
2019-05-17,53.1159
2019-05-20,52.1644
2019-05-21,53.1853
2019-05-22,53.5421
2019-05-23,53.3836
2019-05-24,52.8781
2019-05-28,51.54
2019-05-29,52.59
2019-05-30,53.14
2019-05-31,52.59
2019-06-03,53.31
2019-06-04,55.35
2019-06-05,55.57
2019-06-06,55.82
2019-06-07,56.53
2019-06-10,58.01
2019-06-11,58.03
2019-06-12,57.18
2019-06-13,57.64
2019-06-14,56.37
2019-06-17,55.96
2019-06-18,57.76
2019-06-19,58.135
2019-06-20,58.115
2019-06-21,58.36
2019-06-24,58.415
2019-06-25,57.92
2019-06-26,59.07
2019-06-27,59.97
2019-06-28,60.1
2019-07-01,60.9
2019-07-02,59.975
2019-07-03,60.37
2019-07-04,60.37
2019-07-05,60.145
2019-07-08,59.99
2019-07-09,60.305
2019-07-10,61.09
2019-07-11,61.14
2019-07-12,61.98
2019-07-15,62.25
2019-07-16,61.59
2019-07-17,61.205
2019-07-18,62.1
2019-07-19,62.13
2019-07-22,62.73
2019-07-23,63.64
2019-07-24,65.305
2019-07-25,64.07
2019-07-26,64.59
2019-07-29,64.52
2019-07-30,64.025
2019-07-31,59.23
2019-08-01,56.93
2019-08-02,55.95
2019-08-05,53.62
2019-08-06,54.16
2019-08-07,54.14
2019-08-08,55.35
2019-08-09,53.9
2019-08-12,53.14
2019-08-13,53.93
2019-08-14,52.28
2019-08-15,52.565
2019-08-16,54.09
2019-08-19,54.75
2019-08-20,54.415
2019-08-21,54.86
2019-08-22,54.68
2019-08-23,51.99
2019-08-26,52.525
2019-08-27,52.785
2019-08-28,52.75
2019-08-29,53.91
2019-08-30,54.555
2019-09-02,54.52
2019-09-03,53.815
2019-09-04,55.42
2019-09-05,56.68
2019-09-06,56.87
2019-09-09,57.54
2019-09-10,58.21
2019-09-11,59.72
2019-09-12,59.835
2019-09-13,59.705
2019-09-16,59.095
2019-09-17,58.75
2019-09-18,58.84
2019-09-19,58.49
2019-09-20,57.04
2019-09-23,57.92
2019-09-24,57.165
2019-09-25,58.72
2019-09-26,58.27
2019-09-27,57.15
2019-09-30,57.89
2019-10-01,56.925
2019-10-02,55.82
2019-10-03,56.41
2019-10-04,57.55
2019-10-07,57.06
2019-10-08,55.505
2019-10-09,56.255
2019-10-10,56.925
2019-10-11,57.765
2019-10-14,57.705
2019-10-15,58.655
2019-10-16,57.8
2019-10-17,58.08
2019-10-18,57.79
2019-10-21,58.435
2019-10-22,58.615
2019-10-23,56.7
2019-10-24,57.095
2019-10-25,57.13
2019-10-28,57.96
2019-10-29,58.575
2019-10-30,58.855
2019-10-31,58.555
2019-11-01,60.485
2019-11-04,60.555
2019-11-05,60.83
2019-11-06,59.595
2019-11-07,59.6
2019-11-08,59.555
2019-11-11,59.05
2019-11-12,58.395
2019-11-13,58.47
2019-11-14,57.845
2019-11-15,57.75
2019-11-18,56.545
2019-11-19,55.865
2019-11-20,55.475
2019-11-21,54.975
2019-11-22,55.305
2019-11-25,56.96
