date,close
2014-06-13,35.6801
2014-06-16,35.6162
2014-06-17,35.4975
2014-06-18,35.5523
2014-06-19,35.881
2014-06-20,36.2644
2014-06-23,36.6661
2014-06-24,35.6345
2014-06-25,36.2553
2014-06-26,36.1823
2014-06-27,36.0088
2014-06-30,36.447
2014-07-01,36.3009
2014-07-02,36.1731
2014-07-03,36.8122
2014-07-07,36.1275
2014-07-08,36.0088
2014-07-09,36.1275
2014-07-10,35.9631
2014-07-11,35.7349
2014-07-14,36.237
2014-07-15,35.8901
2014-07-16,36.7666
2014-07-17,36.3375
2014-07-18,36.3375
2014-07-21,36.3101
2014-07-22,36.7027
2014-07-23,36.9583
2014-07-24,37.1683
2014-07-25,36.9857
2014-07-28,36.7301
2014-07-29,36.4653
2014-07-30,36.2096
2014-07-31,35.3788
2014-08-01,35.251
2014-08-04,35.8079
2014-08-05,35.114
2014-08-06,35.5432
2014-08-07,34.7762
2014-08-08,35.6801
2014-08-11,35.7075
2014-08-12,35.6436
2014-08-13,35.744
2014-08-14,35.6071
2014-08-15,35.6253
2014-08-18,35.7355
2014-08-19,36.4698
2014-08-20,36.6442
2014-08-21,36.9839
2014-08-22,36.7177
2014-08-25,37.0573
2014-08-26,37.3327
2014-08-27,37.5346
2014-08-28,37.553
2014-08-29,38.269
2014-09-02,37.654
2014-09-03,37.8926
2014-09-04,37.2042
2014-09-05,37.553
2014-09-08,36.9104
2014-09-09,36.7728
2014-09-10,36.736
2014-09-11,36.736
2014-09-12,36.3321
2014-09-15,36.5616
2014-09-16,36.8278
2014-09-17,37.0206
2014-09-18,36.0935
2014-09-19,36.0109
2014-09-22,35.5335
2014-09-23,35.2582
2014-09-24,35.5152
2014-09-25,35.0011
2014-09-26,35.3775
2014-09-29,35.4326
2014-09-30,34.5054
2014-10-01,34.0832
2014-10-02,33.8721
2014-10-03,33.6426
2014-10-06,33.6242
2014-10-07,32.899
2014-10-08,33.1928
2014-10-09,31.8618
2014-10-10,31.4212
2014-10-13,30.2187
2014-10-14,29.879
2014-10-15,30.0442
2014-10-16,30.7511
2014-10-17,31.1458
2014-10-20,31.4487
2014-10-21,32.0178
2014-10-22,31.2376
2014-10-23,31.8801
2014-10-24,31.669
2014-10-27,30.2921
2014-10-28,31.4579
2014-10-29,30.8153
2014-10-30,31.311
2014-10-31,32.4951
2014-11-03,31.7333
2014-11-04,30.6225
2014-11-05,30.8153
2014-11-06,31.5221
2014-11-07,31.568
2014-11-10,30.5216
2014-11-11,30.4114
2014-11-12,29.9708
2014-11-13,29.3282
2014-11-14,29.7046
2014-11-17,29.3997
2014-11-18,29.6214
2014-11-19,30.2774
2014-11-20,30.7486
2014-11-21,31.2568
2014-11-24,31.0166
2014-11-25,30.5916
2014-11-26,30.028
2014-11-28,26.7203
2014-12-01,26.7849
2014-12-02,27.4687
2014-12-03,28.2078
2014-12-04,27.5703
2014-12-05,27.0067
2014-12-08,25.1773
2014-12-09,25.667
2014-12-10,24.4197
2014-12-11,24.2534
2014-12-12,23.5142
2014-12-15,22.9136
2014-12-16,23.3849
2014-12-17,24.6414
2014-12-18,25.4637
2014-12-19,26.0828
2014-12-22,26.1197
2014-12-23,26.517
2014-12-24,26.2029
2014-12-26,26.1105
2014-12-29,26.4061
2014-12-30,26.2583
2014-12-31,26.1382
2015-01-02,26.4246
2015-01-05,25.1958
2015-01-06,24.817
2015-01-07,25.1219
2015-01-08,25.63
2015-01-09,25.5469
2015-01-12,24.2441
2015-01-13,23.9207
2015-01-14,23.9854
2015-01-15,23.5327
2015-01-16,24.5767
2015-01-20,23.9669
2015-01-21,24.5675
2015-01-22,24.7892
2015-01-23,24.5028
2015-01-26,25.1958
2015-01-27,24.9186
2015-01-28,23.6066
2015-01-29,23.6251
2015-01-30,24.5767
2015-02-02,25.7779
2015-02-03,26.6002
2015-02-04,25.8518
2015-02-05,26.2213
2015-02-06,25.8333
2015-02-09,26.1567
2015-02-10,26.2213
2015-02-11,25.9442
2015-02-12,26.5909
2015-02-13,27.4472
2015-02-17,27.5775
2015-02-18,27.0098
2015-02-19,27.0004
2015-02-20,26.4979
2015-02-23,26.563
2015-02-24,26.8329
2015-02-25,27.047
2015-02-26,26.0604
2015-02-27,25.9301
2015-03-02,25.7533
2015-03-03,25.8184
2015-03-04,25.6974
2015-03-05,25.4461
2015-03-06,24.9249
2015-03-09,24.4782
2015-03-10,24.0314
2015-03-11,24.0035
2015-03-12,23.836
2015-03-13,23.9942
2015-03-16,24.2083
2015-03-17,23.7894
2015-03-18,24.5154
2015-03-19,23.9104
2015-03-20,24.3665
2015-03-23,24.1152
2015-03-24,24.1059
2015-03-25,24.5806
2015-03-26,24.5526
2015-03-27,24.1059
2015-03-30,24.5992
2015-03-31,24.3013
2015-04-01,24.7946
2015-04-02,25.1948
2015-04-06,25.9673
2015-04-07,26.2093
2015-04-08,26.0232
2015-04-09,26.7771
2015-04-10,27.1587
2015-04-13,26.8981
2015-04-14,27.3634
2015-04-15,28.5734
2015-04-16,28.5734
2015-04-17,28.4058
2015-04-20,28.8247
2015-04-21,28.0429
2015-04-22,28.2476
2015-04-23,28.4338
2015-04-24,28.229
2015-04-27,28.3035
2015-04-28,28.592
2015-04-29,29.0294
2015-04-30,28.9457
2015-05-01,28.6385
2015-05-04,28.9271
2015-05-05,27.8939
2015-05-06,27.745
2015-05-07,26.9167
2015-05-08,27.2797
2015-05-11,26.4327
2015-05-12,26.4234
2015-05-13,26.2
2015-05-14,25.7067
2015-05-15,25.7626
2015-05-18,25.9877
2015-05-19,25.6313
2015-05-20,25.7532
2015-05-21,26.4285
2015-05-22,26.344
2015-05-26,25.9595
2015-05-27,25.8657
2015-05-28,25.5281
2015-05-29,25.5
2015-06-01,25.4062
2015-06-02,25.3968
2015-06-03,25.3968
2015-06-04,24.9936
2015-06-05,25.2749
2015-06-08,24.9279
2015-06-09,25.0686
2015-06-10,25.3781
2015-06-11,25.2562
2015-06-12,24.8435
2015-06-15,24.7966
2015-06-16,25.0592
2015-06-17,24.8904
2015-06-18,24.881
2015-06-19,24.3089
2015-06-22,24.4965
2015-06-23,24.956
2015-06-24,24.956
2015-06-25,25.1436
2015-06-26,26.0252
2015-06-29,25.0311
2015-06-30,24.8904
2015-07-01,24.187
2015-07-02,24.1307
2015-07-06,23.5587
2015-07-07,24.112
2015-07-08,23.1929
2015-07-09,23.2398
2015-07-10,22.9397
2015-07-13,23.1929
2015-07-14,23.5211
2015-07-15,22.8834
2015-07-16,22.7615
2015-07-17,22.105
2015-07-20,21.7955
2015-07-21,21.7299
2015-07-22,20.9514
2015-07-23,20.7264
2015-07-24,20.0792
2015-07-27,19.404
2015-07-28,19.8823
2015-07-29,20.4075
2015-07-30,20.5013
2015-07-31,19.7041
2015-08-03,19.2915
2015-08-04,19.2352
2015-08-05,18.5599
2015-08-06,18.2411
2015-08-07,17.2563
2015-08-10,17.8003
2015-08-11,17.7065
2015-08-12,17.8753
2015-08-13,16.9
2015-08-14,16.3185
2015-08-17,16.4799
2015-08-18,16.5938
2015-08-19,15.4072
2015-08-20,15.3122
2015-08-21,14.9325
2015-08-24,13.6604
2015-08-25,13.3282
2015-08-26,13.9073
2015-08-27,15.1603
2015-08-28,15.8059
2015-08-31,16.4134
2015-09-01,15.9957
2015-09-02,16.0147
2015-09-03,16.0147
2015-09-04,15.5306
2015-09-08,15.4926
2015-09-09,14.1541
2015-09-10,14.2205
2015-09-11,14.325
2015-09-14,14.6287
2015-09-15,14.6667
2015-09-16,15.3882
2015-09-17,15.597
2015-09-18,15.0369
2015-09-21,15.2932
2015-09-22,14.8661
2015-09-23,14.5243
2015-09-24,14.6667
2015-09-25,14.9515
2015-09-28,14.0117
2015-09-29,14.211
2015-09-30,14.6192
2015-10-01,14.5338
2015-10-02,15.8154
2015-10-05,17.1349
2015-10-06,18.1981
2015-10-07,18.1981
2015-10-08,19.1569
2015-10-09,18.5968
2015-10-12,17.9988
2015-10-13,17.6475
2015-10-14,17.9513
2015-10-15,18.4449
2015-10-16,18.3025
2015-10-19,17.3532
2015-10-20,17.619
2015-10-21,17.1064
2015-10-22,17.5431
2015-10-23,17.3722
2015-10-26,16.6982
2015-10-27,16.2426
2015-10-28,16.7837
2015-10-29,16.6602
2015-10-30,17.4482
2015-11-02,18.0462
2015-11-03,18.6633
2015-11-04,18.4164
2015-11-05,18.0367
2015-11-06,17.3627
2015-11-09,17.4292
2015-11-10,17.8279
2015-11-11,16.4229
2015-11-12,16.328
2015-11-13,16.271
2015-11-16,17.0136
2015-11-17,16.8613
2015-11-18,17.0422
2015-11-19,16.7947
2015-11-20,16.5852
2015-11-23,16.6899
2015-11-24,17.6135
2015-11-25,17.2421
2015-11-27,16.6043
2015-11-30,16.6709
2015-12-01,16.7851
2015-12-02,15.8712
2015-12-03,15.7569
2015-12-04,15.3475
2015-12-07,14.0717
2015-12-08,14.205
2015-12-09,13.8051
2015-12-10,14.0336
2015-12-11,13.6528
2015-12-14,13.291
2015-12-15,13.7671
2015-12-16,13.1196
2015-12-17,12.1676
2015-12-18,11.8724
2015-12-21,11.92
2015-12-22,12.0819
2015-12-23,13.291
2015-12-24,13.2625
2015-12-28,12.358
2015-12-29,12.4056
2015-12-30,11.7867
2015-12-31,11.9867
2016-01-04,12.2057
2016-01-05,12.1485
2016-01-06,10.7394
2016-01-07,10.1587
2016-01-08,9.854
2016-01-11,9.159
2016-01-12,8.7496
2016-01-13,8.1308
2016-01-14,8.6354
2016-01-15,7.7499
2016-01-19,7.312
2016-01-20,7.4833
2016-01-21,8.3688
2016-01-22,8.5877
2016-01-25,7.7499
2016-01-26,8.0451
2016-01-27,8.3307
2016-01-28,8.7306
2016-01-29,9.2637
2016-02-01,9.2732
2016-02-02,8.3212
2016-02-03,8.9686
2016-02-04,8.7496
2016-02-05,8.0546
2016-02-08,7.4453
2016-02-09,6.9407
2016-02-10,6.7883
2016-02-11,6.7217
2016-02-12,7.1819
2016-02-16,7.0956
2016-02-17,7.1052
2016-02-18,6.645
2016-02-19,6.4532
2016-02-22,7.1819
2016-02-23,6.7409
2016-02-24,6.923
2016-02-25,7.086
2016-02-26,7.6997
2016-02-29,7.8723
2016-03-01,7.6326
2016-03-02,8.7257
2016-03-03,9.5599
2016-03-04,10.5476
2016-03-07,10.5763
2016-03-08,9.7038
2016-03-09,10.049
2016-03-10,10.1544
2016-03-11,10.701
2016-03-14,10.6339
2016-03-15,10.8448
2016-03-16,11.0462
2016-03-17,10.9791
2016-03-18,11.1517
2016-03-21,10.9599
2016-03-22,10.8448
2016-03-23,9.7709
2016-03-24,9.8668
2016-03-28,9.7421
2016-03-29,9.9722
2016-03-30,10.0969
2016-03-31,10.6818
2016-04-01,10.1257
2016-04-04,10.0969
2016-04-05,10.1928
2016-04-06,10.5667
2016-04-07,10.7585
2016-04-08,11.2955
2016-04-11,11.19
2016-04-12,12.5804
2016-04-13,12.3886
2016-04-14,12.5708
2016-04-15,12.4749
2016-04-18,12.8105
2016-04-19,13.3762
2016-04-20,13.4817
2016-04-21,13.2899
2016-04-22,13.7502
2016-04-25,13.2612
2016-04-26,13.8461
2016-04-27,14.2296
2016-04-28,13.7598
2016-04-29,13.5105
2016-05-02,12.9927
2016-05-03,12.2639
2016-05-04,11.6694
2016-05-05,11.5736
2016-05-06,11.5352
2016-05-09,10.9695
2016-05-10,11.4489
2016-05-11,11.9475
2016-05-12,11.8229
2016-05-13,11.7941
2016-05-16,12.3044
2016-05-17,12.3814
2016-05-18,12.1888
2016-05-19,12.2659
2016-05-20,12.6221
2016-05-23,12.6991
2016-05-24,12.5354
2016-05-25,13.0361
2016-05-26,12.6799
2016-05-27,12.4199
2016-05-31,12.5836
2016-06-01,12.7376
2016-06-02,12.882
2016-06-03,12.8243
2016-06-06,13.4405
2016-06-07,14.0759
2016-06-08,13.9892
2016-06-09,13.7293
2016-06-10,12.9206
2016-06-13,12.7858
2016-06-14,12.7376
2016-06-15,12.5739
2016-06-16,12.1985
2016-06-17,12.6702
2016-06-20,13.9411
2016-06-21,14.5284
2016-06-22,14.2011
2016-06-23,14.7017
2016-06-24,14.047
2016-06-27,13.1516
2016-06-28,14.2299
2016-06-29,14.5765
2016-06-30,14.4514
2016-07-01,15.0964
2016-07-05,14.1722
2016-07-06,14.2877
2016-07-07,14.1914
2016-07-08,14.3647
2016-07-11,14.1433
2016-07-12,15.0194
2016-07-13,14.721
2016-07-14,14.7017
2016-07-15,14.6439
2016-07-18,14.615
2016-07-19,14.2011
2016-07-20,14.2877
2016-07-21,13.8833
2016-07-22,13.5849
2016-07-25,13.0746
2016-07-26,13.2672
2016-07-27,12.6413
2016-07-28,12.8532
2016-07-29,13.1324
2016-08-01,12.4392
2016-08-02,12.4199
2016-08-03,12.9206
2016-08-04,12.9109
2016-08-05,13.3538
2016-08-08,13.7197
2016-08-09,13.8833
2016-08-10,13.4597
2016-08-11,13.9122
2016-08-12,14.1722
2016-08-15,14.3944
2016-08-16,14.6552
2016-08-17,15.1672
2016-08-18,16.114
2016-08-19,16.2299
2016-08-22,15.1093
2016-08-23,15.8724
2016-08-24,15.515
2016-08-25,15.4667
2016-08-26,15.4087
2016-08-29,15.4474
2016-08-30,15.0223
2016-08-31,14.5103
2016-09-01,14.5972
2016-09-02,14.9643
2016-09-06,15.1093
2016-09-07,15.1576
2016-09-08,16.1719
2016-09-09,15.1382
2016-09-12,14.945
2016-09-13,13.8534
2016-09-14,13.5346
2016-09-15,13.7761
2016-09-16,13.7568
2016-09-19,13.6119
2016-09-20,13.3993
2016-09-21,14.1528
2016-09-22,14.3654
2016-09-23,13.9983
2016-09-26,13.921
2016-09-27,13.5829
2016-09-28,14.6649
2016-09-29,15.3604
2016-09-30,15.2735
2016-10-03,15.4377
2016-10-04,15.0996
2016-10-05,15.573
2016-10-06,15.5343
2016-10-07,15.032
2016-10-10,15.1865
2016-10-11,14.5683
2016-10-12,14.433
2016-10-13,14.2784
2016-10-14,14.0852
2016-10-17,13.6988
2016-10-18,13.7181
2016-10-19,14.1528
2016-10-20,14.2012
2016-10-21,14.1432
2016-10-24,14.0949
2016-10-25,13.6988
2016-10-26,13.7664
2016-10-27,13.4766
2016-10-28,13.2544
2016-10-31,12.7327
2016-11-01,12.8197
2016-11-02,12.3463
2016-11-03,13.6698
2016-11-04,13.2254
2016-11-07,13.6698
2016-11-08,13.7664
2016-11-09,14.375
2016-11-10,14.6262
2016-11-11,14.3847
2016-11-14,14.4719
2016-11-15,15.2183
2016-11-16,15.0826
2016-11-17,14.9857
2016-11-18,15.1408
2016-11-21,15.9744
2016-11-22,16.0422
2016-11-23,16.2652
2016-11-25,15.7805
2016-11-28,15.0632
2016-11-29,14.4913
2016-11-30,17.5059
2016-12-01,17.3411
2016-12-02,17.6416
2016-12-05,17.8258
2016-12-06,17.787
2016-12-07,17.8549
2016-12-08,17.8161
2016-12-09,17.6901
2016-12-12,17.9227
2016-12-13,18.2232
2016-12-14,17.6416
2016-12-15,17.6804
2016-12-16,18.0197
2016-12-19,17.9421
2016-12-20,17.7482
2016-12-21,17.5253
2016-12-22,17.4865
2016-12-23,17.5059
2016-12-27,17.5835
2016-12-28,17.3024
2016-12-29,17.031
2016-12-30,16.7789
2017-01-03,17.2151
2017-01-04,17.4962
2017-01-05,17.6222
2017-01-06,17.3314
2017-01-09,16.8662
2017-01-10,16.9437
2017-01-11,17.1473
2017-01-12,16.9049
2017-01-13,16.9146
2017-01-17,16.9049
2017-01-18,16.7983
2017-01-19,16.7402
2017-01-20,17.0697
2017-01-23,16.8856
2017-01-24,17.157
2017-01-25,17.2054
2017-01-26,17.2054
2017-01-27,16.8759
2017-01-30,16.0229
2017-01-31,16.2361
2017-02-01,16.081
2017-02-02,16.1683
2017-02-03,16.7014
2017-02-06,16.0132
2017-02-07,15.5382
2017-02-08,15.3928
2017-02-09,15.5576
2017-02-10,15.6933
2017-02-13,15.6155
2017-02-14,15.9558
2017-02-15,15.8489
2017-02-16,15.7225
2017-02-17,15.7808
2017-02-21,15.9266
2017-02-22,15.3238
2017-02-23,15.5377
2017-02-24,15.2946
2017-02-27,15.4113
2017-02-28,15.5572
2017-03-01,15.9947
2017-03-02,15.6933
2017-03-03,15.7322
2017-03-06,16.0141
2017-03-07,15.8294
2017-03-08,14.4584
2017-03-09,15.6252
2017-03-10,15.7127
2017-03-13,15.4016
2017-03-14,14.896
2017-03-15,15.1293
2017-03-16,15.1196
2017-03-17,15.0321
2017-03-20,15.0516
2017-03-21,14.6335
2017-03-22,14.6043
2017-03-23,14.2737
2017-03-24,14.2056
2017-03-27,14.3418
2017-03-28,14.8085
2017-03-29,15.4113
2017-03-30,15.4113
2017-03-31,15.3627
2017-04-03,15.3821
2017-04-04,15.6933
2017-04-05,15.5377
2017-04-06,15.8586
2017-04-07,15.81
2017-04-10,16.1017
2017-04-11,16.1406
2017-04-12,15.9558
2017-04-13,15.4696
2017-04-17,15.5766
2017-04-18,15.3044
2017-04-19,14.6432
2017-04-20,14.6723
2017-04-21,14.7404
2017-04-24,14.7307
2017-04-25,15.178
2017-04-26,14.8863
2017-04-27,14.4682
2017-04-28,14.4584
2017-05-01,14.4098
2017-05-02,14.2348
2017-05-03,14.439
2017-05-04,13.7778
2017-05-05,13.8945
2017-05-08,14.1862
2017-05-09,14.0014
2017-05-10,14.2931
2017-05-11,14.0792
2017-05-12,13.9334
2017-05-15,14.1871
2017-05-16,14.0797
2017-05-17,14.0017
2017-05-18,13.7773
2017-05-19,14.1773
2017-05-22,14.0895
2017-05-23,14.2066
2017-05-24,14.1773
2017-05-25,13.1723
2017-05-26,13.1918
2017-05-30,12.8015
2017-05-31,12.704
2017-06-01,12.782
2017-06-02,12.4112
2017-06-05,12.4698
2017-06-06,12.5674
2017-06-07,11.9136
2017-06-08,11.7965
2017-06-09,12.2356
2017-06-12,12.3137
2017-06-13,12.6942
2017-06-14,12.3332
2017-06-15,12.0697
2017-06-16,12.2161
2017-06-19,12.1868
2017-06-20,11.7673
2017-06-21,11.3282
2017-06-22,11.3087
2017-06-23,11.2501
2017-06-26,11.2501
2017-06-27,11.0745
2017-06-28,11.1721
2017-06-29,11.4258
2017-06-30,11.5624
2017-07-03,11.8453
2017-07-05,11.455
2017-07-06,11.3087
2017-07-07,11.1916
2017-07-10,11.2404
2017-07-11,11.3087
2017-07-12,11.1526
2017-07-13,11.1721
2017-07-14,11.3672
2017-07-17,11.3087
2017-07-18,11.3965
2017-07-19,11.9527
2017-07-20,11.8063
2017-07-21,11.5624
2017-07-24,11.5916
2017-07-25,12.0405
2017-07-26,11.8844
2017-07-27,11.9331
2017-07-28,12.06
2017-07-31,11.9331
2017-08-01,12.0453
2017-08-02,11.7477
2017-08-03,12.2063
2017-08-04,12.5869
2017-08-07,12.0502
2017-08-08,12.0697
2017-08-09,11.9039
2017-08-10,11.7575
2017-08-11,11.8258
2017-08-14,11.3947
2017-08-15,11.2967
2017-08-16,10.9636
2017-08-17,10.6011
2017-08-18,10.6501
2017-08-21,10.5521
2017-08-22,10.6697
2017-08-23,10.797
2017-08-24,10.7677
2017-08-25,10.8264
2017-08-28,10.6991
2017-08-29,10.6599
2017-08-30,10.6795
2017-08-31,10.895
2017-09-01,11.042
2017-09-05,11.0616
2017-09-06,11.4927
2017-09-07,11.5417
2017-09-08,11.0812
2017-09-11,11.2575
2017-09-12,11.3555
2017-09-13,11.669
2017-09-14,15.7465
2017-09-15,11.7572
2017-09-18,11.7768
2017-09-19,11.7572
2017-09-20,12.1687
2017-09-21,12.4725
2017-09-22,12.5312
2017-09-25,12.9231
2017-09-26,13.1289
2017-09-27,13.4522
2017-09-28,13.2563
2017-09-29,13.2857
2017-10-02,13.3151
2017-10-03,13.4816
2017-10-04,13.6188
2017-10-05,13.5992
2017-10-06,13.2759
2017-10-09,13.3053
2017-10-10,13.3444
2017-10-11,13.4032
2017-10-12,13.3444
2017-10-13,13.4718
2017-10-16,13.5698
2017-10-17,13.6776
2017-10-18,13.4914
2017-10-19,13.462
2017-10-20,13.6482
2017-10-23,13.3542
2017-10-24,13.4326
2017-10-25,13.2171
2017-10-26,13.2857
2017-10-27,13.5306
2017-10-30,13.8735
2017-10-31,13.9323
2017-11-01,14.5692
2017-11-02,15.1276
2017-11-03,15.2648
2017-11-06,15.9996
2017-11-07,15.8331
2017-11-08,15.4314
2017-11-09,15.4607
2017-11-10,15.304
2017-11-13,15.2354
2017-11-14,14.5867
2017-11-15,14.5375
2017-11-16,14.2721
2017-11-17,14.7931
2017-11-20,14.223
2017-11-21,14.2721
2017-11-22,14.626
2017-11-24,14.8717
2017-11-27,14.2328
2017-11-28,14.3114
2017-11-29,14.4982
2017-11-30,14.5867
2017-12-01,14.8226
2017-12-04,14.6456
2017-12-05,14.626
2017-12-06,14.2033
2017-12-07,14.4884
2017-12-08,14.8914
2017-12-11,14.8914
2017-12-12,14.9209
2017-12-13,14.9405
2017-12-14,14.8619
2017-12-15,14.7538
2017-12-18,15.1666
2017-12-19,15.7465
2017-12-20,16.0414
2017-12-21,16.7589
2017-12-22,16.6115
2017-12-26,16.9653
2017-12-27,16.7196
2017-12-28,16.7786
2017-12-29,16.641
2018-01-02,17.0833
2018-01-03,17.3683
2018-01-04,17.8107
2018-01-05,17.5846
2018-01-08,17.6632
2018-01-09,17.7419
2018-01-10,17.5944
2018-01-11,18.2825
2018-01-12,18.4987
2018-01-16,17.9286
2018-01-17,18.5184
2018-01-18,18.3709
2018-01-19,18.2628
2018-01-22,18.9509
2018-01-23,18.8919
2018-01-24,18.9509
2018-01-25,18.3611
2018-01-26,18.5184
2018-01-29,18.3021
2018-01-30,17.7517
2018-01-31,17.8795
2018-02-01,18.1154
2018-02-02,17.2209
2018-02-05,16.4935
2018-02-06,16.9359
2018-02-07,16.0512
2018-02-08,15.4123
2018-02-09,15.2452
2018-02-12,15.9922
2018-02-13,15.7957
2018-02-14,16.6606
2018-02-15,16.0414
2018-02-16,15.3828
2018-02-20,15.6294
2018-02-21,15.087
2018-02-22,14.9687
2018-02-23,15.3237
2018-02-26,15.1265
2018-02-27,14.7912
2018-02-28,14.3179
2018-03-01,14.3277
2018-03-02,14.6531
2018-03-05,14.9391
2018-03-06,14.8208
2018-03-07,14.594
2018-03-08,14.6235
2018-03-09,15.0081
2018-03-12,14.8799
2018-03-13,14.6137
2018-03-14,14.663
2018-03-15,14.7024
2018-03-16,14.9095
2018-03-19,14.6433
2018-03-20,15.0476
2018-03-21,16.0928
2018-03-22,15.6195
2018-03-23,15.5406
2018-03-26,16.0435
2018-03-27,15.5998
2018-03-28,15.1067
2018-03-29,15.9055
2018-04-02,15.3532
2018-04-03,15.7773
2018-04-04,15.6688
2018-04-05,16.5661
2018-04-06,16.0139
2018-04-09,16.1224
2018-04-10,16.8225
2018-04-11,17.2761
2018-04-12,17.3846
2018-04-13,17.9072
2018-04-16,17.9368
2018-04-17,17.8973
2018-04-18,17.9762
2018-04-19,17.7396
2018-04-20,17.7691
2018-04-23,17.7297
2018-04-24,17.4635
2018-04-25,17.7198
2018-04-26,18.203
2018-04-27,17.8579
2018-04-30,17.9959
2018-05-01,17.9466
2018-05-02,18.0452
2018-05-03,19.1694
2018-05-04,19.4455
2018-05-07,19.4948
2018-05-08,20.1555
2018-05-09,20.964
2018-05-10,20.8457
2018-05-11,20.7077
2018-05-14,21.1218
2018-05-15,21.023
2018-05-16,20.934
2018-05-17,21.3986
2018-05-18,21.1613
2018-05-21,21.6456
2018-05-22,21.2898
2018-05-23,21.3788
2018-05-24,21.2206
2018-05-25,20.4695
2018-05-29,20.4398
2018-05-30,21.2799
2018-05-31,21.1811
2018-06-01,21.2701
2018-06-04,20.8352
2018-06-05,20.341
2018-06-06,20.4596
2018-06-07,20.8549
2018-06-08,20.7462
2018-06-11,21.2206
2018-06-12,21.1119
2018-06-13,21.2206
2018-06-14,20.8747
2018-06-15,19.7578
2018-06-18,20.084
2018-06-19,20.2916
2018-06-20,20.8154
2018-06-21,19.6886
2018-06-22,21.2305
2018-06-25,20.0642
2018-06-26,20.4892
2018-06-27,20.9735
2018-06-28,20.4596
2018-06-29,20.6177
2018-07-02,20.42
2018-07-03,21.023
2018-07-05,20.4596
2018-07-06,20.8451
2018-07-09,21.6555
2018-07-10,21.7247
2018-07-11,21.0526
2018-07-12,21.1811
2018-07-13,21.2305
2018-07-16,19.8072
2018-07-17,19.827
2018-07-18,20.1334
2018-07-19,20.3014
2018-07-20,20.2421
2018-07-23,20.2224
2018-07-24,20.6078
2018-07-25,20.934
2018-07-26,20.9933
2018-07-27,20.5881
2018-07-30,20.8648
2018-07-31,20.8747
2018-08-01,20.0741
2018-08-02,20.5881
2018-08-03,20.3014
2018-08-06,20.3706
2018-08-07,20.4794
2018-08-08,19.9061
2018-08-09,19.8567
2018-08-10,20.1433
2018-08-13,19.8468
2018-08-14,20.2629
2018-08-15,18.8262
2018-08-16,19.1433
2018-08-17,19.6486
2018-08-20,19.7972
2018-08-21,20.0251
2018-08-22,20.6791
2018-08-23,20.5899
2018-08-24,20.4215
2018-08-27,20.6791
2018-08-28,20.5107
2018-08-29,21.5709
2018-08-30,21.4322
2018-08-31,21.3132
2018-09-04,20.8674
2018-09-05,21.016
2018-09-06,20.1738
2018-09-07,20.3323
2018-09-10,20.1639
2018-09-11,20.3521
2018-09-12,20.3719
2018-09-13,20.4809
2018-09-14,20.689
2018-09-17,20.6791
2018-09-18,21.3033
2018-09-19,21.561
2018-09-20,21.3529
2018-09-21,21.66
2018-09-24,22.1357
2018-09-25,22.2843
2018-09-26,22.2347
2018-09-27,22.5221
2018-09-28,23.0671
2018-10-01,23.6418
2018-10-02,23.295
2018-10-03,23.7706
2018-10-04,23.503
2018-10-05,23.1959
2018-10-08,22.6707
2018-10-09,22.7203
2018-10-10,20.9664
2018-10-11,19.7774
2018-10-12,20.3323
2018-10-15,20.6494
2018-10-16,20.9863
2018-10-17,20.6989
2018-10-18,20.362
2018-10-19,20.4809
2018-10-22,20.2729
2018-10-23,19.3018
2018-10-24,18.1822
2018-10-25,18.6181
2018-10-26,18.519
2018-10-29,17.984
2018-10-30,18.5091
2018-10-31,18.8163
2018-11-01,18.4398
2018-11-02,18.0434
2018-11-05,18.519
2018-11-06,18.1623
2018-11-07,18.3407
2018-11-08,17.8849
2018-11-09,17.6768
2018-11-12,17.1021
2018-11-13,16.3193
2018-11-14,16.5274
2018-11-15,16.9931
2018-11-16,17.0328
2018-11-19,16.9634
2018-11-20,15.8305
2018-11-21,16.3075
2018-11-23,15.5523
2018-11-26,16.1287
2018-11-27,15.9995
2018-11-28,16.387
2018-11-29,16.4467
2018-11-30,16.5858
2018-12-03,17.4404
2018-12-04,16.715
2018-12-06,16.1187
2018-12-07,15.9498
2018-12-10,15.2045
2018-12-11,15.2343
2018-12-12,15.4231
2018-12-13,15.5225
2018-12-14,14.9461
2018-12-17,14.6281
2018-12-18,14.1511
2018-12-19,13.7735
2018-12-20,13.525
2018-12-21,13.366
2018-12-24,12.5809
2018-12-26,14.0815
2018-12-27,14.2008
2018-12-28,13.9921
2018-12-31,14.2505
2019-01-02,14.6281
2019-01-03,14.5287
2019-01-04,15.3138
2019-01-07,15.5225
2019-01-08,15.3833
2019-01-09,15.9697
2019-01-10,16.2479
2019-01-11,16.0094
2019-01-14,15.7312
2019-01-15,15.7312
2019-01-16,15.443
2019-01-17,15.6914
2019-01-18,15.9995
2019-01-22,15.592
2019-01-23,15.4628
2019-01-24,15.7013
2019-01-25,15.8007
2019-01-28,15.7312
2019-01-29,15.8107
2019-01-30,15.92
2019-01-31,15.6914
2019-02-01,15.9001
2019-02-04,16.0492
2019-02-05,15.8405
2019-02-06,15.8107
2019-02-07,15.1746
2019-02-08,15.0355
2019-02-11,15.1746
2019-02-12,15.3535
2019-02-13,15.4529
2019-02-14,16.8044
2019-02-15,16.9733
2019-02-19,16.9733
2019-02-20,17.0232
2019-02-21,16.6245
2019-02-22,16.8338
2019-02-25,16.6145
2019-02-26,16.465
2019-02-27,16.7341
2019-02-28,16.5448
2019-03-01,17.0232
2019-03-04,17.2225
2019-03-05,17.2125
2019-03-06,16.8039
2019-03-07,16.8039
2019-03-08,16.2159
2019-03-11,16.5149
2019-03-12,16.8438
2019-03-13,17.2624
2019-03-14,17.2026
2019-03-15,17.2125
2019-03-18,17.3321
2019-03-19,17.063
2019-03-20,17.5414
2019-03-21,17.6311
2019-03-22,16.6245
2019-03-25,16.6544
2019-03-26,17.0531
2019-03-27,17.0032
2019-03-28,16.764
2019-03-29,16.6544
2019-04-01,17.3321
2019-04-02,17.073
2019-04-03,16.8737
2019-04-04,17.083
2019-04-05,17.6411
2019-04-08,17.5414
2019-04-09,17.2026
2019-04-10,17.3919
2019-04-11,17.1328
2019-04-12,17.7009
2019-04-15,17.3222
2019-04-16,17.4119
2019-04-17,17.681
2019-04-18,17.5614
2019-04-22,18.7175
2019-04-23,18.6179
2019-04-24,18.0896
2019-04-25,17.8703
2019-04-26,17.3222
2019-04-29,17.0929
2019-04-30,16.9833
2019-05-01,16.475
2019-05-02,15.4684
2019-05-03,15.6278
2019-05-06,15.7175
2019-05-07,15.4584
2019-05-08,15.5082
2019-05-09,15.2192
2019-05-10,15.2092
2019-05-13,14.98
2019-05-14,15.46
2019-05-15,15.43
2019-05-16,15.71
2019-05-17,15.47
2019-05-20,15.54
2019-05-21,15.84
2019-05-22,15.43
2019-05-23,14.56
2019-05-24,14.43
2019-05-28,14.33
2019-05-29,14.09
2019-05-30,13.62
2019-05-31,13.15
2019-06-03,13.33
2019-06-04,13.45
2019-06-05,13.19
2019-06-06,13.25
2019-06-07,13.31
2019-06-10,13.45
2019-06-11,13.41
2019-06-12,13.02
2019-06-13,13.21
2019-06-14,12.935
2019-06-17,13.35
2019-06-18,13.61
2019-06-19,13.585
2019-06-20,14.135
2019-06-21,14.045
2019-06-24,13.905
2019-06-25,13.96
2019-06-26,14.395
2019-06-27,14.2
2019-06-28,14.13
2019-07-01,14.245
2019-07-02,13.59
2019-07-03,13.66
2019-07-04,13.66
2019-07-05,13.74
2019-07-08,13.575
2019-07-09,13.53
2019-07-10,13.915
2019-07-11,13.645
2019-07-12,13.955
2019-07-15,13.475
2019-07-16,13.34
2019-07-17,13.24
2019-07-18,13.375
2019-07-19,13.665
2019-07-22,13.645
2019-07-23,13.745
2019-07-24,13.98
2019-07-25,13.74
2019-07-26,13.755
2019-07-29,13.495
2019-07-30,14.1
2019-07-31,14.1
2019-08-01,13.53
2019-08-02,13.29
2019-08-05,12.5
2019-08-06,12.16
2019-08-07,12.105
2019-08-08,12.815
2019-08-09,12.86
2019-08-12,12.71
2019-08-13,12.965
2019-08-14,12.31
2019-08-15,12.02
2019-08-16,12.465
2019-08-19,12.91
2019-08-20,12.63
2019-08-21,12.405
2019-08-22,12.27
2019-08-23,11.735
2019-08-26,11.615
2019-08-27,11.53
2019-08-28,11.94
2019-08-29,12.22
2019-08-30,11.84
2019-09-02,11.84
2019-09-03,11.745
2019-09-04,12.125
2019-09-05,12.545
2019-09-06,12.405
2019-09-09,12.88
2019-09-10,12.82
2019-09-11,12.99
2019-09-12,12.58
2019-09-13,12.68
2019-09-16,14.115
2019-09-17,13.055
2019-09-18,13.06
2019-09-19,13.06
2019-09-20,13.19
2019-09-23,13.13
2019-09-24,12.24
2019-09-25,12.34
2019-09-26,11.935
2019-09-27,12.195
2019-09-30,12.29
2019-10-01,11.795
2019-10-02,11.295
2019-10-03,11.635
2019-10-04,11.56
2019-10-07,11.465
2019-10-08,11.11
2019-10-09,11.185
2019-10-10,11.39
2019-10-11,11.74
2019-10-14,11.765
2019-10-15,11.945
2019-10-16,11.635
2019-10-17,11.545
2019-10-18,11.28
2019-10-21,11.515
2019-10-22,11.715
2019-10-23,11.985
2019-10-24,11.945
2019-10-25,11.955
2019-10-28,11.945
2019-10-29,12.025
2019-10-30,11.56
2019-10-31,11.515
2019-11-01,12.01
2019-11-04,12.535
2019-11-05,12.635
2019-11-06,12.155
2019-11-07,12.555
2019-11-08,12.525
2019-11-11,12.13
2019-11-12,11.985
2019-11-13,11.88
2019-11-14,11.855
2019-11-15,12.075
2019-11-18,11.755
2019-11-19,11.455
2019-11-20,11.675
2019-11-21,11.895
2019-11-22,12.215
2019-11-25,12.125
