date,close
2014-06-13,44.53
2014-06-16,44.28
2014-06-17,42.82
2014-06-18,42.92
2014-06-19,43.135
2014-06-20,43.75
2014-06-23,43.28
2014-06-24,43.43
2014-06-25,43.33
2014-06-26,43.25
2014-06-27,43.31
2014-06-30,43.93
2014-07-01,44.73
2014-07-02,44.94
2014-07-03,45.36
2014-07-07,45
2014-07-08,44.96
2014-07-09,45.16
2014-07-10,44.38
2014-07-11,44.05
2014-07-14,44.41
2014-07-15,44.54
2014-07-16,44.68
2014-07-17,45.17
2014-07-18,45.26
2014-07-21,45.27
2014-07-22,46.63
2014-07-23,46.52
2014-07-24,46.5
2014-07-25,45.57
2014-07-28,44.17
2014-07-29,42.97
2014-07-30,45.2
2014-07-31,45.65
2014-08-01,45.66
2014-08-04,46.07
2014-08-05,46.02
2014-08-06,45.77
2014-08-07,45.65
2014-08-08,46
2014-08-11,46.84
2014-08-12,47.11
2014-08-13,47.86
2014-08-14,47.72
2014-08-15,48
2014-08-18,49.11
2014-08-19,49.08
2014-08-20,48.15
2014-08-21,47.78
2014-08-22,48.06
2014-08-25,48.54
2014-08-26,47.58
2014-08-27,47.69
2014-08-28,47.18
2014-08-29,47.47
2014-09-02,48.94
2014-09-03,49.9
2014-09-04,50.9
2014-09-05,51.04
2014-09-08,51.14
2014-09-09,49.93
2014-09-10,50.4
2014-09-11,51.02
2014-09-12,49.95
2014-09-15,48.37
2014-09-16,48.83
2014-09-17,52.53
2014-09-18,53.56
2014-09-19,51.17
2014-09-22,50.57
2014-09-23,50
2014-09-24,49.83
2014-09-25,49.88
2014-09-26,50.05
2014-09-29,50.66
2014-09-30,49.56
2014-10-01,48.53
2014-10-02,49.68
2014-10-03,50
2014-10-06,49.64
2014-10-07,48.05
2014-10-08,48.35
2014-10-09,47.5
2014-10-10,46.97
2014-10-13,46.26
2014-10-14,46.7
2014-10-15,47.35
2014-10-16,47.82
2014-10-17,48.71
2014-10-20,48.58
2014-10-21,50.54
2014-10-22,49.29
2014-10-23,50.39
2014-10-24,50.23
2014-10-27,50.95
2014-10-28,48.96
2014-10-29,49.82
2014-10-30,50.94
2014-10-31,49.02
2014-11-03,50.12
2014-11-04,51.98
2014-11-05,51.39
2014-11-06,52.38
2014-11-07,51.36
2014-11-10,52.75
2014-11-11,53.16
2014-11-12,53.71
2014-11-13,53.23
2014-11-14,52.13
2014-11-17,52.43
2014-11-18,52.84
2014-11-19,53.07
2014-11-20,53.51
2014-11-21,53.57
2014-11-24,54.88
2014-11-25,54.53
2014-11-26,54.7
2014-11-28,55.47
2014-12-01,53.81
2014-12-02,55.38
2014-12-03,55.25
2014-12-04,56.53
2014-12-05,56.41
2014-12-08,54.73
2014-12-09,54.96
2014-12-10,54.21
2014-12-11,55.09
2014-12-12,54.19
2014-12-15,54.19
2014-12-16,53.31
2014-12-17,53.01
2014-12-18,53.63
2014-12-19,53.44
2014-12-22,54.73
2014-12-23,54.73
2014-12-24,55.04
2014-12-26,55.47
2014-12-29,55.1
2014-12-30,55.73
2014-12-31,55.36
2015-01-02,55.71
2015-01-05,53.35
2015-01-06,51.2
2015-01-07,51.18
2015-01-08,52.37
2015-01-09,51.21
2015-01-12,51.03
2015-01-13,51.43
2015-01-14,49.5
2015-01-15,49.28
2015-01-16,49.97
2015-01-20,48.33
2015-01-21,44.54
2015-01-22,47.03
2015-01-23,46.61
2015-01-26,45.27
2015-01-27,45.05
2015-01-28,44.68
2015-01-29,43.41
2015-01-30,42.11
2015-02-02,41.87
2015-02-03,43.01
2015-02-04,42.12
2015-02-05,43.49
2015-02-06,44.72
2015-02-09,44.12
2015-02-10,44.57
2015-02-11,44.31
2015-02-12,44.61
2015-02-13,45.59
2015-02-17,45.4
2015-02-18,45.58
2015-02-19,46.11
2015-02-20,46.14
2015-02-23,46.68
2015-02-24,46.7
2015-02-25,46.66
2015-02-26,46.81
2015-02-27,46.03
2015-03-02,45.8
2015-03-03,44.37
2015-03-04,43.93
2015-03-05,44.8
2015-03-06,44.65
2015-03-09,44.7
2015-03-10,44.39
2015-03-11,44.3
2015-03-12,44.16
2015-03-13,44.97
2015-03-16,45.45
2015-03-17,45.52
2015-03-18,44.97
2015-03-19,45.13
2015-03-20,45.88
2015-03-23,45.91
2015-03-24,44.51
2015-03-25,43.47
2015-03-26,44.4
2015-03-27,43.98
2015-03-30,44.02
2015-03-31,44.3
2015-04-01,43.76
2015-04-02,41.07
2015-04-06,40.07
2015-04-07,39.9
2015-04-08,39.68
2015-04-09,40.23
2015-04-10,41.95
2015-04-13,42.06
2015-04-14,41.49
2015-04-15,42.19
2015-04-16,42.3
2015-04-17,42.04
2015-04-20,43.11
2015-04-21,43.1
2015-04-22,42.94
2015-04-23,43.09
2015-04-24,42.99
2015-04-27,42.5
2015-04-28,43.07
2015-04-29,40.97
2015-04-30,40.75
2015-05-01,41.08
2015-05-04,41
2015-05-05,40.99
2015-05-06,41.12
2015-05-07,41.64
2015-05-08,42
2015-05-11,41.75
2015-05-12,41.61
2015-05-13,41.72
2015-05-14,41.5
2015-05-15,40.99
2015-05-18,42.16
2015-05-19,41.65
2015-05-20,41.9
2015-05-21,42.65
2015-05-22,42.37
2015-05-26,41.85
2015-05-27,41.81
2015-05-28,41.49
2015-05-29,40.94
2015-06-01,41.74
2015-06-02,41.14
2015-06-03,41.57
2015-06-04,41.72
2015-06-05,42.75
2015-06-08,41.54
2015-06-09,41.01
2015-06-10,41.5
2015-06-11,41.93
2015-06-12,42.12
2015-06-15,41.63
2015-06-16,40.15
2015-06-17,39.86
2015-06-18,40.55
2015-06-19,40.32
2015-06-22,40.19
2015-06-23,39.8
2015-06-24,38.3
2015-06-25,38.15
2015-06-26,38.61
2015-06-29,38.43
2015-06-30,39.29
2015-07-01,39.24
2015-07-02,39.2
2015-07-06,39.08
2015-07-07,39.68
2015-07-08,38.35
2015-07-09,39.25
2015-07-10,39.63
2015-07-13,40.88
2015-07-14,39.19
2015-07-15,38.86
2015-07-16,39.44
2015-07-17,39.84
2015-07-20,39.4
2015-07-21,39.97
2015-07-22,38.94
2015-07-23,38.35
2015-07-24,37.74
2015-07-27,37.435
2015-07-28,37.9
2015-07-29,42.38
2015-07-30,42.53
2015-07-31,43.42
2015-08-03,45.04
2015-08-04,44.13
2015-08-05,44.14
2015-08-06,43.3
2015-08-07,41.62
2015-08-10,42.48
2015-08-11,41.93
2015-08-12,41.39
2015-08-13,41.31
2015-08-14,41.57
2015-08-17,41.2
2015-08-18,41.5
2015-08-19,40.5
2015-08-20,38.9
2015-08-21,37.87
2015-08-24,37.02
2015-08-25,35.78
2015-08-26,36.69
2015-08-27,37.6
2015-08-28,37.61
2015-08-31,37.55
2015-09-01,36.11
2015-09-02,35.75
2015-09-03,35.75
2015-09-04,35.67
2015-09-08,36.38
2015-09-09,36.36
2015-09-10,36.74
2015-09-11,36.24
2015-09-14,35.63
2015-09-15,36.44
2015-09-16,36.42
2015-09-17,35.48
2015-09-18,34.26
2015-09-21,34.04
2015-09-22,32.91
2015-09-23,32.35
2015-09-24,31.21
2015-09-25,31.68
2015-09-28,31.08
2015-09-29,30.99
2015-09-30,30.95
2015-10-01,30.74
2015-10-02,31
2015-10-05,31.7
2015-10-06,31.76
2015-10-07,32.1
2015-10-08,32.85
2015-10-09,33.19
2015-10-12,32.75
2015-10-13,31.94
2015-10-14,32.52
2015-10-15,32.89
2015-10-16,32.6
2015-10-19,32.95
2015-10-20,33.05
2015-10-21,33.43
2015-10-22,33.52
2015-10-23,32.93
2015-10-26,32.6
2015-10-27,30.01
2015-10-28,23.72
2015-10-29,22.9
2015-10-30,23.61
2015-11-02,23.67
2015-11-03,24.37
2015-11-04,24.13
2015-11-05,24
2015-11-06,24.5
2015-11-09,23.56
2015-11-10,24.13
2015-11-11,23.94
2015-11-12,23.37
2015-11-13,23.32
2015-11-16,23.46
2015-11-17,23.47
2015-11-18,23.7
2015-11-19,23.54
2015-11-20,23.4
2015-11-23,23.95
2015-11-24,24.24
2015-11-25,24.61
2015-11-27,24.84
2015-11-30,24.51
2015-12-01,24.58
2015-12-02,23.86
2015-12-03,23.35
2015-12-04,22.06
2015-12-07,21.43
2015-12-08,21.19
2015-12-09,21.21
2015-12-10,21.75
2015-12-11,21.36
2015-12-14,21.42
2015-12-15,22.09
2015-12-16,23.29
2015-12-17,23.47
2015-12-18,22.595
2015-12-21,21.98
2015-12-22,22
2015-12-23,21.88
2015-12-24,22.29
2015-12-28,21.99
2015-12-29,22.04
2015-12-30,21.59
2015-12-31,22.25
2016-01-04,21.79
2016-01-05,22.43
2016-01-06,21.64
2016-01-07,20.05
2016-01-08,19.92
2016-01-11,19.95
2016-01-12,19.8
2016-01-13,19.8
2016-01-14,19.51
2016-01-15,19.67
2016-01-19,19.32
2016-01-20,19.36
2016-01-21,20.2
2016-01-22,20.92
2016-01-25,20.44
2016-01-26,21.82
2016-01-27,21.59
2016-01-28,20.85
2016-01-29,21.39
2016-02-01,21.81
2016-02-02,20.92
2016-02-03,20.51
2016-02-04,22.53
2016-02-05,25.46
2016-02-08,26.41
2016-02-09,27.45
2016-02-10,26.65
2016-02-11,27
2016-02-12,26.84
2016-02-16,27.31
2016-02-17,26.27
2016-02-18,26
2016-02-19,25.87
2016-02-22,26.83
2016-02-23,26.55
2016-02-24,25.82
2016-02-25,25.56
2016-02-26,26.15
2016-02-29,26.25
2016-03-01,27.5
2016-03-02,26.66
2016-03-03,26.55
2016-03-04,26.79
2016-03-07,27.06
2016-03-08,26.12
2016-03-09,26.14
2016-03-10,26.23
2016-03-11,27.37
2016-03-14,27.1
2016-03-15,26.41
2016-03-16,27.1
2016-03-17,28.98
2016-03-18,29.07
2016-03-21,29.77
2016-03-22,29.13
2016-03-23,28.3
2016-03-24,28.49
2016-03-28,27.49
2016-03-29,28.36
2016-03-30,28.31
2016-03-31,28.15
2016-04-01,28.3
2016-04-04,27.69
2016-04-05,26.99
2016-04-06,26.83
2016-04-07,26.95
2016-04-08,27.32
2016-04-11,26.99
2016-04-12,26.97
2016-04-13,27.95
2016-04-14,27.69
2016-04-15,27.88
2016-04-18,28.34
2016-04-19,29.1
2016-04-20,29.84
2016-04-21,29.2
2016-04-22,29.5
2016-04-25,28.88
2016-04-26,29.65
2016-04-27,32
2016-04-28,30.06
2016-04-29,28.92
2016-05-02,28.76
2016-05-03,28.11
2016-05-04,26.84
2016-05-05,26.47
2016-05-06,27.12
2016-05-09,26.92
2016-05-10,27.15
2016-05-11,26.77
2016-05-12,26.12
2016-05-13,24.74
2016-05-16,24.52
2016-05-17,24.11
2016-05-18,24.11
2016-05-19,24.68
2016-05-20,25.17
2016-05-23,24.8
2016-05-24,25.39
2016-05-25,26.07
2016-05-26,25.93
2016-05-27,25.9
2016-05-31,26.07
2016-06-01,25.93
2016-06-02,25.63
2016-06-03,25.69
2016-06-06,25.89
2016-06-07,25.79
2016-06-08,26.77
2016-06-09,26.4
2016-06-10,25.63
2016-06-13,25.42
2016-06-14,25.4
2016-06-15,24.94
2016-06-16,25.04
2016-06-17,25.86
2016-06-20,26.71
2016-06-21,25.56
2016-06-22,25.31
2016-06-23,26.01
2016-06-24,24.91
2016-06-27,23.75
2016-06-28,23.75
2016-06-29,24.74
2016-06-30,25.14
2016-07-01,25.75
2016-07-05,24.68
2016-07-06,24.51
2016-07-07,24.41
2016-07-08,25.71
2016-07-11,26.23
2016-07-12,26.6
2016-07-13,27.16
2016-07-14,26.2
2016-07-15,26.22
2016-07-18,25.81
2016-07-19,25.29
2016-07-20,25.29
2016-07-21,24.76
2016-07-22,25.81
2016-07-25,24.91
2016-07-26,25.79
2016-07-27,25.82
2016-07-28,26.73
2016-07-29,28.89
2016-08-01,28.92
2016-08-02,28.82
2016-08-03,29.72
2016-08-04,29.3
2016-08-05,30.53
2016-08-08,30.47
2016-08-09,29.86
2016-08-10,29.32
2016-08-11,29.36
2016-08-12,29.5
2016-08-15,29.53
2016-08-16,29.92
2016-08-17,29.87
2016-08-18,30.14
2016-08-19,30.33
2016-08-22,30.02
2016-08-23,30.74
2016-08-24,30.25
2016-08-25,29.55
2016-08-26,29.42
2016-08-29,29.5
2016-08-30,29.94
2016-08-31,30.43
2016-09-01,30.52
2016-09-02,30.66
2016-09-06,30.42
2016-09-07,30.79
2016-09-08,31.73
2016-09-09,29.94
2016-09-12,30.06
2016-09-13,29.4
2016-09-14,29.47
2016-09-15,30.78
2016-09-16,30.69
2016-09-19,30.84
2016-09-20,30.15
2016-09-21,30.49
2016-09-22,30.71
2016-09-23,30.18
2016-09-26,29.56
2016-09-27,29.02
2016-09-28,29.55
2016-09-29,29.21
2016-09-30,29.96
2016-10-03,29.87
2016-10-04,29.66
2016-10-05,29.86
2016-10-06,29.85
2016-10-07,29.33
2016-10-10,29.78
2016-10-11,29.7
2016-10-12,29.83
2016-10-13,29.18
2016-10-14,29.03
2016-10-17,29
2016-10-18,29.11
2016-10-19,28.97
2016-10-20,29.01
2016-10-21,29.29
2016-10-24,29.8
2016-10-25,29.15
2016-10-26,33.275
2016-10-27,34.75
2016-10-28,35.5
2016-10-31,35.65
2016-11-01,35
2016-11-02,34.7
2016-11-03,35.3
2016-11-04,34.9
2016-11-07,37.4
2016-11-08,38.2
2016-11-09,39.55
2016-11-10,40.2
2016-11-11,40.55
2016-11-14,41.75
2016-11-15,41.8
2016-11-16,41.95
2016-11-17,42
2016-11-18,41.025
2016-11-21,41
2016-11-22,41.3
2016-11-23,42.35
2016-11-25,42.4
2016-11-28,42
2016-11-29,41.7
2016-11-30,41.75
2016-12-01,43.1
2016-12-02,43.55
2016-12-05,44.05
2016-12-06,45.35
2016-12-07,46.7
2016-12-08,47.8
2016-12-09,47.55
2016-12-12,47.35
2016-12-13,45.95
2016-12-14,46.5
2016-12-15,47.75
2016-12-16,46.65
2016-12-19,46.25
2016-12-20,46.4
2016-12-21,45.85
2016-12-22,44.9
2016-12-23,45
2016-12-27,45.45
2016-12-28,44.7
2016-12-29,44.65
2016-12-30,44.15
2017-01-03,44.9
2017-01-04,45.05
2017-01-05,43.95
2017-01-06,44.875
2017-01-09,44.1
2017-01-10,44.8
2017-01-11,46.05
2017-01-12,46.1
2017-01-13,47.15
2017-01-17,46.95
2017-01-18,47.7
2017-01-19,47.45
2017-01-20,47.55
2017-01-23,47.4
2017-01-24,49.05
2017-01-25,50.3
2017-01-26,49.3
2017-01-27,49.75
2017-01-30,48.85
2017-01-31,48.05
2017-02-01,48.7
2017-02-02,47.85
2017-02-03,49.45
2017-02-06,47
2017-02-07,46.35
2017-02-08,46.6
2017-02-09,47.65
2017-02-10,48.55
2017-02-13,48.8
2017-02-14,47.6
2017-02-15,48.15
2017-02-16,48.55
2017-02-17,48.6
2017-02-21,49.4
2017-02-22,48.95
2017-02-23,48.25
2017-02-24,48.3
2017-02-27,48.9
2017-02-28,48.35
2017-03-01,50
2017-03-02,48.2
2017-03-03,47.95
2017-03-06,47.65
2017-03-07,46.8
2017-03-08,46.1
2017-03-09,45
2017-03-10,45.75
2017-03-13,45.65
2017-03-14,44.75
2017-03-15,45.65
2017-03-16,45.2
2017-03-17,45.65
2017-03-20,45.5
2017-03-21,43.65
2017-03-22,42.8
2017-03-23,42.75
2017-03-24,42.7
2017-03-27,42.7
2017-03-28,44.25
2017-03-29,44.05
2017-03-30,44.4
2017-03-31,44.3
2017-04-03,43.35
2017-04-04,43.9
2017-04-05,43.5
2017-04-06,43.8
2017-04-07,43.4
2017-04-10,44.5
2017-04-11,43.9
2017-04-12,42.3
2017-04-13,41.6
2017-04-17,42.75
2017-04-18,42.8
2017-04-19,42.9
2017-04-20,44.15
2017-04-21,45.3
2017-04-24,47.3
2017-04-25,47.55
2017-04-26,47.55
2017-04-27,48.25
2017-04-28,48.15
2017-05-01,47.15
2017-05-02,46.6
2017-05-03,45.6
2017-05-04,45.35
2017-05-05,45.1
2017-05-08,44.3
2017-05-09,44.35
2017-05-10,44.45
2017-05-11,43.65
2017-05-12,42.8
2017-05-15,43.2
2017-05-16,43.9
2017-05-17,42
2017-05-18,42.85
2017-05-19,43.65
2017-05-22,44.15
2017-05-23,45.2
2017-05-24,45.75
2017-05-25,46.9
2017-05-26,46.2
2017-05-30,46.25
2017-05-31,46.2
2017-06-01,47.05
2017-06-02,48.85
2017-06-05,49.25
2017-06-06,49.4
2017-06-07,49.9
2017-06-08,50.5
2017-06-09,50.45
2017-06-12,51.05
2017-06-13,52.1
2017-06-14,50.6
2017-06-15,50.5
2017-06-16,49.75
2017-06-19,49.45
2017-06-20,47.7
2017-06-21,47.05
2017-06-22,46.55
2017-06-23,47.25
2017-06-26,47.85
2017-06-27,49
2017-06-28,50.275
2017-06-29,50.85
2017-06-30,51.3
2017-07-03,52.1
2017-07-05,52.75
2017-07-06,51.95
2017-07-07,52.95
2017-07-10,53.1
2017-07-11,51.85
2017-07-12,54.1
2017-07-13,53.3
2017-07-14,53.55
2017-07-17,52.6
2017-07-18,51.85
2017-07-19,52.3
2017-07-20,51.65
2017-07-21,51.85
2017-07-24,52.2
2017-07-25,53.7
2017-07-26,53.6
2017-07-27,51.8
2017-07-28,54.7
2017-07-31,54.35
2017-08-01,53.75
2017-08-02,53.7
2017-08-03,53.1
2017-08-04,53.45
2017-08-07,53.65
2017-08-08,52.95
2017-08-09,53.3
2017-08-10,52.95
2017-08-11,53.8
2017-08-14,54
2017-08-15,54.6
2017-08-16,53.25
2017-08-17,52.8
2017-08-18,52.65
2017-08-21,51.95
2017-08-22,52.15
2017-08-23,51.85
2017-08-24,51.35
2017-08-25,52.65
2017-08-28,53.65
2017-08-29,54.4
2017-08-30,56.15
2017-08-31,56.55
2017-09-01,57.55
2017-09-05,57.7
2017-09-06,58.25
2017-09-07,58.3
2017-09-08,58.3
2017-09-11,57.4
2017-09-12,57.6
2017-09-13,57.1
2017-09-14,57.55
2017-09-15,58.7
2017-09-18,59.35
2017-09-19,59.25
2017-09-20,59.7
2017-09-21,60.2
2017-09-22,60.9
2017-09-25,60.5
2017-09-26,60.5
2017-09-27,61.9
2017-09-28,61.95
2017-09-29,62.65
2017-10-02,62.8
2017-10-03,62.15
2017-10-04,61.05
2017-10-05,59.75
2017-10-06,59.65
2017-10-09,59.45
2017-10-10,58.95
2017-10-11,59.4
2017-10-12,59.7
2017-10-13,57.4
2017-10-16,56.65
2017-10-17,56.75
2017-10-18,58.15
2017-10-19,60.55
2017-10-20,62.5
2017-10-23,60.45
2017-10-24,60.9
2017-10-25,60.9
2017-10-26,62.55
2017-10-27,66.3
2017-10-30,64.35
2017-10-31,64.8
2017-11-01,64.4
2017-11-02,65.35
2017-11-03,64.9
2017-11-06,64.3
2017-11-07,63.55
2017-11-08,62.65
2017-11-09,61.9
2017-11-10,61.15
2017-11-13,61.15
2017-11-14,62.55
2017-11-15,60.6
2017-11-16,61.45
2017-11-17,60.9
2017-11-20,62
2017-11-21,64.1
2017-11-22,63.65
2017-11-24,63.35
2017-11-27,63.35
2017-11-28,64.2
2017-11-29,65.5
2017-11-30,65.8
2017-12-01,65.45
2017-12-04,67.75
2017-12-05,66.6
2017-12-06,67.6
2017-12-07,68.35
2017-12-08,68.8
2017-12-11,67.95
2017-12-12,68.15
2017-12-13,69
2017-12-14,68.2
2017-12-15,69.6
2017-12-18,70.1
2017-12-19,69.5
2017-12-20,69.6
2017-12-21,69.25
2017-12-22,70.8
2017-12-26,70.4
2017-12-27,70.55
2017-12-28,71.5
2017-12-29,70.75
2018-01-02,71.5
2018-01-03,71.05
2018-01-04,71.2
2018-01-05,71.05
2018-01-08,71.75
2018-01-09,73.75
2018-01-10,74
2018-01-11,75.75
2018-01-12,75.85
2018-01-16,75.55
2018-01-17,76.15
2018-01-18,77.75
2018-01-19,78.1
2018-01-22,77.85
2018-01-23,78.2
2018-01-24,77.85
2018-01-25,79.6
2018-01-26,78.15
2018-01-29,77.2
2018-01-30,76.75
2018-01-31,75.55
2018-02-01,76.6
2018-02-02,77.05
2018-02-05,72.825
2018-02-06,73.35
2018-02-07,73.5
2018-02-08,70.85
2018-02-09,70
2018-02-12,70.2
2018-02-13,71.5
2018-02-14,74
2018-02-15,73.35
2018-02-16,74.05
2018-02-20,72.1
2018-02-21,72.85
2018-02-22,73.25
2018-02-23,74.05
2018-02-26,73.6
2018-02-27,72.6
2018-02-28,72.65
2018-03-01,71.1
2018-03-02,70.7
2018-03-05,70.5
2018-03-06,70.85
2018-03-07,71.1
2018-03-08,72.55
2018-03-09,76.1
2018-03-12,76.3
2018-03-13,76.35
2018-03-14,76.2
2018-03-15,76.15
2018-03-16,76.3
2018-03-19,75.85
2018-03-20,77.2
2018-03-21,77.45
2018-03-22,74.95
2018-03-23,74.15
2018-03-26,76.5
2018-03-27,73.9
2018-03-28,73.55
2018-03-29,75.15
2018-04-02,73.95
2018-04-03,76
2018-04-04,75.35
2018-04-05,74.25
2018-04-06,72
2018-04-09,71.1
2018-04-10,71.3
2018-04-11,72.8
2018-04-12,73.6
2018-04-13,73.7
2018-04-16,76.55
2018-04-17,77.55
2018-04-18,78
2018-04-19,75.95
2018-04-20,73.85
2018-04-23,74.3
2018-04-24,71.8
2018-04-25,71.65
2018-04-26,66.9
2018-04-27,67.15
2018-04-30,66.05
2018-05-01,66.2
2018-05-02,69.3
2018-05-03,69.3
2018-05-04,70.3
2018-05-07,71.7
2018-05-08,73.6
2018-05-09,74.5
2018-05-10,74.9
2018-05-11,76.95
2018-05-14,76.9
2018-05-15,74.85
2018-05-16,75.65
2018-05-17,76.1
2018-05-18,76.7
2018-05-21,80.35
2018-05-22,78.6
2018-05-23,79.25
2018-05-24,81.575
2018-05-25,82.25
2018-05-29,82
2018-05-30,84.05
2018-05-31,82.4
2018-06-01,82.5
2018-06-04,80.15
2018-06-05,80.2
2018-06-06,80.05
2018-06-07,82.75
2018-06-08,83.65
2018-06-11,85.9
2018-06-12,86.7
2018-06-13,84.05
2018-06-14,82.8
2018-06-15,84.1
2018-06-18,83.5
2018-06-19,81.85
2018-06-20,82.6
2018-06-21,81.7
2018-06-22,82.75
2018-06-25,79.6
2018-06-26,79.95
2018-06-27,79.9
2018-06-28,81.15
2018-06-29,80.85
2018-07-02,80.45
2018-07-03,79.75
2018-07-05,79.55
2018-07-06,80.9
2018-07-09,81.95
2018-07-10,79.25
2018-07-11,76.8
2018-07-12,77.2
2018-07-13,76.55
2018-07-16,74.6
2018-07-17,76.35
2018-07-18,78.45
2018-07-19,79.3
2018-07-20,78.15
2018-07-23,78.6
2018-07-24,75.1
2018-07-25,77.2
2018-07-26,74.35
2018-07-27,72.9
2018-07-30,73.35
2018-07-31,75.35
2018-08-01,74.85
2018-08-02,76.45
2018-08-03,75.6
2018-08-06,76.8
2018-08-07,75.6
2018-08-08,76.1
2018-08-09,76.7
2018-08-10,76.3
2018-08-13,75.85
2018-08-14,76.05
2018-08-15,75.75
2018-08-16,76.5
2018-08-17,77.2
2018-08-20,77.85
2018-08-21,78.5
2018-08-22,77.95
2018-08-23,77.35
2018-08-24,77.05
2018-08-27,78.5
2018-08-28,77.6
2018-08-29,79.65
2018-08-30,79
2018-08-31,79.25
2018-09-04,78.15
2018-09-05,79.25
2018-09-06,78.7
2018-09-07,78.85
2018-09-10,83.6
2018-09-11,81.6
2018-09-12,81.4
2018-09-13,80.4
2018-09-14,81.4
2018-09-17,79.7
2018-09-18,80
2018-09-19,79.65
2018-09-20,79.15
2018-09-21,77.25
2018-09-24,77
2018-09-25,77.4
2018-09-26,77.85
2018-09-27,76.5
2018-09-28,76.45
2018-10-01,76
2018-10-02,72.77
2018-10-03,73.7
2018-10-04,71.34
2018-10-05,68.35
2018-10-08,67.42
2018-10-09,66.34
2018-10-10,65.08
2018-10-11,64.07
2018-10-12,63.95
2018-10-15,62.9
2018-10-16,64.69
2018-10-17,63.82
2018-10-18,61.96
2018-10-19,60.45
2018-10-22,60.36
2018-10-23,59.29
2018-10-24,56.9
2018-10-25,59.2
2018-10-26,57.8
2018-10-29,57.06
2018-10-30,58.18
2018-10-31,62.86
2018-11-01,64.2
2018-11-02,63.78
2018-11-05,63.75
2018-11-06,64.69
2018-11-07,65.86
2018-11-08,65.69
2018-11-09,63.71
2018-11-12,62.85
2018-11-13,63.11
2018-11-14,62.8
2018-11-15,64
2018-11-16,63.12
2018-11-19,62.54
2018-11-20,59.62
2018-11-21,61.14
2018-11-23,60.87
2018-11-26,61.96
2018-11-27,59.36
2018-11-28,62.31
2018-11-29,58.24
2018-11-30,60.31
2018-12-03,58.6
2018-12-04,55.08
2018-12-06,55.26
2018-12-07,54.74
2018-12-10,55.06
2018-12-11,55.24
2018-12-12,55.31
2018-12-13,54.5
2018-12-14,53.82
2018-12-17,54.3
2018-12-18,55.3
2018-12-19,54.3
2018-12-20,52.39
2018-12-21,52.75
2018-12-24,52.45
2018-12-26,54.79
2018-12-27,55.29
2018-12-28,55.41
2018-12-31,55.82
2019-01-02,54.54
2019-01-03,54
2019-01-04,55.07
2019-01-07,54.88
2019-01-08,56.31
2019-01-09,57.14
2019-01-10,57.14
2019-01-11,56.58
2019-01-14,55.22
2019-01-15,55.13
2019-01-16,55.46
2019-01-17,56.27
2019-01-18,59.12
2019-01-22,57.55
2019-01-23,56.69
2019-01-24,57.29
2019-01-25,59.68
2019-01-28,59.73
2019-01-29,61
2019-01-30,61.57
2019-01-31,59.97
2019-02-01,60.79
2019-02-04,65.65
2019-02-05,67.17
2019-02-06,64.84
2019-02-07,66.03
2019-02-08,65.11
2019-02-11,65.41
2019-02-12,67.94
2019-02-13,67.85
2019-02-14,68.93
2019-02-15,69.52
2019-02-19,70.54
2019-02-20,70.36
2019-02-21,69.11
2019-02-22,68.92
2019-02-25,68.61
2019-02-26,67.51
2019-02-27,67.25
2019-02-28,66.16
2019-03-01,67.32
2019-03-04,64.53
2019-03-05,63.33
2019-03-06,62.11
2019-03-07,61.25
2019-03-08,61.01
2019-03-11,62.84
2019-03-12,62
2019-03-13,63.41
2019-03-14,63.86
2019-03-15,62.7
2019-03-18,63.16
2019-03-19,60.3
2019-03-20,59.74
2019-03-21,60.9
2019-03-22,59.06
2019-03-25,58.64
2019-03-26,60.69
2019-03-27,60.98
2019-03-28,62.01
2019-03-29,61.1
2019-04-01,63.32
2019-04-02,61.79
2019-04-03,62.73
2019-04-04,63.78
2019-04-05,64.35
2019-04-08,64.82
2019-04-09,63.65
2019-04-10,63.13
2019-04-11,65.9
2019-04-12,67.18
2019-04-15,67.19
2019-04-16,67.71
2019-04-17,68.92
2019-04-18,68.46
2019-04-22,68.57
2019-04-23,68.33
2019-04-24,70.39
2019-04-25,65.27
2019-04-26,66.13
2019-04-29,65.15
2019-04-30,64.39
2019-05-01,64.32
2019-05-02,65.71
2019-05-03,68.27
2019-05-06,68.9
2019-05-07,67.7
2019-05-08,66.85
2019-05-09,67.18
2019-05-10,66.57
2019-05-13,65.17
2019-05-14,66.1
2019-05-15,66.29
2019-05-16,67.29
2019-05-17,66.31
2019-05-20,66.94
2019-05-21,67.44
2019-05-22,65.16
2019-05-23,64.02
2019-05-24,64.02
2019-05-28,62.37
2019-05-29,61.16
2019-05-30,60.08
2019-05-31,59
2019-06-03,57.76
2019-06-04,59.57
2019-06-05,58.54
2019-06-06,58.32
2019-06-07,58.5
2019-06-10,60.48
2019-06-11,59.63
2019-06-12,60.72
2019-06-13,61.72
2019-06-14,62.08
2019-06-17,61.26
2019-06-18,61.675
2019-06-19,61.31
2019-06-20,62.81
2019-06-21,61.74
2019-06-24,59.79
2019-06-25,59.46
2019-06-26,60.015
2019-06-27,62.37
2019-06-28,64.91
2019-07-01,64.535
2019-07-02,63.87
2019-07-03,64.55
2019-07-04,64.55
2019-07-05,64.36
2019-07-08,63.995
2019-07-09,63.97
2019-07-10,62.12
2019-07-11,62.71
2019-07-12,65.715
2019-07-15,65.01
2019-07-16,66.35
2019-07-17,64.685
2019-07-18,64.38
2019-07-19,65.325
2019-07-22,65.695
2019-07-23,66.375
2019-07-24,67.805
2019-07-25,66.755
2019-07-26,68.56
2019-07-29,68.89
2019-07-30,69.58
2019-07-31,76.61
2019-08-01,75.01
2019-08-02,77.165
2019-08-05,76.075
2019-08-06,78.455
2019-08-07,77.19
2019-08-08,80.84
2019-08-09,79.96
2019-08-12,80.145
2019-08-13,80.985
2019-08-14,79.295
2019-08-15,78.98
2019-08-16,81.3
2019-08-19,82.64
2019-08-20,82.51
2019-08-21,83.88
2019-08-22,82.015
2019-08-23,79.54
2019-08-26,79.42
2019-08-27,78.79
2019-08-28,80.81
2019-08-29,84.24
2019-08-30,85.54
2019-09-02,85.51
2019-09-03,84.4
2019-09-04,88.015
2019-09-05,91.295
2019-09-06,89.56
2019-09-09,93.3
2019-09-10,93.34
2019-09-11,92.03
2019-09-12,93.6
2019-09-13,93.88
2019-09-16,94.1
2019-09-17,94.895
2019-09-18,95.815
2019-09-19,95.075
2019-09-20,93.005
2019-09-23,94.775
2019-09-24,94.34
2019-09-25,96.35
2019-09-26,95.43
2019-09-27,94.08
2019-09-30,93.74
2019-10-01,92.1
2019-10-02,90.91
2019-10-03,93.34
2019-10-04,91.2
2019-10-07,91.975
2019-10-08,90.17
2019-10-09,91.56
2019-10-10,93.33
2019-10-11,95.53
2019-10-14,96
2019-10-15,96.73
2019-10-16,95.84
2019-10-17,97.18
2019-10-18,98.635
2019-10-21,99.47
2019-10-22,98.53
2019-10-23,98.565
2019-10-24,99.89
2019-10-25,103.085
2019-10-28,105.28
2019-10-29,105.04
2019-10-30,92.72
2019-10-31,89.085
2019-11-01,93.15
2019-11-04,96.21
2019-11-05,96.1
2019-11-06,97.075
2019-11-07,98.36
2019-11-08,98.12
2019-11-11,99.42
2019-11-12,99.16
2019-11-13,99.135
2019-11-14,98.64
2019-11-15,97.13
2019-11-18,97.245
2019-11-19,97.01
2019-11-20,96.22
2019-11-21,95.785
2019-11-22,93
2019-11-25,94.33
