date,close
2014-06-13,24.64
2014-06-16,24.36
2014-06-17,25.68
2014-06-18,25.12
2014-06-19,24.24
2014-06-20,24.64
2014-06-23,24.32
2014-06-24,24.16
2014-06-25,24.48
2014-06-26,25.28
2014-06-27,24.4
2014-06-30,23.2
2014-07-01,22.64
2014-07-02,22.88
2014-07-03,23.44
2014-07-07,22.32
2014-07-08,21.28
2014-07-09,21.36
2014-07-10,20.96
2014-07-11,22.8
2014-07-14,23.04
2014-07-15,21.28
2014-07-16,21.12
2014-07-17,20.32
2014-07-18,22
2014-07-21,21.28
2014-07-22,21.84
2014-07-23,22.08
2014-07-24,21.96
2014-07-25,21.12
2014-07-28,20.48
2014-07-29,21.12
2014-07-30,21.12
2014-07-31,20.24
2014-08-01,19.48
2014-08-04,20.24
2014-08-05,20.96
2014-08-06,20.32
2014-08-07,20.72
2014-08-08,22
2014-08-11,22.96
2014-08-12,21.92
2014-08-13,22.36
2014-08-14,21.76
2014-08-15,21.12
2014-08-18,20.24
2014-08-19,20.48
2014-08-20,20.56
2014-08-21,21.52
2014-08-22,21.12
2014-08-25,21.2
2014-08-26,23.2
2014-08-27,23.04
2014-08-28,23.36
2014-08-29,23.12
2014-09-02,21.6
2014-09-03,20.88
2014-09-04,20.72
2014-09-05,21.52
2014-09-08,22.08
2014-09-09,21.12
2014-09-10,21.36
2014-09-11,21.84
2014-09-12,21.12
2014-09-15,20.64
2014-09-16,20.4
2014-09-17,20.56
2014-09-18,20.32
2014-09-19,19.68
2014-09-22,19.2
2014-09-23,19.2
2014-09-24,19.92
2014-09-25,19.2
2014-09-26,19.04
2014-09-29,18.96
2014-09-30,18.32
2014-10-01,17.28
2014-10-02,16.88
2014-10-03,17.52
2014-10-06,16.8
2014-10-07,15.84
2014-10-08,17.12
2014-10-09,16.08
2014-10-10,15.68
2014-10-13,16.48
2014-10-14,17.28
2014-10-15,17.6
2014-10-16,18.8
2014-10-17,18.56
2014-10-20,18.4
2014-10-21,19.04
2014-10-22,19.6
2014-10-23,19.92
2014-10-24,19.68
2014-10-27,20.08
2014-10-28,20.96
2014-10-29,20.88
2014-10-30,20.96
2014-10-31,20.4
2014-11-03,19.92
2014-11-04,19.52
2014-11-05,18.8
2014-11-06,19.92
2014-11-07,19.44
2014-11-10,20.24
2014-11-11,20.64
2014-11-12,20.48
2014-11-13,19.6
2014-11-14,19.6
2014-11-17,19.04
2014-11-18,19.84
2014-11-19,20.4
2014-11-20,20
2014-11-21,20.08
2014-11-24,20.72
2014-11-25,22.4
2014-11-26,24
2014-11-28,24.88
2014-12-01,24.96
2014-12-02,28.64
2014-12-03,32.56
2014-12-04,32.48
2014-12-05,32.32
2014-12-08,35.28
2014-12-09,33.28
2014-12-10,31.76
2014-12-11,30.96
2014-12-12,30.72
2014-12-15,27.68
2014-12-16,28.72
2014-12-17,31.12
2014-12-18,33.36
2014-12-19,32.96
2014-12-22,32.4
2014-12-23,30.96
2014-12-24,31.12
2014-12-26,31.92
2014-12-29,36
2014-12-30,34.92
2014-12-31,35.28
2015-01-02,39.2
2015-01-05,39.28
2015-01-06,37.52
2015-01-07,37.96
2015-01-08,39.68
2015-01-09,39.76
2015-01-12,42.96
2015-01-13,41.12
2015-01-14,42.32
2015-01-15,38.56
2015-01-16,37.52
2015-01-20,37.92
2015-01-21,36.4
2015-01-22,36.8
2015-01-23,36.08
2015-01-26,37.36
2015-01-27,38.48
2015-01-28,36.72
2015-01-29,37.6
2015-01-30,36.16
2015-02-02,33.68
2015-02-03,32.72
2015-02-04,33.6
2015-02-05,33.84
2015-02-06,32.16
2015-02-09,32.4
2015-02-10,32.08
2015-02-11,34.08
2015-02-12,33.92
2015-02-13,32.8
2015-02-17,35.12
2015-02-18,36.24
2015-02-19,36
2015-02-20,37.28
2015-02-23,38.64
2015-02-24,38.24
2015-02-25,39.12
2015-02-26,41.12
2015-02-27,38.96
2015-03-02,38.72
2015-03-03,37.04
2015-03-04,38
2015-03-05,39.12
2015-03-06,37.44
2015-03-09,37.92
2015-03-10,37.36
2015-03-11,35.6
2015-03-12,33.92
2015-03-13,33.2
2015-03-16,34.84
2015-03-17,35.84
2015-03-18,35.44
2015-03-19,35.44
2015-03-20,33.44
2015-03-23,31.76
2015-03-24,31.84
2015-03-25,28.08
2015-03-26,27.92
2015-03-27,27.4
2015-03-30,28.56
2015-03-31,29.68
2015-04-01,28.16
2015-04-02,28.4
2015-04-06,27.76
2015-04-07,29.12
2015-04-08,29.88
2015-04-09,29.68
2015-04-10,30.32
2015-04-13,30.88
2015-04-14,29.44
2015-04-15,29.6
2015-04-16,28.72
2015-04-17,27.6
2015-04-20,28.48
2015-04-21,27.04
2015-04-22,26.88
2015-04-23,27.52
2015-04-24,26.56
2015-04-27,24.4
2015-04-28,24.08
2015-04-29,22.96
2015-04-30,22.48
2015-05-01,23.28
2015-05-04,22.4
2015-05-05,21.84
2015-05-06,22.48
2015-05-07,22
2015-05-08,22.16
2015-05-11,24.4
2015-05-12,24.16
2015-05-13,22.4
2015-05-14,23.56
2015-05-15,23.92
2015-05-18,26.88
2015-05-19,24.96
2015-05-20,25.04
2015-05-21,24.32
2015-05-22,25.04
2015-05-26,25.04
2015-05-27,27.92
2015-05-28,28.8
2015-05-29,30.72
2015-06-01,28.64
2015-06-02,28.88
2015-06-03,28.16
2015-06-04,27.92
2015-06-05,28.72
2015-06-08,28.72
2015-06-09,27.6
2015-06-10,27.44
2015-06-11,28.72
2015-06-12,28.56
2015-06-15,29.76
2015-06-16,28.64
2015-06-17,29.68
2015-06-18,30.4
2015-06-19,29.76
2015-06-22,30.08
2015-06-23,28.8
2015-06-24,28.08
2015-06-25,26.88
2015-06-26,28.48
2015-06-29,27.52
2015-06-30,29.68
2015-07-01,29.28
2015-07-02,29.2
2015-07-06,29.76
2015-07-07,29.84
2015-07-08,27.44
2015-07-09,27.52
2015-07-10,27.92
2015-07-13,28.4
2015-07-14,28
2015-07-15,28.08
2015-07-16,28.4
2015-07-17,27.6
2015-07-20,27.92
2015-07-21,29.04
2015-07-22,30
2015-07-23,31.6
2015-07-24,30.08
2015-07-27,28.72
2015-07-28,28.88
2015-07-29,27.52
2015-07-30,27.6
2015-07-31,28.64
2015-08-03,28.08
2015-08-04,27.92
2015-08-05,26.56
2015-08-06,24.4
2015-08-07,22.44
2015-08-10,22.16
2015-08-11,21.68
2015-08-12,21.92
2015-08-13,21.52
2015-08-14,21.2
2015-08-17,22.24
2015-08-18,20.96
2015-08-19,20.4
2015-08-20,19.44
2015-08-21,20.32
2015-08-24,20.32
2015-08-25,21.52
2015-08-26,22.64
2015-08-27,23.12
2015-08-28,23.36
2015-08-31,24.16
2015-09-01,22.32
2015-09-02,23.68
2015-09-03,23.2
2015-09-04,22.4
2015-09-08,24.16
2015-09-09,23.84
2015-09-10,24.64
2015-09-11,26.72
2015-09-14,27.44
2015-09-15,28.56
2015-09-16,25.76
2015-09-17,27.84
2015-09-18,30.24
2015-09-21,27.44
2015-09-22,30.32
2015-09-23,30.72
2015-09-24,30.8
2015-09-25,28.4
2015-09-28,26.8
2015-09-29,26.4
2015-09-30,26.8
2015-10-01,24.48
2015-10-02,24.16
2015-10-05,22.56
2015-10-06,22.32
2015-10-07,23.6
2015-10-08,23.44
2015-10-09,24.24
2015-10-12,24.52
2015-10-13,22.96
2015-10-14,22.72
2015-10-15,25.84
2015-10-16,24.96
2015-10-19,25.28
2015-10-20,24.32
2015-10-21,25.04
2015-10-22,24.08
2015-10-23,23.2
2015-10-26,22.4
2015-10-27,22.4
2015-10-28,22.88
2015-10-29,22.16
2015-10-30,22.08
2015-11-02,24.88
2015-11-03,24.56
2015-11-04,26.32
2015-11-05,25.44
2015-11-06,26.88
2015-11-09,28.48
2015-11-10,28.72
2015-11-11,28.16
2015-11-12,27.28
2015-11-13,27.84
2015-11-16,27.36
2015-11-17,25.84
2015-11-18,26.08
2015-11-19,25.6
2015-11-20,25.52
2015-11-23,27.44
2015-11-24,28.16
2015-11-25,27.76
2015-11-27,29.44
2015-11-30,31.04
2015-12-01,30.64
2015-12-02,31.12
2015-12-03,29.28
2015-12-04,30.4
2015-12-07,34.56
2015-12-08,34.24
2015-12-09,32.72
2015-12-10,31.84
2015-12-11,29.36
2015-12-14,27.2
2015-12-15,27.12
2015-12-16,26.24
2015-12-17,26.72
2015-12-18,26.64
2015-12-21,26.32
2015-12-22,26.4
2015-12-23,25.92
2015-12-24,25.92
2015-12-28,24.96
2015-12-29,26.08
2015-12-30,25.04
2015-12-31,24.72
2016-01-04,24
2016-01-05,23.04
2016-01-06,23.04
2016-01-07,21.04
2016-01-08,20.16
2016-01-11,17.76
2016-01-12,16.8
2016-01-13,16.8
2016-01-14,17.36
2016-01-15,15.84
2016-01-19,14.32
2016-01-20,15.36
2016-01-21,15.04
2016-01-22,13.92
2016-01-25,14.16
2016-01-26,14.08
2016-01-27,14.16
2016-01-28,14.48
2016-01-29,15.52
2016-02-01,15.44
2016-02-02,14.4
2016-02-03,15.2
2016-02-04,15.2
2016-02-05,14.72
2016-02-08,13.36
2016-02-09,13.48
2016-02-10,13.12
2016-02-11,13.44
2016-02-12,13.28
2016-02-16,13.68
2016-02-17,15.36
2016-02-18,13.92
2016-02-19,14.56
2016-02-22,14.48
2016-02-23,13.92
2016-02-24,14.4
2016-02-25,14.24
2016-02-26,14.8
2016-02-29,14.24
2016-03-01,14.96
2016-03-02,16.8
2016-03-03,16.24
2016-03-04,16.48
2016-03-07,17.52
2016-03-08,16.08
2016-03-09,14.96
2016-03-10,14.24
2016-03-11,14.64
2016-03-14,16.16
2016-03-15,14.88
2016-03-16,14.48
2016-03-17,14.8
2016-03-18,16.8
2016-03-21,17.44
2016-03-22,17.12
2016-03-23,15.6
2016-03-24,15.92
2016-03-28,15.68
2016-03-29,15.68
2016-03-30,15.44
2016-03-31,15.84
2016-04-01,15.76
2016-04-04,16.48
2016-04-05,15.84
2016-04-06,16
2016-04-07,15.52
2016-04-08,15.28
2016-04-11,14.96
2016-04-12,15.28
2016-04-13,15.92
2016-04-14,15.12
2016-04-15,15.2
2016-04-18,15.2
2016-04-19,14.72
2016-04-20,14.72
2016-04-21,14.56
2016-04-22,14.32
2016-04-25,14.24
2016-04-26,14.32
2016-04-27,14.16
2016-04-28,13.68
2016-04-29,13.28
2016-05-02,13.44
2016-05-03,13.28
2016-05-04,11.92
2016-05-05,10.72
2016-05-06,10.96
2016-05-09,11.12
2016-05-10,11.36
2016-05-11,11.6
2016-05-12,10.56
2016-05-13,11.04
2016-05-16,11.76
2016-05-17,11.36
2016-05-18,11.68
2016-05-19,11.36
2016-05-20,11.84
2016-05-23,12.24
2016-05-24,12.8
2016-05-25,12.48
2016-05-26,11.92
2016-05-27,11.92
2016-05-31,12.64
2016-06-01,12.72
2016-06-02,13.2
2016-06-03,12.56
2016-06-06,12.96
2016-06-07,12.64
2016-06-08,12.88
2016-06-09,12.56
2016-06-10,12
2016-06-13,11.52
2016-06-14,11.44
2016-06-15,11.52
2016-06-16,12.48
2016-06-17,12.32
2016-06-20,12.8
2016-06-21,12.24
2016-06-22,11.84
2016-06-23,12.24
2016-06-24,11.84
2016-06-27,10.88
2016-06-28,11.68
2016-06-29,11.76
2016-06-30,12.24
2016-07-01,13.04
2016-07-05,12.88
2016-07-06,12.96
2016-07-07,13.12
2016-07-08,13.44
2016-07-11,13.44
2016-07-12,13.6
2016-07-13,12.96
2016-07-14,12.8
2016-07-15,12.72
2016-07-18,13.04
2016-07-19,12.64
2016-07-20,12.88
2016-07-21,12.8
2016-07-22,13.36
2016-07-25,13.12
2016-07-26,13.44
2016-07-27,13.68
2016-07-28,13.52
2016-07-29,13.76
2016-08-01,13.36
2016-08-02,14
2016-08-03,14.16
2016-08-04,14.8
2016-08-05,15.12
2016-08-08,15.68
2016-08-09,16
2016-08-10,15.44
2016-08-11,15.52
2016-08-12,15.92
2016-08-15,16
2016-08-16,15.6
2016-08-17,15.44
2016-08-18,15.6
2016-08-19,15.84
2016-08-22,15.44
2016-08-23,15.6
2016-08-24,15.52
2016-08-25,15.12
2016-08-26,15.28
2016-08-29,15.6
2016-08-30,15.52
2016-08-31,15.28
2016-09-01,15.36
2016-09-02,15.36
2016-09-06,15.76
2016-09-07,16
2016-09-08,16.16
2016-09-09,15.36
2016-09-12,15.68
2016-09-13,15.52
2016-09-14,15.76
2016-09-15,16
2016-09-16,17.28
2016-09-19,18.8
2016-09-20,22.72
2016-09-21,21.6
2016-09-22,22.32
2016-09-23,22.08
2016-09-26,21.28
2016-09-27,19.84
2016-09-28,20
2016-09-29,18.48
2016-09-30,20.48
2016-10-03,20.48
2016-10-04,20.4
2016-10-05,20.88
2016-10-06,17.44
2016-10-07,16
2016-10-10,15.6
2016-10-11,14.48
2016-10-12,15.36
2016-10-13,14.8
2016-10-14,14.24
2016-10-17,13.92
2016-10-18,14
2016-10-19,13.6
2016-10-20,15.2
2016-10-21,14.96
2016-10-24,15.6
2016-10-25,15.44
2016-10-26,14.56
2016-10-27,13.68
2016-10-28,13.2
2016-10-31,12.4
2016-11-01,12.64
2016-11-02,12.56
2016-11-03,11.68
2016-11-04,12.24
2016-11-07,12.32
2016-11-08,12.08
2016-11-09,13.76
2016-11-10,14.68
2016-11-11,15.04
2016-11-14,14.32
2016-11-15,14.88
2016-11-16,14.32
2016-11-17,14.16
2016-11-18,14.16
2016-11-21,14.08
2016-11-22,14.08
2016-11-23,14.48
2016-11-25,14.64
2016-11-28,14.4
2016-11-29,14.32
2016-11-30,13.52
2016-12-01,12.88
2016-12-02,12.64
2016-12-05,13.44
2016-12-06,13.68
2016-12-07,13.04
2016-12-08,13.44
2016-12-09,13.52
2016-12-12,12.8
2016-12-13,12.8
2016-12-14,13.04
2016-12-15,12.72
2016-12-16,12.88
2016-12-19,12.8
2016-12-20,12.96
2016-12-21,12.72
2016-12-22,12.48
2016-12-23,12.88
2016-12-27,12.72
2016-12-28,12.4
2016-12-29,12.16
2016-12-30,12
2017-01-03,12
2017-01-04,12.72
2017-01-05,12.24
2017-01-06,12.56
2017-01-09,12.96
2017-01-10,12.96
2017-01-11,12.8
2017-01-12,12.56
2017-01-13,12.64
2017-01-17,12.08
2017-01-18,11.84
2017-01-19,11.44
2017-01-20,11.28
2017-01-23,11.28
2017-01-24,11.68
2017-01-25,11.76
2017-01-26,11.28
2017-01-27,11.04
2017-01-30,10.8
2017-01-31,11.2
2017-02-01,11.84
2017-02-02,11.76
2017-02-03,12.08
2017-02-06,12.4
2017-02-07,12.48
2017-02-08,12.48
2017-02-09,12.88
2017-02-10,12.8
2017-02-13,12.72
2017-02-14,12.64
2017-02-15,13.36
2017-02-16,13.44
2017-02-17,13.92
2017-02-21,13.28
2017-02-22,13.44
2017-02-23,13.84
2017-02-24,13.36
2017-02-27,13.2
2017-02-28,14.96
2017-03-01,14.96
2017-03-02,16.32
2017-03-03,15.92
2017-03-06,15.92
2017-03-07,15.28
2017-03-08,15.2
2017-03-09,15.04
2017-03-10,15.44
2017-03-13,15.12
2017-03-14,14.56
2017-03-15,14.64
2017-03-16,15.92
2017-03-17,16.48
2017-03-20,17.84
2017-03-21,16.72
2017-03-22,19.92
2017-03-23,19.36
2017-03-24,19.84
2017-03-27,20.4
2017-03-28,19.92
2017-03-29,19.76
2017-03-30,20.08
2017-03-31,19.76
2017-04-03,19.44
2017-04-04,19.76
2017-04-05,17.68
2017-04-06,17.36
2017-04-07,17.28
2017-04-10,17.6
2017-04-11,17.92
2017-04-12,17.76
2017-04-13,18
2017-04-17,18.24
2017-04-18,18.08
2017-04-19,18
2017-04-20,18.64
2017-04-21,18.56
2017-04-24,18
2017-04-25,19.48
2017-04-26,20.64
2017-04-27,19.6
2017-04-28,18.8
2017-05-01,18.72
2017-05-02,17.84
2017-05-03,16.8
2017-05-04,16.72
2017-05-05,14.72
2017-05-08,14.4
2017-05-09,14.16
2017-05-10,14.72
2017-05-11,14.8
2017-05-12,14.56
2017-05-15,14.88
2017-05-16,14.72
2017-05-17,14
2017-05-18,14.08
2017-05-19,13.76
2017-05-22,13.76
2017-05-23,13.68
2017-05-24,13.44
2017-05-25,13.36
2017-05-26,12.88
2017-05-30,12.88
2017-05-31,13.04
2017-06-01,13.44
2017-06-02,13.76
2017-06-05,13.12
2017-06-06,13.04
2017-06-07,13.04
2017-06-08,13.12
2017-06-09,12.8
2017-06-12,12.88
2017-06-13,12.88
2017-06-14,12.72
2017-06-15,12.4
2017-06-16,12.72
2017-06-19,13.28
2017-06-20,13.28
2017-06-21,13.68
2017-06-22,13.84
2017-06-23,15.44
2017-06-26,15.2
2017-06-27,14.08
2017-06-28,14.56
2017-06-29,14.08
2017-06-30,13.76
2017-07-03,14
2017-07-05,14.16
2017-07-06,13.92
2017-07-07,14.4
2017-07-10,14.16
2017-07-11,14.96
2017-07-12,15.52
2017-07-13,15.12
2017-07-14,14.88
2017-07-17,14.72
2017-07-18,14.56
2017-07-19,14.56
2017-07-20,15.2
2017-07-21,15.04
2017-07-24,15.36
2017-07-25,16.48
2017-07-26,15.52
2017-07-27,14.64
2017-07-28,15.04
2017-07-31,14.72
2017-08-01,14.96
2017-08-02,14.56
2017-08-03,14.72
2017-08-04,14.8
2017-08-07,14.64
2017-08-08,14.32
2017-08-09,14.56
2017-08-10,13.92
2017-08-11,14.24
2017-08-14,14.32
2017-08-15,13.92
2017-08-16,14.08
2017-08-17,13.68
2017-08-18,13.84
2017-08-21,13.92
2017-08-22,14.08
2017-08-23,13.84
2017-08-24,14.32
2017-08-25,14.4
2017-08-28,14.88
2017-08-29,15.36
2017-08-30,15.76
2017-08-31,15.84
2017-09-01,15.04
2017-09-05,14.96
2017-09-06,15.36
2017-09-07,16
2017-09-08,15.6
2017-09-11,17.84
2017-09-12,16.44
2017-09-13,16.12
2017-09-14,16
2017-09-15,16.88
2017-09-18,17.84
2017-09-19,18.64
2017-09-20,17.76
2017-09-21,18.08
2017-09-22,17.84
2017-09-25,18.08
2017-09-26,17.76
2017-09-27,17.76
2017-09-28,17.92
2017-09-29,17.84
2017-10-02,18.24
2017-10-03,18.32
2017-10-04,18
2017-10-05,19.84
2017-10-06,19.44
2017-10-09,19.28
2017-10-10,21.52
2017-10-11,22.16
2017-10-12,21.2
2017-10-13,21.36
2017-10-16,19.2
2017-10-17,20.16
2017-10-18,19.2
2017-10-19,19.12
2017-10-20,18.88
2017-10-23,17.92
2017-10-24,17.44
2017-10-25,16.2
2017-10-26,11.76
2017-10-27,12.48
2017-10-30,12.88
2017-10-31,12.48
2017-11-01,12.56
2017-11-02,13.44
2017-11-03,13.92
2017-11-06,14.48
2017-11-07,14.96
2017-11-08,14.16
2017-11-09,16.16
2017-11-10,16.88
2017-11-13,16.4
2017-11-14,16.72
2017-11-15,15.84
2017-11-16,16.64
2017-11-17,17.12
2017-11-20,17.36
2017-11-21,17.76
2017-11-22,17.36
2017-11-24,17.76
2017-11-27,18.08
2017-11-28,17.36
2017-11-29,17.44
2017-11-30,17.68
2017-12-01,17.76
2017-12-04,17.04
2017-12-05,16.24
2017-12-06,15.76
2017-12-07,15.44
2017-12-08,15.36
2017-12-11,15.92
2017-12-12,15.28
2017-12-13,15.44
2017-12-14,15.6
2017-12-15,14.96
2017-12-18,15.36
2017-12-19,15.6
2017-12-20,15.92
2017-12-21,17.04
2017-12-22,16.64
2017-12-26,16.24
2017-12-27,16.64
2017-12-28,17.04
2017-12-29,16.88
2018-01-02,17.68
2018-01-03,17.92
2018-01-04,17.84
2018-01-05,18.16
2018-01-08,17.44
2018-01-09,18.16
2018-01-10,18.72
2018-01-11,19.12
2018-01-12,19.92
2018-01-16,19.28
2018-01-17,19.28
2018-01-18,19.24
2018-01-19,20.4
2018-01-22,17.36
2018-01-23,17.28
2018-01-24,15.84
2018-01-25,15.44
2018-01-26,14.96
2018-01-29,14.88
2018-01-30,14.8
2018-01-31,14.64
2018-02-01,14.8
2018-02-02,14.4
2018-02-05,14.64
2018-02-06,15.76
2018-02-07,15.68
2018-02-08,15.36
2018-02-09,15.36
2018-02-12,15.44
2018-02-13,15.52
2018-02-14,16
2018-02-15,15.28
2018-02-16,15.44
2018-02-20,15.6
2018-02-21,15.2
2018-02-22,14.72
2018-02-23,14.96
2018-02-26,14.72
2018-02-27,14.16
2018-02-28,14.16
2018-03-01,14.24
2018-03-02,14.88
2018-03-05,15.76
2018-03-06,15.76
2018-03-07,16.08
2018-03-08,16.16
2018-03-09,16.56
2018-03-12,16.24
2018-03-13,16.32
2018-03-14,16.24
2018-03-15,15.6
2018-03-16,15.6
2018-03-19,15.2
2018-03-20,15.44
2018-03-21,16.08
2018-03-22,16.08
2018-03-23,16.08
2018-03-26,16.24
2018-03-27,15.92
2018-03-28,14.56
2018-03-29,14.72
2018-04-02,12.96
2018-04-03,13.68
2018-04-04,14.16
2018-04-05,13.36
2018-04-06,13.12
2018-04-09,13.12
2018-04-10,13.44
2018-04-11,13.28
2018-04-12,14.32
2018-04-13,14.96
2018-04-16,14.16
2018-04-17,14.08
2018-04-18,14.16
2018-04-19,13.76
2018-04-20,12.96
2018-04-23,12.48
2018-04-24,12.48
2018-04-25,12.32
2018-04-26,12.48
2018-04-27,12.24
2018-04-30,12.24
2018-05-01,12.48
2018-05-02,13.04
2018-05-03,13.04
2018-05-04,12.96
2018-05-07,12.96
2018-05-08,12.8
2018-05-09,13.76
2018-05-10,14.08
2018-05-11,14.08
2018-05-14,14.96
2018-05-15,15.2
2018-05-16,15.36
2018-05-17,15.6
2018-05-18,16
2018-05-21,14.8
2018-05-22,15.2
2018-05-23,15.28
2018-05-24,15.12
2018-05-25,15.44
2018-05-29,15.44
2018-05-30,16.08
2018-05-31,16.4
2018-06-01,16.08
2018-06-04,15.36
2018-06-05,16.56
2018-06-06,16.96
2018-06-07,16.32
2018-06-08,16
2018-06-11,15.44
2018-06-12,14.08
2018-06-13,14.08
2018-06-14,13.68
2018-06-15,13.6
2018-06-18,12.48
2018-06-19,11.92
2018-06-20,12.24
2018-06-21,11.76
2018-06-22,11.52
2018-06-25,10.24
2018-06-26,10.32
2018-06-27,9.92
2018-06-28,10.16
2018-06-29,10.56
2018-07-02,10.56
2018-07-03,10.56
2018-07-05,11.36
2018-07-06,11.28
2018-07-09,11.04
2018-07-10,10.96
2018-07-11,8.72
2018-07-12,8.48
2018-07-13,8.08
2018-07-16,7.9032
2018-07-17,7.8048
2018-07-18,7.504
2018-07-19,6.96
2018-07-20,6.88
2018-07-23,6.9728
2018-07-24,6.9184
2018-07-25,6.98
2018-07-26,7.0936
2018-07-27,6.6448
2018-07-30,6.55
2018-07-31,5.71
2018-08-01,5.88
2018-08-02,6.2
2018-08-03,5.53
2018-08-06,5.64
2018-08-07,5.72
2018-08-08,5.76
2018-08-09,7.31
2018-08-10,6.25
2018-08-13,7.39
2018-08-14,8.51
2018-08-15,9.15
2018-08-16,9.27
2018-08-17,8.8
2018-08-20,8.59
2018-08-21,8.65
2018-08-22,9.01
2018-08-23,8.37
2018-08-24,9.17
2018-08-27,9.68
2018-08-28,9.98
2018-08-29,9.95
2018-08-30,9.96
2018-08-31,10.46
2018-09-04,9.88
2018-09-05,9.67
2018-09-06,9.98
2018-09-07,10.13
2018-09-10,9.29
2018-09-11,9.15
2018-09-12,8.47
2018-09-13,8.28
2018-09-14,8.28
2018-09-17,8.19
2018-09-18,7.99
2018-09-19,8.28
2018-09-20,8.32
2018-09-21,8.45
2018-09-24,9.53
2018-09-25,9.11
2018-09-26,9.08
2018-09-27,8.6
2018-09-28,8.91
2018-10-01,8.71
2018-10-02,8.6
2018-10-03,9.38
2018-10-04,9.24
2018-10-05,9.13
2018-10-08,8.71
2018-10-09,8.87
2018-10-10,8.17
2018-10-11,7.7
2018-10-12,7.85
2018-10-15,8.06
2018-10-16,8.74
2018-10-17,8.67
2018-10-18,8.5
2018-10-19,7.04
2018-10-22,7.37
2018-10-23,7.12
2018-10-24,6.43
2018-10-25,7.05
2018-10-26,7.04
2018-10-29,6.75
2018-10-30,6.88
2018-10-31,6.67
2018-11-01,7.31
2018-11-02,7.54
2018-11-05,7.04
2018-11-06,7.21
2018-11-07,9.2
2018-11-08,8.87
2018-11-09,8.39
2018-11-12,7.93
2018-11-13,7.62
2018-11-14,7.17
2018-11-15,7.47
2018-11-16,7.48
2018-11-19,7.25
2018-11-20,7.27
2018-11-21,7.29
2018-11-23,7.3
2018-11-26,7.42
2018-11-27,6.76
2018-11-28,6.44
2018-11-29,6.7
2018-11-30,6.87
2018-12-03,6.7
2018-12-04,6.22
2018-12-06,6.07
2018-12-07,6.06
2018-12-10,6.56
2018-12-11,6.76
2018-12-12,6.68
2018-12-13,6.6
2018-12-14,3.98
2018-12-17,3.6
2018-12-18,3.12
2018-12-19,3.53
2018-12-20,3.26
2018-12-21,2.95
2018-12-24,2.92
2018-12-26,3.23
2018-12-27,3.15
2018-12-28,3.02
2018-12-31,2.77
2019-01-02,3.52
2019-01-03,3.14
2019-01-04,3.66
2019-01-07,3.79
2019-01-08,3.72
2019-01-09,3.68
2019-01-10,3.58
2019-01-11,3.24
2019-01-14,3.06
2019-01-15,2.9
2019-01-16,3.06
2019-01-17,2.96
2019-01-18,2.93
2019-01-22,2.74
2019-01-23,2.33
2019-01-24,2.46
2019-01-25,2.72
2019-01-28,2.57
2019-01-29,2.72
2019-01-30,2.65
2019-01-31,2.53
2019-02-01,2.57
2019-02-04,2.59
2019-02-05,2.52
2019-02-06,2.6
2019-02-07,2.55
2019-02-08,2.46
2019-02-11,2.49
2019-02-12,2.66
2019-02-13,2.77
2019-02-14,2.61
2019-02-15,2.65
2019-02-19,2.58
2019-02-20,2.64
2019-02-21,3.01
2019-02-22,2.85
2019-02-25,2.92
2019-02-26,2.94
2019-02-27,2.94
2019-02-28,2.79
2019-03-01,2.83
2019-03-04,2.84
2019-03-05,2.81
2019-03-06,2.62
2019-03-07,2.79
2019-03-08,2.74
2019-03-11,2.7
2019-03-12,2.72
2019-03-13,2.8
2019-03-14,2.92
2019-03-15,2.98
2019-03-18,3.12
2019-03-19,3.04
2019-03-20,3.15
2019-03-21,3
2019-03-22,2.72
2019-03-25,2.61
2019-03-26,2.59
2019-03-27,2.53
2019-03-28,2.59
2019-03-29,2.55
2019-04-01,2.59
2019-04-02,2.73
2019-04-03,2.78
2019-04-04,2.66
2019-04-05,2.67
2019-04-08,2.66
2019-04-09,2.76
2019-04-10,2.88
2019-04-11,2.81
2019-04-12,2.8
2019-04-15,2.71
2019-04-16,2.62
2019-04-17,2.43
2019-04-18,2.39
2019-04-22,2.37
2019-04-23,2.57
2019-04-24,2.72
2019-04-25,2.63
2019-04-26,2.67
2019-04-29,2.98
2019-04-30,3.01
2019-05-01,2.95
2019-05-02,3.06
2019-05-03,3.57
2019-05-06,3.97
2019-05-07,3.34
2019-05-08,3.6
2019-05-09,3.2
2019-05-10,3.18
2019-05-13,3.13
2019-05-14,2.82
2019-05-15,2.66
2019-05-16,2.52
2019-05-17,2.53
2019-05-20,2.61
2019-05-21,2.82
2019-05-22,2.79
2019-05-23,2.6
2019-05-24,2.57
2019-05-28,2.46
2019-05-29,2.56
2019-05-30,2.55
2019-05-31,2.54
2019-06-03,2.52
2019-06-04,2.57
2019-06-05,2.65
2019-06-06,2.63
2019-06-07,2.64
2019-06-10,2.88
2019-06-11,2.86
2019-06-12,2.88
2019-06-13,2.985
2019-06-14,2.87
2019-06-17,2.98
2019-06-18,2.95
2019-06-19,2.865
2019-06-20,2.72
2019-06-21,2.79
2019-06-24,2.68
2019-06-25,2.725
2019-06-26,2.62
2019-06-27,2.675
2019-06-28,2.685
2019-07-01,2.62
2019-07-02,2.585
2019-07-03,2.6
2019-07-04,2.6
2019-07-05,2.63
2019-07-08,2.625
2019-07-09,2.525
2019-07-10,2.545
2019-07-11,2.53
2019-07-12,2.53
2019-07-15,2.5
2019-07-16,2.58
2019-07-17,2.62
2019-07-18,2.58
2019-07-19,2.535
2019-07-22,2.55
2019-07-23,2.51
2019-07-24,2.55
2019-07-25,2.565
2019-07-26,2.55
2019-07-29,2.61
2019-07-30,2.71
2019-07-31,2.705
2019-08-01,2.56
2019-08-02,2.54
2019-08-05,2.465
2019-08-06,2.4
2019-08-07,2.555
2019-08-08,2.49
2019-08-09,2.49
2019-08-12,2.265
2019-08-13,2.42
2019-08-14,2.26
2019-08-15,2.13
2019-08-16,2.15
2019-08-19,2.285
2019-08-20,2.25
2019-08-21,2.34
2019-08-22,2.35
2019-08-23,2.25
2019-08-26,2.33
2019-08-27,2.38
2019-08-28,2.34
2019-08-29,2.36
2019-08-30,2.29
2019-09-02,2.35
2019-09-03,2.31
2019-09-04,2.6
2019-09-05,2.77
2019-09-06,2.78
2019-09-09,3.14
2019-09-10,3.31
2019-09-11,3.135
2019-09-12,2.99
2019-09-13,3.15
2019-09-16,3.14
2019-09-17,2.985
2019-09-18,2.905
2019-09-19,2.9
2019-09-20,2.835
2019-09-23,2.79
2019-09-24,2.73
2019-09-25,2.73
2019-09-26,2.64
2019-09-27,2.63
2019-09-30,2.88
2019-10-01,2.715
2019-10-02,2.66
2019-10-03,2.79
2019-10-04,2.79
2019-10-07,2.7
2019-10-08,2.7
2019-10-09,2.7
2019-10-10,2.49
2019-10-11,2.475
2019-10-14,2.53
2019-10-15,2.54
2019-10-16,2.69
2019-10-17,2.68
2019-10-18,2.685
2019-10-21,2.81
2019-10-22,2.64
2019-10-23,2.695
2019-10-24,2.7
2019-10-25,2.63
2019-10-28,2.66
2019-10-29,2.59
2019-10-30,2.72
2019-10-31,2.72
2019-11-01,2.61
2019-11-04,2.62
2019-11-05,2.6
2019-11-06,2.45
2019-11-07,2.48
2019-11-08,2.38
2019-11-11,2.23
2019-11-12,2.14
2019-11-13,2.055
2019-11-14,2.13
2019-11-15,2.135
2019-11-18,2.11
2019-11-19,2.065
2019-11-20,2.075
2019-11-21,1.835
2019-11-22,1.82
2019-11-25,1.9
