date,close
2014-06-13,16.7412
2014-06-16,16.6598
2014-06-17,16.8301
2014-06-18,16.9263
2014-06-19,16.8375
2014-06-20,16.971
2014-06-23,17.0082
2014-06-24,16.8966
2014-06-25,16.9115
2014-06-26,16.852
2014-06-27,16.9189
2014-06-30,16.9041
2014-07-01,17.0082
2014-07-02,16.9933
2014-07-03,17.1271
2014-07-07,17.0527
2014-07-08,16.9041
2014-07-09,16.9487
2014-07-10,16.8372
2014-07-11,16.8669
2014-07-14,16.971
2014-07-15,17.0899
2014-07-16,17.0602
2014-07-17,17.0304
2014-07-18,17.0304
2014-07-21,16.9859
2014-07-22,17.0379
2014-07-23,17.0751
2014-07-24,17.1122
2014-07-25,17.0156
2014-07-28,17.023
2014-07-29,16.9338
2014-07-30,17.0082
2014-07-31,16.6588
2014-08-01,16.5175
2014-08-04,16.6513
2014-08-05,16.4804
2014-08-06,16.5473
2014-08-07,16.4729
2014-08-08,16.6365
2014-08-11,16.6513
2014-08-12,16.6885
2014-08-13,16.7628
2014-08-14,16.8669
2014-08-15,16.7851
2014-08-18,16.971
2014-08-19,17.0007
2014-08-20,17.0453
2014-08-21,17.246
2014-08-22,17.1866
2014-08-25,17.3352
2014-08-26,17.3724
2014-08-27,17.3352
2014-08-28,17.2832
2014-08-29,17.365
2014-09-02,17.4319
2014-09-03,17.4021
2014-09-04,17.417
2014-09-05,17.4393
2014-09-08,17.4467
2014-09-09,17.2683
2014-09-10,17.3575
2014-09-11,17.4021
2014-09-12,17.3873
2014-09-15,17.3798
2014-09-16,17.4542
2014-09-17,17.5285
2014-09-18,17.6995
2014-09-19,17.6535
2014-09-22,17.534
2014-09-23,17.4146
2014-09-24,17.5116
2014-09-25,17.2205
2014-09-26,17.3847
2014-09-29,17.325
2014-09-30,17.2952
2014-10-01,17.0862
2014-10-02,17.131
2014-10-03,17.3773
2014-10-06,17.325
2014-10-07,17.0314
2014-10-08,17.3549
2014-10-09,16.9891
2014-10-10,16.8548
2014-10-13,16.7055
2014-10-14,16.7727
2014-10-15,16.4517
2014-10-16,16.4517
2014-10-17,16.6607
2014-10-20,16.7577
2014-10-21,17.0712
2014-10-22,16.9145
2014-10-23,17.0787
2014-10-24,17.2429
2014-10-27,17.2653
2014-10-28,17.4519
2014-10-29,17.4967
2014-10-30,17.5938
2014-10-31,17.7953
2014-11-03,17.8625
2014-11-04,17.8699
2014-11-05,17.9894
2014-11-06,18.0192
2014-11-07,18.0267
2014-11-10,18.1237
2014-11-11,18.064
2014-11-12,18.0267
2014-11-13,18.0192
2014-11-14,17.9595
2014-11-17,17.9595
2014-11-18,18.0192
2014-11-19,17.9819
2014-11-20,17.9819
2014-11-21,18.0715
2014-11-24,18.1909
2014-11-25,18.176
2014-11-26,18.1984
2014-11-28,18.2133
2014-12-01,18.0827
2014-12-02,18.2544
2014-12-03,18.3365
2014-12-04,18.3626
2014-12-05,18.5268
2014-12-08,18.6164
2014-12-09,18.5716
2014-12-10,18.3327
2014-12-11,18.3775
2014-12-12,18.0192
2014-12-15,17.855
2014-12-16,17.6833
2014-12-17,18.0857
2014-12-18,18.5044
2014-12-19,18.5165
2014-12-22,18.644
2014-12-23,18.7491
2014-12-24,18.7191
2014-12-26,18.7191
2014-12-29,18.7866
2014-12-30,18.7641
2014-12-31,18.554
2015-01-02,18.554
2015-01-05,18.1639
2015-01-06,17.8863
2015-01-07,18.0738
2015-01-08,18.3439
2015-01-09,18.0964
2015-01-12,17.9463
2015-01-13,17.8863
2015-01-14,17.6312
2015-01-15,17.4136
2015-01-16,17.6237
2015-01-20,17.5487
2015-01-21,17.5937
2015-01-22,18.0288
2015-01-23,17.8338
2015-01-26,17.9238
2015-01-27,17.7287
2015-01-28,17.4061
2015-01-29,17.5487
2015-01-30,17.2636
2015-02-02,17.5412
2015-02-03,17.8338
2015-02-04,17.7887
2015-02-05,17.9688
2015-02-06,18.1114
2015-02-09,18.0213
2015-02-10,18.1639
2015-02-11,18.1639
2015-02-12,18.3439
2015-02-13,18.3289
2015-02-17,18.389
2015-02-18,18.2764
2015-02-19,18.2014
2015-02-20,18.3364
2015-02-23,18.2914
2015-02-24,18.3815
2015-02-25,18.3815
2015-02-26,18.3364
2015-02-27,18.2689
2015-03-02,18.404
2015-03-03,18.3514
2015-03-04,18.2389
2015-03-05,18.3139
2015-03-06,18.1789
2015-03-09,18.2614
2015-03-10,17.8713
2015-03-11,17.9838
2015-03-12,18.374
2015-03-13,18.2464
2015-03-16,18.4715
2015-03-17,18.4265
2015-03-18,18.5315
2015-03-19,18.3589
2015-03-20,18.608
2015-03-23,18.5026
2015-03-24,18.3519
2015-03-25,18.0583
2015-03-26,18.0432
2015-03-27,18.0206
2015-03-30,18.2842
2015-03-31,18.1562
2015-04-01,18.1411
2015-04-02,18.2315
2015-04-06,18.2616
2015-04-07,18.1637
2015-04-08,18.2315
2015-04-09,18.2578
2015-04-10,18.2541
2015-04-13,18.3218
2015-04-14,18.3218
2015-04-15,18.3896
2015-04-16,18.416
2015-04-17,18.1712
2015-04-20,18.2465
2015-04-21,18.1562
2015-04-22,18.2842
2015-04-23,18.3143
2015-04-24,18.2842
2015-04-27,18.2164
2015-04-28,18.3218
2015-04-29,18.3143
2015-04-30,18.1712
2015-05-01,18.3294
2015-05-04,18.5101
2015-05-05,18.3444
2015-05-06,18.2541
2015-05-07,18.3821
2015-05-08,18.6456
2015-05-11,18.5779
2015-05-12,18.5101
2015-05-13,18.5176
2015-05-14,18.6833
2015-05-15,18.6005
2015-05-18,18.7059
2015-05-19,18.8113
2015-05-20,18.7586
2015-05-21,18.7134
2015-05-22,18.7209
2015-05-26,18.5101
2015-05-27,18.7134
2015-05-28,18.6908
2015-05-29,18.5252
2015-06-01,18.5402
2015-06-02,18.5703
2015-06-03,18.7285
2015-06-04,18.5628
2015-06-05,18.6682
2015-06-08,18.5553
2015-06-09,18.6005
2015-06-10,18.864
2015-06-11,18.9393
2015-06-12,18.8565
2015-06-15,18.7737
2015-06-16,18.8791
2015-06-17,18.8565
2015-06-18,19.0297
2015-06-19,18.7121
2015-06-22,18.9996
2015-06-23,19.0374
2015-06-24,18.8785
2015-06-25,18.7651
2015-06-26,18.8256
2015-06-29,18.3718
2015-06-30,18.4399
2015-07-01,18.7197
2015-07-02,18.6365
2015-07-06,18.5609
2015-07-07,18.5987
2015-07-08,18.2735
2015-07-09,18.4172
2015-07-10,18.6365
2015-07-13,18.8634
2015-07-14,18.9088
2015-07-15,19.0676
2015-07-16,19.2567
2015-07-17,19.2038
2015-07-20,19.2265
2015-07-21,19.2038
2015-07-22,19.3475
2015-07-23,19.1811
2015-07-24,18.9996
2015-07-27,18.8634
2015-07-28,18.9391
2015-07-29,19.1281
2015-07-30,19.1281
2015-07-31,19.0676
2015-08-03,19.0449
2015-08-04,19.0147
2015-08-05,19.0903
2015-08-06,19.0222
2015-08-07,19.0601
2015-08-10,19.2416
2015-08-11,19.0676
2015-08-12,18.8937
2015-08-13,18.9617
2015-08-14,19.0979
2015-08-17,19.1357
2015-08-18,19.1206
2015-08-19,18.9466
2015-08-20,18.5457
2015-08-21,17.8802
2015-08-24,17.1314
2015-08-25,16.8893
2015-08-26,17.5247
2015-08-27,17.9558
2015-08-28,17.8726
2015-08-31,17.7213
2015-09-01,17.1465
2015-09-02,17.381
2015-09-03,17.4793
2015-09-04,17.1314
2015-09-08,17.5701
2015-09-09,17.328
2015-09-10,17.4112
2015-09-11,17.4869
2015-09-14,17.449
2015-09-15,17.6986
2015-09-16,17.8121
2015-09-17,17.5625
2015-09-18,17.2231
2015-09-21,17.4207
2015-09-22,17.2003
2015-09-23,17.2079
2015-09-24,17.0863
2015-09-25,17.3371
2015-09-28,16.9343
2015-09-29,16.9647
2015-09-30,17.2231
2015-10-01,17.2307
2015-10-02,17.2535
2015-10-05,17.6183
2015-10-06,17.5347
2015-10-07,17.6715
2015-10-08,17.7779
2015-10-09,17.6639
2015-10-12,17.6791
2015-10-13,17.5423
2015-10-14,17.3979
2015-10-15,17.7932
2015-10-16,17.8996
2015-10-19,17.8844
2015-10-20,17.9908
2015-10-21,17.8616
2015-10-22,18.1504
2015-10-23,18.348
2015-10-26,18.272
2015-10-27,18.1656
2015-10-28,18.5912
2015-10-29,18.5684
2015-10-30,18.3024
2015-11-02,18.5532
2015-11-03,18.5836
2015-11-04,18.5304
2015-11-05,18.6064
2015-11-06,18.7964
2015-11-09,18.5912
2015-11-10,18.6748
2015-11-11,18.614
2015-11-12,18.3328
2015-11-13,18.1808
2015-11-16,18.4012
2015-11-17,18.3632
2015-11-18,18.69
2015-11-19,18.7204
2015-11-20,18.7508
2015-11-23,18.6748
2015-11-24,18.6216
2015-11-25,18.6368
2015-11-27,18.6824
2015-11-30,18.6672
2015-12-01,18.8724
2015-12-02,18.652
2015-12-03,18.348
2015-12-04,18.8344
2015-12-07,18.6596
2015-12-08,18.424
2015-12-09,18.2112
2015-12-10,18.2264
2015-12-11,17.8236
2015-12-14,17.8616
2015-12-15,18.2796
2015-12-16,18.576
2015-12-17,18.31
2015-12-18,17.8204
2015-12-21,17.9963
2015-12-22,18.1646
2015-12-23,18.3787
2015-12-24,18.3634
2015-12-28,18.3481
2015-12-29,18.5393
2015-12-30,18.4093
2015-12-31,18.2257
2016-01-04,17.8739
2016-01-05,17.9428
2016-01-06,17.6674
2016-01-07,17.1703
2016-01-08,16.9026
2016-01-11,16.9255
2016-01-12,17.0556
2016-01-13,16.612
2016-01-14,16.7573
2016-01-15,16.3825
2016-01-19,16.3749
2016-01-20,16.0536
2016-01-21,15.9848
2016-01-22,16.2754
2016-01-25,15.9466
2016-01-26,16.2143
2016-01-27,16.1531
2016-01-28,16.1607
2016-01-29,16.612
2016-02-01,16.5431
2016-02-02,16.0842
2016-02-03,16.0995
2016-02-04,16.2372
2016-02-05,16.0231
2016-02-08,15.6177
2016-02-09,15.5948
2016-02-10,15.5106
2016-02-11,15.0364
2016-02-12,15.6712
2016-02-16,15.9236
2016-02-17,16.1378
2016-02-18,16.046
2016-02-19,16.046
2016-02-22,16.2984
2016-02-23,16.0078
2016-02-24,15.9695
2016-02-25,16.1913
2016-02-26,16.306
2016-02-29,16.1301
2016-03-01,16.6732
2016-03-02,16.8567
2016-03-03,16.9714
2016-03-04,17.0403
2016-03-07,17.0326
2016-03-08,16.7573
2016-03-09,16.7802
2016-03-10,16.7649
2016-03-11,17.2009
2016-03-14,17.1473
2016-03-15,17.1397
2016-03-16,17.1015
2016-03-17,17.3026
2016-03-18,17.4794
2016-03-21,17.4487
2016-03-22,17.3948
2016-03-23,17.2641
2016-03-24,17.1565
2016-03-28,17.2103
2016-03-29,17.241
2016-03-30,17.341
2016-03-31,17.3026
2016-04-01,17.4564
2016-04-04,17.3718
2016-04-05,17.1257
2016-04-06,17.218
2016-04-07,16.895
2016-04-08,16.9565
2016-04-11,17.0257
2016-04-12,17.241
2016-04-13,17.6332
2016-04-14,17.6717
2016-04-15,17.6102
2016-04-18,17.7409
2016-04-19,17.9639
2016-04-20,18.1023
2016-04-21,17.9408
2016-04-22,18.11
2016-04-25,18.0716
2016-04-26,18.1869
2016-04-27,18.2177
2016-04-28,18.0254
2016-04-29,17.9255
2016-05-02,18.087
2016-05-03,17.8562
2016-05-04,17.7178
2016-05-05,17.7101
2016-05-06,17.787
2016-05-09,17.7409
2016-05-10,17.9947
2016-05-11,17.8024
2016-05-12,17.8101
2016-05-13,17.5948
2016-05-16,17.6871
2016-05-17,17.5871
2016-05-18,17.8947
2016-05-19,17.7255
2016-05-20,17.8486
2016-05-23,17.8332
2016-05-24,18.1023
2016-05-25,18.2946
2016-05-26,18.1869
2016-05-27,18.31
2016-05-31,18.2638
2016-06-01,18.3023
2016-06-02,18.3407
2016-06-03,18.0793
2016-06-06,18.1869
2016-06-07,18.1485
2016-06-08,18.1639
2016-06-09,18.0331
2016-06-10,17.8101
2016-06-13,17.6871
2016-06-14,17.4256
2016-06-15,17.4487
2016-06-16,17.4879
2016-06-17,17.4802
2016-06-20,17.5807
2016-06-21,17.6812
2016-06-22,17.6658
2016-06-23,18.0369
2016-06-24,17.0705
2016-06-27,16.5834
2016-06-28,17.0086
2016-06-29,17.3952
2016-06-30,17.6696
2016-07-01,17.5807
2016-07-05,17.3178
2016-07-06,17.3642
2016-07-07,17.3874
2016-07-08,17.7199
2016-07-11,17.8204
2016-07-12,18.0446
2016-07-13,18.0446
2016-07-14,18.2147
2016-07-15,18.1837
2016-07-18,18.2456
2016-07-19,18.2533
2016-07-20,18.2842
2016-07-21,18.1915
2016-07-22,18.3074
2016-07-25,18.2688
2016-07-26,18.2842
2016-07-27,18.2765
2016-07-28,18.3152
2016-07-29,18.2842
2016-08-01,18.2379
2016-08-02,18.0832
2016-08-03,18.2688
2016-08-04,18.2224
2016-08-05,18.5703
2016-08-08,18.5935
2016-08-09,18.609
2016-08-10,18.4621
2016-08-11,18.5007
2016-08-12,18.4466
2016-08-15,18.5703
2016-08-16,18.5239
2016-08-17,18.5858
2016-08-18,18.5703
2016-08-19,18.5626
2016-08-22,18.5626
2016-08-23,18.5858
2016-08-24,18.578
2016-08-25,18.6167
2016-08-26,18.6399
2016-08-29,18.8022
2016-08-30,18.9723
2016-08-31,18.9878
2016-09-01,18.9105
2016-09-02,18.9955
2016-09-06,18.9646
2016-09-07,18.9569
2016-09-08,18.9414
2016-09-09,18.5858
2016-09-12,18.7945
2016-09-13,18.4621
2016-09-14,18.4157
2016-09-15,18.5239
2016-09-16,18.3487
2016-09-19,18.4732
2016-09-20,18.4827
2016-09-21,18.5975
2016-09-22,18.6358
2016-09-23,18.5401
2016-09-26,18.2436
2016-09-27,18.3871
2016-09-28,18.4732
2016-09-29,18.2149
2016-09-30,18.4636
2016-10-03,18.3775
2016-10-04,18.454
2016-10-05,18.7506
2016-10-06,18.7793
2016-10-07,18.7697
2016-10-10,18.8654
2016-10-11,18.6932
2016-10-12,18.6741
2016-10-13,18.4923
2016-10-14,18.5784
2016-10-17,18.4923
2016-10-18,18.6454
2016-10-19,18.808
2016-10-20,18.808
2016-10-21,18.7984
2016-10-24,18.8558
2016-10-25,18.8367
2016-10-26,18.9515
2016-10-27,18.9993
2016-10-28,18.9132
2016-10-31,18.8845
2016-11-01,18.808
2016-11-02,18.6836
2016-11-03,18.7028
2016-11-04,18.6454
2016-11-07,19.1141
2016-11-08,19.1237
2016-11-09,19.9369
2016-11-10,20.6735
2016-11-11,20.7309
2016-11-14,21.2379
2016-11-15,21.2188
2016-11-16,20.9127
2016-11-17,21.1997
2016-11-18,21.1997
2016-11-21,21.2762
2016-11-22,21.2858
2016-11-23,21.4101
2016-11-25,21.4388
2016-11-28,21.1901
2016-11-29,21.2475
2016-11-30,21.5345
2016-12-01,21.9076
2016-12-02,21.6684
2016-12-05,21.9267
2016-12-06,22.1181
2016-12-07,22.4625
2016-12-08,22.6729
2016-12-09,22.7208
2016-12-12,22.5007
2016-12-13,22.5581
2016-12-14,22.4529
2016-12-15,22.6442
2016-12-16,22.4489
2016-12-19,22.4585
2016-12-20,22.7372
2016-12-21,22.6795
2016-12-22,22.6219
2016-12-23,22.6603
2016-12-27,22.6891
2016-12-28,22.4585
2016-12-29,22.2951
2016-12-30,22.3432
2017-01-03,22.5931
2017-01-04,22.7756
2017-01-05,22.545
2017-01-06,22.6219
2017-01-09,22.4681
2017-01-10,22.5162
2017-01-11,22.6603
2017-01-12,22.4681
2017-01-13,22.5931
2017-01-17,22.0549
2017-01-18,22.2375
2017-01-19,22.1414
2017-01-20,22.2471
2017-01-23,22.1029
2017-01-24,22.3816
2017-01-25,22.7564
2017-01-26,22.8141
2017-01-27,22.7276
2017-01-30,22.545
2017-01-31,22.4008
2017-02-01,22.4297
2017-02-02,22.3432
2017-02-03,22.6315
2017-02-06,22.6891
2017-02-07,22.6315
2017-02-08,22.4777
2017-02-09,22.7852
2017-02-10,22.8525
2017-02-13,23.112
2017-02-14,23.3811
2017-02-15,23.5637
2017-02-16,23.506
2017-02-17,23.5156
2017-02-21,23.6309
2017-02-22,23.6501
2017-02-23,23.6501
2017-02-24,23.4676
2017-02-27,23.5925
2017-02-28,23.5829
2017-03-01,24.2556
2017-03-02,23.8808
2017-03-03,23.9961
2017-03-06,23.8135
2017-03-07,23.7462
2017-03-08,23.7559
2017-03-09,23.8423
2017-03-10,23.8231
2017-03-13,23.8808
2017-03-14,23.8135
2017-03-15,23.7751
2017-03-16,23.8135
2017-03-17,23.58
2017-03-20,23.4074
2017-03-21,22.7313
2017-03-22,22.6831
2017-03-23,22.7313
2017-03-24,22.7024
2017-03-27,22.6156
2017-03-28,22.9242
2017-03-29,22.7796
2017-03-30,23.0785
2017-03-31,22.8856
2017-04-03,22.8374
2017-04-04,22.8085
2017-04-05,22.6349
2017-04-06,22.7796
2017-04-07,22.6831
2017-04-10,22.6253
2017-04-11,22.5577
2017-04-12,22.3745
2017-04-13,22.0852
2017-04-17,22.4709
2017-04-18,22.2588
2017-04-19,22.1913
2017-04-20,22.5674
2017-04-21,22.3359
2017-04-24,22.8374
2017-04-25,23.04
2017-04-26,23.0207
2017-04-27,22.9146
2017-04-28,22.6928
2017-05-01,22.8374
2017-05-02,22.8085
2017-05-03,22.9917
2017-05-04,23.0303
2017-05-05,22.9917
2017-05-08,22.9724
2017-05-09,22.8856
2017-05-10,22.9628
2017-05-11,22.8181
2017-05-12,22.7217
2017-05-15,22.8953
2017-05-16,22.9628
2017-05-17,22.2395
2017-05-18,22.3263
2017-05-19,22.5192
2017-05-22,22.577
2017-05-23,22.7506
2017-05-24,22.741
2017-05-25,22.7796
2017-05-26,22.7699
2017-05-30,22.6156
2017-05-31,22.4227
2017-06-01,22.7024
2017-06-02,22.6156
2017-06-05,22.6542
2017-06-06,22.5577
2017-06-07,22.7313
2017-06-08,22.9917
2017-06-09,23.4257
2017-06-12,23.4739
2017-06-13,23.5993
2017-06-14,23.6379
2017-06-15,23.5414
2017-06-16,23.5154
2017-06-19,23.7574
2017-06-20,23.5541
2017-06-21,23.3605
2017-06-22,23.2152
2017-06-23,23.1281
2017-06-26,23.254
2017-06-27,23.3701
2017-06-28,23.738
2017-06-29,23.9026
2017-06-30,23.8832
2017-07-03,24.2318
2017-07-05,24.2705
2017-07-06,24.0865
2017-07-07,24.2511
2017-07-10,24.2221
2017-07-11,24.0091
2017-07-12,24.0865
2017-07-13,24.2318
2017-07-14,24.1253
2017-07-17,24.0478
2017-07-18,24.0091
2017-07-19,24.0188
2017-07-20,24.0091
2017-07-21,24.0091
2017-07-24,24.1156
2017-07-25,24.4157
2017-07-26,24.2511
2017-07-27,24.1156
2017-07-28,24.1156
2017-07-31,24.2898
2017-08-01,24.5028
2017-08-02,24.5028
2017-08-03,24.4157
2017-08-04,24.5803
2017-08-07,24.5416
2017-08-08,24.4738
2017-08-09,24.4738
2017-08-10,24.0381
2017-08-11,23.9413
2017-08-14,24.2705
2017-08-15,24.2898
2017-08-16,24.2414
2017-08-17,23.8252
2017-08-18,23.8348
2017-08-21,23.7671
2017-08-22,24.0285
2017-08-23,23.951
2017-08-24,23.951
2017-08-25,24.0188
2017-08-28,23.8639
2017-08-29,23.7864
2017-08-30,23.8832
2017-08-31,23.9123
2017-09-01,23.9801
2017-09-05,23.467
2017-09-06,23.525
2017-09-07,23.1184
2017-09-08,23.3314
2017-09-11,23.738
2017-09-12,24.0188
2017-09-13,24.0575
2017-09-14,24.0091
2017-09-15,24.0803
2017-09-18,24.3622
2017-09-19,24.5469
2017-09-20,24.6927
2017-09-21,24.7511
2017-09-22,24.7219
2017-09-25,24.6927
2017-09-26,24.683
2017-09-27,24.9844
2017-09-28,25.0233
2017-09-29,25.1399
2017-10-02,25.3538
2017-10-03,25.4413
2017-10-04,25.3246
2017-10-05,25.5871
2017-10-06,25.6163
2017-10-09,25.5191
2017-10-10,25.6357
2017-10-11,25.5871
2017-10-12,25.3927
2017-10-13,25.4024
2017-10-16,25.5677
2017-10-17,25.4413
2017-10-18,25.5774
2017-10-19,25.5968
2017-10-20,25.8982
2017-10-23,25.8788
2017-10-24,26.0635
2017-10-25,25.9079
2017-10-26,26.0537
2017-10-27,26.0343
2017-10-30,25.9274
2017-10-31,25.8593
2017-11-01,25.8982
2017-11-02,26.1412
2017-11-03,26.0343
2017-11-06,26.0051
2017-11-07,25.6454
2017-11-08,25.5191
2017-11-09,25.4316
2017-11-10,25.3538
2017-11-13,25.3927
2017-11-14,25.383
2017-11-15,25.451
2017-11-16,25.4607
2017-11-17,25.4316
2017-11-20,25.5482
2017-11-21,25.626
2017-11-22,25.4996
2017-11-24,25.4899
2017-11-27,25.4705
2017-11-28,26.1315
2017-11-29,26.5787
2017-11-30,26.7537
2017-12-01,26.812
2017-12-04,27.2203
2017-12-05,27.0745
2017-12-06,26.9773
2017-12-07,27.0648
2017-12-08,27.2301
2017-12-11,27.162
2017-12-12,27.4342
2017-12-13,27.094
2017-12-14,26.919
2017-12-15,27.1603
2017-12-18,27.4044
2017-12-19,27.2873
2017-12-20,27.2384
2017-12-21,27.4728
2017-12-22,27.3947
2017-12-26,27.3166
2017-12-27,27.3459
2017-12-28,27.4533
2017-12-29,27.258
2018-01-02,27.2677
2018-01-03,27.4142
2018-01-04,27.6681
2018-01-05,27.7463
2018-01-08,27.7072
2018-01-09,27.9221
2018-01-10,28.1565
2018-01-11,28.2932
2018-01-12,28.5471
2018-01-16,28.469
2018-01-17,28.6838
2018-01-18,28.6448
2018-01-19,28.8499
2018-01-22,29.0843
2018-01-23,29.1136
2018-01-24,29.3089
2018-01-25,29.2503
2018-01-26,29.4652
2018-01-29,29.348
2018-01-30,28.9671
2018-01-31,29.0452
2018-02-01,29.3187
2018-02-02,28.6741
2018-02-05,27.2287
2018-02-06,27.7267
2018-02-07,27.7463
2018-02-08,26.5255
2018-02-09,27.0333
2018-02-12,27.4142
2018-02-13,27.5314
2018-02-14,28.1858
2018-02-15,28.342
2018-02-16,28.303
2018-02-20,28.2151
2018-02-21,28.2541
2018-02-22,28.0197
2018-02-23,28.4397
2018-02-26,28.8694
2018-02-27,28.5959
2018-02-28,28.1955
2018-03-01,27.7072
2018-03-02,27.7756
2018-03-05,28.1662
2018-03-06,28.2834
2018-03-07,28.2346
2018-03-08,28.3225
2018-03-09,29.0061
2018-03-12,28.9085
2018-03-13,28.5862
2018-03-14,28.2639
2018-03-15,28.2737
2018-03-16,28.2977
2018-03-19,28.0919
2018-03-20,28.1605
2018-03-21,28.1507
2018-03-22,27.1117
2018-03-23,26.2884
2018-03-26,27.1411
2018-03-27,26.6118
2018-03-28,26.6608
2018-03-29,27.0235
2018-04-02,26.4256
2018-04-03,26.7883
2018-04-04,27.0725
2018-04-05,27.2882
2018-04-06,26.6314
2018-04-09,26.7785
2018-04-10,27.1803
2018-04-11,26.8569
2018-04-12,27.3274
2018-04-13,26.9157
2018-04-16,27.0333
2018-04-17,27.0333
2018-04-18,26.9059
2018-04-19,27.3176
2018-04-20,27.3274
2018-04-23,27.298
2018-04-24,27.1215
2018-04-25,27.1019
2018-04-26,27.1117
2018-04-27,27.1509
2018-04-30,26.9059
2018-05-01,26.9157
2018-05-02,26.6118
2018-05-03,26.3864
2018-05-04,26.7295
2018-05-07,26.9059
2018-05-08,27.0921
2018-05-09,27.494
2018-05-10,27.7194
2018-05-11,27.6998
2018-05-14,27.6802
2018-05-15,27.6312
2018-05-16,27.6802
2018-05-17,27.6214
2018-05-18,27.396
2018-05-21,27.592
2018-05-22,27.7782
2018-05-23,27.6018
2018-05-24,27.3862
2018-05-25,27.298
2018-05-29,26.3864
2018-05-30,26.8667
2018-05-31,26.6412
2018-06-01,26.9353
2018-06-04,27.0235
2018-06-05,26.9059
2018-06-06,27.396
2018-06-07,27.4842
2018-06-08,27.5234
2018-06-11,27.4646
2018-06-12,27.396
2018-06-13,27.298
2018-06-14,27.0431
2018-06-15,27.0421
2018-06-18,26.9929
2018-06-19,26.924
2018-06-20,26.8551
2018-06-21,26.7763
2018-06-22,26.6483
2018-06-25,26.3628
2018-06-26,26.2742
2018-06-27,25.9494
2018-06-28,26.1758
2018-06-29,26.1758
2018-07-02,26.3038
2018-07-03,26.0675
2018-07-05,26.1266
2018-07-06,26.2546
2018-07-09,26.8551
2018-07-10,26.7566
2018-07-11,26.6286
2018-07-12,26.6779
2018-07-13,26.5597
2018-07-16,27.0322
2018-07-17,27.0618
2018-07-18,27.4949
2018-07-19,27.0815
2018-07-20,27.1307
2018-07-23,27.5048
2018-07-24,27.5835
2018-07-25,27.6426
2018-07-26,27.6327
2018-07-27,27.6918
2018-07-30,27.7115
2018-07-31,27.5146
2018-08-01,27.5146
2018-08-02,27.5245
2018-08-03,27.682
2018-08-06,27.8296
2018-08-07,27.9576
2018-08-08,28.0265
2018-08-09,27.8592
2018-08-10,27.5343
2018-08-13,27.2685
2018-08-14,27.5245
2018-08-15,27.3079
2018-08-16,27.6721
2018-08-17,27.7312
2018-08-20,27.8198
2018-08-21,27.9281
2018-08-22,27.8296
2018-08-23,27.7017
2018-08-24,27.8001
2018-08-27,28.1742
2018-08-28,28.1446
2018-08-29,28.1348
2018-08-30,27.9182
2018-08-31,27.8887
2018-09-04,28.0265
2018-09-05,28.0462
2018-09-06,27.9182
2018-09-07,27.8887
2018-09-10,27.8592
2018-09-11,27.8887
2018-09-12,27.6327
2018-09-13,27.5934
2018-09-14,27.7903
2018-09-17,27.6721
2018-09-18,27.8099
2018-09-19,28.2825
2018-09-20,28.5286
2018-09-21,28.4173
2018-09-24,28.1009
2018-09-25,27.9922
2018-09-26,27.656
2018-09-27,27.5571
2018-09-28,27.2704
2018-10-01,27.3791
2018-10-02,27.3791
2018-10-03,27.6362
2018-10-04,27.8241
2018-10-05,27.6857
2018-10-08,27.8735
2018-10-09,27.7648
2018-10-10,26.9045
2018-10-11,26.1036
2018-10-12,26.1333
2018-10-15,26.0146
2018-10-16,26.4497
2018-10-17,26.7167
2018-10-18,26.2717
2018-10-19,26.3706
2018-10-22,25.807
2018-10-23,25.5993
2018-10-24,24.9566
2018-10-25,25.3423
2018-10-26,24.9764
2018-10-29,25.1939
2018-10-30,25.629
2018-10-31,25.985
2018-11-01,26.1036
2018-11-02,26.0838
2018-11-05,26.4991
2018-11-06,26.6376
2018-11-07,26.9836
2018-11-08,27.0627
2018-11-09,26.8155
2018-11-12,26.2816
2018-11-13,26.4299
2018-11-14,26.074
2018-11-15,26.4596
2018-11-16,26.4892
2018-11-19,26.4794
2018-11-20,25.896
2018-11-21,25.9157
2018-11-23,25.7081
2018-11-26,26.2322
2018-11-27,26.2519
2018-11-28,26.7562
2018-11-29,26.5288
2018-11-30,26.6672
2018-12-03,26.8353
2018-12-04,25.6686
2018-12-06,25.3126
2018-12-07,24.8281
2018-12-10,24.482
2018-12-11,24.2447
2018-12-12,24.3832
2018-12-13,24.2052
2018-12-14,23.9679
2018-12-17,23.7306
2018-12-18,23.6416
2018-12-19,23.3449
2018-12-20,23.1373
2018-12-21,22.6745
2018-12-24,22.197
2018-12-26,23.2019
2018-12-27,23.4804
2018-12-28,23.4705
2018-12-31,23.6993
2019-01-02,23.8983
2019-01-03,23.361
2019-01-04,24.1371
2019-01-07,24.1669
2019-01-08,24.1868
2019-01-09,24.3062
2019-01-10,24.3162
2019-01-11,24.3759
2019-01-14,24.545
2019-01-15,24.7639
2019-01-16,25.2912
2019-01-17,25.4305
2019-01-18,25.8683
2019-01-22,25.5698
2019-01-23,25.5997
2019-01-24,25.6593
2019-01-25,25.8683
2019-01-28,25.7887
2019-01-29,25.6991
2019-01-30,25.8484
2019-01-31,25.8086
2019-02-01,25.918
2019-02-04,26.0275
2019-02-05,25.9578
2019-02-06,25.928
2019-02-07,25.6693
2019-02-08,25.54
2019-02-11,25.6196
2019-02-12,25.9976
2019-02-13,26.0673
2019-02-14,25.7489
2019-02-15,26.2961
2019-02-19,26.3359
2019-02-20,26.505
2019-02-21,26.3658
2019-02-22,26.326
2019-02-25,26.4354
2019-02-26,26.3558
2019-02-27,26.4553
2019-02-28,26.3856
2019-03-01,26.5548
2019-03-04,26.3856
2019-03-05,26.2862
2019-03-06,26.117
2019-03-07,25.8484
2019-03-08,25.8384
2019-03-11,26.1071
2019-03-12,26.1668
2019-03-13,26.3459
2019-03-14,26.4453
2019-03-15,26.63
2019-03-18,26.9
2019-03-19,26.69
2019-03-20,26.14
2019-03-21,26.06
2019-03-22,25.34
2019-03-25,25.23
2019-03-26,25.53
2019-03-27,25.42
2019-03-28,25.64
2019-03-29,25.71
2019-04-01,26.34
2019-04-02,26.32
2019-04-03,26.4
2019-04-04,26.56
2019-04-05,26.6
2019-04-08,26.63
2019-04-09,26.41
2019-04-10,26.49
2019-04-11,26.65
2019-04-12,27.14
2019-04-15,26.97
2019-04-16,27.35
2019-04-17,27.42
2019-04-18,27.34
2019-04-22,27.26
2019-04-23,27.43
2019-04-24,27.4
2019-04-25,27.45
2019-04-26,27.7
2019-04-29,27.98
2019-04-30,28.02
2019-05-01,27.79
2019-05-02,27.82
2019-05-03,28.07
2019-05-06,27.88
2019-05-07,27.42
2019-05-08,27.36
2019-05-09,27.3
2019-05-10,27.48
2019-05-13,26.68
2019-05-14,26.89
2019-05-15,26.79
2019-05-16,27.06
2019-05-17,26.88
2019-05-20,26.91
2019-05-21,27.19
2019-05-22,27.03
2019-05-23,26.65
2019-05-24,26.86
2019-05-28,26.55
2019-05-29,26.5
2019-05-30,26.41
2019-05-31,26.01
2019-06-03,26.18
2019-06-04,26.89
2019-06-05,27.06
2019-06-06,27.16
2019-06-07,27.12
2019-06-10,27.35
2019-06-11,27.36
2019-06-12,27.09
2019-06-13,27.14
2019-06-14,27.33
2019-06-17,27.005
2019-06-18,27.355
2019-06-19,27.28
2019-06-20,27.425
2019-06-21,27.295
2019-06-24,27.17
2019-06-25,27.085
2019-06-26,27.015
2019-06-27,27.245
2019-06-28,27.545
2019-07-01,27.92
2019-07-02,27.835
2019-07-03,28.075
2019-07-04,28.075
2019-07-05,28.155
2019-07-08,28.02
2019-07-09,28.055
2019-07-10,27.96
2019-07-11,28.125
2019-07-12,28.29
2019-07-15,28.085
2019-07-16,28.11
2019-07-17,27.865
2019-07-18,28.07
2019-07-19,27.955
2019-07-22,27.985
2019-07-23,28.305
2019-07-24,28.56
2019-07-25,28.37
2019-07-26,28.69
2019-07-29,28.47
2019-07-30,28.385
2019-07-31,28.28
2019-08-01,27.6
2019-08-02,27.595
2019-08-05,26.705
2019-08-06,27.095
2019-08-07,26.8
2019-08-08,27.225
2019-08-09,27.165
2019-08-12,26.645
2019-08-13,26.935
2019-08-14,26.03
2019-08-15,26.095
2019-08-16,26.615
2019-08-19,26.86
2019-08-20,26.47
2019-08-21,26.59
2019-08-22,26.785
2019-08-23,25.925
2019-08-26,26.31
2019-08-27,26.185
2019-08-28,26.415
2019-08-29,26.8
2019-08-30,26.94
2019-09-02,26.925
2019-09-03,26.595
2019-09-04,26.915
2019-09-05,27.445
2019-09-06,27.43
2019-09-09,27.87
2019-09-10,27.93
2019-09-11,28.12
2019-09-12,28.3
2019-09-13,28.5
2019-09-16,28.38
2019-09-17,28.395
2019-09-18,28.515
2019-09-19,28.405
2019-09-20,28.135
2019-09-23,28.135
2019-09-24,27.875
2019-09-25,28.105
2019-09-26,27.965
2019-09-27,28.02
2019-09-30,28.03
2019-10-01,27.435
2019-10-02,26.865
2019-10-03,26.885
2019-10-04,27.465
2019-10-07,27.38
2019-10-08,26.765
2019-10-09,27.055
2019-10-10,27.33
2019-10-11,27.685
2019-10-14,27.705
2019-10-15,28.19
2019-10-16,28.015
2019-10-17,28.035
2019-10-18,28.135
2019-10-21,28.5
2019-10-22,28.43
2019-10-23,28.5
2019-10-24,28.525
2019-10-25,28.665
2019-10-28,28.82
2019-10-29,28.88
2019-10-30,28.825
2019-10-31,28.655
2019-11-01,29.08
2019-11-04,29.365
