date,close
2014-06-13,84.5988
2014-06-16,83.9084
2014-06-17,85.6392
2014-06-18,85.4122
2014-06-19,85.2798
2014-06-20,87.0389
2014-06-23,86.8025
2014-06-24,86.2256
2014-06-25,86.1594
2014-06-26,86.3674
2014-06-27,87.1619
2014-06-30,87.5496
2014-07-01,89.1102
2014-07-02,88.5711
2014-07-03,88.2306
2014-07-07,86.6322
2014-07-08,86.2634
2014-07-09,86.2256
2014-07-10,86.3201
2014-07-11,86.2256
2014-07-14,86.3485
2014-07-15,86.1404
2014-07-16,84.7975
2014-07-17,84.4002
2014-07-18,86.2161
2014-07-21,85.5635
2014-07-22,86.2918
2014-07-23,87.2659
2014-07-24,87.0389
2014-07-25,87.6064
2014-07-28,88.4292
2014-07-29,88.7224
2014-07-30,88.7697
2014-07-31,88.259
2014-08-01,88.0509
2014-08-04,88.1076
2014-08-05,87.8334
2014-08-06,88.0698
2014-08-07,88.59
2014-08-08,89.0534
2014-08-11,89.5641
2014-08-12,89.2331
2014-08-13,90.822
2014-08-14,91.4462
2014-08-15,90.9733
2014-08-18,91.3611
2014-08-19,91.3231
2014-08-20,90.4977
2014-08-21,90.7443
2014-08-22,90.7254
2014-08-25,91.0764
2014-08-26,90.6305
2014-08-27,89.6342
2014-08-28,90.194
2014-08-29,90.6305
2014-09-02,91.2852
2014-09-03,90.7254
2014-09-04,90.2035
2014-09-05,90.3079
2014-09-08,91.6078
2014-09-09,91.1428
2014-09-10,90.7823
2014-09-11,89.5488
2014-09-12,88.0877
2014-09-15,87.5848
2014-09-16,89.1788
2014-09-17,89.4919
2014-09-18,89.2927
2014-09-19,89.008
2014-09-22,89.6627
2014-09-23,88.3913
2014-09-24,89.6817
2014-09-25,88.657
2014-09-26,88.7993
2014-09-29,88.9796
2014-09-30,88.7613
2014-10-01,88.0687
2014-10-02,88.8467
2014-10-03,89.397
2014-10-06,88.4577
2014-10-07,86.8542
2014-10-08,87.6228
2014-10-09,85.8959
2014-10-10,84.7668
2014-10-13,83.5239
2014-10-14,83.2772
2014-10-15,83.9793
2014-10-16,85.4025
2014-10-17,86.1995
2014-10-20,85.8959
2014-10-21,89.046
2014-10-22,88.3439
2014-10-23,88.4672
2014-10-24,88.9226
2014-10-27,89.4919
2014-10-28,86.247
2014-10-29,86.9491
2014-10-30,87.0819
2014-10-31,86.3893
2014-11-03,86.4273
2014-11-04,86.0477
2014-11-05,86.0003
2014-11-06,86.8096
2014-11-07,86.3764
2014-11-10,86.7429
2014-11-11,87.3238
2014-11-12,87.6189
2014-11-13,87.6951
2014-11-14,86.3049
2014-11-17,85.8289
2014-11-18,86.0383
2014-11-19,84.9052
2014-11-20,85.467
2014-11-21,85.9431
2014-11-24,87.5523
2014-11-25,86.6477
2014-11-26,87.1714
2014-11-28,87.2286
2014-12-01,85.9336
2014-12-02,85.8003
2014-12-03,85.9336
2014-12-04,85.686
2014-12-05,85.5146
2014-12-08,86.3525
2014-12-09,85.8003
2014-12-10,86.3811
2014-12-11,87.7332
2014-12-12,88.6092
2014-12-15,87.1714
2014-12-16,85.8955
2014-12-17,86.9715
2014-12-18,89.1805
2014-12-19,89.3328
2014-12-22,89.39
2014-12-23,88.7901
2014-12-24,89.8185
2014-12-26,90.3422
2014-12-29,89.628
2014-12-30,88.9329
2014-12-31,87.9808
2015-01-02,87.0667
2015-01-05,86.0193
2015-01-06,85.2671
2015-01-07,86.4192
2015-01-08,87.1333
2015-01-09,87.3904
2015-01-12,87.1429
2015-01-13,88.0665
2015-01-14,88.6282
2015-01-15,87.2095
2015-01-16,88.6092
2015-01-20,88.8663
2015-01-21,88.5997
2015-01-22,89.1805
2015-01-23,88.9329
2015-01-26,88.9805
2015-01-27,88.6949
2015-01-28,88.6473
2015-01-29,89.7232
2015-01-30,88.5711
2015-02-02,88.6092
2015-02-03,85.9336
2015-02-04,85.7527
2015-02-05,86.8858
2015-02-06,85.7336
2015-02-09,85.4861
2015-02-10,87.1238
2015-02-11,87.2958
2015-02-12,88.6526
2015-02-13,90.4012
2015-02-17,91.5669
2015-02-18,91.7485
2015-02-19,91.3949
2015-02-20,92.0734
2015-02-23,93.3346
2015-02-24,93.1435
2015-02-25,94.2997
2015-02-26,94.1373
2015-02-27,93.1913
2015-03-02,93.9366
2015-03-03,93.0575
2015-03-04,93.2009
2015-03-05,93.4588
2015-03-06,93.1435
2015-03-09,92.7327
2015-03-10,91.3949
2015-03-11,92.5798
2015-03-12,92.1593
2015-03-13,92.2645
2015-03-16,93.1626
2015-03-17,93.3155
2015-03-18,93.9653
2015-03-19,96.0578
2015-03-20,96.655
2015-03-23,96.2298
2015-03-24,96.1247
2015-03-25,94.357
2015-03-26,94.0895
2015-03-27,94.6341
2015-03-30,96.163
2015-03-31,95.8285
2015-04-01,95.5036
2015-04-02,94.1373
2015-04-06,95.9432
2015-04-07,94.5004
2015-04-08,95.0832
2015-04-09,95.389
2015-04-10,95.5419
2015-04-13,95.6183
2015-04-14,95.5132
2015-04-15,95.6852
2015-04-16,96.3732
2015-04-17,96.5356
2015-04-20,97.2236
2015-04-21,97.2522
2015-04-22,97.3287
2015-04-23,98.16
2015-04-24,96.3636
2015-04-27,94.2233
2015-04-28,94.3093
2015-04-29,94.0226
2015-04-30,91.6911
2015-05-01,92.4269
2015-05-04,92.5416
2015-05-05,93.1531
2015-05-06,93.9748
2015-05-07,93.4397
2015-05-08,94.185
2015-05-11,93.8984
2015-05-12,94.1755
2015-05-13,94.7986
2015-05-14,96.7446
2015-05-15,96.8405
2015-05-18,97.9621
2015-05-19,98.3455
2015-05-20,98.4989
2015-05-21,98.5085
2015-05-22,98.3647
2015-05-26,97.8183
2015-05-27,98.1059
2015-05-28,97.732
2015-05-29,97.061
2015-06-01,96.342
2015-06-02,96.0352
2015-06-03,96.0352
2015-06-04,96.0544
2015-06-05,94.6644
2015-06-08,95.2204
2015-06-09,94.2043
2015-06-10,94.9999
2015-06-11,95.8148
2015-06-12,95.23
2015-06-15,94.0317
2015-06-16,93.7154
2015-06-17,93.8783
2015-06-18,95.4888
2015-06-19,96.2845
2015-06-22,97.0035
2015-06-23,97.1664
2015-06-24,95.3546
2015-06-25,96.0065
2015-06-26,96.1407
2015-06-29,94.0605
2015-06-30,94.396
2015-07-01,93.5045
2015-07-02,92.5458
2015-07-06,93.8304
2015-07-07,93.3894
2015-07-08,92.4596
2015-07-09,93.2073
2015-07-10,94.6932
2015-07-13,96.4858
2015-07-14,98.4031
2015-07-15,99.007
2015-07-16,100.2436
2015-07-17,99.5726
2015-07-20,100.1861
2015-07-21,100.675
2015-07-22,102.736
2015-07-23,103.0332
2015-07-24,102.8127
2015-07-27,102.784
2015-07-28,104.4424
2015-07-29,105.1422
2015-07-30,105.4585
2015-07-31,104.8546
2015-08-03,105.449
2015-08-04,105.2381
2015-08-05,106.4651
2015-08-06,105.3819
2015-08-07,104.0014
2015-08-10,104.4424
2015-08-11,103.4934
2015-08-12,102.1034
2015-08-13,101.9206
2015-08-14,101.5841
2015-08-17,102.4014
2015-08-18,101.7187
2015-08-19,101.2572
2015-08-20,99.7091
2015-08-21,97.6034
2015-08-24,91.017
2015-08-25,89.6709
2015-08-26,91.8247
2015-08-27,92.7862
2015-08-28,92.3055
2015-08-31,90.844
2015-09-01,88.4113
2015-09-02,89.4209
2015-09-03,88.4979
2015-09-04,88.6902
2015-09-08,90.7382
2015-09-09,89.6901
2015-09-10,91.1132
2015-09-11,91.7862
2015-09-14,92.1324
2015-09-15,92.9881
2015-09-16,92.017
2015-09-17,92.6228
2015-09-18,91.3728
2015-09-21,91.1901
2015-09-22,91.4689
2015-09-23,90.9882
2015-09-24,90.1132
2015-09-25,87.3344
2015-09-28,85.5076
2015-09-29,87.3344
2015-09-30,88.9017
2015-10-01,87.5748
2015-10-02,89.9401
2015-10-05,90.1228
2015-10-06,89.5555
2015-10-07,90.6324
2015-10-08,90.0844
2015-10-09,90.7863
2015-10-12,91.6324
2015-10-13,89.6228
2015-10-14,88.046
2015-10-15,90.1901
2015-10-16,91.3151
2015-10-19,92.2189
2015-10-20,92.0555
2015-10-21,92.1805
2015-10-22,89.4978
2015-10-23,91.8343
2015-10-26,91.9209
2015-10-27,92.2478
2015-10-28,84.0845
2015-10-29,83.9787
2015-10-30,84.8056
2015-11-02,86.9498
2015-11-03,85.9691
2015-11-04,85.6133
2015-11-05,85.4883
2015-11-06,86.1518
2015-11-09,85.3826
2015-11-10,87.3415
2015-11-11,85.9616
2015-11-12,84.0316
2015-11-13,83.9544
2015-11-16,84.6299
2015-11-17,85.0545
2015-11-18,88.4802
2015-11-19,86.9845
2015-11-20,86.8687
2015-11-23,88.1135
2015-11-24,87.2354
2015-11-25,88.21
2015-11-27,89.3873
2015-11-30,88.017
2015-12-01,88.2969
2015-12-02,88.789
2015-12-03,88.432
2015-12-04,88.9145
2015-12-07,88.6057
2015-12-08,88.7215
2015-12-09,87.2354
2015-12-10,87.2933
2015-12-11,85.1027
2015-12-14,85.9519
2015-12-15,85.9037
2015-12-16,87.4477
2015-12-17,86.4827
2015-12-18,85.0545
2015-12-21,84.8036
2015-12-22,85.9037
2015-12-23,86.7336
2015-12-24,88.017
2015-12-28,88.432
2015-12-29,88.6346
2015-12-30,88.017
2015-12-31,86.8494
2016-01-04,85.1413
2016-01-05,84.8904
2016-01-06,84.6299
2016-01-07,84.0991
2016-01-08,82.7578
2016-01-11,81.3103
2016-01-12,82.256
2016-01-13,79.5347
2016-01-14,80.6059
2016-01-15,80.4032
2016-01-19,79.2742
2016-01-20,79.5058
2016-01-21,79.7567
2016-01-22,82.864
2016-01-25,79.7953
2016-01-26,81.0691
2016-01-27,80.4129
2016-01-28,78.3767
2016-01-29,79.7953
2016-02-01,78.9461
2016-02-02,83.2307
2016-02-03,82.8254
2016-02-04,81.8314
2016-02-05,84.4658
2016-02-08,82.0051
2016-02-09,81.7253
2016-02-10,82.2386
2016-02-11,80.7663
2016-02-12,81.9286
2016-02-16,84.7184
2016-02-17,85.0186
2016-02-18,84.3987
2016-02-19,85.658
2016-02-22,85.6967
2016-02-23,83.8369
2016-02-24,84.0791
2016-02-25,84.3212
2016-02-26,84.2244
2016-02-29,83.1491
2016-03-01,87.1691
2016-03-02,87.6146
2016-03-03,88.1474
2016-03-04,89.6682
2016-03-07,90.3462
2016-03-08,89.3679
2016-03-09,89.426
2016-03-10,89.426
2016-03-11,91.2858
2016-03-14,91.3246
2016-03-15,89.2129
2016-03-16,90.4818
2016-03-17,90.4915
2016-03-18,91.7605
2016-03-21,91.8186
2016-03-22,91.8476
2016-03-23,89.9007
2016-03-24,90.9274
2016-03-28,90.0653
2016-03-29,91.0437
2016-03-30,92.5644
2016-03-31,91.5571
2016-04-01,92.5063
2016-04-04,91.683
2016-04-05,89.2613
2016-04-06,91.838
2016-04-07,90.9274
2016-04-08,90.1622
2016-04-11,89.1548
2016-04-12,89.0967
2016-04-13,89.736
2016-04-14,88.9611
2016-04-15,90.0169
2016-04-18,91.0243
2016-04-19,89.7457
2016-04-20,89.6779
2016-04-21,90.9759
2016-04-22,91.8476
2016-04-25,90.1719
2016-04-26,90.7531
2016-04-27,91.0437
2016-04-28,89.6585
2016-04-29,90.2591
2016-05-02,90.3753
2016-05-03,97.398
2016-05-04,96.8071
2016-05-05,97.2527
2016-05-06,97.7467
2016-05-09,98.6573
2016-05-10,98.7541
2016-05-11,98.4238
2016-05-12,98.3169
2016-05-13,99.0165
2016-05-16,100.1826
2016-05-17,99.6093
2016-05-18,99.7064
2016-05-19,100.0854
2016-05-20,101.4652
2016-05-23,102.126
2016-05-24,103.7876
2016-05-25,104.0694
2016-05-26,104.1277
2016-05-27,106.5083
2016-05-31,106.7707
2016-06-01,108.2088
2016-06-02,108.5392
2016-06-03,107.4801
2016-06-06,108.9376
2016-06-07,109.7247
2016-06-08,110.949
2016-06-09,110.5992
2016-06-10,109.8802
2016-06-13,109.1611
2016-06-14,109.336
2016-06-15,109.4526
2016-06-16,109.5498
2016-06-17,107.0234
2016-06-20,107.8104
2016-06-21,107.6647
2016-06-22,108.0436
2016-06-23,109.5498
2016-06-24,108.306
2016-06-27,104.633
2016-06-28,106.0419
2016-06-29,105.8962
2016-06-30,109.5789
2016-07-01,109.0639
2016-07-05,109.2777
2016-07-06,109.7538
2016-07-07,111.911
2016-07-08,111.911
2016-07-11,111.1822
2016-07-12,111.3863
2016-07-13,111.0948
2016-07-14,108.7141
2016-07-15,107.7813
2016-07-18,108.4809
2016-07-19,107.7424
2016-07-20,108.3254
2016-07-21,107.7521
2016-07-22,107.6161
2016-07-25,107.2954
2016-07-26,107.2663
2016-07-27,107.5772
2016-07-28,107.6452
2016-07-29,109.2388
2016-08-01,110.5604
2016-08-02,109.5109
2016-08-03,109.4623
2016-08-04,109.2874
2016-08-05,109.4332
2016-08-08,108.4226
2016-08-09,108.1117
2016-08-10,107.8979
2016-08-11,108.4615
2016-08-12,107.7521
2016-08-15,108.306
2016-08-16,107.208
2016-08-17,108.9765
2016-08-18,103.5738
2016-08-19,104.118
2016-08-22,104.1568
2016-08-23,103.6127
2016-08-24,101.9705
2016-08-25,102.4286
2016-08-26,103.0036
2016-08-29,103.3448
2016-08-30,101.8535
2016-08-31,102.682
2016-09-01,103.8321
2016-09-02,104.1732
2016-09-06,104.5826
2016-09-07,107.1167
2016-09-08,107.721
2016-09-09,103.4325
2016-09-12,105.1479
2016-09-13,102.9061
2016-09-14,104.2999
2016-09-15,106.9121
2016-09-16,104.758
2016-09-19,106.5709
2016-09-20,105.8789
2016-09-21,104.7678
2016-09-22,106.7366
2016-09-23,105.5963
2016-09-26,105.5085
2016-09-27,106.6002
2016-09-28,105.9569
2016-09-29,105.5183
2016-09-30,106.7269
2016-10-03,106.8828
2016-10-04,107.5651
2016-10-05,108.0817
2016-10-06,108.3546
2016-10-07,108.1499
2016-10-10,108.1791
2016-10-11,104.0075
2016-10-12,102.5065
2016-10-13,103.0231
2016-10-14,103.0231
2016-10-17,102.4286
2016-10-18,102.5553
2016-10-19,102.0679
2016-10-20,103.257
2016-10-21,102.2824
2016-10-24,102.8477
2016-10-25,100.2355
2016-10-26,98.9295
2016-10-27,98.6273
2016-10-28,98.4616
2016-10-31,101.3564
2016-11-01,98.7638
2016-11-02,97.7404
2016-11-03,96.7657
2016-11-04,96.9216
2016-11-07,98.2375
2016-11-08,98.1985
2016-11-09,101.5131
2016-11-10,102.97
2016-11-11,104.1238
2016-11-14,104.1825
2016-11-15,103.762
2016-11-16,102.7354
2016-11-17,103.0971
2016-11-18,102.4518
2016-11-21,102.2954
2016-11-22,102.9309
2016-11-23,103.9185
2016-11-25,104.7594
2016-11-28,103.6056
2016-11-29,104.5051
2016-11-30,103.0189
2016-12-01,103.5176
2016-12-02,103.058
2016-12-05,103.9967
2016-12-06,105.8447
2016-12-07,104.2216
2016-12-08,105.6394
2016-12-09,105.1114
2016-12-12,102.7647
2016-12-13,103.0482
2016-12-14,102.7451
2016-12-15,102.9994
2016-12-16,102.5007
2016-12-19,101.914
2016-12-20,102.3834
2016-12-21,100.2518
2016-12-22,99.978
2016-12-23,100.9265
2016-12-27,101.7282
2016-12-28,101.0145
2016-12-29,101.1611
2016-12-30,100.5451
2017-01-03,100.33
2017-01-04,102.6474
2017-01-05,100.8776
2017-01-06,101.4153
2017-01-09,100.946
2017-01-10,101.6989
2017-01-11,99.4011
2017-01-12,99.7433
2017-01-13,99.1371
2017-01-17,96.8589
2017-01-18,96.8002
2017-01-19,95.8224
2017-01-20,95.842
2017-01-23,95.7247
2017-01-24,95.7736
2017-01-25,96.7709
2017-01-26,96.722
2017-01-27,97.6411
2017-01-30,96.9176
2017-01-31,99.4891
2017-02-01,99.89
2017-02-02,99.3229
2017-02-03,100.5158
2017-02-06,98.658
2017-02-07,98.9318
2017-02-08,97.6411
2017-02-09,101.2491
2017-02-10,100.9558
2017-02-13,101.6011
2017-02-14,102.1976
2017-02-15,103.1784
2017-02-16,102.992
2017-02-17,103.2176
2017-02-21,103.3844
2017-02-22,103.6786
2017-02-23,104.2965
2017-02-24,104.5417
2017-02-27,105.3753
2017-02-28,104.2769
2017-03-01,106.1207
2017-03-02,104.6986
2017-03-03,105.238
2017-03-06,105.0223
2017-03-07,104.6496
2017-03-08,104.885
2017-03-09,105.0811
2017-03-10,106.0031
2017-03-13,105.1792
2017-03-14,104.7771
2017-03-15,105.4342
2017-03-16,102.5017
2017-03-17,102.7959
2017-03-20,101.972
2017-03-21,100.3243
2017-03-22,100.5793
2017-03-23,101.5111
2017-03-24,101.8249
2017-03-27,99.0787
2017-03-28,98.0881
2017-03-29,98.0391
2017-03-30,99.0983
2017-03-31,99.6966
2017-04-03,98.9316
2017-04-04,98.402
2017-04-05,97.3722
2017-04-06,98.8041
2017-04-07,98.7747
2017-04-10,98.1764
2017-04-11,98.4903
2017-04-12,97.9508
2017-04-13,97.9312
2017-04-17,99.2258
2017-04-18,99.3337
2017-04-19,99.932
2017-04-20,100.5793
2017-04-21,99.8045
2017-04-24,101.1531
2017-04-25,102.3643
2017-04-26,103.7276
2017-04-27,104.5711
2017-04-28,105.0223
2017-05-01,105.5127
2017-05-02,108.9846
2017-05-03,107.6606
2017-05-04,108.7296
2017-05-05,108.7002
2017-05-08,108.1215
2017-05-09,108.4256
2017-05-10,109.0141
2017-05-11,108.4158
2017-05-12,108.2785
2017-05-15,108.9748
2017-05-16,109.2887
2017-05-17,107.7936
2017-05-18,107.233
2017-05-19,108.1477
2017-05-22,108.5313
2017-05-23,109.0231
2017-05-24,109.2395
2017-05-25,109.3772
2017-05-26,109.5739
2017-05-30,109.6428
2017-05-31,110.2428
2017-06-01,111.3838
2017-06-02,113.6264
2017-06-05,112.5543
2017-06-06,112.0526
2017-06-07,111.9936
2017-06-08,111.7969
2017-06-09,110.4494
2017-06-12,109.5838
2017-06-13,109.5346
2017-06-14,110.3215
2017-06-15,108.9739
2017-06-16,109.8002
2017-06-19,111.069
2017-06-20,111.0395
2017-06-21,112.092
2017-06-22,114.3936
2017-06-23,115.574
2017-06-26,116.0854
2017-06-27,115.6625
2017-06-28,116.8133
2017-06-29,115.3969
2017-06-30,115.574
2017-07-03,114.9543
2017-07-05,114.3444
2017-07-06,114.1182
2017-07-07,115.751
2017-07-10,114.492
2017-07-11,114.974
2017-07-12,114.3641
2017-07-13,113.7641
2017-07-14,113.3608
2017-07-17,114.1772
2017-07-18,115.3182
2017-07-19,115.033
2017-07-20,115.0133
2017-07-21,116.0461
2017-07-24,116.1936
2017-07-25,116.2723
2017-07-26,115.3084
2017-07-27,114.4231
2017-07-28,114.5904
2017-07-31,114.01
2017-08-01,113.8822
2017-08-02,113.5281
2017-08-03,113.5084
2017-08-04,113.4494
2017-08-07,114.3248
2017-08-08,111.728
2017-08-09,112.5641
2017-08-10,114.8363
2017-08-11,115.6133
2017-08-14,115.5444
2017-08-15,115.1117
2017-08-16,116.6798
2017-08-17,116.3445
2017-08-18,116.2853
2017-08-21,116.8672
2017-08-22,117.7944
2017-08-23,117.4393
2017-08-24,118.2974
2017-08-25,118.327
2017-08-28,120.0925
2017-08-29,120.1714
2017-08-30,118.9878
2017-08-31,122.0848
2017-09-01,120.8914
2017-09-05,119.4908
2017-09-06,119.9938
2017-09-07,118.9681
2017-09-08,118.2678
2017-09-11,119.8853
2017-09-12,120.6744
2017-09-13,121.1478
2017-09-14,121.3648
2017-09-15,119.9149
2017-09-18,120.053
2017-09-19,120.2305
2017-09-20,119.5894
2017-09-21,119.55
2017-09-22,119.7374
2017-09-25,119.8853
2017-09-26,118.2086
2017-09-27,119.55
2017-09-28,118.9878
2017-09-29,119.2344
2017-10-02,120.9604
2017-10-03,120.556
2017-10-04,120.773
2017-10-05,121.0097
2017-10-06,120.8815
2017-10-09,119.5105
2017-10-10,120.6251
2017-10-11,121.7495
2017-10-12,122.2327
2017-10-13,119.984
2017-10-16,120.8618
2017-10-17,121.6508
2017-10-18,121.4437
2017-10-19,121.7692
2017-10-20,122.5484
2017-10-23,122.1834
2017-10-24,122.2426
2017-10-25,122.7358
2017-10-26,123.3374
2017-10-27,124.2251
2017-10-30,121.927
2017-10-31,129.2256
2017-11-01,126.6415
2017-11-02,126.247
2017-11-03,127.5193
2017-11-06,126.7007
2017-11-07,124.4815
2017-11-08,124.9845
2017-11-09,123.3035
2017-11-10,122.8487
2017-11-13,122.9476
2017-11-14,123.8177
2017-11-15,124.5099
2017-11-16,127.1698
2017-11-17,127.7729
2017-11-20,128.5739
2017-11-21,130.6404
2017-11-22,130.947
2017-11-24,130.235
2017-11-27,130.9865
2017-11-28,131.6292
2017-11-29,132.1138
2017-11-30,133.241
2017-12-01,131.6985
2017-12-04,128.3563
2017-12-05,127.0313
2017-12-06,127.2785
2017-12-07,127.4565
2017-12-08,127.3181
2017-12-11,125.5778
2017-12-12,125.8942
2017-12-13,126.349
2017-12-14,126.3293
2017-12-15,128.0597
2017-12-18,128.1289
2017-12-19,127.852
2017-12-20,127.7235
2017-12-21,127.328
2017-12-22,126.8929
2017-12-26,127.0412
2017-12-27,126.7643
2017-12-28,127.3181
2017-12-29,128.0992
2018-01-02,129.9878
2018-01-03,132.9839
2018-01-04,133.4091
2018-01-05,134.8527
2018-01-08,134.8626
2018-01-09,136.1876
2018-01-10,135.8514
2018-01-11,136.6227
2018-01-12,138.452
2018-01-16,138.6893
2018-01-17,139.0947
2018-01-18,138.452
2018-01-19,139.1441
2018-01-22,139.421
2018-01-23,139.9055
2018-01-24,139.777
2018-01-25,140.5186
2018-01-26,140.7262
2018-01-29,140.4197
2018-01-30,138.8178
2018-01-31,138.719
2018-02-01,138.452
2018-02-02,136.6425
2018-02-05,131.036
2018-02-06,136.2173
2018-02-07,134.922
2018-02-08,130.4822
2018-02-09,132.094
2018-02-12,133.9233
2018-02-13,135.4658
2018-02-14,139.4803
2018-02-15,140.2336
2018-02-16,139.9363
2018-02-20,138.2614
2018-02-21,138.301
2018-02-22,138.2515
2018-02-23,140.7192
2018-02-26,141.3138
2018-02-27,140.2831
2018-02-28,140.075
2018-03-01,139.5696
2018-03-02,139.1434
2018-03-05,140.2039
2018-03-06,143.4941
2018-03-07,142.9986
2018-03-08,142.6518
2018-03-09,145.0501
2018-03-12,145.3771
2018-03-13,145.2483
2018-03-14,145.506
2018-03-15,145.2285
2018-03-16,146.8538
2018-03-19,146.6556
2018-03-20,147.3493
2018-03-21,147.1214
2018-03-22,146.2394
2018-03-23,143.4644
2018-03-26,147.8647
2018-03-27,145.4762
2018-03-28,146.1105
2018-03-29,149.6882
2018-04-02,143.6032
2018-04-03,145.1591
2018-04-04,145.9024
2018-04-05,146.8835
2018-04-06,144.0293
2018-04-09,145.0204
2018-04-10,147.5773
2018-04-11,148.053
2018-04-12,147.8449
2018-04-13,147.6169
2018-04-16,148.5881
2018-04-17,151.6406
2018-04-18,151.9775
2018-04-19,150.8279
2018-04-20,151.4126
2018-04-23,152.6812
2018-04-24,151.1153
2018-04-25,150.2036
2018-04-26,151.2342
2018-04-27,150.8081
2018-04-30,149.5594
2018-05-01,149.4305
2018-05-02,145.4564
2018-05-03,145.2186
2018-05-04,146.5565
2018-05-07,147.4088
2018-05-08,147.7854
2018-05-09,147.6169
2018-05-10,148.5485
2018-05-11,150.4355
2018-05-14,150.9321
2018-05-15,148.3002
2018-05-16,150.7335
2018-05-17,150.5845
2018-05-18,151.9253
2018-05-21,151.3393
2018-05-22,151.091
2018-05-23,151.5876
2018-05-24,150.4355
2018-05-25,147.8036
2018-05-29,146.2742
2018-05-30,148.8763
2018-05-31,149.2934
2018-06-01,149.939
2018-06-04,152.6304
2018-06-05,154.2195
2018-06-06,158.2021
2018-06-07,157.7155
2018-06-08,158.6391
2018-06-11,159.821
2018-06-12,161.0823
2018-06-13,161.4895
2018-06-14,162.9396
2018-06-15,164.4492
2018-06-18,162.5622
2018-06-19,162.443
2018-06-20,161.8868
2018-06-21,160.0693
2018-06-22,160.3573
2018-06-25,157.1692
2018-06-26,155.9576
2018-06-27,145.132
2018-06-28,146.1252
2018-06-29,146.9396
2018-07-02,147.2077
2018-07-03,146.4331
2018-07-05,147.2971
2018-07-06,149.3828
2018-07-09,151.538
2018-07-10,151.7565
2018-07-11,151.0811
2018-07-12,152.2729
2018-07-13,152.0643
2018-07-16,150.515
2018-07-17,151.4287
2018-07-18,151.1407
2018-07-19,152.839
2018-07-20,155.3517
2018-07-23,157.8148
2018-07-24,161.3803
2018-07-25,164.5088
2018-07-26,165.4721
2018-07-27,161.3207
2018-07-30,156.3151
2018-07-31,159.5429
2018-08-01,163.5255
2018-08-02,165.0947
2018-08-03,165.204
2018-08-06,167.6968
2018-08-07,178.9097
2018-08-08,176.109
2018-08-09,177.0624
2018-08-10,177.4597
2018-08-13,176.4864
2018-08-14,178.9097
2018-08-15,178.7508
2018-08-16,178.8105
2018-08-17,179.5866
2018-08-20,180.3726
2018-08-21,183.9345
2018-08-22,183.8947
2018-08-23,186.9889
2018-08-24,187.2974
2018-08-27,186.581
2018-08-28,187.3869
2018-08-29,190.7498
2018-08-30,190.3717
2018-08-31,191.1975
2018-09-04,190.113
2018-09-05,188.2426
2018-09-06,189.5658
2018-09-07,190.3916
2018-09-10,194.5505
2018-09-11,194.7296
2018-09-12,194.9783
2018-09-13,196.4409
2018-09-14,198.7989
2018-09-17,195.8539
2018-09-18,196.3513
2018-09-19,197.595
2018-09-20,197.9731
2018-09-21,194.9286
2018-09-24,199.2167
2018-09-25,200.9181
2018-09-26,200.5002
2018-09-27,202.7985
2018-09-28,203.0771
2018-10-01,202.7687
2018-10-02,200.6495
2018-10-03,199.3162
2018-10-04,192.3517
2018-10-05,191.2274
2018-10-08,188.4813
2018-10-09,187.576
2018-10-10,181.477
2018-10-11,179.7358
2018-10-12,184.0937
2018-10-15,181.268
2018-10-16,184.4518
2018-10-17,182.1834
2018-10-18,182.3227
2018-10-19,176.6018
2018-10-22,179.7259
2018-10-23,182.4421
2018-10-24,172.8011
2018-10-25,178.9299
2018-10-26,179.2483
2018-10-29,176.562
2018-10-30,165.5082
2018-10-31,166.8713
2018-11-01,168.493
2018-11-02,169.3686
2018-11-05,169.7068
2018-11-06,171.7863
2018-11-07,177.7658
2018-11-08,172.3038
2018-11-09,170.2406
2018-11-12,163.1339
2018-11-13,161.4295
2018-11-14,160.8813
2018-11-15,162.516
2018-11-16,159.7052
2018-11-19,154.6418
2018-11-20,155.808
2018-11-21,155.9675
2018-11-23,158.9577
2018-11-26,158.2101
2018-11-27,157.6619
2018-11-28,162.6256
2018-11-29,161.8482
2018-11-30,160.8913
2018-12-03,163.6722
2018-12-04,159.8647
2018-12-06,159.9643
2018-12-07,155.7083
2018-12-10,155.1203
2018-12-11,157.014
2018-12-12,161.4495
2018-12-13,155.1601
2018-12-14,150.6848
2018-12-17,146.3192
2018-12-18,145.6713
2018-12-19,145.0633
2018-12-20,140.8272
2018-12-21,137.3387
2018-12-24,132.3152
2018-12-26,138.8637
2018-12-27,140.9169
2018-12-28,141.2857
2018-12-31,144.246
2019-01-02,141.4452
2019-01-03,135.6443
2019-01-04,144.0167
2019-01-07,145.4022
2019-01-08,146.8375
2019-01-09,148.4721
2019-01-10,153.1866
2019-01-11,157.2533
2019-01-14,155.7681
2019-01-15,158.2799
2019-01-16,159.7949
2019-01-17,161.4196
2019-01-18,162.6356
2019-01-22,160.4826
2019-01-23,161.599
2019-01-24,161.7086
2019-01-25,163.7519
2019-01-28,163.403
2019-01-29,163.9911
2019-01-30,167.8385
2019-01-31,173.8886
2019-02-01,175.1146
2019-02-04,177.1977
2019-02-05,187.9623
2019-02-06,186.6168
2019-02-07,183.6266
2019-02-08,183.1282
2019-02-11,183.198
2019-02-12,186.0387
2019-02-13,188.4308
2019-02-14,188.2511
2019-02-15,191.3263
2019-02-19,191.5659
2019-02-20,193.403
2019-02-21,193.6526
2019-02-22,194.661
2019-02-25,194.661
2019-02-26,191.2564
2019-02-27,194.012
2019-02-28,193.5927
2019-03-01,196.4981
2019-03-04,194.8607
2019-03-05,195.5496
2019-03-06,190.9569
2019-03-07,190.4676
2019-03-08,189.1996
2019-03-11,191.6657
2019-03-12,193.0535
2019-03-13,194.6809
2019-03-14,194.2117
2019-03-15,195.3399
2019-03-18,196.4382
2019-03-19,198.7545
2019-03-20,198.2053
2019-03-21,200.1223
2019-03-22,192.0351
2019-03-25,193.8822
2019-03-26,195.6294
2019-03-27,193.9321
2019-03-28,196.5979
2019-03-29,198.2353
2019-04-01,199.6131
2019-04-02,199.8827
2019-04-03,201.57
2019-04-04,198.5947
2019-04-05,198.1155
2019-04-08,201.3304
2019-04-09,200.7912
2019-04-10,203.0876
2019-04-11,201.9294
2019-04-12,201.1806
2019-04-15,200.302
2019-04-16,194.9605
2019-04-17,188.4209
2019-04-18,188.8602
2019-04-22,190.857
2019-04-23,191.6058
2019-04-24,190.6274
2019-04-25,190.9768
2019-04-26,194.651
2019-04-29,195.919
2019-04-30,204.2657
2019-05-01,201.8096
2019-05-02,201.0109
2019-05-03,205.2442
2019-05-06,207.0214
2019-05-07,201.0708
2019-05-08,201.6199
2019-05-09,201.87
2019-05-10,201.72
2019-05-13,194.66
2019-05-14,197.4
2019-05-15,196.68
2019-05-16,201.52
2019-05-17,197.46
2019-05-20,197.45
2019-05-21,201.09
2019-05-22,202.04
2019-05-23,197.86
2019-05-24,197.79
2019-05-28,196.04
2019-05-29,193.75
2019-05-30,194.95
2019-05-31,198.05
2019-06-03,197.95
2019-06-04,203.88
2019-06-05,206.57
2019-06-06,208.81
2019-06-07,209.95
2019-06-10,212.12
2019-06-11,212.66
2019-06-12,215.43
2019-06-13,210.88
2019-06-14,208.55
2019-06-17,207.705
2019-06-18,208.07
2019-06-19,209.76
2019-06-20,213.975
2019-06-21,209.705
2019-06-24,206.46
2019-06-25,203.635
2019-06-26,202.47
2019-06-27,205.685
2019-06-28,208.255
2019-07-01,208.28
2019-07-02,213.6
2019-07-03,216.72
2019-07-04,216.72
2019-07-05,215
2019-07-08,212.2
2019-07-09,212.31
2019-07-10,213
2019-07-11,208.515
2019-07-12,209.545
2019-07-15,211
2019-07-16,210.35
2019-07-17,210.33
2019-07-18,214.3
2019-07-19,209.325
2019-07-22,208.925
2019-07-23,208.035
2019-07-24,208.885
2019-07-25,209.2
2019-07-26,214.75
2019-07-29,215.625
2019-07-30,210.58
2019-07-31,210.43
2019-08-01,210.51
2019-08-02,206.44
2019-08-05,199.78
2019-08-06,194.11
2019-08-07,190.47
2019-08-08,195.21
2019-08-09,192.52
2019-08-12,190.62
2019-08-13,196.91
2019-08-14,192.5
2019-08-15,192.95
2019-08-16,197.5
2019-08-19,194.19
2019-08-20,192.5
2019-08-21,193.02
2019-08-22,191.87
2019-08-23,187.14
2019-08-26,189.59
2019-08-27,189.23
2019-08-28,190.76
2019-08-29,192.345
2019-08-30,191.82
2019-09-02,191.24
2019-09-03,185.46
2019-09-04,187.22
2019-09-05,190.03
2019-09-06,188.05
2019-09-09,183.65
2019-09-10,187.83
2019-09-11,195.48
2019-09-12,199.94
2019-09-13,201.1
2019-09-16,200.03
2019-09-17,197.6
2019-09-18,198.795
2019-09-19,197.87
2019-09-20,201.035
2019-09-23,202.615
2019-09-24,200.68
2019-09-25,201.46
2019-09-26,202.99
2019-09-27,197.41
2019-09-30,195.62
2019-10-01,189.81
2019-10-02,191.73
2019-10-03,197.04
2019-10-04,201.435
2019-10-07,202.16
2019-10-08,196.7
2019-10-09,200.9
2019-10-10,199.405
2019-10-11,201.105
2019-10-14,200.14
2019-10-15,201.1
2019-10-16,201.94
2019-10-17,202.09
2019-10-18,200.36
2019-10-21,203.51
2019-10-22,200.8
2019-10-23,202.37
2019-10-24,201.87
2019-10-25,203.05
2019-10-28,209.61
2019-10-29,210.17
2019-10-30,209.35
2019-10-31,208.23
2019-11-01,210.09
2019-11-04,206.82
2019-11-05,204.85
2019-11-06,204.24
2019-11-07,202.84
2019-11-08,203.2
2019-11-11,203.52
2019-11-12,203.94
2019-11-13,205.11
2019-11-14,203.77
2019-11-15,212.455
2019-11-18,210.98
2019-11-19,216.42
2019-11-20,218.47
2019-11-21,214.715
2019-11-22,215.69
2019-11-25,219.78
