date,close
2014-06-13,14.1999
2014-06-16,14.0694
2014-06-17,13.8771
2014-06-18,14.2136
2014-06-19,13.9939
2014-06-20,13.7604
2014-06-23,13.6643
2014-06-24,13.6986
2014-06-25,13.9115
2014-06-26,14.0351
2014-06-27,14.0007
2014-06-30,14.0831
2014-07-01,13.9252
2014-07-02,13.8566
2014-07-03,13.987
2014-07-07,13.733
2014-07-08,13.6712
2014-07-09,13.5956
2014-07-10,13.472
2014-07-11,13.4102
2014-07-14,13.678
2014-07-15,13.63
2014-07-16,13.7398
2014-07-17,13.7055
2014-07-18,13.8016
2014-07-21,13.9458
2014-07-22,14.1037
2014-07-23,14.0007
2014-07-24,14.2273
2014-07-25,14.1175
2014-07-28,14.1381
2014-07-29,13.9664
2014-07-30,14.0694
2014-07-31,13.7467
2014-08-01,13.9108
2014-08-04,14.0487
2014-08-05,13.0211
2014-08-06,13.0694
2014-08-07,12.7314
2014-08-08,12.7039
2014-08-11,13.0349
2014-08-12,13.0694
2014-08-13,12.8625
2014-08-14,12.7797
2014-08-15,12.8763
2014-08-18,12.8832
2014-08-19,12.9728
2014-08-20,13.2073
2014-08-21,13.2763
2014-08-22,13.0901
2014-08-25,13.2211
2014-08-26,13.3177
2014-08-27,13.7453
2014-08-28,13.4625
2014-08-29,14.6694
2014-09-02,14.8068
2014-09-03,15.1392
2014-09-04,15.0838
2014-09-05,15.3401
2014-09-08,15.4717
2014-09-09,15.0007
2014-09-10,14.9869
2014-09-11,15.0631
2014-09-12,14.7653
2014-09-15,14.8553
2014-09-16,15.2223
2014-09-17,15.0631
2014-09-18,14.9938
2014-09-19,14.9245
2014-09-22,14.7445
2014-09-23,14.4744
2014-09-24,14.4882
2014-09-25,14.2528
2014-09-26,14.2874
2014-09-29,13.6018
2014-09-30,13.6295
2014-10-01,13.2498
2014-10-02,13.4305
2014-10-03,13.6252
2014-10-06,13.8685
2014-10-07,13.9728
2014-10-08,14.1883
2014-10-09,14.0353
2014-10-10,13.792
2014-10-13,14.0214
2014-10-14,14.1396
2014-10-15,13.9311
2014-10-16,13.5064
2014-10-17,13.8963
2014-10-20,13.6252
2014-10-21,13.3888
2014-10-22,13.3819
2014-10-23,12.9509
2014-10-24,13.1525
2014-10-27,12.7145
2014-10-28,13.1108
2014-10-29,13.1247
2014-10-30,13.3676
2014-10-31,14.2091
2014-11-03,13.99
2014-11-04,13.7876
2014-11-05,13.5713
2014-11-06,13.3201
2014-11-07,13.4248
2014-11-10,13.3829
2014-11-11,13.3341
2014-11-12,13.5295
2014-11-13,13.355
2014-11-14,13.3829
2014-11-17,13.3062
2014-11-18,13.4806
2014-11-19,13.9691
2014-11-20,14.0249
2014-11-21,14.5831
2014-11-24,14.1714
2014-11-25,14.1295
2014-11-26,14.4645
2014-11-28,14.3459
2014-12-01,13.6287
2014-12-02,13.2985
2014-12-03,13.2213
2014-12-04,13.1791
2014-12-05,13.2704
2014-12-08,12.9332
2014-12-09,12.7646
2014-12-10,12.9051
2014-12-11,12.7295
2014-12-12,12.3501
2014-12-15,12.0551
2014-12-16,11.76
2014-12-17,12.1534
2014-12-18,12.2588
2014-12-19,12.2026
2014-12-22,12.3783
2014-12-23,12.4344
2014-12-24,12.4836
2014-12-26,12.3572
2014-12-29,12.4064
2014-12-30,12.4064
2014-12-31,12.4204
2015-01-02,12.1442
2015-01-05,11.8964
2015-01-06,11.953
2015-01-07,12.2363
2015-01-08,12.4204
2015-01-09,12.4275
2015-01-12,12.4487
2015-01-13,12.7957
2015-01-14,13.0648
2015-01-15,13.1922
2015-01-16,13.4684
2015-01-20,13.8366
2015-01-21,14.3536
2015-01-22,14.1907
2015-01-23,14.1128
2015-01-26,13.9074
2015-01-27,13.8791
2015-01-28,13.8366
2015-01-29,13.957
2015-01-30,13.0577
2015-02-02,13.5038
2015-02-03,13.6313
2015-02-04,13.4047
2015-02-05,13.7375
2015-02-06,13.2985
2015-02-09,13.2985
2015-02-10,13.2064
2015-02-11,12.8896
2015-02-12,13.3906
2015-02-13,13.761
2015-02-17,13.8336
2015-02-18,13.8336
2015-02-19,13.7029
2015-02-20,13.6375
2015-02-23,13.3761
2015-02-24,13.6666
2015-02-25,13.5141
2015-02-26,13.2164
2015-02-27,13.4633
2015-03-02,13.1365
2015-03-03,12.9477
2015-03-04,12.3958
2015-03-05,12.2723
2015-03-06,11.8947
2015-03-09,11.459
2015-03-10,11.3791
2015-03-11,11.3646
2015-03-12,11.4953
2015-03-13,11.3356
2015-03-16,11.3283
2015-03-17,11.6987
2015-03-18,11.9891
2015-03-19,11.1976
2015-03-20,11.1468
2015-03-23,11.3356
2015-03-24,11.6623
2015-03-25,11.43
2015-03-26,10.9507
2015-03-27,10.6675
2015-03-30,11.0378
2015-03-31,11.1032
2015-04-01,11.125
2015-04-02,11.2557
2015-04-06,11.125
2015-04-07,10.7183
2015-04-08,11.0524
2015-04-09,11.1032
2015-04-10,10.9976
2015-04-13,10.8886
2015-04-14,10.8813
2015-04-15,10.8741
2015-04-16,11.1574
2015-04-17,11.1574
2015-04-20,11.4261
2015-04-21,11.3898
2015-04-22,11.8329
2015-04-23,11.7312
2015-04-24,11.8256
2015-04-27,12
2015-04-28,12.167
2015-04-29,12.2106
2015-04-30,11.9273
2015-05-01,11.8474
2015-05-04,11.8111
2015-05-05,11.3535
2015-05-06,11.3607
2015-05-07,11.23
2015-05-08,11.4697
2015-05-11,11.1719
2015-05-12,11.0411
2015-05-13,11.0775
2015-05-14,11.4842
2015-05-15,11.615
2015-05-18,11.3244
2015-05-19,11.1791
2015-05-20,10.9322
2015-05-21,10.7869
2015-05-22,10.5835
2015-05-26,10.2333
2015-05-27,10.314
2015-05-28,10.2773
2015-05-29,10.3287
2015-06-01,10.314
2015-06-02,10.5416
2015-06-03,10.5269
2015-06-04,10.2993
2015-06-05,10.0718
2015-06-08,10.0057
2015-06-09,9.9323
2015-06-10,10.0938
2015-06-11,9.8882
2015-06-12,9.9103
2015-06-15,9.9249
2015-06-16,10.0718
2015-06-17,10.292
2015-06-18,10.4975
2015-06-19,10.0644
2015-06-22,10.0571
2015-06-23,9.9984
2015-06-24,10.1819
2015-06-25,10.1672
2015-06-26,10.3874
2015-06-29,10.0497
2015-06-30,10.2259
2015-07-01,10.2626
2015-07-02,10.5049
2015-07-06,10.3434
2015-07-07,10.1745
2015-07-08,9.9029
2015-07-09,9.8736
2015-07-10,9.991
2015-07-13,10.1378
2015-07-14,10.1452
2015-07-15,10.1158
2015-07-16,10.1966
2015-07-17,9.947
2015-07-20,9.8736
2015-07-21,9.8882
2015-07-22,9.345
2015-07-23,9.2789
2015-07-24,9.0367
2015-07-27,8.9853
2015-07-28,9.0073
2015-07-29,9.7781
2015-07-30,9.602
2015-07-31,9.5579
2015-08-03,9.3046
2015-08-04,9.0616
2015-08-05,9.3046
2015-08-06,9.0469
2015-08-07,8.7672
2015-08-10,9.4371
2015-08-11,9.0469
2015-08-12,8.7083
2015-08-13,8.5464
2015-08-14,8.5684
2015-08-17,8.5537
2015-08-18,8.8703
2015-08-19,8.5832
2015-08-20,8.4948
2015-08-21,8.2814
2015-08-24,7.8176
2015-08-25,7.8544
2015-08-26,8.1562
2015-08-27,8.4654
2015-08-28,8.2372
2015-08-31,8.193
2015-09-01,7.9112
2015-09-02,7.9703
2015-09-03,7.9629
2015-09-04,7.7265
2015-09-08,7.7782
2015-09-09,7.7413
2015-09-10,7.6748
2015-09-11,7.5345
2015-09-14,7.7708
2015-09-15,7.7117
2015-09-16,7.9112
2015-09-17,7.8742
2015-09-18,7.5197
2015-09-21,7.3941
2015-09-22,7.1282
2015-09-23,6.7515
2015-09-24,6.781
2015-09-25,6.7884
2015-09-28,6.5003
2015-09-29,6.6702
2015-09-30,6.7441
2015-10-01,6.8277
2015-10-02,7.1017
2015-10-05,7.272
2015-10-06,7.4127
2015-10-07,7.4942
2015-10-08,7.6793
2015-10-09,7.7386
2015-10-12,7.6571
2015-10-13,7.3239
2015-10-14,7.3016
2015-10-15,7.3757
2015-10-16,7.2794
2015-10-19,7.1461
2015-10-20,7.0943
2015-10-21,7.0202
2015-10-22,7.272
2015-10-23,7.2794
2015-10-26,7.6053
2015-10-27,7.3757
2015-10-28,7.2942
2015-10-29,7.4497
2015-10-30,7.6719
2015-11-02,7.746
2015-11-03,8.1195
2015-11-04,8.0157
2015-11-05,7.6672
2015-11-06,7.8377
2015-11-09,7.6004
2015-11-10,7.6078
2015-11-11,7.8229
2015-11-12,7.6301
2015-11-13,7.2445
2015-11-16,7.4669
2015-11-17,7.5188
2015-11-18,7.7191
2015-11-19,7.9786
2015-11-20,7.9415
2015-11-23,7.8377
2015-11-24,7.8229
2015-11-25,7.4521
2015-11-27,7.3335
2015-11-30,6.9553
2015-12-01,7.0645
2015-12-02,7.1464
2015-12-03,7.3101
2015-12-04,7.1687
2015-12-07,7.1687
2015-12-08,7.1315
2015-12-09,7.2655
2015-12-10,7.191
2015-12-11,7.0198
2015-12-14,7.1315
2015-12-15,7.1389
2015-12-16,7.3846
2015-12-17,7.2208
2015-12-18,7.0421
2015-12-21,6.7518
2015-12-22,6.8635
2015-12-23,7.0719
2015-12-24,7.057
2015-12-28,7.0794
2015-12-29,7.0124
2015-12-30,6.7072
2015-12-31,6.722
2016-01-04,6.6751
2016-01-05,6.6377
2016-01-06,6.5104
2016-01-07,6.2336
2016-01-08,6.0764
2016-01-11,6.1363
2016-01-12,6.2411
2016-01-13,6.1513
2016-01-14,6.286
2016-01-15,6.1064
2016-01-19,6.0839
2016-01-20,6.0689
2016-01-21,5.9717
2016-01-22,6.2411
2016-01-25,6.1438
2016-01-26,6.2186
2016-01-27,6.3159
2016-01-28,6.2336
2016-01-29,6.5254
2016-02-01,6.5554
2016-02-02,6.2934
2016-02-03,6.6377
2016-02-04,6.8622
2016-02-05,6.8547
2016-02-08,6.69
2016-02-09,6.6152
2016-02-10,6.5554
2016-02-11,6.3458
2016-02-12,6.5703
2016-02-16,6.7424
2016-02-17,6.9744
2016-02-18,6.9744
2016-02-19,6.8996
2016-02-22,7.1765
2016-02-23,7.0043
2016-02-24,6.8023
2016-02-25,6.8996
2016-02-26,6.8996
2016-02-29,7.169
2016-03-01,7.449
2016-03-02,7.5316
2016-03-03,7.862
2016-03-04,8.0498
2016-03-07,8.0723
2016-03-08,8.1174
2016-03-09,8.245
2016-03-10,8.4327
2016-03-11,8.5979
2016-03-14,8.4252
2016-03-15,8.1849
2016-03-16,8.5754
2016-03-17,9.071
2016-03-18,9.1912
2016-03-21,9.3789
2016-03-22,9.4239
2016-03-23,8.9659
2016-03-24,8.9884
2016-03-28,9.3338
2016-03-29,9.484
2016-03-30,9.6567
2016-03-31,9.3704
2016-04-01,9.4436
2016-04-04,9.0363
2016-04-05,8.7798
2016-04-06,8.629
2016-04-07,8.6365
2016-04-08,9.0136
2016-04-11,9.0438
2016-04-12,9.1947
2016-04-13,9.3078
2016-04-14,9.4888
2016-04-15,9.4436
2016-04-18,9.2324
2016-04-19,9.2625
2016-04-20,9.172
2016-04-21,9.0891
2016-04-22,9.1117
2016-04-25,8.908
2016-04-26,9.0891
2016-04-27,9.1947
2016-04-28,9.1063
2016-04-29,9.4559
2016-05-02,9.4976
2016-05-03,9.1895
2016-05-04,9.3127
2016-05-05,9.1664
2016-05-06,9.3666
2016-05-09,9.1202
2016-05-10,9.4822
2016-05-11,9.5438
2016-05-12,9.4745
2016-05-13,9.228
2016-05-16,9.3435
2016-05-17,9.2588
2016-05-18,8.9353
2016-05-19,8.7966
2016-05-20,8.9738
2016-05-23,8.9045
2016-05-24,9.0354
2016-05-25,8.8814
2016-05-26,8.9507
2016-05-27,8.8274
2016-05-31,8.8737
2016-06-01,8.8737
2016-06-02,8.8814
2016-06-03,9.151
2016-06-06,9.1895
2016-06-07,9.436
2016-06-08,9.6979
2016-06-09,9.513
2016-06-10,9.2819
2016-06-13,9.2973
2016-06-14,9.0046
2016-06-15,8.9892
2016-06-16,8.8968
2016-06-17,9.0277
2016-06-20,9.2588
2016-06-21,9.3743
2016-06-22,9.3898
2016-06-23,9.7441
2016-06-24,9.3358
2016-06-27,9.2896
2016-06-28,9.798
2016-06-29,10.3757
2016-06-30,10.4718
2016-07-01,10.4809
2016-07-05,10.3652
2016-07-06,10.1722
2016-07-07,10.3806
2016-07-08,10.8128
2016-07-11,10.944
2016-07-12,10.8205
2016-07-13,11.0443
2016-07-14,11.137
2016-07-15,11.0135
2016-07-18,11.0984
2016-07-19,10.9363
2016-07-20,10.9594
2016-07-21,11.0366
2016-07-22,11.2682
2016-07-25,11.0135
2016-07-26,11.0058
2016-07-27,11.2913
2016-07-28,11.3839
2016-07-29,11.6849
2016-08-01,11.5923
2016-08-02,11.4688
2016-08-03,11.4843
2016-08-04,11.5074
2016-08-05,11.3531
2016-08-08,11.2759
2016-08-09,11.2836
2016-08-10,11.1833
2016-08-11,11.2913
2016-08-12,11.1061
2016-08-15,11.4148
2016-08-16,11.2759
2016-08-17,11.2913
2016-08-18,11.5769
2016-08-19,11.5614
2016-08-22,11.3608
2016-08-23,11.4611
2016-08-24,11.4302
2016-08-25,11.5383
2016-08-26,11.4688
2016-08-29,11.5692
2016-08-30,11.492
2016-08-31,11.5306
2016-09-01,11.546
2016-09-02,11.8007
2016-09-06,12.04
2016-09-07,11.9859
2016-09-08,11.8933
2016-09-09,11.0058
2016-09-12,11.2141
2016-09-13,10.7511
2016-09-14,10.6585
2016-09-15,11.0058
2016-09-16,10.8746
2016-09-19,11.0366
2016-09-20,11.1447
2016-09-21,11.3453
2016-09-22,11.4688
2016-09-23,11.3531
2016-09-26,11.1678
2016-09-27,11.4611
2016-09-28,11.4997
2016-09-29,11.1987
2016-09-30,11.1678
2016-10-03,11.3444
2016-10-04,11.1189
2016-10-05,11.3056
2016-10-06,11.2278
2016-10-07,11.2667
2016-10-10,10.5669
2016-10-11,10.6835
2016-10-12,10.8546
2016-10-13,10.7379
2016-10-14,10.5436
2016-10-17,10.5902
2016-10-18,10.8623
2016-10-19,10.8701
2016-10-20,10.8468
2016-10-21,10.7924
2016-10-24,10.7846
2016-10-25,10.7768
2016-10-26,10.8857
2016-10-27,11.0878
2016-10-28,10.9712
2016-10-31,11.1967
2016-11-01,10.8468
2016-11-02,10.7457
2016-11-03,10.7457
2016-11-04,10.7846
2016-11-07,11.2589
2016-11-08,11.2978
2016-11-09,11.0412
2016-11-10,10.1548
2016-11-11,9.8204
2016-11-14,9.8904
2016-11-15,10.1081
2016-11-16,10.2092
2016-11-17,9.9371
2016-11-18,9.9293
2016-11-21,10.1937
2016-11-22,10.1392
2016-11-23,10.0226
2016-11-25,9.8982
2016-11-28,10.1315
2016-11-29,10.0926
2016-11-30,10.147
2016-12-01,9.4783
2016-12-02,9.4317
2016-12-05,9.6416
2016-12-06,9.8282
2016-12-07,10.1859
2016-12-08,10.1315
2016-12-09,10.0148
2016-12-12,10.0071
2016-12-13,9.9448
2016-12-14,9.6883
2016-12-15,9.9137
2016-12-16,9.9293
2016-12-19,9.8671
2016-12-20,10.0226
2016-12-21,10.1392
2016-12-22,10.1315
2016-12-23,10.217
2016-12-27,10.1937
2016-12-28,10.217
2016-12-29,10.5125
2016-12-30,10.4036
2017-01-03,10.7781
2017-01-04,10.865
2017-01-05,10.8176
2017-01-06,10.6675
2017-01-09,10.7623
2017-01-10,11.086
2017-01-11,11.2361
2017-01-12,11.2834
2017-01-13,11.1255
2017-01-17,11.3545
2017-01-18,11.0702
2017-01-19,11.2124
2017-01-20,11.2598
2017-01-23,11.5993
2017-01-24,11.5203
2017-01-25,11.5914
2017-01-26,11.4414
2017-01-27,11.6467
2017-01-30,11.6703
2017-01-31,11.6703
2017-02-01,11.923
2017-02-02,11.9625
2017-02-03,12.002
2017-02-06,12.0415
2017-02-07,11.9546
2017-02-08,12.1283
2017-02-09,12.0178
2017-02-10,12.073
2017-02-13,11.9862
2017-02-14,12.0888
2017-02-15,12.2468
2017-02-16,11.9704
2017-02-17,11.8993
2017-02-21,11.8046
2017-02-22,12.073
2017-02-23,12.0099
2017-02-24,11.6309
2017-02-27,11.694
2017-02-28,11.3782
2017-03-01,11.741
2017-03-02,11.4239
2017-03-03,11.7093
2017-03-06,11.6538
2017-03-07,11.5824
2017-03-08,11.3129
2017-03-09,11.2812
2017-03-10,11.3604
2017-03-13,11.4397
2017-03-14,11.3763
2017-03-15,11.6379
2017-03-16,11.8757
2017-03-17,11.7489
2017-03-20,12.0264
2017-03-21,11.8203
2017-03-22,11.7885
2017-03-23,11.6776
2017-03-24,11.852
2017-03-27,11.7885
2017-03-28,11.6934
2017-03-29,11.8203
2017-03-30,11.8044
2017-03-31,11.7727
2017-04-03,11.9825
2017-04-04,11.8227
2017-04-05,11.7588
2017-04-06,11.583
2017-04-07,11.583
2017-04-10,11.5351
2017-04-11,11.6709
2017-04-12,11.6709
2017-04-13,11.4952
2017-04-17,11.8227
2017-04-18,11.9345
2017-04-19,11.8706
2017-04-20,11.9425
2017-04-21,11.8786
2017-04-24,11.8866
2017-04-25,12.1502
2017-04-26,12.0943
2017-04-27,12.2872
2017-04-28,12.3708
2017-05-01,12.3625
2017-05-02,12.7221
2017-05-03,12.4377
2017-05-04,12.0363
2017-05-05,12.3959
2017-05-08,12.2705
2017-05-09,12.3374
2017-05-10,12.6636
2017-05-11,12.5799
2017-05-12,12.8978
2017-05-15,12.8309
2017-05-16,12.9563
2017-05-17,12.5548
2017-05-18,11.1747
2017-05-19,11.8021
2017-05-22,11.5428
2017-05-23,11.6097
2017-05-24,11.6013
2017-05-25,11.6348
2017-05-26,11.8021
2017-05-30,11.9359
2017-05-31,11.9693
2017-06-01,12.0363
2017-06-02,12.0697
2017-06-05,11.8857
2017-06-06,11.9275
2017-06-07,11.961
2017-06-08,11.9693
2017-06-09,11.6013
2017-06-12,11.6431
2017-06-13,11.6766
2017-06-14,11.7268
2017-06-15,11.6013
2017-06-16,11.685
2017-06-19,11.6766
2017-06-20,11.4257
2017-06-21,11.3002
2017-06-22,11.3086
2017-06-23,11.4006
2017-06-26,11.5177
2017-06-27,11.2667
2017-06-28,11.4508
2017-06-29,11.2835
2017-06-30,11.2835
2017-07-03,11.3753
2017-07-05,11.5262
2017-07-06,11.2328
2017-07-07,11.2412
2017-07-10,11.5681
2017-07-11,11.543
2017-07-12,11.7358
2017-07-13,11.8699
2017-07-14,11.8951
2017-07-17,11.9789
2017-07-18,12.1298
2017-07-19,11.9621
2017-07-20,12.0795
2017-07-21,12.1382
2017-07-24,12.1465
2017-07-25,12.1884
2017-07-26,12.2387
2017-07-27,12.4567
2017-07-28,12.5908
2017-07-31,12.4735
2017-08-01,12.5824
2017-08-02,12.6495
2017-08-03,12.7501
2017-08-04,12.7333
2017-08-07,12.8674
2017-08-08,12.8423
2017-08-09,12.792
2017-08-10,12.5573
2017-08-11,12.6327
2017-08-14,12.5573
2017-08-15,12.5908
2017-08-16,12.6663
2017-08-17,12.398
2017-08-18,12.507
2017-08-21,12.6914
2017-08-22,12.7082
2017-08-23,12.8004
2017-08-24,12.968
2017-08-25,12.9345
2017-08-28,13.0603
2017-08-29,13.0435
2017-08-30,13.0183
2017-08-31,12.9094
2017-09-01,13.0016
2017-09-05,13.1273
2017-09-06,13.1273
2017-09-07,13.2698
2017-09-08,13.2279
2017-09-11,13.5464
2017-09-12,13.4878
2017-09-13,13.6554
2017-09-14,13.6722
2017-09-15,13.8566
2017-09-18,13.8315
2017-09-19,13.9907
2017-09-20,14.0075
2017-09-21,13.8482
2017-09-22,13.7225
2017-09-25,13.5129
2017-09-26,13.4291
2017-09-27,13.1105
2017-09-28,13.186
2017-09-29,13.2782
2017-10-02,13.3854
2017-10-03,13.7565
2017-10-04,13.7059
2017-10-05,13.6722
2017-10-06,13.571
2017-10-09,13.4613
2017-10-10,13.7312
2017-10-11,13.7059
2017-10-12,13.6216
2017-10-13,13.5963
2017-10-16,13.5456
2017-10-17,13.5372
2017-10-18,13.5878
2017-10-19,13.5288
2017-10-20,13.5963
2017-10-23,13.2589
2017-10-24,13.2251
2017-10-25,13.1577
2017-10-26,13.2336
2017-10-27,13.3938
2017-10-30,12.9215
2017-10-31,12.989
2017-11-01,12.9974
2017-11-02,12.9384
2017-11-03,12.5335
2017-11-06,12.8625
2017-11-07,12.6094
2017-11-08,12.8625
2017-11-09,12.7697
2017-11-10,12.5926
2017-11-13,12.5335
2017-11-14,12.3564
2017-11-15,12.3817
2017-11-16,12.5335
2017-11-17,12.7444
2017-11-20,12.9046
2017-11-21,12.8287
2017-11-22,12.854
2017-11-24,12.8034
2017-11-27,12.795
2017-11-28,12.8372
2017-11-29,12.466
2017-11-30,12.2805
2017-12-01,12.5167
2017-12-04,12.6179
2017-12-05,12.6516
2017-12-06,12.9046
2017-12-07,12.8287
2017-12-08,12.7866
2017-12-11,12.6853
2017-12-12,12.989
2017-12-13,12.9721
2017-12-14,12.8625
2017-12-15,12.9046
2017-12-18,12.989
2017-12-19,12.9552
2017-12-20,12.9384
2017-12-21,12.7275
2017-12-22,12.5926
2017-12-26,12.7612
2017-12-27,12.8707
2017-12-28,12.8794
2017-12-29,12.8968
2018-01-02,13.2012
2018-01-03,13.0794
2018-01-04,13.3142
2018-01-05,13.4099
2018-01-08,13.4186
2018-01-09,13.4969
2018-01-10,13.2186
2018-01-11,13.3403
2018-01-12,13.6708
2018-01-16,13.5838
2018-01-17,13.7491
2018-01-18,13.7578
2018-01-19,13.4447
2018-01-22,13.6708
2018-01-23,13.4708
2018-01-24,14.4274
2018-01-25,14.5926
2018-01-26,14.6883
2018-01-29,14.5056
2018-01-30,14.4969
2018-01-31,14.7491
2018-02-01,14.9579
2018-02-02,14.4448
2018-02-05,14.036
2018-02-06,14.7144
2018-02-07,14.2708
2018-02-08,13.8447
2018-02-09,13.7317
2018-02-12,14.0969
2018-02-13,14.0708
2018-02-14,14.3056
2018-02-15,14.3926
2018-02-16,14.3056
2018-02-20,14.1143
2018-02-21,13.8012
2018-02-22,13.6621
2018-02-23,14.0882
2018-02-26,14.1143
2018-02-27,13.8273
2018-02-28,13.6273
2018-03-01,13.8795
2018-03-02,13.836
2018-03-05,14.0882
2018-03-06,14.123
2018-03-07,14.0186
2018-03-08,13.9317
2018-03-09,13.8969
2018-03-12,13.7317
2018-03-13,13.5143
2018-03-14,13.5056
2018-03-15,13.149
2018-03-16,13.1229
2018-03-19,13.2534
2018-03-20,12.9838
2018-03-21,13.062
2018-03-22,12.8533
2018-03-23,12.8011
2018-03-26,13.0794
2018-03-27,13.1577
2018-03-28,12.8968
2018-03-29,13.3577
2018-04-02,13.2968
2018-04-03,13.2447
2018-04-04,13.3925
2018-04-05,13.3055
2018-04-06,13.1055
2018-04-09,12.8881
2018-04-10,13.0794
2018-04-11,13.1316
2018-04-12,12.6011
2018-04-13,12.5953
2018-04-16,12.5864
2018-04-17,12.8714
2018-04-18,13.0941
2018-04-19,12.9427
2018-04-20,12.8002
2018-04-23,12.7111
2018-04-24,12.6665
2018-04-25,12.5953
2018-04-26,12.7289
2018-04-27,12.8002
2018-04-30,12.5775
2018-05-01,12.5953
2018-05-02,12.4617
2018-05-03,12.2123
2018-05-04,12.1143
2018-05-07,11.9539
2018-05-08,11.8292
2018-05-09,11.6244
2018-05-10,11.7936
2018-05-11,11.6867
2018-05-14,11.4195
2018-05-15,11.4195
2018-05-16,11.5976
2018-05-17,11.2948
2018-05-18,10.8939
2018-05-21,10.9296
2018-05-22,11.1166
2018-05-23,11.0454
2018-05-24,11.081
2018-05-25,11.1166
2018-05-29,10.6
2018-05-30,10.7692
2018-05-31,10.7336
2018-06-01,10.8138
2018-06-04,10.796
2018-06-05,10.4307
2018-06-06,10.502
2018-06-07,10.2882
2018-06-08,10.8405
2018-06-11,10.8672
2018-06-12,10.8761
2018-06-13,10.9652
2018-06-14,10.9118
2018-06-15,10.9652
2018-06-18,10.983
2018-06-19,10.9741
2018-06-20,10.9118
2018-06-21,10.6445
2018-06-22,10.698
2018-06-25,10.8227
2018-06-26,10.6089
2018-06-27,10.3239
2018-06-28,10.4218
2018-06-29,10.5733
2018-07-02,10.363
2018-07-03,10.5242
2018-07-05,10.3272
2018-07-06,10.3988
2018-07-09,10.4794
2018-07-10,10.6586
2018-07-11,10.3809
2018-07-12,10.3272
2018-07-13,10.3361
2018-07-16,10.3272
2018-07-17,10.56
2018-07-18,10.3809
2018-07-19,10.2286
2018-07-20,10.4973
2018-07-23,10.2824
2018-07-24,10.4884
2018-07-25,10.5063
2018-07-26,10.1212
2018-07-27,10.2555
2018-07-30,9.9331
2018-07-31,9.8883
2018-08-01,9.942
2018-08-02,9.8793
2018-08-03,10.0495
2018-08-06,10.157
2018-08-07,9.8704
2018-08-08,9.7539
2018-08-09,9.6644
2018-08-10,9.4136
2018-08-13,9.4136
2018-08-14,9.5569
2018-08-15,9.4046
2018-08-16,9.2882
2018-08-17,9.1717
2018-08-20,9.118
2018-08-21,8.912
2018-08-22,8.8672
2018-08-23,8.7597
2018-08-24,8.8941
2018-08-27,8.9926
2018-08-28,8.8493
2018-08-29,8.9568
2018-08-30,8.706
2018-08-31,8.8582
2018-09-04,8.5627
2018-09-05,8.5716
2018-09-06,8.9836
2018-09-07,9.0553
2018-09-10,8.8672
2018-09-11,8.6164
2018-09-12,8.7956
2018-09-13,8.5448
2018-09-14,8.5537
2018-09-17,8.7239
2018-09-18,8.8131
2018-09-19,8.7383
2018-09-20,9.0096
2018-09-21,9.0096
2018-09-24,8.785
2018-09-25,8.785
2018-09-26,9.0751
2018-09-27,9.3745
2018-09-28,9.1031
2018-10-01,9.0657
2018-10-02,9.5148
2018-10-03,9.7674
2018-10-04,9.5803
2018-10-05,9.5429
2018-10-08,10.0574
2018-10-09,9.9077
2018-10-10,9.5616
2018-10-11,9.4774
2018-10-12,9.3745
2018-10-15,9.4306
2018-10-16,9.4867
2018-10-17,9.6551
2018-10-18,9.5148
2018-10-19,9.5522
2018-10-22,9.6738
2018-10-23,9.6832
2018-10-24,9.3557
2018-10-25,9.5522
2018-10-26,9.73
2018-10-29,9.6551
2018-10-30,10.8339
2018-10-31,10.8527
2018-11-01,11.3579
2018-11-02,11.3579
2018-11-05,11.283
2018-11-06,11.0678
2018-11-07,10.9743
2018-11-08,10.8807
2018-11-09,10.862
2018-11-12,10.8339
2018-11-13,10.8339
2018-11-14,10.9836
2018-11-15,11.152
2018-11-16,11.3859
2018-11-19,11.124
2018-11-20,10.9088
2018-11-21,11.2456
2018-11-23,11.0585
2018-11-26,10.8339
2018-11-27,11.2362
2018-11-28,11.2924
2018-11-29,11.283
2018-11-30,11.0866
2018-12-03,11.2362
2018-12-04,11.0866
2018-12-06,11.2269
2018-12-07,11.1801
2018-12-10,11.0772
2018-12-11,11.1988
2018-12-12,11.3017
2018-12-13,11.414
2018-12-14,11.5356
2018-12-17,11.3204
2018-12-18,11.8187
2018-12-19,11.2568
2018-12-20,11.4854
2018-12-21,11.4092
2018-12-24,11.0949
2018-12-26,11.5044
2018-12-27,11.3139
2018-12-28,11.2949
2018-12-31,11.3616
2019-01-02,11.9234
2019-01-03,11.9711
2019-01-04,12.152
2019-01-07,12.1901
2019-01-08,12.2853
2019-01-09,12.552
2019-01-10,12.4282
2019-01-11,12.2853
2019-01-14,12.3901
2019-01-15,12.2377
2019-01-16,11.933
2019-01-17,11.8377
2019-01-18,11.8568
2019-01-22,11.5901
2019-01-23,11.9044
2019-01-24,12.0377
2019-01-25,12.0758
2019-01-28,12.152
2019-01-29,12.152
2019-01-30,12.4472
2019-01-31,12.7615
2019-02-01,12.7806
2019-02-04,12.7234
2019-02-05,12.7615
2019-02-06,12.2853
2019-02-07,12.1615
2019-02-08,12.152
2019-02-11,12.1139
2019-02-12,12.2853
2019-02-13,12.1996
2019-02-14,12.2949
2019-02-15,12.352
2019-02-19,12.3901
2019-02-20,12.1234
2019-02-21,12.0472
2019-02-22,12.1996
2019-02-25,12.1806
2019-02-26,12.2377
2019-02-27,12.1139
2019-02-28,11.8853
2019-03-01,11.727
2019-03-04,11.6501
2019-03-05,11.6789
2019-03-06,11.3617
2019-03-07,11.3425
2019-03-08,11.5732
2019-03-11,11.727
2019-03-12,11.775
2019-03-13,11.8904
2019-03-14,11.7846
2019-03-15,11.9576
2019-03-18,12.2749
2019-03-19,12.246
2019-03-20,12.3998
2019-03-21,12.0345
2019-03-22,11.7077
2019-03-25,11.6789
2019-03-26,11.6981
2019-03-27,11.2079
2019-03-28,11.5059
2019-03-29,11.602
2019-04-01,11.775
2019-04-02,11.6981
2019-04-03,11.7462
2019-04-04,12.1114
2019-04-05,12.2845
2019-04-08,12.4383
2019-04-09,12.0826
2019-04-10,12.1211
2019-04-11,12.0826
2019-04-12,11.8498
2019-04-15,11.8796
2019-04-16,11.9391
2019-04-17,11.7009
2019-04-18,11.8498
2019-04-22,11.8002
2019-04-23,11.7902
2019-04-24,11.5521
2019-04-25,11.7109
2019-04-26,11.7109
2019-04-29,11.691
2019-04-30,11.8101
2019-05-01,11.6116
2019-05-02,11.51
2019-05-03,11.58
2019-05-06,11.46
2019-05-07,11.47
2019-05-08,11.56
2019-05-09,11.48
2019-05-10,11.47
2019-05-13,11.25
2019-05-14,11.25
2019-05-15,11.16
2019-05-16,11.02
2019-05-17,10.93
2019-05-20,11.08
2019-05-21,11.39
2019-05-22,11.48
2019-05-23,11.55
2019-05-24,11.55
2019-05-28,11.57
2019-05-29,11.71
2019-05-30,11.9
2019-05-31,12.24
2019-06-03,12.59
2019-06-04,12.92
2019-06-05,12.73
2019-06-06,12.7
2019-06-07,12.7
2019-06-10,12.69
2019-06-11,12.77
2019-06-12,12.86
2019-06-13,13.005
2019-06-14,12.86
2019-06-17,12.63
2019-06-18,12.925
2019-06-19,12.89
2019-06-20,13.03
2019-06-21,13.065
2019-06-24,13.14
2019-06-25,12.885
2019-06-26,12.945
2019-06-27,13.105
2019-06-28,13.05
2019-07-01,12.695
2019-07-02,12.92
2019-07-03,13.16
2019-07-04,13.16
2019-07-05,13.255
2019-07-08,13.3
2019-07-09,13.275
2019-07-10,13.835
2019-07-11,13.895
2019-07-12,13.96
2019-07-15,14.225
2019-07-16,14.295
2019-07-17,14.35
2019-07-18,14.395
2019-07-19,14.27
2019-07-22,14.31
2019-07-23,14.155
2019-07-24,14.255
2019-07-25,13.83
2019-07-26,13.87
2019-07-29,13.91
2019-07-30,13.76
2019-07-31,13.65
2019-08-01,13.535
2019-08-02,13.455
2019-08-05,13.065
2019-08-06,13.23
2019-08-07,13.365
2019-08-08,13.495
2019-08-09,13.305
2019-08-12,13.01
2019-08-13,13.105
2019-08-14,12.625
2019-08-15,12.935
2019-08-16,13.165
2019-08-19,12.825
2019-08-20,13.125
2019-08-21,13.205
2019-08-22,12.92
2019-08-23,12.575
2019-08-26,12.355
2019-08-27,12.385
2019-08-28,12.475
2019-08-29,12.535
2019-08-30,12.975
2019-09-02,12.95
2019-09-03,12.9
2019-09-04,13.36
2019-09-05,13.495
2019-09-06,13.395
2019-09-09,12.93
2019-09-10,12.775
2019-09-11,13.06
2019-09-12,13.115
2019-09-13,12.745
2019-09-16,12.855
2019-09-17,13.03
2019-09-18,12.995
2019-09-19,13
2019-09-20,13.02
2019-09-23,12.895
2019-09-24,12.875
2019-09-25,12.965
2019-09-26,13.11
2019-09-27,13.095
2019-09-30,13.175
2019-10-01,12.89
2019-10-02,12.745
2019-10-03,12.85
2019-10-04,13.155
2019-10-07,12.865
2019-10-08,12.84
2019-10-09,12.84
2019-10-10,12.905
2019-10-11,13.04
2019-10-14,12.935
2019-10-15,12.87
2019-10-16,13.145
2019-10-17,13.13
2019-10-18,13.225
2019-10-21,13.145
2019-10-22,13.325
2019-10-23,13.465
2019-10-24,13.335
2019-10-25,13.315
2019-10-28,13.32
2019-10-29,13.245
2019-10-30,13.26
2019-10-31,13.17
2019-11-01,13.355
2019-11-04,13.305
2019-11-05,13.355
2019-11-06,13.315
2019-11-07,13.265
2019-11-08,12.945
2019-11-11,13.05
2019-11-12,12.905
2019-11-13,12.915
2019-11-14,13.07
2019-11-15,13.295
2019-11-18,13.305
2019-11-19,13.195
2019-11-20,13.13
2019-11-21,13.055
2019-11-22,13.105
2019-11-25,13.075
