date,close
2014-06-13,58.79
2014-06-16,58.67
2014-06-17,59.93
2014-06-18,59.26
2014-06-19,58
2014-06-20,56.62
2014-06-23,56.15
2014-06-24,56.03
2014-06-25,56.53
2014-06-26,56.66
2014-06-27,56.6
2014-06-30,57.69
2014-07-01,58.51
2014-07-02,58.84
2014-07-03,59.59
2014-07-07,58.72
2014-07-08,56.25
2014-07-09,55.77
2014-07-10,54.88
2014-07-11,55.49
2014-07-14,55.86
2014-07-15,55.96
2014-07-16,56.01
2014-07-17,55.1
2014-07-18,54.73
2014-07-21,55.43
2014-07-22,56.52
2014-07-23,55.99
2014-07-24,56.15
2014-07-25,57.4
2014-07-28,57.81
2014-07-29,57.56
2014-07-30,57.96
2014-07-31,56.72
2014-08-01,55.82
2014-08-04,56.37
2014-08-05,55.96
2014-08-06,56.39
2014-08-07,56.42
2014-08-08,56.72
2014-08-11,57.82
2014-08-12,57.73
2014-08-13,58.61
2014-08-14,57.81
2014-08-15,58.32
2014-08-18,60.19
2014-08-19,61.35
2014-08-20,61.51
2014-08-21,61.43
2014-08-22,61.29
2014-08-25,60.55
2014-08-26,60.28
2014-08-27,60.03
2014-08-28,58.84
2014-08-29,59.06
2014-09-02,59.53
2014-09-03,56.57
2014-09-04,56.54
2014-09-05,56.49
2014-09-08,56.02
2014-09-09,55
2014-09-10,54.57
2014-09-11,56.01
2014-09-12,56.09
2014-09-15,52.92
2014-09-16,53.86
2014-09-17,53.56
2014-09-18,54
2014-09-19,53.68
2014-09-22,52.17
2014-09-23,52.18
2014-09-24,52.49
2014-09-25,52.06
2014-09-26,52.06
2014-09-29,51.55
2014-09-30,50.23
2014-10-01,48.36
2014-10-02,48.69
2014-10-03,48.76
2014-10-06,48.29
2014-10-07,47.24
2014-10-08,47.74
2014-10-09,46.53
2014-10-10,44.62
2014-10-13,44.01
2014-10-14,43.09
2014-10-15,44.84
2014-10-16,44.97
2014-10-17,43.515
2014-10-20,43.545
2014-10-21,43.72
2014-10-22,42.86
2014-10-23,43.51
2014-10-24,44.02
2014-10-27,43.03
2014-10-28,44.47
2014-10-29,43.66
2014-10-30,45.8
2014-10-31,48.59
2014-11-03,50.3
2014-11-04,49.64
2014-11-05,49.51
2014-11-06,49.19
2014-11-07,50.34
2014-11-10,51.49
2014-11-11,51.13
2014-11-12,51.26
2014-11-13,50.15
2014-11-14,50.96
2014-11-17,49.23
2014-11-18,48.99
2014-11-19,47.91
2014-11-20,48.26
2014-11-21,49.02
2014-11-24,49.59
2014-11-25,49.3
2014-11-26,50.61
2014-11-28,50.61
2014-12-01,48.11
2014-12-02,47.78
2014-12-03,48.42
2014-12-04,47.3
2014-12-05,47.77
2014-12-08,46.17
2014-12-09,47.64
2014-12-10,46.34
2014-12-11,47.45
2014-12-12,47.82
2014-12-15,48.76
2014-12-16,48.81
2014-12-17,49.97
2014-12-18,52.15
2014-12-19,52.77
2014-12-22,53.07
2014-12-23,52.02
2014-12-24,51.8
2014-12-26,52.39
2014-12-29,51.94
2014-12-30,51.74
2014-12-31,53.18
2015-01-02,52.42
2015-01-05,51.88
2015-01-06,50.67
2015-01-07,50.72
2015-01-08,51.76
2015-01-09,50.99
2015-01-12,50.18
2015-01-13,50.64
2015-01-14,51.13
2015-01-15,49.385
2015-01-16,49.94
2015-01-20,54.56
2015-01-21,55
2015-01-22,54.87
2015-01-23,54.64
2015-01-26,57.23
2015-01-27,56.62
2015-01-28,57.13
2015-01-29,56.37
2015-01-30,56.14
2015-02-02,56.62
2015-02-03,56.89
2015-02-04,57.68
2015-02-05,57.23
2015-02-06,55.89
2015-02-09,51.62
2015-02-10,50.71
2015-02-11,51.37
2015-02-12,51.22
2015-02-13,53.96
2015-02-17,53.72
2015-02-18,53.51
2015-02-19,53.37
2015-02-20,53.26
2015-02-23,52.76
2015-02-24,52.34
2015-02-25,51.66
2015-02-26,53.18
2015-02-27,52.62
2015-03-02,52.92
2015-03-03,51.9
2015-03-04,51.7
2015-03-05,51.47
2015-03-06,51.07
2015-03-09,51.2
2015-03-10,52.79
2015-03-11,53.42
2015-03-12,49.84
2015-03-13,49.26
2015-03-16,50.22
2015-03-17,50.75
2015-03-18,51.84
2015-03-19,49.96
2015-03-20,53.12
2015-03-23,54.75
2015-03-24,53.79
2015-03-25,53.56
2015-03-26,52.89
2015-03-27,53.74
2015-03-30,53.58
2015-03-31,53.33
2015-04-01,53.74
2015-04-02,53.38
2015-04-06,53.55
2015-04-07,54.51
2015-04-08,57.84
2015-04-09,58.56
2015-04-10,57.81
2015-04-13,60.005
2015-04-14,60.305
2015-04-15,60.74
2015-04-16,63.71
2015-04-17,62.005
2015-04-20,62.88
2015-04-21,63.62
2015-04-22,65.305
2015-04-23,65.55
2015-04-24,67.54
2015-04-27,67.65
2015-04-28,67.97
2015-04-29,68.48
2015-04-30,66.45
2015-05-01,68.615
2015-05-04,68.31
2015-05-05,66.81
2015-05-06,67.78
2015-05-07,68.55
2015-05-08,67.94
2015-05-11,67.85
2015-05-12,67.49
2015-05-13,66.78
2015-05-14,66.18
2015-05-15,67.2
2015-05-18,66.99
2015-05-19,65.79
2015-05-20,66.18
2015-05-21,66.13
2015-05-22,66.36
2015-05-26,65.69
2015-05-27,65.58
2015-05-28,64.12
2015-05-29,63.68
2015-06-01,65.75
2015-06-02,66.94
2015-06-03,67.6
2015-06-04,67.73
2015-06-05,68.92
2015-06-08,69.74
2015-06-09,67.48
2015-06-10,67.99
2015-06-11,69.25
2015-06-12,70.94
2015-06-15,68.11
2015-06-16,66.78
2015-06-17,69.47
2015-06-18,67.18
2015-06-19,65.42
2015-06-22,65.09
2015-06-23,65.14
2015-06-24,64.9
2015-06-25,64.42
2015-06-26,59.92
2015-06-29,58.95
2015-06-30,59.09
2015-07-01,57.71
2015-07-02,58.55
2015-07-06,50.54
2015-07-07,47.1
2015-07-08,44.18
2015-07-09,48.08
2015-07-10,47.12
2015-07-13,47.44
2015-07-14,47.61
2015-07-15,46.26
2015-07-16,47.03
2015-07-17,48.05
2015-07-20,46.91
2015-07-21,47.84
2015-07-22,46.2
2015-07-23,46.2
2015-07-24,44.68
2015-07-27,42.74
2015-07-28,44.23
2015-07-29,46.27
2015-07-30,46.95
2015-07-31,48.13
2015-08-03,47.54
2015-08-04,49.68
2015-08-05,50.37
2015-08-06,50.91
2015-08-07,49.59
2015-08-10,51.18
2015-08-11,50
2015-08-12,50.29
2015-08-13,49.45
2015-08-14,49.87
2015-08-17,48.68
2015-08-18,47.81
2015-08-19,47.27
2015-08-20,46.02
2015-08-21,45.82
2015-08-24,43.04
2015-08-25,43.65
2015-08-26,44.07
2015-08-27,47.49
2015-08-28,47.68
2015-08-31,47.33
2015-09-01,45.16
2015-09-02,45.39
2015-09-03,45.25
2015-09-04,43.77
2015-09-08,44.38
2015-09-09,43.93
2015-09-10,43.33
2015-09-11,43.9
2015-09-14,42.63
2015-09-15,43.08
2015-09-16,44.95
2015-09-17,44.42
2015-09-18,44.08
2015-09-21,42.89
2015-09-22,42.54
2015-09-23,41.55
2015-09-24,42.12
2015-09-25,41.52
2015-09-28,40.73
2015-09-29,40.62
2015-09-30,41.3
2015-10-01,41.96
2015-10-02,44.5
2015-10-05,44.62
2015-10-06,44.86
2015-10-07,44.99
2015-10-08,45.2
2015-10-09,45.29
2015-10-12,46.54
2015-10-13,47.06
2015-10-14,46.56
2015-10-15,47.26
2015-10-16,47.75
2015-10-19,46.88
2015-10-20,47.07
2015-10-21,45
2015-10-22,45
2015-10-23,45.35
2015-10-26,48.5
2015-10-27,47.99
2015-10-28,49.88
2015-10-29,48.3
2015-10-30,50.52
2015-11-02,52.36
2015-11-03,51.99
2015-11-04,52.9
2015-11-05,52.61
2015-11-06,52.57
2015-11-09,53.23
2015-11-10,51.81
2015-11-11,52.14
2015-11-12,51.68
2015-11-13,50.38
2015-11-16,52.59
2015-11-17,52.04
2015-11-18,53.01
2015-11-19,53.47
2015-11-20,53.4
2015-11-23,53.38
2015-11-24,52.99
2015-11-25,52.98
2015-11-27,51.57
2015-11-30,50.25
2015-12-01,49
2015-12-02,48.98
2015-12-03,48.13
2015-12-04,49.68
2015-12-07,49.75
2015-12-08,49.48
2015-12-09,48.62
2015-12-10,48.86
2015-12-11,47.88
2015-12-14,48.88
2015-12-15,51.15
2015-12-16,51.5
2015-12-17,56.2
2015-12-18,58.09
2015-12-21,57.5
2015-12-22,58.1
2015-12-23,59.06
2015-12-24,58.8
2015-12-28,58.16
2015-12-29,57.81
2015-12-30,56.41
2015-12-31,57.19
2016-01-04,53.56
2016-01-05,54.4
2016-01-06,54.57
2016-01-07,53.26
2016-01-08,53.75
2016-01-11,50.87
2016-01-12,50.7
2016-01-13,50.13
2016-01-14,52.97
2016-01-15,51.24
2016-01-19,52
2016-01-20,51.11
2016-01-21,51.13
2016-01-22,51.38
2016-01-25,50.93
2016-01-26,50.86
2016-01-27,49.84
2016-01-28,49.51
2016-01-29,50.39
2016-02-01,48.41
2016-02-02,46.03
2016-02-03,45.37
2016-02-04,45.69
2016-02-05,44.85
2016-02-08,42.6
2016-02-09,42.44
2016-02-10,43
2016-02-11,41.98
2016-02-12,44.22
2016-02-16,46.34
2016-02-17,46.1
2016-02-18,44.94
2016-02-19,46.15
2016-02-22,46.99
2016-02-23,44.58
2016-02-24,44.58
2016-02-25,43.68
2016-02-26,44.72
2016-02-29,43.47
2016-03-01,44.54
2016-03-02,45
2016-03-03,45.14
2016-03-04,48.23
2016-03-07,47.42
2016-03-08,46.91
2016-03-09,46.8
2016-03-10,46.61
2016-03-11,47.99
2016-03-14,48.14
2016-03-15,50.12
2016-03-16,51.36
2016-03-17,51.46
2016-03-18,53.04
2016-03-21,51.68
2016-03-22,51.63
2016-03-23,49.65
2016-03-24,49.89
2016-03-28,48.66
2016-03-29,49.61
2016-03-30,49.5
2016-03-31,49.54
2016-04-01,48.98
2016-04-04,49.72
2016-04-05,48.57
2016-04-06,49.29
2016-04-07,48.42
2016-04-08,48.02
2016-04-11,48.07
2016-04-12,47.75
2016-04-13,48.65
2016-04-14,48.25
2016-04-15,48.51
2016-04-18,48.05
2016-04-19,48.01
2016-04-20,48.37
2016-04-21,47.38
2016-04-22,47.71
2016-04-25,46.11
2016-04-26,45.81
2016-04-27,45.29
2016-04-28,45.02
2016-04-29,44.93
2016-05-02,44.35
2016-05-03,43.24
2016-05-04,43.51
2016-05-05,43.03
2016-05-06,42.82
2016-05-09,41.42
2016-05-10,41.89
2016-05-11,41.01
2016-05-12,40
2016-05-13,39.52
2016-05-16,40.82
2016-05-17,40.31
2016-05-18,40.17
2016-05-19,38.71
2016-05-20,39.46
2016-05-23,39.38
2016-05-24,39.89
2016-05-25,40.22
2016-05-26,40.02
2016-05-27,41.15
2016-05-31,41.77
2016-06-01,40.94
2016-06-02,40.94
2016-06-03,40.51
2016-06-06,41.23
2016-06-07,41.11
2016-06-08,41.03
2016-06-09,40.61
2016-06-10,39.71
2016-06-13,38.98
2016-06-14,39.09
2016-06-15,39.05
2016-06-16,38.58
2016-06-17,39.1
2016-06-20,39.2
2016-06-21,38.44
2016-06-22,38.53
2016-06-23,38.96
2016-06-24,37.41
2016-06-27,35.84
2016-06-28,36.59
2016-06-29,37.54
2016-06-30,37.86
2016-07-01,37.74
2016-07-05,37.12
2016-07-06,36.87
2016-07-07,37.77
2016-07-08,37.75
2016-07-11,39.47
2016-07-12,40
2016-07-13,39.3
2016-07-14,39.25
2016-07-15,39.3
2016-07-18,39.53
2016-07-19,39
2016-07-20,38.89
2016-07-21,38.69
2016-07-22,38.75
2016-07-25,38.74
2016-07-26,39.07
2016-07-27,39.1
2016-07-28,39.28
2016-07-29,38.68
2016-08-01,37.91
2016-08-02,37.57
2016-08-03,37.36
2016-08-04,37.36
2016-08-05,37.75
2016-08-08,37.83
2016-08-09,37.86
2016-08-10,38.37
2016-08-11,40.19
2016-08-12,39.36
2016-08-15,39.61
2016-08-16,39.73
2016-08-17,38.73
2016-08-18,38.72
2016-08-19,38.73
2016-08-22,38.75
2016-08-23,38.95
2016-08-24,39.04
2016-08-25,39.19
2016-08-26,40.24
2016-08-29,41.98
2016-08-30,42.54
2016-08-31,42.54
2016-09-01,41.41
2016-09-02,41.61
2016-09-06,42.6
2016-09-07,41.75
2016-09-08,41.53
2016-09-09,41.44
2016-09-12,42.45
2016-09-13,42.93
2016-09-14,44.76
2016-09-15,44.91
2016-09-16,45.14
2016-09-19,44.97
2016-09-20,43.4
2016-09-21,43.74
2016-09-22,44.48
2016-09-23,44
2016-09-26,42.86
2016-09-27,43.61
2016-09-28,43.86
2016-09-29,45.21
2016-09-30,44.25
2016-10-03,43.79
2016-10-04,44.48
2016-10-05,44.68
2016-10-06,44.4
2016-10-07,42.94
2016-10-10,43.32
2016-10-11,42.59
2016-10-12,43.09
2016-10-13,42.26
2016-10-14,43.42
2016-10-17,42.43
2016-10-18,42.21
2016-10-19,42.76
2016-10-20,41.91
2016-10-21,42.51
2016-10-24,39.63
2016-10-25,38.93
2016-10-26,39.72
2016-10-27,38.25
2016-10-28,37.72
2016-10-31,37.43
2016-11-01,37.52
2016-11-02,36.89
2016-11-03,36.81
2016-11-04,35.94
2016-11-07,36.27
2016-11-08,35.81
2016-11-09,35.39
2016-11-10,34.7
2016-11-11,35.14
2016-11-14,34.1
2016-11-15,34.61
2016-11-16,35.19
2016-11-17,35.04
2016-11-18,34.84
2016-11-21,34.87
2016-11-22,34.69
2016-11-23,34.88
2016-11-25,35.77
2016-11-28,34.44
2016-11-29,35.05
2016-11-30,34.63
2016-12-01,33.92
2016-12-02,32.98
2016-12-05,33.32
2016-12-06,33.88
2016-12-07,35.26
2016-12-08,36.02
2016-12-09,36.75
2016-12-12,36.5
2016-12-13,36.56
2016-12-14,36.28
2016-12-15,35.32
2016-12-16,35.24
2016-12-19,35.43
2016-12-20,34.76
2016-12-21,34.62
2016-12-22,34.18
2016-12-23,34.49
2016-12-27,35.25
2016-12-28,34.38
2016-12-29,34.23
2016-12-30,33.89
2017-01-03,35.54
2017-01-04,36.76
2017-01-05,38.35
2017-01-06,38.95
2017-01-09,38.73
2017-01-10,38.78
2017-01-11,38.55
2017-01-12,38.23
2017-01-13,39.4
2017-01-17,38.99
2017-01-18,39.7
2017-01-19,39.16
2017-01-20,39.1
2017-01-23,39.94
2017-01-24,41.75
2017-01-25,41.27
2017-01-26,40.81
2017-01-27,40.43
2017-01-30,39.49
2017-01-31,39.67
2017-02-01,39.69
2017-02-02,39.53
2017-02-03,39.54
2017-02-06,39.34
2017-02-07,39.79
2017-02-08,39.79
2017-02-09,39.66
2017-02-10,39.97
2017-02-13,39.99
2017-02-14,39.41
2017-02-15,39.25
2017-02-16,39.25
2017-02-17,39.35
2017-02-21,41.62
2017-02-22,42.16
2017-02-23,41.04
2017-02-24,41.25
2017-02-27,40.47
2017-02-28,39.83
2017-03-01,41.29
2017-03-02,40.85
2017-03-03,40.76
2017-03-06,40.58
2017-03-07,40.7
2017-03-08,40.94
2017-03-09,41.08
2017-03-10,41.71
2017-03-13,42.31
2017-03-14,42.06
2017-03-15,41.57
2017-03-16,41.73
2017-03-17,42.01
2017-03-20,42.04
2017-03-21,40.85
2017-03-22,39.18
2017-03-23,40.82
2017-03-24,40.37
2017-03-27,40.37
2017-03-28,40.36
2017-03-29,40.83
2017-03-30,40.38
2017-03-31,39.33
2017-04-03,40.07
2017-04-04,39.54
2017-04-05,39.32
2017-04-06,39.23
2017-04-07,39.05
2017-04-10,39.86
2017-04-11,39.98
2017-04-12,39.75
2017-04-13,39.65
2017-04-17,39.43
2017-04-18,39.55
2017-04-19,39.59
2017-04-20,39.96
2017-04-21,40.83
2017-04-24,38.2
2017-04-25,38.25
2017-04-26,38.52
2017-04-27,39.23
2017-04-28,38.8
2017-05-01,38.98
2017-05-02,39.38
2017-05-03,39.58
2017-05-04,39.38
2017-05-05,39.32
2017-05-08,40.1
2017-05-09,40.38
2017-05-10,40.47
2017-05-11,40.1
2017-05-12,39.53
2017-05-15,41.12
2017-05-16,40.82
2017-05-17,41.54
2017-05-18,44.2
2017-05-19,46.13
2017-05-22,49.22
2017-05-23,48.54
2017-05-24,45.62
2017-05-25,46.61
2017-05-26,46.65
2017-05-30,46.27
2017-05-31,44.89
2017-06-01,45.19
2017-06-02,44.93
2017-06-05,45.97
2017-06-06,46.91
2017-06-07,47.39
2017-06-08,47.68
2017-06-09,45.7
2017-06-12,46.26
2017-06-13,46.54
2017-06-14,45.09
2017-06-15,45.58
2017-06-16,45.48
2017-06-19,46.38
2017-06-20,46.41
2017-06-21,46.33
2017-06-22,45.58
2017-06-23,46.23
2017-06-26,46.06
2017-06-27,45.76
2017-06-28,45.17
2017-06-29,45.43
2017-06-30,45.06
2017-07-03,45.47
2017-07-05,45.31
2017-07-06,44.54
2017-07-07,44.46
2017-07-10,44.77
2017-07-11,45.33
2017-07-12,46.31
2017-07-13,46.12
2017-07-14,46.16
2017-07-17,45.7
2017-07-18,46.75
2017-07-19,48.5
2017-07-20,47.07
2017-07-21,46.69
2017-07-24,47.16
2017-07-25,48.35
2017-07-26,49.66
2017-07-27,48.98
2017-07-28,50.85
2017-07-31,56.83
2017-08-01,55.51
2017-08-02,55.23
2017-08-03,56.35
2017-08-04,56.98
2017-08-07,56.84
2017-08-08,56.32
2017-08-09,55.72
2017-08-10,53.95
2017-08-11,54.62
2017-08-14,54.9
2017-08-15,54.67
2017-08-16,54.6
2017-08-17,53.58
2017-08-18,53.41
2017-08-21,54.84
2017-08-22,54.98
2017-08-23,55.56
2017-08-24,54.9
2017-08-25,54.66
2017-08-28,51.38
2017-08-29,51.76
2017-08-30,52.14
2017-08-31,53.34
2017-09-01,53.93
2017-09-05,53.57
2017-09-06,53.64
2017-09-07,54.66
2017-09-08,54.22
2017-09-11,54.98
2017-09-12,55.74
2017-09-13,54.94
2017-09-14,55.51
2017-09-15,55.81
2017-09-18,56.1
2017-09-19,55.53
2017-09-20,55.31
2017-09-21,54.86
2017-09-22,54.92
2017-09-25,53.27
2017-09-26,53.06
2017-09-27,53.74
2017-09-28,53.65
2017-09-29,54.45
2017-10-02,56.16
2017-10-03,55.69
2017-10-04,55.34
2017-10-05,55.09
2017-10-06,57.46
2017-10-09,57.62
2017-10-10,57.1
2017-10-11,56.87
2017-10-12,57.05
2017-10-13,64.5
2017-10-16,70.06
2017-10-17,67.73
2017-10-18,69.22
2017-10-19,66.6
2017-10-20,67.62
2017-10-23,66.96
2017-10-24,66.06
2017-10-25,64.03
2017-10-26,63.54
2017-10-27,58.31
2017-10-30,56.63
2017-10-31,57.23
2017-11-01,57.63
2017-11-02,57.53
2017-11-03,56.96
2017-11-06,56.46
2017-11-07,58.78
2017-11-08,58.7
2017-11-09,55.28
2017-11-10,54.4
2017-11-13,54.79
2017-11-14,53.67
2017-11-15,52.99
2017-11-16,54.54
2017-11-17,53.33
2017-11-20,53.58
2017-11-21,53.34
2017-11-22,53.1
2017-11-24,52.4
2017-11-27,52.12
2017-11-28,51.44
2017-11-29,48.82
2017-11-30,48.39
2017-12-01,46.36
2017-12-04,44.85
2017-12-05,45.41
2017-12-06,44.97
2017-12-07,44.46
2017-12-08,43.72
2017-12-11,45.86
2017-12-12,44.58
2017-12-13,44.9
2017-12-14,44.49
2017-12-15,44.81
2017-12-18,45.73
2017-12-19,45.64
2017-12-20,44.05
2017-12-21,44.68
2017-12-22,43.98
2017-12-26,44.39
2017-12-27,44.34
2017-12-28,44.18
2017-12-29,43.35
2018-01-02,45.58
2018-01-03,44.99
2018-01-04,45.24
2018-01-05,46.41
2018-01-08,46.82
2018-01-09,46.02
2018-01-10,44.56
2018-01-11,45.33
2018-01-12,44.51
2018-01-16,44.12
2018-01-17,45.51
2018-01-18,45.25
2018-01-19,44.64
2018-01-22,44.37
2018-01-23,44.57
2018-01-24,45.1
2018-01-25,44.88
2018-01-26,46.31
2018-01-29,39.01
2018-01-30,38.61
2018-01-31,38.51
2018-02-01,38.31
2018-02-02,37.14
2018-02-05,35.09
2018-02-06,36.03
2018-02-07,34.65
2018-02-08,33.02
2018-02-09,33.45
2018-02-12,33.29
2018-02-13,34.21
2018-02-14,34.45
2018-02-15,34.87
2018-02-16,34.5
2018-02-20,34.78
2018-02-21,34.3
2018-02-22,34.05
2018-02-23,34
2018-02-26,34.61
2018-02-27,34.23
2018-02-28,33.65
2018-03-01,33.46
2018-03-02,35.35
2018-03-05,36.2
2018-03-06,37.33
2018-03-07,37.58
2018-03-08,37.54
2018-03-09,37.68
2018-03-12,37.5
2018-03-13,37.42
2018-03-14,37.29
2018-03-15,36.91
2018-03-16,36.16
2018-03-19,35.01
2018-03-20,35.09
2018-03-21,34.68
2018-03-22,33.38
2018-03-23,32.9
2018-03-26,32.97
2018-03-27,32.06
2018-03-28,29.71
2018-03-29,30.92
2018-04-02,32.88
2018-04-03,32.99
2018-04-04,34.4
2018-04-05,34.87
2018-04-06,33.8
2018-04-09,34.47
2018-04-10,34.74
2018-04-11,34.75
2018-04-12,34.58
2018-04-13,33.78
2018-04-16,33.85
2018-04-17,34.16
2018-04-18,34.37
2018-04-19,34.24
2018-04-20,33.87
2018-04-23,30.94
2018-04-24,30.28
2018-04-25,27.28
2018-04-26,29.05
2018-04-27,29.73
2018-04-30,30.98
2018-05-01,32.68
2018-05-02,33.79
2018-05-03,33.53
2018-05-04,33.96
2018-05-07,35.21
2018-05-08,35.61
2018-05-09,34.67
2018-05-10,36.4
2018-05-11,35.7
2018-05-14,37.06
2018-05-15,36.54
2018-05-16,36.58
2018-05-17,36.51
2018-05-18,36.08
2018-05-21,36.28
2018-05-22,35.95
2018-05-23,37.42
2018-05-24,36.41
2018-05-25,37.37
2018-05-29,36.53
2018-05-30,36.14
2018-05-31,36.26
2018-06-01,37.81
2018-06-04,39.15
2018-06-05,40.54
2018-06-06,40.62
2018-06-07,39.99
2018-06-08,38.63
2018-06-11,39.01
2018-06-12,39.53
2018-06-13,39.71
2018-06-14,40.79
2018-06-15,41.25
2018-06-18,41.81
2018-06-19,41.01
2018-06-20,41.3
2018-06-21,41
2018-06-22,41.37
2018-06-25,38.44
2018-06-26,38.6
2018-06-27,36.33
2018-06-28,35.78
2018-06-29,35.5
2018-07-02,35.47
2018-07-03,35.81
2018-07-05,34.58
2018-07-06,35.45
2018-07-09,35.25
2018-07-10,34.25
2018-07-11,33.81
2018-07-12,35.14
2018-07-13,34.02
2018-07-16,33.76
2018-07-17,34.05
2018-07-18,33.13
2018-07-19,32.08
2018-07-20,32.12
2018-07-23,31.62
2018-07-24,31.2
2018-07-25,32.6
2018-07-26,31.44
2018-07-27,30.53
2018-07-30,26.45
2018-07-31,25.2
2018-08-01,25.12
2018-08-02,25.09
2018-08-03,24.99
2018-08-06,24.22
2018-08-07,24.12
2018-08-08,23.63
2018-08-09,23.82
2018-08-10,22.69
2018-08-13,22.6
2018-08-14,22.66
2018-08-15,20.85
2018-08-16,21.84
2018-08-17,21.59
2018-08-20,22.05
2018-08-21,21.8
2018-08-22,22.06
2018-08-23,21.59
2018-08-24,21.59
2018-08-27,22.34
2018-08-28,21.97
2018-08-29,21.68
2018-08-30,20.83
2018-08-31,21.35
2018-09-04,20.36
2018-09-05,20.01
2018-09-06,19.82
2018-09-07,20.36
2018-09-10,20
2018-09-11,20.08
2018-09-12,20.6
2018-09-13,21.15
2018-09-14,20.86
2018-09-17,20.04
2018-09-18,19.61
2018-09-19,20.46
2018-09-20,20.72
2018-09-21,21.36
2018-09-24,21.27
2018-09-25,21.25
2018-09-26,21.47
2018-09-27,21.1
2018-09-28,19.88
2018-10-01,20.04
2018-10-02,18.4
2018-10-03,18.47
2018-10-04,17.23
2018-10-05,17.08
2018-10-08,17.13
2018-10-09,16.22
2018-10-10,16.96
2018-10-11,17.1
2018-10-12,18.72
2018-10-15,19.28
2018-10-16,17.89
2018-10-17,17.41
2018-10-18,16.89
2018-10-19,16.83
2018-10-22,17.81
2018-10-23,18.23
2018-10-24,17.7
2018-10-25,16.88
2018-10-26,17.08
2018-10-29,16.67
2018-10-30,16.34
2018-10-31,18.07
2018-11-01,19
2018-11-02,17.79
2018-11-05,19.01
2018-11-06,18.87
2018-11-07,19.05
2018-11-08,19.28
2018-11-09,18.67
2018-11-12,17.95
2018-11-13,18.77
2018-11-14,19.18
2018-11-15,19.93
2018-11-16,20.64
2018-11-19,20.57
2018-11-20,19.92
2018-11-21,21.1
2018-11-23,20.15
2018-11-26,20.67
2018-11-27,20.74
2018-11-28,20.94
2018-11-29,20.4
2018-11-30,20.85
2018-12-03,21.8
2018-12-04,21.31
2018-12-06,21.94
2018-12-07,22.27
2018-12-10,21.55
2018-12-11,21.72
2018-12-12,22.96
2018-12-13,22.26
2018-12-14,21.99
2018-12-17,20.48
2018-12-18,19.83
2018-12-19,18.65
2018-12-20,18.69
2018-12-21,17.46
2018-12-24,17.63
2018-12-26,18.17
2018-12-27,18.17
2018-12-28,18.17
2018-12-31,17.42
2019-01-02,17.85
2019-01-03,16.53
2019-01-04,17.69
2019-01-07,18.44
2019-01-08,18.81
2019-01-09,19.16
2019-01-10,18.97
2019-01-11,18.62
2019-01-14,18.19
2019-01-15,18.5
2019-01-16,19.1
2019-01-17,18.98
2019-01-18,19.54
2019-01-22,18.6
2019-01-23,18.37
2019-01-24,19.21
2019-01-25,19.89
2019-01-28,19.86
2019-01-29,20.6
2019-01-30,20.1
2019-01-31,20.7
2019-02-01,21.46
2019-02-04,22.34
2019-02-05,22.36
2019-02-06,22.48
2019-02-07,21.09
2019-02-08,21.42
2019-02-11,21.33
2019-02-12,21.41
2019-02-13,21.04
2019-02-14,20.59
2019-02-15,19.57
2019-02-19,19.97
2019-02-20,19.68
2019-02-21,19.62
2019-02-22,20.76
2019-02-25,20.93
2019-02-26,20.16
2019-02-27,20.42
2019-02-28,20.06
2019-03-01,19.86
2019-03-04,19.85
2019-03-05,20.62
2019-03-06,20.5
2019-03-07,18.64
2019-03-08,18.33
2019-03-11,19.13
2019-03-12,18.73
2019-03-13,18.35
2019-03-14,18.77
2019-03-15,19.38
2019-03-18,18.74
2019-03-19,18.62
2019-03-20,18
2019-03-21,17.5
2019-03-22,16.54
2019-03-25,17.14
2019-03-26,16.9
2019-03-27,16.52
2019-03-28,16.09
2019-03-29,16.58
2019-04-01,17.09
2019-04-02,16.96
2019-04-03,17.35
2019-04-04,16.95
2019-04-05,17.26
2019-04-08,17.16
2019-04-09,16.64
2019-04-10,16.49
2019-04-11,16.34
2019-04-12,16.47
2019-04-15,15.52
2019-04-16,15.11
2019-04-17,15.19
2019-04-18,15.31
2019-04-22,15.56
2019-04-23,15.73
2019-04-24,15.71
2019-04-25,15.27
2019-04-26,15.38
2019-04-29,18.48
2019-04-30,20.67
2019-05-01,20.12
2019-05-02,19.53
2019-05-03,20
2019-05-06,19.02
2019-05-07,18.3
2019-05-08,18.25
2019-05-09,18.93
2019-05-10,18.66
2019-05-13,18.31
2019-05-14,18.42
2019-05-15,18.42
2019-05-16,17.35
2019-05-17,15.89
2019-05-20,14.9
2019-05-21,14.59
2019-05-22,14.52
2019-05-23,14.11
2019-05-24,13.63
2019-05-28,13.55
2019-05-29,13.96
2019-05-30,14.27
2019-05-31,13.48
2019-06-03,13.74
2019-06-04,14.56
2019-06-05,13.7
2019-06-06,13.4
2019-06-07,13.81
2019-06-10,14.35
2019-06-11,14.26
2019-06-12,13.94
2019-06-13,14.33
2019-06-14,13.74
2019-06-17,14.23
2019-06-18,14.5
2019-06-19,14.1
2019-06-20,14.39
2019-06-21,14.205
2019-06-24,14.21
2019-06-25,13.665
2019-06-26,13.97
2019-06-27,14.04
2019-06-28,13.965
2019-07-01,14.4
2019-07-02,14.14
2019-07-03,13.88
2019-07-04,13.88
2019-07-05,13.7
2019-07-08,13.27
2019-07-09,13.465
2019-07-10,13.79
2019-07-11,13.85
2019-07-12,13.78
2019-07-15,13.835
2019-07-16,13.8
2019-07-17,13.535
2019-07-18,13.17
2019-07-19,12.91
2019-07-22,12.945
2019-07-23,13.195
2019-07-24,13.23
2019-07-25,13.03
2019-07-26,12.755
2019-07-29,12.69
2019-07-30,12.44
2019-07-31,12.225
2019-08-01,12.155
2019-08-02,12.245
2019-08-05,8.95
2019-08-06,8.825
2019-08-07,9.895
2019-08-08,10.095
2019-08-09,9.675
2019-08-12,9.515
2019-08-13,10.56
2019-08-14,10.25
2019-08-15,10.515
2019-08-16,10.99
2019-08-19,11.365
2019-08-20,11.27
2019-08-21,10.85
2019-08-22,10.825
2019-08-23,10.595
2019-08-26,10.275
2019-08-27,10.19
2019-08-28,10.37
2019-08-29,10.465
2019-08-30,10.96
2019-09-02,10.925
2019-09-03,10.61
2019-09-04,10.625
2019-09-05,10.87
2019-09-06,10.83
2019-09-09,11.565
2019-09-10,12.26
2019-09-11,12
2019-09-12,12.435
2019-09-13,12.935
2019-09-16,12.725
2019-09-17,12.48
2019-09-18,12.24
2019-09-19,12.035
2019-09-20,11.695
2019-09-23,10.995
2019-09-24,10.51
2019-09-25,10.705
2019-09-26,10.51
2019-09-27,10.135
2019-09-30,10.185
2019-10-01,10.005
2019-10-02,10.005
2019-10-03,10.8
2019-10-04,10.89
2019-10-07,10.905
2019-10-08,10.425
2019-10-09,10.48
2019-10-10,10.385
2019-10-11,10.645
2019-10-14,10.54
2019-10-15,10.56
2019-10-16,10.23
2019-10-17,10.19
2019-10-18,9.99
2019-10-21,9.93
2019-10-22,9.89
2019-10-23,9.64
2019-10-24,9.71
2019-10-25,9.95
2019-10-28,10.405
2019-10-29,10.38
2019-10-30,10.26
2019-10-31,10.29
2019-11-01,10.89
2019-11-04,11.35
2019-11-05,11.33
2019-11-06,11.64
2019-11-07,11.87
2019-11-08,11.815
2019-11-11,11.4
2019-11-12,11.29
2019-11-13,10.92
2019-11-14,10.255
2019-11-15,10.055
2019-11-18,9.84
2019-11-19,9.915
2019-11-20,9.885
2019-11-21,9.905
2019-11-22,10.13
2019-11-25,10.285
