date,close
2014-06-13,10.5999
2014-06-16,10.5284
2014-06-17,10.6476
2014-06-18,10.5284
2014-06-19,10.5284
2014-06-20,9.7338
2014-06-23,9.9325
2014-06-24,9.9404
2014-06-25,10.0278
2014-06-26,10.0914
2014-06-27,10.0153
2014-06-30,10.496
2014-07-01,10.6242
2014-07-02,10.6002
2014-07-03,10.5281
2014-07-07,10.5521
2014-07-08,10.5922
2014-07-09,10.6162
2014-07-10,10.5521
2014-07-11,10.6731
2014-07-14,10.7801
2014-07-15,10.7591
2014-07-16,10.6675
2014-07-17,10.8886
2014-07-18,10.8229
2014-07-21,10.7764
2014-07-22,10.9207
2014-07-23,10.4559
2014-07-24,10.1435
2014-07-25,9.6707
2014-07-28,9.6227
2014-07-29,9.6227
2014-07-30,9.6387
2014-07-31,9.4704
2014-08-01,8.6532
2014-08-04,8.8134
2014-08-05,8.5811
2014-08-06,8.6211
2014-08-07,8.6612
2014-08-08,8.6933
2014-08-11,8.7413
2014-08-12,8.5731
2014-08-13,8.7333
2014-08-14,8.4609
2014-08-15,8.6852
2014-08-18,9.0698
2014-08-19,8.9416
2014-08-20,8.8936
2014-08-21,9.15
2014-08-22,9.5746
2014-08-25,9.3182
2014-08-26,9.2221
2014-08-27,9.5506
2014-08-28,9.4624
2014-08-29,9.2862
2014-09-02,9.4544
2014-09-03,9.4544
2014-09-04,9.3503
2014-09-05,9.3342
2014-09-08,9.3182
2014-09-09,9.2942
2014-09-10,9.3903
2014-09-11,9.3743
2014-09-12,9.3663
2014-09-15,9.3743
2014-09-16,9.2461
2014-09-17,9.0057
2014-09-18,9.182
2014-09-19,9.2541
2014-09-22,8.9977
2014-09-23,8.8936
2014-09-24,8.8375
2014-09-25,8.9577
2014-09-26,8.9657
2014-09-29,8.8969
2014-09-30,8.8969
2014-10-01,8.7432
2014-10-02,8.3712
2014-10-03,8.2094
2014-10-06,8.1286
2014-10-07,8.1852
2014-10-08,8.0477
2014-10-09,8.2175
2014-10-10,8.0072
2014-10-13,7.8455
2014-10-14,7.8697
2014-10-15,7.6712
2014-10-16,7.6999
2014-10-17,7.9668
2014-10-20,7.9183
2014-10-21,8.0881
2014-10-22,8.4925
2014-10-23,8.5087
2014-10-24,8.4844
2014-10-27,8.4197
2014-10-28,8.3793
2014-10-29,8.4682
2014-10-30,8.4116
2014-10-31,8.3793
2014-11-03,8.5249
2014-11-04,8.4925
2014-11-05,8.5734
2014-11-06,8.6057
2014-11-07,8.5637
2014-11-10,8.6219
2014-11-11,8.5168
2014-11-12,8.5006
2014-11-13,8.2499
2014-11-14,8.2094
2014-11-17,8.3388
2014-11-18,8.2337
2014-11-19,8.3793
2014-11-20,8.355
2014-11-21,8.816
2014-11-24,8.905
2014-11-25,9.1962
2014-11-26,9.0991
2014-11-28,8.9697
2014-12-01,8.6947
2014-12-02,8.6866
2014-12-03,8.664
2014-12-04,8.9535
2014-12-05,8.9859
2014-12-08,8.8969
2014-12-09,9.0991
2014-12-10,9.0668
2014-12-11,9.0587
2014-12-12,9.2204
2014-12-15,8.905
2014-12-16,8.9131
2014-12-17,8.9374
2014-12-18,8.9778
2014-12-19,9.2124
2014-12-22,8.8807
2014-12-23,8.8646
2014-12-24,8.7432
2014-12-26,8.7837
2014-12-29,8.816
2014-12-30,8.5675
2014-12-31,8.5103
2015-01-02,8.7882
2015-01-05,8.7065
2015-01-06,8.543
2015-01-07,8.8291
2015-01-08,8.7801
2015-01-09,8.8373
2015-01-12,8.87
2015-01-13,8.8291
2015-01-14,8.6695
2015-01-15,8.8128
2015-01-16,8.8128
2015-01-20,8.87
2015-01-21,8.682
2015-01-22,8.7964
2015-01-23,8.682
2015-01-26,8.9027
2015-01-27,8.7474
2015-01-28,8.7801
2015-01-29,8.87
2015-01-30,8.7147
2015-02-02,8.7801
2015-02-03,8.6738
2015-02-04,8.7474
2015-02-05,8.7801
2015-02-06,8.7474
2015-02-09,8.7392
2015-02-10,8.682
2015-02-11,8.682
2015-02-12,9.1479
2015-02-13,9.2788
2015-02-17,8.9763
2015-02-18,8.9763
2015-02-19,9.1725
2015-02-20,9.2052
2015-02-23,9.2215
2015-02-24,9.2379
2015-02-25,9.1152
2015-02-26,9.1561
2015-02-27,9.1643
2015-03-02,9.2052
2015-03-03,9.2706
2015-03-04,9.2624
2015-03-05,9.1071
2015-03-06,9.058
2015-03-09,9.009
2015-03-10,8.8782
2015-03-11,8.9109
2015-03-12,8.731
2015-03-13,9.1643
2015-03-16,8.8209
2015-03-17,8.9926
2015-03-18,8.9517
2015-03-19,8.9763
2015-03-20,8.9681
2015-03-23,9.2379
2015-03-24,9.2788
2015-03-25,9.6058
2015-03-26,9.1152
2015-03-27,9.2951
2015-03-30,9.4818
2015-03-31,9.6965
2015-04-01,9.6882
2015-04-02,9.8121
2015-04-06,9.7461
2015-04-07,9.713
2015-04-08,9.6139
2015-04-09,9.5148
2015-04-10,9.5561
2015-04-13,9.5478
2015-04-14,9.5891
2015-04-15,9.5891
2015-04-16,9.7378
2015-04-17,9.9112
2015-04-20,9.8287
2015-04-21,9.9938
2015-04-22,9.9278
2015-04-23,9.9856
2015-04-24,10.0764
2015-04-27,10.0269
2015-04-28,10.0434
2015-04-29,9.9112
2015-04-30,9.8204
2015-05-01,9.7791
2015-05-04,9.8204
2015-05-05,9.7874
2015-05-06,9.6552
2015-05-07,9.5065
2015-05-08,9.3744
2015-05-11,9.5726
2015-05-12,9.267
2015-05-13,9.1514
2015-05-14,9.3331
2015-05-15,9.2835
2015-05-18,9.3331
2015-05-19,9.0853
2015-05-20,8.9696
2015-05-21,8.9697
2015-05-22,9.077
2015-05-26,8.9697
2015-05-27,9.0853
2015-05-28,9.0688
2015-05-29,9.0605
2015-06-01,9.0688
2015-06-02,9.0605
2015-06-03,9.2588
2015-06-04,9.1183
2015-06-05,9.0936
2015-06-08,8.9614
2015-06-09,9.1514
2015-06-10,9.2092
2015-06-11,9.3166
2015-06-12,9.457
2015-06-15,9.7791
2015-06-16,9.6635
2015-06-17,9.5809
2015-06-18,9.5809
2015-06-19,9.9112
2015-06-22,9.827
2015-06-23,9.5396
2015-06-24,9.6717
2015-06-25,9.6965
2015-06-26,9.903
2015-06-29,10.0178
2015-06-30,9.9343
2015-07-01,10.0178
2015-07-02,10.0178
2015-07-06,10.0178
2015-07-07,10.0595
2015-07-08,9.9677
2015-07-09,10.0178
2015-07-10,10.0178
2015-07-13,10.2265
2015-07-14,10.3267
2015-07-15,9.3499
2015-07-16,9.2247
2015-07-17,9.183
2015-07-20,9.183
2015-07-21,9.183
2015-07-22,9.1997
2015-07-23,9.208
2015-07-24,8.9075
2015-07-27,8.7739
2015-07-28,9.1329
2015-07-29,9.016
2015-07-30,9.0995
2015-07-31,9.183
2015-08-03,9.0661
2015-08-04,9.183
2015-08-05,9.0995
2015-08-06,9.0327
2015-08-07,8.9409
2015-08-10,8.991
2015-08-11,9.0076
2015-08-12,9.041
2015-08-13,9.0243
2015-08-14,9.1663
2015-08-17,9.0744
2015-08-18,8.991
2015-08-19,9.016
2015-08-20,8.9325
2015-08-21,8.6988
2015-08-24,8.3481
2015-08-25,8.2229
2015-08-26,8.4316
2015-08-27,8.6236
2015-08-28,8.6988
2015-08-31,8.824
2015-09-01,8.7572
2015-09-02,8.6654
2015-09-03,8.8073
2015-09-04,8.6988
2015-09-08,8.7656
2015-09-09,8.632
2015-09-10,8.4817
2015-09-11,8.5068
2015-09-14,8.4734
2015-09-15,8.4567
2015-09-16,8.4066
2015-09-17,8.3565
2015-09-18,8.4734
2015-09-21,8.465
2015-09-22,8.4316
2015-09-23,8.6236
2015-09-24,8.4818
2015-09-25,8.4984
2015-09-28,8.3899
2015-09-29,8.447
2015-09-30,8.8782
2015-10-01,8.7006
2015-10-02,8.8359
2015-10-05,8.7598
2015-10-06,8.8275
2015-10-07,8.7852
2015-10-08,8.912
2015-10-09,8.912
2015-10-12,8.9458
2015-10-13,8.8782
2015-10-14,8.7852
2015-10-15,9.0896
2015-10-16,9.3432
2015-10-19,9.301
2015-10-20,9.1572
2015-10-21,9.0727
2015-10-22,9.0473
2015-10-23,9.005
2015-10-26,8.9881
2015-10-27,8.8275
2015-10-28,8.7767
2015-10-29,8.6668
2015-10-30,8.6753
2015-11-02,8.7175
2015-11-03,8.6245
2015-11-04,8.6499
2015-11-05,8.5484
2015-11-06,8.6837
2015-11-09,8.5231
2015-11-10,8.9458
2015-11-11,9.2841
2015-11-12,9.2333
2015-11-13,9.1741
2015-11-16,9.0706
2015-11-17,9.1319
2015-11-18,9.2333
2015-11-19,9.3348
2015-11-20,9.4193
2015-11-23,9.487
2015-11-24,9.3601
2015-11-25,9.4278
2015-11-27,9.3094
2015-11-30,9.6307
2015-12-01,9.487
2015-12-02,9.487
2015-12-03,9.4278
2015-12-04,9.5462
2015-12-07,9.5969
2015-12-08,9.5123
2015-12-09,9.4447
2015-12-10,9.2925
2015-12-11,9.0558
2015-12-14,8.9627
2015-12-15,9.208
2015-12-16,9.4109
2015-12-17,9.3601
2015-12-18,9.2925
2015-12-21,9.2671
2015-12-22,9.2671
2015-12-23,9.2418
2015-12-24,9.2671
2015-12-28,9.4447
2015-12-29,9.3601
2015-12-30,9.2126
2015-12-31,9.3837
2016-01-04,9.2212
2016-01-05,9.4521
2016-01-06,9.4008
2016-01-07,9.2126
2016-01-08,9.1099
2016-01-11,9.2383
2016-01-12,9.0159
2016-01-13,9.1185
2016-01-14,9.2554
2016-01-15,8.9902
2016-01-19,8.9132
2016-01-20,8.8533
2016-01-21,8.8875
2016-01-22,8.725
2016-01-25,8.6053
2016-01-26,8.8277
2016-01-27,8.7935
2016-01-28,8.8619
2016-01-29,8.9474
2016-02-01,8.9902
2016-02-02,8.6053
2016-02-03,8.5796
2016-02-04,9.1014
2016-02-05,9.0928
2016-02-08,9.0159
2016-02-09,8.9645
2016-02-10,8.8619
2016-02-11,8.8106
2016-02-12,8.7678
2016-02-16,8.8277
2016-02-17,8.9389
2016-02-18,8.9902
2016-02-19,8.9902
2016-02-22,8.9816
2016-02-23,9.0244
2016-02-24,8.9988
2016-02-25,9.1356
2016-02-26,9.3495
2016-02-29,9.3751
2016-03-01,9.4093
2016-03-02,9.4521
2016-03-03,9.2981
2016-03-04,9.1869
2016-03-07,9.2297
2016-03-08,9.2896
2016-03-09,9.2468
2016-03-10,9.1955
2016-03-11,9.1784
2016-03-14,9.1784
2016-03-15,9.1442
2016-03-16,9.1698
2016-03-17,9.1527
2016-03-18,9.1784
2016-03-21,9.1784
2016-03-22,9.204
2016-03-23,9.1784
2016-03-24,9.1869
2016-03-28,9.2297
2016-03-29,9.1869
2016-03-30,9.2973
2016-03-31,9.2887
2016-04-01,9.306
2016-04-04,9.3925
2016-04-05,9.3839
2016-04-06,9.3666
2016-04-07,9.2973
2016-04-08,9.306
2016-04-11,9.306
2016-04-12,9.3579
2016-04-13,9.4099
2016-04-14,9.3233
2016-04-15,9.3146
2016-04-18,9.2281
2016-04-19,9.3752
2016-04-20,9.2973
2016-04-21,9.2627
2016-04-22,9.3579
2016-04-25,9.4185
2016-04-26,9.4878
2016-04-27,9.28
2016-04-28,9.2627
2016-04-29,9.3406
2016-05-02,9.4445
2016-05-03,9.4618
2016-05-04,9.6003
2016-05-05,9.5224
2016-05-06,9.6955
2016-05-09,9.8946
2016-05-10,9.6696
2016-05-11,9.7128
2016-05-12,9.7994
2016-05-13,9.86
2016-05-16,9.8513
2016-05-17,9.6955
2016-05-18,9.7128
2016-05-19,9.6696
2016-05-20,9.6176
2016-05-23,9.6869
2016-05-24,9.6869
2016-05-25,9.6263
2016-05-26,9.6176
2016-05-27,9.609
2016-05-31,9.6696
2016-06-01,9.7648
2016-06-02,9.7648
2016-06-03,9.7561
2016-06-06,9.5916
2016-06-07,9.6349
2016-06-08,9.6522
2016-06-09,9.6176
2016-06-10,9.5916
2016-06-13,9.3146
2016-06-14,9.2973
2016-06-15,9.531
2016-06-16,9.5743
2016-06-17,9.6522
2016-06-20,9.583
2016-06-21,9.6349
2016-06-22,9.6955
2016-06-23,9.6349
2016-06-24,9.4618
2016-06-27,9.4185
2016-06-28,9.7301
2016-06-29,9.7367
2016-06-30,9.9118
2016-07-01,10.0169
2016-07-05,10.0169
2016-07-06,10.1307
2016-07-07,10.0694
2016-07-08,10.1132
2016-07-11,10.2095
2016-07-12,10.157
2016-07-13,10.0782
2016-07-14,10.0432
2016-07-15,10.0957
2016-07-18,10.2708
2016-07-19,10.2708
2016-07-20,10.3234
2016-07-21,10.2708
2016-07-22,10.2095
2016-07-25,10.2883
2016-07-26,10.122
2016-07-27,10.2271
2016-07-28,10.2621
2016-07-29,10.3146
2016-08-01,10.3146
2016-08-02,10.2796
2016-08-03,10.4547
2016-08-04,10.3234
2016-08-05,10.2708
2016-08-08,10.0782
2016-08-09,10.192
2016-08-10,10.0782
2016-08-11,9.9031
2016-08-12,9.763
2016-08-15,9.8681
2016-08-16,9.9644
2016-08-17,9.9206
2016-08-18,9.9031
2016-08-19,9.7542
2016-08-22,10.0257
2016-08-23,10.2008
2016-08-24,9.9994
2016-08-25,9.9381
2016-08-26,9.6842
2016-08-29,10.1307
2016-08-30,10.2358
2016-08-31,10.2008
2016-09-01,10.1833
2016-09-02,10.2008
2016-09-06,10.157
2016-09-07,10.0519
2016-09-08,9.9644
2016-09-09,9.7192
2016-09-12,9.1238
2016-09-13,9.439
2016-09-14,9.5003
2016-09-15,9.4653
2016-09-16,9.5091
2016-09-19,9.5353
2016-09-20,9.5441
2016-09-21,9.5966
2016-09-22,9.8068
2016-09-23,9.7892
2016-09-26,9.9556
2016-09-27,10.0519
2016-09-28,10.0054
2016-09-29,9.9346
2016-09-30,9.9169
2016-10-03,9.9346
2016-10-04,9.669
2016-10-05,9.6778
2016-10-06,9.6247
2016-10-07,9.3768
2016-10-10,9.3591
2016-10-11,9.2882
2016-10-12,9.2971
2016-10-13,9.2971
2016-10-14,9.2351
2016-10-17,9.2882
2016-10-18,9.3414
2016-10-19,9.3945
2016-10-20,9.4565
2016-10-21,9.5096
2016-10-24,9.5539
2016-10-25,9.6247
2016-10-26,9.5185
2016-10-27,9.3679
2016-10-28,9.3856
2016-10-31,9.4211
2016-11-01,9.1466
2016-11-02,8.9695
2016-11-03,8.9252
2016-11-04,9.12
2016-11-07,9.182
2016-11-08,9.1023
2016-11-09,9.0403
2016-11-10,9.2351
2016-11-11,9.4299
2016-11-14,9.6513
2016-11-15,9.9346
2016-11-16,9.9966
2016-11-17,10.3331
2016-11-18,10.4924
2016-11-21,10.3153
2016-11-22,10.3596
2016-11-23,10.3596
2016-11-25,10.4747
2016-11-28,10.3685
2016-11-29,10.4836
2016-11-30,9.8372
2016-12-01,9.8461
2016-12-02,9.7929
2016-12-05,9.9169
2016-12-06,9.9169
2016-12-07,9.9435
2016-12-08,9.9789
2016-12-09,9.9346
2016-12-12,9.8992
2016-12-13,9.9258
2016-12-14,9.4742
2016-12-15,9.3059
2016-12-16,9.5007
2016-12-19,9.6247
2016-12-20,9.7664
2016-12-21,9.6955
2016-12-22,9.7575
2016-12-23,9.9346
2016-12-27,9.8992
2016-12-28,10.094
2016-12-29,9.9955
2016-12-30,9.9955
2017-01-03,9.9507
2017-01-04,10.1029
2017-01-05,9.9149
2017-01-06,9.8343
2017-01-09,9.8343
2017-01-10,9.7716
2017-01-11,9.879
2017-01-12,9.8163
2017-01-13,9.8074
2017-01-17,9.673
2017-01-18,9.5476
2017-01-19,9.5656
2017-01-20,9.673
2017-01-23,9.7357
2017-01-24,9.7536
2017-01-25,9.8074
2017-01-26,10.0134
2017-01-27,10.2104
2017-01-30,10.1656
2017-01-31,10.1746
2017-02-01,10.2194
2017-02-02,10.1656
2017-02-03,10.1925
2017-02-06,9.9865
2017-02-07,9.8343
2017-02-08,9.879
2017-02-09,10.0761
2017-02-10,10.1925
2017-02-13,10.2283
2017-02-14,10.0582
2017-02-15,9.8611
2017-02-16,9.7447
2017-02-17,9.7357
2017-02-21,9.7895
2017-02-22,9.673
2017-02-23,10.2373
2017-02-24,10.2194
2017-02-27,10.1656
2017-02-28,10.2283
2017-03-01,10.1656
2017-03-02,10.0671
2017-03-03,9.8432
2017-03-06,9.7357
2017-03-07,9.7626
2017-03-08,9.673
2017-03-09,9.5029
2017-03-10,9.5029
2017-03-13,9.4402
2017-03-14,9.3775
2017-03-15,9.5387
2017-03-16,9.5387
2017-03-17,9.6014
2017-03-20,9.7178
2017-03-21,9.6551
2017-03-22,9.6014
2017-03-23,9.7895
2017-03-24,9.7268
2017-03-27,9.7357
2017-03-28,9.7626
2017-03-29,9.9144
2017-03-30,9.9053
2017-03-31,10.1228
2017-04-03,9.9235
2017-04-04,9.9506
2017-04-05,9.8328
2017-04-06,9.8419
2017-04-07,9.9597
2017-04-10,9.9235
2017-04-11,10.0231
2017-04-12,9.996
2017-04-13,10.0322
2017-04-17,9.996
2017-04-18,10.0594
2017-04-19,10.0322
2017-04-20,10.0413
2017-04-21,10.0141
2017-04-24,9.9869
2017-04-25,10.0141
2017-04-26,10.0231
2017-04-27,9.9597
2017-04-28,9.8781
2017-05-01,9.8328
2017-05-02,9.7875
2017-05-03,9.7422
2017-05-04,9.6788
2017-05-05,9.7331
2017-05-08,9.7875
2017-05-09,9.5972
2017-05-10,9.5247
2017-05-11,9.28
2017-05-12,9.271
2017-05-15,9.0897
2017-05-16,9.0444
2017-05-17,8.7181
2017-05-18,8.7544
2017-05-19,8.8178
2017-05-22,8.7635
2017-05-23,8.7997
2017-05-24,9.0081
2017-05-25,9.0535
2017-05-26,9.0081
2017-05-30,8.9266
2017-05-31,8.8178
2017-06-01,8.9991
2017-06-02,8.9719
2017-06-05,8.9356
2017-06-06,8.5278
2017-06-07,8.6275
2017-06-08,8.7181
2017-06-09,8.8088
2017-06-12,8.7635
2017-06-13,8.6275
2017-06-14,8.3375
2017-06-15,8.2106
2017-06-16,8.2469
2017-06-19,8.2922
2017-06-20,8.1744
2017-06-21,8.0385
2017-06-22,8.1381
2017-06-23,8.3738
2017-06-26,8.3375
2017-06-27,8.1653
2017-06-28,8.1538
2017-06-29,8.163
2017-06-30,8.2182
2017-07-03,8.3377
2017-07-05,8.1263
2017-07-06,8.0987
2017-07-07,8.0435
2017-07-10,7.9332
2017-07-11,8.0251
2017-07-12,8.0711
2017-07-13,8.0343
2017-07-14,8.2182
2017-07-17,8.2366
2017-07-18,7.9424
2017-07-19,7.9976
2017-07-20,8.4756
2017-07-21,8.7605
2017-07-24,8.3285
2017-07-25,8.5491
2017-07-26,8.3653
2017-07-27,8.2917
2017-07-28,8.3009
2017-07-31,8.209
2017-08-01,8.1538
2017-08-02,8.0987
2017-08-03,8.0803
2017-08-04,8.163
2017-08-07,8.1355
2017-08-08,8.0711
2017-08-09,8.0343
2017-08-10,8.0711
2017-08-11,8.0803
2017-08-14,8.209
2017-08-15,7.9424
2017-08-16,7.9332
2017-08-17,7.7034
2017-08-18,7.5655
2017-08-21,7.6299
2017-08-22,7.7126
2017-08-23,7.8689
2017-08-24,7.8964
2017-08-25,7.9332
2017-08-28,8.1446
2017-08-29,8.1538
2017-08-30,8.1998
2017-08-31,8.1446
2017-09-01,8.2274
2017-09-05,8.1814
2017-09-06,8.3193
2017-09-07,8.3745
2017-09-08,8.2917
2017-09-11,8.2182
2017-09-12,8.2917
2017-09-13,8.3193
2017-09-14,8.3009
2017-09-15,8.3285
2017-09-18,8.1814
2017-09-19,7.9608
2017-09-20,7.9424
2017-09-21,7.8229
2017-09-22,8.0251
2017-09-25,8.1814
2017-09-26,8.2641
2017-09-27,8.3285
2017-09-28,8.3009
2017-09-29,8.4291
2017-10-02,8.5597
2017-10-03,8.6343
2017-10-04,8.597
2017-10-05,8.597
2017-10-06,8.4851
2017-10-09,8.4012
2017-10-10,8.4291
2017-10-11,8.4851
2017-10-12,8.5597
2017-10-13,8.4851
2017-10-16,8.3732
2017-10-17,8.4012
2017-10-18,8.4851
2017-10-19,8.4571
2017-10-20,8.4664
2017-10-23,8.4944
2017-10-24,8.4851
2017-10-25,8.2053
2017-10-26,7.9629
2017-10-27,7.9349
2017-10-30,7.7485
2017-10-31,7.7858
2017-11-01,7.851
2017-11-02,8.0002
2017-11-03,7.9722
2017-11-06,8.0562
2017-11-07,8.0189
2017-11-08,8.0189
2017-11-09,8.3452
2017-11-10,8.3918
2017-11-13,8.4105
2017-11-14,8.3359
2017-11-15,8.4571
2017-11-16,8.513
2017-11-17,8.4012
2017-11-20,8.4944
2017-11-21,8.597
2017-11-22,8.569
2017-11-24,8.6156
2017-11-27,8.5037
2017-11-28,8.5317
2017-11-29,8.4571
2017-11-30,8.3452
2017-12-01,8.3918
2017-12-04,8.4571
2017-12-05,8.3266
2017-12-06,8.2613
2017-12-07,8.2426
2017-12-08,8.2706
2017-12-11,8.3825
2017-12-12,8.4851
2017-12-13,8.4571
2017-12-14,8.513
2017-12-15,8.8767
2017-12-18,8.6995
2017-12-19,8.4851
2017-12-20,8.4105
2017-12-21,8.2986
2017-12-22,8.2893
2017-12-26,8.3172
2017-12-27,8.224
2017-12-28,8.2333
2017-12-29,8.212
2018-01-02,8.2688
2018-01-03,8.2688
2018-01-04,8.2688
2018-01-05,8.1647
2018-01-08,8.3161
2018-01-09,8.212
2018-01-10,8.1836
2018-01-11,8.2593
2018-01-12,8.2026
2018-01-16,8.1174
2018-01-17,8.0039
2018-01-18,7.9282
2018-01-19,7.8904
2018-01-22,7.9471
2018-01-23,8.0607
2018-01-24,7.9471
2018-01-25,7.9187
2018-01-26,7.8147
2018-01-29,7.7674
2018-01-30,7.6633
2018-01-31,7.7106
2018-02-01,7.616
2018-02-02,7.5782
2018-02-05,7.2376
2018-02-06,7.02
2018-02-07,7.0105
2018-02-08,6.9159
2018-02-09,7.1808
2018-02-12,7.0389
2018-02-13,6.9254
2018-02-14,6.8402
2018-02-15,6.9254
2018-02-16,7.0578
2018-02-20,6.9821
2018-02-21,6.897
2018-02-22,6.9632
2018-02-23,7.1051
2018-02-26,7.1713
2018-02-27,7.2565
2018-02-28,7.1146
2018-03-01,7.2943
2018-03-02,7.5498
2018-03-05,7.3322
2018-03-06,7.6444
2018-03-07,7.8147
2018-03-08,7.8241
2018-03-09,8.1458
2018-03-12,8.1174
2018-03-13,7.8904
2018-03-14,7.9661
2018-03-15,7.985
2018-03-16,7.985
2018-03-19,8.0701
2018-03-20,7.9471
2018-03-21,7.862
2018-03-22,7.9755
2018-03-23,7.8052
2018-03-26,7.8336
2018-03-27,7.9093
2018-03-28,8.089
2018-03-29,8.0194
2018-04-02,7.7121
2018-04-03,7.8273
2018-04-04,7.933
2018-04-05,7.9426
2018-04-06,7.8946
2018-04-09,7.8946
2018-04-10,7.8561
2018-04-11,7.8273
2018-04-12,7.7217
2018-04-13,7.7217
2018-04-16,7.6737
2018-04-17,7.7409
2018-04-18,7.7985
2018-04-19,7.7793
2018-04-20,7.5392
2018-04-23,7.3855
2018-04-24,7.2319
2018-04-25,7.4528
2018-04-26,7.3183
2018-04-27,7.2511
2018-04-30,7.3183
2018-05-01,7.2415
2018-05-02,7.2223
2018-05-03,7.107
2018-05-04,7.107
2018-05-07,7.2895
2018-05-08,7.3375
2018-05-09,7.3375
2018-05-10,7.7217
2018-05-11,7.7985
2018-05-14,7.4047
2018-05-15,7.5104
2018-05-16,7.5488
2018-05-17,7.7697
2018-05-18,7.885
2018-05-21,7.9906
2018-05-22,8.0386
2018-05-23,7.9426
2018-05-24,8.0674
2018-05-25,8.077
2018-05-29,8.2019
2018-05-30,8.1635
2018-05-31,8.1731
2018-06-01,8.2019
2018-06-04,8.1731
2018-06-05,8.2979
2018-06-06,8.3363
2018-06-07,8.3652
2018-06-08,8.3556
2018-06-11,8.3748
2018-06-12,8.5861
2018-06-13,8.5284
2018-06-14,8.6341
2018-06-15,8.5957
2018-06-18,8.6437
2018-06-19,8.6629
2018-06-20,8.7589
2018-06-21,8.7109
2018-06-22,8.7205
2018-06-25,8.6629
2018-06-26,8.7973
2018-06-27,8.7493
2018-06-28,8.6245
2018-06-29,8.5733
2018-07-02,8.4467
2018-07-03,8.5831
2018-07-05,8.6707
2018-07-06,8.6415
2018-07-09,8.5051
2018-07-10,8.4272
2018-07-11,5.144
2018-07-12,6.0793
2018-07-13,6.0793
2018-07-16,5.9429
2018-07-17,6.0793
2018-07-18,6.391
2018-07-19,6.4397
2018-07-20,6.3326
2018-07-23,6.4008
2018-07-24,6.2839
2018-07-25,6.3715
2018-07-26,6.6054
2018-07-27,6.3618
2018-07-30,6.4495
2018-07-31,6.5664
2018-08-01,6.4982
2018-08-02,6.5372
2018-08-03,6.5469
2018-08-06,6.469
2018-08-07,6.6346
2018-08-08,6.4592
2018-08-09,6.2546
2018-08-10,6.4495
2018-08-13,6.3813
2018-08-14,6.3715
2018-08-15,6.7612
2018-08-16,6.7905
2018-08-17,6.8489
2018-08-20,6.6151
2018-08-21,6.5761
2018-08-22,6.5664
2018-08-23,6.4982
2018-08-24,6.5956
2018-08-27,6.7417
2018-08-28,6.8294
2018-08-29,6.8587
2018-08-30,6.8099
2018-08-31,6.8781
2018-09-04,6.732
2018-09-05,6.6151
2018-09-06,6.5566
2018-09-07,6.4982
2018-09-10,6.391
2018-09-11,6.43
2018-09-12,6.7905
2018-09-13,6.5664
2018-09-14,6.391
2018-09-17,6.7028
2018-09-18,6.5761
2018-09-19,6.6248
2018-09-20,6.5079
2018-09-21,6.4202
2018-09-24,6.5664
2018-09-25,6.5372
2018-09-26,6.4982
2018-09-27,6.5274
2018-09-28,6.5765
2018-10-01,6.498
2018-10-02,6.655
2018-10-03,6.7335
2018-10-04,6.7728
2018-10-05,6.8513
2018-10-08,6.3311
2018-10-09,6.2133
2018-10-10,5.9385
2018-10-11,5.9777
2018-10-12,5.9483
2018-10-15,6.1544
2018-10-16,6.2133
2018-10-17,6.3507
2018-10-18,6.6256
2018-10-19,6.6845
2018-10-22,6.6943
2018-10-23,6.6845
2018-10-24,6.6943
2018-10-25,6.9887
2018-10-26,6.7532
2018-10-29,6.763
2018-10-30,6.8415
2018-10-31,6.7237
2018-11-01,6.7924
2018-11-02,6.871
2018-11-05,6.6746
2018-11-06,6.92
2018-11-07,7.4599
2018-11-08,7.5973
2018-11-09,7.3421
2018-11-12,7.3323
2018-11-13,7.1654
2018-11-14,6.7728
2018-11-15,6.547
2018-11-16,6.4882
2018-11-19,6.5372
2018-11-20,6.1053
2018-11-21,6.0072
2018-11-23,6.1053
2018-11-26,6.017
2018-11-27,6.017
2018-11-28,6.1839
2018-11-29,6.2428
2018-11-30,6.0857
2018-12-03,5.9188
2018-12-04,5.8109
2018-12-06,5.8501
2018-12-07,5.6636
2018-12-10,5.6047
2018-12-11,5.487
2018-12-12,5.4281
2018-12-13,5.2514
2018-12-14,5.114
2018-12-17,5.0256
2018-12-18,4.9962
2018-12-19,5.0551
2018-12-20,4.7508
2018-12-21,4.6919
2018-12-24,4.4956
2018-12-26,4.7606
2018-12-27,4.4858
2018-12-28,4.4659
2018-12-31,4.5056
2019-01-02,5.0514
2019-01-03,5.5476
2019-01-04,5.6568
2019-01-07,5.9843
2019-01-08,5.8553
2019-01-09,5.8255
2019-01-10,5.9446
2019-01-11,5.8851
2019-01-14,5.9347
2019-01-15,5.9049
2019-01-16,5.895
2019-01-17,5.9645
2019-01-18,5.7263
2019-01-22,5.4186
2019-01-23,5.3591
2019-01-24,5.4385
2019-01-25,5.5278
2019-01-28,5.4286
2019-01-29,5.4087
2019-01-30,5.4385
2019-01-31,5.5675
2019-02-01,5.4683
2019-02-04,5.5476
2019-02-05,5.5179
2019-02-06,5.5476
2019-02-07,5.508
2019-02-08,5.4782
2019-02-11,5.5576
2019-02-12,5.5873
2019-02-13,5.4881
2019-02-14,5.4683
2019-02-15,5.5774
2019-02-19,5.6072
2019-02-20,5.508
2019-02-21,5.4186
2019-02-22,5.3293
2019-02-25,5.2499
2019-02-26,5.3095
2019-02-27,5.2202
2019-02-28,5.1011
2019-03-01,5.0614
2019-03-04,5.1011
2019-03-05,5.1904
2019-03-06,5.2301
2019-03-07,5.1011
2019-03-08,5.1408
2019-03-11,5.2202
2019-03-12,5.2598
2019-03-13,5.3392
2019-03-14,5.9744
2019-03-15,6.1332
2019-03-18,6.024
2019-03-19,6.3515
2019-03-20,6.3912
2019-03-21,6.1828
2019-03-22,5.9446
2019-03-25,6.0042
2019-03-26,6.3317
2019-03-27,6.421
2019-03-28,6.55
2019-03-29,6.4
2019-04-01,6.62
2019-04-02,6.5
2019-04-03,6.44
2019-04-04,6.48
2019-04-05,6.6
2019-04-08,6.5
2019-04-09,6.39
2019-04-10,6.58
2019-04-11,6.63
2019-04-12,6.66
2019-04-15,6.54
2019-04-16,6.55
2019-04-17,6.54
2019-04-18,6.58
2019-04-22,6.56
2019-04-23,6.72
2019-04-24,6.69
2019-04-25,6.28
2019-04-26,6.42
2019-04-29,6.49
2019-04-30,6.56
2019-05-01,6.47
2019-05-02,6.43
2019-05-03,6.61
2019-05-06,6.61
2019-05-07,6.55
2019-05-08,6.35
2019-05-09,6.47
2019-05-10,6.48
2019-05-13,6.51
2019-05-14,6.53
2019-05-15,6.33
2019-05-16,6.28
2019-05-17,6.09
2019-05-20,6.04
2019-05-21,6.23
2019-05-22,6.07
2019-05-23,5.96
2019-05-24,6.07
2019-05-28,6.29
2019-05-29,6.15
2019-05-30,6.19
2019-05-31,6.19
2019-06-03,6.15
2019-06-04,6.34
2019-06-05,6.32
2019-06-06,6.42
2019-06-07,6.36
2019-06-10,6.49
2019-06-11,6.49
2019-06-12,6.35
2019-06-13,6.44
2019-06-14,6.5
2019-06-17,6.63
2019-06-18,6.73
2019-06-19,6.74
2019-06-20,6.82
2019-06-21,6.815
2019-06-24,6.77
2019-06-25,6.715
2019-06-26,6.86
2019-06-27,7.065
2019-06-28,7.09
2019-07-01,6.93
2019-07-02,6.925
2019-07-03,6.915
2019-07-04,6.915
2019-07-05,6.73
2019-07-08,6.66
2019-07-09,6.625
2019-07-10,6.565
2019-07-11,6.49
2019-07-12,6.57
2019-07-15,6.43
2019-07-16,6.47
2019-07-17,6.48
2019-07-18,6.37
2019-07-19,6.245
2019-07-22,6.195
2019-07-23,6.155
2019-07-24,6.245
2019-07-25,6.03
2019-07-26,6.055
2019-07-29,6.06
2019-07-30,6.065
2019-07-31,6.23
2019-08-01,6.07
2019-08-02,6
2019-08-05,5.95
2019-08-06,5.745
2019-08-07,6.27
2019-08-08,6.36
2019-08-09,6.43
2019-08-12,6.47
2019-08-13,6.45
2019-08-14,6.295
2019-08-15,6.245
2019-08-16,6.42
2019-08-19,6.38
2019-08-20,6.47
2019-08-21,6.45
2019-08-22,6.42
2019-08-23,6.24
2019-08-26,6.37
2019-08-27,6.2
2019-08-28,6.23
2019-08-29,6.24
2019-08-30,6.035
2019-09-02,6.035
2019-09-03,6.28
2019-09-04,6.51
2019-09-05,6.525
2019-09-06,6.46
2019-09-09,6.615
2019-09-10,6.89
2019-09-11,7
2019-09-12,7.01
2019-09-13,6.91
2019-09-16,6.875
2019-09-17,6.7
2019-09-18,6.545
2019-09-19,6.535
2019-09-20,6.605
2019-09-23,6.365
2019-09-24,6.26
2019-09-25,6.425
2019-09-26,6.435
2019-09-27,6.44
2019-09-30,6.685
2019-10-01,6.48
2019-10-02,6.545
2019-10-03,6.4
2019-10-04,6.4
2019-10-07,6.305
2019-10-08,6.34
2019-10-09,6.34
2019-10-10,6.305
2019-10-11,6.52
2019-10-14,6.64
2019-10-15,6.67
2019-10-16,6.64
2019-10-17,6.675
2019-10-18,6.69
2019-10-21,6.905
2019-10-22,6.805
2019-10-23,6.685
2019-10-24,6.485
2019-10-25,6.61
2019-10-28,6.61
2019-10-29,6.735
2019-10-30,6.65
2019-10-31,6.705
2019-11-01,6.91
2019-11-04,6.725
2019-11-05,6.55
2019-11-06,6.485
2019-11-07,6.71
2019-11-08,6.73
2019-11-11,6.66
2019-11-12,6.585
2019-11-13,6.8
2019-11-14,6.59
2019-11-15,6.67
2019-11-18,6.39
2019-11-19,6.325
2019-11-20,6.38
2019-11-21,6.25
2019-11-22,6.34
2019-11-25,6.53
