date,close
2013-12-09,63.3277
2013-12-10,63.6215
2013-12-11,62.8349
2013-12-12,61.7355
2013-12-13,61.6218
2013-12-16,62.181
2013-12-17,62.3137
2013-12-18,63.5647
2013-12-19,63.1477
2013-12-20,63.4794
2013-12-23,63.9438
2013-12-24,63.849
2013-12-26,64.7399
2013-12-27,64.7872
2013-12-30,64.5882
2013-12-31,65.0052
2014-01-02,64.0291
2014-01-03,64.3039
2014-01-06,63.9911
2014-01-07,64.8631
2014-01-08,65.5265
2014-01-09,67.9716
2014-01-10,67.621
2014-01-13,67.3272
2014-01-14,67.9594
2014-01-15,67.8833
2014-01-16,66.771
2014-01-17,66.7044
2014-01-21,66.7995
2014-01-22,67.1323
2014-01-23,66.5238
2014-01-24,65.535
2014-01-27,65.3639
2014-01-28,65.535
2014-01-29,64.7079
2014-01-30,65.4589
2014-01-31,64.9646
2014-02-03,63.7571
2014-02-04,63.9473
2014-02-05,64.9075
2014-02-06,64.5747
2014-02-07,63.4719
2014-02-10,62.4451
2014-02-11,62.7778
2014-02-12,61.9412
2014-02-13,62.5116
2014-02-14,65.7822
2014-02-18,65.7061
2014-02-19,65.6776
2014-02-20,66.4477
2014-02-21,66.9611
2014-02-24,68.2636
2014-02-25,67.6362
2014-02-26,67.9024
2014-02-27,67.9594
2014-02-28,69.1288
2014-03-03,68.701
2014-03-04,70.0225
2014-03-05,70.1176
2014-03-06,69.9655
2014-03-07,70.0796
2014-03-10,70.3743
2014-03-11,70.0225
2014-03-12,69.7373
2014-03-13,69.319
2014-03-14,67.9879
2014-03-17,69.395
2014-03-18,70.1081
2014-03-19,71.0874
2014-03-20,71.6768
2014-03-21,71.9811
2014-03-24,70.6785
2014-03-25,70.2982
2014-03-26,70.574
2014-03-27,69.7944
2014-03-28,70.4504
2014-03-31,71.2775
2014-04-01,71.3536
2014-04-02,71.1254
2014-04-03,71.306
2014-04-04,70.574
2014-04-07,69.3095
2014-04-08,69.4859
2014-04-09,70.5731
2014-04-10,68.5417
2014-04-11,67.5403
2014-04-14,67.4927
2014-04-15,68.3128
2014-04-16,66.6343
2014-04-17,64.6316
2014-04-21,64.746
2014-04-22,65.5281
2014-04-23,65.7188
2014-04-24,69.5812
2014-04-25,67.9504
2014-04-28,67.1112
2014-04-29,67.197
2014-04-30,68.1412
2014-05-01,68.1316
2014-05-02,68.1793
2014-05-05,68.9423
2014-05-06,68.742
2014-05-07,70.6208
2014-05-08,70.287
2014-05-09,71.0213
2014-05-12,72.2611
2014-05-13,71.8224
2014-05-14,71.8987
2014-05-15,71.2693
2014-05-16,70.9164
2014-05-19,71.9178
2014-05-20,71.727
2014-05-21,72.099
2014-05-22,72.0036
2014-05-23,72.8524
2014-05-27,73.8156
2014-05-28,73.148
2014-05-29,73.6154
2014-05-30,73.9587
2014-06-02,74.2543
2014-06-03,74.8647
2014-06-04,75.7135
2014-06-05,75.456
2014-06-06,75.7898
2014-06-09,75.5037
2014-06-10,76.5527
2014-06-11,77.2298
2014-06-12,77.1249
2014-06-13,77.1917
2014-06-16,76.8388
2014-06-17,76.8388
2014-06-18,77.2298
2014-06-19,77.6399
2014-06-20,78.1263
2014-06-23,78.2598
2014-06-24,77.2394
2014-06-25,78.6413
2014-06-26,78.2503
2014-06-27,77.9833
2014-06-30,77.3252
2014-07-01,78.2598
2014-07-02,79.08
2014-07-03,79.7571
2014-07-07,78.6318
2014-07-08,77.5272
2014-07-09,77.642
2014-07-10,77.6994
2014-07-11,78.0436
2014-07-14,78.5696
2014-07-15,78.78
2014-07-16,78.5696
2014-07-17,80.0806
2014-07-18,80.9412
2014-07-21,80.3196
2014-07-22,81.1612
2014-07-23,80.8456
2014-07-24,80.4822
2014-07-25,79.7459
2014-07-28,76.2554
2014-07-29,78.3018
2014-07-30,76.2554
2014-07-31,74.1419
2014-08-01,75.2895
2014-08-04,76.1215
2014-08-05,75.0313
2014-08-06,74.8974
2014-08-07,71.9329
2014-08-08,73.3865
2014-08-11,72.5162
2014-08-12,72.1337
2014-08-13,73.6925
2014-08-14,74.2471
2014-08-15,74.3236
2014-08-18,74.6297
2014-08-19,75.6625
2014-08-20,76.0354
2014-08-21,75.8824
2014-08-22,75.3278
2014-08-25,75.4999
2014-08-26,76.5996
2014-08-27,77.5655
2014-08-28,78.3401
2014-08-29,78.5409
2014-09-02,78.3497
2014-09-03,78.8278
2014-09-04,79.3442
2014-09-05,80.2718
2014-09-08,80.2814
2014-09-09,81.2281
2014-09-10,80.7213
2014-09-11,80.0327
2014-09-12,78.6079
2014-09-15,78.5314
2014-09-16,79.7076
2014-09-17,79.5163
2014-09-18,80.2431
2014-09-19,80.0327
2014-09-22,79.4207
2014-09-23,78.5314
2014-09-24,80.0901
2014-09-25,78.474
2014-09-26,78.4453
2014-09-29,77.7854
2014-09-30,77.4603
2014-10-01,76.3319
2014-10-02,75.9207
2014-10-03,77.9289
2014-10-06,75.7103
2014-10-07,74.601
2014-10-08,76.5327
2014-10-09,75.1843
2014-10-10,74.2663
2014-10-13,73.09
2014-10-14,70.956
2014-10-15,70.5627
2014-10-16,70.4285
2014-10-17,72.3083
2014-10-20,73.325
2014-10-21,75.1857
2014-10-22,74.898
2014-10-23,75.531
2014-10-24,75.4734
2014-10-27,75.9434
2014-10-28,74.0731
2014-10-29,76.4901
2014-10-30,77.3054
2014-10-31,79.1373
2014-11-03,78.8879
2014-11-04,80.2882
2014-11-05,80.8158
2014-11-06,81.2378
2014-11-07,78.9263
2014-11-10,80.5856
2014-11-11,81.046
2014-11-12,81.0651
2014-11-13,81.1035
2014-11-14,80.3842
2014-11-17,82.6956
2014-11-18,83.5972
2014-11-19,82.053
2014-11-20,82.3408
2014-11-21,82.8299
2014-11-24,83.3862
2014-11-25,83.0697
2014-11-26,83.3574
2014-11-28,83.6739
2014-12-01,83.9617
2014-12-02,84.729
2014-12-03,86.0142
2014-12-04,85.5442
2014-12-05,86.9158
2014-12-08,85.8991
2014-12-09,85.8991
2014-12-10,84.0864
2014-12-11,84.518
2014-12-12,83.7315
2014-12-15,83.1272
2014-12-16,82.1394
2014-12-17,83.6164
2014-12-18,86.4458
2014-12-19,87.1268
2014-12-22,86.7144
2014-12-23,85.7936
2014-12-24,85.9279
2014-12-26,86.1677
2014-12-29,86.0813
2014-12-30,86.4554
2014-12-31,85.199
2015-01-02,85.1702
2015-01-05,84.0192
2015-01-06,84.1439
2015-01-07,85.832
2015-01-08,88.6134
2015-01-09,87.3186
2015-01-12,85.8607
2015-01-13,86.8803
2015-01-14,86.4571
2015-01-15,87.0438
2015-01-16,89.0251
2015-01-20,88.4673
2015-01-21,91.1219
2015-01-22,92.4396
2015-01-23,90.8718
2015-01-26,90.641
2015-01-27,90.1216
2015-01-28,89.1502
2015-01-29,90.035
2015-01-30,88.3134
2015-02-02,88.6981
2015-02-03,90.5833
2015-02-04,92.3819
2015-02-05,92.9012
2015-02-06,90.9295
2015-02-09,90.1601
2015-02-10,92.0933
2015-02-11,92.7762
2015-02-12,93.3725
2015-02-13,92.4492
2015-02-17,92.9301
2015-02-18,93.1898
2015-02-19,92.9493
2015-02-20,94.1804
2015-02-23,96.835
2015-02-24,96.3445
2015-02-25,95.7193
2015-02-26,95.5174
2015-02-27,95.7482
2015-03-02,96.6619
2015-03-03,95.979
2015-03-04,97.8642
2015-03-05,98.1912
2015-03-06,96.8254
2015-03-09,97.6526
2015-03-10,96.3349
2015-03-11,96.2195
2015-03-12,98.22
2015-03-13,100.1148
2015-03-16,102.0192
2015-03-17,101.3748
2015-03-18,103.3753
2015-03-19,104.1736
2015-03-20,104.4814
2015-03-23,105.0874
2015-03-24,104.5872
2015-03-25,103.1926
2015-03-26,101.8653
2015-03-27,103.2984
2015-03-30,104.4237
2015-03-31,102.4616
2015-04-01,102.7886
2015-04-02,103.0579
2015-04-06,103.712
2015-04-07,102.9503
2015-04-08,103.5962
2015-04-09,103.8469
2015-04-10,104.0301
2015-04-13,103.818
2015-04-14,104.0011
2015-04-15,102.2659
2015-04-16,105.4954
2015-04-17,103.8469
2015-04-20,103.3938
2015-04-21,104.4639
2015-04-22,104.0686
2015-04-23,104.9845
2015-04-24,104.9073
2015-04-27,103.0757
2015-04-28,106.4112
2015-04-29,104.1265
2015-04-30,103.0275
2015-05-01,104.5699
2015-05-04,105.264
2015-05-05,103.3456
2015-05-06,103.5095
2015-05-07,104.0108
2015-05-08,105.3315
2015-05-11,105.3701
2015-05-12,106.122
2015-05-13,105.8425
2015-05-14,107.4717
2015-05-15,108.6864
2015-05-18,109.6408
2015-05-19,109.9879
2015-05-20,110.2867
2015-05-21,110.5663
2015-05-22,110.4024
2015-05-26,109.7854
2015-05-27,111.0676
2015-05-28,112.2052
2015-05-29,113.7284
2015-06-01,115.319
2015-06-02,113.1114
2015-06-03,112.745
2015-06-04,111.8099
2015-06-05,112.6583
2015-06-08,111.8292
2015-06-09,113.0246
2015-06-10,113.6994
2015-06-11,113.7091
2015-06-12,111.7039
2015-06-15,116.659
2015-06-16,120.4767
2015-06-17,119.4066
2015-06-18,120.0236
2015-06-19,119.609
2015-06-22,123.4459
2015-06-23,123.5905
2015-06-24,122.9253
2015-06-25,127.8323
2015-06-26,125.374
2015-06-29,122.7036
2015-06-30,122.8771
2015-07-01,124.2654
2015-07-02,120.9972
2015-07-06,113.2078
2015-07-07,111.1833
2015-07-08,108.6189
2015-07-09,108.6189
2015-07-10,110.4795
2015-07-13,109.9204
2015-07-14,111.8334
2015-07-15,111.5726
2015-07-16,109.0895
2015-07-17,109.0992
2015-07-20,107.8238
2015-07-21,107.7755
2015-07-22,110.0267
2015-07-23,108.2586
2015-07-24,106.278
2015-07-27,106.5002
2015-07-28,108.5098
2015-07-29,108.79
2015-07-30,110.2876
2015-07-31,109.1475
2015-08-03,109.9397
2015-08-04,111.2924
2015-08-05,114.0749
2015-08-06,112.4614
2015-08-07,112.4518
2015-08-10,113.1281
2015-08-11,114.3454
2015-08-12,113.331
2015-08-13,114.2488
2015-08-14,116.5773
2015-08-17,118.8768
2015-08-18,120.0072
2015-08-19,118.0459
2015-08-20,114.5194
2015-08-21,111.6015
2015-08-24,106.7707
2015-08-25,106.7611
2015-08-26,111.5146
2015-08-27,113.7947
2015-08-28,112.9059
2015-08-31,110.645
2015-09-01,107.7755
2015-09-02,109.7175
2015-09-03,111.2827
2015-09-04,109.6306
2015-09-08,114.1425
2015-09-09,113.2633
2015-09-10,112.2585
2015-09-11,113.901
2015-09-14,112.4518
2015-09-15,113.5918
2015-09-16,113.6015
2015-09-17,113.7754
2015-09-18,112.2199
2015-09-21,114.7995
2015-09-22,114.1232
2015-09-23,114.7995
2015-09-24,112.5001
2015-09-25,108.2296
2015-09-28,101.737
2015-09-29,102.7128
2015-09-30,105.7079
2015-10-01,106.22
2015-10-02,109.2827
2015-10-05,109.2151
2015-10-06,105.1476
2015-10-07,105.8529
2015-10-08,105.9012
2015-10-09,105.4857
2015-10-12,106.8867
2015-10-13,109.6852
2015-10-14,107.5936
2015-10-15,108.62
2015-10-16,109.4141
2015-10-19,110.5858
2015-10-20,108.2811
2015-10-21,104.8531
2015-10-22,100.0889
2015-10-23,102.5388
2015-10-26,104.3883
2015-10-27,107.1675
2015-10-28,107.5936
2015-10-29,111.2249
2015-10-30,111.1474
2015-11-02,111.6897
2015-11-03,108.2714
2015-11-04,105.2211
2015-11-05,107.7485
2015-11-06,104.1463
2015-11-09,104.582
2015-11-10,105.2986
2015-11-11,101.7641
2015-11-12,99.8468
2015-11-13,98.9753
2015-11-16,101.6866
2015-11-17,101.9481
2015-11-18,103.4781
2015-11-19,96.7287
2015-11-20,101.125
2015-11-23,102.3645
2015-11-24,102.7228
2015-11-25,100.6602
2015-11-27,100.7667
2015-11-30,99.4982
2015-12-01,104.0978
2015-12-02,103.5459
2015-12-03,98.5008
2015-12-04,101.9868
2015-12-07,100.3406
2015-12-08,100.6408
2015-12-09,100.5827
2015-12-10,101.5026
2015-12-11,101.5898
2015-12-14,102.4516
2015-12-15,103.633
2015-12-16,105.318
2015-12-17,105.4148
2015-12-18,105.0371
2015-12-21,106.2476
2015-12-22,105.4632
2015-12-23,106.5913
2015-12-24,106.1604
2015-12-28,105.5019
2015-12-29,106.7221
2015-12-30,105.4826
2015-12-31,104.6982
2016-01-04,105.8021
2016-01-05,107.274
2016-01-06,106.7317
2016-01-07,106.7802
2016-01-08,103.6814
2016-01-11,101.9868
2016-01-12,105.9471
2016-01-13,101.8024
2016-01-14,105.0735
2016-01-15,101.9577
2016-01-19,101.7636
2016-01-20,100.9871
2016-01-21,102.1713
2016-01-22,104.4232
2016-01-25,102.3363
2016-01-26,101.8995
2016-01-27,98.706
2016-01-28,95.8911
2016-01-29,98.8516
2016-02-01,100.3367
2016-02-02,98.8905
2016-02-03,98.2207
2016-02-04,99.1137
2016-02-05,96.3085
2016-02-08,91.5426
2016-02-09,94.3478
2016-02-10,96.8133
2016-02-11,94.9496
2016-02-12,96.3862
2016-02-16,99.1817
2016-02-17,102.3654
2016-02-18,101.3171
2016-02-19,100.4144
2016-02-22,103.4331
2016-02-23,104.1805
2016-02-24,103.5205
2016-02-25,106.1898
2016-02-26,106.6945
2016-02-29,105.4424
2016-03-01,107.2963
2016-03-02,106.9178
2016-03-03,106.4228
2016-03-04,104.8891
2016-03-07,106.481
2016-03-08,103.8505
2016-03-09,106.0151
2016-03-10,107.6167
2016-03-11,110.1404
2016-03-14,110.8198
2016-03-15,109.558
2016-03-16,110.0336
2016-03-17,107.306
2016-03-18,109.3056
2016-03-21,108.1408
2016-03-22,109.2182
2016-03-23,108.4708
2016-03-24,109.1115
2016-03-28,108.8106
2016-03-29,109.9656
2016-03-30,110.8392
2016-03-31,109.0532
2016-04-01,110.3733
2016-04-04,111.1693
2016-04-05,107.8593
2016-04-06,108.8203
2016-04-07,107.044
2016-04-08,105.6753
2016-04-11,105.0832
2016-04-12,106.3285
2016-04-13,107.5447
2016-04-14,106.7177
2016-04-15,106.8344
2016-04-18,107.4766
2016-04-19,108.4495
2016-04-20,110.1423
2016-04-21,110.0256
2016-04-22,111.7087
2016-04-25,111.2028
2016-04-26,112.6329
2016-04-27,110.7163
2016-04-28,111.5238
2016-04-29,109.2278
2016-05-02,110.765
2016-05-03,110.979
2016-05-04,109.9964
2016-05-05,110.7844
2016-05-06,109.7629
2016-05-09,110.8428
2016-05-10,111.3584
2016-05-11,109.2181
2016-05-12,105.6572
2016-05-13,104.9762
2016-05-16,107.5057
2016-05-17,107.2139
2016-05-18,107.603
2016-05-19,106.7469
2016-05-20,107.642
2016-05-23,107.1069
2016-05-24,108.6051
2016-05-25,110.6093
2016-05-26,110.0061
2016-05-27,110.1812
2016-05-31,110.1618
2016-06-01,112.166
2016-06-02,116.7775
2016-06-03,116.7872
2016-06-06,118.9763
2016-06-07,118.305
2016-06-08,119.3946
2016-06-09,117.9839
2016-06-10,117.2542
2016-06-13,115.9505
2016-06-14,116.3202
2016-06-15,116.6705
2016-06-16,118.3439
2016-06-17,117.8185
2016-06-20,119.0249
2016-06-21,117.8088
2016-06-22,116.904
2016-06-23,117.7212
2016-06-24,114.4717
2016-06-27,112.4286
2016-06-28,115.6684
2016-06-29,117.8963
2016-06-30,118.8206
2016-07-01,116.6997
2016-07-05,116.4565
2016-07-06,116.9818
2016-07-07,112.3411
2016-07-08,113.8296
2016-07-11,113.2848
2016-07-12,112.612
2016-07-13,116.2
2016-07-14,116.1708
2016-07-15,115.6638
2016-07-18,115.4005
2016-07-19,112.2708
2016-07-20,113.5773
2016-07-21,115.342
2016-07-22,117.448
2016-07-25,114.8935
2016-07-26,114.3183
2016-07-27,113.0118
2016-07-28,112.8948
2016-07-29,112.3293
2016-08-01,111.5883
2016-08-02,112.8168
2016-08-03,113.938
2016-08-04,113.6943
2016-08-05,116.3073
2016-08-08,115.3615
2016-08-09,116.551
2016-08-10,116.551
2016-08-11,116.2098
2016-08-12,116.59
2016-08-15,116.1903
2016-08-16,115.9563
2016-08-17,117.5358
2016-08-18,118.0135
2016-08-19,117.0775
2016-08-22,117.1458
2016-08-23,116.7753
2016-08-24,115.7418
2016-08-25,114.5815
2016-08-26,114.2988
2016-08-29,114.094
2016-08-30,113.9478
2016-08-31,114.1915
2016-09-01,113.2555
2016-09-02,113.8113
2016-09-06,113.4603
2016-09-07,113.5578
2016-09-08,113.626
2016-09-09,112.6608
2016-09-12,113.314
2016-09-13,111.1398
2016-09-14,109.9893
2016-09-15,111.5688
2016-09-16,112.183
2016-09-19,111.9588
2016-09-20,111.7638
2016-09-21,113.7723
2016-09-22,114.0063
2016-09-23,112.7388
2016-09-26,112.0563
2016-09-27,112.846
2016-09-28,113.353
2016-09-29,112.1538
2016-09-30,112.5633
2016-10-03,111.8515
2016-10-04,111.9003
2016-10-05,112.105
2016-10-06,111.1398
2016-10-07,110.8765
2016-10-10,111.8418
2016-10-11,109.5064
2016-10-12,107.8453
2016-10-13,107.2688
2016-10-14,107.132
2016-10-17,106.0083
2016-10-18,108.8811
2016-10-19,108.5195
2016-10-20,108.3925
2016-10-21,108.7052
2016-10-24,109.4576
2016-10-25,109.0863
2016-10-26,108.4707
2016-10-27,108.2948
2016-10-28,104.9335
2016-10-31,104.8944
2016-11-01,103.3994
2016-11-02,103.2821
2016-11-03,102.7936
2016-11-04,103.673
2016-11-07,107.2297
2016-11-08,110.1904
2016-11-09,115.3203
2016-11-10,117.1573
2016-11-11,116.5515
2016-11-14,121.144
2016-11-15,120.7629
2016-11-16,120.4795
2016-11-17,123.3132
2016-11-18,122.0234
2016-11-21,123.9581
2016-11-22,125.4824
2016-11-23,126.3716
2016-11-25,126.6061
2016-11-28,125.4531
2016-11-29,129.0098
2016-11-30,127.8471
2016-12-01,131.8142
2016-12-02,130.4364
2016-12-05,126.4889
2016-12-06,125.5997
2016-12-07,125.7072
2016-12-08,126.3423
2016-12-09,125.9612
2016-12-12,125.3358
2016-12-13,125.072
2016-12-14,123.7627
2016-12-15,122.551
2016-12-16,123.9092
2016-12-19,121.2612
2016-12-20,121.7791
2016-12-21,120.5284
2016-12-22,121.8377
2016-12-23,123.0689
2016-12-27,123.3425
2016-12-28,121.7303
2016-12-29,121.6032
2016-12-30,121.1733
2017-01-03,120.0301
2017-01-04,121.144
2017-01-05,121.6619
2017-01-06,121.4176
2017-01-09,120.3623
2017-01-10,120.1078
2017-01-11,120.0686
2017-01-12,120.0784
2017-01-13,119.7553
2017-01-17,118.5118
2017-01-18,118.4433
2017-01-19,120.0001
2017-01-20,119.9707
2017-01-23,116.7102
2017-01-24,115.1535
2017-01-25,116.6515
2017-01-26,115.1828
2017-01-27,114.9968
2017-01-30,114.2722
2017-01-31,116.1326
2017-02-01,119.0699
2017-02-02,117.9341
2017-02-03,120.0001
2017-02-06,118.267
2017-02-07,118.1495
2017-02-08,118.7958
2017-02-09,118.6783
2017-02-10,119.1482
2017-02-13,119.5007
2017-02-14,123.1822
2017-02-15,125.7572
2017-02-16,126.7853
2017-02-17,122.6535
2017-02-21,123.7011
2017-02-22,126.0999
2017-02-23,127.0203
2017-02-24,126.2762
2017-02-27,126.7559
2017-02-28,126.0706
2017-03-01,127.3238
2017-03-02,126.8049
2017-03-03,127.9602
2017-03-06,128.5575
2017-03-07,127.8623
2017-03-08,128.9589
2017-03-09,130.036
2017-03-10,130.0262
2017-03-13,129.8499
2017-03-14,129.2037
2017-03-15,131.3088
2017-03-16,130.2807
2017-03-17,129.0471
2017-03-20,127.6274
2017-03-21,126.3937
2017-03-22,125.6495
2017-03-23,125.16
2017-03-24,124.1221
2017-03-27,123.6228
2017-03-28,124.3571
2017-03-29,123.1038
2017-03-30,124.2592
2017-03-31,124.8858
2017-04-03,126.051
2017-04-04,125.1796
2017-04-05,124.6215
2017-04-06,126.1489
2017-04-07,125.6789
2017-04-10,126.5993
2017-04-11,127.307
2017-04-12,126.8745
2017-04-13,126.4322
2017-04-17,127.1006
2017-04-18,126.3437
2017-04-19,127.0514
2017-04-20,129.6758
2017-04-21,128.9386
2017-04-24,130.3344
2017-04-25,131.5433
2017-04-26,131.7006
2017-04-27,131.6908
2017-04-28,132.7622
2017-05-01,134.4429
2017-05-02,136.5365
2017-05-03,136.5759
2017-05-04,137.6964
2017-05-05,138.3648
2017-05-08,139.1413
2017-05-09,139.9669
2017-05-10,140.596
2017-05-11,141.9229
2017-05-12,140.4584
2017-05-15,139.7802
2017-05-16,139.4361
2017-05-17,136.684
2017-05-18,137.834
2017-05-19,138.9447
2017-05-22,138.5908
2017-05-23,139.4656
2017-05-24,141.4806
2017-05-25,142.7486
2017-05-26,143.0827
2017-05-30,143.0631
2017-05-31,142.3849
2017-06-01,145.1272
2017-06-02,145.2058
2017-06-05,145.4712
2017-06-06,145.4712
2017-06-07,147.0242
2017-06-08,146.7588
2017-06-09,147.2306
2017-06-12,145.3238
2017-06-13,146.2281
2017-06-14,147.5648
2017-06-15,146.749
2017-06-16,148.017
2017-06-19,149.1375
2017-06-20,149.0097
2017-06-21,149.5012
2017-06-22,150.3661
2017-06-23,149.5012
2017-06-26,148.6067
2017-06-27,148.6067
2017-06-28,149.3439
2017-06-29,149.1866
2017-06-30,149.2358
2017-07-03,149.796
2017-07-05,150.7102
2017-07-06,149.7272
2017-07-07,151.2508
2017-07-10,151.408
2017-07-11,151.9011
2017-07-12,152.4533
2017-07-13,152.8872
2017-07-14,153.114
2017-07-17,152.8478
2017-07-18,151.1812
2017-07-19,152.0983
2017-07-20,153.5676
2017-07-21,154.1396
2017-07-24,153.9128
2017-07-25,154.0804
2017-07-26,153.5282
2017-07-27,151.763
2017-07-28,153.1337
2017-07-31,152.1673
2017-08-01,154.7312
2017-08-02,152.5914
2017-08-03,156.3386
2017-08-04,154.6129
2017-08-07,154.8101
2017-08-08,154.1001
2017-08-09,153.4197
2017-08-10,150.3036
2017-08-11,150.0373
2017-08-14,153.5085
2017-08-15,153.5972
2017-08-16,153.7353
2017-08-17,153.6465
2017-08-18,152.3054
2017-08-21,152.5914
2017-08-22,154.4847
2017-08-23,154.4157
2017-08-24,153.9818
2017-08-25,153.9325
2017-08-28,154.3565
2017-08-29,154.2481
2017-08-30,154.7214
2017-08-31,155.5103
2017-09-01,155.9935
2017-09-05,156.0625
2017-09-06,156.5556
2017-09-07,158.0249
2017-09-08,160.569
2017-09-11,160.9438
2017-09-12,160.569
2017-09-13,160.0464
2017-09-14,160.5197
2017-09-15,160.4211
2017-09-18,158.7645
2017-09-19,153.8733
2017-09-20,152.8774
2017-09-21,151.2601
2017-09-22,151.4376
2017-09-25,149.8697
2017-09-26,151.3292
2017-09-27,152.0687
2017-09-28,155.1158
2017-09-29,156.8021
2017-10-02,158.2122
2017-10-03,160.7465
2017-10-04,160.9438
2017-10-05,159.0504
2017-10-06,159.0406
2017-10-09,156.0329
2017-10-10,153.9325
2017-10-11,154.625
2017-10-12,152.8344
2017-10-13,151.4197
2017-10-16,149.8171
2017-10-17,154.2293
2017-10-18,155.7429
2017-10-19,155.9506
2017-10-20,159.1163
2017-10-23,159.7396
2017-10-24,158.3645
2017-10-25,158.4337
2017-10-26,176.686
2017-10-27,171.2647
2017-10-30,169.395
2017-10-31,168.2078
2017-11-01,169.9589
2017-11-02,170.4733
2017-11-03,175.0933
2017-11-06,175.0537
2017-11-07,174.935
2017-11-08,173.5599
2017-11-09,170.681
2017-11-10,173.2433
2017-11-13,171.1658
2017-11-14,169.9886
2017-11-15,169.1674
2017-11-16,172.8871
2017-11-17,171.3439
2017-11-20,173.0652
2017-11-21,174.559
2017-11-22,174.3513
2017-11-24,174.5689
2017-11-27,174.2029
2017-11-28,176.9234
2017-11-29,177.6456
2017-11-30,178.2491
2017-12-01,179.367
2017-12-04,176.7849
2017-12-05,176.775
2017-12-06,176.9828
2017-12-07,176.9135
2017-12-08,180.7717
2017-12-11,179.6242
2017-12-12,179.3867
2017-12-13,177.1905
2017-12-14,176.5772
2017-12-15,177.7742
2017-12-18,175.4395
2017-12-19,176.8839
2017-12-20,177.6258
2017-12-21,178.7932
2017-12-22,178.0314
2017-12-26,178.4865
2017-12-27,178.9119
2017-12-28,179.2878
2017-12-29,178.4568
2018-01-02,178.7536
2018-01-03,179.8517
2018-01-04,181.4049
2018-01-05,183.8187
2018-01-08,182.6712
2018-01-09,181.6324
2018-01-10,182.0093
2018-01-11,182.7335
2018-01-12,182.7235
2018-01-16,183.16
2018-01-17,183.6163
2018-01-18,184.0032
2018-01-19,186.2947
2018-01-22,187.8223
2018-01-23,187.7926
2018-01-24,188.6159
2018-01-25,190.3321
2018-01-26,191.5522
2018-01-29,192.1871
2018-01-30,186.384
2018-01-31,185.3225
2018-02-01,185.888
2018-02-02,183.5171
2018-02-05,179.4996
2018-02-06,180.5511
2018-02-07,180.0353
2018-02-08,176.5732
2018-02-09,174.9761
2018-02-12,175.9582
2018-02-13,177.0891
2018-02-14,175.3531
2018-02-15,175.7499
2018-02-16,177.0791
2018-02-20,176.603
2018-02-21,174.3611
2018-02-22,173.6568
2018-02-23,174.1429
2018-02-26,174.3413
2018-02-27,174.8571
2018-02-28,175.6408
2018-03-01,175.0357
2018-03-02,176.107
2018-03-05,177.0295
2018-03-06,176.8014
2018-03-07,177.2081
2018-03-08,174.8373
2018-03-09,175.9582
2018-03-12,175.6507
2018-03-13,176.0177
2018-03-14,175.2043
2018-03-15,173.1906
2018-03-16,172.516
2018-03-19,170.6808
2018-03-20,170.2543
2018-03-21,168.6473
2018-03-22,168.0918
2018-03-23,166.7625
2018-03-26,169.3813
2018-03-27,167.0105
2018-03-28,168.0719
2018-03-29,167.6454
2018-04-02,166.7625
2018-04-03,167.4073
2018-04-04,169.0242
2018-04-05,169.3417
2018-04-06,169.0143
2018-04-09,170.1452
2018-04-10,172.4763
2018-04-11,170.3872
2018-04-12,172.3869
2018-04-13,172.0387
2018-04-16,174.9834
2018-04-17,176.3762
2018-04-18,176.6149
2018-04-19,175.5206
2018-04-20,176.0081
2018-04-23,176.1872
2018-04-24,176.2867
2018-04-25,178.0674
2018-04-26,177.8983
2018-04-27,178.9528
2018-04-30,178.1271
2018-05-01,177.7889
2018-05-02,175.839
2018-05-03,171.2428
2018-05-04,171.3721
2018-05-07,170.5165
2018-05-08,169.9495
2018-05-09,169.6908
2018-05-10,169.7107
2018-05-11,173.7697
2018-05-14,176.9035
2018-05-15,176.1872
2018-05-16,176.5553
2018-05-17,176.1175
2018-05-18,175.8987
2018-05-21,176.804
2018-05-22,176.2966
2018-05-23,176.4259
2018-05-24,176.2071
2018-05-25,177.6197
2018-05-29,175.8688
2018-05-30,176.9532
2018-05-31,175.2222
2018-06-01,175.6897
2018-06-04,175.3913
2018-06-05,174.7446
2018-06-06,178.0873
2018-06-07,178.8136
2018-06-08,179.878
2018-06-11,181.1216
2018-06-12,179.7487
2018-06-13,186.454
2018-06-14,187.1205
2018-06-15,188.5233
2018-06-18,185.9864
2018-06-19,188.3044
2018-06-20,189.2495
2018-06-21,188.1751
2018-06-22,189.9359
2018-06-25,188.6028
2018-06-26,187.1106
2018-06-27,187.8468
2018-06-28,184.4046
2018-06-29,182.5542
2018-07-02,184.7229
2018-07-03,184.2454
2018-07-05,184.0365
2018-07-06,185.2502
2018-07-09,186.5435
2018-07-10,187.2896
2018-07-11,186.5933
2018-07-12,190.0951
2018-07-13,190.9009
2018-07-16,190.4632
2018-07-17,190.5527
2018-07-18,190.3438
2018-07-19,189.0605
2018-07-20,186.255
2018-07-23,187.3593
2018-07-24,187.09
2018-07-25,188.6461
2018-07-26,188.676
2018-07-27,189.1348
2018-07-30,189.1847
2018-07-31,187.9179
2018-08-01,186.3219
2018-08-02,186.5813
2018-08-03,188.257
2018-08-06,188.1373
2018-08-07,187.7184
2018-08-08,193.1448
2018-08-09,193.2944
2018-08-10,194.0325
2018-08-13,194.2221
2018-08-14,196.4564
2018-08-15,196.7956
2018-08-16,197.9726
2018-08-17,198.3617
2018-08-20,199.02
2018-08-21,197.8529
2018-08-22,197.2744
2018-08-23,196.2071
2018-08-24,196.7756
2018-08-27,197.4041
2018-08-28,198.3617
2018-08-29,198.7706
2018-08-30,199.0699
2018-08-31,199.7681
2018-09-04,198.8006
2018-09-05,201.424
2018-09-06,202.1122
2018-09-07,202.5711
2018-09-10,200.5462
2018-09-11,201.6833
2018-09-12,202.9202
2018-09-13,202.5212
2018-09-14,202.2419
2018-09-17,204.2568
2018-09-18,204.9252
2018-09-19,205.1546
2018-09-20,204.6858
2018-09-21,203.7581
2018-09-24,202.8903
2018-09-25,201.1247
2018-09-26,201.2544
2018-09-27,202.1721
2018-09-28,202.3417
2018-10-01,203.0898
2018-10-02,202.6409
2018-10-03,203.0399
2018-10-04,203.788
2018-10-05,203.2095
2018-10-08,203.5985
2018-10-09,203.2095
2018-10-10,202.9003
2018-10-11,198.4514
2018-10-12,200.5063
2018-10-15,198.4415
2018-10-16,199.9876
2018-10-17,200.7856
2018-10-18,200.9851
2018-10-19,199.6883
2018-10-22,198.9901
2018-10-23,199.34
2018-10-24,195.27
2018-10-25,196.07
2018-10-26,195.29
2018-10-29,195.13
2018-10-30,197.65
2018-10-31,198.4
2018-11-01,200.14
2018-11-02,198.21
2018-11-05,199.33
2018-11-06,207.05
2018-11-07,208.84
2018-11-08,209.23
2018-11-09,209.36
2018-11-12,209.33
2018-11-13,209.52
2018-11-14,208.05
2018-11-15,209.36
2018-11-16,209.01
2018-11-19,207.49
2018-11-20,204
2018-11-21,204.3
2018-11-23,205.36
2018-11-26,210.1
2018-11-27,212
2018-11-28,212.7
