date,close
2014-06-13,38.2164
2014-06-16,38.2252
2014-06-17,38.2429
2014-06-18,38.6217
2014-06-19,38.701
2014-06-20,38.5424
2014-06-23,38.4014
2014-06-24,37.4148
2014-06-25,38.1485
2014-06-26,38.0497
2014-06-27,38.0137
2014-06-30,38.0137
2014-07-01,38.3281
2014-07-02,38.3191
2014-07-03,38.5706
2014-07-07,37.9598
2014-07-08,37.385
2014-07-09,37.5915
2014-07-10,36.9807
2014-07-11,36.9807
2014-07-14,37.2143
2014-07-15,36.8819
2014-07-16,37.2772
2014-07-17,36.5945
2014-07-18,36.9358
2014-07-21,36.6394
2014-07-22,36.846
2014-07-23,36.9628
2014-07-24,37.2772
2014-07-25,36.846
2014-07-28,36.7562
2014-07-29,36.7203
2014-07-30,36.6214
2014-07-31,35.7501
2014-08-01,35.6154
2014-08-04,35.6154
2014-08-05,36.2891
2014-08-06,34.9283
2014-08-07,34.3938
2014-08-08,34.9058
2014-08-11,34.9238
2014-08-12,34.789
2014-08-13,35.0046
2014-08-14,35.2022
2014-08-15,35.1034
2014-08-18,35.3998
2014-08-19,35.4447
2014-08-20,35.301
2014-08-21,35.6513
2014-08-22,35.3819
2014-08-25,35.813
2014-08-26,36.0735
2014-08-27,36.2172
2014-08-28,35.8669
2014-08-29,35.813
2014-09-02,35.9118
2014-09-03,36.2891
2014-09-04,36.2532
2014-09-05,36.4598
2014-09-08,36.0466
2014-09-09,35.9657
2014-09-10,36.0017
2014-09-11,35.831
2014-09-12,35.7951
2014-09-15,35.7591
2014-09-16,35.849
2014-09-17,35.7861
2014-09-18,36.0556
2014-09-19,35.84
2014-09-22,35.6963
2014-09-23,35.1932
2014-09-24,35.4088
2014-09-25,34.7351
2014-09-26,34.9687
2014-09-29,34.5645
2014-09-30,34.5824
2014-10-01,34.1872
2014-10-02,33.7111
2014-10-03,33.6123
2014-10-06,33.8189
2014-10-07,33.0464
2014-10-08,33.6932
2014-10-09,32.6422
2014-10-10,32.1572
2014-10-13,32.1661
2014-10-14,32.2739
2014-10-15,31.9416
2014-10-16,32.2739
2014-10-17,32.2739
2014-10-20,32.3099
2014-10-21,32.8668
2014-10-22,32.3997
2014-10-23,32.9566
2014-10-24,33.1003
2014-10-27,32.8129
2014-10-28,33.4506
2014-10-29,32.9386
2014-10-30,33.0195
2014-10-31,33.5944
2014-11-03,33.1632
2014-11-04,32.9925
2014-11-05,33.2081
2014-11-06,33.1273
2014-11-07,32.9746
2014-11-10,33.1542
2014-11-11,33.3878
2014-11-12,32.8847
2014-11-13,33.0195
2014-11-14,33.1452
2014-11-17,33.271
2014-11-18,33.8908
2014-11-19,33.8728
2014-11-20,33.6752
2014-11-21,34.0884
2014-11-24,34.6184
2014-11-25,34.816
2014-11-26,34.9597
2014-11-28,34.8968
2014-12-01,34.8339
2014-12-02,34.7711
2014-12-03,34.6992
2014-12-04,34.5196
2014-12-05,34.8429
2014-12-08,34.5285
2014-12-09,34.2321
2014-12-10,33.765
2014-12-11,33.6483
2014-12-12,32.9476
2014-12-15,32.2919
2014-12-16,32.6602
2014-12-17,33.0689
2014-12-18,33.7565
2014-12-19,33.4851
2014-12-22,33.7113
2014-12-23,33.7294
2014-12-24,33.9736
2014-12-26,33.9374
2014-12-29,33.666
2014-12-30,33.2408
2014-12-31,32.8698
2015-01-02,32.906
2015-01-05,31.6756
2015-01-06,31.3498
2015-01-07,31.6213
2015-01-08,32.0646
2015-01-09,31.766
2015-01-12,31.8565
2015-01-13,32.0194
2015-01-14,32.0827
2015-01-15,32.0013
2015-01-16,32.6255
2015-01-20,32.897
2015-01-21,33.2227
2015-01-22,33.3494
2015-01-23,33.0689
2015-01-26,33.7474
2015-01-27,33.6479
2015-01-28,32.8789
2015-01-29,33.7746
2015-01-30,33.1865
2015-02-02,33.5936
2015-02-03,34.4803
2015-02-04,33.7746
2015-02-05,34.3627
2015-02-06,33.5846
2015-02-09,33.3041
2015-02-10,33.7565
2015-02-11,33.6751
2015-02-12,34.5617
2015-02-13,34.6432
2015-02-17,34.6884
2015-02-18,34.7789
2015-02-19,34.7427
2015-02-20,35.2946
2015-02-23,35.0684
2015-02-24,35.3941
2015-02-25,35.3127
2015-02-26,35.1136
2015-02-27,35.2493
2015-03-02,35.3489
2015-03-03,34.987
2015-03-04,34.8151
2015-03-05,34.9779
2015-03-06,34.3808
2015-03-09,34.4984
2015-03-10,33.6751
2015-03-11,33.9194
2015-03-12,34.2089
2015-03-13,33.9827
2015-03-16,34.5708
2015-03-17,34.3536
2015-03-18,34.9598
2015-03-19,34.3808
2015-03-20,35.3579
2015-03-23,35.5298
2015-03-24,35.6746
2015-03-25,35.4303
2015-03-26,35.0955
2015-03-27,35.2946
2015-03-30,35.4393
2015-03-31,34.9055
2015-04-01,35.2403
2015-04-02,35.6384
2015-04-06,35.9732
2015-04-07,35.7651
2015-04-08,35.6746
2015-04-09,35.6565
2015-04-10,35.747
2015-04-13,35.557
2015-04-14,35.7741
2015-04-15,35.8465
2015-04-16,35.7651
2015-04-17,35.1498
2015-04-20,35.2132
2015-04-21,35.4846
2015-04-22,35.4846
2015-04-23,35.566
2015-04-24,35.7379
2015-04-27,36.1993
2015-04-28,36.1541
2015-04-29,35.6474
2015-04-30,35.6836
2015-05-01,36.1089
2015-05-04,35.946
2015-05-05,35.2674
2015-05-06,35.6836
2015-05-07,35.5479
2015-05-08,36.3351
2015-05-11,35.946
2015-05-12,35.8284
2015-05-13,36.0356
2015-05-14,36.7965
2015-05-15,36.8236
2015-05-18,36.5522
2015-05-19,36.5703
2015-05-20,36.6608
2015-05-21,36.7693
2015-05-22,36.3712
2015-05-26,35.4122
2015-05-27,35.9822
2015-05-28,35.9822
2015-05-29,35.4574
2015-06-01,35.367
2015-06-02,35.7922
2015-06-03,36.2627
2015-06-04,35.7289
2015-06-05,35.0955
2015-06-08,35.0865
2015-06-09,34.9689
2015-06-10,35.937
2015-06-11,36.0365
2015-06-12,35.566
2015-06-15,35.1046
2015-06-16,35.0865
2015-06-17,34.9236
2015-06-18,35.4755
2015-06-19,35.2765
2015-06-22,36.4979
2015-06-23,36.4165
2015-06-24,36.0817
2015-06-25,36.1807
2015-06-26,36.3741
2015-06-29,34.8182
2015-06-30,34.5604
2015-07-01,34.8366
2015-07-02,34.6801
2015-07-06,33.5845
2015-07-07,33.6674
2015-07-08,33.2071
2015-07-09,33.916
2015-07-10,35.6652
2015-07-13,35.5639
2015-07-14,35.7572
2015-07-15,35.6191
2015-07-16,35.9598
2015-07-17,35.8585
2015-07-20,36.015
2015-07-21,35.9414
2015-07-22,35.7572
2015-07-23,35.7572
2015-07-24,35.3982
2015-07-27,35.076
2015-07-28,35.4626
2015-07-29,35.4534
2015-07-30,35.3061
2015-07-31,35.6191
2015-08-03,35.748
2015-08-04,35.6191
2015-08-05,35.9137
2015-08-06,35.9966
2015-08-07,35.9045
2015-08-10,36.3556
2015-08-11,35.8309
2015-08-12,35.481
2015-08-13,35.2785
2015-08-14,35.2141
2015-08-17,35.0944
2015-08-18,34.7998
2015-08-19,34.542
2015-08-20,33.6398
2015-08-21,33.1058
2015-08-24,32.3233
2015-08-25,32.4982
2015-08-26,33.2531
2015-08-27,33.5017
2015-08-28,33.2531
2015-08-31,33.1611
2015-09-01,32.3509
2015-09-02,32.756
2015-09-03,32.7376
2015-09-04,32.0655
2015-09-08,33.0045
2015-09-09,32.7284
2015-09-10,33.1703
2015-09-11,33.0874
2015-09-14,32.7652
2015-09-15,33.0138
2015-09-16,33.3912
2015-09-17,33.695
2015-09-18,32.6179
2015-09-21,32.489
2015-09-22,31.4763
2015-09-23,31.3842
2015-09-24,31.2738
2015-09-25,31.5407
2015-09-28,30.9884
2015-09-29,31.1449
2015-09-30,31.6144
2015-10-01,31.55
2015-10-02,32.0931
2015-10-05,32.7652
2015-10-06,33.0138
2015-10-07,33.336
2015-10-08,33.5477
2015-10-09,33.7042
2015-10-12,33.5845
2015-10-13,33.2899
2015-10-14,33.4557
2015-10-15,33.8423
2015-10-16,33.7871
2015-10-19,33.7411
2015-10-20,33.6122
2015-10-21,33.5753
2015-10-22,33.9528
2015-10-23,34.3395
2015-10-26,34.2014
2015-10-27,33.8239
2015-10-28,34.008
2015-10-29,33.9252
2015-10-30,33.9252
2015-11-02,34.3855
2015-11-03,34.2382
2015-11-04,33.8976
2015-11-05,33.9528
2015-11-06,33.9068
2015-11-09,33.4004
2015-11-10,33.2899
2015-11-11,33.428
2015-11-12,33.0138
2015-11-13,32.7007
2015-11-16,33.0045
2015-11-17,33.0782
2015-11-18,33.4557
2015-11-19,33.6214
2015-11-20,33.4004
2015-11-23,33.1979
2015-11-24,33.0874
2015-11-25,33.3268
2015-11-27,33.6122
2015-11-30,33.6582
2015-12-01,33.7595
2015-12-02,33.2807
2015-12-03,33.1611
2015-12-04,33.5477
2015-12-07,33.4557
2015-12-08,32.9401
2015-12-09,32.8112
2015-12-10,32.7192
2015-12-11,32.1115
2015-12-14,32.1023
2015-12-15,32.4246
2015-12-16,32.9953
2015-12-17,32.6639
2015-12-18,32.2312
2015-12-21,32.3483
2015-12-22,32.5513
2015-12-23,33.0633
2015-12-24,33.0311
2015-12-28,32.9019
2015-12-29,33.2156
2015-12-30,32.8834
2015-12-31,32.3298
2016-01-04,31.8039
2016-01-05,31.5271
2016-01-06,31.0104
2016-01-07,30.5768
2016-01-08,30.3
2016-01-11,30.4661
2016-01-12,30.8813
2016-01-13,30.2723
2016-01-14,30.5583
2016-01-15,29.4973
2016-01-19,29.7464
2016-01-20,29.1467
2016-01-21,29.5065
2016-01-22,30.2354
2016-01-25,29.8294
2016-01-26,30.4845
2016-01-27,30.2077
2016-01-28,30.2354
2016-01-29,30.6321
2016-02-01,30.5583
2016-02-02,29.6818
2016-02-03,30.1616
2016-02-04,30.2216
2016-02-05,29.7279
2016-02-08,28.9068
2016-02-09,28.6761
2016-02-10,28.7961
2016-02-11,28.3716
2016-02-12,28.713
2016-02-16,29.6541
2016-02-17,29.9494
2016-02-18,29.691
2016-02-19,29.6449
2016-02-22,29.9494
2016-02-23,29.4973
2016-02-24,29.2205
2016-02-25,29.5988
2016-02-26,29.5111
2016-02-29,29.3404
2016-03-01,30.2815
2016-03-02,30.3277
2016-03-03,30.6321
2016-03-04,30.7336
2016-03-07,30.6967
2016-03-08,30.4107
2016-03-09,30.5676
2016-03-10,30.7152
2016-03-11,31.7163
2016-03-14,31.6655
2016-03-15,31.5087
2016-03-16,31.8362
2016-03-17,31.8777
2016-03-18,31.9792
2016-03-21,31.8823
2016-03-22,31.7762
2016-03-23,31.5271
2016-03-24,31.2226
2016-03-28,31.3334
2016-03-29,31.7578
2016-03-30,32.1638
2016-03-31,31.7301
2016-04-01,31.4718
2016-04-04,31.4441
2016-04-05,30.7798
2016-04-06,31.1304
2016-04-07,30.4661
2016-04-08,31.075
2016-04-11,31.1304
2016-04-12,31.4441
2016-04-13,31.97
2016-04-14,32.0069
2016-04-15,31.97
2016-04-18,32.3114
2016-04-19,32.9895
2016-04-20,32.9803
2016-04-21,32.8004
2016-04-22,32.6528
2016-04-25,32.5328
2016-04-26,32.7081
2016-04-27,32.9111
2016-04-28,32.6574
2016-04-29,32.542
2016-05-02,32.805
2016-05-03,32.1453
2016-05-04,31.7855
2016-05-05,31.6102
2016-05-06,31.7947
2016-05-09,31.7347
2016-05-10,32.053
2016-05-11,31.8131
2016-05-12,31.6932
2016-05-13,31.3241
2016-05-16,31.6286
2016-05-17,31.278
2016-05-18,31.2826
2016-05-19,31.075
2016-05-20,31.4026
2016-05-23,31.2596
2016-05-24,31.8362
2016-05-25,32.2007
2016-05-26,32.4544
2016-05-27,32.3483
2016-05-31,31.361
2016-06-01,32.2699
2016-06-02,32.3068
2016-06-03,32.4221
2016-06-06,32.4959
2016-06-07,32.8004
2016-06-08,32.865
2016-06-09,32.3206
2016-06-10,31.1857
2016-06-13,30.6552
2016-06-14,30.1616
2016-06-15,30.3277
2016-06-16,30.5307
2016-06-17,30.9182
2016-06-20,31.6009
2016-06-21,31.943
2016-06-22,31.9051
2016-06-23,33.021
2016-06-24,29.2196
2016-06-27,28.5955
2016-06-28,29.352
2016-06-29,29.9099
2016-06-30,30.5151
2016-07-01,30.534
2016-07-05,29.56
2016-07-06,29.4654
2016-07-07,29.2763
2016-07-08,29.9099
2016-07-11,30.307
2016-07-12,30.8508
2016-07-13,30.9217
2016-07-14,31.281
2016-07-15,31.1014
2016-07-18,31.0824
2016-07-19,30.8555
2016-07-20,31.1203
2016-07-21,31.0446
2016-07-22,31.1203
2016-07-25,31.1486
2016-07-26,31.2858
2016-07-27,31.5836
2016-07-28,31.6309
2016-07-29,31.9902
2016-08-01,31.6404
2016-08-02,31.3472
2016-08-03,31.2432
2016-08-04,31.3378
2016-08-05,31.6025
2016-08-08,31.6971
2016-08-09,32.1557
2016-08-10,32.3496
2016-08-11,32.5765
2016-08-12,32.5954
2016-08-15,32.6995
2016-08-16,32.6616
2016-08-17,32.5813
2016-08-18,32.7609
2016-08-19,32.482
2016-08-22,32.4441
2016-08-23,32.6144
2016-08-24,32.5387
2016-08-25,32.3969
2016-08-26,32.2739
2016-08-29,32.3685
2016-08-30,32.4158
2016-08-31,32.3496
2016-09-01,32.6049
2016-09-02,33.0115
2016-09-06,33.1912
2016-09-07,33.2763
2016-09-08,33.2574
2016-09-09,32.5292
2016-09-12,32.7467
2016-09-13,32.1321
2016-09-14,32.0375
2016-09-15,32.2645
2016-09-16,31.6498
2016-09-19,31.891
2016-09-20,31.9524
2016-09-21,32.4252
2016-09-22,32.9122
2016-09-23,32.7278
2016-09-26,32.3307
2016-09-27,32.2787
2016-09-28,32.6427
2016-09-29,32.047
2016-09-30,32.6144
2016-10-03,32.4772
2016-10-04,32.5292
2016-10-05,32.69
2016-10-06,32.5623
2016-10-07,32.3307
2016-10-10,32.4631
2016-10-11,32.0943
2016-10-12,31.9335
2016-10-13,31.7917
2016-10-14,31.9146
2016-10-17,31.8957
2016-10-18,32.2172
2016-10-19,32.2928
2016-10-20,32.3543
2016-10-21,32.2361
2016-10-24,32.3779
2016-10-25,32.3212
2016-10-26,32.1983
2016-10-27,32.2266
2016-10-28,32.359
2016-10-31,32.2834
2016-11-01,32.1132
2016-11-02,31.8579
2016-11-03,31.8011
2016-11-04,31.4985
2016-11-07,31.9902
2016-11-08,32.1415
2016-11-09,32.0659
2016-11-10,31.8579
2016-11-11,31.4985
2016-11-14,31.2054
2016-11-15,31.4276
2016-11-16,30.9879
2016-11-17,31.0824
2016-11-18,30.7231
2016-11-21,31.0163
2016-11-22,31.125
2016-11-23,30.7988
2016-11-25,30.9879
2016-11-28,30.6475
2016-11-29,31.0068
2016-11-30,30.9973
2016-12-01,30.865
2016-12-02,30.9122
2016-12-05,31.5931
2016-12-06,31.9902
2016-12-07,32.5671
2016-12-08,32.3685
2016-12-09,32.3874
2016-12-12,32.4489
2016-12-13,32.7751
2016-12-14,32.255
2016-12-15,32.2928
2016-12-16,32.4158
2016-12-19,32.307
2016-12-20,32.4867
2016-12-21,32.6417
2016-12-22,32.5703
2016-12-23,32.6988
2016-12-27,32.7321
2016-12-28,32.4704
2016-12-29,32.7321
2016-12-30,32.932
2017-01-03,33.0081
2017-01-04,33.2175
2017-01-05,33.4936
2017-01-06,33.4364
2017-01-09,33.3413
2017-01-10,33.2794
2017-01-11,33.4745
2017-01-12,33.5031
2017-01-13,33.6554
2017-01-17,33.6554
2017-01-18,33.5174
2017-01-19,33.4936
2017-01-20,33.7125
2017-01-23,33.7696
2017-01-24,33.8457
2017-01-25,34.236
2017-01-26,33.8933
2017-01-27,33.9171
2017-01-30,33.5887
2017-01-31,33.6363
2017-02-01,33.6934
2017-02-02,33.7791
2017-02-03,33.9599
2017-02-06,33.484
2017-02-07,33.3698
2017-02-08,33.3793
2017-02-09,33.5983
2017-02-10,33.5316
2017-02-13,33.703
2017-02-14,33.7791
2017-02-15,33.8838
2017-02-16,34.1122
2017-02-17,33.8743
2017-02-21,33.8743
2017-02-22,33.9076
2017-02-23,33.8648
2017-02-24,33.5697
2017-02-27,33.7172
2017-02-28,33.703
2017-03-01,34.2169
2017-03-02,34.017
2017-03-03,34.4929
2017-03-06,34.3692
2017-03-07,34.1693
2017-03-08,34.0741
2017-03-09,34.4929
2017-03-10,34.8832
2017-03-13,34.926
2017-03-14,34.5881
2017-03-15,35.0402
2017-03-16,35.4923
2017-03-17,35.4542
2017-03-20,35.3781
2017-03-21,35.321
2017-03-22,35.3686
2017-03-23,35.5114
2017-03-24,35.6351
2017-03-27,35.8159
2017-03-28,35.9682
2017-03-29,35.8588
2017-03-30,35.6922
2017-03-31,35.7874
2017-04-03,35.6922
2017-04-04,35.7588
2017-04-05,35.4828
2017-04-06,35.6636
2017-04-07,35.5875
2017-04-10,35.4067
2017-04-11,35.478
2017-04-12,35.4542
2017-04-13,35.1877
2017-04-17,35.4067
2017-04-18,35.2163
2017-04-19,35.2258
2017-04-20,35.578
2017-04-21,35.5875
2017-04-24,37.4197
2017-04-25,37.691
2017-04-26,37.4435
2017-04-27,37.3911
2017-04-28,37.3483
2017-05-01,37.5863
2017-05-02,37.8623
2017-05-03,37.7481
2017-05-04,38.5952
2017-05-05,39.2138
2017-05-08,38.5856
2017-05-09,38.4334
2017-05-10,38.4619
2017-05-11,38.3096
2017-05-12,38.6713
2017-05-15,38.9426
2017-05-16,39.3185
2017-05-17,38.6999
2017-05-18,38.6903
2017-05-19,39.2329
2017-05-22,39.2995
2017-05-23,39.29
2017-05-24,39.4042
2017-05-25,39.3661
2017-05-26,39.2233
2017-05-30,39.0806
2017-05-31,39.1948
2017-06-01,39.4994
2017-06-02,39.9277
2017-06-05,39.6326
2017-06-06,39.4232
2017-06-07,39.5089
2017-06-08,39.4423
2017-06-09,39.4185
2017-06-12,39.1139
2017-06-13,39.4423
2017-06-14,39.4089
2017-06-15,38.8521
2017-06-16,39.2614
2017-06-19,39.5089
2017-06-20,39.0526
2017-06-21,39.1009
2017-06-22,38.9946
2017-06-23,39.0429
2017-06-26,39.1831
2017-06-27,39.2556
2017-06-28,39.6616
2017-06-29,39.0429
2017-06-30,38.9801
2017-07-03,39.0236
2017-07-05,39.0623
2017-07-06,38.9656
2017-07-07,39.0816
2017-07-10,39.2073
2017-07-11,39.4199
2017-07-12,39.6712
2017-07-13,39.8259
2017-07-14,40.0869
2017-07-17,39.9806
2017-07-18,39.9226
2017-07-19,40.0386
2017-07-20,40.2706
2017-07-21,39.9612
2017-07-24,39.8501
2017-07-25,39.9612
2017-07-26,40.2996
2017-07-27,40.1981
2017-07-28,40.2416
2017-07-31,40.2416
2017-08-01,40.8409
2017-08-02,40.5606
2017-08-03,40.6572
2017-08-04,40.8409
2017-08-07,40.8506
2017-08-08,40.6282
2017-08-09,40.4591
2017-08-10,39.8549
2017-08-11,39.8259
2017-08-14,40.2609
2017-08-15,40.2609
2017-08-16,40.4929
2017-08-17,39.9661
2017-08-18,40.1062
2017-08-21,40.0676
2017-08-22,40.3382
2017-08-23,40.3431
2017-08-24,40.2319
2017-08-25,40.5896
2017-08-28,40.5896
2017-08-29,40.3092
2017-08-30,40.2029
2017-08-31,40.4349
2017-09-01,40.5316
2017-09-05,40.2416
2017-09-06,40.6862
2017-09-07,41.0149
2017-09-08,41.0052
2017-09-11,41.4209
2017-09-12,41.5949
2017-09-13,41.3435
2017-09-14,41.4209
2017-09-15,41.5465
2017-09-18,41.6432
2017-09-19,41.8462
2017-09-20,41.6432
2017-09-21,41.6722
2017-09-22,41.7544
2017-09-25,41.3
2017-09-26,41.1502
2017-09-27,41.3049
2017-09-28,41.4692
2017-09-29,41.8752
2017-10-02,41.7495
2017-10-03,41.8752
2017-10-04,41.6625
2017-10-05,41.7399
2017-10-06,41.7399
2017-10-09,41.7205
2017-10-10,42.0975
2017-10-11,42.2812
2017-10-12,42.1555
2017-10-13,42.1459
2017-10-16,42.0685
2017-10-17,42.0105
2017-10-18,42.2135
2017-10-19,42.1749
2017-10-20,41.9429
2017-10-23,41.8172
2017-10-24,42.0492
2017-10-25,42.0105
2017-10-26,41.9815
2017-10-27,41.8945
2017-10-30,42.1459
2017-10-31,42.3682
2017-11-01,42.4745
2017-11-02,42.6389
2017-11-03,42.3779
2017-11-06,42.3392
2017-11-07,41.9815
2017-11-08,42.0589
2017-11-09,41.7399
2017-11-10,41.6335
2017-11-13,41.4789
2017-11-14,41.6625
2017-11-15,41.4692
2017-11-16,41.7785
2017-11-17,41.5659
2017-11-20,41.5369
2017-11-21,41.7785
2017-11-22,41.7689
2017-11-24,42.3682
2017-11-27,42.1265
2017-11-28,42.2812
2017-11-29,42.1797
2017-11-30,42.2619
2017-12-01,41.9719
2017-12-04,42.0395
2017-12-05,41.9429
2017-12-06,41.8655
2017-12-07,42.0299
2017-12-08,42.2522
2017-12-11,42.2232
2017-12-12,42.1652
2017-12-13,42.0975
2017-12-14,41.7399
2017-12-15,41.7882
2017-12-18,42.3585
2017-12-19,42.3794
2017-12-20,42.1561
2017-12-21,42.2435
2017-12-22,42.2192
2017-12-26,42.2143
2017-12-27,42.2241
2017-12-28,42.2095
2017-12-29,42.1173
2018-01-02,42.3308
2018-01-03,42.5542
2018-01-04,43.2629
2018-01-05,43.6901
2018-01-08,43.5056
2018-01-09,43.6318
2018-01-10,43.4425
2018-01-11,43.7484
2018-01-12,44.3746
2018-01-16,44.4765
2018-01-17,44.6513
2018-01-18,44.7241
2018-01-19,45.0348
2018-01-22,45.36
2018-01-23,45.4571
2018-01-24,45.4668
2018-01-25,45.36
2018-01-26,45.7387
2018-01-29,45.3018
2018-01-30,44.9814
2018-01-31,45.0688
2018-02-01,45.1853
2018-02-02,44.0493
2018-02-05,42.2338
2018-02-06,43.4182
2018-02-07,42.6221
2018-02-08,41.4182
2018-02-09,41.593
2018-02-12,42.2435
2018-02-13,42.127
2018-02-14,42.9425
2018-02-15,43.1755
2018-02-16,43.2629
2018-02-20,42.8066
2018-02-21,42.6318
2018-02-22,42.8454
2018-02-23,43.1221
2018-02-26,43.3988
2018-02-27,42.6415
2018-02-28,42.3697
2018-03-01,41.8842
2018-03-02,41.9522
2018-03-05,42.2046
2018-03-06,42.4959
2018-03-07,42.7192
2018-03-08,42.7386
2018-03-09,42.9037
2018-03-12,43.0105
2018-03-13,42.6027
2018-03-14,42.7289
2018-03-15,42.7192
2018-03-16,42.758
2018-03-19,42.5542
2018-03-20,42.491
2018-03-21,42.4862
2018-03-22,41.5736
2018-03-23,41.1658
2018-03-26,42.0007
2018-03-27,41.5056
2018-03-28,41.6901
2018-03-29,42.0881
2018-04-02,41.5056
2018-04-03,41.8551
2018-04-04,41.9716
2018-04-05,42.3697
2018-04-06,42.2338
2018-04-09,42.5736
2018-04-10,43.0736
2018-04-11,42.826
2018-04-12,43.059
2018-04-13,43.1658
2018-04-16,43.2823
2018-04-17,43.661
2018-04-18,43.8454
2018-04-19,43.6804
2018-04-20,43.4862
2018-04-23,43.3794
2018-04-24,43.1658
2018-04-25,43.0105
2018-04-26,43.1464
2018-04-27,43.2823
2018-04-30,43.0396
2018-05-01,42.9134
2018-05-02,43.0202
2018-05-03,43.127
2018-05-04,43.2435
2018-05-07,43.2241
2018-05-08,43.1221
2018-05-09,43.1658
2018-05-10,43.5056
2018-05-11,43.5348
2018-05-14,43.5445
2018-05-15,43.2241
2018-05-16,43.093
2018-05-17,43.2047
2018-05-18,43.0105
2018-05-21,43.3017
2018-05-22,43.3309
2018-05-23,42.6804
2018-05-24,42.5542
2018-05-25,42.1658
2018-05-29,40.724
2018-05-30,41.593
2018-05-31,41.4959
2018-06-01,41.7677
2018-06-04,41.9813
2018-06-05,41.9425
2018-06-06,42.4376
2018-06-07,42.059
2018-06-08,42.127
2018-06-11,42.5736
2018-06-12,42.292
2018-06-13,42.4571
2018-06-14,42.3988
2018-06-15,42.2726
2018-06-18,41.8066
2018-06-19,41.4393
2018-06-20,41.3249
2018-06-21,40.8972
2018-06-22,41.3299
2018-06-25,40.8276
2018-06-26,40.7082
2018-06-27,40.3104
2018-06-28,40.3303
2018-06-29,40.7878
2018-07-02,40.5789
2018-07-03,40.7281
2018-07-05,41.4542
2018-07-06,41.7028
2018-07-09,41.9415
2018-07-10,42.0609
2018-07-11,41.3149
2018-07-12,41.6332
2018-07-13,41.7327
2018-07-16,41.8122
2018-07-17,41.9067
2018-07-18,41.9316
2018-07-19,41.7526
2018-07-20,41.852
2018-07-23,41.7923
2018-07-24,41.9813
2018-07-25,42.3592
2018-07-26,42.041
2018-07-27,42.1802
2018-07-30,42.2598
2018-07-31,42.3394
2018-08-01,42.0907
2018-08-02,41.6979
2018-08-03,41.7526
2018-08-06,41.5586
2018-08-07,41.9067
2018-08-08,41.8023
2018-08-09,41.6034
2018-08-10,40.4099
2018-08-13,40.2806
2018-08-14,40.2756
2018-08-15,39.475
2018-08-16,39.7833
2018-08-17,40.0419
2018-08-20,40.3402
2018-08-21,40.937
2018-08-22,41.116
2018-08-23,40.8674
2018-08-24,41.305
2018-08-27,41.8769
2018-08-28,41.8918
2018-08-29,42.031
2018-08-30,41.5437
2018-08-31,40.9967
2018-09-04,40.6287
2018-09-05,40.2308
2018-09-06,40.0319
2018-09-07,39.6639
2018-09-10,40.1115
2018-09-11,40.1612
2018-09-12,40.2308
2018-09-13,40.6486
2018-09-14,40.5292
2018-09-17,40.5988
2018-09-18,40.8674
2018-09-19,40.9967
2018-09-20,41.7526
2018-09-21,41.7526
2018-09-24,41.5586
2018-09-25,41.6829
2018-09-26,41.6531
2018-09-27,41.4343
2018-09-28,40.7828
2018-10-01,40.7878
2018-10-02,40.5193
2018-10-03,40.6486
2018-10-04,40.1314
2018-10-05,39.7932
2018-10-08,39.4352
2018-10-09,39.3556
2018-10-10,38.4505
2018-10-11,38.1124
2018-10-12,38.1621
2018-10-15,38.2218
2018-10-16,38.9777
2018-10-17,38.5401
2018-10-18,37.7693
2018-10-19,38.0129
2018-10-22,37.6947
2018-10-23,37.4062
2018-10-24,36.2426
2018-10-25,36.8393
2018-10-26,36.6901
2018-10-29,36.71
2018-10-30,36.9587
2018-10-31,37.1675
2018-11-01,37.7543
2018-11-02,37.9135
2018-11-05,37.814
2018-11-06,37.9532
2018-11-07,38.4406
2018-11-08,37.8538
2018-11-09,37.7543
2018-11-12,36.9089
2018-11-13,37.2272
2018-11-14,37.456
2018-11-15,37.5355
2018-11-16,37.5455
2018-11-19,37.1526
2018-11-20,36.3719
2018-11-21,36.8393
2018-11-23,36.5409
2018-11-26,37.1178
2018-11-27,36.9388
2018-11-28,37.456
2018-11-29,37.3068
2018-11-30,37.0382
2018-12-03,37.5057
2018-12-04,36.5211
2018-12-06,36.0934
2018-12-07,35.6558
2018-12-10,35.4171
2018-12-11,35.5364
2018-12-12,36.2028
2018-12-13,36.1431
2018-12-14,35.606
2018-12-17,35.3276
2018-12-18,35.41
2018-12-19,35.13
2018-12-20,34.94
2018-12-21,34.45
2018-12-24,33.85
2018-12-26,34.78
2018-12-27,34.77
2018-12-28,34.9
2018-12-31,35.06
2019-01-02,34.885
2019-01-03,34.49
2019-01-04,35.56
2019-01-07,35.73
2019-01-08,35.98
2019-01-09,36.485
2019-01-10,36.47
2019-01-11,36.18
2019-01-14,36.06
2019-01-15,36.06
2019-01-16,36.125
2019-01-17,36.21
2019-01-18,36.715
2019-01-22,36.23
2019-01-23,36.505
2019-01-24,36.58
2019-01-25,37.15
2019-01-28,37.05
2019-01-29,37.15
2019-01-30,37.515
2019-01-31,37.35
2019-02-01,37.38
2019-02-04,37.48
2019-02-05,37.84
2019-02-06,37.73
2019-02-07,36.97
2019-02-08,36.74
2019-02-11,36.74
2019-02-12,37.24
2019-02-13,37.19
2019-02-14,37.08
2019-02-15,37.79
2019-02-19,37.93
2019-02-20,38.12
2019-02-21,38.01
2019-02-22,38.12
2019-02-25,38.21
2019-02-26,38.45
2019-02-27,38.3
2019-02-28,38.52
2019-03-01,38.86
2019-03-04,38.67
2019-03-05,38.64
2019-03-06,38.56
2019-03-07,37.88
2019-03-08,37.975
2019-03-11,38.28
2019-03-12,38.305
2019-03-13,38.65
2019-03-14,38.8
2019-03-15,39.27
2019-03-18,39.43
2019-03-19,39.65
2019-03-20,39.63
2019-03-21,39.475
2019-03-22,38.33
2019-03-25,38.36
2019-03-26,38.46
2019-03-27,38.55
2019-03-28,38.36
2019-03-29,38.6
2019-04-01,39.11
2019-04-02,39.24
2019-04-03,39.65
2019-04-04,39.64
2019-04-05,39.76
2019-04-08,39.76
2019-04-09,39.5
2019-04-10,39.67
2019-04-11,39.75
2019-04-12,40.17
2019-04-15,40.19
2019-04-16,40.26
2019-04-17,40.54
2019-04-18,40.43
2019-04-22,40.51
2019-04-23,40.41
2019-04-24,40.09
2019-04-25,39.98
2019-04-26,40.06
2019-04-29,40.31
2019-04-30,40.53
2019-05-01,40.27
2019-05-02,40.08
2019-05-03,40.43
2019-05-06,39.98
2019-05-07,39.18
2019-05-08,39.41
2019-05-09,39.15
2019-05-10,39.43
2019-05-13,38.44
2019-05-14,38.86
2019-05-15,39.09
2019-05-16,39.46
2019-05-17,39.21
2019-05-20,38.84
2019-05-21,39.105
2019-05-22,38.97
2019-05-23,38.47
2019-05-24,38.86
2019-05-28,38.5
2019-05-29,38.11
2019-05-30,38.32
2019-05-31,37.92
2019-06-03,38.195
2019-06-04,38.84
2019-06-05,38.77
2019-06-06,38.9
2019-06-07,39.455
2019-06-10,39.54
2019-06-11,39.82
2019-06-12,39.49
2019-06-13,39.495
2019-06-14,39.19
2019-06-17,38.14
2019-06-18,38.79
2019-06-19,39.045
2019-06-20,39.37
2019-06-21,39.455
2019-06-24,39.42
2019-06-25,39.165
2019-06-26,39.235
2019-06-27,39.25
2019-06-28,39.51
2019-07-01,39.63
2019-07-02,39.71
2019-07-03,40.095
2019-07-04,40.095
2019-07-05,39.745
2019-07-08,39.5
2019-07-09,39.365
2019-07-10,39.52
2019-07-11,39.41
2019-07-12,39.485
2019-07-15,39.575
2019-07-16,39.555
2019-07-17,39.38
2019-07-18,39.465
2019-07-19,39.125
2019-07-22,39.29
2019-07-23,39.635
2019-07-24,39.75
2019-07-25,39.315
2019-07-26,39.465
2019-07-29,39.48
2019-07-30,38.695
2019-07-31,38.43
2019-08-01,38.345
2019-08-02,37.96
2019-08-05,37.225
2019-08-06,37.425
2019-08-07,37.68
2019-08-08,37.955
2019-08-09,37.79
2019-08-12,37.425
2019-08-13,37.76
2019-08-14,36.665
2019-08-15,36.535
2019-08-16,37.035
2019-08-19,37.385
2019-08-20,37.215
2019-08-21,37.7
2019-08-22,37.59
2019-08-23,37.055
2019-08-26,37.35
2019-08-27,37.405
2019-08-28,37.375
2019-08-29,37.805
2019-08-30,37.935
2019-09-02,37.91
2019-09-03,37.775
2019-09-04,38.345
2019-09-05,38.665
2019-09-06,38.73
2019-09-09,38.865
2019-09-10,38.935
2019-09-11,39.075
2019-09-12,39.405
2019-09-13,39.515
2019-09-16,39.045
2019-09-17,39.235
2019-09-18,39.215
2019-09-19,39.315
2019-09-20,39.235
2019-09-23,39.005
2019-09-24,38.785
2019-09-25,38.585
2019-09-26,38.72
2019-09-27,38.685
2019-09-30,38.875
2019-10-01,38.525
2019-10-02,37.59
2019-10-03,37.815
2019-10-04,38.185
2019-10-07,38.23
2019-10-08,37.745
2019-10-09,38.19
2019-10-10,38.43
2019-10-11,39.33
2019-10-14,39.255
2019-10-15,39.77
2019-10-16,39.86
2019-10-17,39.99
2019-10-18,40.06
2019-10-21,40.23
2019-10-22,40.035
2019-10-23,40.175
2019-10-24,40.26
2019-10-25,40.205
2019-10-28,40.375
2019-10-29,40.375
2019-10-30,40.52
2019-10-31,40.385
2019-11-01,40.725
2019-11-04,40.98
2019-11-05,40.91
2019-11-06,40.905
2019-11-07,40.935
2019-11-08,40.915
2019-11-11,40.895
2019-11-12,40.88
2019-11-13,40.75
2019-11-14,40.73
2019-11-15,41.015
2019-11-18,41.065
2019-11-19,40.98
2019-11-20,40.755
2019-11-21,40.735
2019-11-22,40.745
2019-11-25,40.905
