date,close
2014-06-13,34.7012
2014-06-16,34.9745
2014-06-17,35.9705
2014-06-18,34.5426
2014-06-19,31.4576
2014-06-20,30.6115
2014-06-23,29.9857
2014-06-24,30.0474
2014-06-25,30.0562
2014-06-26,30.2677
2014-06-27,30.3823
2014-06-30,30.1355
2014-07-01,30.2148
2014-07-02,30.9023
2014-07-03,30.9729
2014-07-07,31.5722
2014-07-08,30.8318
2014-07-09,30.4088
2014-07-10,30.0562
2014-07-11,30.1884
2014-07-14,29.9592
2014-07-15,29.6067
2014-07-16,29.783
2014-07-17,30.1884
2014-07-18,30.1884
2014-07-21,30.2501
2014-07-22,30.4969
2014-07-23,30.4705
2014-07-24,30.9112
2014-07-25,30.5233
2014-07-28,30.541
2014-07-29,30.2765
2014-07-30,30.6467
2014-07-31,30.4616
2014-08-01,29.7036
2014-08-04,30.2413
2014-08-05,31.5546
2014-08-06,30.9376
2014-08-07,30.6908
2014-08-08,32.3567
2014-08-11,31.8895
2014-08-12,31.7133
2014-08-13,31.4665
2014-08-14,32.0041
2014-08-15,31.7838
2014-08-18,31.96
2014-08-19,32.1187
2014-08-20,32.5241
2014-08-21,32.4272
2014-08-22,32.9296
2014-08-25,32.8238
2014-08-26,32.7709
2014-08-27,32.7709
2014-08-28,32.4184
2014-08-29,32.4625
2014-09-02,32.3919
2014-09-03,32.1892
2014-09-04,32.8503
2014-09-05,33.3462
2014-09-08,33.2216
2014-09-09,32.6079
2014-09-10,32.8303
2014-09-11,33.2127
2014-09-12,32.8747
2014-09-15,32.8481
2014-09-16,33.0437
2014-09-17,32.9281
2014-09-18,33.2039
2014-09-19,32.9548
2014-09-22,32.4033
2014-09-23,32.6257
2014-09-24,32.9815
2014-09-25,32.2699
2014-09-26,32.3144
2014-09-29,32.1632
2014-09-30,31.674
2014-10-01,31.0158
2014-10-02,31.3182
2014-10-03,31.2292
2014-10-06,30.8823
2014-10-07,30.4554
2014-10-08,31.0691
2014-10-09,30.2775
2014-10-10,30.3131
2014-10-13,30.3398
2014-10-14,31.6829
2014-10-15,31.6117
2014-10-16,31.2381
2014-10-17,30.6778
2014-10-20,31.2915
2014-10-21,31.5317
2014-10-22,31.3449
2014-10-23,31.9675
2014-10-24,31.9942
2014-10-27,32.1543
2014-10-28,30.2419
2014-10-29,30.064
2014-10-30,30.4821
2014-10-31,30.5799
2014-11-03,30.1886
2014-11-04,29.3525
2014-11-05,29.3702
2014-11-06,29.7616
2014-11-07,29.9395
2014-11-10,30.153
2014-11-11,30.4999
2014-11-12,31.2737
2014-11-13,30.8646
2014-11-14,31.3004
2014-11-17,31.2292
2014-11-18,31.3982
2014-11-19,31.5228
2014-11-20,32.1365
2014-11-21,32.43
2014-11-24,33.275
2014-11-25,32.9904
2014-11-26,32.6079
2014-11-28,33.0171
2014-12-01,32.1098
2014-12-02,31.3004
2014-12-03,31.5137
2014-12-04,31.1634
2014-12-05,30.9838
2014-12-08,30.5976
2014-12-09,30.5707
2014-12-10,30.1935
2014-12-11,30.9479
2014-12-12,31.6125
2014-12-15,31.4957
2014-12-16,31.4059
2014-12-17,32.1064
2014-12-18,32.7171
2014-12-19,32.771
2014-12-22,33.229
2014-12-23,33.4086
2014-12-24,33.2021
2014-12-26,33.3368
2014-12-29,33.8756
2014-12-30,34.0014
2014-12-31,33.732
2015-01-02,33.5074
2015-01-05,32.9865
2015-01-06,32.6004
2015-01-07,33.6062
2015-01-08,34.4594
2015-01-09,34.3067
2015-01-12,34.639
2015-01-13,34.0193
2015-01-14,33.1931
2015-01-15,32.5644
2015-01-16,32.4297
2015-01-20,32.3758
2015-01-21,33.7589
2015-01-22,34.3516
2015-01-23,33.7858
2015-01-26,33.3099
2015-01-27,33.0225
2015-01-28,32.7441
2015-01-29,34.9713
2015-01-30,33.3997
2015-02-02,33.714
2015-02-03,34.7468
2015-02-04,35.124
2015-02-05,34.9893
2015-02-06,35.2228
2015-02-09,35.2407
2015-02-10,35.573
2015-02-11,35.5281
2015-02-12,35.2138
2015-02-13,35.7886
2015-02-17,35.4383
2015-02-18,35.6538
2015-02-19,36.5429
2015-02-20,37.3063
2015-02-23,37.459
2015-02-24,38.5726
2015-02-25,38.878
2015-02-26,38.9857
2015-02-27,39.1115
2015-03-02,39.1204
2015-03-03,38.3032
2015-03-04,37.975
2015-03-05,38.1199
2015-03-06,37.5043
2015-03-09,37.3595
2015-03-10,36.8887
2015-03-11,36.5176
2015-03-12,36.7167
2015-03-13,37.3323
2015-03-16,37.4952
2015-03-17,37.106
2015-03-18,37.5677
2015-03-19,37.3504
2015-03-20,37.6401
2015-03-23,38.0293
2015-03-24,38.0927
2015-03-25,38.2013
2015-03-26,36.8344
2015-03-27,37.3957
2015-03-30,37.6491
2015-03-31,37.5043
2015-04-01,37.6763
2015-04-02,37.8936
2015-04-06,38.4548
2015-04-07,38.3462
2015-04-08,38.7264
2015-04-09,38.9255
2015-04-10,38.9527
2015-04-13,38.4639
2015-04-14,38.0565
2015-04-15,37.803
2015-04-16,38.9346
2015-04-17,38.3824
2015-04-20,38.5091
2015-04-21,37.5586
2015-04-22,37.6491
2015-04-23,38.3552
2015-04-24,38.6087
2015-04-27,38.319
2015-04-28,35.893
2015-04-29,34.861
2015-04-30,34.5894
2015-05-01,34.2816
2015-05-04,34.5532
2015-05-05,34.4627
2015-05-06,34.3722
2015-05-07,34.7161
2015-05-08,34.8157
2015-05-11,34.7795
2015-05-12,34.6799
2015-05-13,34.517
2015-05-14,34.1821
2015-05-15,33.9105
2015-05-18,34.0463
2015-05-19,33.8381
2015-05-20,33.7837
2015-05-21,34.4717
2015-05-22,33.9738
2015-05-26,33.0958
2015-05-27,32.0095
2015-05-28,31.8556
2015-05-29,32.0185
2015-06-01,32.4168
2015-06-02,32.444
2015-06-03,32.7798
2015-06-04,32.5605
2015-06-05,32.7159
2015-06-08,32.3595
2015-06-09,32.2407
2015-06-10,32.195
2015-06-11,32.0487
2015-06-12,32.0944
2015-06-15,32.0305
2015-06-16,32.1493
2015-06-17,32.2863
2015-06-18,32.7159
2015-06-19,32.8164
2015-06-22,33.0266
2015-06-23,33.1088
2015-06-24,32.99
2015-06-25,32.6336
2015-06-26,33.0083
2015-06-29,31.9756
2015-06-30,31.6284
2015-07-01,32.1036
2015-07-02,31.9848
2015-07-06,31.1532
2015-07-07,31.2171
2015-07-08,30.0657
2015-07-09,30.2302
2015-07-10,30.5043
2015-07-13,30.4678
2015-07-14,30.55
2015-07-15,29.7733
2015-07-16,29.5174
2015-07-17,29.1061
2015-07-20,28.9873
2015-07-21,28.6584
2015-07-22,28.3751
2015-07-23,28.3294
2015-07-24,27.845
2015-07-27,28.1009
2015-07-28,28.2197
2015-07-29,28.7406
2015-07-30,28.6035
2015-07-31,28.5121
2015-08-03,27.8085
2015-08-04,28.7041
2015-08-05,28.9965
2015-08-06,28.8411
2015-08-07,30.221
2015-08-10,30.221
2015-08-11,29.8281
2015-08-12,28.503
2015-08-13,28.7497
2015-08-14,29.1793
2015-08-17,29.2615
2015-08-18,29.819
2015-08-19,29.3163
2015-08-20,28.5213
2015-08-21,28.0644
2015-08-24,26.2458
2015-08-25,25.9534
2015-08-26,26.8672
2015-08-27,27.5069
2015-08-28,27.379
2015-08-31,27.644
2015-09-01,27.0408
2015-09-02,27.2328
2015-09-03,27.5909
2015-09-04,26.9532
2015-09-08,27.8682
2015-09-09,26.8607
2015-09-10,27.2767
2015-09-11,27.212
2015-09-14,26.796
2015-09-15,27.1565
2015-09-16,27.6556
2015-09-17,27.5909
2015-09-18,26.8977
2015-09-21,27.0733
2015-09-22,26.7313
2015-09-23,26.2507
2015-09-24,26.5557
2015-09-25,26.3246
2015-09-28,25.3633
2015-09-29,25.6406
2015-09-30,26.7406
2015-10-01,26.2969
2015-10-02,27.1288
2015-10-05,28.0161
2015-10-06,28.1086
2015-10-07,28.0531
2015-10-08,29.0699
2015-10-09,28.9127
2015-10-12,28.4968
2015-10-13,28.469
2015-10-14,28.4413
2015-10-15,27.6002
2015-10-16,27.443
2015-10-19,27.8867
2015-10-20,27.785
2015-10-21,27.785
2015-10-22,27.8682
2015-10-23,27.8498
2015-10-26,28.0254
2015-10-27,29.2547
2015-10-28,28.6539
2015-10-29,28.5245
2015-10-30,28.8388
2015-11-02,29.3379
2015-11-03,30.0866
2015-11-04,29.837
2015-11-05,30.2437
2015-11-06,29.6337
2015-11-09,28.543
2015-11-10,28.9959
2015-11-11,27.9514
2015-11-12,27.7481
2015-11-13,27.0179
2015-11-16,27.1565
2015-11-17,26.7406
2015-11-18,27.3506
2015-11-19,27.4153
2015-11-20,28.238
2015-11-23,29.1623
2015-11-24,29.7354
2015-11-25,29.9387
2015-11-27,29.4118
2015-11-30,29.3656
2015-12-01,29.1808
2015-12-02,28.8514
2015-12-03,27.9078
2015-12-04,28.5711
2015-12-07,29.029
2015-12-08,29.1691
2015-12-09,28.5057
2015-12-10,29.0757
2015-12-11,28.3843
2015-12-14,29.0476
2015-12-15,30.2155
2015-12-16,31.1405
2015-12-17,30.4958
2015-12-18,29.8885
2015-12-21,30.5519
2015-12-22,30.8602
2015-12-23,31.0938
2015-12-24,30.5052
2015-12-28,30.4771
2015-12-29,30.8322
2015-12-30,30.5239
2015-12-31,30.5799
2016-01-04,31.4301
2016-01-05,31.7385
2016-01-06,30.636
2016-01-07,30.7294
2016-01-08,29.8512
2016-01-11,30.6173
2016-01-12,30.4491
2016-01-13,29.4494
2016-01-14,29.6736
2016-01-15,29.3653
2016-01-19,29.113
2016-01-20,29.3933
2016-01-21,30.337
2016-01-22,30.2996
2016-01-25,28.3563
2016-01-26,31.1405
2016-01-27,31.944
2016-01-28,33.4669
2016-01-29,34.6161
2016-02-01,34.7656
2016-02-02,34.7096
2016-02-03,34.0275
2016-02-04,33.7192
2016-02-05,32.7475
2016-02-08,32.1682
2016-02-09,31.8132
2016-02-10,31.4395
2016-02-11,31.4208
2016-02-12,32.2617
2016-02-16,33.2427
2016-02-17,33.6071
2016-02-18,33.9247
2016-02-19,33.4669
2016-02-22,33.8033
2016-02-23,34.5227
2016-02-24,35.4009
2016-02-25,36.3446
2016-02-26,36.0363
2016-02-29,36.382
2016-03-01,36.7463
2016-03-02,36.6309
2016-03-03,36.5555
2016-03-04,36.5461
2016-03-07,36.9325
2016-03-08,36.2445
2016-03-09,36.5743
2016-03-10,36.8382
2016-03-11,37.3754
2016-03-14,37.1304
2016-03-15,36.6215
2016-03-16,36.7628
2016-03-17,37.4319
2016-03-18,37.0079
2016-03-21,37.1398
2016-03-22,36.6215
2016-03-23,36.5178
2016-03-24,36.4518
2016-03-28,36.6874
2016-03-29,37.1398
2016-03-30,37.9974
2016-03-31,37.7806
2016-04-01,38.1858
2016-04-04,37.8372
2016-04-05,37.4225
2016-04-06,37.9785
2016-04-07,37.9879
2016-04-08,36.7251
2016-04-11,37.0455
2016-04-12,36.7628
2016-04-13,37.1775
2016-04-14,36.4895
2016-04-15,36.7346
2016-04-18,37.3565
2016-04-19,37.7618
2016-04-20,38.1576
2016-04-21,37.6864
2016-04-22,37.9597
2016-04-25,37.8749
2016-04-26,39.4487
2016-04-27,39.5806
2016-04-28,38.8361
2016-04-29,37.9502
2016-05-02,38.9586
2016-05-03,38.3649
2016-05-04,38.0916
2016-05-05,37.3377
2016-05-06,37.611
2016-05-09,38.3461
2016-05-10,38.2707
2016-05-11,35.9806
2016-05-12,35.8204
2016-05-13,35.1513
2016-05-16,35.4812
2016-05-17,35.6979
2016-05-18,35.2267
2016-05-19,35.9052
2016-05-20,36.8759
2016-05-23,36.6403
2016-05-24,37.2058
2016-05-25,37.234
2016-05-26,37.0644
2016-05-27,37.3188
2016-05-31,37.152
2016-06-01,37.3968
2016-06-02,37.8055
2016-06-03,36.8835
2016-06-06,36.4842
2016-06-07,37.2162
2016-06-08,37.2827
2016-06-09,36.7314
2016-06-10,35.9804
2016-06-13,35.9328
2016-06-14,35.6001
2016-06-15,36.4272
2016-06-16,36.3986
2016-06-17,36.9215
2016-06-20,37.4538
2016-06-21,38.4139
2016-06-22,38.2999
2016-06-23,38.4329
2016-06-24,36.5793
2016-06-27,35.5621
2016-06-28,36.6363
2016-06-29,37.8911
2016-06-30,38.7276
2016-07-01,38.7181
2016-07-05,37.9957
2016-07-06,38.0432
2016-07-07,38.566
2016-07-08,39.5071
2016-07-11,39.9064
2016-07-12,40.4862
2016-07-13,39.9349
2016-07-14,40.0965
2016-07-15,40.2106
2016-07-18,41.2277
2016-07-19,41.1422
2016-07-20,40.914
2016-07-21,40.6098
2016-07-22,40.8094
2016-07-25,41.1231
2016-07-26,40.9996
2016-07-27,40.971
2016-07-28,40.6859
2016-07-29,40.9806
2016-08-01,41.3133
2016-08-02,39.6117
2016-08-03,39.6877
2016-08-04,39.355
2016-08-05,39.9539
2016-08-08,39.4026
2016-08-09,38.5185
2016-08-10,37.6439
2016-08-11,37.9006
2016-08-12,37.3873
2016-08-15,37.758
2016-08-16,37.5013
2016-08-17,37.2827
2016-08-18,37.5109
2016-08-19,38.3189
2016-08-22,37.796
2016-08-23,38.471
2016-08-24,37.9006
2016-08-25,37.8626
2016-08-26,36.988
2016-08-29,37.0641
2016-08-30,36.6838
2016-08-31,36.2941
2016-09-01,36.4937
2016-09-02,36.2656
2016-09-06,35.9709
2016-09-07,36.6268
2016-09-08,35.8859
2016-09-09,35.09
2016-09-12,35.7229
2016-09-13,34.8023
2016-09-14,34.0159
2016-09-15,34.3995
2016-09-16,33.6035
2016-09-19,34.4666
2016-09-20,34.3707
2016-09-21,34.5529
2016-09-22,35.1187
2016-09-23,34.5625
2016-09-26,34.1118
2016-09-27,34.1885
2016-09-28,34.4283
2016-09-29,34.7255
2016-09-30,35.0612
2016-10-03,35.042
2016-10-04,35.2626
2016-10-05,35.1475
2016-10-06,35.0708
2016-10-07,35.0037
2016-10-10,35.1667
2016-10-11,34.7639
2016-10-12,35.0324
2016-10-13,34.8023
2016-10-14,34.3899
2016-10-17,33.4501
2016-10-18,33.7761
2016-10-19,34.3611
2016-10-20,34.4378
2016-10-21,34.0926
2016-10-24,34.5242
2016-10-25,34.1885
2016-10-26,34.2556
2016-10-27,34.0638
2016-10-28,34.2556
2016-10-31,34.4187
2016-11-01,35.1763
2016-11-02,34.0159
2016-11-03,33.8529
2016-11-04,33.8912
2016-11-07,34.7831
2016-11-08,34.5625
2016-11-09,34.8694
2016-11-10,35.2146
2016-11-11,35.4736
2016-11-14,36.423
2016-11-15,35.9051
2016-11-16,36.0777
2016-11-17,36.4134
2016-11-18,36.4422
2016-11-21,36.586
2016-11-22,36.9025
2016-11-23,36.8066
2016-11-25,36.7778
2016-11-28,36.2791
2016-11-29,35.8668
2016-11-30,34.8982
2016-12-01,34.7927
2016-12-02,34.7447
2016-12-05,35.9435
2016-12-06,36.3079
2016-12-07,36.9828
2016-12-08,37.3892
2016-12-09,37.3312
2016-12-12,36.8473
2016-12-13,36.857
2016-12-14,36.5183
2016-12-15,35.183
2016-12-16,34.1767
2016-12-19,34.138
2016-12-20,34.6605
2016-12-21,34.5057
2016-12-22,33.1316
2016-12-23,33.2478
2016-12-27,33.3252
2016-12-28,34.0025
2016-12-29,33.8767
2016-12-30,33.8864
2017-01-03,34.3605
2017-01-04,35.0669
2017-01-05,34.1477
2017-01-06,34.3896
2017-01-09,33.8574
2017-01-10,34.3315
2017-01-11,34.0025
2017-01-12,33.9735
2017-01-13,33.9445
2017-01-17,34.5734
2017-01-18,34.2057
2017-01-19,33.9638
2017-01-20,34.167
2017-01-23,34.2928
2017-01-24,35.5604
2017-01-25,35.0863
2017-01-26,34.7379
2017-01-27,34.4283
2017-01-30,34.8153
2017-01-31,36.141
2017-02-01,36.5861
2017-02-02,35.7926
2017-02-03,35.5797
2017-02-06,35.9571
2017-02-07,35.6862
2017-02-08,36.2571
2017-02-09,36.3151
2017-02-10,36.8377
2017-02-13,36.8957
2017-02-14,36.8667
2017-02-15,36.9151
2017-02-16,36.7312
2017-02-17,36.9731
2017-02-21,37.4086
2017-02-22,37.3795
2017-02-23,36.7216
2017-02-24,36.7893
2017-02-27,37.4569
2017-02-28,36.857
2017-03-01,37.1473
2017-03-02,37.186
2017-03-03,36.8377
2017-03-06,36.7893
2017-03-07,36.5958
2017-03-08,37.7845
2017-03-09,37.5697
2017-03-10,38.341
2017-03-13,37.9895
2017-03-14,38.0481
2017-03-15,38.917
2017-03-16,38.7315
2017-03-17,38.7999
2017-03-20,38.2238
2017-03-21,37.7649
2017-03-22,37.6282
2017-03-23,37.9602
2017-03-24,38.1652
2017-03-27,39.083
2017-03-28,39.9422
2017-03-29,40.4108
2017-03-30,40.7037
2017-03-31,40.3522
2017-04-03,39.659
2017-04-04,38.6241
2017-04-05,38.4093
2017-04-06,39.0928
2017-04-07,38.6925
2017-04-10,38.6827
2017-04-11,39.1123
2017-04-12,39.1904
2017-04-13,38.7901
2017-04-17,38.7803
2017-04-18,38.5851
2017-04-19,38.4777
2017-04-20,38.8389
2017-04-21,38.1848
2017-04-24,38.3703
2017-04-25,38.6339
2017-04-26,38.4874
2017-04-27,38.878
2017-04-28,38.4581
2017-05-01,37.8235
2017-05-02,42.1292
2017-05-03,41.6508
2017-05-04,41.5531
2017-05-05,41.6508
2017-05-08,43.6523
2017-05-09,44.1307
2017-05-10,44.8532
2017-05-11,44.6482
2017-05-12,44.199
2017-05-15,44.3357
2017-05-16,43.9257
2017-05-17,43.6913
2017-05-18,43.6132
2017-05-19,44.2478
2017-05-22,44.6579
2017-05-23,44.9215
2017-05-24,45.0192
2017-05-25,44.9801
2017-05-26,45.234
2017-05-30,44.9801
2017-05-31,45.1168
2017-06-01,45.068
2017-06-02,44.9118
2017-06-05,45.4585
2017-06-06,45.3999
2017-06-07,45.5843
2017-06-08,45.722
2017-06-09,45.9482
2017-06-12,45.604
2017-06-13,45.3778
2017-06-14,45.5253
2017-06-15,45.309
2017-06-16,45.4663
2017-06-19,45.781
2017-06-20,44.9451
2017-06-21,45.781
2017-06-22,45.7122
2017-06-23,45.9384
2017-06-26,46.4793
2017-06-27,46.3416
2017-06-28,46.5481
2017-06-29,46.0859
2017-06-30,46.558
2017-07-03,46.5481
2017-07-05,46.3219
2017-07-06,45.9089
2017-07-07,46.8924
2017-07-10,46.7842
2017-07-11,46.2334
2017-07-12,46.2728
2017-07-13,46.6563
2017-07-14,47.1972
2017-07-17,47.1481
2017-07-18,46.9612
2017-07-19,47.3546
2017-07-20,47.2858
2017-07-21,47.9349
2017-07-24,47.748
2017-07-25,47.7185
2017-07-26,47.0989
2017-07-27,47.1776
2017-07-28,47.8857
2017-07-31,46.3613
2017-08-01,46.2334
2017-08-02,45.4565
2017-08-03,45.3876
2017-08-04,46.2334
2017-08-07,46.7842
2017-08-08,47.0399
2017-08-09,46.971
2017-08-10,46.3121
2017-08-11,46.7645
2017-08-14,47.1284
2017-08-15,39.9687
2017-08-16,40.0473
2017-08-17,40.3227
2017-08-18,39.713
2017-08-21,40.2145
2017-08-22,40.303
2017-08-23,40.2735
2017-08-24,40.6374
2017-08-25,41.1882
2017-08-28,41.2078
2017-08-29,41.021
2017-08-30,40.5194
2017-08-31,41.0111
2017-09-01,41.2767
2017-09-05,40.6866
2017-09-06,40.8341
2017-09-07,40.3161
2017-09-08,40.088
2017-09-11,40.4549
2017-09-12,40.9308
2017-09-13,41.7439
2017-09-14,41.2779
2017-09-15,41.0498
2017-09-18,40.1277
2017-09-19,40.0087
2017-09-20,39.1262
2017-09-21,39.2749
2017-09-22,39.6121
2017-09-25,38.8188
2017-09-26,39.3443
2017-09-27,39.8996
2017-09-28,39.7806
2017-09-29,39.9393
2017-10-02,40.326
2017-10-03,39.4931
2017-10-04,39.384
2017-10-05,39.4732
2017-10-06,39.4931
2017-10-09,39.3443
2017-10-10,39.6616
2017-10-11,38.5412
2017-10-12,39.0865
2017-10-13,39.2353
2017-10-16,38.9874
2017-10-17,39.3047
2017-10-18,39.1361
2017-10-19,39.1361
2017-10-20,40.0087
2017-10-23,39.4633
2017-10-24,39.9194
2017-10-25,39.8996
2017-10-26,40.0483
2017-10-27,39.9393
2017-10-30,39.5625
2017-10-31,40.95
2017-11-01,40.68
2017-11-02,41.35
2017-11-03,41.15
2017-11-06,41.48
2017-11-07,41.93
2017-11-08,40.08
2017-11-09,40.16
2017-11-10,40.82
2017-11-13,40.44
2017-11-14,40.2
2017-11-15,40.26
2017-11-16,41
2017-11-17,41.66
2017-11-20,42.07
2017-11-21,41.25
2017-11-22,41.03
2017-11-24,40.86
2017-11-27,40.59
2017-11-28,40.65
2017-11-29,41.51
2017-11-30,41.69
2017-12-01,41.54
2017-12-04,41.65
2017-12-05,41.65
2017-12-06,41.71
2017-12-07,41.98
2017-12-08,42.26
2017-12-11,41.39
2017-12-12,41.51
2017-12-13,42.27
2017-12-14,42.82
2017-12-15,42.83
2017-12-18,43.49
2017-12-19,43.48
2017-12-20,43.28
2017-12-21,44.27
2017-12-22,44.38
2017-12-26,44.95
2017-12-27,44.65
2017-12-28,44.34
2017-12-29,44.23
2018-01-02,45.26
2018-01-03,45.27
2018-01-04,45.2
2018-01-05,45.41
2018-01-08,45.29
2018-01-09,45.35
2018-01-10,45.23
2018-01-11,45.52
2018-01-12,45.78
2018-01-16,45.9
2018-01-17,46.99
2018-01-18,47.31
2018-01-19,47.76
2018-01-22,47.51
2018-01-23,47.58
2018-01-24,47.54
2018-01-25,47.43
2018-01-26,47.74
2018-01-29,48.44
2018-01-30,47.85
2018-01-31,47.04
2018-02-01,46.96
2018-02-02,45.96
2018-02-05,44.97
2018-02-06,49.02
2018-02-07,50.1
2018-02-08,48.85
2018-02-09,49.06
2018-02-12,49.91
2018-02-13,50.14
2018-02-14,50.49
2018-02-15,50.63
2018-02-16,50.06
2018-02-20,49.41
2018-02-21,49.58
2018-02-22,49.77
2018-02-23,50.65
2018-02-26,51.16
2018-02-27,50.65
2018-02-28,50.91
2018-03-01,50.27
2018-03-02,50.95
2018-03-05,50.98
2018-03-06,51.2
2018-03-07,50.69
2018-03-08,51.96
2018-03-09,52.49
2018-03-12,52.46
2018-03-13,52.98
2018-03-14,52.48
2018-03-15,52.37
2018-03-16,52.77
2018-03-19,52.21
2018-03-20,53.18
2018-03-21,52.97
2018-03-22,51.95
2018-03-23,51.74
2018-03-26,53.24
2018-03-27,53.11
2018-03-28,52.51
2018-03-29,52.61
2018-04-02,51.48
2018-04-03,51.81
2018-04-04,52.62
2018-04-05,54
2018-04-06,52.47
2018-04-09,52.61
2018-04-10,53.07
2018-04-11,52.46
2018-04-12,52.68
2018-04-13,52.51
2018-04-16,53.19
2018-04-17,53.7
2018-04-18,53.33
2018-04-19,53.29
2018-04-20,53.03
2018-04-23,53.56
2018-04-24,53.16
2018-04-25,53.44
2018-04-26,54.61
2018-04-27,54.64
2018-04-30,53.77
2018-05-01,47.46
2018-05-02,46.37
2018-05-03,46.09
2018-05-04,46.16
2018-05-07,45.41
2018-05-08,45.54
2018-05-09,45.4
2018-05-10,45.95
2018-05-11,46.04
2018-05-14,45.7
2018-05-15,45.24
2018-05-16,44.34
2018-05-17,44.42
2018-05-18,44.48
2018-05-21,44.99
2018-05-22,43.93
2018-05-23,44.61
2018-05-24,44.57
2018-05-25,44.29
2018-05-29,43.79
2018-05-30,43.96
2018-05-31,43.72
2018-06-01,44.5
2018-06-04,45.15
2018-06-05,44.76
2018-06-06,45.74
2018-06-07,45.83
2018-06-08,46.24
2018-06-11,46.31
2018-06-12,45.82
2018-06-13,45.47
2018-06-14,45.53
2018-06-15,46.41
2018-06-18,46.93
2018-06-19,46.88
2018-06-20,47.04
2018-06-21,48.04
2018-06-22,47.27
2018-06-25,47.06
2018-06-26,47.14
2018-06-27,46.22
2018-06-28,46.82
2018-06-29,46.71
2018-07-02,46.37
2018-07-03,46.45
2018-07-05,46.26
2018-07-06,46.8
2018-07-09,46.41
2018-07-10,46.5
2018-07-11,45.5
2018-07-12,45.63
2018-07-13,46.53
2018-07-16,47.03
2018-07-17,47.39
2018-07-18,47.3
2018-07-19,48.02
2018-07-20,48.32
2018-07-23,48.24
2018-07-24,47.97
2018-07-25,48.05
2018-07-26,47.99
2018-07-27,47.57
2018-07-30,47.53
2018-07-31,47.12
2018-08-01,46.47
2018-08-02,46.53
2018-08-03,46.53
2018-08-06,45.41
2018-08-07,45.76
2018-08-08,47.05
2018-08-09,47.54
2018-08-10,47.93
2018-08-13,47.46
2018-08-14,53.16
2018-08-15,52.07
2018-08-16,51.38
2018-08-17,51.41
2018-08-20,52.19
2018-08-21,52.03
2018-08-22,51.65
2018-08-23,51.39
2018-08-24,51.03
2018-08-27,50.74
2018-08-28,51.36
2018-08-29,51.32
2018-08-30,50.61
2018-08-31,50.69
2018-09-04,50.86
2018-09-05,50.43
2018-09-06,49.96
2018-09-07,49.18
2018-09-10,49.75
2018-09-11,50.12
2018-09-12,50.53
2018-09-13,49.96
2018-09-14,49.94
2018-09-17,50.51
2018-09-18,50.82
2018-09-19,50.43
2018-09-20,50.34
2018-09-21,50.2
2018-09-24,49.33
2018-09-25,49.25
2018-09-26,49.69
2018-09-27,50.14
2018-09-28,50.27
2018-10-01,50.34
2018-10-02,49.83
2018-10-03,50.14
2018-10-04,48.43
2018-10-05,47.96
2018-10-08,48.26
2018-10-09,47.78
2018-10-10,43.77
2018-10-11,42.68
2018-10-12,43.82
2018-10-15,43.06
2018-10-16,44.47
2018-10-17,43.99
2018-10-18,43.44
2018-10-19,42.51
2018-10-22,42.62
2018-10-23,42.44
2018-10-24,41.7
2018-10-25,41.52
2018-10-26,41.24
2018-10-29,40.8
2018-10-30,40.32
2018-10-31,42.31
2018-11-01,42.94
2018-11-02,42.81
2018-11-05,42.75
2018-11-06,42.45
2018-11-07,42.43
2018-11-08,43.03
2018-11-09,42
2018-11-12,41.27
2018-11-13,41.1
2018-11-14,41.09
2018-11-15,41.01
2018-11-16,40.63
2018-11-19,39.14
2018-11-20,38.07
2018-11-21,37.87
2018-11-23,37.67
2018-11-26,38.73
2018-11-27,37.34
2018-11-28,38.5
2018-11-29,38.01
2018-11-30,38.93
2018-12-03,39.54
2018-12-04,38.22
2018-12-06,37.58
2018-12-07,35.34
2018-12-10,35.84
2018-12-11,34.96
2018-12-12,36.04
2018-12-13,34.83
2018-12-14,34.6
2018-12-17,34.73
2018-12-18,34.68
2018-12-19,33.95
2018-12-20,33.41
2018-12-21,32.81
2018-12-24,32.3
2018-12-26,33.89
2018-12-27,34.15
2018-12-28,33.81
2018-12-31,33.75
2019-01-02,34.41
2019-01-03,33.02
2019-01-04,34.27
2019-01-07,34.61
2019-01-08,35.42
2019-01-09,37
2019-01-10,36.11
2019-01-11,36.35
2019-01-14,36.14
2019-01-15,35.9
2019-01-16,35.3
2019-01-17,36.12
2019-01-18,37.08
2019-01-22,36.35
2019-01-23,36.51
2019-01-24,36.12
2019-01-25,37.5
2019-01-28,37.88
2019-01-29,37.79
2019-01-30,38.38
2019-01-31,38.71
2019-02-01,38.63
2019-02-04,38.48
2019-02-05,38.74
2019-02-06,39.31
2019-02-07,33.48
2019-02-08,33.86
2019-02-11,34.65
2019-02-12,35.35
2019-02-13,35.1
2019-02-14,35.15
2019-02-15,35.91
2019-02-19,35.53
2019-02-20,34.99
2019-02-21,34.83
2019-02-22,35.46
2019-02-25,36.16
2019-02-26,35.66
2019-02-27,35.45
2019-02-28,34.94
2019-03-01,35.36
2019-03-04,34.6
2019-03-05,34.61
2019-03-06,34.52
2019-03-07,34.18
2019-03-08,33.54
2019-03-11,33.86
2019-03-12,33.78
2019-03-13,33.86
2019-03-14,33.1
2019-03-15,32.2
2019-03-18,32.94
2019-03-19,32.93
2019-03-20,31.85
2019-03-21,31.95
2019-03-22,30.93
2019-03-25,31.57
2019-03-26,31.95
2019-03-27,32.48
2019-03-28,32.71
2019-03-29,32.49
2019-04-01,33.39
2019-04-02,33.24
2019-04-03,33.89
2019-04-04,34.45
2019-04-05,34.25
2019-04-08,33.81
2019-04-09,33.56
2019-04-10,33.41
2019-04-11,32.9
2019-04-12,32.57
2019-04-15,32.3
2019-04-16,32.26
2019-04-17,32.3
2019-04-18,32.55
2019-04-22,30.7
2019-04-23,30.84
2019-04-24,31.53
2019-04-25,30.8
2019-04-26,31.65
2019-04-29,32.33
2019-04-30,32.27
2019-05-01,31.02
2019-05-02,31.39
2019-05-03,31.2
2019-05-06,31.52
2019-05-07,30.72
2019-05-08,30.75
2019-05-09,33.36
2019-05-10,32.25
2019-05-13,30.22
2019-05-14,30.78
2019-05-15,31.08
2019-05-16,31.34
2019-05-17,30.78
2019-05-20,30.72
2019-05-21,31.38
2019-05-22,30.86
2019-05-23,30.23
2019-05-24,29.71
2019-05-28,29.4
2019-05-29,29
2019-05-30,28.36
2019-05-31,28.56
2019-06-03,28.82
2019-06-04,30.05
2019-06-05,30.17
2019-06-06,29.61
2019-06-07,30.25
2019-06-10,29.97
2019-06-11,29.72
2019-06-12,28.83
2019-06-13,29.79
2019-06-14,29.62
2019-06-17,29.7
2019-06-18,30.245
2019-06-19,30.325
2019-06-20,30.78
2019-06-21,31.21
2019-06-24,31.35
2019-06-25,30.365
2019-06-26,30.755
2019-06-27,31.005
2019-06-28,31.65
2019-07-01,31.295
2019-07-02,30.3
2019-07-03,30.365
2019-07-04,30.365
2019-07-05,30.175
2019-07-08,30.235
2019-07-09,29.735
2019-07-10,28.93
2019-07-11,29.665
2019-07-12,30.44
2019-07-15,30.67
2019-07-16,31.205
2019-07-17,30.335
2019-07-18,30.395
2019-07-19,30.345
2019-07-22,29.395
2019-07-23,30.095
2019-07-24,30.81
2019-07-25,30.815
2019-07-26,30.65
2019-07-29,30.585
2019-07-30,30.67
2019-07-31,30.905
2019-08-01,29.34
2019-08-02,29.775
2019-08-05,27.915
2019-08-06,27.925
2019-08-07,28.23
2019-08-08,28.455
2019-08-09,27.365
2019-08-12,26.335
2019-08-13,26.68
2019-08-14,24.955
2019-08-15,19.455
2019-08-16,19.995
2019-08-19,20.985
2019-08-20,21.01
2019-08-21,21.695
2019-08-22,21.285
2019-08-23,20.27
2019-08-26,20.865
2019-08-27,20.475
2019-08-28,20.47
2019-08-29,20.26
2019-08-30,20.64
2019-09-02,20.645
2019-09-03,20.42
2019-09-04,21.465
2019-09-05,22.915
2019-09-06,23.685
2019-09-09,24.355
2019-09-10,25.18
2019-09-11,25.78
2019-09-12,25.605
2019-09-13,25.19
2019-09-16,25.52
2019-09-17,25.125
2019-09-18,25.19
2019-09-19,25.255
2019-09-20,25.2
2019-09-23,25.155
2019-09-24,25.175
2019-09-25,25.33
2019-09-26,25.475
2019-09-27,25.94
2019-09-30,26.03
2019-10-01,25.595
2019-10-02,24.73
2019-10-03,25.23
2019-10-04,25.48
2019-10-07,25.195
2019-10-08,24.67
2019-10-09,24.775
2019-10-10,24.995
2019-10-11,26.005
2019-10-14,25.21
2019-10-15,25.695
2019-10-16,25.46
2019-10-17,25.445
2019-10-18,25.61
2019-10-21,26.245
2019-10-22,26.455
2019-10-23,25.985
2019-10-24,25.725
2019-10-25,26.435
2019-10-28,26.135
2019-10-29,25.88
2019-10-30,26.24
2019-10-31,25.82
2019-11-01,26.255
2019-11-04,26.575
2019-11-05,26.955
2019-11-06,25.905
2019-11-07,27.075
2019-11-08,27.17
2019-11-11,26.68
2019-11-12,26.37
2019-11-13,26.045
2019-11-14,26.075
2019-11-15,26.765
2019-11-18,26.89
2019-11-19,26.975
2019-11-20,26.165
2019-11-21,25.8
2019-11-22,26.36
2019-11-25,26.69
