date,close
2017-06-14,14.8511
2017-06-15,14.9659
2017-06-16,14.9905
2017-06-19,15.0069
2017-06-20,15.0479
2017-06-21,15.0187
2017-06-22,15.0479
2017-06-23,14.9823
2017-06-26,15.1545
2017-06-27,15.1627
2017-06-28,15.5321
2017-06-29,15.3954
2017-06-30,15.3784
2017-07-03,15.6431
2017-07-05,15.5491
2017-07-06,15.4467
2017-07-07,15.4723
2017-07-10,15.4381
2017-07-11,15.5235
2017-07-12,15.5235
2017-07-13,15.5491
2017-07-14,15.5577
2017-07-17,15.5235
2017-07-18,15.5235
2017-07-19,15.4723
2017-07-20,15.3698
2017-07-21,15.5406
2017-07-24,15.6943
2017-07-25,15.737
2017-07-26,15.737
2017-07-27,15.7712
2017-07-28,15.7968
2017-07-31,15.7797
2017-08-01,15.8651
2017-08-02,15.7882
2017-08-03,15.8822
2017-08-04,15.8395
2017-08-07,15.8736
2017-08-08,15.8224
2017-08-09,15.6687
2017-08-10,15.7028
2017-08-11,15.6772
2017-08-14,15.7199
2017-08-15,15.6772
2017-08-16,15.7114
2017-08-17,15.6175
2017-08-18,15.626
2017-08-21,15.626
2017-08-22,15.737
2017-08-23,15.6943
2017-08-24,15.7114
2017-08-25,15.7968
2017-08-28,15.8224
2017-08-29,15.8138
2017-08-30,15.8053
2017-08-31,15.7968
2017-09-01,15.7968
2017-09-05,15.6858
2017-09-06,15.7028
2017-09-07,15.7882
2017-09-08,15.6345
2017-09-11,15.8395
2017-09-12,15.7882
2017-09-13,15.7285
2017-09-14,15.7968
2017-09-15,15.7199
2017-09-18,15.9078
2017-09-19,15.7968
2017-09-20,16.1298
2017-09-21,15.9163
2017-09-22,15.9761
2017-09-25,16.0529
2017-09-26,16.07
2017-09-27,16.0359
2017-09-28,16.2972
2017-09-29,16.393
2017-10-02,16.332
2017-10-03,16.4452
2017-10-04,16.4104
2017-10-05,16.3494
2017-10-06,16.4365
2017-10-09,16.1665
2017-10-10,16.2275
2017-10-11,16.2362
2017-10-12,16.2536
2017-10-13,16.3146
2017-10-16,16.2885
2017-10-17,16.2885
2017-10-18,16.2275
2017-10-19,16.271
2017-10-20,16.271
2017-10-23,16.1665
2017-10-24,16.1404
2017-10-25,16.0968
2017-10-26,15.9488
2017-10-27,16.1578
2017-10-30,16.1055
2017-10-31,16.1491
2017-11-01,16.1055
2017-11-02,16.0359
2017-11-03,15.94
2017-11-06,15.9575
2017-11-07,15.8007
2017-11-08,15.8268
2017-11-09,15.94
2017-11-10,16.1491
2017-11-13,15.9749
2017-11-14,15.9923
2017-11-15,15.94
2017-11-16,16.062
2017-11-17,16.0794
2017-11-20,16.0533
2017-11-21,16.0446
2017-11-22,16.1404
2017-11-24,16.1926
2017-11-27,16.123
2017-11-28,16.1578
2017-11-29,16.0707
2017-11-30,16.1578
2017-12-01,16.0533
2017-12-04,16.123
2017-12-05,16.0881
2017-12-06,16.0446
2017-12-07,15.9488
2017-12-08,16.062
2017-12-11,15.9313
2017-12-12,15.7484
2017-12-13,15.069
2017-12-14,14.8425
2017-12-15,15.13
2017-12-18,15.3216
2017-12-19,15.4958
2017-12-20,15.8007
2017-12-21,15.8616
2017-12-22,15.9749
2017-12-26,16.3233
2017-12-27,16.5324
2017-12-28,16.9854
2017-12-29,17.8027
2018-01-02,16.4169
2018-01-03,16.5412
2018-01-04,16.479
2018-01-05,16.3902
2018-01-08,16.4169
2018-01-09,16.1948
2018-01-10,16.2214
2018-01-11,16.3636
2018-01-12,16.408
2018-01-16,16.3547
2018-01-17,16.3103
2018-01-18,16.2303
2018-01-19,16.2125
2018-01-22,16.1148
2018-01-23,16.1681
2018-01-24,16.1504
2018-01-25,16.1681
2018-01-26,16.0971
2018-01-29,15.9993
2018-01-30,15.946
2018-01-31,15.946
2018-02-01,15.8927
2018-02-02,15.644
2018-02-05,15.4574
2018-02-06,15.6529
2018-02-07,15.8483
2018-02-08,15.5552
2018-02-09,15.5729
2018-02-12,15.9105
2018-02-13,16.1504
2018-02-14,15.9905
2018-02-15,15.8661
2018-02-16,16.0793
2018-02-20,15.7861
2018-02-21,15.7506
2018-02-22,15.6351
2018-02-23,15.5907
2018-02-26,15.5907
2018-02-27,15.4308
2018-02-28,15.3419
2018-03-01,15.2087
2018-03-02,15.1287
2018-03-05,15.4219
2018-03-06,15.5463
2018-03-07,15.5196
2018-03-08,15.7328
2018-03-09,15.8483
2018-03-12,15.8039
2018-03-13,15.7684
2018-03-14,15.6529
2018-03-15,15.6795
2018-03-16,16.0438
2018-03-19,15.9816
2018-03-20,15.9105
2018-03-21,15.946
2018-03-22,16.0438
2018-03-23,15.6884
2018-03-26,15.9283
2018-03-27,15.3953
2018-03-28,15.84
2018-03-29,16.2485
2018-04-02,16.1668
2018-04-03,16.1941
2018-04-04,16.2848
2018-04-05,16.4028
2018-04-06,16.1033
2018-04-09,16.0579
2018-04-10,16.2848
2018-04-11,16.0942
2018-04-12,16.0307
2018-04-13,15.9762
2018-04-16,16.0307
2018-04-17,16.1124
2018-04-18,16.185
2018-04-19,16.1668
2018-04-20,16.1487
2018-04-23,16.1759
2018-04-24,16.2394
2018-04-25,16.2576
2018-04-26,16.2576
2018-04-27,16.3211
2018-04-30,16.2394
2018-05-01,16.2304
2018-05-02,15.9853
2018-05-03,16.0579
2018-05-04,15.9762
2018-05-07,16.2576
2018-05-08,16.0488
2018-05-09,16.2122
2018-05-10,16.2031
2018-05-11,16.1396
2018-05-14,16.1124
2018-05-15,16.1487
2018-05-16,16.0579
2018-05-17,16.0761
2018-05-18,16.3847
2018-05-21,16.3393
2018-05-22,16.3211
2018-05-23,16.3393
2018-05-24,16.2394
2018-05-25,16.4119
2018-05-29,16.303
2018-05-30,16.421
2018-05-31,16.5027
2018-06-01,16.4301
2018-06-04,16.4301
2018-06-05,16.4936
2018-06-06,16.6479
2018-06-07,16.5935
2018-06-08,16.6116
2018-06-11,16.3847
2018-06-12,15.9762
2018-06-13,15.8854
2018-06-14,15.9671
2018-06-15,15.9308
2018-06-18,15.9853
2018-06-19,15.9671
2018-06-20,15.9762
2018-06-21,15.9308
2018-06-22,15.9308
2018-06-25,15.8854
2018-06-26,15.9127
2018-06-27,15.8945
2018-06-28,15.8018
2018-06-29,15.7832
2018-07-02,15.8018
2018-07-03,15.8389
2018-07-05,15.8852
2018-07-06,15.8667
2018-07-09,15.8945
2018-07-10,15.9872
2018-07-11,15.8945
2018-07-12,15.8481
2018-07-13,15.9131
2018-07-16,15.8389
2018-07-17,16.1171
2018-07-18,16.4509
2018-07-19,16.5529
2018-07-20,16.6086
2018-07-23,16.5622
2018-07-24,16.4787
2018-07-25,16.488
2018-07-26,16.3674
2018-07-27,16.5622
2018-07-30,16.5529
2018-07-31,16.4787
2018-08-01,16.5251
2018-08-02,16.5807
2018-08-03,16.6178
2018-08-06,16.59
2018-08-07,16.6642
2018-08-08,16.4973
2018-08-09,15.9687
2018-08-10,15.978
2018-08-13,15.8481
2018-08-14,15.8667
2018-08-15,15.8389
2018-08-16,15.8481
2018-08-17,15.8481
2018-08-20,15.7925
2018-08-21,15.9038
2018-08-22,16.0151
2018-08-23,15.8481
2018-08-24,15.8018
2018-08-27,15.811
2018-08-28,15.774
2018-08-29,15.8018
2018-08-30,15.7832
2018-08-31,15.7554
2018-09-04,15.7276
2018-09-05,15.7647
2018-09-06,15.5792
2018-09-07,15.5792
2018-09-10,15.7925
2018-09-11,15.8018
2018-09-12,15.6998
2018-09-13,15.7183
2018-09-14,15.8852
2018-09-17,15.9687
2018-09-18,15.9223
2018-09-19,16.0151
2018-09-20,15.9501
2018-09-21,15.9501
2018-09-24,15.8296
2018-09-25,15.8481
2018-09-26,15.8018
2018-09-27,15.9345
2018-09-28,15.8302
2018-10-01,15.9345
2018-10-02,15.7923
2018-10-03,15.7449
2018-10-04,15.2046
2018-10-05,15.3183
2018-10-08,15.0434
2018-10-09,14.8539
2018-10-10,14.6548
2018-10-11,14.6548
2018-10-12,14.6643
2018-10-15,14.8728
2018-10-16,14.8349
2018-10-17,15.0814
2018-10-18,15.0719
2018-10-19,15.1288
2018-10-22,14.9866
2018-10-23,14.9392
2018-10-24,14.8539
2018-10-25,14.9961
2018-10-26,14.8159
2018-10-29,14.9013
2018-10-30,14.8539
2018-10-31,15.1667
2018-11-01,15.1193
2018-11-02,15.034
2018-11-05,15.1382
2018-11-06,15.2046
2018-11-07,15.2046
2018-11-08,15.1477
2018-11-09,15.1382
2018-11-12,14.9202
2018-11-13,15.0245
2018-11-14,14.8633
2018-11-15,14.778
2018-11-16,14.6548
2018-11-19,14.7875
2018-11-20,14.6358
2018-11-21,14.5031
2018-11-23,14.541
2018-11-26,14.579
2018-11-27,14.5221
2018-11-28,14.6927
2018-11-29,14.6453
2018-11-30,14.6927
2018-12-03,14.8254
2018-12-04,14.5126
2018-12-06,14.1808
2018-12-07,13.9818
2018-12-10,13.669
2018-12-11,13.4699
2018-12-12,13.4604
2018-12-13,13.2045
2018-12-14,13.1192
2018-12-17,12.5694
2018-12-18,12.8727
2018-12-19,12.74
2018-12-20,12.1618
2018-12-21,12.2755
2018-12-24,12.3229
2018-12-26,12.5883
2018-12-27,12.6078
2018-12-28,12.4226
2018-12-31,12.091
2019-01-02,12.4908
2019-01-03,12.8419
2019-01-04,13.3099
2019-01-07,13.9047
2019-01-08,13.9827
2019-01-09,13.8949
2019-01-10,13.9144
2019-01-11,14.0315
2019-01-14,14.0997
2019-01-15,14.1387
2019-01-16,14.1485
2019-01-17,14.1777
2019-01-18,14.324
2019-01-22,14.0802
2019-01-23,14.0412
2019-01-24,14.2362
2019-01-25,14.4215
2019-01-28,14.3435
2019-01-29,14.3045
2019-01-30,14.4605
2019-01-31,14.5678
2019-02-01,14.4995
2019-02-04,14.714
2019-02-05,14.8213
2019-02-06,14.6263
2019-02-07,14.5385
2019-02-08,14.5873
2019-02-11,14.6263
2019-02-12,14.363
2019-02-13,14.4702
2019-02-14,14.4897
2019-02-15,14.5483
2019-02-19,14.4995
2019-02-20,14.6263
2019-02-21,14.597
2019-02-22,14.831
2019-02-25,14.675
2019-02-26,14.558
2019-02-27,14.6799
2019-02-28,14.5775
2019-03-01,14.441
2019-03-04,14.5092
2019-03-05,14.3435
2019-03-06,14.3142
2019-03-07,14.2557
2019-03-08,14.3825
2019-03-11,14.5775
2019-03-12,14.519
2019-03-13,14.5873
2019-03-14,14.7043
2019-03-15,14.7335
2019-03-18,14.753
2019-03-19,14.6653
2019-03-20,14.5775
2019-03-21,14.597
2019-03-22,14.519
2019-03-25,14.5288
2019-03-26,14.519
2019-03-27,14.48
2019-03-28,14.55
2019-03-29,14.48
2019-04-01,14.68
2019-04-02,14.78
2019-04-03,14.74
2019-04-04,14.8
2019-04-05,14.83
2019-04-08,14.79
2019-04-09,14.6
2019-04-10,14.7
2019-04-11,14.71
2019-04-12,14.7
2019-04-15,14.64
2019-04-16,14.85
2019-04-17,14.78
2019-04-18,14.79
2019-04-22,14.8
2019-04-23,14.9
2019-04-24,14.91
2019-04-25,14.92
2019-04-26,15.02
2019-04-29,15.01
2019-04-30,14.96
2019-05-01,14.97
2019-05-02,14.99
2019-05-03,15.05
2019-05-06,15.05
2019-05-07,14.91
2019-05-08,15.42
2019-05-09,15.5
2019-05-10,15.32
2019-05-13,15.14
2019-05-14,14.99
2019-05-15,14.69
2019-05-16,14.83
2019-05-17,14.95
2019-05-20,14.82
2019-05-21,14.77
2019-05-22,14.63
2019-05-23,14.63
2019-05-24,14.76
2019-05-28,14.77
2019-05-29,15
2019-05-30,14.86
2019-05-31,14.64
2019-06-03,14.69
2019-06-04,14.77
2019-06-05,14.71
2019-06-06,14.78
2019-06-07,14.85
2019-06-10,14.86
2019-06-11,14.94
2019-06-12,15
2019-06-13,15.17
2019-06-14,15.17
2019-06-17,15.19
2019-06-18,15.26
2019-06-19,15.425
2019-06-20,15.29
2019-06-21,15.34
2019-06-24,15.515
2019-06-25,15.45
2019-06-26,15.37
2019-06-27,14.98
2019-06-28,15.21
2019-07-01,15.15
2019-07-02,15.205
2019-07-03,15.33
2019-07-04,15.33
2019-07-05,15.265
2019-07-08,15.3
2019-07-09,15.32
2019-07-10,15.43
2019-07-11,15.31
2019-07-12,15.29
2019-07-15,15.325
2019-07-16,15.265
2019-07-17,15.145
2019-07-18,15.085
2019-07-19,15.09
2019-07-22,15.04
2019-07-23,15.03
2019-07-24,15.07
2019-07-25,15.11
2019-07-26,15.245
2019-07-29,15.225
2019-07-30,15.24
2019-07-31,15.135
2019-08-01,15.005
2019-08-02,14.935
2019-08-05,14.595
2019-08-06,14.77
2019-08-07,14.035
2019-08-08,14.23
2019-08-09,13.91
2019-08-12,13.735
2019-08-13,13.715
2019-08-14,13.48
2019-08-15,13.555
2019-08-16,13.765
2019-08-19,13.875
2019-08-20,14.05
2019-08-21,14.245
2019-08-22,14.28
2019-08-23,14.12
2019-08-26,14.24
2019-08-27,14.075
2019-08-28,14.255
2019-08-29,14.34
2019-08-30,14.39
2019-09-02,14.42
2019-09-03,14.315
2019-09-04,14.275
2019-09-05,14.49
2019-09-06,14.215
2019-09-09,14.73
2019-09-10,14.735
2019-09-11,14.825
2019-09-12,14.875
2019-09-13,14.905
2019-09-16,15.005
2019-09-17,14.99
2019-09-18,14.945
2019-09-19,14.885
2019-09-20,14.89
2019-09-23,14.96
2019-09-24,14.885
2019-09-25,14.845
2019-09-26,14.97
2019-09-27,14.445
2019-09-30,14.415
2019-10-01,14.16
2019-10-02,13.83
2019-10-03,13.785
2019-10-04,13.895
2019-10-07,14.035
2019-10-08,14.03
2019-10-09,13.925
2019-10-10,13.92
2019-10-11,14.055
2019-10-14,14.005
2019-10-15,14.16
2019-10-16,14.135
2019-10-17,14.135
2019-10-18,14.265
2019-10-21,14.31
2019-10-22,14.35
2019-10-23,14.295
2019-10-24,14.285
2019-10-25,14.215
2019-10-28,14.295
2019-10-29,14.335
2019-10-30,14.25
2019-10-31,14.305
2019-11-01,14.325
2019-11-04,14.54
2019-11-05,14.4
2019-11-06,13.7
2019-11-07,13.7
2019-11-08,13.655
2019-11-11,13.62
2019-11-12,13.675
2019-11-13,13.54
2019-11-14,13.485
2019-11-15,13.4
2019-11-18,13.395
2019-11-19,13.355
2019-11-20,13.35
2019-11-21,13.23
2019-11-22,13.145
2019-11-25,13.425
