date,close
2014-06-13,50.522
2014-06-16,50.6851
2014-06-17,51.3717
2014-06-18,50.7795
2014-06-19,50.7451
2014-06-20,51.3031
2014-06-23,51.2001
2014-06-24,51.6378
2014-06-25,52.8052
2014-06-26,53.4317
2014-06-27,53.0798
2014-06-30,53.4317
2014-07-01,53.4146
2014-07-02,53.2772
2014-07-03,53.2343
2014-07-07,52.6335
2014-07-08,52.0412
2014-07-09,51.861
2014-07-10,51.4833
2014-07-11,51.037
2014-07-14,51.5606
2014-07-15,50.7655
2014-07-16,51.3459
2014-07-17,50.8712
2014-07-18,51.0697
2014-07-21,50.9316
2014-07-22,50.5519
2014-07-23,49.6803
2014-07-24,48.3255
2014-07-25,48.6017
2014-07-28,48.4722
2014-07-29,48.3514
2014-07-30,48.5844
2014-07-31,48.0321
2014-08-01,47.6179
2014-08-04,48.1098
2014-08-05,46.9707
2014-08-06,47.3504
2014-08-07,46.8412
2014-08-08,47.4626
2014-08-11,47.5834
2014-08-12,47.5316
2014-08-13,47.5143
2014-08-14,48.5326
2014-08-15,48.6621
2014-08-18,49.8443
2014-08-19,51.2596
2014-08-20,50.6296
2014-08-21,50.8799
2014-08-22,51.3113
2014-08-25,51.9154
2014-08-26,51.7514
2014-08-27,52.0966
2014-08-28,52.5799
2014-08-29,52.9164
2014-09-02,52.4591
2014-09-03,52.5195
2014-09-04,52.4591
2014-09-05,52.8905
2014-09-08,52.4245
2014-09-09,52.157
2014-09-10,52.1225
2014-09-11,51.924
2014-09-12,51.225
2014-09-15,51.1905
2014-09-16,51.855
2014-09-17,52.1398
2014-09-18,51.7169
2014-09-19,51.691
2014-09-22,50.7418
2014-09-23,49.1712
2014-09-24,50.0255
2014-09-25,49.4301
2014-09-26,49.9996
2014-09-29,50.3621
2014-09-30,57.2657
2014-10-01,56.1266
2014-10-02,57.6972
2014-10-03,57.9216
2014-10-06,57.3002
2014-10-07,56.7652
2014-10-08,55.0048
2014-10-09,51.8895
2014-10-10,49.6199
2014-10-13,46.3407
2014-10-14,44.4681
2014-10-15,45.3418
2014-10-16,48.676
2014-10-17,49.9437
2014-10-20,49.7527
2014-10-21,50.8901
2014-10-22,48.6065
2014-10-23,50.4299
2014-10-24,50.8294
2014-10-27,48.9104
2014-10-28,50.5689
2014-10-29,50.1434
2014-10-30,50.1347
2014-10-31,50.7599
2014-11-03,50.5862
2014-11-04,48.3287
2014-11-05,48.4589
2014-11-06,46.4185
2014-11-07,47.6688
2014-11-10,46.9742
2014-11-11,46.8873
2014-11-12,47.0957
2014-11-13,46.4532
2014-11-14,47.0697
2014-11-17,46.9568
2014-11-18,46.9394
2014-11-19,47.3128
2014-11-20,47.6254
2014-11-21,47.608
2014-11-24,47.8946
2014-11-25,47.2086
2014-11-26,46.2274
2014-11-28,43.1711
2014-12-01,41.1393
2014-12-02,42.8151
2014-12-03,43.31
2014-12-04,44.0915
2014-12-05,44.1088
2014-12-08,41.2348
2014-12-09,41.9642
2014-12-10,40.7573
2014-12-11,40.1408
2014-12-12,39.4375
2014-12-15,38.8904
2014-12-16,38.7776
2014-12-17,42.1291
2014-12-18,43.9612
2014-12-19,44.5517
2014-12-22,44.9424
2014-12-23,45.5849
2014-12-24,44.925
2014-12-26,45.2897
2014-12-29,44.7427
2014-12-30,45.3071
2014-12-31,44.187
2015-01-02,43.4576
2015-01-05,40.0192
2015-01-06,39.0207
2015-01-07,38.7342
2015-01-08,39.5069
2015-01-09,39.9932
2015-01-12,38.7081
2015-01-13,37.067
2015-01-14,37.9093
2015-01-15,36.9264
2015-01-16,36.9089
2015-01-20,37.0838
2015-01-21,38.1946
2015-01-22,38.8243
2015-01-23,39.1742
2015-01-26,38.7981
2015-01-27,38.527
2015-01-28,36.9789
2015-01-29,37.2063
2015-01-30,37.0226
2015-02-02,38.0634
2015-02-03,39.3491
2015-02-04,38.6844
2015-02-05,41.4132
2015-02-06,41.0459
2015-02-09,40.3987
2015-02-10,39.7689
2015-02-11,38.7544
2015-02-12,39.6465
2015-02-13,40.836
2015-02-17,40.9846
2015-02-18,41.0896
2015-02-19,40.3637
2015-02-20,39.9351
2015-02-23,39.0255
2015-02-24,38.7019
2015-02-25,39.0605
2015-02-26,38.5445
2015-02-27,38.6931
2015-03-02,38.5357
2015-03-03,38.6757
2015-03-04,38.2558
2015-03-05,38.5007
2015-03-06,38.9905
2015-03-09,38.4745
2015-03-10,37.836
2015-03-11,38.5707
2015-03-12,38.4657
2015-03-13,37.8273
2015-03-16,37.7311
2015-03-17,37.9847
2015-03-18,40.3199
2015-03-19,40.5998
2015-03-20,40.0488
2015-03-23,40.3812
2015-03-24,39.7077
2015-03-25,40.2412
2015-03-26,40.2062
2015-03-27,39.5765
2015-03-30,40.8447
2015-03-31,40.731
2015-04-01,40.4249
2015-04-02,40.8272
2015-04-06,41.7018
2015-04-07,42.1042
2015-04-08,41.973
2015-04-09,42.8126
2015-04-10,43.2237
2015-04-13,42.5415
2015-04-14,43.7747
2015-04-15,44.7836
2015-04-16,43.7978
2015-04-17,43.7274
2015-04-20,43.7714
2015-04-21,43.1025
2015-04-22,44.2731
2015-04-23,44.4051
2015-04-24,44.1851
2015-04-27,43.7802
2015-04-28,44.1675
2015-04-29,44.6692
2015-04-30,43.7538
2015-05-01,43.657
2015-05-04,43.701
2015-05-05,44.009
2015-05-06,43.2081
2015-05-07,42.1871
2015-05-08,42.3719
2015-05-11,41.6678
2015-05-12,42.8296
2015-05-13,42.5655
2015-05-14,42.3455
2015-05-15,41.879
2015-05-18,41.9934
2015-05-19,41.1661
2015-05-20,41.2013
2015-05-21,41.3069
2015-05-22,41.2365
2015-05-26,40.3651
2015-05-27,40.2243
2015-05-28,40.3035
2015-05-29,40.3299
2015-06-01,41.5709
2015-06-02,42.4863
2015-06-03,42.1959
2015-06-04,40.7964
2015-06-05,41.2629
2015-06-08,40.0834
2015-06-09,40.0306
2015-06-10,39.6609
2015-06-11,39.2737
2015-06-12,38.9568
2015-06-15,39.1592
2015-06-16,39.08
2015-06-17,39.4585
2015-06-18,39.3089
2015-06-19,39.0448
2015-06-22,39.7402
2015-06-23,40.2859
2015-06-24,39.4057
2015-06-25,38.86
2015-06-26,38.6663
2015-06-29,37.6629
2015-06-30,37.6893
2015-07-01,37.8126
2015-07-02,38.8336
2015-07-06,36.8444
2015-07-07,37.6013
2015-07-08,35.5945
2015-07-09,35.885
2015-07-10,36.2899
2015-07-13,37.1436
2015-07-14,37.6805
2015-07-15,37.6538
2015-07-16,37.7697
2015-07-17,37.092
2015-07-20,36.0488
2015-07-21,35.2909
2015-07-22,34.1229
2015-07-23,33.5433
2015-07-24,32.5893
2015-07-27,31.3856
2015-07-28,31.8136
2015-07-29,32.7141
2015-07-30,32.1078
2015-07-31,31.9295
2015-08-03,30.8328
2015-08-04,30.1105
2015-08-05,28.7107
2015-08-06,30.5029
2015-08-07,29.8341
2015-08-10,31.2073
2015-08-11,31.0824
2015-08-12,31.7422
2015-08-13,31.0378
2015-08-14,31.1448
2015-08-17,31.4926
2015-08-18,31.5015
2015-08-19,30.5385
2015-08-20,29.6647
2015-08-21,29.3616
2015-08-24,27.7031
2015-08-25,28.2738
2015-08-26,28.1668
2015-08-27,31.0468
2015-08-28,32.1078
2015-08-31,32.7765
2015-09-01,31.3053
2015-09-02,30.9308
2015-09-03,31.3767
2015-09-04,30.8595
2015-09-08,31.0468
2015-09-09,30.5474
2015-09-10,30.3691
2015-09-11,29.6647
2015-09-14,29.4061
2015-09-15,30.0035
2015-09-16,30.7436
2015-09-17,31.2429
2015-09-18,30.6634
2015-09-21,30.3959
2015-09-22,29.7806
2015-09-23,28.5234
2015-09-24,28.1311
2015-09-25,27.7388
2015-09-28,26.2408
2015-09-29,25.7594
2015-09-30,26.4281
2015-10-01,26.6688
2015-10-02,27.4891
2015-10-05,29.1119
2015-10-06,30.271
2015-10-07,31.1359
2015-10-08,31.6977
2015-10-09,31.5817
2015-10-12,31.0468
2015-10-13,30.4404
2015-10-14,30.812
2015-10-15,31.0748
2015-10-16,31.3739
2015-10-19,31.1564
2015-10-20,30.7576
2015-10-21,30.4042
2015-10-22,30.4858
2015-10-23,29.5342
2015-10-26,28.7639
2015-10-27,27.8758
2015-10-28,28.8908
2015-10-29,28.6733
2015-10-30,29.1173
2015-11-02,29.0811
2015-11-03,29.5886
2015-11-04,28.7367
2015-11-05,27.1055
2015-11-06,26.7521
2015-11-09,25.8005
2015-11-10,25.7915
2015-11-11,25.3746
2015-11-12,25.1843
2015-11-13,26.0089
2015-11-16,26.3986
2015-11-17,25.4652
2015-11-18,25.3383
2015-11-19,24.9124
2015-11-20,24.704
2015-11-23,24.8671
2015-11-24,25.293
2015-11-25,25.3111
2015-11-27,25.2115
2015-11-30,25.2296
2015-12-01,25.3202
2015-12-02,23.8974
2015-12-03,23.254
2015-12-04,21.7043
2015-12-07,19.2937
2015-12-08,18.9494
2015-12-09,19.5203
2015-12-10,19.3753
2015-12-11,18.1791
2015-12-14,16.9194
2015-12-15,16.5841
2015-12-16,15.8501
2015-12-17,6.5883
2015-12-18,7.9749
2015-12-21,8.7361
2015-12-22,8.3827
2015-12-23,9.2527
2015-12-24,9.0895
2015-12-28,9.153
2015-12-29,8.9264
2015-12-30,8.5639
2015-12-31,8.9445
2016-01-04,9.2255
2016-01-05,8.6999
2016-01-06,8.2286
2016-01-07,7.3043
2016-01-08,7.1502
2016-01-11,6.6155
2016-01-12,6.2168
2016-01-13,5.6005
2016-01-14,6.4071
2016-01-15,5.6005
2016-01-19,5.1112
2016-01-20,4.4587
2016-01-21,4.948
2016-01-22,5.7365
2016-01-25,5.2924
2016-01-26,5.8996
2016-01-27,5.7002
2016-01-28,6.0899
2016-01-29,6.2077
2016-02-01,6.3074
2016-02-02,5.673
2016-02-03,6.281
2016-02-04,6.2719
2016-02-05,6.3359
2016-02-08,5.8056
2016-02-09,5.1016
2016-02-10,5.3393
2016-02-11,5.0742
2016-02-12,5.3668
2016-02-16,5.9153
2016-02-17,6.1165
2016-02-18,7.1313
2016-02-19,6.9302
2016-02-22,7.0947
2016-02-23,6.729
2016-02-24,6.8387
2016-02-25,6.6467
2016-02-26,7.0947
2016-02-29,7.3141
2016-03-01,7.3141
2016-03-02,7.4513
2016-03-03,7.6616
2016-03-04,8.0364
2016-03-07,8.6307
2016-03-08,6.9759
2016-03-09,7.4056
2016-03-10,7.2776
2016-03-11,7.7804
2016-03-14,7.8444
2016-03-15,7.6067
2016-03-16,8.3016
2016-03-17,8.9781
2016-03-18,8.8318
2016-03-21,8.2467
2016-03-22,8.5484
2016-03-23,7.6799
2016-03-24,8.2193
2016-03-28,7.7439
2016-03-29,7.7164
2016-03-30,7.7621
2016-03-31,7.9176
2016-04-01,7.6433
2016-04-04,7.4147
2016-04-05,7.1496
2016-04-06,7.4604
2016-04-07,7.2776
2016-04-08,8.2284
2016-04-11,8.4204
2016-04-12,8.9233
2016-04-13,9.5541
2016-04-14,9.5541
2016-04-15,9.5084
2016-04-18,9.4718
2016-04-19,10.0661
2016-04-20,10.2398
2016-04-21,10.0844
2016-04-22,10.4501
2016-04-25,9.9929
2016-04-26,10.3769
2016-04-27,10.2713
2016-04-28,10.1886
2016-04-29,10.2897
2016-05-02,9.8762
2016-05-03,9.1872
2016-05-04,9.0861
2016-05-05,9.0953
2016-05-06,9.0402
2016-05-09,8.8289
2016-05-10,9.2056
2016-05-11,9.4169
2016-05-12,9.0402
2016-05-13,8.5717
2016-05-16,8.7278
2016-05-17,8.9024
2016-05-18,8.489
2016-05-19,8.3052
2016-05-20,8.8381
2016-05-23,8.884
2016-05-24,8.6727
2016-05-25,9.3066
2016-05-26,9.0678
2016-05-27,9.2974
2016-05-31,9.6649
2016-06-01,9.4261
2016-06-02,9.3618
2016-06-03,9.2056
2016-06-06,9.5731
2016-06-07,9.2607
2016-06-08,9.4353
2016-06-09,8.884
2016-06-10,7.9561
2016-06-13,7.4141
2016-06-14,6.9639
2016-06-15,6.9915
2016-06-16,6.431
2016-06-17,7.0741
2016-06-20,6.8996
2016-06-21,6.9547
2016-06-22,6.872
2016-06-23,7.1109
2016-06-24,6.8353
2016-06-27,6.1738
2016-06-28,6.4586
2016-06-29,6.8169
2016-06-30,6.5505
2016-07-01,6.624
2016-07-05,6.1462
2016-07-06,6.33
2016-07-07,6.0636
2016-07-08,6.3208
2016-07-11,6.5597
2016-07-12,6.9639
2016-07-13,6.624
2016-07-14,6.578
2016-07-15,6.4494
2016-07-18,6.624
2016-07-19,6.3575
2016-07-20,6.3575
2016-07-21,6.5045
2016-07-22,6.2473
2016-07-25,6.0819
2016-07-26,6.1187
2016-07-27,5.9102
2016-07-28,5.6323
2016-07-29,5.7435
2016-08-01,5.3081
2016-08-02,5.1321
2016-08-03,5.4007
2016-08-04,5.6601
2016-08-05,5.6694
2016-08-08,6.0955
2016-08-09,5.8361
2016-08-10,5.8454
2016-08-11,6.0214
2016-08-12,6.0307
2016-08-15,6.3364
2016-08-16,6.2808
2016-08-17,6.4197
2016-08-18,6.9478
2016-08-19,6.7347
2016-08-22,6.4939
2016-08-23,6.6977
2016-08-24,6.3364
2016-08-25,6.4012
2016-08-26,6.1511
2016-08-29,6.3086
2016-08-30,6.7903
2016-08-31,6.6977
2016-09-01,6.4846
2016-09-02,6.8737
2016-09-06,7.1053
2016-09-07,7.2164
2016-09-08,7.5221
2016-09-09,7.1053
2016-09-12,7.1516
2016-09-13,6.6143
2016-09-14,6.5031
2016-09-15,6.5124
2016-09-16,6.5402
2016-09-19,6.5402
2016-09-20,6.4197
2016-09-21,6.6421
2016-09-22,6.7069
2016-09-23,6.6143
2016-09-26,6.7532
2016-09-27,6.6143
2016-09-28,7.1516
2016-09-29,7.0034
2016-09-30,7.1423
2016-10-03,7.3832
2016-10-04,7.448
2016-10-05,7.8371
2016-10-06,7.9946
2016-10-07,7.8371
2016-10-10,8.0687
2016-10-11,7.9019
2016-10-12,7.7908
2016-10-13,7.624
2016-10-14,7.5777
2016-10-17,7.2164
2016-10-18,7.3369
2016-10-19,7.624
2016-10-20,7.5592
2016-10-21,7.448
2016-10-24,7.2164
2016-10-25,7.0682
2016-10-26,7.1755
2016-10-27,7.2408
2016-10-28,6.653
2016-10-31,6.0931
2016-11-01,5.9438
2016-11-02,5.6919
2016-11-03,5.5799
2016-11-04,5.8039
2016-11-07,5.8972
2016-11-08,5.8692
2016-11-09,6.0651
2016-11-10,6.0745
2016-11-11,6.1958
2016-11-14,6.3544
2016-11-15,6.513
2016-11-16,6.541
2016-11-17,6.4384
2016-11-18,6.4104
2016-11-21,7.2222
2016-11-22,7.0635
2016-11-23,7.1102
2016-11-25,7.0262
2016-11-28,6.9516
2016-11-29,6.9049
2016-11-30,7.3621
2016-12-01,7.3248
2016-12-02,7.5394
2016-12-05,7.754
2016-12-06,7.95
2016-12-07,7.894
2016-12-08,7.9686
2016-12-09,7.922
2016-12-12,7.6607
2016-12-13,7.67
2016-12-14,7.3715
2016-12-15,7.5301
2016-12-16,7.8287
2016-12-19,7.6234
2016-12-20,7.698
2016-12-21,7.7167
2016-12-22,7.5394
2016-12-23,7.6141
2016-12-27,7.6514
2016-12-28,7.5487
2016-12-29,7.3435
2016-12-30,7.4928
2017-01-03,8.0433
2017-01-04,8.2392
2017-01-05,8.3139
2017-01-06,8.2206
2017-01-09,8.0899
2017-01-10,7.9406
2017-01-11,8.2579
2017-01-12,8.3046
2017-01-13,8.3979
2017-01-17,8.5565
2017-01-18,8.7804
2017-01-19,8.8924
2017-01-20,9.4803
2017-01-23,9.4056
2017-01-24,9.9281
2017-01-25,10.6644
2017-01-26,9.9141
2017-01-27,10.0266
2017-01-30,9.4076
2017-01-31,9.4263
2017-02-01,9.5483
2017-02-02,9.295
2017-02-03,9.5295
2017-02-06,9.417
2017-02-07,9.295
2017-02-08,9.2387
2017-02-09,9.3232
2017-02-10,9.5014
2017-02-13,9.6139
2017-02-14,9.9328
2017-02-15,9.961
2017-02-16,9.5952
2017-02-17,9.5389
2017-02-21,10.383
2017-02-22,10.2048
2017-02-23,9.7921
2017-02-24,9.3044
2017-02-27,9.3325
2017-02-28,9.2106
2017-03-01,9.4263
2017-03-02,9.2669
2017-03-03,9.4826
2017-03-06,9.5483
2017-03-07,9.3701
2017-03-08,9.0512
2017-03-09,8.8917
2017-03-10,8.9011
2017-03-13,8.7041
2017-03-14,8.2351
2017-03-15,8.4227
2017-03-16,8.4884
2017-03-17,8.479
2017-03-20,8.5634
2017-03-21,8.4321
2017-03-22,8.3852
2017-03-23,8.5259
2017-03-24,8.6103
2017-03-27,8.2727
2017-03-28,8.5353
2017-03-29,8.7885
2017-03-30,8.8167
2017-03-31,8.5822
2017-04-03,8.5916
2017-04-04,8.6009
2017-04-05,8.5072
2017-04-06,8.8073
2017-04-07,8.7604
2017-04-10,9.2856
2017-04-11,9.3607
2017-04-12,9.0605
2017-04-13,8.7416
2017-04-17,8.7135
2017-04-18,8.7041
2017-04-19,8.4415
2017-04-20,8.3852
2017-04-21,8.2258
2017-04-24,8.2164
2017-04-25,8.282
2017-04-26,8.1883
2017-04-27,8.0194
2017-04-28,8.1414
2017-05-01,7.7943
2017-05-02,7.4285
2017-05-03,7.4616
2017-05-04,7.1499
2017-05-05,7.3199
2017-05-08,7.2443
2017-05-09,7.1688
2017-05-10,7.2349
2017-05-11,7.0932
2017-05-12,7.0271
2017-05-15,7.1593
2017-05-16,6.9988
2017-05-17,6.8571
2017-05-18,6.092
2017-05-19,6.1015
2017-05-22,6.3187
2017-05-23,6.1298
2017-05-24,5.9409
2017-05-25,5.8559
2017-05-26,6.1393
2017-05-30,5.7615
2017-05-31,5.7709
2017-06-01,6.2337
2017-06-02,6.0637
2017-06-05,5.8937
2017-06-06,6.1298
2017-06-07,6.0354
2017-06-08,6.0637
2017-06-09,5.8276
2017-06-12,5.5631
2017-06-13,5.7804
2017-06-14,5.3553
2017-06-15,5.1286
2017-06-16,5.2042
2017-06-19,5.157
2017-06-20,5.0248
2017-06-21,4.9681
2017-06-22,5.4403
2017-06-23,5.9031
2017-06-26,5.9126
2017-06-27,6.0826
2017-06-28,6.3093
2017-06-29,6.3848
2017-06-30,6.2998
2017-07-03,7.3671
2017-07-05,6.9799
2017-07-06,6.9515
2017-07-07,6.4226
2017-07-10,6.3376
2017-07-11,6.2621
2017-07-12,6.3565
2017-07-13,6.7249
2017-07-14,6.6965
2017-07-17,6.9704
2017-07-18,6.8099
2017-07-19,7.1404
2017-07-20,7.4238
2017-07-21,7.2821
2017-07-24,7.7166
2017-07-25,8.1699
2017-07-26,8.0944
2017-07-27,9.02
2017-07-28,9.1806
2017-07-31,9.2561
2017-08-01,9.4356
2017-08-02,9.4783
2017-08-03,9.5353
2017-08-04,9.4023
2017-08-07,9.3644
2017-08-08,9.2694
2017-08-09,9.013
2017-08-10,8.709
2017-08-11,9.0509
2017-08-14,9.1554
2017-08-15,8.7755
2017-08-16,8.5381
2017-08-17,8.3197
2017-08-18,8.4716
2017-08-21,8.0917
2017-08-22,8.4146
2017-08-23,8.6616
2017-08-24,8.8705
2017-08-25,8.975
2017-08-28,8.8705
2017-08-29,8.9465
2017-08-30,8.7375
2017-08-31,8.7565
2017-09-01,8.5381
2017-09-05,8.3671
2017-09-06,8.6711
2017-09-07,8.747
2017-09-08,8.6616
2017-09-11,8.6426
2017-09-12,8.4906
2017-09-13,8.6046
2017-09-14,8.5761
2017-09-15,8.3861
2017-09-18,8.5381
2017-09-19,8.5476
2017-09-20,8.5381
2017-09-21,8.4526
2017-09-22,8.3671
2017-09-25,8.4906
2017-09-26,8.5476
2017-09-27,8.6046
2017-09-28,8.5286
2017-09-29,8.4811
2017-10-02,8.6331
2017-10-03,8.6616
2017-10-04,8.5951
2017-10-05,8.6236
2017-10-06,8.3576
2017-10-09,8.2627
2017-10-10,8.4146
2017-10-11,8.4526
2017-10-12,8.4716
2017-10-13,8.5286
2017-10-16,8.3766
2017-10-17,8.4526
2017-10-18,8.3766
2017-10-19,8.3007
2017-10-20,8.2912
2017-10-23,8.1677
2017-10-24,7.9493
2017-10-25,7.6833
2017-10-26,7.6358
2017-10-27,7.8448
2017-10-30,7.8543
2017-10-31,7.6928
2017-11-01,7.7783
2017-11-02,7.7448
2017-11-03,7.5919
2017-11-06,8.0795
2017-11-07,7.8787
2017-11-08,7.764
2017-11-09,8.5098
2017-11-10,8.7201
2017-11-13,8.6436
2017-11-14,8.0412
2017-11-15,8.5675
2017-11-16,8.1369
2017-11-17,8.1655
2017-11-20,7.8405
2017-11-21,7.8118
2017-11-22,8.0891
2017-11-24,8.0795
2017-11-27,8.1751
2017-11-28,8.1369
2017-11-29,8.1847
2017-11-30,7.9648
2017-12-01,7.9552
2017-12-04,7.8691
2017-12-05,7.9169
2017-12-06,7.7831
2017-12-07,7.8309
2017-12-08,7.8022
2017-12-11,8.0699
2017-12-12,8.3759
2017-12-13,8.3568
2017-12-14,8.4906
2017-12-15,8.7392
2017-12-18,8.9018
2017-12-19,8.8349
2017-12-20,8.6723
2017-12-21,8.8253
2017-12-22,8.7775
2017-12-26,8.9592
2017-12-27,8.9878
2017-12-28,9.0739
2017-12-29,8.9113
2018-01-02,9.3894
2018-01-03,9.5998
2018-01-04,9.5902
2018-01-05,9.6093
2018-01-08,9.8866
2018-01-09,9.5998
2018-01-10,9.7241
2018-01-11,9.9631
2018-01-12,10.0779
2018-01-16,9.9344
2018-01-17,10.0683
2018-01-18,9.9727
2018-01-19,10.0205
2018-01-22,10.2213
2018-01-23,10.2691
2018-01-24,8.8922
2018-01-25,8.5002
2018-01-26,8.3663
2018-01-29,8.2612
2018-01-30,8.2038
2018-01-31,7.8022
2018-02-01,7.9707
2018-02-02,7.7878
2018-02-05,7.422
2018-02-06,7.422
2018-02-07,7.4797
2018-02-08,7.4701
2018-02-09,7.3161
2018-02-12,7.6145
2018-02-13,7.2487
2018-02-14,7.345
2018-02-15,7.3257
2018-02-16,7.1909
2018-02-20,7.5375
2018-02-21,7.3642
2018-02-22,7.5086
2018-02-23,7.6915
2018-02-26,7.6915
2018-02-27,7.4605
2018-02-28,7.3161
2018-03-01,7.4123
2018-03-02,7.5856
2018-03-05,7.6819
2018-03-06,7.7974
2018-03-07,7.9418
2018-03-08,7.9418
2018-03-09,8.0477
2018-03-12,8.3461
2018-03-13,8.3076
2018-03-14,8.3172
2018-03-15,8.0766
2018-03-16,8.3172
2018-03-19,7.8937
2018-03-20,7.8359
2018-03-21,8.1054
2018-03-22,7.7396
2018-03-23,7.5182
2018-03-26,7.7204
2018-03-27,7.7878
2018-03-28,7.6434
2018-03-29,7.7878
2018-04-02,7.4605
2018-04-03,7.653
2018-04-04,7.7878
2018-04-05,7.9996
2018-04-06,7.8359
2018-04-09,7.9033
2018-04-10,8.3172
2018-04-11,8.5194
2018-04-12,8.375
2018-04-13,8.4424
2018-04-16,8.4905
2018-04-17,8.5098
2018-04-18,8.7023
2018-04-19,8.76
2018-04-20,8.6349
2018-04-23,8.5386
2018-04-24,8.3461
2018-04-25,8.3269
2018-04-26,8.6927
2018-04-27,8.5675
2018-04-30,8.4905
2018-05-01,8.4327
2018-05-02,8.606
2018-05-03,8.4075
2018-05-04,8.6787
2018-05-07,8.5624
2018-05-08,8.7561
2018-05-09,8.7561
2018-05-10,8.669
2018-05-11,8.6109
2018-05-14,8.6593
2018-05-15,8.6399
2018-05-16,8.7174
2018-05-17,7.8553
2018-05-18,7.7972
2018-05-21,7.5163
2018-05-22,7.6423
2018-05-23,7.5841
2018-05-24,7.497
2018-05-25,7.3904
2018-05-29,7.3904
2018-05-30,7.8457
2018-05-31,7.7294
2018-06-01,7.8457
2018-06-04,7.8747
2018-06-05,7.8069
2018-06-06,7.7585
2018-06-07,7.8457
2018-06-08,7.9135
2018-06-11,8.0684
2018-06-12,7.8844
2018-06-13,7.7875
2018-06-14,7.6229
2018-06-15,7.5163
2018-06-18,7.865
2018-06-19,7.836
2018-06-20,7.9328
2018-06-21,7.7488
2018-06-22,7.7585
2018-06-25,7.3614
2018-06-26,7.4582
2018-06-27,7.342
2018-06-28,7.3904
2018-06-29,7.5067
2018-07-02,7.5067
2018-07-03,7.6907
2018-07-05,7.7004
2018-07-06,7.5648
2018-07-09,7.5551
2018-07-10,7.7391
2018-07-11,7.2742
2018-07-12,7.2742
2018-07-13,7.2258
2018-07-16,6.9933
2018-07-17,6.9255
2018-07-18,6.9352
2018-07-19,6.8867
2018-07-20,6.693
2018-07-23,6.6446
2018-07-24,6.5574
2018-07-25,6.8674
2018-07-26,6.7608
2018-07-27,6.6155
2018-07-30,6.7511
2018-07-31,6.7511
2018-08-01,6.6833
2018-08-02,6.9616
2018-08-03,6.8152
2018-08-06,6.6199
2018-08-07,6.8054
2018-08-08,6.8054
2018-08-09,6.9128
2018-08-10,6.8152
2018-08-13,6.6882
2018-08-14,6.7663
2018-08-15,6.4441
2018-08-16,6.4148
2018-08-17,6.4539
2018-08-20,6.6492
2018-08-21,6.7468
2018-08-22,6.8347
2018-08-23,6.8152
2018-08-24,6.7859
2018-08-27,6.8737
2018-08-28,6.8054
2018-08-29,6.8347
2018-08-30,6.7273
2018-08-31,6.6199
2018-09-04,6.5711
2018-09-05,6.3953
2018-09-06,6.2098
2018-09-07,6.1805
2018-09-10,6.1414
2018-09-11,6.2781
2018-09-12,6.2489
2018-09-13,6.2977
2018-09-14,6.3563
2018-09-17,6.1805
2018-09-18,6.3953
2018-09-19,6.4344
2018-09-20,6.2586
2018-09-21,6.2977
2018-09-24,6.3367
2018-09-25,6.3758
2018-09-26,6.1219
2018-09-27,6.1805
2018-09-28,6.5808
2018-10-01,6.8933
2018-10-02,6.7273
2018-10-03,6.7859
2018-10-04,6.698
2018-10-05,6.6785
2018-10-08,6.7566
2018-10-09,6.6882
2018-10-10,6.2977
2018-10-11,6.2489
2018-10-12,6.3074
2018-10-15,6.4637
2018-10-16,6.3367
2018-10-17,6.366
2018-10-18,6.6394
2018-10-19,6.737
2018-10-22,6.7761
2018-10-23,6.6199
2018-10-24,6.2098
2018-10-25,6.3172
2018-10-26,6.3563
2018-10-29,6.2586
2018-10-30,6.3758
2018-10-31,6.4734
2018-11-01,6.7442
2018-11-02,6.8722
2018-11-05,6.9805
2018-11-06,7.1971
2018-11-07,7.0691
2018-11-08,7.0198
2018-11-09,6.9509
2018-11-12,6.5276
2018-11-13,6.1731
2018-11-14,6.1436
2018-11-15,5.6513
2018-11-16,5.2083
2018-11-19,4.6077
2018-11-20,4.3419
2018-11-21,4.273
2018-11-23,4.1154
2018-11-26,4.1548
2018-11-27,4.2926
2018-11-28,4.4305
2018-11-29,4.4797
2018-11-30,4.3419
2018-12-03,4.3616
2018-12-04,4.204
2018-12-06,4.0662
2018-12-07,4.0662
2018-12-10,3.8397
2018-12-11,3.8988
2018-12-12,4.0268
2018-12-13,3.8791
2018-12-14,3.948
2018-12-17,3.761
2018-12-18,3.5247
2018-12-19,3.8496
2018-12-20,3.4853
2018-12-21,3.4656
2018-12-24,3.2687
2018-12-26,3.6231
2018-12-27,3.3967
2018-12-28,3.3081
2018-12-31,3.2884
2019-01-02,3.3967
2019-01-03,3.3376
2019-01-04,3.6527
2019-01-07,3.8201
2019-01-08,3.8988
2019-01-09,3.9185
2019-01-10,3.8004
2019-01-11,3.5838
2019-01-14,3.5345
2019-01-15,3.4853
2019-01-16,3.4656
2019-01-17,3.4164
2019-01-18,3.6724
2019-01-22,3.4361
2019-01-23,3.3672
2019-01-24,3.4656
2019-01-25,3.5936
2019-01-28,3.4558
2019-01-29,3.4262
2019-01-30,3.505
2019-01-31,3.51
2019-02-01,3.54
2019-02-04,3.53
2019-02-05,3.54
2019-02-06,3.46
2019-02-07,3.31
2019-02-08,3.42
2019-02-11,3.57
2019-02-12,3.63
2019-02-13,3.66
2019-02-14,3.8
2019-02-15,3.81
2019-02-19,3.82
2019-02-20,3.89
2019-02-21,4.16
2019-02-22,4.09
2019-02-25,4.13
2019-02-26,4.2
2019-02-27,4.18
2019-02-28,4.1
2019-03-01,4.11
2019-03-04,4.05
2019-03-05,4.12
2019-03-06,3.86
2019-03-07,3.87
2019-03-08,3.58
2019-03-11,3.63
2019-03-12,3.79
2019-03-13,3.83
2019-03-14,3.98
2019-03-15,3.91
2019-03-18,4.21
2019-03-19,4.2
2019-03-20,4.3
2019-03-21,4.29
2019-03-22,4.04
2019-03-25,4
2019-03-26,4.02
2019-03-27,4.05
2019-03-28,3.95
2019-03-29,3.92
2019-04-01,4.07
2019-04-02,4.13
2019-04-03,4.17
2019-04-04,4.28
2019-04-05,4.49
2019-04-08,4.58
2019-04-09,4.34
2019-04-10,4.51
2019-04-11,4.56
2019-04-12,4.7
2019-04-15,4.61
2019-04-16,4.57
2019-04-17,4.64
2019-04-18,4.5
2019-04-22,4.76
2019-04-23,4.62
2019-04-24,4.02
2019-04-25,3.85
2019-04-26,3.82
2019-04-29,3.9
2019-04-30,4.16
2019-05-01,4.14
2019-05-02,4.32
2019-05-03,4.48
2019-05-06,4.44
2019-05-07,4.23
2019-05-08,4.24
2019-05-09,4.2
2019-05-10,4.25
2019-05-13,4.02
2019-05-14,4.19
2019-05-15,4.29
2019-05-16,4.39
2019-05-17,4.28
2019-05-20,4.26
2019-05-21,4.31
2019-05-22,4.2
2019-05-23,3.85
2019-05-24,3.74
2019-05-28,3.63
2019-05-29,3.32
2019-05-30,3.26
2019-05-31,3.21
2019-06-03,3.14
2019-06-04,3.2
2019-06-05,2.97
2019-06-06,2.82
2019-06-07,2.96
2019-06-10,3
2019-06-11,3.1
2019-06-12,2.97
2019-06-13,3.075
2019-06-14,3.065
2019-06-17,3.065
2019-06-18,3.145
2019-06-19,3.21
2019-06-20,3.18
2019-06-21,3.065
2019-06-24,3.105
2019-06-25,3.095
2019-06-26,3.22
2019-06-27,3.285
2019-06-28,3.365
2019-07-01,3.435
2019-07-02,3.275
2019-07-03,3.24
2019-07-04,3.24
2019-07-05,3.355
2019-07-08,3.435
2019-07-09,3.7
2019-07-10,3.85
2019-07-11,4.035
2019-07-12,4.355
2019-07-15,4.385
2019-07-16,4.545
2019-07-17,4.425
2019-07-18,4.525
2019-07-19,4.42
2019-07-22,4.645
2019-07-23,4.575
2019-07-24,4.78
2019-07-25,4.45
2019-07-26,4.59
2019-07-29,4.265
2019-07-30,4.375
2019-07-31,4.575
2019-08-01,4.21
2019-08-02,4.095
2019-08-05,3.675
2019-08-06,3.585
2019-08-07,3.505
2019-08-08,3.645
2019-08-09,3.385
2019-08-12,3.3
2019-08-13,3.425
2019-08-14,3.275
2019-08-15,3.215
2019-08-16,3.5
2019-08-19,3.705
2019-08-20,3.75
2019-08-21,3.925
2019-08-22,3.745
2019-08-23,3.545
2019-08-26,3.605
2019-08-27,3.45
2019-08-28,3.535
2019-08-29,3.605
2019-08-30,3.665
2019-09-02,3.655
2019-09-03,3.535
2019-09-04,3.585
2019-09-05,3.73
2019-09-06,3.775
2019-09-09,3.995
2019-09-10,4.355
2019-09-11,4.425
2019-09-12,4.435
2019-09-13,4.465
2019-09-16,4.595
2019-09-17,4.64
2019-09-18,4.585
2019-09-19,4.555
2019-09-20,4.445
2019-09-23,4.66
2019-09-24,4.515
2019-09-25,4.495
2019-09-26,4.48
2019-09-27,4.22
2019-09-30,4.015
2019-10-01,3.925
2019-10-02,3.645
2019-10-03,3.655
2019-10-04,3.705
2019-10-07,4.115
2019-10-08,4.225
2019-10-09,4.245
2019-10-10,4.385
2019-10-11,4.835
2019-10-14,4.895
2019-10-15,4.78
2019-10-16,4.53
2019-10-17,4.56
2019-10-18,4.3
2019-10-21,4.13
2019-10-22,5.06
2019-10-23,5.55
2019-10-24,5.555
2019-10-25,5.525
2019-10-28,5.665
2019-10-29,5.495
2019-10-30,5.375
2019-10-31,5.095
2019-11-01,5.425
2019-11-04,5.545
2019-11-05,5.51
2019-11-06,5.235
2019-11-07,5.045
2019-11-08,5.01
2019-11-11,5.045
2019-11-12,5.08
2019-11-13,4.9
2019-11-14,5.165
2019-11-15,5.405
2019-11-18,5.185
2019-11-19,5.055
2019-11-20,4.94
2019-11-21,4.995
2019-11-22,5.055
2019-11-25,5.2
