date,close
2014-06-13,110.0499
2014-06-16,109.395
2014-06-17,110.956
2014-06-18,111.1444
2014-06-19,110.9022
2014-06-20,111.898
2014-06-23,111.4494
2014-06-24,110.8214
2014-06-25,111.3956
2014-06-26,111.0816
2014-06-27,111.3507
2014-06-30,111.2879
2014-07-01,112.1133
2014-07-02,111.0906
2014-07-03,112.0864
2014-07-07,111.8262
2014-07-08,110.5972
2014-07-09,110.1845
2014-07-10,109.1707
2014-07-11,109.4578
2014-07-14,109.1169
2014-07-15,110.4985
2014-07-16,109.6821
2014-07-17,109.5027
2014-07-18,109.5027
2014-07-21,109.8525
2014-07-22,109.7269
2014-07-23,109.8705
2014-07-24,110.8573
2014-07-25,111.4225
2014-07-28,110.0589
2014-07-29,109.6552
2014-07-30,110.0858
2014-07-31,109.0003
2014-08-01,107.7712
2014-08-04,107.7712
2014-08-05,107.4662
2014-08-06,107.6815
2014-08-07,106.596
2014-08-08,107.5649
2014-08-11,107.2778
2014-08-12,107.206
2014-08-13,107.8609
2014-08-14,107.7443
2014-08-15,107.6187
2014-08-18,108.6145
2014-08-19,108.9106
2014-08-20,108.9106
2014-08-21,110.6061
2014-08-22,110.0499
2014-08-25,111.0637
2014-08-26,111.4046
2014-08-27,111.0457
2014-08-28,110.6668
2014-08-29,111.5419
2014-09-02,112.2456
2014-09-03,111.5058
2014-09-04,111.9569
2014-09-05,112.3088
2014-09-08,112.408
2014-09-09,111.6953
2014-09-10,112.805
2014-09-11,113.4456
2014-09-12,113.6261
2014-09-15,113.3915
2014-09-16,113.4095
2014-09-17,113.9418
2014-09-18,114.7087
2014-09-19,115.1959
2014-09-22,114.2305
2014-09-23,113.1028
2014-09-24,113.3915
2014-09-25,112.0021
2014-09-26,112.6246
2014-09-29,112.1735
2014-09-30,111.2352
2014-10-01,110.3239
2014-10-02,110.2608
2014-10-03,111.2893
2014-10-06,110.8562
2014-10-07,109.16
2014-10-08,111.4156
2014-10-09,109.1781
2014-10-10,108.2308
2014-10-13,107.3105
2014-10-14,108.1766
2014-10-15,104.5407
2014-10-16,104.8023
2014-10-17,101.825
2014-10-20,102.0325
2014-10-21,103.8279
2014-10-22,103.6835
2014-10-23,104.261
2014-10-24,104.9918
2014-10-27,105.6143
2014-10-28,106.8955
2014-10-29,110.8201
2014-10-30,113.3373
2014-10-31,110.2337
2014-11-03,109.8006
2014-11-04,109.4127
2014-11-05,110.8201
2014-11-06,112.2637
2014-11-07,112.3629
2014-11-10,112.4712
2014-11-11,112.6426
2014-11-12,113.3373
2014-11-13,113.1028
2014-11-14,112.7238
2014-11-17,112.5163
2014-11-18,112.5614
2014-11-19,112.4351
2014-11-20,112.6065
2014-11-21,112.4893
2014-11-24,113.7253
2014-11-25,113.8787
2014-11-26,114.6408
2014-11-28,114.3323
2014-12-01,112.6811
2014-12-02,114.0601
2014-12-03,115.2214
2014-12-04,115.5662
2014-12-05,116.1559
2014-12-08,116.0017
2014-12-09,115.9472
2014-12-10,111.8374
2014-12-11,112.4815
2014-12-12,110.5491
2014-12-15,109.9503
2014-12-16,108.6075
2014-12-17,110.5581
2014-12-18,112.8081
2014-12-19,113.5067
2014-12-22,114.1327
2014-12-23,115.4936
2014-12-24,114.8767
2014-12-26,114.9855
2014-12-29,115.6932
2014-12-30,115.5208
2014-12-31,113.9694
2015-01-02,113.7607
2015-01-05,110.0954
2015-01-06,107.6277
2015-01-07,107.8545
2015-01-08,110.041
2015-01-09,107.8273
2015-01-12,107.1196
2015-01-13,107.8273
2015-01-14,104.6156
2015-01-15,103.7719
2015-01-16,104.3616
2015-01-20,102.3928
2015-01-21,101.8666
2015-01-22,106.2668
2015-01-23,104.534
2015-01-26,106.0581
2015-01-27,105.3777
2015-01-28,103.1731
2015-01-29,104.6973
2015-01-30,102.665
2015-02-02,104.8334
2015-02-03,107.3192
2015-02-04,107.5914
2015-02-05,108.3807
2015-02-06,110.3676
2015-02-09,109.415
2015-02-10,109.914
2015-02-11,109.3515
2015-02-12,111.9372
2015-02-13,112.4089
2015-02-17,112.5269
2015-02-18,110.413
2015-02-19,109.9684
2015-02-20,110.0864
2015-02-23,109.9593
2015-02-24,110.3041
2015-02-25,110.286
2015-02-26,110.733
2015-02-27,110.4137
2015-03-02,112.0288
2015-03-03,111.9923
2015-03-04,111.7368
2015-03-05,112.4394
2015-03-06,113.5436
2015-03-09,113.5801
2015-03-10,110.6783
2015-03-11,111.0159
2015-03-12,114.6477
2015-03-13,114.2644
2015-03-16,114.9762
2015-03-17,115.615
2015-03-18,115.9526
2015-03-19,115.396
2015-03-20,116.8012
2015-03-23,116.1898
2015-03-24,115.0036
2015-03-25,112.5307
2015-03-26,113.2516
2015-03-27,114.0363
2015-03-30,115.7792
2015-03-31,115.8887
2015-04-01,115.2135
2015-04-02,116.0803
2015-04-06,112.9322
2015-04-07,113.6439
2015-04-08,113.3793
2015-04-09,113.7899
2015-04-10,113.5071
2015-04-13,113.3428
2015-04-14,112.4759
2015-04-15,113.1329
2015-04-16,112.4303
2015-04-17,110.2403
2015-04-20,108.7803
2015-04-21,109.0358
2015-04-22,109.9574
2015-04-23,109.6745
2015-04-24,109.1453
2015-04-27,108.0138
2015-04-28,109.8935
2015-04-29,109.6563
2015-04-30,109.2
2015-05-01,108.8533
2015-05-04,111.0707
2015-05-05,109.7749
2015-05-06,110.2494
2015-05-07,109.6654
2015-05-08,110.8699
2015-05-11,110.6418
2015-05-12,110.6874
2015-05-13,111.3444
2015-05-14,112.0562
2015-05-15,110.5962
2015-05-18,111.7915
2015-05-19,113.1968
2015-05-20,112.7679
2015-05-21,112.7953
2015-05-22,112.3847
2015-05-26,111.4083
2015-05-27,111.5725
2015-05-28,111.7744
2015-05-29,110.9393
2015-06-01,109.994
2015-06-02,111.0678
2015-06-03,112.5545
2015-06-04,111.9672
2015-06-05,113.6742
2015-06-08,113.7752
2015-06-09,114.5736
2015-06-10,116.0329
2015-06-11,115.831
2015-06-12,115.7575
2015-06-15,115.4088
2015-06-16,115.9411
2015-06-17,114.9958
2015-06-18,116.1614
2015-06-19,115.2987
2015-06-22,116.5744
2015-06-23,117.6206
2015-06-24,117.0241
2015-06-25,116.8313
2015-06-26,117.4371
2015-06-29,114.4084
2015-06-30,114.6562
2015-07-01,116.8221
2015-07-02,115.5556
2015-07-06,115.3078
2015-07-07,114.748
2015-07-08,112.8941
2015-07-09,113.9771
2015-07-10,115.831
2015-07-13,116.8405
2015-07-14,116.7212
2015-07-15,117.4554
2015-07-16,120.0527
2015-07-17,120.429
2015-07-20,121.1448
2015-07-21,121.0163
2015-07-22,122.2461
2015-07-23,121.3926
2015-07-24,120.7869
2015-07-27,119.9793
2015-07-28,120.9704
2015-07-29,121.2917
2015-07-30,121.3467
2015-07-31,120.3647
2015-08-03,119.9058
2015-08-04,120.2729
2015-08-05,121.3651
2015-08-06,120.7961
2015-08-07,120.016
2015-08-10,121.824
2015-08-11,120.2087
2015-08-12,118.3456
2015-08-13,118.8688
2015-08-14,119.7406
2015-08-17,120.1445
2015-08-18,120.3831
2015-08-19,119.2267
2015-08-20,115.1243
2015-08-21,112.2333
2015-08-24,106.5615
2015-08-25,103.6706
2015-08-26,108.0116
2015-08-27,110.7466
2015-08-28,109.8696
2015-08-31,109.1496
2015-09-01,103.9893
2015-09-02,106.4079
2015-09-03,109.168
2015-09-04,108.0603
2015-09-08,110.9035
2015-09-09,111.1527
2015-09-10,111.1435
2015-09-11,111.7251
2015-09-14,112.4082
2015-09-15,113.359
2015-09-16,112.6943
2015-09-17,111.125
2015-09-18,109.2326
2015-09-21,110.8296
2015-09-22,108.9188
2015-09-23,108.9188
2015-09-24,109.8973
2015-09-25,111.8912
2015-09-28,110.7004
2015-09-29,110.8666
2015-09-30,112.5743
2015-10-01,108.1434
2015-10-02,107.691
2015-10-05,109.1865
2015-10-06,108.4018
2015-10-07,110.4235
2015-10-08,110.9589
2015-10-09,110.3865
2015-10-12,110.9312
2015-10-13,110.0819
2015-10-14,107.1833
2015-10-15,110.1373
2015-10-16,108.0049
2015-10-19,104.7001
2015-10-20,106.6202
2015-10-21,106.3156
2015-10-22,109.6665
2015-10-23,113.1744
2015-10-26,113.7467
2015-10-27,113.6913
2015-10-28,116.5694
2015-10-29,114.2112
2015-10-30,111.2682
2015-11-02,111.6582
2015-11-03,111.5375
2015-11-04,110.999
2015-11-05,111.9645
2015-11-06,114.8054
2015-11-09,114.7776
2015-11-10,114.6569
2015-11-11,115.641
2015-11-12,115.1675
2015-11-13,113.6913
2015-11-16,114.6383
2015-11-17,115.3717
2015-11-18,116.328
2015-11-19,116.4487
2015-11-20,116.1237
2015-11-23,116.1237
2015-11-24,115.6688
2015-11-25,115.9938
2015-11-27,116.4672
2015-11-30,116.3558
2015-12-01,117.1171
2015-12-02,116.1145
2015-12-03,113.9977
2015-12-04,117.0336
2015-12-07,116.5972
2015-12-08,114.7126
2015-12-09,112.3173
2015-12-10,113.8677
2015-12-11,111.7881
2015-12-14,112.2152
2015-12-15,115.3625
2015-12-16,117.3678
2015-12-17,115.8081
2015-12-18,111.4353
2015-12-21,112.0017
2015-12-22,113.0508
2015-12-23,114.4248
2015-12-24,114.4991
2015-12-28,113.877
2015-12-29,115.1211
2015-12-30,113.8585
2015-12-31,112.503
2016-01-04,109.0679
2016-01-05,109.6714
2016-01-06,107.4525
2016-01-07,104.426
2016-01-08,102.2814
2016-01-11,101.3158
2016-01-12,102.5784
2016-01-13,99.0784
2016-01-14,99.5333
2016-01-15,97.0081
2016-01-19,98.7349
2016-01-20,97.2309
2016-01-21,94.9192
2016-01-22,97.0916
2016-01-25,94.5014
2016-01-26,98.1129
2016-01-27,99.849
2016-01-28,100.4524
2016-01-29,102.2906
2016-02-01,100.4153
2016-02-02,98.0015
2016-02-03,98.5678
2016-02-04,100.4431
2016-02-05,100.0811
2016-02-08,98.3171
2016-02-09,99.8211
2016-02-10,97.9179
2016-02-11,93.5637
2016-02-12,98.345
2016-02-16,101.0837
2016-02-17,100.7588
2016-02-18,98.5585
2016-02-19,99.3848
2016-02-22,101.6036
2016-02-23,98.3821
2016-02-24,97.3423
2016-02-25,97.7508
2016-02-26,99.3022
2016-02-29,95.8442
2016-03-01,98.3209
2016-03-02,101.7602
2016-03-03,102.6668
2016-03-04,103.022
2016-03-07,102.536
2016-03-08,100.7695
2016-03-09,100.9378
2016-03-10,100.7415
2016-03-11,104.0407
2016-03-14,104.2743
2016-03-15,104.0968
2016-03-16,103.4238
2016-03-17,103.8164
2016-03-18,105.2463
2016-03-21,105.1622
2016-03-22,105.0874
2016-03-23,104.6482
2016-03-24,103.9753
2016-03-28,104.05
2016-03-29,103.8818
2016-03-30,104.6482
2016-03-31,103.7416
2016-04-01,105.0688
2016-04-04,104.8444
2016-04-05,102.7883
2016-04-06,103.6201
2016-04-07,100.7602
2016-04-08,101.7415
2016-04-11,102.592
2016-04-12,104.1622
2016-04-13,107.9754
2016-04-14,108.6203
2016-04-15,107.3025
2016-04-18,108.2371
2016-04-19,110.1437
2016-04-20,112.3961
2016-04-21,110.5643
2016-04-22,111.2559
2016-04-25,111.1157
2016-04-26,111.8073
2016-04-27,112.555
2016-04-28,111.3493
2016-04-29,110.5829
2016-05-02,111.1717
2016-05-03,109.0595
2016-05-04,106.6576
2016-05-05,106.751
2016-05-06,107.1903
2016-05-09,106.4426
2016-05-10,108.2184
2016-05-11,107.9193
2016-05-12,107.5828
2016-05-13,105.8258
2016-05-16,106.5922
2016-05-17,105.7697
2016-05-18,109.1063
2016-05-19,108.2464
2016-05-20,108.7791
2016-05-23,108.2558
2016-05-24,110.0969
2016-05-25,111.2185
2016-05-26,110.7271
2016-05-27,112.2314
2016-05-31,112.3536
2016-06-01,112.1374
2016-06-02,112.8989
2016-06-03,111.216
2016-06-06,112.8049
2016-06-07,111.404
2016-06-08,111.9117
2016-06-09,111.2912
2016-06-10,110.5202
2016-06-13,110.6519
2016-06-14,108.6116
2016-06-15,109.298
2016-06-16,109.1569
2016-06-17,110.2006
2016-06-20,110.3792
2016-06-21,110.8211
2016-06-22,110.3134
2016-06-23,113.2186
2016-06-24,105.9039
2016-06-27,102.2747
2016-06-28,104.879
2016-06-29,106.6936
2016-06-30,111.1596
2016-07-01,110.0501
2016-07-05,106.1201
2016-07-06,106.6372
2016-07-07,107.3706
2016-07-08,109.0065
2016-07-11,109.5612
2016-07-12,111.0373
2016-07-13,110.9057
2016-07-14,112.316
2016-07-15,111.9399
2016-07-18,111.4416
2016-07-19,111.6297
2016-07-20,107.0039
2016-07-21,105.9885
2016-07-22,107.6338
2016-07-25,106.5808
2016-07-26,107.6056
2016-07-27,108.0569
2016-07-28,107.9629
2016-07-29,107.709
2016-08-01,106.0355
2016-08-02,105.3021
2016-08-03,107.0885
2016-08-04,107.1543
2016-08-05,110.1912
2016-08-08,110.6895
2016-08-09,110.5296
2016-08-10,109.5988
2016-08-11,109.8057
2016-08-12,109.3544
2016-08-15,111.0373
2016-08-16,110.351
2016-08-17,110.445
2016-08-18,110.8493
2016-08-19,110.6236
2016-08-22,110.8305
2016-08-23,110.9527
2016-08-24,110.1912
2016-08-25,110.4262
2016-08-26,110.6613
2016-08-29,111.1447
2016-08-30,111.5609
2016-08-31,111.9203
2016-09-01,110.965
2016-09-02,110.9839
2016-09-06,109.5273
2016-09-07,109.7165
2016-09-08,109.9151
2016-09-09,110.7475
2016-09-12,111.7311
2016-09-13,109.8489
2016-09-14,109.3098
2016-09-15,109.3855
2016-09-16,108.591
2016-09-19,108.799
2016-09-20,109.0828
2016-09-21,109.4328
2016-09-22,110.2367
2016-09-23,110.7758
2016-09-26,107.9762
2016-09-27,109.272
2016-09-28,109.4422
2016-09-29,108.3356
2016-09-30,109.8111
2016-10-03,108.9598
2016-10-04,110.1705
2016-10-05,111.6649
2016-10-06,111.9297
2016-10-07,111.4474
2016-10-10,111.5041
2016-10-11,109.7733
2016-10-12,110.5299
2016-10-13,107.0398
2016-10-14,107.7019
2016-10-17,107.8248
2016-10-18,109.026
2016-10-19,111.1353
2016-10-20,112.4121
2016-10-21,112.4689
2016-10-24,112.4783
2016-10-25,112.6013
2016-10-26,113.6795
2016-10-27,115.3726
2016-10-28,115.4577
2016-10-31,116.082
2016-11-01,116.2333
2016-11-02,115.2118
2016-11-03,114.8335
2016-11-04,115.2118
2016-11-07,118.1155
2016-11-08,118.3519
2016-11-09,124.4147
2016-11-10,126.4672
2016-11-11,128.6331
2016-11-14,132.3692
2016-11-15,131.3288
2016-11-16,129.3331
2016-11-17,132.3313
2016-11-18,133.6082
2016-11-21,133.4191
2016-11-22,134.5824
2016-11-23,135.7931
2016-11-25,135.9255
2016-11-28,133.0975
2016-11-29,133.1637
2016-11-30,136.8233
2016-12-01,139.8176
2016-12-02,138.9336
2016-12-05,140.0552
2016-12-06,141.5476
2016-12-07,143.8099
2016-12-08,145.9107
2016-12-09,146.5475
2016-12-12,145.2453
2016-12-13,145.6445
2016-12-14,145.3023
2016-12-15,146.2434
2016-12-16,144.9506
2016-12-19,146.557
2016-12-20,149.2566
2016-12-21,148.2015
2016-12-22,148.3156
2016-12-23,149.3327
2016-12-27,150.2832
2016-12-28,148.9049
2016-12-29,147.9354
2016-12-30,148.6958
2017-01-03,148.9905
2017-01-04,149.903
2017-01-05,147.6977
2017-01-06,148.8194
2017-01-09,148.249
2017-01-10,148.9525
2017-01-11,149.2471
2017-01-12,147.6692
2017-01-13,148.3536
2017-01-17,145.1312
2017-01-18,146.9943
2017-01-19,147.6692
2017-01-20,149.2661
2017-01-23,148.23
2017-01-24,151.6996
2017-01-25,154.1805
2017-01-26,155.5398
2017-01-27,155.9296
2017-01-30,155.1786
2017-01-31,154.5322
2017-02-01,154.6748
2017-02-02,154.095
2017-02-03,155.787
2017-02-06,155.3687
2017-02-07,154.4657
2017-02-08,154.7509
2017-02-09,156.3478
2017-02-10,157.1368
2017-02-13,158.5531
2017-02-14,159.9029
2017-02-15,160.7679
2017-02-16,159.2945
2017-02-17,159.6082
2017-02-21,159.6272
2017-02-22,159.7223
2017-02-23,161.3858
2017-02-24,160.3306
2017-02-27,159.6462
2017-02-28,158.7147
2017-03-01,163.6956
2017-03-02,159.5521
2017-03-03,160.4018
2017-03-06,159.4089
2017-03-07,159.1798
2017-03-08,159.1129
2017-03-09,158.9888
2017-03-10,158.6642
2017-03-13,157.9864
2017-03-14,158.4446
2017-03-15,156.3347
2017-03-16,157.0412
2017-03-17,154.7499
2017-03-20,153.652
2017-03-21,148.0287
2017-03-22,147.7518
2017-03-23,147.9523
2017-03-24,147.9523
2017-03-27,147.1885
2017-03-28,148.993
2017-03-29,147.4368
2017-03-30,149.5467
2017-03-31,147.7232
2017-04-03,147.4941
2017-04-04,147.2076
2017-04-05,145.4796
2017-04-06,146.4248
2017-04-07,146.0906
2017-04-10,144.6872
2017-04-11,144.6204
2017-04-12,143.0355
2017-04-13,141.2311
2017-04-17,146.7494
2017-04-18,144.9736
2017-04-19,144.6204
2017-04-20,147.2936
2017-04-21,146.9403
2017-04-24,149.8618
2017-04-25,150.5873
2017-04-26,151.5039
2017-04-27,149.8427
2017-04-28,148.3724
2017-05-01,149.8522
2017-05-02,149.6994
2017-05-03,152.0862
2017-05-04,151.8858
2017-05-05,151.733
2017-05-08,152.6591
2017-05-09,152.0958
2017-05-10,152.0862
2017-05-11,151.2556
2017-05-12,150.6637
2017-05-15,153.2701
2017-05-16,155.0172
2017-05-17,149.4417
2017-05-18,149.9668
2017-05-19,150.1768
2017-05-22,151.5611
2017-05-23,153.9957
2017-05-24,153.146
2017-05-25,153.9002
2017-05-26,152.9455
2017-05-30,151.6218
2017-05-31,150.0871
2017-06-01,152.2261
2017-06-02,151.1614
2017-06-05,150.7681
2017-06-06,149.5116
2017-06-07,150.3269
2017-06-08,152.5906
2017-06-09,156.696
2017-06-12,155.8136
2017-06-13,156.0438
2017-06-14,155.9191
2017-06-15,154.9215
2017-06-16,155.075
2017-06-19,156.0246
2017-06-20,155.1997
2017-06-21,154.4611
2017-06-22,152.9839
2017-06-23,151.4012
2017-06-26,152.3316
2017-06-27,152.6674
2017-06-28,155.0558
2017-06-29,154.605
2017-06-30,155.3436
2017-07-03,157.6073
2017-07-05,157.732
2017-07-06,156.9167
2017-07-07,158.3746
2017-07-10,157.6552
2017-07-11,158.4322
2017-07-12,158.4993
2017-07-13,159.7463
2017-07-14,159.0077
2017-07-17,159.2188
2017-07-18,158.7296
2017-07-19,155.8519
2017-07-20,153.7992
2017-07-21,151.6602
2017-07-24,153.7992
2017-07-25,154.9119
2017-07-26,151.5355
2017-07-27,152.5235
2017-07-28,154.039
2017-07-31,156.4946
2017-08-01,156.9071
2017-08-02,158.1924
2017-08-03,157.1085
2017-08-04,156.9071
2017-08-07,156.9454
2017-08-08,157.6648
2017-08-09,156.3507
2017-08-10,152.2453
2017-08-11,150.2118
2017-08-14,152.6002
2017-08-15,152.0343
2017-08-16,152.1302
2017-08-17,147.5932
2017-08-18,147.1711
2017-08-21,146.2695
2017-08-22,147.3342
2017-08-23,146.9601
2017-08-24,146.5956
2017-08-25,147.526
2017-08-28,145.7994
2017-08-29,144.0057
2017-08-30,143.919
2017-08-31,142.5405
2017-09-01,143.6394
2017-09-05,140.2172
2017-09-06,139.9376
2017-09-07,137.3444
2017-09-08,138.8868
2017-09-11,141.2487
2017-09-12,143.6587
2017-09-13,145.0855
2017-09-14,144.5264
2017-09-15,144.5938
2017-09-18,146.2134
2017-09-19,147.216
2017-09-20,148.9994
2017-09-21,148.8645
2017-09-22,148.286
2017-09-25,149.144
2017-09-26,149.8478
2017-09-27,152.2289
2017-09-28,153.4918
2017-09-29,155.2463
2017-10-02,155.5837
2017-10-03,155.5066
2017-10-04,154.9089
2017-10-05,155.7572
2017-10-06,156.2489
2017-10-09,155.3716
2017-10-10,157.29
2017-10-11,157.2804
2017-10-12,156.9719
2017-10-13,157.3382
2017-10-16,158.3119
2017-10-17,158.2348
2017-10-18,154.8414
2017-10-19,156.4224
2017-10-20,159.2566
2017-10-23,159.006
2017-10-24,159.7868
2017-10-25,159.864
2017-10-26,161.5703
2017-10-27,161.7824
2017-10-30,160.8955
2017-10-31,160.7701
2017-11-01,161.2618
2017-11-02,162.9488
2017-11-03,162.6885
2017-11-06,162.6403
2017-11-07,157.0201
2017-11-08,155.4102
2017-11-09,152.9037
2017-11-10,151.448
2017-11-13,153.7039
2017-11-14,154.9282
2017-11-15,155.4198
2017-11-16,154.1184
2017-11-17,154.7932
2017-11-20,155.7958
2017-11-21,154.4269
2017-11-22,154.1666
2017-11-24,153.4146
2017-11-27,153.7617
2017-11-28,158.4276
2017-11-29,163.026
2017-11-30,163.5973
2017-12-01,164.1008
2017-12-04,166.7927
2017-12-05,165.0304
2017-12-06,164.1395
2017-12-07,165.6501
2017-12-08,166.2795
2017-12-11,165.1078
2017-12-12,167.0251
2017-12-13,165.6017
2017-12-14,163.6844
2017-12-15,165.4855
2017-12-18,168.3517
2017-12-19,168.3904
2017-12-20,167.0638
2017-12-21,168.0903
2017-12-22,167.5867
2017-12-26,166.541
2017-12-27,166.1343
2017-12-28,166.8314
2017-12-29,165.5726
2018-01-02,165.7663
2018-01-03,167.6255
2018-01-04,167.945
2018-01-05,167.3447
2018-01-08,166.9573
2018-01-09,169.3684
2018-01-10,171.1501
2018-01-11,172.3509
2018-01-12,172.8641
2018-01-16,172.1475
2018-01-17,173.5322
2018-01-18,180.2523
2018-01-19,182.799
2018-01-22,182.7796
2018-01-23,182.8474
2018-01-24,183.4575
2018-01-25,181.7145
2018-01-26,183.3703
2018-01-29,183.777
2018-01-30,184.5323
2018-01-31,184.7356
2018-02-01,186.7401
2018-02-02,183.2057
2018-02-05,174.1132
2018-02-06,179.1969
2018-02-07,179.1097
2018-02-08,172.6995
2018-02-09,176.8342
2018-02-12,178.8967
2018-02-13,180.2523
2018-02-14,185.8976
2018-02-15,185.0455
2018-02-16,185.5684
2018-02-20,184.6001
2018-02-21,186.711
2018-02-22,183.4962
2018-02-23,187.3791
2018-02-26,189.1318
2018-02-27,186.101
2018-02-28,183.8254
2018-03-01,182.8668
2018-03-02,185.6666
2018-03-05,188.3595
2018-03-06,189.9053
2018-03-07,189.7595
2018-03-08,189.2734
2018-03-09,191.3344
2018-03-12,189.4872
2018-03-13,187.679
2018-03-14,185.0152
2018-03-15,185.0347
2018-03-16,185.0736
2018-03-19,184.0236
2018-03-20,183.4403
2018-03-21,184.3736
2018-03-22,177.3739
2018-03-23,172.5713
2018-03-26,179.1141
2018-03-27,175.3129
2018-03-28,175.5657
2018-03-29,179.2308
2018-04-02,174.8851
2018-04-03,177.928
2018-04-04,180.8057
2018-04-05,181.3696
2018-04-06,176.635
2018-04-09,177.7531
2018-04-10,181.2529
2018-04-11,179.7849
2018-04-12,181.9334
2018-04-13,178.0642
2018-04-16,176.5184
2018-04-17,172.4936
2018-04-18,173.0963
2018-04-19,175.2254
2018-04-20,176.4795
2018-04-23,176.917
2018-04-24,177.2475
2018-04-25,177.442
2018-04-26,177.3836
2018-04-27,179.3669
2018-04-30,177.1989
2018-05-01,177.6947
2018-05-02,174.5935
2018-05-03,174.5935
2018-05-04,175.4295
2018-05-07,175.8865
2018-05-08,176.0226
2018-05-09,178.9877
2018-05-10,180.5626
2018-05-11,180.4752
2018-05-14,179.1822
2018-05-15,179.2599
2018-05-16,179.1335
2018-05-17,179.1238
2018-05-18,176.7712
2018-05-21,176.985
2018-05-22,178.7738
2018-05-23,175.7309
2018-05-24,174.8851
2018-05-25,174.0977
2018-05-29,166.9619
2018-05-30,169.2854
2018-05-31,168.0645
2018-06-01,170.6038
2018-06-04,170.9945
2018-06-05,170.2718
2018-06-06,174.2956
2018-06-07,173.5241
2018-06-08,172.9771
2018-06-11,171.6782
2018-06-12,171.0726
2018-06-13,170.3304
2018-06-14,170.6331
2018-06-15,170.6624
2018-06-18,170.0081
2018-06-19,170.3011
2018-06-20,170.0081
2018-06-21,170.4573
2018-06-22,168.9435
2018-06-25,167.8301
2018-06-26,166.2088
2018-06-27,164.5387
2018-06-28,164.7438
2018-06-29,166.1795
2018-07-02,166.1209
2018-07-03,165.115
2018-07-05,165.1345
2018-07-06,165.0173
2018-07-09,168.5724
2018-07-10,167.8887
2018-07-11,166.8437
2018-07-12,164.9001
2018-07-13,162.5659
2018-07-16,164.1969
2018-07-17,164.568
2018-07-18,170.4085
2018-07-19,168.7384
2018-07-20,168.963
2018-07-23,170.555
2018-07-24,169.1779
2018-07-25,168.1915
2018-07-26,168.924
2018-07-27,171.5024
2018-07-30,171.5512
2018-07-31,169.3049
2018-08-01,169.51
2018-08-02,170.5745
2018-08-03,170.3597
2018-08-06,171.0922
2018-08-07,171.4828
2018-08-08,173.0162
2018-08-09,171.8344
2018-08-10,169.9006
2018-08-13,168.9923
2018-08-14,170.975
2018-08-15,169.5979
2018-08-16,172.8013
2018-08-17,172.3814
2018-08-20,171.4438
2018-08-21,172.9478
2018-08-22,172.8795
2018-08-23,172.4497
2018-08-24,172.1958
2018-08-27,173.1432
2018-08-28,173.6803
2018-08-29,173.4459
2018-08-30,172.2446
2018-08-31,174.0028
2018-09-04,176.1637
2018-09-05,176.537
2018-09-06,175.4663
2018-09-07,175.6333
2018-09-10,175.3386
2018-09-11,175.7119
2018-09-12,171.3508
2018-09-13,167.9719
2018-09-14,168.1781
2018-09-17,166.7048
2018-09-18,166.1056
2018-09-19,168.9639
2018-09-20,169.8087
2018-09-21,169.9265
2018-09-24,167.1272
2018-09-25,165.5949
2018-09-26,164.4162
2018-09-27,162.658
2018-09-28,161.6168
2018-10-01,161.7642
2018-10-02,162.0392
2018-10-03,164.1903
2018-10-04,166.1449
2018-10-05,165.3198
2018-10-08,167.0682
2018-10-09,166.3217
2018-10-10,162.8741
2018-10-11,157.5995
2018-10-12,155.7038
2018-10-15,156.1851
2018-10-16,155.91
2018-10-17,159.0237
2018-10-18,157.9138
2018-10-19,159.7408
2018-10-22,155.193
2018-10-23,155.969
2018-10-24,151.9025
2018-10-25,155.5466
2018-10-26,155.7136
2018-10-29,158.6799
2018-10-30,160.3006
2018-10-31,162.4714
2018-11-01,161.0864
2018-11-02,161.2632
2018-11-05,161.774
2018-11-06,161.273
2018-11-07,162.5107
2018-11-08,164.3965
2018-11-09,163.7581
2018-11-12,162.1963
2018-11-13,164.5242
2018-11-14,162.3535
2018-11-15,165.3002
2018-11-16,166.0369
2018-11-19,165.585
2018-11-20,165.2806
2018-11-21,164.8484
2018-11-23,164.2787
2018-11-26,167.0486
2018-11-27,164.4653
2018-11-28,165.4574
2018-11-29,165.6931
2018-11-30,166.9974
2018-12-03,166.5527
2018-12-04,159.1717
2018-12-06,159.3792
2018-12-07,155.99
2018-12-10,153.5
2018-12-11,151.7313
2018-12-12,152.4724
2018-12-13,147.8976
2018-12-14,146.0498
2018-12-17,144.6072
2018-12-18,142.384
2018-12-19,139.8644
2018-12-20,139.4197
2018-12-21,137.0681
2018-12-24,134.1236
2018-12-26,139.4
2018-12-27,138.9751
2018-12-28,139.5482
2018-12-31,141.4256
2019-01-02,143.1646
2019-01-03,142.1469
2019-01-04,146.5142
2019-01-07,148.3126
2019-01-08,148.9548
2019-01-09,150.5358
2019-01-10,148.6485
2019-01-11,149.0141
2019-01-14,149.2414
2019-01-15,149.6465
2019-01-16,152.5811
2019-01-17,161.2664
2019-01-18,163.6181
2019-01-22,164.6951
2019-01-23,165.5548
2019-01-24,166.4144
2019-01-25,166.3057
2019-01-28,165.6733
2019-01-29,165.9994
2019-01-30,164.2011
2019-01-31,162.5806
2019-02-01,162.047
2019-02-04,161.8593
2019-02-05,160.476
2019-02-06,159.7349
2019-02-07,164.705
2019-02-08,163.4304
2019-02-11,166.3452
2019-02-12,167.9756
2019-02-13,168.5882
2019-02-14,167.1258
2019-02-15,170.2185
2019-02-19,171.4141
2019-02-20,173.9041
2019-02-21,171.0189
2019-02-22,170.4162
2019-02-25,170.4162
2019-02-26,168.4795
2019-02-27,170.4754
2019-02-28,170.9991
2019-03-01,171.5258
2019-03-04,171.7743
2019-03-05,171.6053
2019-03-06,168.8524
2019-03-07,166.6063
2019-03-08,166.8051
2019-03-11,168.0474
2019-03-12,169.3096
2019-03-13,171.1084
2019-03-14,172.2612
2019-03-15,171.4562
2019-03-18,173.6526
2019-03-19,170.2935
2019-03-20,162.7801
2019-03-21,159.3315
2019-03-22,152.8417
2019-03-25,152.3448
2019-03-26,154.6207
2019-03-27,154.3524
2019-03-28,156.4295
2019-03-29,156.0518
2019-04-01,160.7328
2019-04-02,160.7427
2019-04-03,160.8818
2019-04-04,162.2832
2019-04-05,162.2136
2019-04-08,163.0484
2019-04-09,161.1303
2019-04-10,162.0446
2019-04-11,163.4857
2019-04-12,166.7256
2019-04-15,162.7105
2019-04-16,167.2424
2019-04-17,167.4412
2019-04-18,165.3143
2019-04-22,165.4634
2019-04-23,166.1194
2019-04-24,165.533
2019-04-25,166.7455
2019-04-26,167.9182
2019-04-29,169.5878
2019-04-30,169.0213
2019-05-01,166.8349
2019-05-02,168.3555
2019-05-03,169.3096
2019-05-06,168.7331
2019-05-07,166.5169
2019-05-08,166.1591
2019-05-09,165.0858
2019-05-10,166.3579
2019-05-13,160.6731
2019-05-14,161.6869
2019-05-15,160.3154
2019-05-16,162.8894
2019-05-17,162.7701
2019-05-20,164.5491
2019-05-21,165.2746
2019-05-22,164.6187
2019-05-23,161.7465
2019-05-24,163.9031
2019-05-28,161.2297
2019-05-29,163.7342
2019-05-30,161.18
2019-05-31,159.6
2019-06-03,162.31
2019-06-04,167.26
2019-06-05,166.36
2019-06-06,166.89
2019-06-07,165.76
2019-06-10,167.6
2019-06-11,167.76
2019-06-12,165.45
2019-06-13,166.56
2019-06-14,168.05
2019-06-17,165.23
2019-06-18,167.17
2019-06-19,165.97
2019-06-20,165.22
2019-06-21,166.56
2019-06-24,165.77
2019-06-25,166.12
2019-06-26,165.665
2019-06-27,168.2
2019-06-28,169.6
2019-07-01,170.34
2019-07-02,169.44
2019-07-03,171.6
2019-07-04,171.6
2019-07-05,174.325
2019-07-08,173.05
2019-07-09,174.45
2019-07-10,171.33
2019-07-11,173.62
2019-07-12,173.74
2019-07-15,172.275
2019-07-16,171.18
2019-07-17,170.62
2019-07-18,162.56
2019-07-19,162.86
2019-07-22,161.39
2019-07-23,162.48
2019-07-24,163.67
2019-07-25,163.2
2019-07-26,164.92
2019-07-29,163.64
2019-07-30,164.24
2019-07-31,164.5
2019-08-01,155.78
2019-08-02,157.61
2019-08-05,154.18
2019-08-06,154.58
2019-08-07,150.67
2019-08-08,152.58
2019-08-09,153.03
2019-08-12,149.76
2019-08-13,151.21
2019-08-14,144.98
2019-08-15,144.76
2019-08-16,147.75
2019-08-19,149.37
2019-08-20,146.57
2019-08-21,147.55
2019-08-22,148.51
2019-08-23,143.105
2019-08-26,145.54
2019-08-27,144.115
2019-08-28,145.23
2019-08-29,147.23
2019-08-30,146.32
2019-09-02,146.2
2019-09-03,142.8
2019-09-04,143.94
2019-09-05,147.21
2019-09-06,146.29
2019-09-09,153.91
2019-09-10,154.84
2019-09-11,154.81
2019-09-12,156.93
2019-09-13,158.41
2019-09-16,159.73
2019-09-17,157.9
2019-09-18,159.33
2019-09-19,156.75
2019-09-20,156.31
2019-09-23,156.03
2019-09-24,155.38
2019-09-25,157.335
2019-09-26,157.02
2019-09-27,158.015
2019-09-30,158
2019-10-01,153.78
2019-10-02,149.985
2019-10-03,150.66
2019-10-04,154.3
2019-10-07,154.41
2019-10-08,150.62
2019-10-09,152.595
2019-10-10,154.925
2019-10-11,156.48
2019-10-14,156.575
2019-10-15,158.86
2019-10-16,159.29
2019-10-17,152.15
2019-10-18,152.035
2019-10-21,154.1
2019-10-22,156.41
2019-10-23,157.87
2019-10-24,156.285
2019-10-25,156.57
2019-10-28,158.77
2019-10-29,158.02
2019-10-30,156.75
2019-10-31,156.38
2019-11-01,160.6
2019-11-04,164.14
2019-11-05,166.005
2019-11-06,166.3
2019-11-07,166.81
2019-11-08,167.515
2019-11-11,166.58
2019-11-12,165.44
2019-11-13,163.285
2019-11-14,162.95
2019-11-15,163.915
2019-11-18,162.84
2019-11-19,162.95
2019-11-20,163.11
2019-11-21,163.05
2019-11-22,164.86
2019-11-25,165.985
