date,close
2014-06-13,133.59
2014-06-16,133.94
2014-06-17,133.63
2014-06-18,134.07
2014-06-19,134.26
2014-06-20,134.15
2014-06-23,134.22
2014-06-24,134.24
2014-06-25,134.5
2014-06-26,134.32
2014-06-27,134.64
2014-06-30,135.12
2014-07-01,134.98
2014-07-02,134.74
2014-07-03,134.25
2014-07-07,134.25
2014-07-08,134.29
2014-07-09,134.58
2014-07-10,134.29
2014-07-11,134.24
2014-07-14,134.34
2014-07-15,133.82
2014-07-16,133.43
2014-07-17,133.44
2014-07-18,133.44
2014-07-21,133.38
2014-07-22,132.84
2014-07-23,132.78
2014-07-24,132.79
2014-07-25,132.5
2014-07-28,132.5
2014-07-29,132.29
2014-07-30,132.1
2014-07-31,132.09
2014-08-01,132.38
2014-08-04,132.4
2014-08-05,131.94
2014-08-06,131.95
2014-08-07,131.83
2014-08-08,132.27
2014-08-11,132.03
2014-08-12,131.84
2014-08-13,131.79
2014-08-14,131.86
2014-08-15,132.11
2014-08-18,131.79
2014-08-19,131.38
2014-08-20,130.78
2014-08-21,130.94
2014-08-22,130.6
2014-08-25,130.09
2014-08-26,129.86
2014-08-27,130.12
2014-08-28,130.01
2014-08-29,129.54
2014-09-02,129.44
2014-09-03,129.64
2014-09-04,127.66
2014-09-05,127.7
2014-09-08,127.2
2014-09-09,127.67
2014-09-10,127.35
2014-09-11,127.35
2014-09-12,127.65
2014-09-15,127.58
2014-09-16,127.74
2014-09-17,126.89
2014-09-18,127.36
2014-09-19,126.54
2014-09-22,126.69
2014-09-23,126.76
2014-09-24,126
2014-09-25,125.65
2014-09-26,125
2014-09-29,125.1
2014-09-30,124.48
2014-10-01,124.38
2014-10-02,124.85
2014-10-03,123.33
2014-10-06,124.65
2014-10-07,124.82
2014-10-08,125.58
2014-10-09,125.06
2014-10-10,124.31
2014-10-13,125.09
2014-10-14,124.76
2014-10-15,126.18
2014-10-16,126.17
2014-10-17,125.73
2014-10-20,126.16
2014-10-21,125.31
2014-10-22,124.62
2014-10-23,124.65
2014-10-24,124.81
2014-10-27,125.19
2014-10-28,125.51
2014-10-29,124.52
2014-10-30,122.95
2014-10-31,123.49
2014-11-03,123.09
2014-11-04,123.61
2014-11-05,122.94
2014-11-06,121.95
2014-11-07,122.67
2014-11-10,122.34
2014-11-11,122.94
2014-11-12,122.48
2014-11-13,122.95
2014-11-14,123.43
2014-11-17,122.63
2014-11-18,123.47
2014-11-19,123.57
2014-11-20,123.56
2014-11-21,122.08
2014-11-24,122.55
2014-11-25,122.9
2014-11-26,123.22
2014-11-28,122.46
2014-12-01,122.86
2014-12-02,121.95
2014-12-03,121.27
2014-12-04,121.95
2014-12-05,121.03
2014-12-08,121.25
2014-12-09,121.83
2014-12-10,122.55
2014-12-11,122.02
2014-12-12,122.63
2014-12-15,122.45
2014-12-16,123.24
2014-12-17,121.54
2014-12-18,121
2014-12-19,120.39
2014-12-22,120.4
2014-12-23,119.84
2014-12-24,120.03
2014-12-26,119.91
2014-12-29,119.67
2014-12-30,119.67
2014-12-31,119.14
2015-01-02,118.2
2015-01-05,117.54
2015-01-06,117.16
2015-01-07,116.49
2015-01-08,116.08
2015-01-09,116.61
2015-01-12,116.53
2015-01-13,115.88
2015-01-14,116.06
2015-01-15,114.4
2015-01-16,113.91
2015-01-20,113.73
2015-01-21,114.09
2015-01-22,111.83
2015-01-23,110.33
2015-01-26,110.88
2015-01-27,112.03
2015-01-28,111.11
2015-01-29,111.44
2015-01-30,111.22
2015-02-02,111.58
2015-02-03,113.03
2015-02-04,112.12
2015-02-05,113.06
2015-02-06,111.4
2015-02-09,111.45
2015-02-10,111.36
2015-02-11,111.15
2015-02-12,112.31
2015-02-13,112.16
2015-02-17,112.38
2015-02-18,112.17
2015-02-19,111.8
2015-02-20,111.94
2015-02-23,111.53
2015-02-24,111.62
2015-02-25,111.84
2015-02-26,110.17
2015-02-27,110.12
2015-03-02,110
2015-03-03,109.94
2015-03-04,108.98
2015-03-05,108.51
2015-03-06,106.75
2015-03-09,106.78
2015-03-10,105.26
2015-03-11,103.67
2015-03-12,104.45
2015-03-13,103.08
2015-03-16,104.01
2015-03-17,104.19
2015-03-18,106.64
2015-03-19,104.69
2015-03-20,106.32
2015-03-23,107.84
2015-03-24,107.44
2015-03-25,107.88
2015-03-26,107.07
2015-03-27,107.16
2015-03-30,106.32
2015-03-31,105.71
2015-04-01,105.8
2015-04-02,106.99
2015-04-06,107.59
2015-04-07,106.34
2015-04-08,106.03
2015-04-09,104.77
2015-04-10,104.33
2015-04-13,104.03
2015-04-14,104.71
2015-04-15,105.07
2015-04-16,105.89
2015-04-17,106.36
2015-04-20,105.55
2015-04-21,105.54
2015-04-22,105.45
2015-04-23,106.43
2015-04-24,106.81
2015-04-27,107.04
2015-04-28,107.89
2015-04-29,109.25
2015-04-30,110.37
2015-05-01,110.15
2015-05-04,109.62
2015-05-05,110.03
2015-05-06,111.55
2015-05-07,110.75
2015-05-08,110.14
2015-05-11,109.61
2015-05-12,110.2
2015-05-13,111.48
2015-05-14,112.1
2015-05-15,112.51
2015-05-18,111.14
2015-05-19,109.55
2015-05-20,109.13
2015-05-21,109.22
2015-05-22,108.14
2015-05-26,106.82
2015-05-27,107.09
2015-05-28,107.52
2015-05-29,107.91
2015-06-01,107.31
2015-06-02,109.47
2015-06-03,110.77
2015-06-04,110.39
2015-06-05,109.13
2015-06-08,110.85
2015-06-09,110.74
2015-06-10,111.27
2015-06-11,110.69
2015-06-12,110.53
2015-06-15,110.81
2015-06-16,110.4
2015-06-17,111.38
2015-06-18,111.72
2015-06-19,111.41
2015-06-22,111.31
2015-06-23,109.66
2015-06-24,109.94
2015-06-25,110.03
2015-06-26,109.7
2015-06-29,110.37
2015-06-30,109.46
2015-07-01,108.53
2015-07-02,108.81
2015-07-06,108.51
2015-07-07,108.14
2015-07-08,108.7
2015-07-09,108.25
2015-07-10,109.41
2015-07-13,107.98
2015-07-14,108.03
2015-07-15,107.52
2015-07-16,106.8
2015-07-17,106.47
2015-07-20,106.37
2015-07-21,107.36
2015-07-22,107.17
2015-07-23,107.93
2015-07-24,107.75
2015-07-27,108.9
2015-07-28,108.56
2015-07-29,107.77
2015-07-30,107.29
2015-07-31,107.79
2015-08-03,107.49
2015-08-04,106.88
2015-08-05,107.03
2015-08-06,107.25
2015-08-07,107.52
2015-08-10,108.1
2015-08-11,108.35
2015-08-12,109.63
2015-08-13,109.44
2015-08-14,108.96
2015-08-17,108.71
2015-08-18,108.24
2015-08-19,109.19
2015-08-20,110.05
2015-08-21,111.5
2015-08-24,113.77
2015-08-25,112.76
2015-08-26,111.22
2015-08-27,110.31
2015-08-28,109.74
2015-08-31,110.05
2015-09-01,110.85
2015-09-02,110.15
2015-09-03,109.1
2015-09-04,109.31
2015-09-08,109.84
2015-09-09,109.93
2015-09-10,110.62
2015-09-11,111.22
2015-09-14,111.06
2015-09-15,110.5
2015-09-16,110.68
2015-09-17,112.19
2015-09-18,110.63
2015-09-21,109.79
2015-09-22,109.16
2015-09-23,109.64
2015-09-24,110.06
2015-09-25,109.88
2015-09-28,110.13
2015-09-29,110.32
2015-09-30,109.58
2015-10-01,109.69
2015-10-02,109.85
2015-10-05,109.64
2015-10-06,110.57
2015-10-07,110.23
2015-10-08,110.52
2015-10-09,111.29
2015-10-12,111.37
2015-10-13,111.6
2015-10-14,112.58
2015-10-15,111.51
2015-10-16,111.28
2015-10-19,111.02
2015-10-20,111.13
2015-10-21,111.13
2015-10-22,108.9
2015-10-23,107.95
2015-10-26,108.28
2015-10-27,108.23
2015-10-28,107.05
2015-10-29,107.54
2015-10-30,107.76
2015-11-02,107.95
2015-11-03,107.45
2015-11-04,106.43
2015-11-05,106.58
2015-11-06,105.3
2015-11-09,105.37
2015-11-10,104.97
2015-11-11,105.23
2015-11-12,105.88
2015-11-13,105.34
2015-11-16,104.69
2015-11-17,104.31
2015-11-18,104.36
2015-11-19,105.13
2015-11-20,104.25
2015-11-23,104.09
2015-11-24,104.29
2015-11-25,103.97
2015-11-27,103.81
2015-11-30,103.49
2015-12-01,104.16
2015-12-02,103.97
2015-12-03,107.27
2015-12-04,106.51
2015-12-07,106.23
2015-12-08,106.69
2015-12-09,107.88
2015-12-10,107.22
2015-12-11,107.62
2015-12-14,107.59
2015-12-15,106.94
2015-12-16,106.93
2015-12-17,105.94
2015-12-18,106.47
2015-12-21,106.95
2015-12-22,107.21
2015-12-23,106.96
2015-12-24,107.24
2015-12-28,107.42
2015-12-29,107.06
2015-12-30,107.02
2015-12-31,106.4
2016-01-04,106.02
2016-01-05,105.24
2016-01-06,105.62
2016-01-07,107.04
2016-01-08,106.88
2016-01-11,106.2
2016-01-12,106.23
2016-01-13,106.53
2016-01-14,106.31
2016-01-15,106.86
2016-01-19,106.76
2016-01-20,106.56
2016-01-21,106.53
2016-01-22,105.63
2016-01-25,106.21
2016-01-26,106.27
2016-01-27,106.59
2016-01-28,107.06
2016-01-29,105.97
2016-02-01,106.59
2016-02-02,106.79
2016-02-03,108.68
2016-02-04,109.64
2016-02-05,109.08
2016-02-08,109.48
2016-02-09,110.5
2016-02-10,110.46
2016-02-11,110.78
2016-02-12,110.07
2016-02-16,108.97
2016-02-17,108.87
2016-02-18,108.53
2016-02-19,108.88
2016-02-22,107.8
2016-02-23,107.75
2016-02-24,107.66
2016-02-25,107.83
2016-02-26,106.96
2016-02-29,106.37
2016-03-01,106.26
2016-03-02,106.23
2016-03-03,107.19
2016-03-04,107.58
2016-03-07,107.68
2016-03-08,107.59
2016-03-09,107.57
2016-03-10,109.3
2016-03-11,109.01
2016-03-14,108.47
2016-03-15,108.61
2016-03-16,109.81
2016-03-17,110.65
2016-03-18,110.2
2016-03-21,109.9
2016-03-22,109.64
2016-03-23,109.25
2016-03-24,109.26
2016-03-28,109.45
2016-03-29,110.38
2016-03-30,110.75
2016-03-31,111.18
2016-04-01,111.29
2016-04-04,111.3
2016-04-05,111.21
2016-04-06,111.36
2016-04-07,111.12
2016-04-08,111.39
2016-04-11,111.4
2016-04-12,111.28
2016-04-13,110.22
2016-04-14,109.97
2016-04-15,110.21
2016-04-18,110.47
2016-04-19,110.99
2016-04-20,110.28
2016-04-21,110.29
2016-04-22,109.63
2016-04-25,109.96
2016-04-26,110.24
2016-04-27,110.47
2016-04-28,110.87
2016-04-29,111.84
2016-05-02,112.49
2016-05-03,112.35
2016-05-04,112.19
2016-05-05,111.35
2016-05-06,111.34
2016-05-09,111.12
2016-05-10,111.02
2016-05-11,111.55
2016-05-12,111.06
2016-05-13,110.45
2016-05-16,110.5
2016-05-17,110.48
2016-05-18,109.53
2016-05-19,109.31
2016-05-20,109.51
2016-05-23,109.47
2016-05-24,108.74
2016-05-25,108.89
2016-05-26,109.2
2016-05-27,108.44
2016-05-31,108.59
2016-06-01,109.24
2016-06-02,108.82
2016-06-03,110.87
2016-06-06,110.88
2016-06-07,110.81
2016-06-08,111.21
2016-06-09,110.45
2016-06-10,109.81
2016-06-13,110.22
2016-06-14,109.3
2016-06-15,109.81
2016-06-16,109.68
2016-06-17,110.06
2016-06-20,110.3
2016-06-21,109.73
2016-06-22,110.25
2016-06-23,111.04
2016-06-24,108.05
2016-06-27,107.43
2016-06-28,108.06
2016-06-29,108.28
2016-06-30,108.17
2016-07-01,108.61
2016-07-05,107.89
2016-07-06,108.27
2016-07-07,107.85
2016-07-08,107.74
2016-07-11,107.82
2016-07-12,107.87
2016-07-13,108.17
2016-07-14,108.35
2016-07-15,107.89
2016-07-18,107.92
2016-07-19,107.4
2016-07-20,107.4
2016-07-21,107.45
2016-07-22,106.95
2016-07-25,107.13
2016-07-26,107.08
2016-07-27,107.74
2016-07-28,107.96
2016-07-29,108.96
2016-08-01,108.81
2016-08-02,109.38
2016-08-03,108.64
2016-08-04,108.46
2016-08-05,108.03
2016-08-08,107.98
2016-08-09,108.28
2016-08-10,108.9
2016-08-11,108.53
2016-08-12,108.72
2016-08-15,108.98
2016-08-16,109.89
2016-08-17,109.92
2016-08-18,110.72
2016-08-19,110.32
2016-08-22,110.28
2016-08-23,110.11
2016-08-24,109.68
2016-08-25,109.88
2016-08-26,109.01
2016-08-29,108.98
2016-08-30,108.52
2016-08-31,108.65
2016-09-01,109.1
2016-09-02,108.66
2016-09-06,109.47
2016-09-07,109.46
2016-09-08,109.61
2016-09-09,109.29
2016-09-12,109.38
2016-09-13,109.16
2016-09-14,109.54
2016-09-15,109.5
2016-09-16,108.58
2016-09-19,108.84
2016-09-20,108.62
2016-09-21,108.93
2016-09-22,109.08
2016-09-23,109.31
2016-09-26,109.55
2016-09-27,109.2
2016-09-28,109.17
2016-09-29,109.18
2016-09-30,109.35
2016-10-03,109.12
2016-10-04,109.03
2016-10-05,109.02
2016-10-06,108.48
2016-10-07,108.97
2016-10-10,108.37
2016-10-11,107.6
2016-10-12,107.16
2016-10-13,107.53
2016-10-14,106.73
2016-10-17,107.08
2016-10-18,106.82
2016-10-19,106.73
2016-10-20,106.29
2016-10-21,105.85
2016-10-24,105.76
2016-10-25,105.94
2016-10-26,106.05
2016-10-27,106
2016-10-28,106.85
2016-10-31,106.75
2016-11-01,107.52
2016-11-02,107.89
2016-11-03,108
2016-11-04,108.35
2016-11-07,107.36
2016-11-08,107.1
2016-11-09,106.07
2016-11-10,105.87
2016-11-11,105.47
2016-11-14,104.35
2016-11-15,104.3
2016-11-16,103.85
2016-11-17,103.29
2016-11-18,102.94
2016-11-21,103.3
2016-11-22,103.26
2016-11-23,102.56
2016-11-25,102.97
2016-11-28,103.11
2016-11-29,103.5
2016-11-30,102.98
2016-12-01,103.63
2016-12-02,103.62
2016-12-05,104.61
2016-12-06,104.16
2016-12-07,104.6
2016-12-08,103.12
2016-12-09,102.58
2016-12-12,103.34
2016-12-13,103.18
2016-12-14,102.32
2016-12-15,101.16
2016-12-16,101.47
2016-12-19,101.02
2016-12-20,100.93
2016-12-21,101.35
2016-12-22,101.36
2016-12-23,101.52
2016-12-27,101.57
2016-12-28,101.1
2016-12-29,101.87
2016-12-30,102.26
2017-01-03,100.93
2017-01-04,101.87
2017-01-05,102.98
2017-01-06,102.29
2017-01-09,102.66
2017-01-10,102.55
2017-01-11,102.69
2017-01-12,103.17
2017-01-13,103.31
2017-01-17,103.95
2017-01-18,103.27
2017-01-19,103.52
2017-01-20,103.86
2017-01-23,104.32
2017-01-24,104.17
2017-01-25,104.39
2017-01-26,103.62
2017-01-27,103.82
2017-01-30,103.81
2017-01-31,104.81
2017-02-01,104.51
2017-02-02,104.44
2017-02-03,104.64
2017-02-06,104.32
2017-02-07,103.71
2017-02-08,103.71
2017-02-09,103.46
2017-02-10,103.22
2017-02-13,102.81
2017-02-14,102.63
2017-02-15,102.88
2017-02-16,103.58
2017-02-17,102.93
2017-02-21,102.29
2017-02-22,102.5
2017-02-23,102.67
2017-02-24,102.44
2017-02-27,102.74
2017-02-28,102.78
2017-03-01,102.28
2017-03-02,101.89
2017-03-03,102.99
2017-03-06,102.63
2017-03-07,102.5
2017-03-08,102.24
2017-03-09,102.65
2017-03-10,103.67
2017-03-13,103.3
2017-03-14,102.83
2017-03-15,103.87
2017-03-16,104.42
2017-03-17,104.15
2017-03-20,104.1832
2017-03-21,104.83
2017-03-22,104.67
2017-03-23,104.54
2017-03-24,104.65
2017-03-27,105.34
2017-03-28,104.8
2017-03-29,104.41
2017-03-30,103.52
2017-03-31,103.41
2017-04-03,103.43
2017-04-04,103.38
2017-04-05,103.58
2017-04-06,103.13
2017-04-07,102.66
2017-04-10,102.64
2017-04-11,102.8
2017-04-12,103.32
2017-04-13,102.89
2017-04-17,103.12
2017-04-18,104.02
2017-04-19,103.84
2017-04-20,103.84
2017-04-21,103.71
2017-04-24,105.32
2017-04-25,105.98
2017-04-26,105.66
2017-04-27,105.35
2017-04-28,105.52
2017-05-01,105.57
2017-05-02,105.85
2017-05-03,105.51
2017-05-04,106.42
2017-05-05,106.53
2017-05-08,105.85
2017-05-09,105.3
2017-05-10,105.25
2017-05-11,105.2
2017-05-12,105.83
2017-05-15,106.31
2017-05-16,107.36
2017-05-17,108.01
2017-05-18,107.58
2017-05-19,108.52
2017-05-22,108.82
2017-05-23,108.26
2017-05-24,108.6
2017-05-25,108.53
2017-05-26,108.12
2017-05-30,108.32
2017-05-31,108.77
2017-06-01,108.54
2017-06-02,109.22
2017-06-05,108.93
2017-06-06,109.19
2017-06-07,109.04
2017-06-08,108.55
2017-06-09,108.34
2017-06-12,108.45
2017-06-13,108.45
2017-06-14,108.57
2017-06-15,107.84
2017-06-16,108.41
2017-06-19,107.87
2017-06-20,107.67
2017-06-21,108.04
2017-06-22,107.9
2017-06-23,108.36
2017-06-26,108.15
2017-06-27,109.82
2017-06-28,110.14
2017-06-29,110.69
2017-06-30,110.48
2017-07-03,109.85
2017-07-05,109.7
2017-07-06,110.48
2017-07-07,110.3
2017-07-10,110.25
2017-07-11,110.89
2017-07-12,110.44
2017-07-13,110.3
2017-07-14,110.94
2017-07-17,111.05
2017-07-18,111.78
2017-07-19,111.37
2017-07-20,112.47
2017-07-21,112.85
2017-07-24,112.56
2017-07-25,112.62
2017-07-26,113.35
2017-07-27,112.87
2017-07-28,113.69
2017-07-31,114.45
2017-08-01,114.07
2017-08-02,114.61
2017-08-03,114.8
2017-08-04,113.85
2017-08-07,114
2017-08-08,113.54
2017-08-09,113.64
2017-08-10,113.82
2017-08-11,114.3
2017-08-14,113.85
2017-08-15,113.43
2017-08-16,113.77
2017-08-17,113.31
2017-08-18,113.7
2017-08-21,114.16
2017-08-22,113.58
2017-08-23,114.23
2017-08-24,114.02
2017-08-25,115.26
2017-08-28,115.71
2017-08-29,115.64
2017-08-30,114.85
2017-08-31,115.03
2017-09-01,114.59
2017-09-05,115.14
2017-09-06,115.13
2017-09-07,116.12
2017-09-08,116.17
2017-09-11,115.46
2017-09-12,115.58
2017-09-13,114.75
2017-09-14,114.99
2017-09-15,115.39
2017-09-18,115.42
2017-09-19,115.87
2017-09-20,114.8
2017-09-21,115.23
2017-09-22,115.33
2017-09-25,114.4
2017-09-26,113.85
2017-09-27,113.43
2017-09-28,113.73
2017-09-29,114.1
2017-10-02,113.27
2017-10-03,113.43
2017-10-04,113.57
2017-10-05,112.99
2017-10-06,113.29
2017-10-09,113.44
2017-10-10,114.07
2017-10-11,114.56
2017-10-12,114.22
2017-10-13,114.07
2017-10-16,113.79
2017-10-17,113.56
2017-10-18,113.82
2017-10-19,114.27
2017-10-20,113.62
2017-10-23,113.36
2017-10-24,113.49
2017-10-25,113.89
2017-10-26,112.36
2017-10-27,111.92
2017-10-30,112.47
2017-10-31,112.38
2017-11-01,112.09
2017-11-02,112.5
2017-11-03,111.96
2017-11-06,111.98
2017-11-07,111.79
2017-11-08,111.87
2017-11-09,112.32
2017-11-10,112.52
2017-11-13,112.55
2017-11-14,113.75
2017-11-15,113.74
2017-11-16,113.5
2017-11-17,113.75
2017-11-20,113.12
2017-11-21,113.19
2017-11-22,113.98
2017-11-24,114.99
2017-11-27,114.73
2017-11-28,114.16
2017-11-29,114.25
2017-11-30,114.73
2017-12-01,114.64
2017-12-04,114.29
2017-12-05,113.96
2017-12-06,113.69
2017-12-07,113.51
2017-12-08,113.41
2017-12-11,113.47
2017-12-12,113.23
2017-12-13,113.98
2017-12-14,113.6
2017-12-15,113.28
2017-12-18,113.55
2017-12-19,114.11
2017-12-20,114.48
2017-12-21,114.43
2017-12-22,114.24
2017-12-26,114.31
2017-12-27,114.59
2017-12-28,115.07
2017-12-29,115.61
2018-01-02,116.2
2018-01-03,115.71
2018-01-04,116.29
2018-01-05,115.97
2018-01-08,115.27
2018-01-09,114.99
2018-01-10,115.2
2018-01-11,115.9
2018-01-12,117.4
2018-01-16,118.16
2018-01-17,117.65
2018-01-18,117.87
2018-01-19,117.71
2018-01-22,118.03
2018-01-23,118.4
2018-01-24,119.42
2018-01-25,119.46
2018-01-26,119.59
2018-01-29,119.22
2018-01-30,119.35
2018-01-31,119.58
2018-02-01,120.47
2018-02-02,120
2018-02-05,119.29
2018-02-06,119.11
2018-02-07,118.06
2018-02-08,117.89
2018-02-09,117.79
2018-02-12,118.29
2018-02-13,118.92
2018-02-14,119.96
2018-02-15,120.33
2018-02-16,119.4
2018-02-20,118.73
2018-02-21,118.3
2018-02-22,118.61
2018-02-23,118.33
2018-02-26,118.48
2018-02-27,117.72
2018-02-28,117.41
2018-03-01,117.97
2018-03-02,118.61
2018-03-05,118.67
2018-03-06,119.29
2018-03-07,119.39
2018-03-08,118.46
2018-03-09,118.39
2018-03-12,118.68
2018-03-13,119.11
2018-03-14,118.99
2018-03-15,118.32
2018-03-16,118.17
2018-03-19,118.65
2018-03-20,117.78
2018-03-21,118.73
2018-03-22,118.45
2018-03-23,118.91
2018-03-26,119.72
2018-03-27,119.22
2018-03-28,118.31
2018-03-29,118.33
2018-04-02,118.33
2018-04-03,117.93
2018-04-04,118.08
2018-04-05,117.65
2018-04-06,118.1
2018-04-09,118.45
2018-04-10,118.75
2018-04-11,118.86
2018-04-12,118.51
2018-04-13,118.59
2018-04-16,118.94
2018-04-17,118.92
2018-04-18,118.92
2018-04-19,118.69
2018-04-20,118.05
2018-04-23,117.34
2018-04-24,117.56
2018-04-25,116.98
2018-04-26,116.34
2018-04-27,116.56
2018-04-30,116.04
2018-05-01,115.27
2018-05-02,114.75
2018-05-03,115.16
2018-05-04,114.89
2018-05-07,114.56
2018-05-08,113.98
2018-05-09,113.84
2018-05-10,114.57
2018-05-11,114.73
2018-05-14,114.66
2018-05-15,113.73
2018-05-16,113.37
2018-05-17,113.3
2018-05-18,113.03
2018-05-21,113.2
2018-05-22,113.15
2018-05-23,112.41
2018-05-24,112.58
2018-05-25,111.99
2018-05-29,110.77
2018-05-30,111.97
2018-05-31,112.24
2018-06-01,111.89
2018-06-04,112.3
2018-06-05,112.46
2018-06-06,113.01
2018-06-07,113.26
2018-06-08,112.96
2018-06-11,113.12
2018-06-12,112.81
2018-06-13,113.17
2018-06-14,111.19
2018-06-15,111.47
2018-06-18,111.5
2018-06-19,111.14
2018-06-20,111.15
2018-06-21,111.44
2018-06-22,111.9
2018-06-25,112.28
2018-06-26,111.74
2018-06-27,110.88
2018-06-28,110.97
2018-06-29,112.06
2018-07-02,111.47
2018-07-03,111.8
2018-07-05,112.18
2018-07-06,112.68
2018-07-09,112.68
2018-07-10,112.69
2018-07-11,111.96
2018-07-12,111.99
2018-07-13,112.05
2018-07-16,112.32
2018-07-17,111.87
2018-07-18,111.66
2018-07-19,111.6
2018-07-20,112.47
2018-07-23,112.15
2018-07-24,112.08
2018-07-25,112.5
2018-07-26,111.67
2018-07-27,111.8
2018-07-30,112.21
2018-07-31,112.1
2018-08-01,111.83
2018-08-02,111.13
2018-08-03,110.95
2018-08-06,110.78
2018-08-07,111.18
2018-08-08,111.34
2018-08-09,110.54
2018-08-10,109.3
2018-08-13,109.24
2018-08-14,108.76
2018-08-15,108.75
2018-08-16,109.01
2018-08-17,109.68
2018-08-20,109.97
2018-08-21,110.87
2018-08-22,111.24
2018-08-23,110.59
2018-08-24,111.42
2018-08-27,111.95
2018-08-28,112.03
2018-08-29,112.14
2018-08-30,111.88
2018-08-31,111.21
2018-09-04,110.99
2018-09-05,111.45
2018-09-06,111.37
2018-09-07,110.73
2018-09-10,111.1
2018-09-11,111.05
2018-09-12,111.39
2018-09-13,111.98
2018-09-14,111.37
2018-09-17,111.93
2018-09-18,111.79
2018-09-19,111.83
2018-09-20,112.81
2018-09-21,112.54
2018-09-24,112.49
2018-09-25,112.7
2018-09-26,112.49
2018-09-27,111.58
2018-09-28,111.16
2018-10-01,110.88
2018-10-02,110.62
2018-10-03,110.26
2018-10-04,110.25
2018-10-05,110.34
2018-10-08,110.09
2018-10-09,110.09
2018-10-10,110.27
2018-10-11,110.99
2018-10-12,110.66
2018-10-15,110.84
2018-10-16,110.88
2018-10-17,110.17
2018-10-18,109.67
2018-10-19,110.15
2018-10-22,109.74
2018-10-23,109.79
2018-10-24,109.1
2018-10-25,108.85
2018-10-26,109.17
2018-10-29,108.97
2018-10-30,108.59
2018-10-31,108.41
2018-11-01,109.2
2018-11-02,109.03
2018-11-05,109.18
2018-11-06,109.25
2018-11-07,109.47
2018-11-08,108.69
2018-11-09,108.47
2018-11-12,107.47
2018-11-13,107.96
2018-11-14,108.32
2018-11-15,108.42
2018-11-16,109.2
2018-11-19,109.55
2018-11-20,108.75
2018-11-21,108.89
2018-11-23,108.42
2018-11-26,108.38
2018-11-27,108.04
2018-11-28,108.72
2018-11-29,108.91
2018-11-30,108.27
2018-12-03,108.48
2018-12-04,108.41
2018-12-06,108.87
2018-12-07,109.11
2018-12-10,108.56
2018-12-11,108.29
2018-12-12,108.71
2018-12-13,108.65
2018-12-14,108.02
2018-12-17,108.48
2018-12-18,108.64
2018-12-19,108.73
2018-12-20,109.54
2018-12-21,108.58
2018-12-24,109.07
2018-12-26,108.52
2018-12-27,109.36
2018-12-28,109.37
2018-12-31,109.48
2019-01-02,108.44
2019-01-03,108.91
2019-01-04,108.93
2019-01-07,109.65
2019-01-08,109.31
2019-01-09,110.41
2019-01-10,109.89
2019-01-11,109.52
2019-01-14,109.56
2019-01-15,109.05
2019-01-16,108.82
2019-01-17,108.81
2019-01-18,108.58
2019-01-22,108.44
2019-01-23,108.71
2019-01-24,108.02
2019-01-25,109.02
2019-01-28,109.16
2019-01-29,109.2
2019-01-30,109.63
2019-01-31,109.31
2019-02-01,109.42
2019-02-04,109.18
2019-02-05,109.02
2019-02-06,108.56
2019-02-07,108.29
2019-02-08,108.09
2019-02-11,107.67
2019-02-12,108.19
2019-02-13,107.55
2019-02-14,107.8
2019-02-15,107.88
2019-02-19,108.29
2019-02-20,108.27
2019-02-21,108.23
2019-02-22,108.18
2019-02-25,108.44
2019-02-26,108.71
2019-02-27,108.52
2019-02-28,108.56
2019-03-01,108.46
2019-03-04,108.23
2019-03-05,108.13
2019-03-06,107.94
2019-03-07,106.7
2019-03-08,107.17
2019-03-11,107.34
2019-03-12,107.78
2019-03-13,108.15
2019-03-14,107.86
2019-03-15,108.04
2019-03-18,108.21
2019-03-19,108.36
2019-03-20,109.08
2019-03-21,108.45
2019-03-22,107.77
2019-03-25,107.93
2019-03-26,107.5
2019-03-27,107.3
2019-03-28,107.05
2019-03-29,107.02
2019-04-01,106.92
2019-04-02,106.85
2019-04-03,107.21
2019-04-04,107.07
2019-04-05,107
2019-04-08,107.43
2019-04-09,107.42
2019-04-10,107.5
2019-04-11,107.38
2019-04-12,107.72
2019-04-15,107.78
2019-04-16,107.58
2019-04-17,107.71
2019-04-18,107.06
2019-04-22,107.33
2019-04-23,107
2019-04-24,106.33
2019-04-25,106.14
2019-04-26,106.25
2019-04-29,106.59
2019-04-30,106.89
2019-05-01,106.69
2019-05-02,106.48
2019-05-03,106.74
2019-05-06,106.74
2019-05-07,106.6
2019-05-08,106.66
2019-05-09,106.91
2019-05-10,107.01
2019-05-13,107.02
2019-05-14,106.77
2019-05-15,106.77
2019-05-16,106.51
2019-05-17,106.35
2019-05-20,106.39
2019-05-21,106.34
2019-05-22,106.27
2019-05-23,106.49
2019-05-24,106.78
2019-05-28,106.35
2019-05-29,106.05
2019-05-30,106.06
2019-05-31,106.44
2019-06-03,107.12
2019-06-04,107.21
2019-06-05,106.92
2019-06-06,107.37
2019-06-07,107.91
2019-06-10,107.79
2019-06-11,107.86
2019-06-12,107.49
2019-06-13,107.36
2019-06-14,106.745
2019-06-17,106.85
2019-06-18,106.65
2019-06-19,106.97
2019-06-20,107.5
2019-06-21,108.21
2019-06-24,108.48
2019-06-25,108.37
2019-06-26,108.21
2019-06-27,108.21
2019-06-28,108.255
2019-07-01,107.455
2019-07-02,107.45
2019-07-03,107.38
2019-07-04,107.38
2019-07-05,106.79
2019-07-08,106.79
2019-07-09,106.67
2019-07-10,106.67
2019-07-11,107.21
2019-07-12,107.21
2019-07-15,107.23
2019-07-16,106.68
2019-07-17,106.78
2019-07-18,107.26
2019-07-19,106.72
2019-07-22,106.635
2019-07-23,106.1
2019-07-24,106.02
2019-07-25,106.01
2019-07-26,105.82
2019-07-29,106.035
2019-07-30,106.1
2019-07-31,105.265
2019-08-01,105.51
2019-08-02,105.67
2019-08-05,106.46
2019-08-06,106.48
2019-08-07,106.56
2019-08-08,106.4
2019-08-09,106.53
2019-08-12,106.62
2019-08-13,106.26
2019-08-14,105.895
2019-08-15,105.6
2019-08-16,105.54
2019-08-19,105.5
2019-08-20,105.58
2019-08-21,105.395
2019-08-22,105.4
2019-08-23,105.98
2019-08-26,105.92
2019-08-27,105.42
2019-08-28,105.3
2019-08-29,105.1
2019-08-30,104.37
2019-09-02,104.37
2019-09-03,104.3
2019-09-04,104.82
2019-09-05,104.9
2019-09-06,104.9
2019-09-09,105.02
2019-09-10,104.97
2019-09-11,104.62
2019-09-12,105.14
2019-09-13,105.21
2019-09-16,104.59
2019-09-17,105.2
2019-09-18,104.92
2019-09-19,105
2019-09-20,104.62
2019-09-23,104.48
2019-09-24,104.68
2019-09-25,103.99
2019-09-26,103.72
2019-09-27,103.94
2019-09-30,103.56
2019-10-01,103.9
2019-10-02,104.13
2019-10-03,104.22
2019-10-04,104.35
2019-10-07,104.21
2019-10-08,104.05
2019-10-09,104.22
2019-10-10,104.53
2019-10-11,104.91
2019-10-14,104.7
2019-10-15,104.63
2019-10-16,105.18
2019-10-17,105.635
2019-10-18,105.99
2019-10-21,105.87
2019-10-22,105.68
2019-10-23,105.73
2019-10-24,105.46
2019-10-25,105.19
2019-10-28,105.38
2019-10-29,105.48
2019-10-30,105.8
2019-10-31,105.78
2019-11-01,106.02
2019-11-04,105.62
2019-11-05,105.08
2019-11-06,105.01
2019-11-07,104.84
2019-11-08,104.6
2019-11-11,104.72
2019-11-12,104.49
2019-11-13,104.41
2019-11-14,104.59
2019-11-15,104.88
2019-11-18,105.09
2019-11-19,105.13
2019-11-20,105.04
2019-11-21,104.92
2019-11-22,104.62
2019-11-25,104.41
