date,close
2014-06-13,51.5945
2014-06-16,51.5099
2014-06-17,51.7639
2014-06-18,51.8876
2014-06-19,52.3369
2014-06-20,52.4216
2014-06-23,52.4932
2014-06-24,52.4867
2014-06-25,53.3854
2014-06-26,53.216
2014-06-27,53.3398
2014-06-30,52.8774
2014-07-01,53.0988
2014-07-02,53.3463
2014-07-03,53.7175
2014-07-07,53.5872
2014-07-08,53.5937
2014-07-09,54.4441
2014-07-10,53.947
2014-07-11,53.8685
2014-07-14,54.4834
2014-07-15,54.4114
2014-07-16,54.104
2014-07-17,50.3754
2014-07-18,50.6436
2014-07-21,48.4915
2014-07-22,48.9559
2014-07-23,48.8709
2014-07-24,48.3017
2014-07-25,48.4326
2014-07-28,48.5111
2014-07-29,48.2821
2014-07-30,47.7523
2014-07-31,45.3974
2014-08-01,45.9076
2014-08-04,45.9076
2014-08-05,45.5217
2014-08-06,45.7899
2014-08-07,45.6067
2014-08-08,45.7702
2014-08-11,45.816
2014-08-12,45.8095
2014-08-13,46.1038
2014-08-14,46.4767
2014-08-15,46.758
2014-08-18,47.1897
2014-08-19,47.4187
2014-08-20,47.7196
2014-08-21,47.2813
2014-08-22,47.3663
2014-08-25,47.6018
2014-08-26,47.7588
2014-08-27,47.3075
2014-08-28,47.3009
2014-08-29,47.3794
2014-09-02,46.7187
2014-09-03,46.758
2014-09-04,46.8888
2014-09-05,47.3336
2014-09-08,47.3205
2014-09-09,47.1439
2014-09-10,47.4841
2014-09-11,47.4841
2014-09-12,46.8234
2014-09-15,46.9281
2014-09-16,47.0916
2014-09-17,47.3729
2014-09-18,47.5168
2014-09-19,47.7392
2014-09-22,47.3271
2014-09-23,46.9346
2014-09-24,47.3794
2014-09-25,46.7972
2014-09-26,47.3205
2014-09-29,47.5299
2014-09-30,47.085
2014-10-01,46.7776
2014-10-02,46.7841
2014-10-03,46.8561
2014-10-06,46.6926
2014-10-07,45.6132
2014-10-08,46.2739
2014-10-09,45.1357
2014-10-10,45.3385
2014-10-13,44.233
2014-10-14,44.3638
2014-10-15,44.2453
2014-10-16,44.502
2014-10-17,44.9956
2014-10-20,45.4958
2014-10-21,45.9367
2014-10-22,45.4958
2014-10-23,45.5747
2014-10-24,45.9894
2014-10-27,45.8314
2014-10-28,46.2065
2014-10-29,45.8117
2014-10-30,46.0552
2014-10-31,47.2727
2014-11-03,47.095
2014-11-04,47.4241
2014-11-05,47.6741
2014-11-06,48.1085
2014-11-07,47.9506
2014-11-10,48.2204
2014-11-11,48.3849
2014-11-12,49.0694
2014-11-13,49.6156
2014-11-14,49.2141
2014-11-17,48.6942
2014-11-18,48.8259
2014-11-19,48.6811
2014-11-20,49.6946
2014-11-21,49.9249
2014-11-24,50.2737
2014-11-25,50.2079
2014-11-26,50.5106
2014-11-28,50.8397
2014-12-01,50.9252
2014-12-02,51.5702
2014-12-03,51.0964
2014-12-04,51.1556
2014-12-05,51.5307
2014-12-08,50.3198
2014-12-09,49.5037
2014-12-10,46.4171
2014-12-11,47.3977
2014-12-12,47.944
2014-12-15,46.4829
2014-12-16,45.4234
2014-12-17,46.4632
2014-12-18,47.2135
2014-12-19,46.8383
2014-12-22,47.6873
2014-12-23,47.8321
2014-12-24,47.9045
2014-12-26,48.1348
2014-12-29,48.4112
2014-12-30,48.227
2014-12-31,47.944
2015-01-02,47.6149
2015-01-05,46.6475
2015-01-06,46.0749
2015-01-07,47.6017
2015-01-08,48.431
2015-01-09,48.3454
2015-01-12,47.9835
2015-01-13,47.786
2015-01-14,47.8588
2015-01-15,47.2897
2015-01-16,47.9383
2015-01-20,47.0911
2015-01-21,47.3227
2015-01-22,48.8384
2015-01-23,49.0502
2015-01-26,49.1362
2015-01-27,48.6001
2015-01-28,48.2493
2015-01-29,49.1561
2015-01-30,47.839
2015-02-02,48.1368
2015-02-03,48.7193
2015-02-04,48.7457
2015-02-05,49.7716
2015-02-06,48.9311
2015-02-09,48.3883
2015-02-10,49.0303
2015-02-11,48.9708
2015-02-12,49.5069
2015-02-13,49.4341
2015-02-17,50.3342
2015-02-18,50.632
2015-02-19,50.7445
2015-02-20,51.3137
2015-02-23,51.2542
2015-02-24,51.5321
2015-02-25,52.2602
2015-02-26,52.5448
2015-02-27,53.6832
2015-03-02,54.1399
2015-03-03,53.9479
2015-03-04,53.0015
2015-03-05,53.2927
2015-03-06,52.3926
2015-03-09,52.5779
2015-03-10,51.5454
2015-03-11,50.632
2015-03-12,51.5189
2015-03-13,51.3005
2015-03-16,51.7506
2015-03-17,51.5321
2015-03-18,52.247
2015-03-19,52.1146
2015-03-20,52.4257
2015-03-23,52.4654
2015-03-24,53.061
2015-03-25,52.3859
2015-03-26,51.9888
2015-03-27,51.83
2015-03-30,52.558
2015-03-31,52.1013
2015-04-01,52.1808
2015-04-02,52.8095
2015-04-06,52.7698
2015-04-07,51.8167
2015-04-08,52.0962
2015-04-09,52.5087
2015-04-10,53.2406
2015-04-13,53.7063
2015-04-14,52.9744
2015-04-15,52.9611
2015-04-16,52.8879
2015-04-17,53.0609
2015-04-20,53.9525
2015-04-21,53.7928
2015-04-22,55.9153
2015-04-23,55.9352
2015-04-24,57.9512
2015-04-27,57.6252
2015-04-28,57.7782
2015-04-29,57.3857
2015-04-30,57.1927
2015-05-01,61.1448
2015-05-04,60.5527
2015-05-05,59.874
2015-05-06,59.3551
2015-05-07,59.9672
2015-05-08,59.8008
2015-05-11,59.7077
2015-05-12,60.1402
2015-05-13,59.8141
2015-05-14,59.894
2015-05-15,62.5154
2015-05-18,62.2693
2015-05-19,62.7483
2015-05-20,63.1275
2015-05-21,62.1695
2015-05-22,60.9053
2015-05-26,60.9053
2015-05-27,61.1981
2015-05-28,61.0783
2015-05-29,59.9539
2015-06-01,60.0603
2015-06-02,59.7942
2015-06-03,60.912
2015-06-04,60.2267
2015-06-05,60.4063
2015-06-08,60.2134
2015-06-09,60.2732
2015-06-10,60.9452
2015-06-11,60.7656
2015-06-12,60.6192
2015-06-15,60.4662
2015-06-16,61.0916
2015-06-17,60.7456
2015-06-18,61.6638
2015-06-19,61.391
2015-06-22,61.4908
2015-06-23,61.2313
2015-06-24,60.8853
2015-06-25,60.7989
2015-06-26,61.7104
2015-06-29,59.6212
2015-06-30,59.9339
2015-07-01,61.0051
2015-07-02,60.912
2015-07-06,60.3265
2015-07-07,59.8075
2015-07-08,57.9645
2015-07-09,58.5433
2015-07-10,60.4529
2015-07-13,60.6192
2015-07-14,61.2047
2015-07-15,59.4002
2015-07-16,58.9792
2015-07-17,58.7319
2015-07-20,58.899
2015-07-21,59.2265
2015-07-22,59.6876
2015-07-23,58.6918
2015-07-24,57.95
2015-07-27,57.4621
2015-07-28,58.1104
2015-07-29,58.6584
2015-07-30,58.8255
2015-07-31,58.6517
2015-08-03,58.6918
2015-08-04,58.9391
2015-08-05,59.5072
2015-08-06,58.6584
2015-08-07,58.5515
2015-08-10,58.6918
2015-08-11,55.8314
2015-08-12,53.92
2015-08-13,56.0052
2015-08-14,55.8648
2015-08-17,56.8272
2015-08-18,56.2725
2015-08-19,57.5356
2015-08-20,54.6819
2015-08-21,53.2651
2015-08-24,51.5876
2015-08-25,50.8591
2015-08-26,53.2517
2015-08-27,54.9827
2015-08-28,54.6819
2015-08-31,53.3119
2015-09-01,52.8641
2015-09-02,53.646
2015-09-03,53.6126
2015-09-04,52.7237
2015-09-08,54.6418
2015-09-09,54.1473
2015-09-10,53.3987
2015-09-11,54.4213
2015-09-14,54.1005
2015-09-15,55.0829
2015-09-16,55.5173
2015-09-17,55.4505
2015-09-18,53.5658
2015-09-21,53.7529
2015-09-22,52.9977
2015-09-23,52.7438
2015-09-24,52.3428
2015-09-25,52.5299
2015-09-28,50.7923
2015-09-29,50.8925
2015-09-30,53.4322
2015-10-01,53.3787
2015-10-02,54.5349
2015-10-05,55.5039
2015-10-06,55.7512
2015-10-07,45.2519
2015-10-08,45.0848
2015-10-09,46.9495
2015-10-12,47.3438
2015-10-13,46.769
2015-10-14,46.1366
2015-10-15,46.6008
2015-10-16,48.545
2015-10-19,48.2423
2015-10-20,49.1303
2015-10-21,49.4869
2015-10-22,48.8949
2015-10-23,49.0361
2015-10-26,49.904
2015-10-27,49.2245
2015-10-28,49.09
2015-10-29,48.7805
2015-10-30,47.7041
2015-11-02,48.323
2015-11-03,48.5787
2015-11-04,48.1279
2015-11-05,47.879
2015-11-06,47.9261
2015-11-09,46.4192
2015-11-10,46.2577
2015-11-11,46.0424
2015-11-12,45.1544
2015-11-13,46.7354
2015-11-16,46.2981
2015-11-17,47.0515
2015-11-18,47.8454
2015-11-19,48.2221
2015-11-20,48.9487
2015-11-23,48.9016
2015-11-24,48.693
2015-11-25,48.8343
2015-11-27,49.0832
2015-11-30,48.7805
2015-12-01,50.1058
2015-12-02,50.422
2015-12-03,49.1976
2015-12-04,51.2225
2015-12-07,51.4042
2015-12-08,50.8525
2015-12-09,49.6483
2015-12-10,49.238
2015-12-11,47.9665
2015-12-14,48.2019
2015-12-15,48.8478
2015-12-16,49.4734
2015-12-17,48.5719
2015-12-18,48.3298
2015-12-21,49.3792
2015-12-22,49.1101
2015-12-23,49.8636
2015-12-24,49.7829
2015-12-28,49.6752
2015-12-29,49.9443
2015-12-30,49.6551
2015-12-31,49.1438
2016-01-04,48.5787
2016-01-05,48.4576
2016-01-06,48.1145
2016-01-07,46.473
2016-01-08,45.8406
2016-01-11,45.7599
2016-01-12,46.8026
2016-01-13,46.7485
2016-01-14,47.4121
2016-01-15,45.4346
2016-01-19,46.5724
2016-01-20,46.0441
2016-01-21,46.701
2016-01-22,46.7146
2016-01-25,45.6378
2016-01-26,47.3173
2016-01-27,46.999
2016-01-28,47.683
2016-01-29,49.0104
2016-02-01,49.5047
2016-02-02,48.9765
2016-02-03,49.0645
2016-02-04,48.9697
2016-02-05,47.2428
2016-02-08,45.6649
2016-02-09,45.0148
2016-02-10,45.2112
2016-02-11,44.1818
2016-02-12,45.604
2016-02-16,47.0803
2016-02-17,48.218
2016-02-18,48.1029
2016-02-19,47.7575
2016-02-22,48.7327
2016-02-23,48.428
2016-02-24,48.4076
2016-02-25,48.0555
2016-02-26,48.367
2016-02-29,49.0781
2016-03-01,51.5973
2016-03-02,51.0691
2016-03-03,51.7328
2016-03-04,52.857
2016-03-07,52.857
2016-03-08,51.9292
2016-03-09,51.6718
2016-03-10,51.9834
2016-03-11,52.6673
2016-03-14,52.5184
2016-03-15,52.9789
2016-03-16,53.2633
2016-03-17,53.3581
2016-03-18,53.033
2016-03-21,53.7915
2016-03-22,53.4868
2016-03-23,54.55
2016-03-24,53.7374
2016-03-28,54.0421
2016-03-29,54.5636
2016-03-30,55.7013
2016-03-31,55.4304
2016-04-01,55.7148
2016-04-04,55.4643
2016-04-05,55.2408
2016-04-06,55.4575
2016-04-07,55.0376
2016-04-08,55.7622
2016-04-11,55.3965
2016-04-12,55.2543
2016-04-13,55.949
2016-04-14,56.1193
2016-04-15,55.7379
2016-04-18,56.2623
2016-04-19,55.9354
2016-04-20,56.2078
2016-04-21,55.6425
2016-04-22,55.2952
2016-04-25,55.411
2016-04-26,55.8741
2016-04-27,55.4995
2016-04-28,54.7844
2016-04-29,54.1851
2016-05-02,55.1454
2016-05-03,54.294
2016-05-04,54.9274
2016-05-05,55.0568
2016-05-06,55.1385
2016-05-09,55.7651
2016-05-10,56.4598
2016-05-11,54.9547
2016-05-12,55.554
2016-05-13,54.689
2016-05-16,55.3361
2016-05-17,55.1522
2016-05-18,54.6005
2016-05-19,54.5324
2016-05-20,54.2123
2016-05-23,54.4711
2016-05-24,55.9354
2016-05-25,56.2555
2016-05-26,56.1533
2016-05-27,56.2487
2016-05-31,55.9081
2016-06-01,56.1397
2016-06-02,56.1601
2016-06-03,56.2623
2016-06-06,56.6573
2016-06-07,56.9638
2016-06-08,57.3384
2016-06-09,57.0251
2016-06-10,56.1874
2016-06-13,56.2351
2016-06-14,56.1806
2016-06-15,56.4053
2016-06-16,56.4734
2016-06-17,56.9025
2016-06-20,57.243
2016-06-21,57.4065
2016-06-22,57.1341
2016-06-23,58.503
2016-06-24,55.949
2016-06-27,54.0284
2016-06-28,55.302
2016-06-29,56.2827
2016-06-30,56.4734
2016-07-01,56.8889
2016-07-05,56.5552
2016-07-06,57.3247
2016-07-07,57.4201
2016-07-08,58.4076
2016-07-11,58.8708
2016-07-12,58.4144
2016-07-13,58.7089
2016-07-14,60.4412
2016-07-15,59.9071
2016-07-18,59.9825
2016-07-19,59.9551
2016-07-20,60.1673
2016-07-21,60.1879
2016-07-22,61.6943
2016-07-25,61.8586
2016-07-26,61.1123
2016-07-27,61.4341
2016-07-28,61.8039
2016-07-29,61.2287
2016-08-01,61.2287
2016-08-02,60.4686
2016-08-03,60.5097
2016-08-04,60.5439
2016-08-05,60.7631
2016-08-08,61.0027
2016-08-09,60.9685
2016-08-10,60.5713
2016-08-11,61.6121
2016-08-12,61.5984
2016-08-15,61.5847
2016-08-16,61.4889
2016-08-17,61.5437
2016-08-18,62.1462
2016-08-19,61.1534
2016-08-22,61.4889
2016-08-23,61.8312
2016-08-24,61.4546
2016-08-25,61.5847
2016-08-26,61.304
2016-08-29,62.1462
2016-08-30,62.1599
2016-08-31,62.112
2016-09-01,62.1462
2016-09-02,62.4886
2016-09-06,62.4817
2016-09-07,62.0367
2016-09-08,60.8658
2016-09-09,59.5511
2016-09-12,60.7083
2016-09-13,59.3731
2016-09-14,59.5237
2016-09-15,60.1126
2016-09-16,60.2838
2016-09-19,60.5234
2016-09-20,60.811
2016-09-21,61.3725
2016-09-22,61.9476
2016-09-23,62.0641
2016-09-26,61.2972
2016-09-27,61.53
2016-09-28,61.7765
2016-09-29,61.4957
2016-09-30,62.1805
2016-10-03,62.2558
2016-10-04,61.8175
2016-10-05,60.6809
2016-10-06,59.8729
2016-10-07,60.0646
2016-10-10,59.8387
2016-10-11,60.4275
2016-10-12,60.9
2016-10-13,61.1944
2016-10-14,61.0643
2016-10-17,59.7283
2016-10-18,59.3358
2016-10-19,60.0796
2016-10-20,59.3633
2016-10-21,59.8936
2016-10-24,60.4652
2016-10-25,59.0397
2016-10-26,59.0397
2016-10-27,58.7849
2016-10-28,59.0328
2016-10-31,59.4184
2016-11-01,58.1255
2016-11-02,57.1773
2016-11-03,57.6083
2016-11-04,57.2827
2016-11-07,59.3897
2016-11-08,59.3801
2016-11-09,59.2556
2016-11-10,58.748
2016-11-11,58.1351
2016-11-14,58.1351
2016-11-15,58.1351
2016-11-16,57.8478
2016-11-17,58.1925
2016-11-18,59.7249
2016-11-21,59.3801
2016-11-22,60.0793
2016-11-23,60.4816
2016-11-25,60.6635
2016-11-28,60.4432
2016-11-29,60.8551
2016-11-30,60.7114
2016-12-01,60.041
2016-12-02,59.7824
2016-12-05,60.3954
2016-12-06,60.7785
2016-12-07,61.717
2016-12-08,61.6404
2016-12-09,61.7649
2016-12-12,62.0044
2016-12-13,61.8894
2016-12-14,61.1807
2016-12-15,61.1137
2016-12-16,61.5351
2016-12-19,61.3339
2016-12-20,61.5063
2016-12-21,61.4776
2016-12-22,61.3435
2016-12-23,61.1137
2016-12-27,61.3244
2016-12-28,61.0275
2016-12-29,60.9413
2016-12-30,60.6539
2017-01-03,60.539
2017-01-04,60.7593
2017-01-05,60.9604
2017-01-06,61.6979
2017-01-09,61.8703
2017-01-10,62.2342
2017-01-11,62.0514
2017-01-12,62.215
2017-01-13,62.215
2017-01-17,61.7435
2017-01-18,61.9263
2017-01-19,61.6088
2017-01-20,62.138
2017-01-23,61.9744
2017-01-24,62.8597
2017-01-25,63.1194
2017-01-26,62.8308
2017-01-27,63.4081
2017-01-30,63.1964
2017-01-31,63.0521
2017-02-01,62.4171
2017-02-02,63.1868
2017-02-03,63.7256
2017-02-06,63.793
2017-02-07,63.9758
2017-02-08,64.072
2017-02-09,64.8418
2017-02-10,65.4287
2017-02-13,65.5345
2017-02-14,65.9868
2017-02-15,66.0541
2017-02-16,65.8521
2017-02-17,65.8136
2017-02-21,65.1112
2017-02-22,63.6005
2017-02-23,63.2638
2017-02-24,63.4562
2017-02-27,63.0425
2017-02-28,62.85
2017-03-01,63.0906
2017-03-02,62.7442
2017-03-03,62.571
2017-03-06,62.061
2017-03-07,61.5992
2017-03-08,61.6569
2017-03-09,61.3971
2017-03-10,61.8782
2017-03-13,61.9456
2017-03-14,61.5318
2017-03-15,61.4934
2017-03-16,61.4068
2017-03-17,61.4549
2017-03-20,61.6473
2017-03-21,61.3202
2017-03-22,60.9257
2017-03-23,60.791
2017-03-24,61.1758
2017-03-27,61.1085
2017-03-28,62.0322
2017-03-29,61.6281
2017-03-30,61.5992
2017-03-31,61.4837
2017-04-03,61.147
2017-04-04,61.426
2017-04-05,61.4549
2017-04-06,62.1092
2017-04-07,61.8494
2017-04-10,61.705
2017-04-11,62.0144
2017-04-12,61.8984
2017-04-13,61.6664
2017-04-17,61.763
2017-04-18,61.8307
2017-04-19,62.3914
2017-04-20,62.8748
2017-04-21,62.6621
2017-04-24,63.5321
2017-04-25,63.7835
2017-04-26,63.6868
2017-04-27,63.8125
2017-04-28,63.5611
2017-05-01,63.5611
2017-05-02,64.1315
2017-05-03,65.9779
2017-05-04,66.6836
2017-05-05,66.9929
2017-05-08,66.8383
2017-05-09,66.4709
2017-05-10,66.5869
2017-05-11,66.8286
2017-05-12,66.6063
2017-05-15,66.9156
2017-05-16,67.0413
2017-05-17,66.8576
2017-05-18,66.7996
2017-05-19,67.7373
2017-05-22,68.646
2017-05-23,68.559
2017-05-24,69.5547
2017-05-25,69.7287
2017-05-26,69.6901
2017-05-30,69.9994
2017-05-31,70.2217
2017-06-01,71.3721
2017-06-02,71.5268
2017-06-05,71.7298
2017-06-06,71.8458
2017-06-07,71.7878
2017-06-08,71.5075
2017-06-09,70.6664
2017-06-12,69.516
2017-06-13,70.2507
2017-06-14,70.6084
2017-06-15,70.1927
2017-06-16,70.3571
2017-06-19,71.4688
2017-06-20,71.4495
2017-06-21,71.9231
2017-06-22,72.0585
2017-06-23,72.3292
2017-06-26,72.2518
2017-06-27,71.5075
2017-06-28,71.6815
2017-06-29,71.0048
2017-06-30,71.3045
2017-07-03,70.9081
2017-07-05,70.6471
2017-07-06,70.2314
2017-07-07,71.0434
2017-07-10,71.0918
2017-07-11,71.5075
2017-07-12,71.9249
2017-07-13,71.2648
2017-07-14,71.4395
2017-07-17,71.4104
2017-07-18,71.5948
2017-07-19,71.9734
2017-07-20,72.4296
2017-07-21,72.5461
2017-07-24,72.4005
2017-07-25,72.6043
2017-07-26,72.4005
2017-07-27,73.3905
2017-07-28,72.7984
2017-07-31,73.2644
2017-08-01,73.3129
2017-08-02,74.3709
2017-08-03,72.6626
2017-08-04,72.8276
2017-08-07,72.7887
2017-08-08,72.0219
2017-08-09,72.8664
2017-08-10,73.1479
2017-08-11,73.342
2017-08-14,74.0409
2017-08-15,74.1476
2017-08-16,74.1768
2017-08-17,73.3226
2017-08-18,73.1964
2017-08-21,73.6235
2017-08-22,74.3029
2017-08-23,74.1671
2017-08-24,74.0215
2017-08-25,73.6041
2017-08-28,73.9729
2017-08-29,73.8564
2017-08-30,73.7885
2017-08-31,74.565
2017-09-01,74.3806
2017-09-05,74.0797
2017-09-06,73.9729
2017-09-07,74.2253
2017-09-08,74.235
2017-09-11,75.5163
2017-09-12,74.9047
2017-09-13,74.8659
2017-09-14,74.895
2017-09-15,73.0411
2017-09-18,73.4876
2017-09-19,73.5361
2017-09-20,74.1282
2017-09-21,74.235
2017-09-22,73.74
2017-09-25,71.7793
2017-09-26,71.2454
2017-09-27,70.9542
2017-09-28,71.3425
2017-09-29,71.4492
2017-10-02,71.5851
2017-10-03,71.7501
2017-10-04,71.9249
2017-10-05,72.3908
2017-10-06,73.7011
2017-10-09,73.7691
2017-10-10,73.9438
2017-10-11,74.3903
2017-10-12,74.1671
2017-10-13,73.9632
2017-10-16,73.9729
2017-10-17,73.9535
2017-10-18,73.7885
2017-10-19,73.5944
2017-10-20,73.9341
2017-10-23,73.3323
2017-10-24,73.1285
2017-10-25,72.4878
2017-10-26,73.6429
2017-10-27,73.0314
2017-10-30,72.7596
2017-10-31,72.2646
2017-11-01,72.1287
2017-11-02,76.8266
2017-11-03,76.5937
2017-11-06,77.5255
2017-11-07,78.632
2017-11-08,78.7485
2017-11-09,77.1955
2017-11-10,77.2537
2017-11-13,77.3993
2017-11-14,77.3895
2017-11-15,76.7757
2017-11-16,76.5224
2017-11-17,76.5809
2017-11-20,76.766
2017-11-21,77.487
2017-11-22,77.1947
2017-11-24,77.146
2017-11-27,77.5357
2017-11-28,78.9484
2017-11-29,79.7084
2017-11-30,81.3258
2017-12-01,81.2576
2017-12-04,81.1699
2017-12-05,80.9653
2017-12-06,81.1017
2017-12-07,80.9166
2017-12-08,81.1796
2017-12-11,80.332
2017-12-12,79.8838
2017-12-13,80.0786
2017-12-14,79.9325
2017-12-15,80.1858
2017-12-18,80.975
2017-12-19,80.7314
2017-12-20,80.0202
2017-12-21,80.3807
2017-12-22,80.2832
2017-12-26,80.0786
2017-12-27,80.2832
2017-12-28,80.5463
2017-12-29,79.5135
2018-01-02,79.5038
2018-01-03,79.4356
2018-01-04,80.2443
2018-01-05,80.7119
2018-01-08,80.8483
2018-01-09,80.634
2018-01-10,80.4294
2018-01-11,80.3709
2018-01-12,81.4719
2018-01-16,80.7996
2018-01-17,80.9555
2018-01-18,80.9653
2018-01-19,81.657
2018-01-22,82.7288
2018-01-23,83.6349
2018-01-24,83.0503
2018-01-25,83.4595
2018-01-26,83.9856
2018-01-29,84.2584
2018-01-30,82.417
2018-01-31,82.417
2018-02-01,81.8227
2018-02-02,80.5073
2018-02-05,77.75
2018-02-06,78.51
2018-02-07,78.0716
2018-02-08,74.34
2018-02-09,77.2726
2018-02-12,76.0645
2018-02-13,76.1232
2018-02-14,76.2309
2018-02-15,77.2978
2018-02-16,76.593
2018-02-20,76.4266
2018-02-21,76.1623
2018-02-22,76.6615
2018-02-23,78.1102
2018-02-26,78.8639
2018-02-27,78.4822
2018-02-28,79.6568
2018-03-01,78.0123
2018-03-02,78.5898
2018-03-05,78.9226
2018-03-06,79.6568
2018-03-07,79.6861
2018-03-08,80.6747
2018-03-09,81.1935
2018-03-12,80.6649
2018-03-13,80.6062
2018-03-14,80.5279
2018-03-15,81.125
2018-03-16,81.7319
2018-03-19,80.4007
2018-03-20,81.3305
2018-03-21,81.0565
2018-03-22,80.4398
2018-03-23,79.9504
2018-03-26,82.2506
2018-03-27,82.1038
2018-03-28,82.466
2018-03-29,83.3273
2018-04-02,81.9668
2018-04-03,82.3289
2018-04-04,83.6112
2018-04-05,84.1887
2018-04-06,82.6715
2018-04-09,82.6617
2018-04-10,83.7678
2018-04-11,83.6308
2018-04-12,83.9342
2018-04-13,83.6112
2018-04-16,84.4334
2018-04-17,84.7662
2018-04-18,85.148
2018-04-19,84.6096
2018-04-20,84.4628
2018-04-23,84.0712
2018-04-24,83.3763
2018-04-25,83.4546
2018-04-26,84.9228
2018-04-27,85.2067
2018-04-30,85.2556
2018-05-01,84.8054
2018-05-02,78.5017
2018-05-03,80.9194
2018-05-04,80.6845
2018-05-07,81.3501
2018-05-08,81.7416
2018-05-09,82.6617
2018-05-10,82.8869
2018-05-11,82.8281
2018-05-14,81.8297
2018-05-15,81.928
2018-05-16,82.1541
2018-05-17,81.5938
2018-05-18,80.945
2018-05-21,81.289
2018-05-22,80.9843
2018-05-23,81.6823
2018-05-24,82.0558
2018-05-25,81.1317
2018-05-29,80.5223
2018-05-30,81.1121
2018-05-31,79.9521
2018-06-01,80.5223
2018-06-04,80.8958
2018-06-05,81.5053
2018-06-06,82.1935
2018-06-07,82.7636
2018-06-08,81.7707
2018-06-11,81.7019
2018-06-12,81.8199
2018-06-13,81.1907
2018-06-14,81.9673
2018-06-15,81.2202
2018-06-18,81.407
2018-06-19,79.6375
2018-06-20,79.49
2018-06-21,78.3792
2018-06-22,78.9985
2018-06-25,77.2585
2018-06-26,78.6544
2018-06-27,77.5338
2018-06-28,76.5704
2018-06-29,76.8948
2018-07-02,76.7866
2018-07-03,76.5212
2018-07-05,76.4229
2018-07-06,76.9439
2018-07-09,77.8287
2018-07-10,77.9663
2018-07-11,77.4551
2018-07-12,77.7795
2018-07-13,77.7992
2018-07-16,77.3273
2018-07-17,77.3863
2018-07-18,78.1433
2018-07-19,77.986
2018-07-20,77.9663
2018-07-23,77.6124
2018-07-24,76.9243
2018-07-25,77.3371
2018-07-26,77.6124
2018-07-27,77.5731
2018-07-30,77.406
2018-07-31,77.9466
2018-08-01,78.1236
2018-08-02,79.2639
2018-08-03,80.4731
2018-08-06,80.2077
2018-08-07,79.9521
2018-08-08,80.5321
2018-08-09,81.3284
2018-08-10,81.5348
2018-08-13,80.9843
2018-08-14,81.6823
2018-08-15,81.466
2018-08-16,82.7735
2018-08-17,82.7439
2018-08-20,83.0401
2018-08-21,83.2573
2018-08-22,82.7439
2018-08-23,82.4576
2018-08-24,83.0697
2018-08-27,83.4152
2018-08-28,84.284
2018-08-29,84.8961
2018-08-30,84.6098
2018-08-31,85.7847
2018-09-04,85.913
2018-09-05,85.6267
2018-09-06,86.8016
2018-09-07,87.2755
2018-09-10,87.3347
2018-09-11,87.1077
2018-09-12,87.2064
2018-09-13,87.3643
2018-09-14,87.0188
2018-09-17,86.5745
2018-09-18,87.1669
2018-09-19,87.4236
2018-09-20,87.8284
2018-09-21,88.3911
2018-09-24,88.164
2018-09-25,88.7367
2018-09-26,88.7367
2018-09-27,89.1711
2018-09-28,89.7536
2018-10-01,89.2698
2018-10-02,88.8354
2018-10-03,88.6182
2018-10-04,88.4306
2018-10-05,88.8551
2018-10-08,89.487
2018-10-09,90.0201
2018-10-10,88.0653
2018-10-11,85.9624
2018-10-12,86.9299
2018-10-15,87.3249
2018-10-16,89.2797
2018-10-17,90.1978
2018-10-18,88.6774
2018-10-19,88.2628
2018-10-22,88.2134
2018-10-23,87.6901
2018-10-24,85.9525
2018-10-25,85.8143
2018-10-26,84.6888
2018-10-29,84.3828
2018-10-30,85.3305
2018-10-31,89.2599
2018-11-01,86.8707
2018-11-02,85.7946
2018-11-05,86.3573
2018-11-06,86.7819
2018-11-07,88.243
2018-11-08,89.3093
2018-11-09,89.566
2018-11-12,88.3121
2018-11-13,87.8975
2018-11-14,88.0456
2018-11-15,87.6605
2018-11-16,87.7593
2018-11-19,87.0089
2018-11-20,86.0809
2018-11-21,85.9229
2018-11-23,86.4385
2018-11-26,87.5488
2018-11-27,88.6988
2018-11-28,90.9393
2018-11-29,91.0682
2018-11-30,91.4251
2018-12-03,91.2764
2018-12-04,89.8984
2018-12-06,90.7113
2018-12-07,89.6506
2018-12-10,89.482
2018-12-11,89.0359
2018-12-12,89.6803
2018-12-13,92.6544
2018-12-14,90.9096
2018-12-17,88.9368
2018-12-18,89.3234
2018-12-19,89.3432
2018-12-20,86.3691
2018-12-21,87.3803
2018-12-24,86.2699
2018-12-26,89.2143
2018-12-27,90.176
2018-12-28,90.8204
2018-12-31,91.1277
2019-01-02,90.6518
2019-01-03,88.3717
2019-01-04,90.6717
2019-01-07,90.5725
2019-01-08,90.3941
2019-01-09,90.3544
2019-01-10,90.9988
2019-01-11,90.1562
2019-01-14,89.2243
2019-01-15,89.6109
2019-01-16,89.0557
2019-01-17,89.9182
2019-01-18,91.5639
2019-01-22,91.2566
2019-01-23,91.9803
2019-01-24,92.1092
2019-01-25,91.9109
2019-01-28,91.7919
2019-01-29,91.8712
2019-01-30,92.6445
2019-01-31,93.17
2019-02-01,93.3187
2019-02-04,93.8342
2019-02-05,93.626
2019-02-06,93.7747
2019-02-07,93.7945
2019-02-08,93.6756
2019-02-11,92.4562
2019-02-12,93.2393
2019-02-13,92.9406
2019-02-14,93.4585
2019-02-15,93.7273
2019-02-19,94.1257
2019-02-20,94.3248
2019-02-21,94.4842
2019-02-22,94.992
2019-02-25,93.1099
2019-02-26,92.9705
2019-02-27,92.7215
2019-02-28,94.1057
2019-03-01,94.9721
2019-03-04,94.7431
2019-03-05,95.5298
2019-03-06,96.197
2019-03-07,96.1372
2019-03-08,96.2667
2019-03-11,97.382
2019-03-12,97.5712
2019-03-13,98.2285
2019-03-14,98.5671
2019-03-15,100.479
2019-03-18,99.8218
2019-03-19,98.826
2019-03-20,98.1588
2019-03-21,98.7762
2019-03-22,98.5571
2019-03-25,98.5571
2019-03-26,98.338
2019-03-27,98.5671
2019-03-28,98.7264
2019-03-29,99.3936
2019-04-01,100.1604
2019-04-02,99.762
2019-04-03,100.1205
2019-04-04,100.0309
2019-04-05,99.543
2019-04-08,99.1745
2019-04-09,99.065
2019-04-10,99.6226
2019-04-11,100.3496
2019-04-12,100.977
2019-04-15,101.216
2019-04-16,101.206
2019-04-17,101.0765
2019-04-18,102.8889
2019-04-22,102.7495
2019-04-23,102.4906
2019-04-24,102.9089
2019-04-25,103.0184
2019-04-26,103.6557
2019-04-29,103.3669
2019-04-30,103.9545
2019-05-01,101.5147
2019-05-02,101.3155
2019-05-03,102.2915
2019-05-06,101.9827
2019-05-07,101.0467
2019-05-08,100.0708
2019-05-09,100.3197
2019-05-10,101.0068
2019-05-13,99.9911
2019-05-14,100.26
2019-05-15,100.36
2019-05-16,100.87
2019-05-17,101.3
2019-05-20,100.69
2019-05-21,101.78
2019-05-22,101.46
2019-05-23,101.39
2019-05-24,100.99
2019-05-28,99.8
2019-05-29,99.65
2019-05-30,101.55
2019-05-31,102.35
2019-06-03,104.11
2019-06-04,106.97
2019-06-05,107.29
2019-06-06,108.42
2019-06-07,109.07
2019-06-10,108.65
2019-06-11,107.57
2019-06-12,108.94
2019-06-13,108.91
2019-06-14,109.885
2019-06-17,109.21
2019-06-18,108.73
2019-06-19,109.37
2019-06-20,110.285
2019-06-21,110.31
2019-06-24,110.57
2019-06-25,110.36
2019-06-26,110.12
2019-06-27,110.405
2019-06-28,110.32
2019-07-01,109.22
2019-07-02,110.86
2019-07-03,110.93
2019-07-04,110.93
2019-07-05,110.485
2019-07-08,110.015
2019-07-09,110.23
2019-07-10,110.73
2019-07-11,111.195
2019-07-12,111.185
2019-07-15,111.98
2019-07-16,111.56
2019-07-17,111.88
2019-07-18,113.125
2019-07-19,112.54
2019-07-22,113.205
2019-07-23,112.99
2019-07-24,112.665
2019-07-25,112.795
2019-07-26,114.065
2019-07-29,114.115
2019-07-30,113.205
2019-07-31,112.675
2019-08-01,117.02
2019-08-02,117.275
2019-08-05,115.12
2019-08-06,116.21
2019-08-07,116.275
2019-08-08,117.39
2019-08-09,118.855
2019-08-12,116.68
2019-08-13,117.035
2019-08-14,115.68
2019-08-15,116.46
2019-08-16,115.77
2019-08-19,116.65
2019-08-20,116.58
2019-08-21,117.19
2019-08-22,117.425
2019-08-23,115.005
2019-08-26,117.105
2019-08-27,117.24
2019-08-28,117.11
2019-08-29,117.21
2019-08-30,116.85
2019-09-02,116.77
2019-09-03,116.73
2019-09-04,117.86
2019-09-05,118.03
2019-09-06,119.16
2019-09-09,117.74
2019-09-10,115.105
2019-09-11,113.71
2019-09-12,113.21
2019-09-13,111.34
2019-09-16,110.42
2019-09-17,112.86
2019-09-18,114.47
2019-09-19,114.05
2019-09-20,112.5
2019-09-23,113.62
2019-09-24,112.24
2019-09-25,111.5
2019-09-26,112.86
2019-09-27,112.83
2019-09-30,113.35
2019-10-01,112.9
2019-10-02,112.56
2019-10-03,113.375
2019-10-04,114.605
2019-10-07,113.84
2019-10-08,112.49
2019-10-09,113.36
2019-10-10,114.34
2019-10-11,114.31
2019-10-14,112.76
2019-10-15,111.15
2019-10-16,111.47
2019-10-17,110.285
2019-10-18,112.485
2019-10-21,112.35
2019-10-22,110.08
2019-10-23,109.215
2019-10-24,108.95
2019-10-25,109.16
2019-10-28,109.73
2019-10-29,109.825
2019-10-30,102.94
2019-10-31,101.765
2019-11-01,99.33
2019-11-04,98.3
2019-11-05,97.675
2019-11-06,100.09
2019-11-07,99.525
2019-11-08,98.905
2019-11-11,98.93
2019-11-12,98.245
2019-11-13,98.44
2019-11-14,98.14
2019-11-15,98.28
2019-11-18,98.215
2019-11-19,98.065
2019-11-20,98.135
2019-11-21,98
2019-11-22,97.61
2019-11-25,98.065
