date,close
2014-06-13,20.02
2014-06-16,20.01
2014-06-17,19.91
2014-06-18,20.01
2014-06-19,19.9
2014-06-20,20.03
2014-06-23,20.19
2014-06-24,20.06
2014-06-25,20.35
2014-06-26,20.73
2014-06-27,21.26
2014-06-30,21.37
2014-07-01,21.63
2014-07-02,22.36
2014-07-03,23.07
2014-07-07,22.69
2014-07-08,22.24
2014-07-09,22.45
2014-07-10,21.91
2014-07-11,21.77
2014-07-14,22.07
2014-07-15,21.8
2014-07-16,21.83
2014-07-17,21.3
2014-07-18,21.75
2014-07-21,21.53
2014-07-22,21.62
2014-07-23,21.55
2014-07-24,21.63
2014-07-25,21.47
2014-07-28,21.53
2014-07-29,21.6
2014-07-30,22.29
2014-07-31,23.48
2014-08-01,23.43
2014-08-04,23.31
2014-08-05,23.3
2014-08-06,23.67
2014-08-07,23.54
2014-08-08,24.13
2014-08-11,24.66
2014-08-12,24.86
2014-08-13,25.16
2014-08-14,25.28
2014-08-15,25.45
2014-08-18,25.49
2014-08-19,25.3
2014-08-20,25.25
2014-08-21,25.38
2014-08-22,25.33
2014-08-25,25.51
2014-08-26,25.76
2014-08-27,25.77
2014-08-28,25.49
2014-08-29,25.74
2014-09-02,25.46
2014-09-03,25.32
2014-09-04,25.09
2014-09-05,24.98
2014-09-08,24.96
2014-09-09,24.65
2014-09-10,24.64
2014-09-11,24.65
2014-09-12,24.38
2014-09-15,24
2014-09-16,23.97
2014-09-17,23.96
2014-09-18,23.98
2014-09-19,23.55
2014-09-22,23.14
2014-09-23,23.92
2014-09-24,23.9
2014-09-25,23.51
2014-09-26,23.73
2014-09-29,23.63
2014-09-30,23.2
2014-10-01,22.74
2014-10-02,23.27
2014-10-03,22.93
2014-10-06,23.24
2014-10-07,22.95
2014-10-08,23.67
2014-10-09,23.09
2014-10-10,23.2
2014-10-13,23.75
2014-10-14,23.53
2014-10-15,23.6
2014-10-16,23.66
2014-10-17,23.51
2014-10-20,23.75
2014-10-21,23.73
2014-10-22,23.21
2014-10-23,23.36
2014-10-24,23.74
2014-10-27,23.52
2014-10-28,23.82
2014-10-29,24.49
2014-10-30,24.32
2014-10-31,24.35
2014-11-03,23.75
2014-11-04,24.1
2014-11-05,23.63
2014-11-06,23.75
2014-11-07,23.64
2014-11-10,23.75
2014-11-11,23.59
2014-11-12,23.75
2014-11-13,23.72
2014-11-14,23.67
2014-11-17,23.49
2014-11-18,23.37
2014-11-19,23.63
2014-11-20,23.77
2014-11-21,23.74
2014-11-24,23.75
2014-11-25,24.07
2014-11-26,23.96
2014-11-28,23.51
2014-12-01,24.02
2014-12-02,24.98
2014-12-03,24.82
2014-12-04,24.76
2014-12-05,25.01
2014-12-08,25.38
2014-12-09,27.33
2014-12-10,27.05
2014-12-11,28.48
2014-12-12,28.73
2014-12-15,28.57
2014-12-16,29.01
2014-12-17,29.74
2014-12-18,29.83
2014-12-19,29.63
2014-12-22,30.35
2014-12-23,30.54
2014-12-24,30.33
2014-12-26,31.02
2014-12-29,30.69
2014-12-30,31.46
2014-12-31,31.18
2015-01-02,30.91
2015-01-05,30.81
2015-01-06,30.7
2015-01-07,30.44
2015-01-08,30.78
2015-01-09,30.68
2015-01-12,30.67
2015-01-13,30.9
2015-01-14,30.75
2015-01-15,30.33
2015-01-16,30.53
2015-01-20,29.9
2015-01-21,30.12
2015-01-22,30.72
2015-01-23,29.93
2015-01-26,29.66
2015-01-27,29.91
2015-01-28,29.72
2015-01-29,30.44
2015-01-30,29.72
2015-02-02,28.95
2015-02-03,28.88
2015-02-04,29.6
2015-02-05,30.13
2015-02-06,30.08
2015-02-09,30.02
2015-02-10,30.5
2015-02-11,30.72
2015-02-12,30.99
2015-02-13,30.42
2015-02-17,30.07
2015-02-18,30.43
2015-02-19,30.12
2015-02-20,29.27
2015-02-23,29.38
2015-02-24,29.17
2015-02-25,28.93
2015-02-26,33.61
2015-02-27,33.8
2015-03-02,34.33
2015-03-03,34.39
2015-03-04,34.4
2015-03-05,34.31
2015-03-06,33.28
2015-03-09,33.39
2015-03-10,32.65
2015-03-11,32.23
2015-03-12,32.35
2015-03-13,32.35
2015-03-16,32.68
2015-03-17,32.51
2015-03-18,32.37
2015-03-19,32.51
2015-03-20,32.4
2015-03-23,32.48
2015-03-24,32.4
2015-03-25,31.48
2015-03-26,31.25
2015-03-27,32.32
2015-03-30,32.48
2015-03-31,33.03
2015-04-01,35.17
2015-04-02,34.73
2015-04-06,34.72
2015-04-07,34.24
2015-04-08,34.04
2015-04-09,33.93
2015-04-10,34.21
2015-04-13,34.74
2015-04-14,34.81
2015-04-15,34.26
2015-04-16,33.88
2015-04-17,32.98
2015-04-20,34.03
2015-04-21,34.48
2015-04-22,34.07
2015-04-23,34.73
2015-04-24,36.06
2015-04-27,34.04
2015-04-28,35.18
2015-04-29,33.34
2015-04-30,32.06
2015-05-01,31.64
2015-05-04,31.61
2015-05-05,30.15
2015-05-06,30.53
2015-05-07,33.32
2015-05-08,34.25
2015-05-11,34.39
2015-05-12,34.05
2015-05-13,33.59
2015-05-14,34.07
2015-05-15,34.08
2015-05-18,34.8
2015-05-19,35.17
2015-05-20,36
2015-05-21,34.63
2015-05-22,34.56
2015-05-26,35.08
2015-05-27,35.91
2015-05-28,35.78
2015-05-29,36.76
2015-06-01,37.04
2015-06-02,36.95
2015-06-03,36.25
2015-06-04,36.23
2015-06-05,36.275
2015-06-08,36.18
2015-06-09,36.31
2015-06-10,36.47
2015-06-11,36.97
2015-06-12,36.24
2015-06-15,36.63
2015-06-16,37.49
2015-06-17,37.98
2015-06-18,38.82
2015-06-19,40.61
2015-06-22,40
2015-06-23,38.31
2015-06-24,37.14
2015-06-25,38.15
2015-06-26,38.87
2015-06-29,38.55
2015-06-30,38.25
2015-07-01,37.53
2015-07-02,36.95
2015-07-06,37.5
2015-07-07,37.49
2015-07-08,37.4
2015-07-09,37.83
2015-07-10,39.26
2015-07-13,40.31
2015-07-14,40.38
2015-07-15,39.66
2015-07-16,41.27
2015-07-17,42.01
2015-07-20,40.71
2015-07-21,40.9
2015-07-22,41.58
2015-07-23,40.78
2015-07-24,40.66
2015-07-27,39.8
2015-07-28,40.41
2015-07-29,39.23
2015-07-30,38.58
2015-07-31,40.29
2015-08-03,40.41
2015-08-04,41.03
2015-08-05,42.75
2015-08-06,46.66
2015-08-07,51.12
2015-08-10,48.74
2015-08-11,47.4
2015-08-12,47.43
2015-08-13,47.5
2015-08-14,47.48
2015-08-17,47.49
2015-08-18,47.78
2015-08-19,47.44
2015-08-20,45.3
2015-08-21,45.55
2015-08-24,42.99
2015-08-25,43.02
2015-08-26,43.44
2015-08-27,43.68
2015-08-28,43.46
2015-08-31,43.3
2015-09-01,44.25
2015-09-02,46.85
2015-09-03,46.45
2015-09-04,46.66
2015-09-08,46.72
2015-09-09,47.05
2015-09-10,46.04
2015-09-11,45.75
2015-09-14,47.64
2015-09-15,48
2015-09-16,47.64
2015-09-17,49.16
2015-09-18,47.83
2015-09-21,47.5
2015-09-22,48.44
2015-09-23,49.59
2015-09-24,49.87
2015-09-25,47.7
2015-09-28,45.01
2015-09-29,44.21
2015-09-30,44.77
2015-10-01,42.97
2015-10-02,43.76
2015-10-05,43.58
2015-10-06,43.44
2015-10-07,43.48
2015-10-08,43.25
2015-10-09,43.52
2015-10-12,44.85
2015-10-13,45.32
2015-10-14,45.14
2015-10-15,46.52
2015-10-16,46.73
2015-10-19,47.53
2015-10-20,47.39
2015-10-21,47.25
2015-10-22,44.8
2015-10-23,44.7
2015-10-26,43.86
2015-10-27,44.1
2015-10-28,44.57
2015-10-29,44.61
2015-10-30,45.065
2015-11-02,45.67
2015-11-03,46.33
2015-11-04,46.18
2015-11-05,47.59
2015-11-06,49.16
2015-11-09,48
2015-11-10,47.49
2015-11-11,46.09
2015-11-12,45.07
2015-11-13,46.17
2015-11-16,45.45
2015-11-17,45.24
2015-11-18,45.43
2015-11-19,43.7
2015-11-20,45.75
2015-11-23,45.96
2015-11-24,46.57
2015-11-25,47.04
2015-11-27,47.29
2015-11-30,46.55
2015-12-01,46.07
2015-12-02,46.04
2015-12-03,45.27
2015-12-04,47.01
2015-12-07,46.03
2015-12-08,46.12
2015-12-09,45.5
2015-12-10,45.58
2015-12-11,45.3
2015-12-14,45.02
2015-12-15,45.12
2015-12-16,45.83
2015-12-17,46.52
2015-12-18,45.74
2015-12-21,46.6
2015-12-22,46.45
2015-12-23,46.81
2015-12-24,45.57
2015-12-28,45.29
2015-12-29,46.76
2015-12-30,46.3
2015-12-31,45.29
2016-01-04,42.97
2016-01-05,42.56
2016-01-06,44.1
2016-01-07,43.5
2016-01-08,42.24
2016-01-11,40.78
2016-01-12,40.7
2016-01-13,38.71
2016-01-14,39.44
2016-01-15,39.79
2016-01-19,38.99
2016-01-20,39.84
2016-01-21,38.29
2016-01-22,38.46
2016-01-25,38.31
2016-01-26,38.48
2016-01-27,37.43
2016-01-28,36.68
2016-01-29,37.92
2016-02-01,37.52
2016-02-02,36.53
2016-02-03,35.63
2016-02-04,35.49
2016-02-05,34.27
2016-02-08,33.55
2016-02-09,33.99
2016-02-10,34.69
2016-02-11,33.77
2016-02-12,34.51
2016-02-16,35.14
2016-02-17,35.61
2016-02-18,34.54
2016-02-19,35
2016-02-22,35.85
2016-02-23,35.74
2016-02-24,36.38
2016-02-25,36.6
2016-02-26,36.84
2016-02-29,35.63
2016-03-01,37.43
2016-03-02,35.25
2016-03-03,36.92
2016-03-04,35.69
2016-03-07,36.51
2016-03-08,35.33
2016-03-09,36.93
2016-03-10,35.39
2016-03-11,36.09
2016-03-14,35.71
2016-03-15,35.21
2016-03-16,34.91
2016-03-17,34.3
2016-03-18,34.45
2016-03-21,34.3
2016-03-22,33.89
2016-03-23,34.41
2016-03-24,34.19
2016-03-28,34.79
2016-03-29,35.46
2016-03-30,35.41
2016-03-31,35.56
2016-04-01,35.96
2016-04-04,36.07
2016-04-05,35.56
2016-04-06,35.05
2016-04-07,35.67
2016-04-08,35.99
2016-04-11,35.29
2016-04-12,35.93
2016-04-13,36.78
2016-04-14,38.32
2016-04-15,38.57
2016-04-18,38.78
2016-04-19,38.95
2016-04-20,40.1
2016-04-21,39.64
2016-04-22,39.83
2016-04-25,40.06
2016-04-26,40.83
2016-04-27,41.68
2016-04-28,41
2016-04-29,40.34
2016-05-02,40.77
2016-05-03,40.66
2016-05-04,40.29
2016-05-05,40.85
2016-05-06,42.35
2016-05-09,43.67
2016-05-10,43.23
2016-05-11,42.6
2016-05-12,40.87
2016-05-13,40.87
2016-05-16,41.6
2016-05-17,40.98
2016-05-18,42.29
2016-05-19,41.62
2016-05-20,41.97
2016-05-23,41.03
2016-05-24,42.03
2016-05-25,41.59
2016-05-26,41
2016-05-27,41.02
2016-05-31,42
2016-06-01,42.71
2016-06-02,43.09
2016-06-03,42.69
2016-06-06,43.14
2016-06-07,43.37
2016-06-08,43.49
2016-06-09,43.53
2016-06-10,42.75
2016-06-13,41.9
2016-06-14,42.21
2016-06-15,41.84
2016-06-16,41.87
2016-06-17,41.43
2016-06-20,41.84
2016-06-21,42.26
2016-06-22,42.14
2016-06-23,42.9
2016-06-24,42.06
2016-06-27,41.55
2016-06-28,41.53
2016-06-29,41.83
2016-06-30,43.28
2016-07-01,42.9
2016-07-05,42.54
2016-07-06,43.82
2016-07-07,44.38
2016-07-08,45.53
2016-07-11,45.89
2016-07-12,46.06
2016-07-13,46.51
2016-07-14,45.96
2016-07-15,45.34
2016-07-18,45.43
2016-07-19,45.54
2016-07-20,45.43
2016-07-21,45.37
2016-07-22,45.64
2016-07-25,45.24
2016-07-26,45.56
2016-07-27,45.53
2016-07-28,45.57
2016-07-29,45.26
2016-08-01,45.32
2016-08-02,44.48
2016-08-03,44.66
2016-08-04,41.9
2016-08-05,40.51
2016-08-08,39.39
2016-08-09,39.64
2016-08-10,39.19
2016-08-11,38.89
2016-08-12,38.67
2016-08-15,38.86
2016-08-16,38.3
2016-08-17,37.7
2016-08-18,37.38
2016-08-19,37.01
2016-08-22,37.09
2016-08-23,36.78
2016-08-24,36.28
2016-08-25,35.99
2016-08-26,35.86
2016-08-29,36.28
2016-08-30,36.4
2016-08-31,35.56
2016-09-01,34.9
2016-09-02,35.93
2016-09-06,35.46
2016-09-07,35.58
2016-09-08,36.41
2016-09-09,35.77
2016-09-12,36.23
2016-09-13,36
2016-09-14,35.93
2016-09-15,36.21
2016-09-16,36.43
2016-09-19,36.59
2016-09-20,36.34
2016-09-21,36.83
2016-09-22,37.84
2016-09-23,38.43
2016-09-26,37.7
2016-09-27,37.88
2016-09-28,38.1
2016-09-29,37.29
2016-09-30,36.88
2016-10-03,36.61
2016-10-04,37.46
2016-10-05,37.56
2016-10-06,37.16
2016-10-07,36.74
2016-10-10,37.27
2016-10-11,36.54
2016-10-12,36.53
2016-10-13,36.4
2016-10-14,36.32
2016-10-17,36.39
2016-10-18,37.39
2016-10-19,37.32
2016-10-20,37.12
2016-10-21,36.06
2016-10-24,36.1
2016-10-25,36.05
2016-10-26,35.12
2016-10-27,33.1
2016-10-28,32.48
2016-10-31,34.27
2016-11-01,32.7
2016-11-02,33.93
2016-11-03,38.97
2016-11-04,40.53
2016-11-07,42.01
2016-11-08,42.45
2016-11-09,41.95
2016-11-10,42.83
2016-11-11,43
2016-11-14,43.63
2016-11-15,43.56
2016-11-16,43.24
2016-11-17,43.03
2016-11-18,43.5
2016-11-21,43.41
2016-11-22,43.58
2016-11-23,43.53
2016-11-25,44.34
2016-11-28,43.63
2016-11-29,42.82
2016-11-30,42.06
2016-12-01,42.7
2016-12-02,41.98
2016-12-05,42.49
2016-12-06,42.51
2016-12-07,42.54
2016-12-08,43.11
2016-12-09,43.42
2016-12-12,43.6
2016-12-13,43.47
2016-12-14,42.87
2016-12-15,43.88
2016-12-16,44.04
2016-12-19,44.64
2016-12-20,45
2016-12-21,44.52
2016-12-22,44.3
2016-12-23,44.96
2016-12-27,45.67
2016-12-28,45.7
2016-12-29,45.52
2016-12-30,45.7
2017-01-03,45.66
2017-01-04,46.13
2017-01-05,45.3
2017-01-06,45.39
2017-01-09,45.32
2017-01-10,44.69
2017-01-11,44.8
2017-01-12,44.64
2017-01-13,46.22
2017-01-17,46.66
2017-01-18,46.76
2017-01-19,45.99
2017-01-20,46.24
2017-01-23,46.44
2017-01-24,46.59
2017-01-25,46.97
2017-01-26,46.96
2017-01-27,47.78
2017-01-30,47
2017-01-31,50.13
2017-02-01,49.97
2017-02-02,50.23
2017-02-03,49.76
2017-02-06,48.69
2017-02-07,48.25
2017-02-08,47.5
2017-02-09,46.95
2017-02-10,46.71
2017-02-13,46.49
2017-02-14,47.7
2017-02-15,47.96
2017-02-16,48.18
2017-02-17,48.3
2017-02-21,48.9
2017-02-22,49.26
2017-02-23,48.99
2017-02-24,48.75
2017-02-27,48.77
2017-02-28,48.02
2017-03-01,48.52
2017-03-02,48.86
2017-03-03,49.11
2017-03-06,48.86
2017-03-07,48.5
2017-03-08,48.46
2017-03-09,48.43
2017-03-10,53.1
2017-03-13,50.74
2017-03-14,50.67
2017-03-15,50.46
2017-03-16,50.04
2017-03-17,50.1
2017-03-20,50
2017-03-21,50.18
2017-03-22,50.03
2017-03-23,50.62
2017-03-24,51.61
2017-03-27,52.99
2017-03-28,53.71
2017-03-29,53.54
2017-03-30,54.1
2017-03-31,53.9
2017-04-03,53.64
2017-04-04,52.65
2017-04-05,53.06
2017-04-06,53.17
2017-04-07,52.62
2017-04-10,52.65
2017-04-11,53.2
2017-04-12,52.97
2017-04-13,52.35
2017-04-17,52.39
2017-04-18,51.76
2017-04-19,52.05
2017-04-20,53.04
2017-04-21,52.78
2017-04-24,53.17
2017-04-25,53.33
2017-04-26,54.15
2017-04-27,54.665
2017-04-28,54.1
2017-05-01,54.93
2017-05-02,55.7
2017-05-03,55.43
2017-05-04,60.96
2017-05-05,60.27
2017-05-08,60.8
2017-05-09,60.68
2017-05-10,60.99
2017-05-11,60.4
2017-05-12,61.28
2017-05-15,60.5
2017-05-16,60.5
2017-05-17,59.84
2017-05-18,59.85
2017-05-19,59.51
2017-05-22,59.82
2017-05-23,59.48
2017-05-24,60.05
2017-05-25,60.65
2017-05-26,60.49
2017-05-30,59.93
2017-05-31,60.2
2017-06-01,60.79
2017-06-02,61.12
2017-06-05,62.64
2017-06-06,63.22
2017-06-07,64.04
2017-06-08,65.07
2017-06-09,65.61
2017-06-12,65.22
2017-06-13,65.43
2017-06-14,66.35
2017-06-15,65.93
2017-06-16,65.81
2017-06-19,66.37
2017-06-20,65.9
2017-06-21,67.27
2017-06-22,68.04
2017-06-23,68.35
2017-06-26,66.99
2017-06-27,65.53
2017-06-28,67
2017-06-29,67.3
2017-06-30,67.89
2017-07-03,67.56
2017-07-05,67.69
2017-07-06,65.66
2017-07-07,66.48
2017-07-10,65.2
2017-07-11,64.81
2017-07-12,64.65
2017-07-13,64.45
2017-07-14,65.35
2017-07-17,64.24
2017-07-18,63.52
2017-07-19,63.37
2017-07-20,63.35
2017-07-21,63.43
2017-07-24,63.605
2017-07-25,64.26
2017-07-26,58.92
2017-07-27,58.34
2017-07-28,58.3
2017-07-31,57.9
2017-08-01,58.16
2017-08-02,57.72
2017-08-03,60.03
2017-08-04,60.85
2017-08-07,62.62
2017-08-08,63.95
2017-08-09,62.95
2017-08-10,63.16
2017-08-11,63.87
2017-08-14,63.9
2017-08-15,64.97
2017-08-16,65.23
2017-08-17,63.86
2017-08-18,64.31
2017-08-21,64.43
2017-08-22,64.2
2017-08-23,63.45
2017-08-24,63.66
2017-08-25,63.1
2017-08-28,64.14
2017-08-29,63.39
2017-08-30,63.5
2017-08-31,65.25
2017-09-01,65.33
2017-09-05,66.16
2017-09-06,65.62
2017-09-07,65.43
2017-09-08,65.42
2017-09-11,65.27
2017-09-12,65.15
2017-09-13,65.27
2017-09-14,64.81
2017-09-15,65.57
2017-09-18,64.96
2017-09-19,63.57
2017-09-20,64.79
2017-09-21,64.88
2017-09-22,65.47
2017-09-25,65.19
2017-09-26,66.95
2017-09-27,69.61
2017-09-28,70.28
2017-09-29,70.92
2017-10-02,72
2017-10-03,71.18
2017-10-04,70.79
2017-10-05,70.82
2017-10-06,68.93
2017-10-09,67.2
2017-10-10,67.08
2017-10-11,66.94
2017-10-12,66.23
2017-10-13,65.96
2017-10-16,66.28
2017-10-17,66.25
2017-10-18,66.34
2017-10-19,66.86
2017-10-20,67.66
2017-10-23,67.83
2017-10-24,68.02
2017-10-25,67.99
2017-10-26,67.95
2017-10-27,68.84
2017-10-30,66.88
2017-10-31,66.81
2017-11-01,65.31
2017-11-02,72.07
2017-11-03,71.82
2017-11-06,70.54
2017-11-07,69.09
2017-11-08,69.07
2017-11-09,67.52
2017-11-10,66.26
2017-11-13,67.81
2017-11-14,68.78
2017-11-15,66.53
2017-11-16,67.93
2017-11-17,67.65
2017-11-20,66.52
2017-11-21,67.98
2017-11-22,71.29
2017-11-24,70.18
2017-11-27,67.29
2017-11-28,66.01
2017-11-29,66.51
2017-11-30,65.77
2017-12-01,65.43
2017-12-04,64.86
2017-12-05,62.96
2017-12-06,63.9
2017-12-07,63.91
2017-12-08,62.09
2017-12-11,61.21
2017-12-12,61.6
2017-12-13,62.09
2017-12-14,60.48
2017-12-15,61.86
2017-12-18,60.2
2017-12-19,60.81
2017-12-20,59.84
2017-12-21,59.7
2017-12-22,61.95
2017-12-26,61.65
2017-12-27,61.18
2017-12-28,60.8
2017-12-29,61.25
2018-01-02,61.62
2018-01-03,61.92
2018-01-04,64.51
2018-01-05,64.34
2018-01-08,61.26
2018-01-09,62.63
2018-01-10,61.59
2018-01-11,63.87
2018-01-12,63.24
2018-01-16,64.86
2018-01-17,65.86
2018-01-18,63.62
2018-01-19,65.43
2018-01-22,65.02
2018-01-23,64.3
2018-01-24,63.99
2018-01-25,64.84
2018-01-26,65.01
2018-01-29,64.42
2018-01-30,64.26
2018-01-31,62.8
2018-02-01,62.89
2018-02-02,61.72
2018-02-05,60.26
2018-02-06,63.8
2018-02-07,62.83
2018-02-08,62.42
2018-02-09,63.56
2018-02-12,63.5
2018-02-13,63.05
2018-02-14,63
2018-02-15,63.09
2018-02-16,63.39
2018-02-20,63.07
2018-02-21,64.04
2018-02-22,63.32
2018-02-23,64.27
2018-02-26,64.97
2018-02-27,66.13
2018-02-28,64.38
2018-03-01,61.07
2018-03-02,61.06
2018-03-05,60.98
2018-03-06,60.87
2018-03-07,62.19
2018-03-08,62.4
2018-03-09,63.87
2018-03-12,64.22
2018-03-13,63.78
2018-03-14,63.79
2018-03-15,63.32
2018-03-16,63.59
2018-03-19,63.07
2018-03-20,61.51
2018-03-21,61.88
2018-03-22,62.23
2018-03-23,62.32
2018-03-26,61.73
2018-03-27,61.03
2018-03-28,60.09
2018-03-29,61.56
2018-04-02,62.98
2018-04-03,67.28
2018-04-04,69.51
2018-04-05,70.66
2018-04-06,71.31
2018-04-09,69.65
2018-04-10,68.89
2018-04-11,68.94
2018-04-12,70.66
2018-04-13,70.56
2018-04-16,71.11
2018-04-17,72.41
2018-04-18,73.4
2018-04-19,74.31
2018-04-20,75.64
2018-04-23,76.08
2018-04-24,75.55
2018-04-25,75.59
2018-04-26,73.97
2018-04-27,74.75
2018-04-30,74.42
2018-05-01,74.45
2018-05-02,73.55
2018-05-03,71.89
2018-05-04,71.56
2018-05-07,70.43
2018-05-08,72.2
2018-05-09,71.77
2018-05-10,72.5
2018-05-11,73.23
2018-05-14,73.81
2018-05-15,73.79
2018-05-16,75.04
2018-05-17,75.1
2018-05-18,75.34
2018-05-21,74.5
2018-05-22,73.34
2018-05-23,74.81
2018-05-24,74.95
2018-05-25,75.67
2018-05-29,75.77
2018-05-30,76.9
2018-05-31,76.97
2018-06-01,77.23
2018-06-04,77.95
2018-06-05,79.87
2018-06-06,79.84
2018-06-07,77.5
2018-06-08,78.87
2018-06-11,80.1
2018-06-12,80.39
2018-06-13,82.28
2018-06-14,83.4
2018-06-15,84.26
2018-06-18,85.42
2018-06-19,85.59
2018-06-20,86.76
2018-06-21,86.63
2018-06-22,86.41
2018-06-25,86.3
2018-06-26,86.87
2018-06-27,86.23
2018-06-28,85.64
2018-06-29,85.59
2018-07-02,86.38
2018-07-03,87.79
2018-07-05,88.01
2018-07-06,88.29
2018-07-09,87.7
2018-07-10,86.91
2018-07-11,86.71
2018-07-12,87.51
2018-07-13,86.82
2018-07-16,86.32
2018-07-17,86.33
2018-07-18,86.19
2018-07-19,87
2018-07-20,87.11
2018-07-23,88.51
2018-07-24,87.46
2018-07-25,88.44
2018-07-26,89.07
2018-07-27,86.55
2018-07-30,85.17
2018-07-31,86.08
2018-08-01,89.95
2018-08-02,93.58
2018-08-03,92.84
2018-08-06,92.82
2018-08-07,91.81
2018-08-08,91.89
2018-08-09,92.54
2018-08-10,93.4
2018-08-13,93.85
2018-08-14,94.71
2018-08-15,94.42
2018-08-16,93.83
2018-08-17,93.84
2018-08-20,94.64
2018-08-21,97.85
2018-08-22,99.16
2018-08-23,98.72
2018-08-24,99.47
2018-08-27,99.47
2018-08-28,98.72
2018-08-29,98.01
2018-08-30,98
2018-08-31,98.93
2018-09-04,100.09
2018-09-05,98.82
2018-09-06,99.3
2018-09-07,98.05
2018-09-10,95.89
2018-09-11,96.64
2018-09-12,95.11
2018-09-13,96.29
2018-09-14,96.6
2018-09-17,95.57
2018-09-18,97.18
2018-09-19,96.01
2018-09-20,98.02
2018-09-21,98.5
2018-09-24,100.8
2018-09-25,101.52
2018-09-26,100.99
2018-09-27,101.83
2018-09-28,102.99
2018-10-01,101.6
2018-10-02,95.79
2018-10-03,96.28
2018-10-04,97.1
2018-10-05,97.7
2018-10-08,98.98
2018-10-09,100.04
2018-10-10,98.04
2018-10-11,94.17
2018-10-12,90.53
2018-10-15,90.42
2018-10-16,90.91
2018-10-17,89.65
2018-10-18,90.84
2018-10-19,89.92
2018-10-22,91.04
2018-10-23,91.43
2018-10-24,90.5
2018-10-25,91.61
2018-10-26,85.98
2018-10-29,85.06
2018-10-30,89.3
2018-10-31,91.43
2018-11-01,91.95
2018-11-02,95.05
2018-11-05,95.13
2018-11-06,95.24
2018-11-07,99.69
2018-11-08,96.79
2018-11-09,96.93
2018-11-12,95.58
2018-11-13,92.3
2018-11-14,93.12
2018-11-15,96.19
2018-11-16,98.24
2018-11-19,95.91
2018-11-20,94.5
2018-11-21,94.9
2018-11-23,96
2018-11-26,99.09
2018-11-27,99.41
2018-11-28,103.97
2018-11-29,104.99
2018-11-30,104.87
2018-12-03,104.66
2018-12-04,104.83
2018-12-06,104.86
2018-12-07,102
2018-12-10,101.51
2018-12-11,101.4
2018-12-12,103.27
2018-12-13,101.65
2018-12-14,99.24
2018-12-17,94.86
2018-12-18,95
2018-12-19,91.25
2018-12-20,89.66
2018-12-21,89.1
2018-12-24,88.79
2018-12-26,92.64
2018-12-27,93.53
2018-12-28,93.75
2018-12-31,93.88
2019-01-02,93.1
2019-01-03,88.98
2019-01-04,91.86
2019-01-07,94.86
2019-01-08,94.99
2019-01-09,96.02
2019-01-10,95.54
2019-01-11,97.61
2019-01-14,98.13
2019-01-15,102.59
2019-01-16,105.25
2019-01-17,104.32
2019-01-18,103.19
2019-01-22,103.73
2019-01-23,107.07
2019-01-24,108.23
2019-01-25,107.62
2019-01-28,105.64
2019-01-29,106.59
2019-01-30,105.14
2019-01-31,105.73
2019-02-01,106.61
2019-02-04,110.92
2019-02-05,111.71
2019-02-06,109.87
2019-02-07,109.83
2019-02-08,106.87
2019-02-11,108.46
2019-02-12,110.66
2019-02-13,110.9
2019-02-14,112.64
2019-02-15,113.02
2019-02-19,110.47
2019-02-20,111.18
2019-02-21,110.08
2019-02-22,111
2019-02-25,109.06
2019-02-26,107.35
2019-02-27,106.39
2019-02-28,109.69
2019-03-01,109.43
2019-03-04,109.18
2019-03-05,108.12
2019-03-06,105.35
2019-03-07,106.31
2019-03-08,108.12
2019-03-11,107.41
2019-03-12,110.2
2019-03-13,110.44
2019-03-14,111.6
2019-03-15,111
2019-03-18,112.95
2019-03-19,113.37
2019-03-20,112.01
2019-03-21,113.79
2019-03-22,111.18
2019-03-25,109.92
2019-03-26,110.14
2019-03-27,107.06
2019-03-28,107.64
2019-03-29,110.86
2019-04-01,108.43
2019-04-02,108.41
2019-04-03,108.92
2019-04-04,108.18
2019-04-05,110.85
2019-04-08,109.78
2019-04-09,110.36
2019-04-10,110.58
2019-04-11,107.02
2019-04-12,106.43
2019-04-15,108.28
2019-04-16,99.75
2019-04-17,99.63
2019-04-18,100.67
2019-04-22,100.21
2019-04-23,104.99
2019-04-24,107.86
2019-04-25,108.77
2019-04-26,110.45
2019-04-29,110.94
2019-04-30,111.11
2019-05-01,110.77
2019-05-02,112.38
2019-05-03,114.82
2019-05-06,116.04
2019-05-07,112.41
2019-05-08,110.25
2019-05-09,115.06
2019-05-10,116.13
2019-05-13,114.13
2019-05-14,115.39
2019-05-15,117.25
2019-05-16,118.71
2019-05-17,118.25
2019-05-20,120.55
2019-05-21,118.62
2019-05-22,118.87
2019-05-23,114
2019-05-24,114.49
2019-05-28,114.4
2019-05-29,112.55
2019-05-30,112.68
2019-05-31,113.28
2019-06-03,113.94
2019-06-04,117.13
2019-06-05,115.31
2019-06-06,114.97
2019-06-07,115.17
2019-06-10,116.23
2019-06-11,115.13
2019-06-12,115.92
2019-06-13,116.45
2019-06-14,115.26
2019-06-17,116.605
2019-06-18,117.71
2019-06-19,118.82
2019-06-20,114.45
2019-06-21,114.34
2019-06-24,114.585
2019-06-25,115.82
2019-06-26,116.4
2019-06-27,117.68
2019-06-28,119.56
2019-07-01,120.135
2019-07-02,120.04
2019-07-03,120.93
2019-07-04,120.93
2019-07-05,122.59
2019-07-08,122.47
2019-07-09,120.54
2019-07-10,122.7
2019-07-11,124.59
2019-07-12,125.275
2019-07-15,123.26
2019-07-16,120.725
2019-07-17,121.5
2019-07-18,123.42
2019-07-19,122.87
2019-07-22,120.24
2019-07-23,122.365
2019-07-24,123.56
2019-07-25,122.44
2019-07-26,124.68
2019-07-29,123.785
2019-07-30,126.07
2019-07-31,126.48
2019-08-01,123.495
2019-08-02,123.895
2019-08-05,120.35
2019-08-06,121.7
2019-08-07,123.4
2019-08-08,121.63
2019-08-09,122.87
2019-08-12,117.65
2019-08-13,120.78
2019-08-14,120.99
2019-08-15,119.81
2019-08-16,121.76
2019-08-19,119.99
2019-08-20,119.725
2019-08-21,119.91
2019-08-22,120.43
2019-08-23,118.71
2019-08-26,119.25
2019-08-27,118.18
2019-08-28,119.015
2019-08-29,120.21
2019-08-30,118.52
2019-09-02,118.53
2019-09-03,118.54
2019-09-04,119.93
2019-09-05,120.295
2019-09-06,122.375
2019-09-09,117.12
2019-09-10,118.23
2019-09-11,119.76
2019-09-12,118.685
2019-09-13,117.655
2019-09-16,118.17
2019-09-17,119.38
2019-09-18,118.36
2019-09-19,118
2019-09-20,117.69
2019-09-23,119.1
2019-09-24,116.165
2019-09-25,117.615
2019-09-26,113.705
2019-09-27,112.83
2019-09-30,113.57
2019-10-01,108.83
2019-10-02,108.05
2019-10-03,110.22
2019-10-04,110.46
2019-10-07,111.07
2019-10-08,108.87
2019-10-09,109.11
2019-10-10,110.81
2019-10-11,111.76
2019-10-14,111.07
2019-10-15,111.83
2019-10-16,113.445
2019-10-17,115.96
2019-10-18,116.62
2019-10-21,114.65
2019-10-22,113.525
2019-10-23,113.29
2019-10-24,113.27
2019-10-25,111.745
2019-10-28,113.07
2019-10-29,115.27
2019-10-30,113.45
2019-10-31,110.975
2019-11-01,123.535
2019-11-04,124.81
2019-11-05,124.06
2019-11-06,126.6
2019-11-07,125.47
2019-11-08,126.225
2019-11-11,127.275
2019-11-12,128.32
2019-11-13,127.64
2019-11-14,129.09
2019-11-15,129.77
2019-11-18,130.06
2019-11-19,130.1
2019-11-20,130.35
2019-11-21,131.05
2019-11-22,132.7
2019-11-25,135.94
