date,close
2014-06-13,0.78
2014-06-16,0.7777
2014-06-17,0.7897
2014-06-18,0.81
2014-06-19,0.8349
2014-06-20,0.91
2014-06-23,0.8844
2014-06-24,0.81
2014-06-25,0.8321
2014-06-26,0.83
2014-06-27,0.81
2014-06-30,0.837
2014-07-01,0.85
2014-07-02,0.85
2014-07-03,0.855
2014-07-07,0.8536
2014-07-08,0.8599
2014-07-09,0.8665
2014-07-10,0.83
2014-07-11,0.8477
2014-07-14,0.8399
2014-07-15,0.8312
2014-07-16,0.84
2014-07-17,0.84
2014-07-18,0.78
2014-07-21,0.7843
2014-07-22,0.7999
2014-07-23,0.79
2014-07-24,0.83
2014-07-25,0.84
2014-07-28,0.8287
2014-07-29,0.8222
2014-07-30,0.83
2014-07-31,0.87
2014-08-01,0.85
2014-08-04,0.8155
2014-08-05,0.79
2014-08-06,0.7819
2014-08-07,0.77
2014-08-08,0.78
2014-08-11,0.761
2014-08-12,0.75
2014-08-13,0.76
2014-08-14,0.7595
2014-08-15,0.73
2014-08-18,0.7398
2014-08-19,0.745
2014-08-20,0.74
2014-08-21,0.705
2014-08-22,0.6999
2014-08-25,0.68
2014-08-26,0.67
2014-08-27,0.667
2014-08-28,0.665
2014-08-29,0.671
2014-09-02,0.6895
2014-09-03,0.68
2014-09-04,0.6806
2014-09-05,0.68
2014-09-08,0.67
2014-09-09,0.67
2014-09-10,0.63
2014-09-11,0.67
2014-09-12,0.6601
2014-09-15,0.633
2014-09-16,0.605
2014-09-17,0.6178
2014-09-18,0.618
2014-09-19,0.52
2014-09-22,0.54
2014-09-23,0.565
2014-09-24,0.597
2014-09-25,0.6001
2014-09-26,0.5901
2014-09-29,0.5401
2014-09-30,0.5467
2014-10-01,0.52
2014-10-02,0.4802
2014-10-03,0.484
2014-10-06,0.4851
2014-10-07,0.44
2014-10-08,0.4052
2014-10-09,0.4035
2014-10-10,0.343
2014-10-13,0.4
2014-10-14,0.3682
2014-10-15,0.3951
2014-10-16,0.4198
2014-10-17,0.431
2014-10-20,0.435
2014-10-21,0.4302
2014-10-22,0.4299
2014-10-23,0.4238
2014-10-24,0.3918
2014-10-27,0.4101
2014-10-28,0.4045
2014-10-29,0.384
2014-10-30,0.3889
2014-10-31,0.3845
2014-11-03,0.38
2014-11-04,0.3746
2014-11-05,0.3758
2014-11-06,0.3704
2014-11-07,0.3998
2014-11-10,0.3957
2014-11-11,0.4399
2014-11-12,0.4516
2014-11-13,0.46
2014-11-14,0.4519
2014-11-17,0.4483
2014-11-18,0.415
2014-11-19,0.41
2014-11-20,0.4
2014-11-21,0.3962
2014-11-24,0.3892
2014-11-25,0.3899
2014-11-26,0.42
2014-11-28,0.4053
2014-12-01,0.392
2014-12-02,0.3808
2014-12-03,0.37
2014-12-04,0.4099
2014-12-05,0.3997
2014-12-08,0.3904
2014-12-09,0.3912
2014-12-10,0.4
2014-12-11,0.3899
2014-12-12,0.3796
2014-12-15,0.365
2014-12-16,0.3653
2014-12-17,0.3641
2014-12-18,0.3775
2014-12-19,0.48
2014-12-22,0.45
2014-12-23,0.45
2014-12-24,0.451
2014-12-26,0.4317
2014-12-29,0.429
2014-12-30,0.414
2014-12-31,0.4055
2015-01-02,0.4017
2015-01-05,0.435
2015-01-06,0.4378
2015-01-07,0.4203
2015-01-08,0.4302
2015-01-09,0.4207
2015-01-12,0.42
2015-01-13,0.413
2015-01-14,0.401
2015-01-15,0.41
2015-01-16,0.395
2015-01-20,0.4131
2015-01-21,0.42
2015-01-22,0.41
2015-01-23,0.41
2015-01-26,0.43
2015-01-27,0.44
2015-01-28,0.4395
2015-01-29,0.4494
2015-01-30,0.44
2015-02-02,0.4497
2015-02-03,0.44
2015-02-04,0.45
2015-02-05,0.6413
2015-02-06,0.5849
2015-02-09,0.5898
2015-02-10,0.5666
2015-02-11,0.55
2015-02-12,0.56
2015-02-13,0.548
2015-02-17,0.52
2015-02-18,0.5792
2015-02-19,0.55
2015-02-20,0.5499
2015-02-23,0.56
2015-02-24,0.52
2015-02-25,0.53
2015-02-26,0.52
2015-02-27,0.501
2015-03-02,0.4593
2015-03-03,0.466
2015-03-04,0.4513
2015-03-05,0.4474
2015-03-06,0.44
2015-03-09,0.4169
2015-03-10,0.418
2015-03-11,0.4
2015-03-12,0.4299
2015-03-13,0.43
2015-03-16,0.425
2015-03-17,0.406
2015-03-18,0.3801
2015-03-19,0.3775
2015-03-20,0.3819
2015-03-23,0.38
2015-03-24,0.3714
2015-03-25,0.385
2015-03-26,0.4
2015-03-27,0.374
2015-03-30,0.3731
2015-03-31,0.3851
2015-04-01,0.4045
2015-04-02,0.3821
2015-04-06,0.4288
2015-04-07,0.4027
2015-04-08,0.3948
2015-04-09,0.3824
2015-04-10,0.385
2015-04-13,0.38
2015-04-14,0.375
2015-04-15,0.385
2015-04-16,0.38
2015-04-17,0.3719
2015-04-20,0.37
2015-04-21,0.371
2015-04-22,0.369
2015-04-23,0.39
2015-04-24,0.39
2015-04-27,0.385
2015-04-28,0.382
2015-04-29,0.3882
2015-04-30,0.41
2015-05-01,0.395
2015-05-04,0.3981
2015-05-05,0.405
2015-05-06,0.404
2015-05-07,0.4
2015-05-08,0.405
2015-05-11,0.405
2015-05-12,0.4002
2015-05-13,0.4
2015-05-14,0.42
2015-05-15,0.43
2015-05-18,0.4089
2015-05-19,0.3979
2015-05-20,0.395
2015-05-21,0.391
2015-05-22,0.3894
2015-05-26,0.3236
2015-05-27,0.3541
2015-05-28,0.3488
2015-05-29,0.3739
2015-06-01,0.3794
2015-06-02,0.361
2015-06-03,0.3682
2015-06-04,0.3726
2015-06-05,0.38
2015-06-08,0.383
2015-06-09,0.3886
2015-06-10,0.39
2015-06-11,0.3829
2015-06-12,0.39
2015-06-15,0.41
2015-06-16,0.42
2015-06-17,0.381
2015-06-18,0.35
2015-06-19,0.3
2015-06-22,0.343
2015-06-23,0.3202
2015-06-24,0.35
2015-06-25,0.3368
2015-06-26,0.356
2015-06-29,0.3481
2015-06-30,0.34
2015-07-01,0.3602
2015-07-02,0.33
2015-07-06,0.3239
2015-07-07,0.3401
2015-07-08,0.35455
2015-07-09,0.36
2015-07-10,0.3547
2015-07-13,0.3533
2015-07-14,0.34
2015-07-15,0.3281
2015-07-16,0.32
2015-07-17,0.348
2015-07-20,0.3271
2015-07-21,0.338
2015-07-22,0.318075
2015-07-23,0.305
2015-07-24,0.33
2015-07-27,0.3153
2015-07-28,0.29
2015-07-29,0.3323
2015-07-30,0.34
2015-07-31,0.3175
2015-08-03,0.325
2015-08-04,0.341
2015-08-05,0.3101
2015-08-06,0.3089
2015-08-07,0.33
2015-08-10,0.35
2015-08-11,0.345
2015-08-12,0.3251
2015-08-13,0.3014
2015-08-14,0.3113
2015-08-17,0.31
2015-08-18,0.323
2015-08-19,0.31
2015-08-20,0.3288
2015-08-21,0.3084
2015-08-24,0.3
2015-08-25,0.309
2015-08-26,0.3
2015-08-27,0.326
2015-08-28,0.3516
2015-08-31,0.5
2015-09-01,0.4
2015-09-02,0.38
2015-09-03,0.39
2015-09-04,0.3983
2015-09-08,0.3985
2015-09-09,0.41
2015-09-10,0.4198
2015-09-11,0.4267
2015-09-14,0.4123
2015-09-15,0.4095
2015-09-16,0.405
2015-09-17,0.3937
2015-09-18,0.395
2015-09-21,0.3903
2015-09-22,0.3817
2015-09-23,0.3817
2015-09-24,0.365
2015-09-25,0.3576
2015-09-28,0.3547
2015-09-29,0.3337
2015-09-30,0.31
2015-10-01,0.3109
2015-10-02,0.325
2015-10-05,0.326
2015-10-06,0.368
2015-10-07,0.4162
2015-10-08,0.42
2015-10-09,0.4292
2015-10-12,0.395
2015-10-13,0.3892
2015-10-14,0.3851
2015-10-15,0.4087
2015-10-16,0.3632
2015-10-19,0.3571
2015-10-20,0.36
2015-10-21,0.3403
2015-10-22,0.3403
2015-10-23,0.41
2015-10-26,0.4217
2015-10-27,0.4255
2015-10-28,0.439
2015-10-29,0.425
2015-10-30,0.44
2015-11-02,0.43
2015-11-03,0.41
2015-11-04,0.395
2015-11-05,0.377
2015-11-06,0.368
2015-11-09,0.35
2015-11-10,0.35
2015-11-11,0.3422
2015-11-12,0.333
2015-11-13,0.3321
2015-11-16,0.3101
2015-11-17,0.3
2015-11-18,0.3
2015-11-19,0.31
2015-11-20,0.29
2015-11-23,0.2983
2015-11-24,0.3001
2015-11-25,0.3073
2015-11-27,0.3055
2015-11-30,0.315
2015-12-01,0.293
2015-12-02,0.3049
2015-12-03,0.3
2015-12-04,0.3159
2015-12-07,0.3
2015-12-08,0.3
2015-12-09,0.3001
2015-12-10,0.2933
2015-12-11,0.29
2015-12-14,0.285
2015-12-15,0.2857
2015-12-16,0.3
2015-12-17,0.2802
2015-12-18,0.287
2015-12-21,0.287
2015-12-22,0.287
2015-12-23,0.2881
2015-12-24,0.2919
2015-12-28,0.2805
2015-12-29,0.301
2015-12-30,0.2902
2015-12-31,0.306
2016-01-04,0.315
2016-01-05,0.2962
2016-01-06,0.2861
2016-01-07,0.2822
2016-01-08,0.2821
2016-01-11,0.2806
2016-01-12,0.2903
2016-01-13,0.2874
2016-01-14,0.25
2016-01-15,0.24
2016-01-19,0.2233
2016-01-20,0.2079
2016-01-21,0.2267
2016-01-22,0.2201
2016-01-25,0.2502
2016-01-26,0.2679
2016-01-27,0.2679
2016-01-28,0.2651
2016-01-29,0.277
2016-02-01,0.275
2016-02-02,0.2601
2016-02-03,0.2761
2016-02-04,0.28
2016-02-05,0.2838
2016-02-08,0.2944
2016-02-09,0.2912
2016-02-10,0.2909
2016-02-11,0.34
2016-02-12,0.33
2016-02-16,0.345
2016-02-17,0.3518
2016-02-18,0.37
2016-02-19,0.3605
2016-02-22,0.3569
2016-02-23,0.355
2016-02-24,0.365
2016-02-25,0.3648
2016-02-26,0.3467
2016-02-29,0.3502
2016-03-01,0.3481
2016-03-02,0.33
2016-03-03,0.339
2016-03-04,0.341
2016-03-07,0.3401
2016-03-08,0.3424
2016-03-09,0.3466
2016-03-10,0.3753
2016-03-11,0.3823
2016-03-14,0.38
2016-03-15,0.32
2016-03-16,0.337
2016-03-17,0.3547
2016-03-18,0.36
2016-03-21,0.3549
2016-03-22,0.3478
2016-03-23,0.31
2016-03-24,0.3475
2016-03-28,0.33
2016-03-29,0.3201
2016-03-30,0.3311
2016-03-31,0.3213
2016-04-01,0.3447
2016-04-04,0.31
2016-04-05,0.309
2016-04-06,0.3224
2016-04-07,0.295
2016-04-08,0.3399
2016-04-11,0.3106
2016-04-12,0.325
2016-04-13,0.35
2016-04-14,0.3487
2016-04-15,0.3629
2016-04-18,0.39
2016-04-19,0.39
2016-04-20,0.4
2016-04-21,0.43
2016-04-22,0.435
2016-04-25,0.4419
2016-04-26,0.4443
2016-04-27,0.42
2016-04-28,0.4009
2016-04-29,0.4308
2016-05-02,0.448
2016-05-03,0.4172
2016-05-04,0.3882
2016-05-05,0.37
2016-05-06,0.38
2016-05-09,0.3458
2016-05-10,0.3449
2016-05-11,0.35
2016-05-12,0.3589
2016-05-13,0.3581
2016-05-16,0.34
2016-05-17,0.3475
2016-05-18,0.3312
2016-05-19,0.3455
2016-05-20,0.3451
2016-05-23,0.38
2016-05-24,0.3424
2016-05-25,0.3452
2016-05-26,0.3431
2016-05-27,0.3247
2016-05-31,0.32
2016-06-01,0.316
2016-06-02,0.314
2016-06-03,0.36
2016-06-06,0.3636
2016-06-07,0.3549
2016-06-08,0.3529
2016-06-09,0.3623
2016-06-10,0.3277
2016-06-13,0.3322
2016-06-14,0.3293
2016-06-15,0.34
2016-06-16,0.345
2016-06-17,0.334
2016-06-20,0.3258
2016-06-21,0.313
2016-06-22,0.3117
2016-06-23,0.3135
2016-06-24,0.3005
2016-06-27,0.2989
2016-06-28,0.3086
2016-06-29,0.3101
2016-06-30,0.3118
2016-07-01,0.339
2016-07-05,0.3483
2016-07-06,0.3438
2016-07-07,0.3389
2016-07-08,0.423
2016-07-11,0.54
2016-07-12,0.4711
2016-07-13,0.4537
2016-07-14,0.525
2016-07-15,0.5038
2016-07-18,0.49
2016-07-19,0.467
2016-07-20,0.4402
2016-07-21,0.46
2016-07-22,0.4409
2016-07-25,0.44
2016-07-26,0.4541
2016-07-27,0.4726
2016-07-28,0.5171
2016-07-29,0.544
2016-08-01,0.635
2016-08-02,0.5984
2016-08-03,0.6525
2016-08-04,0.679
2016-08-05,0.6957
2016-08-08,0.766
2016-08-09,0.71
2016-08-10,0.735
2016-08-11,0.7169
2016-08-12,0.8498
2016-08-15,0.94
2016-08-16,1.04
2016-08-17,0.96
2016-08-18,0.9479
2016-08-19,0.886
2016-08-22,0.7885
2016-08-23,0.852
2016-08-24,0.7769
2016-08-25,0.7964
2016-08-26,0.78
2016-08-29,0.76
2016-08-30,0.7399
2016-08-31,0.6911
2016-09-01,0.74
2016-09-02,0.7879
2016-09-06,0.8509
2016-09-07,0.8291
2016-09-08,0.84
2016-09-09,0.7937
2016-09-12,0.7964
2016-09-13,0.78
2016-09-14,0.7825
2016-09-15,0.752
2016-09-16,0.7411
2016-09-19,0.74
2016-09-20,0.75
2016-09-21,0.83
2016-09-22,0.805
2016-09-23,0.7949
2016-09-26,0.764
2016-09-27,0.7256
2016-09-28,0.7483
2016-09-29,0.7092
2016-09-30,0.71
2016-10-03,0.695
2016-10-04,0.64
2016-10-05,0.639
2016-10-06,0.5801
2016-10-07,0.6157
2016-10-10,0.6599
2016-10-11,0.6007
2016-10-12,0.5821
2016-10-13,0.6079
2016-10-14,0.62
2016-10-17,0.6
2016-10-18,0.6849
2016-10-19,0.692
2016-10-20,0.7
2016-10-21,0.692
2016-10-24,0.7421
2016-10-25,0.7495
2016-10-26,0.7348
2016-10-27,0.725
2016-10-28,0.8499
2016-10-31,0.8374
2016-11-01,0.8535
2016-11-02,0.8432
2016-11-03,0.77
2016-11-04,0.7332
2016-11-07,0.7468
2016-11-08,0.753
2016-11-09,0.925
2016-11-10,0.889
2016-11-11,0.8877
2016-11-14,0.8947
2016-11-15,1.24
2016-11-16,1.32
2016-11-17,1.22
2016-11-18,1.36
2016-11-21,1.31
2016-11-22,1.29
2016-11-23,1.29
2016-11-25,1.26
2016-11-28,1.23
2016-11-29,1.23
2016-11-30,1.2
2016-12-01,1.19
2016-12-02,1.45
2016-12-05,1.48
2016-12-06,1.42
2016-12-07,1.52
2016-12-08,1.91
2016-12-09,1.75
2016-12-12,1.67
2016-12-13,1.67
2016-12-14,1.65
2016-12-15,1.62
2016-12-16,1.59
2016-12-19,1.75
2016-12-20,1.78
2016-12-21,1.72
2016-12-22,1.72
2016-12-23,1.89
2016-12-27,2.46
2016-12-28,2.17
2016-12-29,2.22
2016-12-30,2.07
2017-01-03,1.94
2017-01-04,1.88
2017-01-05,2.05
2017-01-06,1.92
2017-01-09,2.04
2017-01-10,2.08
2017-01-11,2.11
2017-01-12,2.09
2017-01-13,2.28
2017-01-17,2.5
2017-01-18,2.53
2017-01-19,2.46
2017-01-20,2.63
2017-01-23,2.96
2017-01-24,3.32
2017-01-25,3.11
2017-01-26,2.95
2017-01-27,3
2017-01-30,2.99
2017-01-31,2.9
2017-02-01,3.04
2017-02-02,2.97
2017-02-03,2.93
2017-02-06,3.01
2017-02-07,2.96
2017-02-08,3.05
2017-02-09,3.04
2017-02-10,3.36
2017-02-13,3.18
2017-02-14,2.5
2017-02-15,2.54
2017-02-16,2.26
2017-02-17,2.26
2017-02-21,1.66
2017-02-22,1.39
2017-02-23,1.65
2017-02-24,1.55
2017-02-27,1.58
2017-02-28,1.54
2017-03-01,1.6
2017-03-02,1.48
2017-03-03,1.44
2017-03-06,1.4
2017-03-07,1.19
2017-03-08,1.32
2017-03-09,1.23
2017-03-10,1.19
2017-03-13,1.2
2017-03-14,1.08
2017-03-15,1.26
2017-03-16,1.23
2017-03-17,1.35
2017-03-20,1.57
2017-03-21,1.42
2017-03-22,1.4
2017-03-23,1.35
2017-03-24,1.34
2017-03-27,1.43
2017-03-28,1.38
2017-03-29,1.44
2017-03-30,1.42
2017-03-31,1.43
2017-04-03,1.41
2017-04-04,1.34
2017-04-05,1.23
2017-04-06,1.24
2017-04-07,1.27
2017-04-10,1.39
2017-04-11,1.38
2017-04-12,1.82
2017-04-13,1.64
2017-04-17,1.54
2017-04-18,1.52
2017-04-19,1.44
2017-04-20,1.49
2017-04-21,1.51
2017-04-24,1.49
2017-04-25,1.5
2017-04-26,1.65
2017-04-27,1.53
2017-04-28,1.6
2017-05-01,1.57
2017-05-02,1.61
2017-05-03,1.51
2017-05-04,1.47
2017-05-05,1.6
2017-05-08,1.83
2017-05-09,2.08
2017-05-10,2.04
2017-05-11,2.17
2017-05-12,1.86
2017-05-15,1.83
2017-05-16,1.81
2017-05-17,1.79
2017-05-18,1.73
2017-05-19,1.77
2017-05-22,1.8
2017-05-23,1.74
2017-05-24,1.66
2017-05-25,1.66
2017-05-26,1.73
2017-05-30,1.65
2017-05-31,1.55
2017-06-01,1.51
2017-06-02,1.53
2017-06-05,1.79
2017-06-06,1.68
2017-06-07,1.68
2017-06-08,1.73
2017-06-09,1.65
2017-06-12,1.69
2017-06-13,1.7
2017-06-14,1.61
2017-06-15,1.52
2017-06-16,1.63
2017-06-19,1.61
2017-06-20,1.55
2017-06-21,1.56
2017-06-22,1.54
2017-06-23,1.48
2017-06-26,1.43
2017-06-27,1.36
2017-06-28,1.46
2017-06-29,1.4
2017-06-30,1.39
2017-07-03,1.38
2017-07-05,1.35
2017-07-06,1.25
2017-07-07,1.26
2017-07-10,1.35
2017-07-11,1.46
2017-07-12,1.44
2017-07-13,1.4
2017-07-14,1.49
2017-07-17,1.46
2017-07-18,1.4
2017-07-19,1.43
2017-07-20,1.39
2017-07-21,1.36
2017-07-24,1.39
2017-07-25,1.43
2017-07-26,1.43
2017-07-27,1.39
2017-07-28,1.44
2017-07-31,1.41
2017-08-01,1.43
2017-08-02,1.42
2017-08-03,1.415
2017-08-04,1.405
2017-08-07,1.39
2017-08-08,1.42
2017-08-09,1.39
2017-08-10,1.38
2017-08-11,1.4
2017-08-14,1.42
2017-08-15,1.39
2017-08-16,1.49
2017-08-17,1.56
2017-08-18,1.46
2017-08-21,1.47
2017-08-22,1.63
2017-08-23,1.62
2017-08-24,1.75
2017-08-25,1.78
2017-08-28,1.76
2017-08-29,1.68
2017-08-30,1.7
2017-08-31,1.79
2017-09-01,1.81
2017-09-05,1.79
2017-09-06,1.8
2017-09-07,1.82
2017-09-08,1.82
2017-09-11,1.8
2017-09-12,1.81
2017-09-13,1.8
2017-09-14,1.84
2017-09-15,1.82
2017-09-18,1.83
2017-09-19,1.9
2017-09-20,1.95
2017-09-21,1.88
2017-09-22,1.88
2017-09-25,1.74
2017-09-26,1.88
2017-09-27,1.85
2017-09-28,1.82
2017-09-29,1.8
2017-10-02,1.74
2017-10-03,1.72
2017-10-04,1.74
2017-10-05,1.77
2017-10-06,1.93
2017-10-09,1.94
2017-10-10,1.88
2017-10-11,2.03
2017-10-12,2.17
2017-10-13,2.12
2017-10-16,2.05
2017-10-17,1.99
2017-10-18,2.09
2017-10-19,2.03
2017-10-20,2.05
2017-10-23,1.97
2017-10-24,1.91
2017-10-25,1.89
2017-10-26,1.88
2017-10-27,1.99
2017-10-30,2.02
2017-10-31,1.98
2017-11-01,1.96
2017-11-02,1.92
2017-11-03,1.93
2017-11-06,2.05
2017-11-07,2.01
2017-11-08,2.18
2017-11-09,2.14
2017-11-10,2.13
2017-11-13,2.29
2017-11-14,2.17
2017-11-15,2.19
2017-11-16,2.22
2017-11-17,2.12
2017-11-20,2.11
2017-11-21,2.1
2017-11-22,2.06
2017-11-24,2.07
2017-11-27,1.98
2017-11-28,1.97
2017-11-29,1.91
2017-11-30,1.97
2017-12-01,2.04
2017-12-04,1.98
2017-12-05,1.94
2017-12-06,1.91
2017-12-07,1.88
2017-12-08,1.93
2017-12-11,2.01
2017-12-12,1.98
2017-12-13,2.01
2017-12-14,2.13
2017-12-15,2.16
2017-12-18,1.91
2017-12-19,1.8
2017-12-20,1.72
2017-12-21,1.83
2017-12-22,1.84
2017-12-26,1.83
2017-12-27,1.83
2017-12-28,1.82
2017-12-29,1.77
2018-01-02,1.85
2018-01-03,1.77
2018-01-04,1.76
2018-01-05,1.76
2018-01-08,1.78
2018-01-09,1.74
2018-01-10,1.68
2018-01-11,1.66
2018-01-12,1.68
2018-01-16,1.69
2018-01-17,1.69
2018-01-18,1.71
2018-01-19,1.71
2018-01-22,1.63
2018-01-23,1.56
2018-01-24,1.6
2018-01-25,1.51
2018-01-26,1.53
2018-01-29,1.2
2018-01-30,1.16
2018-01-31,0.99
2018-02-01,0.935
2018-02-02,0.8591
2018-02-05,1.03
2018-02-06,1.04
2018-02-07,1.18
2018-02-08,1.11
2018-02-09,1.05
2018-02-12,1.12
2018-02-13,1.09
2018-02-14,1.1
2018-02-15,1.11
2018-02-16,1.07
2018-02-20,1.08
2018-02-21,1.07
2018-02-22,1.06
2018-02-23,1.09
2018-02-26,1.1
2018-02-27,1.06
2018-02-28,1.07
2018-03-01,1.04
2018-03-02,0.95
2018-03-05,0.92
2018-03-06,0.957
2018-03-07,0.9326
2018-03-08,0.9247
2018-03-09,0.94
2018-03-12,0.934
2018-03-13,0.92
2018-03-14,0.9209
2018-03-15,0.9147
2018-03-16,0.8762
2018-03-19,0.8851
2018-03-20,0.8355
2018-03-21,0.8923
2018-03-22,0.9343
2018-03-23,0.91
2018-03-26,0.8902
2018-03-27,0.9011
2018-03-28,0.9013
2018-03-29,0.906
2018-04-02,0.875
2018-04-03,0.89
2018-04-04,0.9045
2018-04-05,0.8973
2018-04-06,0.8727
2018-04-09,0.84
2018-04-10,0.8648
2018-04-11,0.8643
2018-04-12,0.8792
2018-04-13,0.89
2018-04-16,0.8723
2018-04-17,0.905
2018-04-18,0.965
2018-04-19,0.97
2018-04-20,0.979
2018-04-23,0.934
2018-04-24,0.9446
2018-04-25,0.882
2018-04-26,0.8693
2018-04-27,0.8538
2018-04-30,0.8787
2018-05-01,0.836
2018-05-02,0.856
2018-05-03,0.85
2018-05-04,0.8881
2018-05-07,0.875
2018-05-08,0.83
2018-05-09,0.8456
2018-05-10,0.8385
2018-05-11,0.8207
2018-05-14,0.7837
2018-05-15,0.77
2018-05-16,0.7115
2018-05-17,0.68
2018-05-18,0.6701
2018-05-21,0.7139
2018-05-22,0.73
2018-05-23,0.71
2018-05-24,0.7047
2018-05-25,0.4701
2018-05-29,0.455
2018-05-30,0.48
2018-05-31,0.475
2018-06-01,0.49
2018-06-04,0.48
2018-06-05,0.65
2018-06-06,0.6172
2018-06-07,0.563
2018-06-08,0.593
2018-06-11,0.5812
2018-06-12,0.5596
2018-06-13,0.54
2018-06-14,0.5271
2018-06-15,0.5162
2018-06-18,0.5125
2018-06-19,0.49
2018-06-20,0.5061
2018-06-21,0.5079
2018-06-22,0.55
2018-06-25,0.52
2018-06-26,0.5171
2018-06-27,0.54
2018-06-28,0.5498
2018-06-29,0.5416
2018-07-02,0.53
2018-07-03,0.52501
2018-07-05,0.553958
2018-07-06,0.523
2018-07-09,0.5205
2018-07-10,0.5105
2018-07-11,0.5088
2018-07-12,0.5147
2018-07-13,0.5098
2018-07-16,0.4978
2018-07-17,0.5044
2018-07-18,0.5012
2018-07-19,0.4928
2018-07-20,0.5105
2018-07-23,0.5
2018-07-24,0.498525
2018-07-25,0.496
2018-07-26,0.54
2018-07-27,0.56
2018-07-30,0.619079
2018-07-31,0.607
2018-08-01,0.584
2018-08-02,0.58
2018-08-03,0.567
2018-08-06,0.5854
2018-08-07,0.6
2018-08-08,0.57
2018-08-09,0.5768
2018-08-10,0.5619
2018-08-13,0.5536
2018-08-14,0.5301
2018-08-15,0.505
2018-08-16,0.4985
2018-08-17,0.499
2018-08-20,0.514
2018-08-21,0.5172
2018-08-22,0.5458
2018-08-23,0.5349
2018-08-24,0.539606
2018-08-27,0.549
2018-08-28,0.566
2018-08-29,0.5779
2018-08-30,0.5889
2018-08-31,0.584
2018-09-04,0.585
2018-09-05,0.585
2018-09-06,0.553
2018-09-07,0.554
2018-09-10,0.5425
2018-09-11,0.5322
2018-09-12,0.5231
2018-09-13,0.53
2018-09-14,0.528
2018-09-17,0.5358
2018-09-18,0.525
2018-09-19,0.53
2018-09-20,0.53
2018-09-21,0.54
2018-09-24,0.5484
2018-09-25,0.5452
2018-09-26,0.5589
2018-09-27,0.5441
2018-09-28,0.56
2018-10-01,0.555
2018-10-02,0.559
2018-10-03,0.5581
2018-10-04,0.5553
2018-10-05,0.5529
2018-10-08,0.5452
2018-10-09,0.55
2018-10-10,0.5117
2018-10-11,0.51
2018-10-12,0.5298
2018-10-15,0.547484
2018-10-16,0.5425
2018-10-17,0.52501
2018-10-18,0.5275
2018-10-19,0.52
2018-10-22,0.524
2018-10-23,0.5072
2018-10-24,0.4951
2018-10-25,0.4972
2018-10-26,0.473
2018-10-29,0.47
2018-10-30,0.463
2018-10-31,0.4888
2018-11-01,0.485
2018-11-02,0.4872
2018-11-05,0.51
2018-11-06,0.5586
2018-11-07,0.7139
2018-11-08,0.66
2018-11-09,0.66
2018-11-12,0.6847
2018-11-13,0.68
2018-11-14,0.6591
2018-11-15,0.6676
2018-11-16,0.68
2018-11-19,0.6859
2018-11-20,0.7611
2018-11-21,0.7799
2018-11-23,0.7349
2018-11-26,0.7646
2018-11-27,0.748
2018-11-28,0.75
2018-11-29,0.757
2018-11-30,0.76
2018-12-03,0.716
2018-12-04,0.7011
2018-12-06,0.6825
2018-12-07,0.68
2018-12-10,0.6689
2018-12-11,0.64
2018-12-12,0.63
2018-12-13,0.6017
2018-12-14,0.6061
2018-12-17,0.5819
2018-12-18,0.58
2018-12-19,0.5849
2018-12-20,0.57
2018-12-21,0.53
2018-12-24,0.515
2018-12-26,0.584
2018-12-27,0.5601
2018-12-28,0.5799
2018-12-31,0.5692
2019-01-02,0.5924
2019-01-03,0.594
2019-01-04,0.6601
2019-01-07,0.6794
2019-01-08,0.665
2019-01-09,0.651
2019-01-10,0.645
2019-01-11,0.649
2019-01-14,0.655
2019-01-15,0.6973
2019-01-16,0.692
2019-01-17,0.73
2019-01-18,0.72
2019-01-22,0.7111
2019-01-23,0.7164
2019-01-24,0.705
2019-01-25,0.7091
2019-01-28,0.7495
2019-01-29,0.7526
2019-01-30,0.77
2019-01-31,0.78
2019-02-01,0.7927
2019-02-04,0.84
2019-02-05,0.89
2019-02-06,1.05
2019-02-07,1.02
2019-02-08,0.9563
2019-02-11,1.0194
2019-02-12,0.96
2019-02-13,0.9615
2019-02-14,0.9701
2019-02-15,0.95
2019-02-19,0.8839
2019-02-20,1
2019-02-21,0.9271
2019-02-22,0.9583
2019-02-25,0.97
2019-02-26,1
2019-02-27,0.98
2019-02-28,0.92
2019-03-01,0.9005
2019-03-04,0.8872
2019-03-05,0.8523
2019-03-06,0.8178
2019-03-07,0.761
2019-03-08,0.7625
2019-03-11,0.75
2019-03-12,0.7419
2019-03-13,0.7128
2019-03-14,0.6601
2019-03-15,0.6621
2019-03-18,0.68
2019-03-19,0.68
2019-03-20,0.6838
2019-03-21,0.6729
2019-03-22,0.6504
2019-03-25,0.663
2019-03-26,0.6581
2019-03-27,0.6255
2019-03-28,0.6121
2019-03-29,0.602
2019-04-01,0.587
2019-04-02,0.591
2019-04-03,0.6468
2019-04-04,0.6323
2019-04-05,0.6255
2019-04-08,0.614
2019-04-09,0.5996
2019-04-10,0.602
2019-04-11,0.5951
2019-04-12,0.5915
2019-04-15,0.56
2019-04-16,0.5851
2019-04-17,0.5907
2019-04-18,0.5654
2019-04-22,0.5639
2019-04-23,0.555
2019-04-24,0.5477
2019-04-25,0.5428
2019-04-26,0.5391
2019-04-29,0.5296
2019-04-30,0.539
2019-05-01,0.5234
2019-05-02,0.5078
2019-05-03,0.4855
2019-05-06,0.49
2019-05-07,0.4701
2019-05-08,0.45
2019-05-09,0.4225
2019-05-10,0.489
2019-05-13,0.4588
2019-05-14,0.4599
2019-05-15,0.4577
2019-05-16,0.4709
2019-05-17,0.546249
2019-05-20,0.5519
2019-05-21,0.5182
2019-05-22,0.5151
2019-05-23,0.495
2019-05-24,0.4947
2019-05-28,0.471
2019-05-29,0.465
2019-05-30,0.45
2019-05-31,0.4422
2019-06-03,0.4589
2019-06-04,0.4677
2019-06-05,0.48
2019-06-06,0.48
2019-06-07,0.4687
2019-06-10,0.475
2019-06-11,0.474
2019-06-12,0.495
2019-06-13,0.5125
2019-06-14,0.511
2019-06-17,0.5173
2019-06-18,0.515
2019-06-19,0.446
2019-06-20,0.4491
2019-06-21,0.46
2019-06-24,0.4722
2019-06-25,0.4749
2019-06-26,0.56
2019-06-27,0.58
2019-06-28,0.5976
2019-07-01,0.6301
2019-07-02,0.5714
2019-07-03,0.5834
2019-07-04,0.5834
2019-07-05,0.5588
2019-07-08,0.5335
2019-07-09,0.52
2019-07-10,0.505
2019-07-11,0.4925
2019-07-12,0.4715
2019-07-15,0.4701
2019-07-16,0.4695
2019-07-17,0.46
2019-07-18,0.5082
2019-07-19,0.5147
2019-07-22,0.5958
2019-07-23,0.583
2019-07-24,0.6069
2019-07-25,0.575
2019-07-26,0.5868
2019-07-29,0.556
2019-07-30,0.87
2019-07-31,0.7881
2019-08-01,0.8165
2019-08-02,0.8027
2019-08-05,0.83
2019-08-06,0.8242
2019-08-07,0.938
2019-08-08,0.852
2019-08-09,0.7964
2019-08-12,0.7533
2019-08-13,0.6957
2019-08-14,0.6767
2019-08-15,0.67
2019-08-16,0.6979
2019-08-19,0.7089
2019-08-20,0.7286
2019-08-21,0.6909
2019-08-22,0.6647
2019-08-23,0.6564
2019-08-26,0.6111
2019-08-27,0.5831
2019-08-28,0.6701
2019-08-29,0.6559
2019-08-30,0.6494
2019-09-02,0.6454
2019-09-03,0.6551
2019-09-04,0.6966
2019-09-05,0.6357
2019-09-06,0.6464
2019-09-09,0.6199
2019-09-10,0.6355
2019-09-11,0.623
2019-09-12,0.62
2019-09-13,0.6238
2019-09-16,0.6288
2019-09-17,0.6315
2019-09-18,0.6201
2019-09-19,0.636
2019-09-20,0.642
2019-09-23,0.6462
2019-09-24,0.64
2019-09-25,0.6335
2019-09-26,0.6218
2019-09-27,0.6082
2019-09-30,0.6
2019-10-01,0.5701
2019-10-02,0.5656
2019-10-03,0.5597
2019-10-04,0.5871
2019-10-07,0.5871
2019-10-08,0.5228
2019-10-09,0.5261
2019-10-10,0.5201
2019-10-11,0.5292
2019-10-14,0.5205
2019-10-15,0.5205
2019-10-16,0.53
2019-10-17,0.5584
2019-10-18,0.5587
2019-10-21,0.5587
2019-10-22,0.5618
2019-10-23,0.5551
2019-10-24,0.5431
2019-10-25,0.56
2019-10-28,0.5696
2019-10-29,0.567
2019-10-30,0.5906
2019-10-31,0.5875
2019-11-01,0.5864
2019-11-04,0.6322
2019-11-05,0.622
2019-11-06,0.6301
2019-11-07,0.57
2019-11-08,0.5757
2019-11-11,0.5781
2019-11-12,0.561
2019-11-13,0.5743
2019-11-14,0.5547
2019-11-15,0.5573
2019-11-18,0.5525
2019-11-19,0.527
2019-11-20,0.53
2019-11-21,0.5301
2019-11-22,0.5302
2019-11-25,0.523
