date,close
2017-11-10,21.19
2017-11-13,20.3
2017-11-14,20.09
2017-11-15,20.04
2017-11-16,20
2017-11-17,18.16
2017-11-20,19.13
2017-11-21,20.05
2017-11-22,21.22
2017-11-24,21.06
2017-11-27,20.72
2017-11-28,20.43
2017-11-29,20.67
2017-11-30,21.84
2017-12-01,22.22
2017-12-04,22.37
2017-12-05,22.7
2017-12-06,22.55
2017-12-07,21.53
2017-12-08,21.15
2017-12-11,20.65
2017-12-12,20.25
2017-12-13,21.55
2017-12-14,22.12
2017-12-15,21.49
2017-12-18,22.86
2017-12-19,22.63
2017-12-20,22.97
2017-12-21,23.06
2017-12-22,23.05
2017-12-26,23.03
2017-12-27,24.07
2017-12-28,24.38
2017-12-29,23.12
2018-01-02,23.24
2018-01-03,23.53
2018-01-04,23.44
2018-01-05,23.48
2018-01-08,23.5
2018-01-09,23.3
2018-01-10,23.23
2018-01-11,23.06
2018-01-12,23.01
2018-01-16,23.13
2018-01-17,23.05
2018-01-18,23.08
2018-01-19,23.31
2018-01-22,23.13
2018-01-23,23.05
2018-01-24,22.81
2018-01-25,22.7
2018-01-26,22.73
2018-01-29,23.51
2018-01-30,23.94
2018-01-31,23.34
2018-02-01,23.61
2018-02-02,22.52
2018-02-05,21.76
2018-02-06,21.1
2018-02-07,20.74
2018-02-08,21.03
2018-02-09,21.03
2018-02-12,21.35
2018-02-13,19.88
2018-02-14,22.21
2018-02-15,22.32
2018-02-16,22.29
2018-02-20,23.91
2018-02-21,24.09
2018-02-22,26.99
2018-02-23,26.81
2018-02-26,27.51
2018-02-27,27.45
2018-02-28,27.45
2018-03-01,27.25
2018-03-02,27
2018-03-05,27.24
2018-03-06,28.73
2018-03-07,28.64
2018-03-08,28.84
2018-03-09,28.83
2018-03-12,28.6
2018-03-13,28.58
2018-03-14,28.39
2018-03-15,29.49
2018-03-16,29.05
2018-03-19,29.02
2018-03-20,31.94
2018-03-21,32.1
2018-03-22,32.16
2018-03-23,31.93
2018-03-26,31.93
2018-03-27,31.47
2018-03-28,32.09
2018-03-29,32.66
2018-04-02,32.55
2018-04-03,31.68
2018-04-04,31.5
2018-04-05,31.1
2018-04-06,30.33
2018-04-09,31.1
2018-04-10,32.43
2018-04-11,31.72
2018-04-12,31.74
2018-04-13,31.89
2018-04-16,31.91
2018-04-17,32.15
2018-04-18,31.79
2018-04-19,30.83
2018-04-20,30.57
2018-04-23,31.89
2018-04-24,31.89
2018-04-25,31.9
2018-04-26,32
2018-04-27,32.17
2018-04-30,32.45
2018-05-01,32.16
2018-05-02,35.06
2018-05-03,35.12
2018-05-04,35.6
2018-05-07,35.4
2018-05-08,36.65
2018-05-09,34.21
2018-05-10,34.79
2018-05-11,34.82
2018-05-14,34.35
2018-05-15,34.62
2018-05-16,34.82
2018-05-17,34.72
2018-05-18,34.51
2018-05-21,34.89
2018-05-22,35.58
2018-05-23,35.32
2018-05-24,35.51
2018-05-25,35.16
2018-05-29,35.16
2018-05-30,35.22
2018-05-31,37.31
2018-06-01,39.45
2018-06-04,38.98
2018-06-05,40.51
2018-06-06,40.83
2018-06-07,39.34
2018-06-08,39.91
2018-06-11,39.69
2018-06-12,39.2
2018-06-13,39.17
2018-06-14,39.47
2018-06-15,39.44
2018-06-18,39.87
2018-06-19,39.94
2018-06-20,39.93
2018-06-21,39.58
2018-06-22,39.51
2018-06-25,37.96
2018-06-26,37.8
2018-06-27,37.23
2018-06-28,37.98
2018-06-29,37.98
2018-07-02,36.65
2018-07-03,37.14
2018-07-05,38.25
2018-07-06,38.63
2018-07-09,37.13
2018-07-10,36.07
2018-07-11,35.4
2018-07-12,35.76
2018-07-13,36
2018-07-16,36.02
2018-07-17,35.35
2018-07-18,35.76
2018-07-19,36.2
2018-07-20,36.63
2018-07-23,37.13
2018-07-24,36.88
2018-07-25,37.52
2018-07-26,37.12
2018-07-27,36.58
2018-07-30,35.06
2018-07-31,35.04
2018-08-01,39.36
2018-08-02,39.24
2018-08-03,39.05
2018-08-06,39.12
2018-08-07,40.39
2018-08-08,43.7
2018-08-09,43.15
2018-08-10,44.49
2018-08-13,43.65
2018-08-14,44.16
2018-08-15,44.18
2018-08-16,44.01
2018-08-17,44.75
2018-08-20,44.93
2018-08-21,44.98
2018-08-22,44.95
2018-08-23,45
2018-08-24,45.13
2018-08-27,45.12
2018-08-28,45.17
2018-08-29,45.22
2018-08-30,45.16
2018-08-31,45.56
2018-09-04,51.08
2018-09-05,49.91
2018-09-06,50.765
2018-09-07,52.05
2018-09-10,52.86
2018-09-11,52.89
2018-09-12,54.07
2018-09-13,54.56
2018-09-14,55.22
2018-09-17,53.55
2018-09-18,55.25
2018-09-19,53
2018-09-20,52.69
2018-09-21,52.41
2018-09-24,52.63
2018-09-25,53.78
2018-09-26,53.64
2018-09-27,53.54
2018-09-28,53.57
2018-10-01,53.4
2018-10-02,52.96
2018-10-03,54.01
2018-10-04,54.2
2018-10-05,54.67
2018-10-08,54.19
2018-10-09,54.83
2018-10-10,49.71
2018-10-11,49.18
2018-10-12,49.39
2018-10-15,49.64
2018-10-16,51.82
2018-10-17,51.65
2018-10-18,51.5
2018-10-19,50.15
2018-10-22,50.29
2018-10-23,49.53
2018-10-24,48.12
2018-10-25,50.25
2018-10-26,49.02
2018-10-29,48.87
2018-10-30,49.57
2018-10-31,53.36
2018-11-01,55.64
2018-11-02,53.62
2018-11-05,49.85
2018-11-06,49.12
2018-11-07,49.24
2018-11-08,48.8
2018-11-09,48.32
2018-11-12,47.31
2018-11-13,47.5
2018-11-14,47.29
2018-11-15,48.14
2018-11-16,47.48
2018-11-19,43.4
2018-11-20,41.24
2018-11-21,43.92
2018-11-23,44.08
2018-11-26,44.2
2018-11-27,43.61
2018-11-28,44.98
2018-11-29,44.67
2018-11-30,46.66
2018-12-03,45.76
2018-12-04,44.11
2018-12-06,44.79
2018-12-07,44.41
2018-12-10,45.99
2018-12-11,45.19
2018-12-12,45.72
2018-12-13,44.83
2018-12-14,43.9
2018-12-17,41.35
2018-12-18,39.77
2018-12-19,39.37
2018-12-20,38.44
2018-12-21,35.23
2018-12-24,35.46
2018-12-26,37.96
2018-12-27,39.06
2018-12-28,39.1
2018-12-31,40.75
2019-01-02,41.32
2019-01-03,39.57
2019-01-04,41.27
2019-01-07,41.69
2019-01-08,42.16
2019-01-09,41.96
2019-01-10,41.66
2019-01-11,41.61
2019-01-14,40.77
2019-01-15,41.86
2019-01-16,41.7
2019-01-17,42.55
2019-01-18,44
2019-01-22,43.03
2019-01-23,43.08
2019-01-24,44.2
2019-01-25,45.73
2019-01-28,44.83
2019-01-29,43.68
2019-01-30,44.36
2019-01-31,46.1
2019-02-01,46.95
2019-02-04,47.43
2019-02-05,48.1
2019-02-06,48.05
2019-02-07,47.6
2019-02-08,49.12
2019-02-11,47.48
2019-02-12,47.47
2019-02-13,48.54
2019-02-14,47.35
2019-02-15,51.14
2019-02-19,51.6
2019-02-20,51.57
2019-02-21,52.25
2019-02-22,53.96
2019-02-25,53.31
2019-02-26,52.95
2019-02-27,53.7
2019-02-28,55.72
2019-03-01,57.86
2019-03-04,56.96
2019-03-05,57.7
2019-03-06,55.2
2019-03-07,61.2
2019-03-08,62.15
2019-03-11,63.28
2019-03-12,65.2
2019-03-13,65.45
2019-03-14,66.58
2019-03-15,67.57
2019-03-18,68.77
2019-03-19,67.51
2019-03-20,68.26
2019-03-21,69.19
2019-03-22,66.4
2019-03-25,66.9
2019-03-26,68.31
2019-03-27,65.5
2019-03-28,66.74
2019-03-29,66.96
2019-04-01,65.63
2019-04-02,67.76
2019-04-03,68.2
2019-04-04,66.26
2019-04-05,66.87
2019-04-08,68.57
2019-04-09,68.55
2019-04-10,71.28
2019-04-11,71.64
2019-04-12,70.98
2019-04-15,70
2019-04-16,69.3
2019-04-17,67.8
2019-04-18,67.92
2019-04-22,69.01
2019-04-23,72.95
2019-04-24,72.43
2019-04-25,73.2
2019-04-26,74.81
2019-04-29,75.18
2019-04-30,75.42
2019-05-01,75.26
2019-05-02,72.47
2019-05-03,69.52
2019-05-06,70.31
2019-05-07,72.2
2019-05-08,73.89
2019-05-09,73.4
2019-05-10,74.43
2019-05-13,70.55
2019-05-14,71.54
2019-05-15,74.13
2019-05-16,77.65
2019-05-17,77.82
2019-05-20,77.83
2019-05-21,78.5
2019-05-22,77.26
2019-05-23,75.49
2019-05-24,76.75
2019-05-28,77.53
2019-05-29,75.13
2019-05-30,74.86
2019-05-31,72.57
2019-06-03,70.46
2019-06-04,71.65
2019-06-05,72.87
2019-06-06,74.03
2019-06-07,76.66
2019-06-10,73.2
2019-06-11,73.81
2019-06-12,75.84
2019-06-13,76.45
2019-06-14,76.845
2019-06-17,73.93
2019-06-18,72.53
2019-06-19,74.88
2019-06-20,78.67
2019-06-21,74.86
2019-06-24,74.88
2019-06-25,71.72
2019-06-26,70.59
2019-06-27,72.72
2019-06-28,74.34
2019-07-01,75.25
2019-07-02,75.46
2019-07-03,77.5
2019-07-04,77.5
2019-07-05,75.37
2019-07-08,77.035
2019-07-09,78.57
2019-07-10,79.67
2019-07-11,77.9
2019-07-12,77.84
2019-07-15,76.915
2019-07-16,77.145
2019-07-17,79.03
2019-07-18,78.1
2019-07-19,77
2019-07-22,76.71
2019-07-23,76.93
2019-07-24,79.265
2019-07-25,78.94
2019-07-26,80.605
2019-07-29,76.92
2019-07-30,78.005
2019-07-31,74.3
2019-08-01,79.22
2019-08-02,79.095
2019-08-05,78.48
2019-08-06,76.9
2019-08-07,76.155
2019-08-08,80.605
2019-08-09,79.34
2019-08-12,79.51
2019-08-13,80.755
2019-08-14,78.075
2019-08-15,78.55
2019-08-16,84.08
2019-08-19,84.86
2019-08-20,84.89
2019-08-21,87.34
2019-08-22,88.69
2019-08-23,85.31
2019-08-26,86.88
2019-08-27,85.565
2019-08-28,83.78
2019-08-29,86.875
2019-08-30,87.19
2019-09-02,87.13
2019-09-03,88.4
2019-09-04,86.4
2019-09-05,88.575
2019-09-06,86.03
2019-09-09,80.06
2019-09-10,75.3
2019-09-11,73.81
2019-09-12,72
2019-09-13,69.61
2019-09-16,70.315
2019-09-17,71.93
2019-09-18,71.785
2019-09-19,72.085
2019-09-20,69.94
2019-09-23,68.67
2019-09-24,66.95
2019-09-25,67.69
2019-09-26,65.71
2019-09-27,65.19
2019-09-30,65.24
2019-10-01,65.64
2019-10-02,65.43
2019-10-03,65.83
2019-10-04,66.76
2019-10-07,68.095
2019-10-08,64.34
2019-10-09,64.35
2019-10-10,63.135
2019-10-11,62.58
2019-10-14,60.61
2019-10-15,61.055
2019-10-16,57.89
2019-10-17,59.67
2019-10-18,58.45
2019-10-21,58.5
2019-10-22,55.69
2019-10-23,56.69
2019-10-24,59.345
2019-10-25,59.2
2019-10-28,57.41
2019-10-29,57.06
2019-10-30,57
2019-10-31,56.175
2019-11-01,56.92
2019-11-04,55.76
2019-11-05,55.145
2019-11-06,55.48
2019-11-07,47.32
2019-11-08,48.295
2019-11-11,50.31
2019-11-12,53.03
2019-11-13,53.16
2019-11-14,53.25
2019-11-15,53.2
2019-11-18,53.26
2019-11-19,55.05
2019-11-20,53.475
2019-11-21,52.46
2019-11-22,52.79
2019-11-25,53.37
