date,close
2014-06-13,14.1745
2014-06-16,14.3597
2014-06-17,14.2439
2014-06-18,14.3597
2014-06-19,14.3944
2014-06-20,14.3983
2014-06-23,14.5064
2014-06-24,14.4462
2014-06-25,14.4137
2014-06-26,14.3751
2014-06-27,14.5604
2014-06-30,14.8075
2014-07-01,14.5527
2014-07-02,14.5064
2014-07-03,14.6299
2014-07-07,14.6454
2014-07-08,14.8615
2014-07-09,14.8229
2014-07-10,14.8152
2014-07-11,14.6762
2014-07-14,14.7843
2014-07-15,14.7843
2014-07-16,14.7303
2014-07-17,14.684
2014-07-18,14.8152
2014-07-21,15.0545
2014-07-22,15.1472
2014-07-23,15.1935
2014-07-24,15.3247
2014-07-25,15.3247
2014-07-28,15.0008
2014-07-29,15.3247
2014-07-30,15.1008
2014-07-31,15.0005
2014-08-01,14.8229
2014-08-04,14.4446
2014-08-05,14.4292
2014-08-06,13.7575
2014-08-07,13.7344
2014-08-08,13.5722
2014-08-11,13.8579
2014-08-12,13.8888
2014-08-13,14.0432
2014-08-14,13.8579
2014-08-15,13.9428
2014-08-18,13.7344
2014-08-19,13.7421
2014-08-20,13.8502
2014-08-21,13.8502
2014-08-22,13.858
2014-08-25,14.0763
2014-08-26,14.0295
2014-08-27,14.0139
2014-08-28,13.9203
2014-08-29,13.9437
2014-09-02,14.1231
2014-09-03,14.0981
2014-09-04,13.7254
2014-09-05,14.1075
2014-09-08,14.0529
2014-09-09,13.8424
2014-09-10,13.9905
2014-09-11,13.9593
2014-09-12,13.8502
2014-09-15,13.8658
2014-09-16,13.7605
2014-09-17,13.8034
2014-09-18,13.8034
2014-09-19,13.9905
2014-09-22,13.8034
2014-09-23,13.7722
2014-09-24,13.8813
2014-09-25,13.8502
2014-09-26,13.7878
2014-09-29,13.8112
2014-09-30,13.6474
2014-10-01,13.507
2014-10-02,13.4368
2014-10-03,13.702
2014-10-06,13.7722
2014-10-07,13.6396
2014-10-08,13.5773
2014-10-09,13.3277
2014-10-10,12.9455
2014-10-13,12.7974
2014-10-14,12.735
2014-10-15,12.9299
2014-10-16,13.0001
2014-10-17,13.0859
2014-10-20,13.0391
2014-10-21,13.0859
2014-10-22,12.9143
2014-10-23,12.696
2014-10-24,12.6804
2014-10-27,12.813
2014-10-28,12.7506
2014-10-29,12.5712
2014-10-30,12.5556
2014-10-31,12.384
2014-11-03,12.5556
2014-11-04,12.3139
2014-11-05,12.1813
2014-11-06,12.0565
2014-11-07,12.1579
2014-11-10,12.1657
2014-11-11,12.1657
2014-11-12,12.54
2014-11-13,12.9221
2014-11-14,12.9533
2014-11-17,12.8363
2014-11-18,12.5556
2014-11-19,12.5946
2014-11-20,12.8479
2014-11-21,12.7925
2014-11-24,12.7925
2014-11-25,12.9983
2014-11-26,12.84
2014-11-28,12.8242
2014-12-01,12.8717
2014-12-02,12.8558
2014-12-03,12.8004
2014-12-04,13.1329
2014-12-05,13.3308
2014-12-08,13.2833
2014-12-09,13.3229
2014-12-10,13.3308
2014-12-11,13.2912
2014-12-12,13.0617
2014-12-15,13.1804
2014-12-16,13.2121
2014-12-17,13.3466
2014-12-18,13.7029
2014-12-19,13.6316
2014-12-22,13.8058
2014-12-23,13.5762
2014-12-24,13.1012
2014-12-26,13.1012
2014-12-29,13.1012
2014-12-30,13.1883
2014-12-31,13.5683
2015-01-02,13.2912
2015-01-05,13.2991
2015-01-06,13.0854
2015-01-07,13.3308
2015-01-08,13.9008
2015-01-09,14.0274
2015-01-12,13.8137
2015-01-13,13.7979
2015-01-14,13.7345
2015-01-15,13.9008
2015-01-16,14.1462
2015-01-20,14.3757
2015-01-21,14.3441
2015-01-22,14.4074
2015-01-23,14.8428
2015-01-26,15.5236
2015-01-27,15.4444
2015-01-28,15.3178
2015-01-29,15.1832
2015-01-30,15.0328
2015-02-02,15.0644
2015-02-03,15.1357
2015-02-04,14.9536
2015-02-05,14.7399
2015-02-06,14.5261
2015-02-09,14.6449
2015-02-10,14.6765
2015-02-11,14.6924
2015-02-12,14.7953
2015-02-13,15.3178
2015-02-17,15.5869
2015-02-18,15.3811
2015-02-19,15.4682
2015-02-20,15.5948
2015-02-23,15.5157
2015-02-24,15.5552
2015-02-25,15.6502
2015-02-26,15.7215
2015-02-27,16.0698
2015-03-02,16.2835
2015-03-03,16.0856
2015-03-04,16.1331
2015-03-05,15.8561
2015-03-06,15.5632
2015-03-09,15.5157
2015-03-10,15.7294
2015-03-11,15.5315
2015-03-12,15.4433
2015-03-13,15.3311
2015-03-16,14.7301
2015-03-17,14.8663
2015-03-18,14.8984
2015-03-19,14.5057
2015-03-20,14.6419
2015-03-23,14.706
2015-03-24,14.706
2015-03-25,14.5618
2015-03-26,14.5297
2015-03-27,14.5217
2015-03-30,14.6579
2015-03-31,14.8583
2015-04-01,14.5698
2015-04-02,14.4736
2015-04-06,14.3534
2015-04-07,14.3534
2015-04-08,14.2332
2015-04-09,14.2011
2015-04-10,14.5858
2015-04-13,14.5457
2015-04-14,14.129
2015-04-15,14.2813
2015-04-16,14.3213
2015-04-17,14.153
2015-04-20,14.0248
2015-04-21,14.1611
2015-04-22,14.121
2015-04-23,14.7701
2015-04-24,14.6179
2015-04-27,14.3133
2015-04-28,14.2252
2015-04-29,14.6018
2015-04-30,14.5137
2015-05-01,14.4335
2015-05-04,14.8182
2015-05-05,14.9064
2015-05-06,14.9064
2015-05-07,15.0186
2015-05-08,15.0907
2015-05-11,15.2269
2015-05-12,15.1228
2015-05-13,15.4433
2015-05-14,15.7879
2015-05-15,15.7719
2015-05-18,15.5876
2015-05-19,15.6036
2015-05-20,15.8228
2015-05-21,16.107
2015-05-22,15.9933
2015-05-26,15.8959
2015-05-27,15.9933
2015-05-28,16.1881
2015-05-29,15.8228
2015-06-01,16.0339
2015-06-02,15.7579
2015-06-03,15.7497
2015-06-04,15.563
2015-06-05,15.5224
2015-06-08,15.4412
2015-06-09,15.4169
2015-06-10,15.6523
2015-06-11,16.4073
2015-06-12,16.5778
2015-06-15,16.7645
2015-06-16,16.5697
2015-06-17,16.2774
2015-06-18,16.3018
2015-06-19,16.1963
2015-06-22,15.8796
2015-06-23,15.839
2015-06-24,15.5874
2015-06-25,15.2464
2015-06-26,15.3032
2015-06-29,15.0516
2015-06-30,15.0191
2015-07-01,15.1977
2015-07-02,15.4981
2015-07-06,15.425
2015-07-07,15.1571
2015-07-08,14.9054
2015-07-09,15.0191
2015-07-10,15.0678
2015-07-13,15.1165
2015-07-14,15.0516
2015-07-15,15.0191
2015-07-16,15.3763
2015-07-17,15.4494
2015-07-20,16.1963
2015-07-21,16.245
2015-07-22,15.8634
2015-07-23,15.9852
2015-07-24,16.1881
2015-07-27,15.7903
2015-07-28,15.8147
2015-07-29,15.7497
2015-07-30,15.4494
2015-07-31,15.4088
2015-08-03,15.1896
2015-08-04,15.6036
2015-08-05,15.1003
2015-08-06,15.425
2015-08-07,15.4575
2015-08-10,15.4656
2015-08-11,15.4818
2015-08-12,15.4331
2015-08-13,15.2545
2015-08-14,15.1733
2015-08-17,15.0191
2015-08-18,15.0678
2015-08-19,14.9704
2015-08-20,14.0043
2015-08-21,14.301
2015-08-24,13.8641
2015-08-25,13.419
2015-08-26,13.4355
2015-08-27,13.7982
2015-08-28,14.2928
2015-08-31,14.2186
2015-09-01,13.9383
2015-09-02,13.9795
2015-09-03,14.0125
2015-09-04,14.0867
2015-09-08,14.0125
2015-09-09,14.0372
2015-09-10,14.062
2015-09-11,14.2763
2015-09-14,14.334
2015-09-15,14.5895
2015-09-16,14.6967
2015-09-17,15.0428
2015-09-18,15.4632
2015-09-21,15.5621
2015-09-22,15.0593
2015-09-23,16.0402
2015-09-24,15.5539
2015-09-25,14.7544
2015-09-28,14.9604
2015-09-29,14.8121
2015-09-30,14.4082
2015-10-01,14.606
2015-10-02,14.3381
2015-10-05,14.4741
2015-10-06,14.2186
2015-10-07,14.2886
2015-10-08,14.2845
2015-10-09,14.1609
2015-10-12,14.0208
2015-10-13,13.9548
2015-10-14,13.7405
2015-10-15,13.7652
2015-10-16,13.996
2015-10-19,13.8147
2015-10-20,13.8229
2015-10-21,13.6251
2015-10-22,13.2212
2015-10-23,13.4273
2015-10-26,13.2624
2015-10-27,13.3036
2015-10-28,13.3943
2015-10-29,13.2377
2015-10-30,13.3449
2015-11-02,13.3284
2015-11-03,13.3366
2015-11-04,13.1141
2015-11-05,13.1883
2015-11-06,13.452
2015-11-09,13.7405
2015-11-10,13.3284
2015-11-11,13.3119
2015-11-12,12.8668
2015-11-13,12.092
2015-11-16,11.9189
2015-11-17,11.6798
2015-11-18,11.3172
2015-11-19,11.3831
2015-11-20,11.6494
2015-11-23,11.6078
2015-11-24,11.6244
2015-11-25,11.7243
2015-11-27,11.7409
2015-11-30,11.7076
2015-12-01,11.7326
2015-12-02,11.8158
2015-12-03,11.6327
2015-12-04,11.5662
2015-12-07,11.3332
2015-12-08,11.3748
2015-12-09,11.2333
2015-12-10,11.6161
2015-12-11,11.2749
2015-12-14,10.3679
2015-12-15,10.5344
2015-12-16,10.6841
2015-12-17,10.784
2015-12-18,10.7008
2015-12-21,10.7091
2015-12-22,11.0003
2015-12-23,11.1002
2015-12-24,10.7757
2015-12-28,10.8173
2015-12-29,10.6592
2015-12-30,10.7424
2015-12-31,10.759
2016-01-04,10.6592
2016-01-05,10.5593
2016-01-06,9.9685
2016-01-07,9.8271
2016-01-08,9.7522
2016-01-11,9.7189
2016-01-12,9.5442
2016-01-13,9.5442
2016-01-14,9.3611
2016-01-15,9.0782
2016-01-19,9.3278
2016-01-20,9.3611
2016-01-21,9.2446
2016-01-22,9.5858
2016-01-25,9.4443
2016-01-26,9.7439
2016-01-27,9.9269
2016-01-28,9.7023
2016-01-29,9.7855
2016-02-01,9.3528
2016-02-02,9.228
2016-02-03,9.2363
2016-02-04,9.2696
2016-02-05,9.1947
2016-02-08,9.2113
2016-02-09,9.1115
2016-02-10,9.0948
2016-02-11,9.1281
2016-02-12,9.7189
2016-02-16,10.0268
2016-02-17,9.9519
2016-02-18,9.8604
2016-02-19,9.644
2016-02-22,9.6773
2016-02-23,9.5442
2016-02-24,9.5691
2016-02-25,9.669
2016-02-26,10.0517
2016-02-29,9.902
2016-03-01,10.0767
2016-03-02,10.3846
2016-03-03,10.3596
2016-03-04,10.576
2016-03-07,10.4678
2016-03-08,10.2098
2016-03-09,10.8173
2016-03-10,11.2483
2016-03-11,11.5948
2016-03-14,11.992
2016-03-15,11.8314
2016-03-16,11.6286
2016-03-17,11.7215
2016-03-18,11.7131
2016-03-21,11.806
2016-03-22,11.8906
2016-03-23,11.5779
2016-03-24,11.9497
2016-03-28,12.0342
2016-03-29,12.7441
2016-03-30,12.8793
2016-03-31,13.0145
2016-04-01,12.93
2016-04-04,12.7526
2016-04-05,12.5666
2016-04-06,12.2709
2016-04-07,12.3976
2016-04-08,12.3892
2016-04-11,12.33
2016-04-12,12.5244
2016-04-13,12.423
2016-04-14,12.499
2016-04-15,12.5751
2016-04-18,13.0483
2016-04-19,12.9385
2016-04-20,13.0991
2016-04-21,12.8033
2016-04-22,12.7019
2016-04-25,12.9554
2016-04-26,13.1329
2016-04-27,13.0314
2016-04-28,12.7272
2016-04-29,12.2624
2016-05-02,12.6089
2016-05-03,12.4568
2016-05-04,12.0089
2016-05-05,11.9328
2016-05-06,11.9582
2016-05-09,12.0004
2016-05-10,11.9497
2016-05-11,11.823
2016-05-12,11.7469
2016-05-13,11.4427
2016-05-16,11.4089
2016-05-17,11.5779
2016-05-18,11.8314
2016-05-19,11.7638
2016-05-20,12.0201
2016-05-23,12.0457
2016-05-24,11.9005
2016-05-25,12.0713
2016-05-26,11.8492
2016-05-27,12.1226
2016-05-31,12.0457
2016-06-01,12.1226
2016-06-02,12.1397
2016-06-03,12.1311
2016-06-06,12.1824
2016-06-07,12.1141
2016-06-08,11.9347
2016-06-09,11.7382
2016-06-10,11.8834
2016-06-13,11.6698
2016-06-14,11.4306
2016-06-15,11.6186
2016-06-16,11.3708
2016-06-17,11.3452
2016-06-20,11.3537
2016-06-21,11.7296
2016-06-22,11.704
2016-06-23,11.9774
2016-06-24,11.4819
2016-06-27,10.5507
2016-06-28,10.4652
2016-06-29,11.6357
2016-06-30,12.0372
2016-07-01,12.097
2016-07-05,12.0628
2016-07-06,12.1311
2016-07-07,12.6181
2016-07-08,13.1307
2016-07-11,13.1734
2016-07-12,12.9769
2016-07-13,13.0025
2016-07-14,12.601
2016-07-15,12.8146
2016-07-18,12.806
2016-07-19,12.7292
2016-07-20,12.6864
2016-07-21,12.7804
2016-07-22,13.2845
2016-07-25,14.1815
2016-07-26,14.8222
2016-07-27,14.6941
2016-07-28,14.7368
2016-07-29,14.8222
2016-08-01,14.7453
2016-08-02,14.4036
2016-08-03,14.6001
2016-08-04,14.677
2016-08-05,14.7539
2016-08-08,14.6343
2016-08-09,14.5488
2016-08-10,14.5574
2016-08-11,14.6257
2016-08-12,14.8137
2016-08-15,15.181
2016-08-16,15.3433
2016-08-17,15.3006
2016-08-18,15.2494
2016-08-19,15.0324
2016-08-22,15.2928
2016-08-23,15.2841
2016-08-24,15.232
2016-08-25,15.1756
2016-08-26,15.1799
2016-08-29,15.3014
2016-08-30,15.6226
2016-08-31,15.8656
2016-09-01,16.4211
2016-09-02,15.718
2016-09-06,15.8395
2016-09-07,15.7094
2016-09-08,15.9003
2016-09-09,15.8309
2016-09-12,16.0739
2016-09-13,16.2735
2016-09-14,16.0826
2016-09-15,16.1433
2016-09-16,16.3343
2016-09-19,16.4905
2016-09-20,16.6641
2016-09-21,15.9871
2016-09-22,16.1433
2016-09-23,16.2041
2016-09-26,16.3777
2016-09-27,16.1433
2016-09-28,16.4471
2016-09-29,16.1867
2016-09-30,15.1105
2016-10-03,15.6399
2016-10-04,15.6746
2016-10-05,16.0738
2016-10-06,16.4818
2016-10-07,15.935
2016-10-10,16.0999
2016-10-11,16.0999
2016-10-12,16.1867
2016-10-13,16.4471
2016-10-14,15.6226
2016-10-17,15.3188
2016-10-18,15.5358
2016-10-19,15.1886
2016-10-20,14.8414
2016-10-21,14.8414
2016-10-24,14.772
2016-10-25,14.8848
2016-10-26,14.5377
2016-10-27,14.9282
2016-10-28,14.7546
2016-10-31,14.5377
2016-11-01,14.0169
2016-11-02,13.149
2016-11-03,13.6263
2016-11-04,13.4528
2016-11-07,13.3226
2016-11-08,13.3226
2016-11-09,13.366
2016-11-10,14.6245
2016-11-11,14.6679
2016-11-14,14.6679
2016-11-15,14.5377
2016-11-16,14.3641
2016-11-17,14.8034
2016-11-18,15.3744
2016-11-21,15.9191
2016-11-22,15.9015
2016-11-23,15.4623
2016-11-25,15.348
2016-11-28,14.9351
2016-11-29,14.8034
2016-11-30,15.023
2016-12-01,14.9791
2016-12-02,14.7594
2016-12-05,14.9351
2016-12-06,14.9351
2016-12-07,14.9791
2016-12-08,15.2426
2016-12-09,14.7594
2016-12-12,14.8912
2016-12-13,14.0566
2016-12-14,14.2762
2016-12-15,13.837
2016-12-16,14.1445
2016-12-19,14.2499
2016-12-20,14.4959
2016-12-21,14.9351
2016-12-22,15.9718
2016-12-23,16.209
2016-12-27,15.9015
2016-12-28,15.6819
2016-12-29,15.6819
2016-12-30,16.8679
2017-01-03,16.3847
2017-01-04,16.6483
2017-01-05,16.6483
2017-01-06,16.7361
2017-01-09,15.8576
2017-01-10,15.7258
2017-01-11,15.594
2017-01-12,15.5062
2017-01-13,15.4183
2017-01-17,15.1108
2017-01-18,15.8137
2017-01-19,17.4829
2017-01-20,17.8343
2017-01-23,18.3614
2017-01-24,17.7465
2017-01-25,17.439
2017-01-26,17.3511
2017-01-27,17.3072
2017-01-30,17.0876
2017-01-31,17.2633
2017-02-01,17.439
2017-02-02,17.2193
2017-02-03,17.1754
2017-02-06,17.2193
2017-02-07,16.6483
2017-02-08,16.9558
2017-02-09,17.439
2017-02-10,18.2736
2017-02-13,18.4493
2017-02-14,18.3614
2017-02-15,18.5723
2017-02-16,18.4844
2017-02-17,18.4932
2017-02-21,19.1082
2017-02-22,19.5914
2017-02-23,20.2503
2017-02-24,20.426
2017-02-27,19.1521
2017-02-28,18.9764
2017-03-01,19.3278
2017-03-02,17.439
2017-03-03,17.3511
2017-03-06,17.1315
2017-03-07,17.0876
2017-03-08,16.936
2017-03-09,16.936
2017-03-10,16.936
2017-03-13,16.9806
2017-03-14,16.936
2017-03-15,16.7132
2017-03-16,16.5349
2017-03-17,16.5349
2017-03-20,16.624
2017-03-21,16.3655
2017-03-22,16.4458
2017-03-23,16.3566
2017-03-24,16.3121
2017-03-27,16.2675
2017-03-28,16.5795
2017-03-29,16.8915
2017-03-30,16.7132
2017-03-31,16.8915
2017-04-03,16.6686
2017-04-04,17.1143
2017-04-05,16.7577
2017-04-06,16.5349
2017-04-07,17.1143
2017-04-10,17.0697
2017-04-11,17.248
2017-04-12,17.1589
2017-04-13,17.2034
2017-04-17,17.1143
2017-04-18,17.1143
2017-04-19,17.0876
2017-04-20,17.2034
2017-04-21,17.1143
2017-04-24,17.1945
2017-04-25,17.1143
2017-04-26,17.248
2017-04-27,17.56
2017-04-28,17.5154
2017-05-01,17.4708
2017-05-02,17.1589
2017-05-03,16.624
2017-05-04,16.0892
2017-05-05,16.8915
2017-05-08,16.7132
2017-05-09,16.3121
2017-05-10,16.1338
2017-05-11,16.8023
2017-05-12,16.8023
2017-05-15,16.8915
2017-05-16,16.7577
2017-05-17,16.1784
2017-05-18,16.6093
2017-05-19,16.4746
2017-05-22,16.7889
2017-05-23,16.6183
2017-05-24,16.5644
2017-05-25,16.5463
2017-05-26,16.682
2017-05-30,16.4559
2017-05-31,16.3203
2017-06-01,16.3203
2017-06-02,16.1847
2017-06-05,16.2299
2017-06-06,16.4107
2017-06-07,16.3655
2017-06-08,16.5011
2017-06-09,16.4559
2017-06-12,16.2751
2017-06-13,16.2751
2017-06-14,16.1395
2017-06-15,16.0038
2017-06-16,16.1847
2017-06-19,16.1847
2017-06-20,15.9586
2017-06-21,15.8682
2017-06-22,15.823
2017-06-23,16.1395
2017-06-26,16.2751
2017-06-27,16.2299
2017-06-28,16.3474
2017-06-29,16.1847
2017-06-30,16.2751
2017-07-03,16.5463
2017-07-05,16.4559
2017-07-06,16.3203
2017-07-07,16.3203
2017-07-10,16.3203
2017-07-11,16.3203
2017-07-12,16.5463
2017-07-13,16.4559
2017-07-14,16.5011
2017-07-17,16.5915
2017-07-18,16.7272
2017-07-19,16.7724
2017-07-20,16.908
2017-07-21,16.9532
2017-07-24,16.8176
2017-07-25,16.682
2017-07-26,16.8176
2017-07-27,16.7272
2017-07-28,16.682
2017-07-31,16.7272
2017-08-01,16.682
2017-08-02,16.5011
2017-08-03,16.5011
2017-08-04,16.4559
2017-08-07,16.4559
2017-08-08,16.4107
2017-08-09,16.5011
2017-08-10,16.2751
2017-08-11,16.1847
2017-08-14,16.3655
2017-08-15,16.2751
2017-08-16,16.4683
2017-08-17,16.3303
2017-08-18,16.2843
2017-08-21,16.3303
2017-08-22,16.4223
2017-08-23,16.5143
2017-08-24,16.5143
2017-08-25,16.6063
2017-08-28,16.7443
2017-08-29,16.6983
2017-08-30,16.6983
2017-08-31,16.6983
2017-09-01,16.7443
2017-09-05,16.4683
2017-09-06,16.4223
2017-09-07,16.3763
2017-09-08,16.3763
2017-09-11,16.5603
2017-09-12,16.7811
2017-09-13,16.6983
2017-09-14,16.6063
2017-09-15,16.8363
2017-09-18,16.9283
2017-09-19,16.8363
2017-09-20,16.8823
2017-09-21,16.7903
2017-09-22,17.1123
2017-09-25,17.2503
2017-09-26,17.0663
2017-09-27,17.0203
2017-09-28,16.9283
2017-09-29,17.1583
2017-10-02,17.2503
2017-10-03,17.3423
2017-10-04,17.3883
2017-10-05,17.4343
2017-10-06,17.2503
2017-10-09,17.2043
2017-10-10,17.1123
2017-10-11,16.9283
2017-10-12,16.7903
2017-10-13,16.9283
2017-10-16,17.1583
2017-10-17,17.2043
2017-10-18,16.8363
2017-10-19,16.7903
2017-10-20,17.0663
2017-10-23,17.1583
2017-10-24,17.2043
2017-10-25,17.0663
2017-10-26,17.0663
2017-10-27,17.1123
2017-10-30,17.0663
2017-10-31,16.8823
2017-11-01,17.0203
2017-11-02,17.1123
2017-11-03,17.2503
2017-11-06,17.2963
2017-11-07,17.2963
2017-11-08,17.3423
2017-11-09,17.4343
2017-11-10,17.2963
2017-11-13,17.5263
2017-11-14,17.4343
2017-11-15,17.2963
2017-11-16,17.3998
2017-11-17,17.4468
2017-11-20,17.6349
2017-11-21,17.7289
2017-11-22,17.776
2017-11-24,17.5502
2017-11-27,17.6819
2017-11-28,17.7289
2017-11-29,17.4938
2017-11-30,17.3527
2017-12-01,17.1646
2017-12-04,17.3527
2017-12-05,17.2587
2017-12-06,17.3527
2017-12-07,17.5879
2017-12-08,17.3998
2017-12-11,17.3998
2017-12-12,17.6819
2017-12-13,17.823
2017-12-14,17.9076
2017-12-15,17.823
2017-12-18,17.7289
2017-12-19,17.7289
2017-12-20,17.9171
2017-12-21,17.823
2017-12-22,17.9171
2017-12-26,17.9641
2017-12-27,18.1522
2017-12-28,18.5284
2017-12-29,18.8106
2018-01-02,18.9987
2018-01-03,18.9516
2018-01-04,18.8106
2018-01-05,18.9046
2018-01-08,19.4689
2018-01-09,20.1273
2018-01-10,20.9267
2018-01-11,21.5851
2018-01-12,21.5851
2018-01-16,21.8673
2018-01-17,21.8673
2018-01-18,21.6321
2018-01-19,21.8202
2018-01-22,22.7608
2018-01-23,23.4662
2018-01-24,23.6072
2018-01-25,23.0429
2018-01-26,23.231
2018-01-29,23.0429
2018-01-30,22.7137
2018-01-31,21.9613
2018-02-01,22.2435
2018-02-02,21.7732
2018-02-05,20.2684
2018-02-06,20.6446
2018-02-07,20.9267
2018-02-08,20.5035
2018-02-09,20.3154
2018-02-12,21.6321
2018-02-13,21.6792
2018-02-14,21.35
2018-02-15,22.9959
2018-02-16,22.6197
2018-02-20,22.2905
2018-02-21,22.5727
2018-02-22,22.6667
2018-02-23,22.9058
2018-02-26,23.5753
2018-02-27,23.2884
2018-02-28,23.3362
2018-03-01,23.671
2018-03-02,23.5275
2018-03-05,24.1492
2018-03-06,21.8538
2018-03-07,21.3278
2018-03-08,21.0408
2018-03-09,20.9452
2018-03-12,21.0408
2018-03-13,20.8974
2018-03-14,20.9452
2018-03-15,20.4192
2018-03-16,20.4192
2018-03-19,19.9888
2018-03-20,20.2279
2018-03-21,20.1323
2018-03-22,20.8496
2018-03-23,20.8017
2018-03-26,20.8017
2018-03-27,20.3714
2018-03-28,20.0844
2018-03-29,20.467
2018-04-02,20.2757
2018-04-03,20.7539
2018-04-04,21.0408
2018-04-05,20.6105
2018-04-06,19.9888
2018-04-09,20.3714
2018-04-10,21.0887
2018-04-11,20.5148
2018-04-12,20.467
2018-04-13,20.5086
2018-04-16,20.8448
2018-04-17,21.3731
2018-04-18,21.3731
2018-04-19,21.6613
2018-04-20,21.6133
2018-04-23,21.3731
2018-04-24,20.9889
2018-04-25,21.133
2018-04-26,21.2771
2018-04-27,20.9889
2018-04-30,21.133
2018-05-01,21.5172
2018-05-02,21.6133
2018-05-03,21.3251
2018-05-04,20.8928
2018-05-07,21.4212
2018-05-08,21.0369
2018-05-09,21.2771
2018-05-10,21.181
2018-05-11,21.133
2018-05-14,21.6613
2018-05-15,21.2771
2018-05-16,21.0369
2018-05-17,21.229
2018-05-18,20.8928
2018-05-21,20.7968
2018-05-22,20.7488
2018-05-23,20.6527
2018-05-24,20.7007
2018-05-25,20.5566
2018-05-29,20.4606
2018-05-30,20.7007
2018-05-31,21.2771
2018-06-01,21.085
2018-06-04,21.133
2018-06-05,20.9889
2018-06-06,20.7488
2018-06-07,21.0369
2018-06-08,20.8448
2018-06-11,20.7968
2018-06-12,20.4125
2018-06-13,20.0763
2018-06-14,20.3003
2018-06-15,20.1542
2018-06-18,19.9595
2018-06-19,20.1055
2018-06-20,19.8621
2018-06-21,20.1542
2018-06-22,20.4463
2018-06-25,20.3003
2018-06-26,20.2029
2018-06-27,20.1542
2018-06-28,20.3976
2018-06-29,20.1542
2018-07-02,20.4463
2018-07-03,20.5437
2018-07-05,20.641
2018-07-06,20.5924
2018-07-09,20.8845
2018-07-10,20.5924
2018-07-11,20.2516
2018-07-12,20.4463
2018-07-13,20.8845
2018-07-16,21.0305
2018-07-17,20.641
2018-07-18,20.7871
2018-07-19,20.5924
2018-07-20,20.9818
2018-07-23,20.9331
2018-07-24,20.5437
2018-07-25,20.5437
2018-07-26,20.3003
2018-07-27,20.349
2018-07-30,20.3976
2018-07-31,20.7871
2018-08-01,20.349
2018-08-02,20.6897
2018-08-03,20.3976
2018-08-06,20.495
2018-08-07,20.495
2018-08-08,20.4463
2018-08-09,20.4463
2018-08-10,20.5437
2018-08-13,20.7871
2018-08-14,21.2739
2018-08-15,20.3976
2018-08-16,20.2516
2018-08-17,20.2516
2018-08-20,20.3976
2018-08-21,20.495
2018-08-22,20.8358
2018-08-23,20.7384
2018-08-24,20.4463
2018-08-27,20.6897
2018-08-28,20.9818
2018-08-29,21.2252
2018-08-30,21.0792
2018-08-31,20.7384
2018-09-04,20.6897
2018-09-05,20.5924
2018-09-06,20.4463
2018-09-07,20.495
2018-09-10,20.5437
2018-09-11,20.495
2018-09-12,20.495
2018-09-13,20.87
2018-09-14,21.2647
2018-09-17,21.314
2018-09-18,22.0047
2018-09-19,22.6955
2018-09-20,22.6461
2018-09-21,22.9915
2018-09-24,22.7448
2018-09-25,22.6955
2018-09-26,22.7942
2018-09-27,22.9915
2018-09-28,22.8928
2018-10-01,22.4291
2018-10-02,22.0541
2018-10-03,22.1429
2018-10-04,21.6791
2018-10-05,21.4226
2018-10-08,21.3634
2018-10-09,21.5706
2018-10-10,20.6529
2018-10-11,20.4161
2018-10-12,20.4457
2018-10-15,20.3766
2018-10-16,20.5542
2018-10-17,20.6726
2018-10-18,20.5049
2018-10-19,20.1398
2018-10-22,19.8339
2018-10-23,19.5773
2018-10-24,19.1234
2018-10-25,19.3898
2018-10-26,19.2517
2018-10-29,18.7583
2018-10-30,19.153
2018-10-31,19.3504
2018-11-01,20.2977
2018-11-02,20.7516
2018-11-05,20.87
2018-11-06,21.3338
2018-11-07,21.4423
2018-11-08,21.5607
2018-11-09,21.837
2018-11-12,21.4423
2018-11-13,21.9751
2018-11-14,21.8469
2018-11-15,21.7087
2018-11-16,22.0936
2018-11-19,21.9061
2018-11-20,21.4127
2018-11-21,21.9554
2018-11-23,21.8271
2018-11-26,22.5376
2018-11-27,22.281
2018-11-28,22.7053
2018-11-29,22.4784
2018-11-30,22.1429
2018-12-03,22.7448
2018-12-04,21.7778
2018-12-06,21.9159
2018-12-07,21.1759
2018-12-10,21.4324
2018-12-11,21.462
2018-12-12,21.7087
2018-12-13,21.8765
2018-12-14,21.3732
2018-12-17,20.7614
2018-12-18,20.1891
2018-12-19,18.9261
2018-12-20,17.3078
2018-12-21,16.8539
2018-12-24,16.6466
2018-12-26,17.0019
2018-12-27,17.515
2018-12-28,17.7123
2018-12-31,17.5446
2019-01-02,17.2683
2019-01-03,16.8736
2019-01-04,17.8011
2019-01-07,18.2551
2019-01-08,18.6991
2019-01-09,18.5314
2019-01-10,18.5906
2019-01-11,19.0445
2019-01-14,19.3898
2019-01-15,19.6464
2019-01-16,19.5477
2019-01-17,19.5378
2019-01-18,19.7845
2019-01-22,19.9424
2019-01-23,20.3075
2019-01-24,20.3766
2019-01-25,20.6924
2019-01-28,20.7713
2019-01-29,20.5739
2019-01-30,20.5049
2019-01-31,20.5838
2019-02-01,20.5246
2019-02-04,21.3732
2019-02-05,21.7087
2019-02-06,21.9258
2019-02-07,21.3041
2019-02-08,21.3239
2019-02-11,20.9983
2019-02-12,21.3436
2019-02-13,21.462
2019-02-14,22.1034
2019-02-15,22.9224
2019-02-19,23.3369
2019-02-20,23.0902
2019-02-21,23.0112
2019-02-22,23.475
2019-02-25,23.4948
2019-02-26,23.3171
2019-02-27,23.2875
2019-02-28,23.3073
2019-03-01,23.0902
2019-03-04,22.8336
2019-03-05,22.5672
2019-03-06,22.4093
2019-03-07,22.1528
2019-03-08,22.5475
2019-03-11,23.3369
2019-03-12,23.3961
2019-03-13,23.85
2019-03-14,23.86
2019-03-15,23.9
2019-03-18,23.91
2019-03-19,23.8
2019-03-20,23.74
2019-03-21,23.76
2019-03-22,23.12
2019-03-25,23.15
2019-03-26,23.38
2019-03-27,23.14
2019-03-28,23.29
2019-03-29,23.21
2019-04-01,23.63
2019-04-02,23.7
2019-04-03,23.63
2019-04-04,23.63
2019-04-05,23.71
2019-04-08,23.8
2019-04-09,23.62
2019-04-10,23.67
2019-04-11,23.63
2019-04-12,23.76
2019-04-15,23.82
2019-04-16,23.87
2019-04-17,23.86
2019-04-18,24.47
2019-04-22,24.13
2019-04-23,24.19
2019-04-24,24.29
2019-04-25,24.3
2019-04-26,24.18
2019-04-29,24.42
2019-04-30,24.45
2019-05-01,24.7
2019-05-02,24.48
2019-05-03,25
2019-05-06,25.21
2019-05-07,25.21
2019-05-08,25.22
2019-05-09,25.43
2019-05-10,25.8
2019-05-13,25.32
2019-05-14,25.45
2019-05-15,25.82
2019-05-16,26
2019-05-17,25.92
2019-05-20,25.98
2019-05-21,26.27
2019-05-22,26.32
2019-05-23,26.3
2019-05-24,26.55
2019-05-28,26.68
2019-05-29,26.45
2019-05-30,26.47
2019-05-31,25.69
2019-06-03,26.2
2019-06-04,26.34
2019-06-05,26.58
2019-06-06,25.72
2019-06-07,25.8
2019-06-10,25.95
2019-06-11,25.89
2019-06-12,25.85
2019-06-13,26.81
2019-06-14,27.12
2019-06-17,27.615
2019-06-18,27.42
2019-06-19,27.81
2019-06-20,27.725
2019-06-21,27.235
2019-06-24,27.165
2019-06-25,26
2019-06-26,25.98
2019-06-27,26.1
2019-06-28,25.97
2019-07-01,26.755
2019-07-02,26.875
2019-07-03,27.21
2019-07-04,27.21
2019-07-05,27.12
2019-07-08,27.01
2019-07-09,27.345
2019-07-10,28.015
2019-07-11,28.02
2019-07-12,28.555
2019-07-15,28.16
2019-07-16,28.325
2019-07-17,28.15
2019-07-18,28.435
2019-07-19,28.145
2019-07-22,28.22
2019-07-23,28.42
2019-07-24,29.015
2019-07-25,29.09
2019-07-26,29.355
2019-07-29,29.16
2019-07-30,29.485
2019-07-31,29.2
2019-08-01,28.7
2019-08-02,28.71
2019-08-05,26.69
2019-08-06,27.515
2019-08-07,27.605
2019-08-08,28.17
2019-08-09,28.3
2019-08-12,27.66
2019-08-13,28.05
2019-08-14,27.31
2019-08-15,27.1
2019-08-16,28.35
2019-08-19,29.135
2019-08-20,28.7
2019-08-21,28.89
2019-08-22,28.935
2019-08-23,27.86
2019-08-26,27.655
2019-08-27,27.74
2019-08-28,28.24
2019-08-29,29.26
2019-08-30,29.17
2019-09-02,29.1
2019-09-03,28.32
2019-09-04,29.28
2019-09-05,29.73
2019-09-06,29.94
2019-09-09,29.935
2019-09-10,29.045
2019-09-11,29.845
2019-09-12,30.42
2019-09-13,30.145
2019-09-16,30.47
2019-09-17,30.64
2019-09-18,30.83
2019-09-19,29.495
2019-09-20,29.4
2019-09-23,29.605
2019-09-24,28.71
2019-09-25,29.695
2019-09-26,29.595
2019-09-27,27.79
2019-09-30,26.825
2019-10-01,26.465
2019-10-02,26.2
2019-10-03,26.485
2019-10-04,26.435
2019-10-07,26.085
2019-10-08,25.98
2019-10-09,26.22
2019-10-10,26.08
2019-10-11,26.7
2019-10-14,26.3
2019-10-15,26.785
2019-10-16,26.395
2019-10-17,27.18
2019-10-18,27.935
2019-10-21,28.285
2019-10-22,28.025
2019-10-23,28.83
2019-10-24,28.135
2019-10-25,28.305
2019-10-28,29.305
2019-10-29,29.65
2019-10-30,29.62
2019-10-31,29.55
2019-11-01,31.265
2019-11-04,32.78
2019-11-05,31.81
2019-11-06,32.065
2019-11-07,32.11
2019-11-08,31.64
2019-11-11,31.885
2019-11-12,31.55
2019-11-13,31.835
2019-11-14,31.735
2019-11-15,31.58
2019-11-18,32.29
2019-11-19,32.845
2019-11-20,33.18
2019-11-21,32.195
2019-11-22,32.17
2019-11-25,32.74
