date,close
2014-06-13,71.7676
2014-06-16,71.6871
2014-06-17,71.6692
2014-06-18,71.7766
2014-06-19,71.7587
2014-06-20,71.7588
2014-06-23,71.7497
2014-06-24,71.7497
2014-06-25,71.8213
2014-06-26,71.8481
2014-06-27,71.8839
2014-06-30,71.9108
2014-07-01,71.9009
2014-07-02,71.7486
2014-07-03,71.7576
2014-07-07,71.7307
2014-07-08,71.7934
2014-07-09,71.8382
2014-07-10,71.883
2014-07-11,71.883
2014-07-14,71.8472
2014-07-15,71.8292
2014-07-16,71.8203
2014-07-17,71.8292
2014-07-18,71.8292
2014-07-21,71.7844
2014-07-22,71.8113
2014-07-23,71.874
2014-07-24,71.7844
2014-07-25,71.8203
2014-07-28,71.8472
2014-07-29,71.883
2014-07-30,71.7934
2014-07-31,71.7934
2014-08-01,71.9199
2014-08-04,71.9872
2014-08-05,71.9648
2014-08-06,71.9917
2014-08-07,72.0725
2014-08-08,72.0725
2014-08-11,72.0545
2014-08-12,72.0097
2014-08-13,72.0815
2014-08-14,72.0994
2014-08-15,72.1174
2014-08-18,72.0725
2014-08-19,72.0725
2014-08-20,71.9738
2014-08-21,71.9738
2014-08-22,71.9379
2014-08-25,71.9379
2014-08-26,71.9379
2014-08-27,72.0007
2014-08-28,72.0186
2014-08-29,72.0097
2014-09-02,71.9414
2014-09-03,71.9773
2014-09-04,71.9594
2014-09-05,72.0313
2014-09-08,71.9773
2014-09-09,71.8785
2014-09-10,71.8246
2014-09-11,71.8156
2014-09-12,71.7527
2014-09-15,71.8156
2014-09-16,71.8695
2014-09-17,71.7706
2014-09-18,71.7616
2014-09-19,71.8156
2014-09-22,71.8875
2014-09-23,71.8964
2014-09-24,71.8066
2014-09-25,71.8695
2014-09-26,71.8335
2014-09-29,71.8605
2014-09-30,71.7796
2014-10-01,71.9974
2014-10-02,71.8804
2014-10-03,71.8714
2014-10-06,71.9164
2014-10-07,72.0244
2014-10-08,72.2764
2014-10-09,72.1594
2014-10-10,72.1504
2014-10-13,72.3574
2014-10-14,72.3124
2014-10-15,72.4114
2014-10-16,72.2674
2014-10-17,72.3664
2014-10-20,72.4249
2014-10-21,72.4384
2014-10-22,72.3574
2014-10-23,72.2944
2014-10-24,72.2854
2014-10-27,72.3034
2014-10-28,72.2314
2014-10-29,72.0874
2014-10-30,72.1144
2014-10-31,72.1234
2014-11-03,72.0378
2014-11-04,72.0197
2014-11-05,72.0558
2014-11-06,72.0017
2014-11-07,72.0828
2014-11-10,72.0197
2014-11-11,72.0468
2014-11-12,72.0468
2014-11-13,71.9972
2014-11-14,72.0919
2014-11-17,72.1099
2014-11-18,72.1369
2014-11-19,72.0107
2014-11-20,72.0648
2014-11-21,72.1369
2014-11-24,72.164
2014-11-25,72.2271
2014-11-26,72.2541
2014-11-28,72.2812
2014-12-01,72.2478
2014-12-02,72.144
2014-12-03,72.1349
2014-12-04,72.162
2014-12-05,71.9905
2014-12-08,71.9815
2014-12-09,72.0537
2014-12-10,72.162
2014-12-11,72.0717
2014-12-12,72.1711
2014-12-15,71.9995
2014-12-16,72.0537
2014-12-17,72.0537
2014-12-18,72.0176
2014-12-19,71.9724
2014-12-22,71.9363
2014-12-23,71.9786
2014-12-24,71.9877
2014-12-26,71.9424
2014-12-29,71.9696
2014-12-30,72.0964
2014-12-31,72.1417
2015-01-02,72.0692
2015-01-05,72.0964
2015-01-06,72.187
2015-01-07,72.2866
2015-01-08,72.2776
2015-01-09,72.3501
2015-01-12,72.4316
2015-01-13,72.4044
2015-01-14,72.4588
2015-01-15,72.649
2015-01-16,72.5675
2015-01-20,72.6309
2015-01-21,72.5947
2015-01-22,72.4588
2015-01-23,72.5403
2015-01-26,72.4407
2015-01-27,72.495
2015-01-28,72.6581
2015-01-29,72.6672
2015-01-30,72.8121
2015-02-02,72.7722
2015-02-03,72.7177
2015-02-04,72.754
2015-02-05,72.7268
2015-02-06,72.5363
2015-02-09,72.5272
2015-02-10,72.4455
2015-02-11,72.3548
2015-02-12,72.5
2015-02-13,72.5544
2015-02-17,72.4455
2015-02-18,72.5453
2015-02-19,72.5363
2015-02-20,72.5453
2015-02-23,72.5272
2015-02-24,72.7086
2015-02-25,72.7086
2015-02-26,72.6088
2015-02-27,72.6633
2015-03-02,72.5851
2015-03-03,72.5124
2015-03-04,72.5488
2015-03-05,72.6306
2015-03-06,72.4761
2015-03-09,72.4943
2015-03-10,72.5397
2015-03-11,72.5669
2015-03-12,72.5124
2015-03-13,72.5579
2015-03-16,72.5942
2015-03-17,72.5488
2015-03-18,72.8668
2015-03-19,72.6942
2015-03-20,72.7941
2015-03-23,72.8395
2015-03-24,72.8305
2015-03-25,72.8032
2015-03-26,72.7941
2015-03-27,72.8214
2015-03-30,72.8214
2015-03-31,72.885
2015-04-01,73.0525
2015-04-02,73.007
2015-04-06,73.0525
2015-04-07,73.0889
2015-04-08,73.0889
2015-04-09,72.9797
2015-04-10,72.9888
2015-04-13,73.0525
2015-04-14,73.1071
2015-04-15,73.1617
2015-04-16,73.2163
2015-04-17,73.1799
2015-04-20,73.1071
2015-04-21,73.0616
2015-04-22,72.9979
2015-04-23,73.0434
2015-04-24,73.0707
2015-04-27,73.098
2015-04-28,73.0252
2015-04-29,72.9706
2015-04-30,72.9342
2015-05-01,72.9469
2015-05-04,72.9287
2015-05-05,72.9651
2015-05-06,72.8101
2015-05-07,72.8466
2015-05-08,72.9469
2015-05-11,72.8557
2015-05-12,72.874
2015-05-13,72.9378
2015-05-14,73.1019
2015-05-15,73.1474
2015-05-18,73.0745
2015-05-19,72.9378
2015-05-20,72.9651
2015-05-21,73.0472
2015-05-22,72.9104
2015-05-26,72.9834
2015-05-27,72.9834
2015-05-28,73.0198
2015-05-29,73.0016
2015-06-01,72.9267
2015-06-02,72.8171
2015-06-03,72.7441
2015-06-04,72.8354
2015-06-05,72.6528
2015-06-08,72.6619
2015-06-09,72.5888
2015-06-10,72.5523
2015-06-11,72.6436
2015-06-12,72.5888
2015-06-15,72.598
2015-06-16,72.5888
2015-06-17,72.671
2015-06-18,72.7075
2015-06-19,72.7349
2015-06-22,72.671
2015-06-23,72.6345
2015-06-24,72.6254
2015-06-25,72.5888
2015-06-26,72.5341
2015-06-29,72.6528
2015-06-30,72.6619
2015-07-01,72.596
2015-07-02,72.7058
2015-07-06,72.7698
2015-07-07,72.907
2015-07-08,72.907
2015-07-09,72.7881
2015-07-10,72.7149
2015-07-13,72.6875
2015-07-14,72.7058
2015-07-15,72.7606
2015-07-16,72.7515
2015-07-17,72.7332
2015-07-20,72.6966
2015-07-21,72.7241
2015-07-22,72.6692
2015-07-23,72.7789
2015-07-24,72.7515
2015-07-27,72.7881
2015-07-28,72.8521
2015-07-29,72.8247
2015-07-30,72.7606
2015-07-31,72.9344
2015-08-03,72.9445
2015-08-04,72.743
2015-08-05,72.6605
2015-08-06,72.6788
2015-08-07,72.6056
2015-08-10,72.633
2015-08-11,72.7979
2015-08-12,72.7979
2015-08-13,72.7338
2015-08-14,72.688
2015-08-17,72.743
2015-08-18,72.7155
2015-08-19,72.8346
2015-08-20,72.7704
2015-08-21,72.7888
2015-08-24,72.6697
2015-08-25,72.7155
2015-08-26,72.7796
2015-08-27,72.7613
2015-08-28,72.743
2015-08-31,72.6972
2015-09-01,72.888
2015-09-02,72.9064
2015-09-03,72.9798
2015-09-04,72.9614
2015-09-08,72.9798
2015-09-09,72.9247
2015-09-10,72.8972
2015-09-11,72.9706
2015-09-14,72.9522
2015-09-15,72.7596
2015-09-16,72.7504
2015-09-17,72.9798
2015-09-18,72.9981
2015-09-21,72.9614
2015-09-22,73.044
2015-09-23,73.0623
2015-09-24,73.0807
2015-09-25,72.9889
2015-09-28,72.9431
2015-09-29,73.0256
2015-09-30,73.1358
2015-10-01,73.0641
2015-10-02,73.2571
2015-10-05,73.2203
2015-10-06,73.2754
2015-10-07,73.2938
2015-10-08,73.3122
2015-10-09,73.3122
2015-10-12,73.3306
2015-10-13,73.3122
2015-10-14,73.4133
2015-10-15,73.3949
2015-10-16,73.4225
2015-10-19,73.3857
2015-10-20,73.3765
2015-10-21,73.4317
2015-10-22,73.5052
2015-10-23,73.4868
2015-10-26,73.4041
2015-10-27,73.5236
2015-10-28,73.3122
2015-10-29,73.1468
2015-10-30,73.2295
2015-11-02,73.27
2015-11-03,73.2424
2015-11-04,73.1411
2015-11-05,73.1135
2015-11-06,72.9846
2015-11-09,72.9202
2015-11-10,72.9662
2015-11-11,73.0123
2015-11-12,73.0307
2015-11-13,73.1503
2015-11-16,73.2792
2015-11-17,73.2332
2015-11-18,73.224
2015-11-19,73.2056
2015-11-20,73.1595
2015-11-23,73.1964
2015-11-24,73.27
2015-11-25,73.2792
2015-11-27,73.3253
2015-11-30,73.224
2015-12-01,73.3282
2015-12-02,73.2267
2015-12-03,73.0792
2015-12-04,73.1345
2015-12-07,73.1438
2015-12-08,73.0515
2015-12-09,73.1622
2015-12-10,73.0884
2015-12-11,73.0608
2015-12-14,72.9132
2015-12-15,72.8487
2015-12-16,72.7933
2015-12-17,72.7657
2015-12-18,72.8856
2015-12-21,72.8763
2015-12-22,72.904
2015-12-23,72.9963
2015-12-24,73.0703
2015-12-28,72.9871
2015-12-29,72.8946
2015-12-30,72.9409
2015-12-31,73.0518
2016-01-04,73.0056
2016-01-05,72.9871
2016-01-06,73.0148
2016-01-07,73.0518
2016-01-08,73.0611
2016-01-11,73.1258
2016-01-12,73.1258
2016-01-13,73.1443
2016-01-14,73.1166
2016-01-15,73.1351
2016-01-19,73.1073
2016-01-20,73.1073
2016-01-21,73.1166
2016-01-22,73.0981
2016-01-25,73.0611
2016-01-26,73.1073
2016-01-27,73.0703
2016-01-28,73.0981
2016-01-29,73.1998
2016-02-01,73.1173
2016-02-02,73.21
2016-02-03,73.2563
2016-02-04,73.2285
2016-02-05,73.1914
2016-02-08,73.2563
2016-02-09,73.21
2016-02-10,73.1822
2016-02-11,73.2007
2016-02-12,73.0155
2016-02-16,72.9506
2016-02-17,73.0155
2016-02-18,73.1266
2016-02-19,73.1081
2016-02-22,73.071
2016-02-23,73.1451
2016-02-24,73.2192
2016-02-25,73.3952
2016-02-26,73.3859
2016-02-29,73.3674
2016-03-01,73.2514
2016-03-02,73.1772
2016-03-03,73.1772
2016-03-04,73.2607
2016-03-07,73.2143
2016-03-08,73.3164
2016-03-09,73.3535
2016-03-10,73.3628
2016-03-11,73.4184
2016-03-14,73.4834
2016-03-15,73.4834
2016-03-16,73.7431
2016-03-17,73.8452
2016-03-18,73.8544
2016-03-21,73.8266
2016-03-22,73.8266
2016-03-23,73.9379
2016-03-24,73.9101
2016-03-28,73.9565
2016-03-29,74.1327
2016-03-30,74.1049
2016-03-31,74.2441
2016-04-01,74.3091
2016-04-04,74.2626
2016-04-05,74.3742
2016-04-06,74.4764
2016-04-07,74.495
2016-04-08,74.4392
2016-04-11,74.4392
2016-04-12,74.4299
2016-04-13,74.4113
2016-04-14,74.4392
2016-04-15,74.5321
2016-04-18,74.5321
2016-04-19,74.5414
2016-04-20,74.495
2016-04-21,74.5228
2016-04-22,74.495
2016-04-25,74.4578
2016-04-26,74.402
2016-04-27,74.4578
2016-04-28,74.5321
2016-04-29,74.5228
2016-05-02,74.5107
2016-05-03,74.6131
2016-05-04,74.5945
2016-05-05,74.6224
2016-05-06,74.669
2016-05-09,74.7155
2016-05-10,74.8086
2016-05-11,74.7341
2016-05-12,74.6317
2016-05-13,74.641
2016-05-16,74.6876
2016-05-17,74.6131
2016-05-18,74.3897
2016-05-19,74.4269
2016-05-20,74.4549
2016-05-23,74.4828
2016-05-24,74.4176
2016-05-25,74.4362
2016-05-26,74.5386
2016-05-27,74.399
2016-05-31,74.4735
2016-06-01,74.4772
2016-06-02,74.6264
2016-06-03,74.8409
2016-06-06,74.785
2016-06-07,74.8223
2016-06-08,74.8875
2016-06-09,74.8875
2016-06-10,74.9622
2016-06-13,74.9808
2016-06-14,74.9528
2016-06-15,75.0834
2016-06-16,75.0647
2016-06-17,74.9995
2016-06-20,75.0368
2016-06-21,74.9342
2016-06-22,74.9528
2016-06-23,74.9995
2016-06-24,75.1953
2016-06-27,75.0927
2016-06-28,75.3259
2016-06-29,75.3352
2016-06-30,75.3912
2016-07-01,75.5443
2016-07-05,75.6191
2016-07-06,75.6845
2016-07-07,75.6097
2016-07-08,75.5443
2016-07-11,75.5163
2016-07-12,75.2827
2016-07-13,75.3855
2016-07-14,75.236
2016-07-15,75.1706
2016-07-18,75.1613
2016-07-19,75.2547
2016-07-20,75.3201
2016-07-21,75.3949
2016-07-22,75.3762
2016-07-25,75.3388
2016-07-26,75.3295
2016-07-27,75.4136
2016-07-28,75.4416
2016-07-29,75.6097
2016-08-01,75.4347
2016-08-02,75.3692
2016-08-03,75.416
2016-08-04,75.5096
2016-08-05,75.3879
2016-08-08,75.4067
2016-08-09,75.4815
2016-08-10,75.6032
2016-08-11,75.4909
2016-08-12,75.6219
2016-08-15,75.547
2016-08-16,75.4722
2016-08-17,75.6126
2016-08-18,75.6313
2016-08-19,75.5658
2016-08-22,75.5938
2016-08-23,75.6219
2016-08-24,75.6032
2016-08-25,75.6032
2016-08-26,75.5002
2016-08-29,75.4909
2016-08-30,75.5658
2016-08-31,75.5377
2016-09-01,75.5658
2016-09-02,75.5565
2016-09-06,75.6783
2016-09-07,75.669
2016-09-08,75.5752
2016-09-09,75.4815
2016-09-12,75.5002
2016-09-13,75.4346
2016-09-14,75.5283
2016-09-15,75.5283
2016-09-16,75.5096
2016-09-19,75.4721
2016-09-20,75.4627
2016-09-21,75.4815
2016-09-22,75.5658
2016-09-23,75.5377
2016-09-26,75.5471
2016-09-27,75.5846
2016-09-28,75.5846
2016-09-29,75.6033
2016-09-30,75.519
2016-10-03,75.3596
2016-10-04,75.3221
2016-10-05,75.2658
2016-10-06,75.2752
2016-10-07,75.3033
2016-10-10,75.3127
2016-10-11,75.2846
2016-10-12,75.2377
2016-10-13,75.3408
2016-10-14,75.294
2016-10-17,75.369
2016-10-18,75.4252
2016-10-19,75.4721
2016-10-20,75.4252
2016-10-21,75.4533
2016-10-24,75.4252
2016-10-25,75.3971
2016-10-26,75.3596
2016-10-27,75.2846
2016-10-28,75.2752
2016-10-31,75.3033
2016-11-01,75.3005
2016-11-02,75.3569
2016-11-03,75.3757
2016-11-04,75.3851
2016-11-07,75.4038
2016-11-08,75.3381
2016-11-09,75.0939
2016-11-10,75
2016-11-11,74.8028
2016-11-14,74.6995
2016-11-15,74.831
2016-11-16,74.7652
2016-11-17,74.6807
2016-11-18,74.6243
2016-11-21,74.6619
2016-11-22,74.7277
2016-11-23,74.5304
2016-11-25,74.5117
2016-11-28,74.6337
2016-11-29,74.6995
2016-11-30,74.5868
2016-12-01,74.4513
2016-12-02,74.63
2016-12-05,74.63
2016-12-06,74.6582
2016-12-07,74.6771
2016-12-08,74.6959
2016-12-09,74.6582
2016-12-12,74.6018
2016-12-13,74.5924
2016-12-14,74.4325
2016-12-15,74.3008
2016-12-16,74.3572
2016-12-19,74.4325
2016-12-20,74.4607
2016-12-21,74.5171
2016-12-22,74.4813
2016-12-23,74.5567
2016-12-27,74.5002
2016-12-28,74.585
2016-12-29,74.7075
2016-12-30,74.8207
2017-01-03,74.7264
2017-01-04,74.783
2017-01-05,74.9149
2017-01-06,74.783
2017-01-09,74.8489
2017-01-10,74.8867
2017-01-11,74.9149
2017-01-12,74.9338
2017-01-13,74.8678
2017-01-17,74.9998
2017-01-18,74.8678
2017-01-19,74.7924
2017-01-20,74.8961
2017-01-23,75.0281
2017-01-24,74.9621
2017-01-25,74.9055
2017-01-26,74.9432
2017-01-27,74.9998
2017-01-30,74.9621
2017-01-31,75.0563
2017-02-01,75.046
2017-02-02,75.0365
2017-02-03,75.0932
2017-02-06,75.197
2017-02-07,75.1876
2017-02-08,75.2537
2017-02-09,75.197
2017-02-10,75.1782
2017-02-13,75.1687
2017-02-14,75.1073
2017-02-15,75.0554
2017-02-16,75.2159
2017-02-17,75.2442
2017-02-21,75.2442
2017-02-22,75.282
2017-02-23,75.3859
2017-02-24,75.4614
2017-02-27,75.367
2017-02-28,75.3198
2017-03-01,75.2914
2017-03-02,75.1685
2017-03-03,75.2157
2017-03-06,75.1779
2017-03-07,75.1212
2017-03-08,75.0455
2017-03-09,74.9509
2017-03-10,74.9888
2017-03-13,74.932
2017-03-14,74.9604
2017-03-15,75.2063
2017-03-16,75.0739
2017-03-17,75.1495
2017-03-20,75.1874
2017-03-21,75.2725
2017-03-22,75.3482
2017-03-23,75.3292
2017-03-24,75.3482
2017-03-27,75.386
2017-03-28,75.2914
2017-03-29,75.3671
2017-03-30,75.3576
2017-03-31,75.4144
2017-04-03,75.5091
2017-04-04,75.4807
2017-04-05,75.5754
2017-04-06,75.5375
2017-04-07,75.4333
2017-04-10,75.4996
2017-04-11,75.6228
2017-04-12,75.6702
2017-04-13,75.7555
2017-04-17,75.746
2017-04-18,75.8502
2017-04-19,75.7934
2017-04-20,75.7839
2017-04-21,75.7555
2017-04-24,75.727
2017-04-25,75.6418
2017-04-26,75.6797
2017-04-27,75.727
2017-04-28,75.727
2017-05-01,75.7052
2017-05-02,75.7906
2017-05-03,75.7052
2017-05-04,75.6767
2017-05-05,75.7052
2017-05-08,75.6482
2017-05-09,75.6482
2017-05-10,75.6767
2017-05-11,75.7052
2017-05-12,75.8571
2017-05-15,75.8286
2017-05-16,75.9045
2017-05-17,76.0469
2017-05-18,75.971
2017-05-19,76.0374
2017-05-22,75.99
2017-05-23,75.952
2017-05-24,75.99
2017-05-25,75.9425
2017-05-26,75.99
2017-05-30,76.0279
2017-05-31,76.0849
2017-06-01,76.0563
2017-06-02,76.1514
2017-06-05,76.0944
2017-06-06,76.1895
2017-06-07,76.1229
2017-06-08,76.1039
2017-06-09,76.0373
2017-06-12,76.0373
2017-06-13,76.0563
2017-06-14,76.1609
2017-06-15,76.0658
2017-06-16,76.1514
2017-06-19,76.0849
2017-06-20,76.1324
2017-06-21,76.1134
2017-06-22,76.1704
2017-06-23,76.18
2017-06-26,76.199
2017-06-27,76.1134
2017-06-28,76.1895
2017-06-29,76.1229
2017-06-30,76.1229
2017-07-03,75.9612
2017-07-05,75.9137
2017-07-06,75.8851
2017-07-07,75.9137
2017-07-10,75.9897
2017-07-11,76.0278
2017-07-12,76.1229
2017-07-13,76.1039
2017-07-14,76.1609
2017-07-17,76.1609
2017-07-18,76.218
2017-07-19,76.237
2017-07-20,76.2275
2017-07-21,76.3036
2017-07-24,76.2656
2017-07-25,76.18
2017-07-26,76.2846
2017-07-27,76.256
2017-07-28,76.2941
2017-07-31,76.3131
2017-08-01,76.3808
2017-08-02,76.3522
2017-08-03,76.4284
2017-08-04,76.3808
2017-08-07,76.3903
2017-08-08,76.3141
2017-08-09,76.3331
2017-08-10,76.3045
2017-08-11,76.3808
2017-08-14,76.3617
2017-08-15,76.2855
2017-08-16,76.3712
2017-08-17,76.4284
2017-08-18,76.3903
2017-08-21,76.4379
2017-08-22,76.3998
2017-08-23,76.4951
2017-08-24,76.4475
2017-08-25,76.4284
2017-08-28,76.5046
2017-08-29,76.5523
2017-08-30,76.5237
2017-08-31,76.5809
2017-09-01,76.5055
2017-09-05,76.62
2017-09-06,76.5627
2017-09-07,76.6582
2017-09-08,76.6582
2017-09-11,76.5818
2017-09-12,76.5532
2017-09-13,76.5246
2017-09-14,76.4959
2017-09-15,76.4768
2017-09-18,76.4482
2017-09-19,76.4482
2017-09-20,76.3718
2017-09-21,76.3718
2017-09-22,76.4386
2017-09-25,76.4864
2017-09-26,76.4864
2017-09-27,76.4482
2017-09-28,76.5341
2017-09-29,76.4959
2017-10-02,76.5074
2017-10-03,76.5265
2017-10-04,76.5457
2017-10-05,76.517
2017-10-06,76.5074
2017-10-09,76.5552
2017-10-10,76.5552
2017-10-11,76.5552
2017-10-12,76.5648
2017-10-13,76.6222
2017-10-16,76.5648
2017-10-17,76.5265
2017-10-18,76.517
2017-10-19,76.5744
2017-10-20,76.517
2017-10-23,76.5457
2017-10-24,76.4978
2017-10-25,76.4787
2017-10-26,76.4309
2017-10-27,76.5074
2017-10-30,76.5457
2017-10-31,76.5552
2017-11-01,76.5006
2017-11-02,76.4815
2017-11-03,76.4623
2017-11-06,76.5102
2017-11-07,76.4911
2017-11-08,76.4336
2017-11-09,76.4144
2017-11-10,76.3186
2017-11-13,76.309
2017-11-14,76.2706
2017-11-15,76.3186
2017-11-16,76.2706
2017-11-17,76.309
2017-11-20,76.2515
2017-11-21,76.2515
2017-11-22,76.424
2017-11-24,76.3473
2017-11-27,76.3665
2017-11-28,76.4144
2017-11-29,76.3377
2017-11-30,76.309
2017-12-01,76.3502
2017-12-04,76.2638
2017-12-05,76.2542
2017-12-06,76.3022
2017-12-07,76.331
2017-12-08,76.3022
2017-12-11,76.3022
2017-12-12,76.2638
2017-12-13,76.3982
2017-12-14,76.3502
2017-12-15,76.2926
2017-12-18,76.2734
2017-12-19,76.2542
2017-12-20,76.2638
2017-12-21,76.1966
2017-12-22,76.1774
2017-12-26,76.1806
2017-12-27,76.2864
2017-12-28,76.296
2017-12-29,76.3057
2018-01-02,76.2768
2018-01-03,76.2864
2018-01-04,76.2479
2018-01-05,76.2672
2018-01-08,76.2768
2018-01-09,76.2672
2018-01-10,76.2768
2018-01-11,76.2768
2018-01-12,76.2672
2018-01-16,76.2287
2018-01-17,76.1613
2018-01-18,76.1228
2018-01-19,76.0555
2018-01-22,76.0651
2018-01-23,76.1517
2018-01-24,76.1421
2018-01-25,76.1998
2018-01-26,76.0843
2018-01-29,76.0651
2018-01-30,76.0459
2018-01-31,76.0459
2018-02-01,75.9812
2018-02-02,75.9522
2018-02-05,76.0776
2018-02-06,76.0004
2018-02-07,75.9522
2018-02-08,75.9426
2018-02-09,75.904
2018-02-12,75.8655
2018-02-13,75.8173
2018-02-14,75.663
2018-02-15,75.6823
2018-02-16,75.692
2018-02-20,75.6534
2018-02-21,75.6052
2018-02-22,75.6534
2018-02-23,75.692
2018-02-26,75.7209
2018-02-27,75.6052
2018-02-28,75.6341
2018-03-01,75.7231
2018-03-02,75.6459
2018-03-05,75.7231
2018-03-06,75.6362
2018-03-07,75.6459
2018-03-08,75.6652
2018-03-09,75.6362
2018-03-12,75.6362
2018-03-13,75.6555
2018-03-14,75.6362
2018-03-15,75.6169
2018-03-16,75.6266
2018-03-19,75.5734
2018-03-20,75.501
2018-03-21,75.5396
2018-03-22,75.5493
2018-03-23,75.559
2018-03-26,75.53
2018-03-27,75.6362
2018-03-28,75.6555
2018-03-29,75.7424
2018-04-02,75.7262
2018-04-03,75.7649
2018-04-04,75.823
2018-04-05,75.7843
2018-04-06,75.852
2018-04-09,75.8714
2018-04-10,75.8424
2018-04-11,75.8327
2018-04-12,75.7843
2018-04-13,75.7649
2018-04-16,75.8133
2018-04-17,75.8133
2018-04-18,75.6875
2018-04-19,75.6778
2018-04-20,75.581
2018-04-23,75.5858
2018-04-24,75.5907
2018-04-25,75.5423
2018-04-26,75.6294
2018-04-27,75.6197
2018-04-30,75.6584
2018-05-01,75.5984
2018-05-02,75.6372
2018-05-03,75.7051
2018-05-04,75.6954
2018-05-07,75.7148
2018-05-08,75.6857
2018-05-09,75.6566
2018-05-10,75.7051
2018-05-11,75.6954
2018-05-14,75.6566
2018-05-15,75.5402
2018-05-16,75.5111
2018-05-17,75.5499
2018-05-18,75.6566
2018-05-21,75.6469
2018-05-22,75.6178
2018-05-23,75.7633
2018-05-24,75.8409
2018-05-25,75.8894
2018-05-29,76.1319
2018-05-30,76.0543
2018-05-31,75.9379
2018-06-01,75.8641
2018-06-04,75.7961
2018-06-05,75.8447
2018-06-06,75.7766
2018-06-07,75.8544
2018-06-08,75.8252
2018-06-11,75.7864
2018-06-12,75.7961
2018-06-13,75.7669
2018-06-14,75.8155
2018-06-15,75.8739
2018-06-18,75.8155
2018-06-19,75.8641
2018-06-20,75.8155
2018-06-21,75.835
2018-06-22,75.835
2018-06-25,75.8252
2018-06-26,75.9127
2018-06-27,76.01
2018-06-28,75.9905
2018-06-29,75.9225
2018-07-02,75.9463
2018-07-03,75.956
2018-07-05,76.0145
2018-07-06,76.0535
2018-07-09,76.0242
2018-07-10,76.0145
2018-07-11,76.034
2018-07-12,76.0535
2018-07-13,76.0924
2018-07-16,76.0632
2018-07-17,76.0632
2018-07-18,76.0632
2018-07-19,76.1314
2018-07-20,76.1119
2018-07-23,76.0535
2018-07-24,76.1022
2018-07-25,76.0924
2018-07-26,76.1022
2018-07-27,76.1217
2018-07-30,76.1168
2018-07-31,76.1411
2018-08-01,76.1801
2018-08-02,76.1899
2018-08-03,76.3266
2018-08-06,76.3656
2018-08-07,76.3071
2018-08-08,76.2973
2018-08-09,76.3266
2018-08-10,76.3852
2018-08-13,76.434
2018-08-14,76.4047
2018-08-15,76.4926
2018-08-16,76.4633
2018-08-17,76.5121
2018-08-20,76.5707
2018-08-21,76.5512
2018-08-22,76.5512
2018-08-23,76.5414
2018-08-24,76.5414
2018-08-27,76.5316
2018-08-28,76.4828
2018-08-29,76.473
2018-08-30,76.5023
2018-08-31,76.5512
2018-09-04,76.4961
2018-09-05,76.5059
2018-09-06,76.5842
2018-09-07,76.4667
2018-09-10,76.4667
2018-09-11,76.3982
2018-09-12,76.4765
2018-09-13,76.4765
2018-09-14,76.4276
2018-09-17,76.4472
2018-09-18,76.4178
2018-09-19,76.3493
2018-09-20,76.3982
2018-09-21,76.3787
2018-09-24,76.3787
2018-09-25,76.3591
2018-09-26,76.4276
2018-09-27,76.4472
2018-09-28,76.4863
2018-10-01,76.5199
2018-10-02,76.5395
2018-10-03,76.4512
2018-10-04,76.3531
2018-10-05,76.3433
2018-10-08,76.3139
2018-10-09,76.2943
2018-10-10,76.2845
2018-10-11,76.3728
2018-10-12,76.3433
2018-10-15,76.3237
2018-10-16,76.3924
2018-10-17,76.3237
2018-10-18,76.3139
2018-10-19,76.2845
2018-10-22,76.2943
2018-10-23,76.3139
2018-10-24,76.4316
2018-10-25,76.4806
2018-10-26,76.4905
2018-10-29,76.461
2018-10-30,76.4512
2018-10-31,76.4316
2018-11-01,76.5106
2018-11-02,76.3632
2018-11-05,76.3828
2018-11-06,76.3828
2018-11-07,76.4025
2018-11-08,76.2943
2018-11-09,76.3533
2018-11-12,76.373
2018-11-13,76.373
2018-11-14,76.3435
2018-11-15,76.3927
2018-11-16,76.432
2018-11-19,76.3927
2018-11-20,76.314
2018-11-21,76.4123
2018-11-23,76.3927
2018-11-26,76.3927
2018-11-27,76.3828
2018-11-28,76.4516
2018-11-29,76.4222
2018-11-30,76.373
2018-12-03,76.4306
2018-12-04,76.4109
2018-12-06,76.47
2018-12-07,76.4404
2018-12-10,76.5488
2018-12-11,76.4798
2018-12-12,76.47
2018-12-13,76.5685
2018-12-14,76.6178
2018-12-17,76.6572
2018-12-18,76.7656
2018-12-19,76.7262
2018-12-20,76.6769
2018-12-21,76.7361
2018-12-24,76.7211
2018-12-26,76.6717
2018-12-27,76.7903
2018-12-28,76.899
2018-12-31,77.0076
2019-01-02,77.057
2019-01-03,77.2053
2019-01-04,76.9978
2019-01-07,76.9681
2019-01-08,76.9286
2019-01-09,77.0966
2019-01-10,77.0669
2019-01-11,77.1954
2019-01-14,77.1855
2019-01-15,77.2645
2019-01-16,77.3238
2019-01-17,77.3238
2019-01-18,77.3732
2019-01-22,77.4523
2019-01-23,77.5313
2019-01-24,77.6202
2019-01-25,77.6103
2019-01-28,77.6202
2019-01-29,77.6993
2019-01-30,77.8672
2019-01-31,78.0352
2019-02-01,77.9452
2019-02-04,77.9155
2019-02-05,77.9848
2019-02-06,77.9749
2019-02-07,78.0145
2019-02-08,78.0739
2019-02-11,78.0343
2019-02-12,78.0541
2019-02-13,77.9848
2019-02-14,78.064
2019-02-15,78.0739
2019-02-19,78.1234
2019-02-20,78.1234
2019-02-21,78.1234
2019-02-22,78.2125
2019-02-25,78.1828
2019-02-26,78.2819
2019-02-27,78.2521
2019-02-28,78.2323
2019-03-01,78.1969
2019-03-04,78.2664
2019-03-05,78.2961
2019-03-06,78.3656
2019-03-07,78.4946
2019-03-08,78.4946
2019-03-11,78.5045
2019-03-12,78.5542
2019-03-13,78.5938
2019-03-14,78.5641
2019-03-15,78.6633
2019-03-18,78.6335
2019-03-19,78.6534
2019-03-20,78.8717
2019-03-21,78.8618
2019-03-22,79.0206
2019-03-25,79.1496
2019-03-26,79.1496
2019-03-27,79.1793
2019-03-28,79.1496
2019-03-29,79.1496
2019-04-01,78.9552
2019-04-02,79.0149
2019-04-03,78.9552
2019-04-04,78.9751
2019-04-05,78.985
2019-04-08,79.0049
2019-04-09,79.0646
2019-04-10,79.1542
2019-04-11,79.1044
2019-04-12,79.0746
2019-04-15,79.0447
2019-04-16,79.0049
2019-04-17,79.0049
2019-04-18,79.0348
2019-04-22,79.0149
2019-04-23,79.1243
2019-04-24,79.194
2019-04-25,79.1741
2019-04-26,79.3134
2019-04-29,79.2338
2019-04-30,79.3333
2019-05-01,79.2543
2019-05-02,79.1845
2019-05-03,79.2543
2019-05-06,79.3341
2019-05-07,79.354
2019-05-08,79.2942
2019-05-09,79.344
2019-05-10,79.364
2019-05-13,79.4438
2019-05-14,79.4438
2019-05-15,79.5236
2019-05-16,79.4737
2019-05-17,79.4937
2019-05-20,79.4438
2019-05-21,79.3939
2019-05-22,79.4238
2019-05-23,79.5535
2019-05-24,79.5435
2019-05-28,79.6233
2019-05-29,79.6532
2019-05-30,79.7729
2019-05-31,79.9126
2019-06-03,80.12
2019-06-04,80.04
2019-06-05,80.13
2019-06-06,80.09
2019-06-07,80.2
2019-06-10,80.14
2019-06-11,80.1
2019-06-12,80.17
2019-06-13,80.285
2019-06-14,80.215
2019-06-17,80.245
2019-06-18,80.335
2019-06-19,80.565
2019-06-20,80.635
2019-06-21,80.575
2019-06-24,80.665
2019-06-25,80.67
2019-06-26,80.575
2019-06-27,80.655
2019-06-28,80.695
2019-07-01,80.475
2019-07-02,80.585
2019-07-03,80.605
2019-07-04,80.605
2019-07-05,80.395
2019-07-08,80.345
2019-07-09,80.325
2019-07-10,80.455
2019-07-11,80.41
2019-07-12,80.44
2019-07-15,80.455
2019-07-16,80.4
2019-07-17,80.515
2019-07-18,80.645
2019-07-19,80.58
2019-07-22,80.625
2019-07-23,80.625
2019-07-24,80.655
2019-07-25,80.595
2019-07-26,80.625
2019-07-29,80.625
2019-07-30,80.595
2019-07-31,80.575
2019-08-01,80.65
2019-08-02,80.665
2019-08-05,80.785
2019-08-06,80.865
2019-08-07,80.875
2019-08-08,80.865
2019-08-09,80.775
2019-08-12,80.93
2019-08-13,80.805
2019-08-14,80.83
2019-08-15,81.035
2019-08-16,81.035
2019-08-19,80.985
2019-08-20,81.11
2019-08-21,81.085
2019-08-22,81.035
2019-08-23,81.175
2019-08-26,81.17
2019-08-27,81.24
2019-08-28,81.275
2019-08-29,81.235
2019-08-30,81.285
2019-09-02,81.28
2019-09-03,81.09
2019-09-04,81.23
2019-09-05,81.01
2019-09-06,81.045
2019-09-09,80.93
2019-09-10,80.77
2019-09-11,80.75
2019-09-12,80.685
2019-09-13,80.525
2019-09-16,80.625
2019-09-17,80.725
2019-09-18,80.72
2019-09-19,80.765
2019-09-20,80.895
2019-09-23,80.915
2019-09-24,81.06
2019-09-25,80.945
2019-09-26,80.985
2019-09-27,81.015
2019-09-30,81.05
2019-10-01,80.965
2019-10-02,81.105
2019-10-03,81.28
2019-10-04,81.3
2019-10-07,81.215
2019-10-08,81.255
2019-10-09,81.195
2019-10-10,81.09
2019-10-11,80.95
2019-10-14,80.995
2019-10-15,80.95
2019-10-16,81.015
2019-10-17,81.035
2019-10-18,81.11
2019-10-21,81.045
2019-10-22,81.09
2019-10-23,81.1
2019-10-24,81.12
2019-10-25,81.06
2019-10-28,81.025
2019-10-29,81.015
2019-10-30,81.075
2019-10-31,81.285
2019-11-01,81.075
2019-11-04,81.005
2019-11-05,80.895
2019-11-06,80.985
2019-11-07,80.825
2019-11-08,80.81
2019-11-11,80.76
2019-11-12,80.845
2019-11-13,80.925
2019-11-14,81.02
2019-11-15,80.98
2019-11-18,81.015
2019-11-19,81.035
2019-11-20,81.075
2019-11-21,81.015
2019-11-22,81.005
2019-11-25,81.05
