date,close
2014-06-13,24.5754
2014-06-16,24.5848
2014-06-17,24.6415
2014-06-18,24.3298
2014-06-19,24.3676
2014-06-20,24.0465
2014-06-23,24.1126
2014-06-24,23.9709
2014-06-25,23.9898
2014-06-26,24.0843
2014-06-27,24.4715
2014-06-30,24.4432
2014-07-01,24.6037
2014-07-02,25.3121
2014-07-03,24.9437
2014-07-07,24.8021
2014-07-08,25.4537
2014-07-09,25.5388
2014-07-10,25.3499
2014-07-11,25.2082
2014-07-14,25.8032
2014-07-15,25.6993
2014-07-16,25.6993
2014-07-17,25.5954
2014-07-18,25.5104
2014-07-21,25.7182
2014-07-22,25.8315
2014-07-23,25.7749
2014-07-24,25.8504
2014-07-25,25.7843
2014-07-28,25.8032
2014-07-29,25.841
2014-07-30,25.8221
2014-07-31,25.4632
2014-08-01,25.5199
2014-08-04,25.671
2014-08-05,25.0287
2014-08-06,24.8776
2014-08-07,24.9815
2014-08-08,25.076
2014-08-11,25.0948
2014-08-12,25.0193
2014-08-13,24.9154
2014-08-14,25.2271
2014-08-15,25.0992
2014-08-18,25.0613
2014-08-19,25.0992
2014-08-20,25.1371
2014-08-21,24.9571
2014-08-22,24.6919
2014-08-25,24.8056
2014-08-26,24.7298
2014-08-27,24.512
2014-08-28,24.7204
2014-08-29,24.5309
2014-09-02,24.6256
2014-09-03,24.6256
2014-09-04,24.7677
2014-09-05,24.9477
2014-09-08,25.4686
2014-09-09,25.4402
2014-09-10,25.5633
2014-09-11,25.7054
2014-09-12,25.7149
2014-09-15,25.6864
2014-09-16,25.5065
2014-09-17,25.5633
2014-09-18,25.6107
2014-09-19,25.9516
2014-09-22,25.9043
2014-09-23,25.8475
2014-09-24,25.3928
2014-09-25,25.1939
2014-09-26,25.3644
2014-09-29,25.0234
2014-09-30,24.9098
2014-10-01,24.6256
2014-10-02,24.5688
2014-10-03,25.0424
2014-10-06,25.4212
2014-10-07,25.336
2014-10-08,25.1182
2014-10-09,25.1087
2014-10-10,25.0708
2014-10-13,24.2563
2014-10-14,24.4741
2014-10-15,24.512
2014-10-16,24.01
2014-10-17,24.1994
2014-10-20,24.7867
2014-10-21,24.995
2014-10-22,24.5215
2014-10-23,24.8719
2014-10-24,25.1276
2014-10-27,25.4212
2014-10-28,25.3739
2014-10-29,25.8285
2014-10-30,27.8459
2014-10-31,26.4347
2014-11-03,26.482
2014-11-04,26.7378
2014-11-05,26.8988
2014-11-06,27.145
2014-11-07,26.7662
2014-11-10,26.8609
2014-11-11,26.6809
2014-11-12,27.0408
2014-11-13,27.8459
2014-11-14,27.2587
2014-11-17,26.9556
2014-11-18,26.8419
2014-11-19,27.145
2014-11-20,27.647
2014-11-21,27.9379
2014-11-24,28.0234
2014-11-25,27.7765
2014-11-26,27.9759
2014-11-28,28.8784
2014-12-01,28.1469
2014-12-02,28.4129
2014-12-03,28.2894
2014-12-04,27.9854
2014-12-05,28.6219
2014-12-08,28.6599
2014-12-09,28.3274
2014-12-10,28.0709
2014-12-11,27.1305
2014-12-12,26.874
2014-12-15,27.4155
2014-12-16,27.558
2014-12-17,27.786
2014-12-18,28.0234
2014-12-19,28.2894
2014-12-22,28.8119
2014-12-23,28.9734
2014-12-24,29.0399
2014-12-26,29.3819
2014-12-29,29.1919
2014-12-30,29.3154
2014-12-31,29.5909
2015-01-02,29.2584
2015-01-05,28.3464
2015-01-06,28.5649
2015-01-07,29.0589
2015-01-08,29.4674
2015-01-09,29.9993
2015-01-12,30.6073
2015-01-13,30.4173
2015-01-14,30.1513
2015-01-15,29.7903
2015-01-16,30.3508
2015-01-20,30.1228
2015-01-21,30.3033
2015-01-22,30.4363
2015-01-23,30.5028
2015-01-26,30.6073
2015-01-27,30.2653
2015-01-28,30.2083
2015-01-29,30.5408
2015-01-30,29.7523
2015-02-02,30.0658
2015-02-03,30.3888
2015-02-04,30.6738
2015-02-05,30.5883
2015-02-06,30.3413
2015-02-09,29.8473
2015-02-10,30.2273
2015-02-11,29.2489
2015-02-12,29.2643
2015-02-13,29.0929
2015-02-17,28.8071
2015-02-18,29.5311
2015-02-19,29.2453
2015-02-20,29.3501
2015-02-23,29.4358
2015-02-24,29.7883
2015-02-25,30.3313
2015-02-26,30.2932
2015-02-27,30.1503
2015-03-02,30.7409
2015-03-03,30.9314
2015-03-04,30.5885
2015-03-05,30.6933
2015-03-06,30.6171
2015-03-09,31.0076
2015-03-10,30.9981
2015-03-11,30.9886
2015-03-12,31.0648
2015-03-13,30.6933
2015-03-16,30.8552
2015-03-17,30.779
2015-03-18,30.9219
2015-03-19,30.6647
2015-03-20,31.0076
2015-03-23,30.5504
2015-03-24,30.8076
2015-03-25,30.4742
2015-03-26,30.0741
2015-03-27,30.0741
2015-03-30,30.579
2015-03-31,30.1312
2015-04-01,29.9598
2015-04-02,29.9121
2015-04-06,29.9121
2015-04-07,29.5597
2015-04-08,29.7978
2015-04-09,29.6644
2015-04-10,29.5501
2015-04-13,29.1977
2015-04-14,29.5406
2015-04-15,29.4168
2015-04-16,29.1977
2015-04-17,28.9976
2015-04-20,29.2167
2015-04-21,29.512
2015-04-22,29.8169
2015-04-23,29.9693
2015-04-24,30.1598
2015-04-27,30.036
2015-04-28,29.7692
2015-04-29,29.3596
2015-04-30,29.2739
2015-05-01,29.3977
2015-05-04,29.8931
2015-05-05,29.5787
2015-05-06,29.2548
2015-05-07,29.5978
2015-05-08,30.0264
2015-05-11,29.6359
2015-05-12,29.7692
2015-05-13,29.512
2015-05-14,30.2455
2015-05-15,30.0931
2015-05-18,30.2806
2015-05-19,30.0895
2015-05-20,30.3952
2015-05-21,30.2233
2015-05-22,30.3474
2015-05-26,30.3665
2015-05-27,30.2806
2015-05-28,30.0322
2015-05-29,29.9462
2015-06-01,29.9271
2015-06-02,30.0991
2015-06-03,30.2137
2015-06-04,30.0895
2015-06-05,30.0991
2015-06-08,29.8985
2015-06-09,29.9367
2015-06-10,29.717
2015-06-11,29.4973
2015-06-12,29.5546
2015-06-15,29.6024
2015-06-16,29.5451
2015-06-17,29.6692
2015-06-18,29.9176
2015-06-19,30.2519
2015-06-22,30.4048
2015-06-23,30.4621
2015-06-24,30.1182
2015-06-25,30.1468
2015-06-26,30.2328
2015-06-29,29.9367
2015-06-30,29.5833
2015-07-01,29.8985
2015-07-02,29.6883
2015-07-06,29.7934
2015-07-07,29.9367
2015-07-08,29.5928
2015-07-09,29.631
2015-07-10,30.1755
2015-07-13,30.5385
2015-07-14,30.7295
2015-07-15,30.5194
2015-07-16,30.6818
2015-07-17,30.5767
2015-07-20,30.6054
2015-07-21,30.3952
2015-07-22,30.9397
2015-07-23,30.5576
2015-07-24,30.3665
2015-07-27,29.8221
2015-07-28,30.2233
2015-07-29,30.5671
2015-07-30,30.3283
2015-07-31,30.3952
2015-08-03,31.1307
2015-08-04,30.9206
2015-08-05,31.0734
2015-08-06,30.7009
2015-08-07,30.9015
2015-08-10,30.8442
2015-08-11,30.6531
2015-08-12,30.1755
2015-08-13,30.634
2015-08-14,31.3296
2015-08-17,31.1189
2015-08-18,31.8468
2015-08-19,32.0767
2015-08-20,31.2434
2015-08-21,30.889
2015-08-24,29.4236
2015-08-25,29.2224
2015-08-26,29.7397
2015-08-27,30.6304
2015-08-28,30.2664
2015-08-31,30.0174
2015-09-01,29.5768
2015-09-02,29.9408
2015-09-03,30.0174
2015-09-04,29.6439
2015-09-08,30.2664
2015-09-09,29.9025
2015-09-10,29.9408
2015-09-11,30.3526
2015-09-14,30.0557
2015-09-15,30.0749
2015-09-16,30.2856
2015-09-17,30.5538
2015-09-18,30.3335
2015-09-21,30.4867
2015-09-22,29.9695
2015-09-23,30.2473
2015-09-24,29.9025
2015-09-25,29.8259
2015-09-28,28.2072
2015-09-29,27.5942
2015-09-30,28.3892
2015-10-01,28.7723
2015-10-02,29.5289
2015-10-05,29.7013
2015-10-06,29.1267
2015-10-07,29.6343
2015-10-08,29.6151
2015-10-09,29.5864
2015-10-12,29.6439
2015-10-13,29.232
2015-10-14,28.8872
2015-10-15,29.3278
2015-10-16,29.8354
2015-10-19,29.8929
2015-10-20,29.778
2015-10-21,29.3086
2015-10-22,29.4236
2015-10-23,29.5289
2015-10-26,29.7588
2015-10-27,29.7301
2015-10-28,29.7971
2015-10-29,29.5481
2015-10-30,29.0692
2015-11-02,29.0788
2015-11-03,29.6726
2015-11-04,29.2129
2015-11-05,29.2129
2015-11-06,29.2129
2015-11-09,29.0309
2015-11-10,29.0788
2015-11-11,29.481
2015-11-12,29.0213
2015-11-13,28.3221
2015-11-16,28.3221
2015-11-17,28.37
2015-11-18,31.2626
2015-11-19,30.9752
2015-11-20,31.2721
2015-11-23,31.6744
2015-11-24,31.6074
2015-11-25,31.641
2015-11-27,31.9003
2015-11-30,31.3336
2015-12-01,31.5834
2015-12-02,32.4094
2015-12-03,32.1501
2015-12-04,32.688
2015-12-07,32.5727
2015-12-08,32.3614
2015-12-09,32.1981
2015-12-10,32.2173
2015-12-11,31.2568
2015-12-14,31.2952
2015-12-15,31.4873
2015-12-16,31.3816
2015-12-17,31.1991
2015-12-18,30.9014
2015-12-21,30.9014
2015-12-22,30.8245
2015-12-23,31.1223
2015-12-24,31.0166
2015-12-28,31.007
2015-12-29,31.276
2015-12-30,31.1127
2015-12-31,30.9782
2016-01-04,31.0839
2016-01-05,31.1607
2016-01-06,31.0166
2016-01-07,30.642
2016-01-08,30.5652
2016-01-11,30.6132
2016-01-12,30.9974
2016-01-13,30.4499
2016-01-14,30.3346
2016-01-15,29.8832
2016-01-19,29.691
2016-01-20,29.643
2016-01-21,29.8639
2016-01-22,30.4691
2016-01-25,29.9504
2016-01-26,30.7381
2016-01-27,30.3826
2016-01-28,30.5459
2016-01-29,30.69
2016-02-01,31.4969
2016-02-02,31.1991
2016-02-03,31.1607
2016-02-04,31.9964
2016-02-05,30.1233
2016-02-08,28.644
2016-02-09,29.0186
2016-02-10,30.0272
2016-02-11,28.9337
2016-02-12,29.1938
2016-02-16,29.0782
2016-02-17,29.7623
2016-02-18,29.2902
2016-02-19,29.0493
2016-02-22,29.8104
2016-02-23,29.8683
2016-02-24,29.6563
2016-02-25,30.3789
2016-02-26,30.4174
2016-02-29,30.2729
2016-03-01,30.9377
2016-03-02,31.063
2016-03-03,30.9763
2016-03-04,31.063
2016-03-07,31.0052
2016-03-08,30.7065
2016-03-09,30.5909
2016-03-10,30.5138
2016-03-11,30.957
2016-03-14,31.1593
2016-03-15,31.0245
2016-03-16,31.1015
2016-03-17,31.1304
2016-03-18,30.9666
2016-03-21,31.1882
2016-03-22,31.458
2016-03-23,31.3424
2016-03-24,31.3231
2016-03-28,31.4098
2016-03-29,31.6893
2016-03-30,31.776
2016-03-31,31.9109
2016-04-01,32.2385
2016-04-04,32.2481
2016-04-05,31.9109
2016-04-06,32.1228
2016-04-07,32.0072
2016-04-08,32.0361
2016-04-11,31.776
2016-04-12,31.882
2016-04-13,31.9879
2016-04-14,32.3733
2016-04-15,32.5275
2016-04-18,32.6913
2016-04-19,32.8165
2016-04-20,33.0382
2016-04-21,32.8358
2016-04-22,32.7298
2016-04-25,32.566
2016-04-26,32.6913
2016-04-27,32.5275
2016-04-28,32.2385
2016-04-29,32.2866
2016-05-02,32.6624
2016-05-03,32.5853
2016-05-04,32.3348
2016-05-05,32.4022
2016-05-06,32.5082
2016-05-09,32.7876
2016-05-10,33.0863
2016-05-11,31.7374
2016-05-12,32.0265
2016-05-13,31.9109
2016-05-16,31.9543
2016-05-17,31.6355
2016-05-18,31.3842
2016-05-19,31.1137
2016-05-20,31.22
2016-05-23,31.22
2016-05-24,31.7321
2016-05-25,31.8094
2016-05-26,31.5485
2016-05-27,32.1669
2016-05-31,32.1669
2016-06-01,32.1572
2016-06-02,32.3505
2016-06-03,32.1283
2016-06-06,32.2925
2016-06-07,32.2635
2016-06-08,32.6017
2016-06-09,32.7273
2016-06-10,32.5341
2016-06-13,32.4954
2016-06-14,32.4471
2016-06-15,32.3602
2016-06-16,32.2442
2016-06-17,32.0413
2016-06-20,32.2635
2016-06-21,32.3215
2016-06-22,32.5051
2016-06-23,32.766
2016-06-24,31.3069
2016-06-27,30.5726
2016-06-28,30.9977
2016-06-29,31.7804
2016-06-30,32.2925
2016-07-01,32.1766
2016-07-05,32.0799
2016-07-06,32.1862
2016-07-07,32.7467
2016-07-08,33.3651
2016-07-11,33.4037
2016-07-12,33.7226
2016-07-13,34.1574
2016-07-14,34.2347
2016-07-15,34.2927
2016-07-18,33.9642
2016-07-19,34.0028
2016-07-20,34.7178
2016-07-21,34.6889
2016-07-22,34.9401
2016-07-25,34.9014
2016-07-26,35.0174
2016-07-27,34.7951
2016-07-28,35.0174
2016-07-29,34.6405
2016-08-01,34.7662
2016-08-02,34.4086
2016-08-03,34.3217
2016-08-04,34.3024
2016-08-05,34.5246
2016-08-08,34.5536
2016-08-09,34.5439
2016-08-10,35.8484
2016-08-11,36.4668
2016-08-12,36.4522
2016-08-15,36.3748
2016-08-16,36.1132
2016-08-17,36.1035
2016-08-18,36.0454
2016-08-19,35.9485
2016-08-22,35.6967
2016-08-23,36.1229
2016-08-24,36.0938
2016-08-25,36.2779
2016-08-26,36.4426
2016-08-29,36.3554
2016-08-30,36.7235
2016-08-31,36.7429
2016-09-01,36.675
2016-09-02,36.8978
2016-09-06,36.8494
2016-09-07,37.0141
2016-09-08,36.9366
2016-09-09,36.1229
2016-09-12,36.2004
2016-09-13,35.687
2016-09-14,35.7742
2016-09-15,36.2101
2016-09-16,36.2391
2016-09-19,36.3263
2016-09-20,36.3263
2016-09-21,36.5782
2016-09-22,36.5975
2016-09-23,36.491
2016-09-26,36.3554
2016-09-27,36.5201
2016-09-28,36.4619
2016-09-29,36.7138
2016-09-30,36.8397
2016-10-03,36.7719
2016-10-04,36.3844
2016-10-05,35.8323
2016-10-06,35.9388
2016-10-07,35.6579
2016-10-10,35.7354
2016-10-11,35.3964
2016-10-12,35.9388
2016-10-13,35.9485
2016-10-14,35.8904
2016-10-17,35.7935
2016-10-18,35.7645
2016-10-19,35.9195
2016-10-20,35.7742
2016-10-21,35.8129
2016-10-24,36.2004
2016-10-25,35.7645
2016-10-26,36.2101
2016-10-27,35.9873
2016-10-28,35.6773
2016-10-31,36.0648
2016-11-01,35.5998
2016-11-02,35.4254
2016-11-03,35.4448
2016-11-04,35.0089
2016-11-07,35.6773
2016-11-08,36.1229
2016-11-09,36.0357
2016-11-10,35.2123
2016-11-11,35.0767
2016-11-14,35.3285
2016-11-15,32.1125
2016-11-16,32.2578
2016-11-17,33.0424
2016-11-18,33.0134
2016-11-21,33.3911
2016-11-22,34.0596
2016-11-23,34.1596
2016-11-25,34.2956
2016-11-28,33.9944
2016-11-29,34.0624
2016-11-30,33.4309
2016-12-01,33.499
2016-12-02,34.1499
2016-12-05,34.8883
2016-12-06,34.966
2016-12-07,35.1603
2016-12-08,35.0631
2016-12-09,35.0631
2016-12-12,34.9951
2016-12-13,35.2477
2016-12-14,35.2575
2016-12-15,35.2089
2016-12-16,35.2575
2016-12-19,35.1214
2016-12-20,34.9951
2016-12-21,35.238
2016-12-22,35.1992
2016-12-23,35.1894
2016-12-27,35.0826
2016-12-28,34.9077
2016-12-29,34.8494
2016-12-30,34.7037
2017-01-03,33.6738
2017-01-04,33.9653
2017-01-05,34.2373
2017-01-06,33.9264
2017-01-09,33.7127
2017-01-10,33.052
2017-01-11,32.9646
2017-01-12,32.78
2017-01-13,32.9257
2017-01-17,32.5468
2017-01-18,32.3525
2017-01-19,32.2457
2017-01-20,32.1874
2017-01-23,32.1388
2017-01-24,32.4011
2017-01-25,32.6343
2017-01-26,32.644
2017-01-27,32.7411
2017-01-30,32.576
2017-01-31,32.8772
2017-02-01,32.2165
2017-02-02,32.8577
2017-02-03,33.052
2017-02-06,32.5274
2017-02-07,34.1693
2017-02-08,34.4996
2017-02-09,34.4025
2017-02-10,34.4996
2017-02-13,34.3857
2017-02-14,34.7267
2017-02-15,34.7949
2017-02-16,34.7559
2017-02-17,34.8339
2017-02-21,35.0482
2017-02-22,34.9995
2017-02-23,34.8728
2017-02-24,34.8923
2017-02-27,34.9508
2017-02-28,34.8241
2017-03-01,34.7754
2017-03-02,34.98
2017-03-03,35.2431
2017-03-06,35.1164
2017-03-07,35.0872
2017-03-08,35.2529
2017-03-09,35.3795
2017-03-10,35.5841
2017-03-13,35.5744
2017-03-14,35.5647
2017-03-15,35.818
2017-03-16,36.3052
2017-03-17,36.5488
2017-03-20,36.1103
2017-03-21,35.6426
2017-03-22,35.6816
2017-03-23,35.6621
2017-03-24,35.6329
2017-03-27,35.5549
2017-03-28,35.8765
2017-03-29,35.9447
2017-03-30,36.1785
2017-03-31,35.9252
2017-04-03,35.7888
2017-04-04,35.5549
2017-04-05,35.477
2017-04-06,35.7108
2017-04-07,35.5257
2017-04-10,35.5062
2017-04-11,35.5647
2017-04-12,35.399
2017-04-13,35.1846
2017-04-17,35.5257
2017-04-18,35.4672
2017-04-19,35.3405
2017-04-20,35.6621
2017-04-21,35.779
2017-04-24,36.0226
2017-04-25,35.818
2017-04-26,35.7108
2017-04-27,35.6718
2017-04-28,35.5841
2017-05-01,35.5744
2017-05-02,35.6231
2017-05-03,35.5744
2017-05-04,35.5159
2017-05-05,35.779
2017-05-08,35.3503
2017-05-09,36.4416
2017-05-10,36.3734
2017-05-11,36.1688
2017-05-12,35.8862
2017-05-15,36.192
2017-05-16,36.0846
2017-05-17,35.684
2017-05-18,35.7914
2017-05-19,35.7621
2017-05-22,36.0259
2017-05-23,35.8794
2017-05-24,36.1041
2017-05-25,36.192
2017-05-26,36.1823
2017-05-30,36.1823
2017-05-31,36.407
2017-06-01,37.775
2017-06-02,37.902
2017-06-05,38.029
2017-06-06,38.1365
2017-06-07,38.625
2017-06-08,38.6641
2017-06-09,38.6348
2017-06-12,38.9084
2017-06-13,39.1136
2017-06-14,39.4947
2017-06-15,39.6608
2017-06-16,39.9051
2017-06-19,40.0809
2017-06-20,40.0809
2017-06-21,40.1493
2017-06-22,40.0516
2017-06-23,40.5109
2017-06-26,40.5304
2017-06-27,40.0614
2017-06-28,40.1884
2017-06-29,39.7585
2017-06-30,40.0418
2017-07-03,40.1298
2017-07-05,39.993
2017-07-06,38.967
2017-07-07,39.3188
2017-07-10,39.1722
2017-07-11,38.8107
2017-07-12,39.436
2017-07-13,39.2992
2017-07-14,39.4654
2017-07-17,39.778
2017-07-18,39.5044
2017-07-19,39.7878
2017-07-20,39.7487
2017-07-21,39.6217
2017-07-24,39.5631
2017-07-25,39.3481
2017-07-26,38.967
2017-07-27,38.8986
2017-07-28,38.5371
2017-07-31,38.9475
2017-08-01,39.436
2017-08-02,39.2504
2017-08-03,39.1429
2017-08-04,38.9963
2017-08-07,38.8889
2017-08-08,39.182
2017-08-09,39.1429
2017-08-10,38.4492
2017-08-11,38.4492
2017-08-14,38.4521
2017-08-15,38.4227
2017-08-16,38.5501
2017-08-17,38.119
2017-08-18,38.2856
2017-08-21,38.217
2017-08-22,38.9126
2017-08-23,38.6676
2017-08-24,39.0007
2017-08-25,39.1281
2017-08-28,39.4514
2017-08-29,39.275
2017-08-30,39.2261
2017-08-31,39.8628
2017-09-01,39.9216
2017-09-05,39.4906
2017-09-06,39.5298
2017-09-07,39.5004
2017-09-08,39.853
2017-09-11,40.1665
2017-09-12,40.1078
2017-09-13,40.2449
2017-09-14,39.6963
2017-09-15,39.6473
2017-09-18,39.5689
2017-09-19,39.4416
2017-09-20,39.6277
2017-09-21,39.9706
2017-09-22,40.1078
2017-09-25,39.9608
2017-09-26,39.6767
2017-09-27,39.4906
2017-09-28,39.6277
2017-09-29,39.7845
2017-10-02,40.1567
2017-10-03,40.1176
2017-10-04,40.2939
2017-10-05,40.3233
2017-10-06,40.578
2017-10-09,40.578
2017-10-10,40.6956
2017-10-11,41.1168
2017-10-12,41.3128
2017-10-13,41.4695
2017-10-16,41.6654
2017-10-17,42.0965
2017-10-18,42.0867
2017-10-19,41.9593
2017-10-20,42.41
2017-10-23,41.8614
2017-10-24,41.8908
2017-10-25,42.0818
2017-10-26,42.4198
2017-10-27,42.7431
2017-10-30,42.5765
2017-10-31,42.8019
2017-11-01,42.3806
2017-11-02,42.6157
2017-11-03,42.8606
2017-11-06,42.5667
2017-11-07,42.3708
2017-11-08,42.4492
2017-11-09,41.881
2017-11-10,41.8124
2017-11-13,41.9789
2017-11-14,39.2065
2017-11-15,39.0203
2017-11-16,39.9118
2017-11-17,39.9902
2017-11-20,40.3331
2017-11-21,40.4213
2017-11-22,40.2351
2017-11-24,40.5838
2017-11-27,40.6329
2017-11-28,41.5169
2017-11-29,41.8214
2017-11-30,41.841
2017-12-01,42.3026
2017-12-04,41.9982
2017-12-05,41.6642
2017-12-06,41.7133
2017-12-07,41.7821
2017-12-08,41.9294
2017-12-11,42.1553
2017-12-12,41.5169
2017-12-13,41.3204
2017-12-14,41.2517
2017-12-15,41.7035
2017-12-18,41.733
2017-12-19,42.1357
2017-12-20,42.1553
2017-12-21,42.116
2017-12-22,42.0374
2017-12-26,41.9098
2017-12-27,42.1651
2017-12-28,42.4205
2017-12-29,41.9785
2018-01-02,42.5089
2018-01-03,42.4598
2018-01-04,42.116
2018-01-05,41.9589
2018-01-08,42.4107
2018-01-09,42.7937
2018-01-10,42.8821
2018-01-11,43.2455
2018-01-12,43.2848
2018-01-16,43.2161
2018-01-17,43.825
2018-01-18,43.7366
2018-01-19,44.5715
2018-01-22,44.6304
2018-01-23,44.7679
2018-01-24,44.6697
2018-01-25,44.9742
2018-01-26,45.1706
2018-01-29,44.7483
2018-01-30,44.7188
2018-01-31,44.9938
2018-02-01,44.8956
2018-02-02,44.4929
2018-02-05,43.3045
2018-02-06,41.7919
2018-02-07,41.2222
2018-02-08,39.8275
2018-02-09,40.2204
2018-02-12,40.0829
2018-02-13,40.2749
2018-02-14,40.5211
2018-02-15,41.8603
2018-02-16,41.3384
2018-02-20,40.787
2018-02-21,40.8854
2018-02-22,40.6983
2018-02-23,41.4566
2018-02-26,41.4369
2018-02-27,41.1316
2018-02-28,41.0725
2018-03-01,40.2552
2018-03-02,40.2454
2018-03-05,40.3537
2018-03-06,40.4719
2018-03-07,40.5309
2018-03-08,40.4719
2018-03-09,41.2695
2018-03-12,41.2695
2018-03-13,40.6885
2018-03-14,40.3832
2018-03-15,40.3734
2018-03-16,40.4423
2018-03-19,40.2158
2018-03-20,40.4226
2018-03-21,40.1863
2018-03-22,39.1819
2018-03-23,38.4729
2018-03-26,39.2607
2018-03-27,38.9948
2018-03-28,39.0736
2018-03-29,38.9554
2018-04-02,37.5965
2018-04-03,38.0987
2018-04-04,38.3252
2018-04-05,38.8372
2018-04-06,37.9608
2018-04-09,37.7344
2018-04-10,37.7147
2018-04-11,37.2223
2018-04-12,37.2321
2018-04-13,36.8678
2018-04-16,37.2026
2018-04-17,37.5965
2018-04-18,37.4291
2018-04-19,36.9269
2018-04-20,37.1731
2018-04-23,37.1632
2018-04-24,37.1238
2018-04-25,37.5276
2018-04-26,37.5965
2018-04-27,36.9269
2018-04-30,36.8186
2018-05-01,36.858
2018-05-02,36.405
2018-05-03,36.0505
2018-05-04,36.661
2018-05-07,36.4838
2018-05-08,38.6501
2018-05-09,36.8973
2018-05-10,37.3799
2018-05-11,37.4192
2018-05-14,37.4192
2018-05-15,37.5669
2018-05-16,37.6607
2018-05-17,37.72
2018-05-18,37.5225
2018-05-21,38.115
2018-05-22,38.4606
2018-05-23,38.3816
2018-05-24,38.3026
2018-05-25,38.2433
2018-05-29,38.0261
2018-05-30,38.6087
2018-05-31,38.3322
2018-06-01,38.0853
2018-06-04,38.1742
2018-06-05,38.6482
2018-06-06,38.9543
2018-06-07,38.8259
2018-06-08,38.5396
2018-06-11,38.352
2018-06-12,38.8555
2018-06-13,39.2209
2018-06-14,39.2604
2018-06-15,39.3196
2018-06-18,38.8753
2018-06-19,38.0063
2018-06-20,37.878
2018-06-21,37.404
2018-06-22,37.7694
2018-06-25,37.6904
2018-06-26,37.9372
2018-06-27,36.9103
2018-06-28,36.7326
2018-06-29,36.6338
2018-07-02,36.7227
2018-07-03,37.0485
2018-07-05,37.5719
2018-07-06,37.7299
2018-07-09,37.9866
2018-07-10,38.1446
2018-07-11,38.3421
2018-07-12,38.3421
2018-07-13,38.1742
2018-07-16,38.1248
2018-07-17,38.0063
2018-07-18,38.4902
2018-07-19,39.0037
2018-07-20,39.1123
2018-07-23,39.0135
2018-07-24,38.9938
2018-07-25,40.1491
2018-07-26,40.1985
2018-07-27,39.8726
2018-07-30,39.2406
2018-07-31,39.7047
2018-08-01,39.5467
2018-08-02,38.3914
2018-08-03,37.8484
2018-08-06,37.7694
2018-08-07,40.4947
2018-08-08,39.6751
2018-08-09,38.7173
2018-08-10,39.4974
2018-08-13,39.527
2018-08-14,39.9911
2018-08-15,40.2139
2018-08-16,40.4416
2018-08-17,40.1941
2018-08-20,40.4317
2018-08-21,40.5901
2018-08-22,40.7386
2018-08-23,40.4515
2018-08-24,40.2535
2018-08-27,40.3624
2018-08-28,40.798
2018-08-29,40.7782
2018-08-30,40.5406
2018-08-31,40.6693
2018-09-04,40.402
2018-09-05,40.5109
2018-09-06,40.1545
2018-09-07,39.9763
2018-09-10,40.501
2018-09-11,40.9366
2018-09-12,41.3326
2018-09-13,41.5504
2018-09-14,41.7583
2018-09-17,41.5702
2018-09-18,42.382
2018-09-19,42.4216
2018-09-20,42.6097
2018-09-21,42.5404
2018-09-24,42.3523
2018-09-25,42.6394
2018-09-26,42.7384
2018-09-27,42.5206
2018-09-28,42.5899
2018-10-01,42.1444
2018-10-02,41.8474
2018-10-03,41.5801
2018-10-04,41.1148
2018-10-05,40.8772
2018-10-08,41.1643
2018-10-09,41.2435
2018-10-10,39.9268
2018-10-11,38.9566
2018-10-12,39.8872
2018-10-15,39.7981
2018-10-16,40.5505
2018-10-17,39.8377
2018-10-18,38.7982
2018-10-19,37.8676
2018-10-22,37.1251
2018-10-23,36.3826
2018-10-24,34.6897
2018-10-25,34.6698
2018-10-26,34.2045
2018-10-29,34.3629
2018-10-30,34.947
2018-10-31,35.5609
2018-11-01,36.1846
2018-11-02,35.4025
2018-11-05,35.3827
2018-11-06,35.0955
2018-11-07,35.6698
2018-11-08,35.8678
2018-11-09,35.2441
2018-11-12,34.2441
2018-11-13,35.0857
2018-11-14,35.056
2018-11-15,36.3727
2018-11-16,36.5212
2018-11-19,35.4718
2018-11-20,35.5807
2018-11-21,36.5509
2018-11-23,36.1537
2018-11-26,36.8884
2018-11-27,36.8686
2018-11-28,37.8417
2018-11-29,37.5736
2018-11-30,37.792
2018-12-03,38.1495
2018-12-04,37.236
2018-12-06,37.3849
2018-12-07,36.2033
2018-12-10,35.3096
2018-12-11,30.9406
2018-12-12,31.8839
2018-12-13,32.4797
2018-12-14,31.8541
2018-12-17,30.9406
2018-12-18,30.2356
2018-12-19,29.5505
2018-12-20,28.766
2018-12-21,27.7929
2018-12-24,27.3064
2018-12-26,28.5674
2018-12-27,28.5277
2018-12-28,28.4483
2018-12-31,28.766
2019-01-02,29.2029
2019-01-03,28.4781
2019-01-04,28.9845
2019-01-07,29.5108
2019-01-08,29.6398
2019-01-09,30.0569
2019-01-10,30.7122
2019-01-11,30.9406
2019-01-14,30.6527
2019-01-15,30.9406
2019-01-16,30.7817
2019-01-17,31.2186
2019-01-18,31.6655
2019-01-22,31.4669
2019-01-23,31.6754
2019-01-24,31.7648
2019-01-25,32.2811
2019-01-28,31.7747
2019-01-29,31.8144
2019-01-30,32.3705
2019-01-31,32.718
2019-02-01,33.0258
2019-02-04,33.572
2019-02-05,33.006
2019-02-06,33.1152
2019-02-07,33.1351
2019-02-08,31.7548
2019-02-11,31.1889
2019-02-12,30.6129
2019-02-13,31.1411
2019-02-14,31.0913
2019-02-15,31.6892
2019-02-19,32.4864
2019-02-20,32.4565
2019-02-21,32.6359
2019-02-22,32.1575
2019-02-25,32.0778
2019-02-26,31.5297
2019-02-27,31.2507
2019-02-28,30.1944
2019-03-01,30.4236
2019-03-04,30.4834
2019-03-05,30.1346
2019-03-06,29.7161
2019-03-07,29.8556
2019-03-08,29.5965
2019-03-11,30.0449
2019-03-12,30.2044
2019-03-13,29.9154
2019-03-14,29.7559
2019-03-15,29.7659
2019-03-18,29.8257
2019-03-19,30.2243
2019-03-20,29.9951
2019-03-21,29.7958
2019-03-22,28.8092
2019-03-25,28.9587
2019-03-26,29.3673
2019-03-27,29.4371
2019-03-28,29.6563
2019-03-29,29.447
2019-04-01,29.8755
2019-04-02,29.7559
2019-04-03,29.9652
2019-04-04,29.746
2019-04-05,30.4435
2019-04-08,30.9418
2019-04-09,29.9453
2019-04-10,30.324
2019-04-11,30.8621
2019-04-12,31.1212
2019-04-15,30.9119
2019-04-16,30.9119
2019-04-17,31.161
2019-04-18,31.5397
2019-04-22,31.1511
2019-04-23,31.0016
2019-04-24,31.2607
2019-04-25,30.6927
2019-04-26,30.9318
2019-04-29,31.0215
2019-04-30,30.9717
2019-05-01,30.7226
2019-05-02,30.6129
2019-05-03,31.0713
2019-05-06,31.2009
2019-05-07,29.4271
2019-05-08,30.3837
2019-05-09,31.2407
2019-05-10,31.2109
2019-05-13,31.0913
2019-05-14,31.45
2019-05-15,31.87
2019-05-16,31.55
2019-05-17,31.64
2019-05-20,31.7
2019-05-21,32.25
2019-05-22,31.82
2019-05-23,31.21
2019-05-24,31.56
2019-05-28,31.73
2019-05-29,32.74
2019-05-30,34.89
2019-05-31,34.79
2019-06-03,34.5
2019-06-04,35.26
2019-06-05,35.43
2019-06-06,35.18
2019-06-07,35.56
2019-06-10,34.73
2019-06-11,35.06
2019-06-12,34.93
2019-06-13,34.475
2019-06-14,34.485
2019-06-17,34.805
2019-06-18,34.885
2019-06-19,34.86
2019-06-20,34.72
2019-06-21,34.775
2019-06-24,34.365
2019-06-25,34.425
2019-06-26,34.14
2019-06-27,35.18
2019-06-28,35.84
2019-07-01,35.62
2019-07-02,35.77
2019-07-03,35.91
2019-07-04,35.91
2019-07-05,36.26
2019-07-08,36.11
2019-07-09,36.08
2019-07-10,36.01
2019-07-11,36.48
2019-07-12,36.55
2019-07-15,36.265
2019-07-16,35.905
2019-07-17,35.86
2019-07-18,36.175
2019-07-19,35.785
2019-07-22,35.575
2019-07-23,36.35
2019-07-24,36.665
2019-07-25,36.615
2019-07-26,37.055
2019-07-29,36.68
2019-07-30,36.92
2019-07-31,36.275
2019-08-01,35.76
2019-08-02,35.45
2019-08-05,34.785
2019-08-06,36.695
2019-08-07,37.6
2019-08-08,37.61
2019-08-09,38.06
2019-08-12,38
2019-08-13,37.935
2019-08-14,37.24
2019-08-15,37.14
2019-08-16,37.115
2019-08-19,40.28
2019-08-20,39.46
2019-08-21,39.62
2019-08-22,39.985
2019-08-23,39.49
2019-08-26,41.195
2019-08-27,40.075
2019-08-28,39.98
2019-08-29,40.605
2019-08-30,40.855
2019-09-02,40.87
2019-09-03,41.165
2019-09-04,41.575
2019-09-05,41.945
2019-09-06,42.01
2019-09-09,41.975
2019-09-10,42.115
2019-09-11,42.7
2019-09-12,43.155
2019-09-13,42.765
2019-09-16,42.95
2019-09-17,42.745
2019-09-18,42.735
2019-09-19,42.45
2019-09-20,42.34
2019-09-23,42.71
2019-09-24,42.735
2019-09-25,43.035
2019-09-26,42.975
2019-09-27,43.07
2019-09-30,43.545
2019-10-01,42.695
2019-10-02,42.27
2019-10-03,42.235
2019-10-04,42.785
2019-10-07,44.01
2019-10-08,42.67
2019-10-09,42.76
2019-10-10,43.375
2019-10-11,44.15
2019-10-14,43.925
2019-10-15,44.095
2019-10-16,43.79
2019-10-17,44.225
2019-10-18,44.555
2019-10-21,44.38
2019-10-22,44.145
2019-10-23,44.325
2019-10-24,44.7
2019-10-25,44.245
2019-10-28,44.185
2019-10-29,44.34
2019-10-30,43.895
2019-10-31,43.79
2019-11-01,43.275
2019-11-04,42.945
2019-11-05,43.525
2019-11-06,43.07
2019-11-07,43.215
2019-11-08,43.035
2019-11-11,42.855
2019-11-12,42.78
2019-11-13,43.345
2019-11-14,43.38
2019-11-15,43.61
2019-11-18,43.775
2019-11-19,45.095
2019-11-20,43.755
2019-11-21,42.43
2019-11-22,43.135
2019-11-25,44.465
