date,close
2014-06-13,13.64
2014-06-16,14.38
2014-06-17,14.6
2014-06-18,14.66
2014-06-19,14.65
2014-06-20,14.69
2014-06-23,14.53
2014-06-24,14.14
2014-06-25,14.37
2014-06-26,14.24
2014-06-27,14.29
2014-06-30,14.3
2014-07-01,14.48
2014-07-02,14.2
2014-07-03,14.68
2014-07-07,14.29
2014-07-08,14.06
2014-07-09,14.15
2014-07-10,14.12
2014-07-11,14.02
2014-07-14,14.14
2014-07-15,13.87
2014-07-16,13.68
2014-07-17,13.56
2014-07-18,13.66
2014-07-21,13.76
2014-07-22,13.44
2014-07-23,12.53
2014-07-24,12.73
2014-07-25,12.23
2014-07-28,12.13
2014-07-29,12.09
2014-07-30,11.96
2014-07-31,11.51
2014-08-01,11.48
2014-08-04,11.57
2014-08-05,11.49
2014-08-06,11.66
2014-08-07,11.77
2014-08-08,11.8
2014-08-11,11.99
2014-08-12,11.82
2014-08-13,11.9
2014-08-14,11.79
2014-08-15,11.83
2014-08-18,11.89
2014-08-19,11.86
2014-08-20,11.94
2014-08-21,11.89
2014-08-22,11.84
2014-08-25,11.87
2014-08-26,12.22
2014-08-27,12.15
2014-08-28,12.17
2014-08-29,12.41
2014-09-02,12.3
2014-09-03,11.97
2014-09-04,12.15
2014-09-05,12.27
2014-09-08,12.59
2014-09-09,12.51
2014-09-10,12.46
2014-09-11,12.86
2014-09-12,13.07
2014-09-15,12.43
2014-09-16,12.4
2014-09-17,12.63
2014-09-18,12.93
2014-09-19,12.92
2014-09-22,12.65
2014-09-23,12.465
2014-09-24,12.44
2014-09-25,12.34
2014-09-26,12.76
2014-09-29,12.4
2014-09-30,12.48
2014-10-01,11.925
2014-10-02,12.05
2014-10-03,12.16
2014-10-06,11.77
2014-10-07,11.66
2014-10-08,11.81
2014-10-09,11.28
2014-10-10,10.23
2014-10-13,10.45
2014-10-14,10.38
2014-10-15,10.56
2014-10-16,10.87
2014-10-17,11.06
2014-10-20,10.97
2014-10-21,10.08
2014-10-22,10.28
2014-10-23,10.42
2014-10-24,10.44
2014-10-27,10.65
2014-10-28,10.84
2014-10-29,10.91
2014-10-30,10.92
2014-10-31,11.45
2014-11-03,11.36
2014-11-04,11.06
2014-11-05,11.2
2014-11-06,11.32
2014-11-07,11.09
2014-11-10,11.275
2014-11-11,11.38
2014-11-12,11.47
2014-11-13,11.32
2014-11-14,11.57
2014-11-17,11.24
2014-11-18,11.67
2014-11-19,11.3
2014-11-20,11.55
2014-11-21,11.555
2014-11-24,11.76
2014-11-25,11.66
2014-11-26,11.855
2014-11-28,11.85
2014-12-01,11.41
2014-12-02,11.67
2014-12-03,11.88
2014-12-04,11.72
2014-12-05,11.85
2014-12-08,11.58
2014-12-09,11.99
2014-12-10,11.7
2014-12-11,11.51
2014-12-12,11.25
2014-12-15,11.21
2014-12-16,11.23
2014-12-17,11.63
2014-12-18,11.81
2014-12-19,11.45
2014-12-22,11.69
2014-12-23,11.555
2014-12-24,11.64
2014-12-26,11.6
2014-12-29,11.42
2014-12-30,11.34
2014-12-31,11.09
2015-01-02,11.46
2015-01-05,11.14
2015-01-06,10.84
2015-01-07,10.92
2015-01-08,11.02
2015-01-09,11.27
2015-01-12,11.13
2015-01-13,11.06
2015-01-14,10.72
2015-01-15,10.13
2015-01-16,10.28
2015-01-20,10.27
2015-01-21,10.19
2015-01-22,10.55
2015-01-23,10.63
2015-01-26,10.51
2015-01-27,11.38
2015-01-28,11.23
2015-01-29,11.31
2015-01-30,11.25
2015-02-02,11.26
2015-02-03,11.48
2015-02-04,11.49
2015-02-05,11.58
2015-02-06,11.635
2015-02-09,11.68
2015-02-10,11.79
2015-02-11,11.89
2015-02-12,12.06
2015-02-13,12.12
2015-02-17,12.09
2015-02-18,12.04
2015-02-19,12.02
2015-02-20,12.06
2015-02-23,12.07
2015-02-24,12.12
2015-02-25,12.07
2015-02-26,12.25
2015-02-27,12
2015-03-02,12.33
2015-03-03,12.14
2015-03-04,12.2
2015-03-05,12.25
2015-03-06,12.25
2015-03-09,12.39
2015-03-10,12.3
2015-03-11,12.39
2015-03-12,12.405
2015-03-13,12.43
2015-03-16,12.42
2015-03-17,12.54
2015-03-18,12.57
2015-03-19,12.56
2015-03-20,12.74
2015-03-23,12.63
2015-03-24,12.75
2015-03-25,12.48
2015-03-26,12.56
2015-03-27,12.71
2015-03-30,12.61
2015-03-31,12.575
2015-04-01,12.63
2015-04-02,12.61
2015-04-06,12.57
2015-04-07,12.9
2015-04-08,13.545
2015-04-09,13.36
2015-04-10,13.73
2015-04-13,13.68
2015-04-14,13.2
2015-04-15,13.14
2015-04-16,13
2015-04-17,12.91
2015-04-20,12.77
2015-04-21,14.18
2015-04-22,14.4
2015-04-23,14.295
2015-04-24,13.99
2015-04-27,14.1
2015-04-28,14.22
2015-04-29,14.12
2015-04-30,13.84
2015-05-01,14.16
2015-05-04,13.96
2015-05-05,13.75
2015-05-06,13.75
2015-05-07,13.91
2015-05-08,13.92
2015-05-11,14.1
2015-05-12,14.07
2015-05-13,14.01
2015-05-14,14.28
2015-05-15,14.17
2015-05-18,14.49
2015-05-19,14.32
2015-05-20,14.2
2015-05-21,14.49
2015-05-22,14.4
2015-05-26,14.4
2015-05-27,14.91
2015-05-28,14.92
2015-05-29,15.29
2015-06-01,15.23
2015-06-02,15.29
2015-06-03,15.3
2015-06-04,15.26
2015-06-05,15.2
2015-06-08,14.93
2015-06-09,14.91
2015-06-10,15.22
2015-06-11,15.41
2015-06-12,15.28
2015-06-15,15.17
2015-06-16,15.18
2015-06-17,15
2015-06-18,15.06
2015-06-19,14.98
2015-06-22,15.01
2015-06-23,14.94
2015-06-24,14.85
2015-06-25,15.33
2015-06-26,15.21
2015-06-29,14.6
2015-06-30,14.49
2015-07-01,14.31
2015-07-02,14.47
2015-07-06,13.89
2015-07-07,13.72
2015-07-08,13.41
2015-07-09,13.12
2015-07-10,13.35
2015-07-13,13.5
2015-07-14,13.44
2015-07-15,13.08
2015-07-16,12.88
2015-07-17,13.03
2015-07-20,12.98
2015-07-21,12.89
2015-07-22,13.21
2015-07-23,13.36
2015-07-24,13.11
2015-07-27,13.15
2015-07-28,13.53
2015-07-29,13.33
2015-07-30,13.13
2015-07-31,13.09
2015-08-03,13.06
2015-08-04,13.06
2015-08-05,13.53
2015-08-06,13.34
2015-08-07,13.48
2015-08-10,13.95
2015-08-11,13.6
2015-08-12,13.51
2015-08-13,13.41
2015-08-14,13.45
2015-08-17,13.64
2015-08-18,13.06
2015-08-19,12.75
2015-08-20,12.45
2015-08-21,12.84
2015-08-24,12.49
2015-08-25,12.71
2015-08-26,13.11
2015-08-27,13.18
2015-08-28,13.45
2015-08-31,13.43
2015-09-01,13.24
2015-09-02,13.56
2015-09-03,13.59
2015-09-04,13.51
2015-09-08,13.91
2015-09-09,13.68
2015-09-10,13.62
2015-09-11,13.65
2015-09-14,13.65
2015-09-15,13.19
2015-09-16,11.705
2015-09-17,12.06
2015-09-18,11.64
2015-09-21,11.33
2015-09-22,10.81
2015-09-23,10.65
2015-09-24,10.65
2015-09-25,11.25
2015-09-28,11.23
2015-09-29,11.37
2015-09-30,11.8
2015-10-01,11.75
2015-10-02,11.94
2015-10-05,11.95
2015-10-06,12.19
2015-10-07,12.65
2015-10-08,12.86
2015-10-09,12.65
2015-10-12,12.67
2015-10-13,12.91
2015-10-14,13.3
2015-10-15,13.62
2015-10-16,13.77
2015-10-19,13.89
2015-10-20,10
2015-10-21,10.39
2015-10-22,10.53
2015-10-23,10.65
2015-10-26,10.24
2015-10-27,10.53
2015-10-28,10.39
2015-10-29,10.18
2015-10-30,10.32
2015-11-02,10.54
2015-11-03,10.79
2015-11-04,10.71
2015-11-05,10.77
2015-11-06,11.11
2015-11-09,11.17
2015-11-10,11
2015-11-11,11.11
2015-11-12,10.77
2015-11-13,10.73
2015-11-16,10.64
2015-11-17,10.77
2015-11-18,10.935
2015-11-19,11.05
2015-11-20,11.12
2015-11-23,11.19
2015-11-24,11.49
2015-11-25,11.64
2015-11-27,11.67
2015-11-30,11.93
2015-12-01,12.01
2015-12-02,11.77
2015-12-03,11.74
2015-12-04,11.92
2015-12-07,11.71
2015-12-08,11.61
2015-12-09,11.45
2015-12-10,11.63
2015-12-11,11.46
2015-12-14,11.47
2015-12-15,11.35
2015-12-16,11.74
2015-12-17,11.68
2015-12-18,11.61
2015-12-21,11.98
2015-12-22,11.93
2015-12-23,11.84
2015-12-24,11.84
2015-12-28,11.88
2015-12-29,11.97
2015-12-30,11.87
2015-12-31,11.59
2016-01-04,11.59
2016-01-05,11.63
2016-01-06,11.48
2016-01-07,11.12
2016-01-08,10.95
2016-01-11,11.11
2016-01-12,11.3
2016-01-13,11.12
2016-01-14,11.21
2016-01-15,10.98
2016-01-19,10.89
2016-01-20,11
2016-01-21,11.19
2016-01-22,11.4
2016-01-25,11.2
2016-01-26,11.95
2016-01-27,12.005
2016-01-28,11.91
2016-01-29,12.24
2016-02-01,12.31
2016-02-02,11.91
2016-02-03,12.14
2016-02-04,12.35
2016-02-05,12
2016-02-08,11.94
2016-02-09,11.76
2016-02-10,11.74
2016-02-11,11.87
2016-02-12,11.97
2016-02-16,12.27
2016-02-17,12.42
2016-02-18,12.44
2016-02-19,12.41
2016-02-22,12.59
2016-02-23,12.61
2016-02-24,12.81
2016-02-25,12.97
2016-02-26,12.98
2016-02-29,13.03
2016-03-01,13.22
2016-03-02,13.2
2016-03-03,13.48
2016-03-04,13.27
2016-03-07,13.06
2016-03-08,12.99
2016-03-09,13.07
2016-03-10,13.13
2016-03-11,13.25
2016-03-14,12.93
2016-03-15,12.84
2016-03-16,13.11
2016-03-17,13.18
2016-03-18,13.44
2016-03-21,13.61
2016-03-22,13.74
2016-03-23,13.51
2016-03-24,13.51
2016-03-28,13.48
2016-03-29,13.87
2016-03-30,13.83
2016-03-31,13.75
2016-04-01,13.85
2016-04-04,13.58
2016-04-05,13.45
2016-04-06,13.75
2016-04-07,13.57
2016-04-08,13.49
2016-04-11,13.51
2016-04-12,13.59
2016-04-13,13.92
2016-04-14,13.83
2016-04-15,13.67
2016-04-18,13.77
2016-04-19,12.54
2016-04-20,12.27
2016-04-21,11.98
2016-04-22,11.93
2016-04-25,11.98
2016-04-26,12.14
2016-04-27,12.35
2016-04-28,11.8
2016-04-29,11.62
2016-05-02,11.71
2016-05-03,11.555
2016-05-04,11.41
2016-05-05,11.215
2016-05-06,11.4
2016-05-09,11.39
2016-05-10,11.48
2016-05-11,11.45
2016-05-12,11.21
2016-05-13,11.33
2016-05-16,11.42
2016-05-17,11.25
2016-05-18,11.5
2016-05-19,11.23
2016-05-20,11.65
2016-05-23,11.74
2016-05-24,12.07
2016-05-25,11.79
2016-05-26,11.87
2016-05-27,11.96
2016-05-31,12.1
2016-06-01,12.16
2016-06-02,12.15
2016-06-03,12.28
2016-06-06,12.31
2016-06-07,12.35
2016-06-08,12.33
2016-06-09,12.32
2016-06-10,12.145
2016-06-13,12.01
2016-06-14,12.16
2016-06-15,12.08
2016-06-16,12.1
2016-06-17,11.91
2016-06-20,12.05
2016-06-21,12.15
2016-06-22,11.97
2016-06-23,12.27
2016-06-24,11.77
2016-06-27,11.36
2016-06-28,11.44
2016-06-29,11.63
2016-06-30,12.08
2016-07-01,11.95
2016-07-05,11.69
2016-07-06,11.69
2016-07-07,11.72
2016-07-08,12.11
2016-07-11,12.19
2016-07-12,12.41
2016-07-13,12.62
2016-07-14,12.62
2016-07-15,12.75
2016-07-18,12.81
2016-07-19,13.25
2016-07-20,13.56
2016-07-21,13.4
2016-07-22,13.56
2016-07-25,13.72
2016-07-26,14.04
2016-07-27,13.86
2016-07-28,13.69
2016-07-29,13.52
2016-08-01,13.68
2016-08-02,13.16
2016-08-03,13.43
2016-08-04,13.46
2016-08-05,13.67
2016-08-08,13.59
2016-08-09,13.8
2016-08-10,13.59
2016-08-11,13.56
2016-08-12,13.6
2016-08-15,13.72
2016-08-16,13.55
2016-08-17,13.49
2016-08-18,13.56
2016-08-19,13.84
2016-08-22,13.93
2016-08-23,13.78
2016-08-24,13.71
2016-08-25,13.9
2016-08-26,13.91
2016-08-29,13.79
2016-08-30,13.92
2016-08-31,13.82
2016-09-01,14.4
2016-09-02,14.36
2016-09-06,14.42
2016-09-07,13.6
2016-09-08,13.45
2016-09-09,13.1
2016-09-12,13.2
2016-09-13,12.9
2016-09-14,12.74
2016-09-15,12.93
2016-09-16,13.03
2016-09-19,12.96
2016-09-20,12.66
2016-09-21,12.53
2016-09-22,12.72
2016-09-23,12.54
2016-09-26,12.35
2016-09-27,12.47
2016-09-28,12.53
2016-09-29,12.39
2016-09-30,12.5
2016-10-03,12.43
2016-10-04,12.425
2016-10-05,12.61
2016-10-06,12.51
2016-10-07,12.42
2016-10-10,12.32
2016-10-11,11.99
2016-10-12,11.84
2016-10-13,11.77
2016-10-14,11.73
2016-10-17,11.67
2016-10-18,11.7
2016-10-19,11.7
2016-10-20,11.69
2016-10-21,11.62
2016-10-24,11.99
2016-10-25,12.51
2016-10-26,12.65
2016-10-27,12.01
2016-10-28,12.03
2016-10-31,12.19
2016-11-01,12.15
2016-11-02,11.93
2016-11-03,11.9
2016-11-04,11.93
2016-11-07,12.2
2016-11-08,12.31
2016-11-09,12.59
2016-11-10,12.49
2016-11-11,12.91
2016-11-14,12.97
2016-11-15,12.98
2016-11-16,13.22
2016-11-17,13.39
2016-11-18,13.48
2016-11-21,13.32
2016-11-22,13.55
2016-11-23,13.61
2016-11-25,13.71
2016-11-28,13.54
2016-11-29,13.4
2016-11-30,13.15
2016-12-01,12.67
2016-12-02,12.76
2016-12-05,12.98
2016-12-06,13.46
2016-12-07,13.76
2016-12-08,14.21
2016-12-09,14.27
2016-12-12,14.21
2016-12-13,14.25
2016-12-14,14.01
2016-12-15,14.04
2016-12-16,13.9
2016-12-19,14.19
2016-12-20,14.18
2016-12-21,14.05
2016-12-22,13.94
2016-12-23,14.23
2016-12-27,14.24
2016-12-28,14.01
2016-12-29,14.02
2016-12-30,13.77
2017-01-03,14.16
2017-01-04,14.05
2017-01-05,13.89
2017-01-06,13.8
2017-01-09,13.9
2017-01-10,14.02
2017-01-11,14.01
2017-01-12,13.88
2017-01-13,13.94
2017-01-17,13.78
2017-01-18,13.65
2017-01-19,13.43
2017-01-20,13.5
2017-01-23,13.35
2017-01-24,13.62
2017-01-25,13.97
2017-01-26,13.77
2017-01-27,13.89
2017-01-30,13.98
2017-01-31,12.98
2017-02-01,12.8
2017-02-02,12.67
2017-02-03,12.69
2017-02-06,12.55
2017-02-07,12.57
2017-02-08,12.4
2017-02-09,12.65
2017-02-10,12.79
2017-02-13,12.8
2017-02-14,12.7
2017-02-15,12.69
2017-02-16,12.62
2017-02-17,12.6
2017-02-21,12.67
2017-02-22,12.51
2017-02-23,12.56
2017-02-24,12.57
2017-02-27,12.76
2017-02-28,12.56
2017-03-01,12.95
2017-03-02,12.85
2017-03-03,12.81
2017-03-06,12.8
2017-03-07,13.1
2017-03-08,13.14
2017-03-09,13.1
2017-03-10,13.13
2017-03-13,13.1
2017-03-14,13.06
2017-03-15,13.14
2017-03-16,13.1
2017-03-17,13.24
2017-03-20,13.23
2017-03-21,12.87
2017-03-22,12.76
2017-03-23,12.82
2017-03-24,12.94
2017-03-27,12.92
2017-03-28,12.96
2017-03-29,12.92
2017-03-30,13.04
2017-03-31,13.14
2017-04-03,12.86
2017-04-04,12.81
2017-04-05,12.64
2017-04-06,12.85
2017-04-07,12.86
2017-04-10,12.81
2017-04-11,12.8
2017-04-12,12.58
2017-04-13,12.35
2017-04-17,12.54
2017-04-18,12.67
2017-04-19,12.81
2017-04-20,13.01
2017-04-21,12.94
2017-04-24,13.28
2017-04-25,12.55
2017-04-26,12.69
2017-04-27,12.81
2017-04-28,12.52
2017-05-01,12.55
2017-05-02,12.65
2017-05-03,12.54
2017-05-04,12.5
2017-05-05,12.52
2017-05-08,12.42
2017-05-09,12.48
2017-05-10,12.53
2017-05-11,12.46
2017-05-12,12.25
2017-05-15,12.43
2017-05-16,12.34
2017-05-17,11.88
2017-05-18,12.04
2017-05-19,12.08
2017-05-22,12.06
2017-05-23,12.13
2017-05-24,12.17
2017-05-25,12.13
2017-05-26,11.94
2017-05-30,12
2017-05-31,11.84
2017-06-01,12.04
2017-06-02,12.18
2017-06-05,12.11
2017-06-06,12.07
2017-06-07,12.01
2017-06-08,12.15
2017-06-09,12.13
2017-06-12,12.07
2017-06-13,12.09
2017-06-14,11.89
2017-06-15,11.86
2017-06-16,11.79
2017-06-19,11.94
2017-06-20,11.75
2017-06-21,11.84
2017-06-22,11.71
2017-06-23,11.84
2017-06-26,11.77
2017-06-27,11.62
2017-06-28,11.74
2017-06-29,11.55
2017-06-30,11.43
2017-07-03,11.33
2017-07-05,11.43
2017-07-06,11.33
2017-07-07,12.45
2017-07-10,12.72
2017-07-11,12.85
2017-07-12,12.97
2017-07-13,12.8
2017-07-14,12.77
2017-07-17,12.63
2017-07-18,12.6
2017-07-19,12.64
2017-07-20,12.68
2017-07-21,12.61
2017-07-24,12.64
2017-07-25,13.19
2017-07-26,13.18
2017-07-27,13.07
2017-07-28,12.97
2017-07-31,12.89
2017-08-01,12.89
2017-08-02,12.79
2017-08-03,12.75
2017-08-04,12.77
2017-08-07,12.84
2017-08-08,12.79
2017-08-09,12.76
2017-08-10,12.62
2017-08-11,12.63
2017-08-14,12.75
2017-08-15,12.82
2017-08-16,12.84
2017-08-17,12.68
2017-08-18,12.62
2017-08-21,12.61
2017-08-22,12.73
2017-08-23,12.66
2017-08-24,12.75
2017-08-25,12.77
2017-08-28,12.81
2017-08-29,12.88
2017-08-30,12.95
2017-08-31,12.97
2017-09-01,13.16
2017-09-05,13.04
2017-09-06,13.06
2017-09-07,12.86
2017-09-08,12.87
2017-09-11,13.05
2017-09-12,13.16
2017-09-13,13.16
2017-09-14,13.15
2017-09-15,13.38
2017-09-18,13.52
2017-09-19,13.58
2017-09-20,13.35
2017-09-21,13.34
2017-09-22,13.03
2017-09-25,13
2017-09-26,13.11
2017-09-27,13.34
2017-09-28,13.5
2017-09-29,13.35
2017-10-02,13.57
2017-10-03,13.69
2017-10-04,13.7
2017-10-05,13.61
2017-10-06,13.56
2017-10-09,13.55
2017-10-10,13.75
2017-10-11,13.65
2017-10-12,13.68
2017-10-13,13.67
2017-10-16,13.64
2017-10-17,13.64
2017-10-18,13.7
2017-10-19,13.58
2017-10-20,13.7
2017-10-23,13.75
2017-10-24,14.41
2017-10-25,14.2
2017-10-26,13.92
2017-10-27,14.07
2017-10-30,14.47
2017-10-31,14.71
2017-11-01,14.66
2017-11-02,14.71
2017-11-03,14.53
2017-11-06,14.63
2017-11-07,14.43
2017-11-08,14.59
2017-11-09,14.44
2017-11-10,14.48
2017-11-13,14.61
2017-11-14,14.56
2017-11-15,14.49
2017-11-16,14.72
2017-11-17,14.78
2017-11-20,15.07
2017-11-21,15.35
2017-11-22,15.41
2017-11-24,15.17
2017-11-27,15.19
2017-11-28,15.39
2017-11-29,14.96
2017-11-30,14.8
2017-12-01,14.85
2017-12-04,14.73
2017-12-05,14.75
2017-12-06,14.55
2017-12-07,14.73
2017-12-08,14.67
2017-12-11,14.71
2017-12-12,14.67
2017-12-13,14.75
2017-12-14,14.68
2017-12-15,14.56
2017-12-18,14.61
2017-12-19,14.58
2017-12-20,14.45
2017-12-21,14.39
2017-12-22,14.31
2017-12-26,14.23
2017-12-27,14.21
2017-12-28,14.27
2017-12-29,14.22
2018-01-02,14.29
2018-01-03,14.4
2018-01-04,14.48
2018-01-05,14.5
2018-01-08,14.56
2018-01-09,14.21
2018-01-10,14.09
2018-01-11,14.35
2018-01-12,14.36
2018-01-16,14.06
2018-01-17,14.5
2018-01-18,14.26
2018-01-19,14.18
2018-01-22,14.12
2018-01-23,14.23
2018-01-24,13.96
2018-01-25,14
2018-01-26,14.18
2018-01-29,14.2
2018-01-30,13.02
2018-01-31,12.63
2018-02-01,12.84
2018-02-02,12.72
2018-02-05,12.11
2018-02-06,12.49
2018-02-07,12.13
2018-02-08,11.85
2018-02-09,12.13
2018-02-12,12.15
2018-02-13,12.17
2018-02-14,12.32
2018-02-15,12.47
2018-02-16,12.32
2018-02-20,12.49
2018-02-21,12.51
2018-02-22,12.42
2018-02-23,12.71
2018-02-26,13.02
2018-02-27,12.8
2018-02-28,12.71
2018-03-01,12.59
2018-03-02,12.71
2018-03-05,12.83
2018-03-06,13.31
2018-03-07,13.73
2018-03-08,13.65
2018-03-09,13.92
2018-03-12,13.85
2018-03-13,13.6
2018-03-14,13.74
2018-03-15,13.87
2018-03-16,13.99
2018-03-19,13.79
2018-03-20,13.84
2018-03-21,13.81
2018-03-22,13.44
2018-03-23,13.2
2018-03-26,13.49
2018-03-27,13.51
2018-03-28,13.34
2018-03-29,13.43
2018-04-02,13.19
2018-04-03,13.3
2018-04-04,13.53
2018-04-05,13.7
2018-04-06,13.45
2018-04-09,13.47
2018-04-10,13.64
2018-04-11,13.66
2018-04-12,13.78
2018-04-13,13.81
2018-04-16,13.86
2018-04-17,13.99
2018-04-18,14.09
2018-04-19,13.92
2018-04-20,13.77
2018-04-23,13.54
2018-04-24,13.55
2018-04-25,13.53
2018-04-26,13.63
2018-04-27,13.62
2018-04-30,13.5
2018-05-01,13.72
2018-05-02,13.77
2018-05-03,13.88
2018-05-04,14.17
2018-05-07,14.13
2018-05-08,13.26
2018-05-09,13.13
2018-05-10,13.28
2018-05-11,13.14
2018-05-14,13.11
2018-05-15,13.19
2018-05-16,13.27
2018-05-17,13.37
2018-05-18,13.38
2018-05-21,13.42
2018-05-22,13.32
2018-05-23,13.42
2018-05-24,13.51
2018-05-25,13.55
2018-05-29,13.51
2018-05-30,13.53
2018-05-31,13.46
2018-06-01,13.6
2018-06-04,13.78
2018-06-05,13.84
2018-06-06,13.81
2018-06-07,13.78
2018-06-08,13.7
2018-06-11,13.61
2018-06-12,13.52
2018-06-13,13.48
2018-06-14,13.59
2018-06-15,13.7
2018-06-18,13.64
2018-06-19,13.5
2018-06-20,13.44
2018-06-21,13.32
2018-06-22,13.21
2018-06-25,13.04
2018-06-26,13.05
2018-06-27,12.91
2018-06-28,12.99
2018-06-29,12.54
2018-07-02,12.59
2018-07-03,12.56
2018-07-05,12.71
2018-07-06,12.7
2018-07-09,12.77
2018-07-10,13.01
2018-07-11,12.81
2018-07-12,12.81
2018-07-13,12.56
2018-07-16,12.68
2018-07-17,12.88
2018-07-18,12.96
2018-07-19,13.18
2018-07-20,13.3
2018-07-23,13.14
2018-07-24,13.1
2018-07-25,13.225
2018-07-26,13.46
2018-07-27,13.39
2018-07-30,13.12
2018-07-31,12.36
2018-08-01,12.46
2018-08-02,12.62
2018-08-03,12.53
2018-08-06,12.6
2018-08-07,12.7
2018-08-08,12.75
2018-08-09,12.64
2018-08-10,12.58
2018-08-13,12.36
2018-08-14,11.97
2018-08-15,11.86
2018-08-16,11.76
2018-08-17,11.67
2018-08-20,11.64
2018-08-21,11.82
2018-08-22,11.81
2018-08-23,11.73
2018-08-24,11.92
2018-08-27,12.02
2018-08-28,12.04
2018-08-29,12.07
2018-08-30,11.98
2018-08-31,12.22
2018-09-04,12.05
2018-09-05,12.03
2018-09-06,11.78
2018-09-07,11.58
2018-09-10,11.47
2018-09-11,11.33
2018-09-12,11.33
2018-09-13,11.28
2018-09-14,11.32
2018-09-17,11.18
2018-09-18,11.15
2018-09-19,11.12
2018-09-20,11.45
2018-09-21,11.26
2018-09-24,11.26
2018-09-25,11.11
2018-09-26,10.94
2018-09-27,10.91
2018-09-28,10.91
2018-10-01,10.71
2018-10-02,10.5
2018-10-03,10.44
2018-10-04,10.19
2018-10-05,9.86
2018-10-08,9.71
2018-10-09,9.68
2018-10-10,9.38
2018-10-11,9.21
2018-10-12,9.18
2018-10-15,9.24
2018-10-16,9.5
2018-10-17,9.38
2018-10-18,9.13
2018-10-19,8.89
2018-10-22,9
2018-10-23,9.07
2018-10-24,8.46
2018-10-25,8.65
2018-10-26,8.57
2018-10-29,8.53
2018-10-30,8.12
2018-10-31,8.71
2018-11-01,9.35
2018-11-02,9.26
2018-11-05,9.14
2018-11-06,9.14
2018-11-07,9.15
2018-11-08,9.15
2018-11-09,8.81
2018-11-12,8.39
2018-11-13,8.44
2018-11-14,8.44
2018-11-15,8.71
2018-11-16,8.53
2018-11-19,8.44
2018-11-20,8.29
2018-11-21,8.47
2018-11-23,8.33
2018-11-26,8.39
2018-11-27,8.58
2018-11-28,8.66
2018-11-29,8.64
2018-11-30,8.72
2018-12-03,8.92
2018-12-04,8.41
2018-12-06,8.33
2018-12-07,8.19
2018-12-10,8.16
2018-12-11,8.12
2018-12-12,8.19
2018-12-13,8.07
2018-12-14,7.97
2018-12-17,7.88
2018-12-18,7.79
2018-12-19,7.59
2018-12-20,7.53
2018-12-21,7.38
2018-12-24,7.25
2018-12-26,7.61
2018-12-27,7.68
2018-12-28,7.71
2018-12-31,7.67
2019-01-02,8.01
2019-01-03,7.83
2019-01-04,8.02
2019-01-07,8.07
2019-01-08,8.21
2019-01-09,8.26
2019-01-10,8.27
2019-01-11,8.3
2019-01-14,8.22
2019-01-15,8.15
2019-01-16,8.16
2019-01-17,8.22
2019-01-18,8.6
2019-01-22,8.47
2019-01-23,8.39
2019-01-24,8.69
2019-01-25,8.9
2019-01-28,8.82
2019-01-29,8.49
2019-01-30,8.97
2019-01-31,9.02
2019-02-01,9.38
2019-02-04,9.38
2019-02-05,9.72
2019-02-06,10.12
2019-02-07,10.05
2019-02-08,9.83
2019-02-11,9.79
2019-02-12,9.9
2019-02-13,10.02
2019-02-14,10.1
2019-02-15,10.15
2019-02-19,10.32
2019-02-20,10.5
2019-02-21,10.51
2019-02-22,10.61
2019-02-25,10.59
2019-02-26,10.32
2019-02-27,10.22
2019-02-28,10.27
2019-03-01,10.38
2019-03-04,10.29
2019-03-05,10.22
2019-03-06,9.89
2019-03-07,9.78
2019-03-08,9.93
2019-03-11,10.33
2019-03-12,10.14
2019-03-13,10.37
2019-03-14,10.46
2019-03-15,10.75
2019-03-18,10.81
2019-03-19,10.72
2019-03-20,10.56
2019-03-21,10.84
2019-03-22,10.36
2019-03-25,10.32
2019-03-26,10.39
2019-03-27,10.34
2019-03-28,10.22
2019-03-29,10.45
2019-04-01,10.8
2019-04-02,10.87
2019-04-03,11.07
2019-04-04,10.93
2019-04-05,10.87
2019-04-08,10.92
2019-04-09,10.9
2019-04-10,11.15
2019-04-11,11.15
2019-04-12,11.38
2019-04-15,11.35
2019-04-16,11.67
2019-04-17,11.74
2019-04-18,11.89
2019-04-22,11.82
2019-04-23,11.38
2019-04-24,11.56
2019-04-25,11.58
2019-04-26,11.5
2019-04-29,11.37
2019-04-30,11.46
2019-05-01,11.5
2019-05-02,11.39
2019-05-03,11.7
2019-05-06,11.63
2019-05-07,11.72
2019-05-08,11.61
2019-05-09,11.65
2019-05-10,11.64
2019-05-13,11.01
2019-05-14,11.35
2019-05-15,11.63
2019-05-16,11.6
2019-05-17,11.22
2019-05-20,11.08
2019-05-21,11.41
2019-05-22,11.09
2019-05-23,10.87
2019-05-24,10.94
2019-05-28,10.85
2019-05-29,11.06
2019-05-30,11.4
2019-05-31,11.36
2019-06-03,11
2019-06-04,11.87
2019-06-05,11.88
2019-06-06,11.79
2019-06-07,11.87
2019-06-10,11.96
2019-06-11,11.9
2019-06-12,11.74
2019-06-13,11.865
2019-06-14,11.495
2019-06-17,11.255
2019-06-18,11.7
2019-06-19,11.735
2019-06-20,11.8
2019-06-21,11.615
2019-06-24,11.525
2019-06-25,11.525
2019-06-26,11.905
2019-06-27,12.03
2019-06-28,12.095
2019-07-01,12.275
2019-07-02,12.05
2019-07-03,12.15
2019-07-04,12.15
2019-07-05,12.165
2019-07-08,11.865
2019-07-09,11.89
2019-07-10,12.11
2019-07-11,11.96
2019-07-12,12.115
2019-07-15,12.075
2019-07-16,12.085
2019-07-17,12.07
2019-07-18,12.385
2019-07-19,12.565
2019-07-22,12.685
2019-07-23,12.69
2019-07-24,13.105
2019-07-25,12.98
2019-07-26,13
2019-07-29,12.845
2019-07-30,12.825
2019-07-31,12.485
2019-08-01,12.385
2019-08-02,12.3
2019-08-05,11.955
2019-08-06,11.945
2019-08-07,12.175
2019-08-08,12.23
2019-08-09,11.99
2019-08-12,11.99
2019-08-13,12.325
2019-08-14,12.205
2019-08-15,12.1
2019-08-16,12.235
2019-08-19,12.41
2019-08-20,12.355
2019-08-21,12.37
2019-08-22,12.2
2019-08-23,11.565
2019-08-26,11.51
2019-08-27,11.36
2019-08-28,11.325
2019-08-29,12.185
2019-08-30,12.545
2019-09-02,12.545
2019-09-03,12.595
2019-09-04,12.5
2019-09-05,12.56
2019-09-06,12.425
2019-09-09,12.525
2019-09-10,13.025
2019-09-11,13.205
2019-09-12,13.315
2019-09-13,13.99
2019-09-16,13.945
2019-09-17,13.695
2019-09-18,13.65
2019-09-19,13.58
2019-09-20,13.265
2019-09-23,13.365
2019-09-24,13.335
2019-09-25,13.465
2019-09-26,13.485
2019-09-27,13.305
2019-09-30,13.12
2019-10-01,13.045
2019-10-02,12.985
2019-10-03,12.895
2019-10-04,13.045
2019-10-07,12.85
2019-10-08,12.645
2019-10-09,12.845
2019-10-10,13.005
2019-10-11,13.3
2019-10-14,13.105
2019-10-15,13.455
2019-10-16,13.755
2019-10-17,13.565
2019-10-18,13.39
2019-10-21,13.435
2019-10-22,13.52
2019-10-23,13.195
2019-10-24,13.455
2019-10-25,13.62
2019-10-28,13.845
2019-10-29,13.715
2019-10-30,13.705
2019-10-31,13.82
2019-11-01,13.945
2019-11-04,14.075
2019-11-05,14.285
2019-11-06,14.39
2019-11-07,14.065
2019-11-08,13.925
2019-11-11,13.685
2019-11-12,13.895
2019-11-13,13.895
2019-11-14,13.535
2019-11-15,13.795
2019-11-18,13.595
2019-11-19,13.295
2019-11-20,13.23
2019-11-21,13.195
2019-11-22,13.205
2019-11-25,13.305
