date,close
2014-06-13,38.72
2014-06-16,38.81
2014-06-17,39.08
2014-06-18,39.01
2014-06-19,39.56
2014-06-20,39.67
2014-06-23,39.67
2014-06-24,38.95
2014-06-25,39.22
2014-06-26,39.39
2014-06-27,40.5
2014-06-30,41.02
2014-07-01,42.54
2014-07-02,42.79
2014-07-03,43.44
2014-07-07,41.95
2014-07-08,42.96
2014-07-09,43.2
2014-07-10,41.78
2014-07-11,41.41
2014-07-14,41.99
2014-07-15,41.14
2014-07-16,41.23
2014-07-17,40.99
2014-07-18,41.3
2014-07-21,40.88
2014-07-22,40.96
2014-07-23,40.85
2014-07-24,40.33
2014-07-25,39.68
2014-07-28,39.52
2014-07-29,39.81
2014-07-30,40.38
2014-07-31,39.61
2014-08-01,39.19
2014-08-04,39.58
2014-08-05,40.49
2014-08-06,40.12
2014-08-07,39.45
2014-08-08,40.07
2014-08-11,40.4
2014-08-12,40.39
2014-08-13,40.39
2014-08-14,40.07
2014-08-15,39.86
2014-08-18,40.45
2014-08-19,40.35
2014-08-20,39.51
2014-08-21,39.4
2014-08-22,39.45
2014-08-25,39.05
2014-08-26,39.36
2014-08-27,39.88
2014-08-28,39.75
2014-08-29,39.91
2014-09-02,40.67
2014-09-03,40.71
2014-09-04,40.59
2014-09-05,40.99
2014-09-08,40.99
2014-09-09,40.55
2014-09-10,40.82
2014-09-11,41.13
2014-09-12,40.71
2014-09-15,40.18
2014-09-16,40.21
2014-09-17,39.97
2014-09-18,40.13
2014-09-19,39.01
2014-09-22,39.01
2014-09-23,39.06
2014-09-24,38.85
2014-09-25,38.2
2014-09-26,38.72
2014-09-29,38.48
2014-09-30,37.91
2014-10-01,37.11
2014-10-02,37.47
2014-10-03,38.06
2014-10-06,37.71
2014-10-07,38.1
2014-10-08,38.88
2014-10-09,37.92
2014-10-10,37.71
2014-10-13,38.21
2014-10-14,38.46
2014-10-15,38.3
2014-10-16,38.51
2014-10-17,38.75
2014-10-20,38.72
2014-10-21,39.98
2014-10-22,39.34
2014-10-23,40.03
2014-10-24,39.97
2014-10-27,39.84
2014-10-28,41.32
2014-10-29,40.92
2014-10-30,41.63
2014-10-31,42.14
2014-11-03,41.47
2014-11-04,42.25
2014-11-05,42.45
2014-11-06,42.49
2014-11-07,42.71
2014-11-10,43.18
2014-11-11,43.35
2014-11-12,44
2014-11-13,43.19
2014-11-14,42.93
2014-11-17,42.13
2014-11-18,42.06
2014-11-19,41.3
2014-11-20,40.92
2014-11-21,40.71
2014-11-24,41.2
2014-11-25,41.31
2014-11-26,41.2
2014-11-28,40.61
2014-12-01,38.38
2014-12-02,38.89
2014-12-03,39.4
2014-12-04,39.14
2014-12-05,40.24
2014-12-08,38.79
2014-12-09,39.32
2014-12-10,38.71
2014-12-11,38.21
2014-12-12,38.5
2014-12-15,38.05
2014-12-16,37.47
2014-12-17,38.23
2014-12-18,38.84
2014-12-19,38.48
2014-12-22,39.47
2014-12-23,40.19
2014-12-24,40.33
2014-12-26,41.02
2014-12-29,41.06
2014-12-30,41.05
2014-12-31,40.46
2015-01-02,40.04
2015-01-05,38.82
2015-01-06,37.81
2015-01-07,37.43
2015-01-08,37.75
2015-01-09,37.37
2015-01-12,37.35
2015-01-13,38.25
2015-01-14,38.98
2015-01-15,37.57
2015-01-16,37.77
2015-01-20,37.31
2015-01-21,37.56
2015-01-22,38.22
2015-01-23,37.98
2015-01-26,38.65
2015-01-27,38.75
2015-01-28,37.83
2015-01-29,38.95
2015-01-30,38.14
2015-02-02,38.98
2015-02-03,39.8
2015-02-04,39.24
2015-02-05,39.63
2015-02-06,39.46
2015-02-09,38.78
2015-02-10,38.37
2015-02-11,38.65
2015-02-12,39.33
2015-02-13,39.07
2015-02-17,38.53
2015-02-18,39.28
2015-02-19,39.34
2015-02-20,39.51
2015-02-23,39.05
2015-02-24,39.47
2015-02-25,38.94
2015-02-26,39.02
2015-02-27,38.4
2015-03-02,38.25
2015-03-03,37.47
2015-03-04,36.95
2015-03-05,37.22
2015-03-06,36.98
2015-03-09,36.75
2015-03-10,35.93
2015-03-11,36.08
2015-03-12,37.19
2015-03-13,37.4
2015-03-16,37.56
2015-03-17,37.27
2015-03-18,38.33
2015-03-19,38.5
2015-03-20,39.06
2015-03-23,38.5
2015-03-24,38.51
2015-03-25,38.71
2015-03-26,38.97
2015-03-27,39.57
2015-03-30,39.44
2015-03-31,38.98
2015-04-01,38.97
2015-04-02,39.03
2015-04-06,39.51
2015-04-07,39.95
2015-04-08,39.3
2015-04-09,39.14
2015-04-10,38.82
2015-04-13,38.48
2015-04-14,38.58
2015-04-15,39.99
2015-04-16,40.45
2015-04-17,39.79
2015-04-20,40.35
2015-04-21,40.6
2015-04-22,40.59
2015-04-23,40.69
2015-04-24,40.34
2015-04-27,40.38
2015-04-28,40.87
2015-04-29,40.07
2015-04-30,39.08
2015-05-01,39.17
2015-05-04,40.65
2015-05-05,38.97
2015-05-06,38.9
2015-05-07,39.07
2015-05-08,39.2
2015-05-11,39.54
2015-05-12,39.3
2015-05-13,39.38
2015-05-14,39.72
2015-05-15,39.81
2015-05-18,39.85
2015-05-19,40.21
2015-05-20,40.08
2015-05-21,40.12
2015-05-22,39.85
2015-05-26,39.21
2015-05-27,39.42
2015-05-28,39.84
2015-05-29,39.8
2015-06-01,40.05
2015-06-02,40.07
2015-06-03,40.77
2015-06-04,39.92
2015-06-05,40.54
2015-06-08,39.96
2015-06-09,40.09
2015-06-10,41.02
2015-06-11,41.28
2015-06-12,41.1
2015-06-15,40.17
2015-06-16,40.7
2015-06-17,40.62
2015-06-18,41.26
2015-06-19,41.24
2015-06-22,41.3
2015-06-23,40.99
2015-06-24,40.75
2015-06-25,40.94
2015-06-26,41.2
2015-06-29,40.22
2015-06-30,40.25
2015-07-01,40.66
2015-07-02,39.79
2015-07-06,40.89
2015-07-07,43.09
2015-07-08,43.21
2015-07-09,43.45
2015-07-10,45.17
2015-07-13,44.36
2015-07-14,44.43
2015-07-15,44.19
2015-07-16,44.42
2015-07-17,44.53
2015-07-20,44.17
2015-07-21,44.33
2015-07-22,44.47
2015-07-23,43.43
2015-07-24,43.06
2015-07-27,43.02
2015-07-28,42.86
2015-07-29,43.69
2015-07-30,43.2
2015-07-31,43.4
2015-08-03,43.34
2015-08-04,43.44
2015-08-05,44.8
2015-08-06,45.58
2015-08-07,45.31
2015-08-10,46.49
2015-08-11,46.46
2015-08-12,45.66
2015-08-13,44.82
2015-08-14,45.8
2015-08-17,45.62
2015-08-18,44.81
2015-08-19,45.12
2015-08-20,44.18
2015-08-21,42
2015-08-24,40.73
2015-08-25,41.01
2015-08-26,42.02
2015-08-27,42.29
2015-08-28,42.01
2015-08-31,41.84
2015-09-01,41.48
2015-09-02,42.07
2015-09-03,42.13
2015-09-04,41.79
2015-09-08,42.15
2015-09-09,42.06
2015-09-10,42.34
2015-09-11,42.64
2015-09-14,41.79
2015-09-15,42.48
2015-09-16,42.93
2015-09-17,43.19
2015-09-18,42.51
2015-09-21,42.72
2015-09-22,41.3
2015-09-23,41.59
2015-09-24,41.06
2015-09-25,41.06
2015-09-28,41.01
2015-09-29,33.08
2015-09-30,32.12
2015-10-01,32.79
2015-10-02,33.31
2015-10-05,35.36
2015-10-06,34.22
2015-10-07,33.28
2015-10-08,33.58
2015-10-09,33.96
2015-10-12,34.03
2015-10-13,33.66
2015-10-14,33.35
2015-10-15,33.91
2015-10-16,33.33
2015-10-19,33.08
2015-10-20,33.18
2015-10-21,31.66
2015-10-22,32.79
2015-10-23,33.19
2015-10-26,33.36
2015-10-27,33.3
2015-10-28,34.61
2015-10-29,34.18
2015-10-30,35
2015-11-02,35.61
2015-11-03,38.43
2015-11-04,38.57
2015-11-05,38.5
2015-11-06,38.7
2015-11-09,38.14
2015-11-10,38.03
2015-11-11,38.32
2015-11-12,37.72
2015-11-13,37.9
2015-11-16,37.97
2015-11-17,38.02
2015-11-18,38.42
2015-11-19,38.23
2015-11-20,38.96
2015-11-23,38.45
2015-11-24,38.78
2015-11-25,38.65
2015-11-27,38.7
2015-11-30,38.18
2015-12-01,38.85
2015-12-02,38.97
2015-12-03,37.81
2015-12-04,37.6
2015-12-07,36.45
2015-12-08,36.38
2015-12-09,35.74
2015-12-10,35.7
2015-12-11,34.16
2015-12-14,34.63
2015-12-15,34.28
2015-12-16,33.78
2015-12-17,32.75
2015-12-18,31.77
2015-12-21,32.13
2015-12-22,32.57
2015-12-23,32.35
2015-12-24,32.62
2015-12-28,32.1
2015-12-29,32.26
2015-12-30,32.23
2015-12-31,31.96
2016-01-04,31.15
2016-01-05,31.12
2016-01-06,30.11
2016-01-07,28.1
2016-01-08,28.13
2016-01-11,28.04
2016-01-12,27.87
2016-01-13,25.92
2016-01-14,26.53
2016-01-15,25.63
2016-01-19,24.11
2016-01-20,23.71
2016-01-21,23.78
2016-01-22,24.47
2016-01-25,23.68
2016-01-26,23.91
2016-01-27,23.59
2016-01-28,23.79
2016-01-29,24
2016-02-01,23.71
2016-02-02,22.5
2016-02-03,22.24
2016-02-04,22.86
2016-02-05,22.9
2016-02-08,22.8
2016-02-09,22.01
2016-02-10,22.02
2016-02-11,22.67
2016-02-12,23.13
2016-02-16,23.63
2016-02-17,24.99
2016-02-18,24.07
2016-02-19,24.04
2016-02-22,23.99
2016-02-23,24.3
2016-02-24,24.28
2016-02-25,24.12
2016-02-26,25.37
2016-02-29,25.63
2016-03-01,25.3
2016-03-02,26.2
2016-03-03,26.58
2016-03-04,25.84
2016-03-07,26.34
2016-03-08,25.59
2016-03-09,25.51
2016-03-10,23.94
2016-03-11,24.84
2016-03-14,25.78
2016-03-15,25.63
2016-03-16,25.6
2016-03-17,26.3
2016-03-18,27.41
2016-03-21,28.26
2016-03-22,29.38
2016-03-23,29.33
2016-03-24,28.57
2016-03-28,29.54
2016-03-29,29.99
2016-03-30,30.5
2016-03-31,30.38
2016-04-01,30.29
2016-04-04,29.99
2016-04-05,29.37
2016-04-06,29.24
2016-04-07,29.13
2016-04-08,29.38
2016-04-11,29.72
2016-04-12,30
2016-04-13,31.25
2016-04-14,31.71
2016-04-15,30.91
2016-04-18,30.77
2016-04-19,31.01
2016-04-20,31.13
2016-04-21,30.62
2016-04-22,31.13
2016-04-25,30.01
2016-04-26,30.47
2016-04-27,30.52
2016-04-28,29.31
2016-04-29,28.73
2016-05-02,28.52
2016-05-03,28.44
2016-05-04,28.51
2016-05-05,27.99
2016-05-06,27.93
2016-05-09,27.26
2016-05-10,26.01
2016-05-11,25.7
2016-05-12,26.03
2016-05-13,26.06
2016-05-16,26.01
2016-05-17,25.95
2016-05-18,25.73
2016-05-19,25.24
2016-05-20,25.35
2016-05-23,25.25
2016-05-24,26
2016-05-25,26.48
2016-05-26,25.97
2016-05-27,26.06
2016-05-31,30.32
2016-06-01,30.08
2016-06-02,29.83
2016-06-03,29.25
2016-06-06,29.05
2016-06-07,28.85
2016-06-08,28.99
2016-06-09,28.88
2016-06-10,28.13
2016-06-13,28
2016-06-14,27.97
2016-06-15,27.49
2016-06-16,27.43
2016-06-17,27.67
2016-06-20,27.66
2016-06-21,27.25
2016-06-22,26.51
2016-06-23,26.71
2016-06-24,25.22
2016-06-27,23.84
2016-06-28,23.57
2016-06-29,24.05
2016-06-30,24.83
2016-07-01,25.32
2016-07-05,24.52
2016-07-06,24.93
2016-07-07,25.73
2016-07-08,26.47
2016-07-11,26.84
2016-07-12,27.21
2016-07-13,27.26
2016-07-14,27.31
2016-07-15,27.66
2016-07-18,27.74
2016-07-19,27.5
2016-07-20,27.59
2016-07-21,27.79
2016-07-22,27.7
2016-07-25,27.19
2016-07-26,27.82
2016-07-27,27.76
2016-07-28,27.63
2016-07-29,27.61
2016-08-01,27.43
2016-08-02,26.81
2016-08-03,26.96
2016-08-04,26.3
2016-08-05,26.81
2016-08-08,27.27
2016-08-09,30.01
2016-08-10,30.6
2016-08-11,31.25
2016-08-12,31.97
2016-08-15,33.3
2016-08-16,32.92
2016-08-17,32.36
2016-08-18,33.05
2016-08-19,32.91
2016-08-22,32.34
2016-08-23,32.24
2016-08-24,32.23
2016-08-25,32.3
2016-08-26,31.88
2016-08-29,31.86
2016-08-30,31.83
2016-08-31,31.77
2016-09-01,31.42
2016-09-02,31.74
2016-09-06,31.59
2016-09-07,31.74
2016-09-08,31.63
2016-09-09,30.98
2016-09-12,30.86
2016-09-13,30.07
2016-09-14,29.94
2016-09-15,29.95
2016-09-16,29.46
2016-09-19,29.35
2016-09-20,29.47
2016-09-21,30.43
2016-09-22,31.31
2016-09-23,30.81
2016-09-26,30.54
2016-09-27,30.71
2016-09-28,31.87
2016-09-29,32.48
2016-09-30,32.71
2016-10-03,32.82
2016-10-04,33.24
2016-10-05,33.42
2016-10-06,33.46
2016-10-07,32.62
2016-10-10,32.64
2016-10-11,32.4
2016-10-12,32.43
2016-10-13,31.62
2016-10-14,30.87
2016-10-17,30.7
2016-10-18,30.9
2016-10-19,31.5
2016-10-20,32.05
2016-10-21,31.85
2016-10-24,32.05
2016-10-25,31.75
2016-10-26,31.9
2016-10-27,32.35
2016-10-28,31.6
2016-10-31,30.75
2016-11-01,30.2
2016-11-02,31.25
2016-11-03,31.55
2016-11-04,31.6
2016-11-07,31.45
2016-11-08,31.6
2016-11-09,33.2
2016-11-10,34.95
2016-11-11,36.35
2016-11-14,36.75
2016-11-15,37.15
2016-11-16,36.75
2016-11-17,36.85
2016-11-18,36.8
2016-11-21,36.85
2016-11-22,36.9
2016-11-23,37
2016-11-25,39.05
2016-11-28,35.7
2016-11-29,34.5
2016-11-30,34.3
2016-12-01,33.9
2016-12-02,34.15
2016-12-05,34.95
2016-12-06,35.05
2016-12-07,35.25
2016-12-08,36.4
2016-12-09,36.95
2016-12-12,37
2016-12-13,36.9
2016-12-14,35.8
2016-12-15,35.9
2016-12-16,36.6
2016-12-19,37.05
2016-12-20,37.35
2016-12-21,37.6
2016-12-22,37.2
2016-12-23,37.35
2016-12-27,38.1
2016-12-28,37.55
2016-12-29,38.45
2016-12-30,39.25
2017-01-03,38.05
2017-01-04,38.3
2017-01-05,37.8
2017-01-06,35.85
2017-01-09,34.4
2017-01-10,34.1
2017-01-11,34.9
2017-01-12,33.65
2017-01-13,34.6
2017-01-17,33.85
2017-01-18,33.5
2017-01-19,33.35
2017-01-20,34
2017-01-23,34
2017-01-24,35.2
2017-01-25,36
2017-01-26,35.4
2017-01-27,34.85
2017-01-30,33.85
2017-01-31,33.6
2017-02-01,33.55
2017-02-02,32.65
2017-02-03,33.45
2017-02-06,32.45
2017-02-07,32.15
2017-02-08,31.7
2017-02-09,32.3
2017-02-10,32.4
2017-02-13,33
2017-02-14,33.85
2017-02-15,34.15
2017-02-16,34.8
2017-02-17,34.75
2017-02-21,33.85
2017-02-22,33.9
2017-02-23,34.05
2017-02-24,33.95
2017-02-27,34.6
2017-02-28,34.35
2017-03-01,34.25
2017-03-02,33.05
2017-03-03,32.05
2017-03-06,32.2
2017-03-07,31.7
2017-03-08,27.1
2017-03-09,27
2017-03-10,26.3
2017-03-13,25.9
2017-03-14,25.4
2017-03-15,25.4
2017-03-16,25.15
2017-03-17,24.9
2017-03-20,24.05
2017-03-21,24.8
2017-03-22,24.65
2017-03-23,25.2
2017-03-24,25.4
2017-03-27,25.2
2017-03-28,26.55
2017-03-29,26.95
2017-03-30,27.9
2017-03-31,27.05
2017-04-03,25.55
2017-04-04,25.05
2017-04-05,25.4
2017-04-06,25.7
2017-04-07,26.25
2017-04-10,27.25
2017-04-11,26.85
2017-04-12,26.3
2017-04-13,25.75
2017-04-17,25.8
2017-04-18,25.85
2017-04-19,26.1
2017-04-20,26.55
2017-04-21,26.3
2017-04-24,27.25
2017-04-25,28.1
2017-04-26,28.7
2017-04-27,28.7
2017-04-28,26.9
2017-05-01,26.85
2017-05-02,26.85
2017-05-03,26.15
2017-05-04,25.75
2017-05-05,26.6
2017-05-08,26.8
2017-05-09,27.05
2017-05-10,27.65
2017-05-11,26.6
2017-05-12,25.7
2017-05-15,25.75
2017-05-16,25.35
2017-05-17,24.25
2017-05-18,24.1
2017-05-19,24.55
2017-05-22,24.65
2017-05-23,25.3
2017-05-24,26.05
2017-05-25,25.8
2017-05-26,25.75
2017-05-30,25.5
2017-05-31,25.65
2017-06-01,25.9
2017-06-02,26.25
2017-06-05,25.25
2017-06-06,24.9
2017-06-07,24.2
2017-06-08,25.05
2017-06-09,25.55
2017-06-12,25.85
2017-06-13,25.6
2017-06-14,25.6
2017-06-15,25.25
2017-06-16,25.2
2017-06-19,25.5
2017-06-20,25.55
2017-06-21,24.25
2017-06-22,23.85
2017-06-23,23.9
2017-06-26,24.1
2017-06-27,23.85
2017-06-28,24.25
2017-06-29,23.55
2017-06-30,23.45
2017-07-03,24.15
2017-07-05,23.5
2017-07-06,22.95
2017-07-07,23.1
2017-07-10,22.95
2017-07-11,22.65
2017-07-12,22.9
2017-07-13,23.3
2017-07-14,23.2
2017-07-17,23.25
2017-07-18,23.25
2017-07-19,23.95
2017-07-20,24.55
2017-07-21,24.55
2017-07-24,23.8
2017-07-25,15.5
2017-07-26,14.7
2017-07-27,14.55
2017-07-28,14.25
2017-07-31,14.35
2017-08-01,14.6
2017-08-02,13.9
2017-08-03,13
2017-08-04,13.15
2017-08-07,12.95
2017-08-08,11.9
2017-08-09,11.45
2017-08-10,10.7
2017-08-11,10.8
2017-08-14,11.4
2017-08-15,11.35
2017-08-16,11.1
2017-08-17,11.25
2017-08-18,10.75
2017-08-21,10.7
2017-08-22,11
2017-08-23,11
2017-08-24,11.6
2017-08-25,11.3
2017-08-28,12.9
2017-08-29,12.45
2017-08-30,12.4
2017-08-31,12.35
2017-09-01,12.6
2017-09-05,11.95
2017-09-06,12.1
2017-09-07,12.35
2017-09-08,12.65
2017-09-11,12.8
2017-09-12,12.85
2017-09-13,12.95
2017-09-14,13.5
2017-09-15,13.5
2017-09-18,13.45
2017-09-19,13.4
2017-09-20,13.6
2017-09-21,13.2
2017-09-22,13.1
2017-09-25,13.4
2017-09-26,14.05
2017-09-27,14.1
2017-09-28,13.55
2017-09-29,13.35
2017-10-02,13.75
2017-10-03,13.85
2017-10-04,13
2017-10-05,13.15
2017-10-06,13
2017-10-09,12.7
2017-10-10,12.5
2017-10-11,12.5
2017-10-12,12.45
2017-10-13,12.6
2017-10-16,12.3
2017-10-17,12
2017-10-18,12.1
2017-10-19,12.25
2017-10-20,12.35
2017-10-23,12
2017-10-24,11.65
2017-10-25,11.775
2017-10-26,12.25
2017-10-27,12.6
2017-10-30,12.3
2017-10-31,12.3
2017-11-01,11.95
2017-11-02,12.2
2017-11-03,12.15
2017-11-06,12.4
2017-11-07,13
2017-11-08,13.95
2017-11-09,13.75
2017-11-10,13.9
2017-11-13,13.35
2017-11-14,12.9
2017-11-15,13.05
2017-11-16,13
2017-11-17,13.6
2017-11-20,13.85
2017-11-21,14
2017-11-22,14
2017-11-24,13.75
2017-11-27,13.9
2017-11-28,13.9
2017-11-29,14.45
2017-11-30,13.75
2017-12-01,13.75
2017-12-04,14.15
2017-12-05,13.45
2017-12-06,13.05
2017-12-07,13.65
2017-12-08,14.05
2017-12-11,14.15
2017-12-12,13.8
2017-12-13,13.35
2017-12-14,13.65
2017-12-15,14.65
2017-12-18,14.8
2017-12-19,14.55
2017-12-20,14.1
2017-12-21,14.55
2017-12-22,14.45
2017-12-26,14.4
2017-12-27,14.6
2017-12-28,14.8
2017-12-29,14.9
2018-01-02,15.1
2018-01-03,14.9
2018-01-04,15.7
2018-01-05,16.3
2018-01-08,16.05
2018-01-09,16
2018-01-10,16.05
2018-01-11,16.3
2018-01-12,16.2
2018-01-16,16.15
2018-01-17,16.65
2018-01-18,16.25
2018-01-19,16.55
2018-01-22,17.8
2018-01-23,17.95
2018-01-24,17.85
2018-01-25,17.85
2018-01-26,17.9
2018-01-29,17.6
2018-01-30,16.95
2018-01-31,17
2018-02-01,16.75
2018-02-02,16.4
2018-02-05,15.4
2018-02-06,15.8
2018-02-07,16.35
2018-02-08,16.4
2018-02-09,17.2
2018-02-12,17.1
2018-02-13,17.05
2018-02-14,17.65
2018-02-15,17.55
2018-02-16,17.95
2018-02-20,17.85
2018-02-21,17.3
2018-02-22,17.6
2018-02-23,17.55
2018-02-26,17.95
2018-02-27,17
2018-02-28,16.35
2018-03-01,16.9
2018-03-02,17.1
2018-03-05,17.15
2018-03-06,17.7
2018-03-07,17.7
2018-03-08,17.8
2018-03-09,18.65
2018-03-12,18.75
2018-03-13,18.45
2018-03-14,16.9
2018-03-15,14.9
2018-03-16,15.4
2018-03-19,14.35
2018-03-20,14.2
2018-03-21,14.15
2018-03-22,14
2018-03-23,13.75
2018-03-26,13.55
2018-03-27,13.6
2018-03-28,13.2
2018-03-29,13.75
2018-04-02,13.65
2018-04-03,13.85
2018-04-04,14.25
2018-04-05,14.4
2018-04-06,14.8
2018-04-09,15.15
2018-04-10,16
2018-04-11,15.95
2018-04-12,16.75
2018-04-13,16.55
2018-04-16,16.8
2018-04-17,17.2
2018-04-18,17.1
2018-04-19,16.75
2018-04-20,16.45
2018-04-23,16.95
2018-04-24,17.1
2018-04-25,16.9
2018-04-26,17
2018-04-27,17.15
2018-04-30,16.95
2018-05-01,17.3
2018-05-02,17.4
2018-05-03,17.7
2018-05-04,18.05
2018-05-07,17.95
2018-05-08,18.2
2018-05-09,19.15
2018-05-10,20
2018-05-11,20.6
2018-05-14,20.35
2018-05-15,20.3
2018-05-16,20.35
2018-05-17,20.7
2018-05-18,20.85
2018-05-21,21.9
2018-05-22,21.3
2018-05-23,21.45
2018-05-24,21.4
2018-05-25,21.15
2018-05-29,21.15
2018-05-30,21.25
2018-05-31,21.25
2018-06-01,21.4
2018-06-04,21.5
2018-06-05,21.9
2018-06-06,21.55
2018-06-07,21.7
2018-06-08,20.95
2018-06-11,21.05
2018-06-12,21
2018-06-13,21.15
2018-06-14,21.1
2018-06-15,21.25
2018-06-18,21.95
2018-06-19,21.55
2018-06-20,21.6
2018-06-21,21.1
2018-06-22,21.75
2018-06-25,21.75
2018-06-26,21.95
2018-06-27,21.95
2018-06-28,22.25
2018-06-29,23.1
2018-07-02,23.15
2018-07-03,23
2018-07-05,23.1
2018-07-06,23.5
2018-07-09,23.75
2018-07-10,23.65
2018-07-11,22.2
2018-07-12,20.85
2018-07-13,21.05
2018-07-16,20.4
2018-07-17,20.85
2018-07-18,21.65
2018-07-19,22.15
2018-07-20,22.05
2018-07-23,22.45
2018-07-24,22.15
2018-07-25,22.5
2018-07-26,22.75
2018-07-27,22.35
2018-07-30,22.4
2018-07-31,21.8
2018-08-01,22.75
2018-08-02,21.95
2018-08-03,21.9
2018-08-06,22.35
2018-08-07,22.95
2018-08-08,22.75
2018-08-09,22.7
2018-08-10,23.15
2018-08-13,23
2018-08-14,23
2018-08-15,23.45
2018-08-16,24.25
2018-08-17,24.45
2018-08-20,24.75
2018-08-21,25
2018-08-22,24.95
2018-08-23,24.95
2018-08-24,25.2
2018-08-27,24.35
2018-08-28,23.25
2018-08-29,23
2018-08-30,23.4
2018-08-31,23.3
2018-09-04,23.8
2018-09-05,23.3
2018-09-06,23.05
2018-09-07,22.5
2018-09-10,21.8
2018-09-11,21.4
2018-09-12,21.15
2018-09-13,20.95
2018-09-14,20.2
2018-09-17,20.85
2018-09-18,21.3
2018-09-19,21.85
2018-09-20,22.55
2018-09-21,22.25
2018-09-24,21.4
2018-09-25,21.8
2018-09-26,22.15
2018-09-27,22.2
2018-09-28,22.5
2018-10-01,21.58
2018-10-02,21.89
2018-10-03,22.33
2018-10-04,21.96
2018-10-05,21.9
2018-10-08,22.4
2018-10-09,22.54
2018-10-10,21.35
2018-10-11,20.97
2018-10-12,20.66
2018-10-15,20.28
2018-10-16,19.88
2018-10-17,19.49
2018-10-18,19.58
2018-10-19,19.15
2018-10-22,19.24
2018-10-23,19.18
2018-10-24,18.86
2018-10-25,19.47
2018-10-26,19.24
2018-10-29,19.59
2018-10-30,20.18
2018-10-31,19.9
2018-11-01,19.62
2018-11-02,19.89
2018-11-05,19.53
2018-11-06,21.28
2018-11-07,21.23
2018-11-08,19.72
2018-11-09,20.38
2018-11-12,18.89
2018-11-13,18.59
2018-11-14,18.45
2018-11-15,18.01
2018-11-16,17.61
2018-11-19,16.95
2018-11-20,16.66
2018-11-21,17.33
2018-11-23,17.13
2018-11-26,16.79
2018-11-27,16.59
2018-11-28,17.03
2018-11-29,17.22
2018-11-30,16.71
2018-12-03,17.02
2018-12-04,16.52
2018-12-06,16.78
2018-12-07,16.56
2018-12-10,16.08
2018-12-11,16
2018-12-12,15.89
2018-12-13,15.39
2018-12-14,15.16
2018-12-17,14.97
2018-12-18,14.82
2018-12-19,14.77
2018-12-20,14.85
2018-12-21,14.12
2018-12-24,14.19
2018-12-26,14.8
2018-12-27,14.66
2018-12-28,14.93
2018-12-31,14.65
2019-01-02,14.88
2019-01-03,14.82
2019-01-04,15.2
2019-01-07,15.57
2019-01-08,15.39
2019-01-09,15.55
2019-01-10,15.6
2019-01-11,15.62
2019-01-14,15.06
2019-01-15,15.31
2019-01-16,15.14
2019-01-17,15.54
2019-01-18,15.64
2019-01-22,15.32
2019-01-23,15.02
2019-01-24,14.9
2019-01-25,14.51
2019-01-28,14.17
2019-01-29,14.03
2019-01-30,14.5
2019-01-31,14.34
2019-02-01,14.3
2019-02-04,14.7
2019-02-05,15.13
2019-02-06,15.06
2019-02-07,14.42
2019-02-08,14.28
2019-02-11,14.41
2019-02-12,14.68
2019-02-13,15.24
2019-02-14,15.39
2019-02-15,14.92
2019-02-19,14.78
2019-02-20,15.52
2019-02-21,15.25
2019-02-22,15.62
2019-02-25,15.59
2019-02-26,15.4
2019-02-27,15.63
2019-02-28,15.62
2019-03-01,15.9
2019-03-04,15.85
2019-03-05,16.15
2019-03-06,15.72
2019-03-07,15.9
2019-03-08,16.09
2019-03-11,16.66
2019-03-12,17
2019-03-13,18.84
2019-03-14,19.47
2019-03-15,18.42
2019-03-18,18.45
2019-03-19,18.37
2019-03-20,17.95
2019-03-21,17.84
2019-03-22,17.5
2019-03-25,17.43
2019-03-26,17.25
2019-03-27,17.75
2019-03-28,17.5
2019-03-29,17.5
2019-04-01,17.69
2019-04-02,17.57
2019-04-03,17.54
2019-04-04,17.64
2019-04-05,17.56
2019-04-08,18
2019-04-09,17.81
2019-04-10,18.22
2019-04-11,18.14
2019-04-12,18.5
2019-04-15,18.4
2019-04-16,18.5
2019-04-17,18.52
2019-04-18,18.69
2019-04-22,18.44
2019-04-23,18.56
2019-04-24,17.93
2019-04-25,17.16
2019-04-26,17.18
2019-04-29,17.19
2019-04-30,16.9
2019-05-01,17.15
2019-05-02,17.25
2019-05-03,17.04
2019-05-06,17.13
2019-05-07,16.78
2019-05-08,15.95
2019-05-09,16.06
2019-05-10,15.87
2019-05-13,15.75
2019-05-14,15.74
2019-05-15,15.67
2019-05-16,15.58
2019-05-17,15.29
2019-05-20,15
2019-05-21,15.22
2019-05-22,14.94
2019-05-23,14.6
2019-05-24,14.5
2019-05-28,14.37
2019-05-29,14.53
2019-05-30,14.79
2019-05-31,14.52
2019-06-03,14.61
2019-06-04,14.99
2019-06-05,14.94
2019-06-06,14.67
2019-06-07,14.68
2019-06-10,14.9
2019-06-11,14.79
2019-06-12,14.64
2019-06-13,14.88
2019-06-14,14.635
2019-06-17,14.625
2019-06-18,14.685
2019-06-19,14.61
2019-06-20,14.86
2019-06-21,14.77
2019-06-24,14.465
2019-06-25,14.82
2019-06-26,15.05
2019-06-27,15.245
2019-06-28,15.28
2019-07-01,15.79
2019-07-02,15.04
2019-07-03,14.99
2019-07-04,14.99
2019-07-05,14.93
2019-07-08,14.97
2019-07-09,15
2019-07-10,14.69
2019-07-11,14.61
2019-07-12,15.045
2019-07-15,15.28
2019-07-16,15.285
2019-07-17,14.78
2019-07-18,14.99
2019-07-19,15.12
2019-07-22,15.19
2019-07-23,15.25
2019-07-24,15.82
2019-07-25,15.835
2019-07-26,15.865
2019-07-29,16.05
2019-07-30,16.56
2019-07-31,16.72
2019-08-01,15.86
2019-08-02,15.92
2019-08-05,15.57
2019-08-06,15.74
2019-08-07,17.085
2019-08-08,17.1
2019-08-09,17.61
2019-08-12,17.175
2019-08-13,17.26
2019-08-14,16.8
2019-08-15,16.985
2019-08-16,17.17
2019-08-19,17.09
2019-08-20,16.66
2019-08-21,16.44
2019-08-22,16.16
2019-08-23,15.84
2019-08-26,16.22
2019-08-27,16.35
2019-08-28,16.45
2019-08-29,16.58
2019-08-30,16.485
2019-09-02,16.485
2019-09-03,16.49
2019-09-04,16.69
2019-09-05,16.8
2019-09-06,16.845
2019-09-09,16.98
2019-09-10,16.97
2019-09-11,17.56
2019-09-12,18.07
2019-09-13,17.765
2019-09-16,17.935
2019-09-17,18.155
2019-09-18,17.84
2019-09-19,18.145
2019-09-20,18.395
2019-09-23,18.82
2019-09-24,18.7
2019-09-25,18.78
2019-09-26,18.48
2019-09-27,18.15
2019-09-30,18.085
2019-10-01,17.805
2019-10-02,17.44
2019-10-03,17.35
2019-10-04,17.49
2019-10-07,17.435
2019-10-08,16.96
2019-10-09,17.2
2019-10-10,17.575
2019-10-11,17.86
2019-10-14,17.39
2019-10-15,17.775
2019-10-16,17.92
2019-10-17,17.985
2019-10-18,18.04
2019-10-21,18.25
2019-10-22,18.4
2019-10-23,17.81
2019-10-24,17.565
2019-10-25,17.9
2019-10-28,18.005
2019-10-29,17.96
2019-10-30,18.165
2019-10-31,18.17
2019-11-01,18.475
2019-11-04,18.565
2019-11-05,17.335
2019-11-06,17.31
2019-11-07,17.7
2019-11-08,17.9
2019-11-11,17.08
2019-11-12,16.89
2019-11-13,16.915
2019-11-14,17.025
2019-11-15,16.675
2019-11-18,16.51
2019-11-19,16.28
2019-11-20,16.31
2019-11-21,16.135
2019-11-22,16.15
2019-11-25,16.435
