date,close
2017-11-03,47.5428
2017-11-07,47.6932
2017-11-08,47.6471
2017-11-09,47.6377
2017-11-13,47.5238
2017-11-14,47.6472
2017-11-15,47.6472
2017-11-17,47.7042
2017-11-20,47.7327
2017-11-21,47.7184
2017-11-28,47.7184
2017-12-01,47.7184
2017-12-07,48.1837
2017-12-08,47.7469
2017-12-13,48.0223
2017-12-14,48.0996
2017-12-15,48.0603
2017-12-18,48.0983
2017-12-20,47.8159
2017-12-21,47.9605
2017-12-22,47.9419
2017-12-27,48.1418
2017-12-28,48.0924
2017-12-29,48.0561
2018-01-02,48.1418
2018-01-03,48.2084
2018-01-04,48.2084
2018-01-05,48.1894
2018-01-08,48.1799
2018-01-09,48.1418
2018-01-10,47.999
2018-01-11,47.9704
2018-01-12,47.9942
2018-01-17,47.9228
2018-01-22,47.999
2018-01-23,48.1756
2018-01-24,48.0897
2018-01-26,48.0324
2018-01-29,47.9417
2018-01-30,47.7174
2018-01-31,47.8701
2018-02-01,47.6162
2018-02-02,47.42
2018-02-05,47.5074
2018-02-07,47.6792
2018-02-08,47.6871
2018-02-09,47.8892
2018-02-14,47.6177
2018-02-15,47.746
2018-02-16,47.5074
2018-02-20,47.3738
2018-02-21,47.3738
2018-02-22,48.3013
2018-02-23,47.6657
2018-02-26,47.6657
2018-02-27,47.7614
2018-02-28,47.7901
2018-03-01,47.7901
2018-03-02,47.7614
2018-03-05,47.5604
2018-03-06,47.5126
2018-03-08,47.5891
2018-03-09,47.4534
2018-03-12,47.4534
2018-03-14,47.5987
2018-03-15,47.7518
2018-03-16,47.5974
2018-03-20,47.8763
2018-03-21,47.905
2018-03-22,48.0633
2018-03-23,48.0106
2018-03-26,48.0681
2018-03-27,48.1449
2018-03-28,48.2601
2018-03-29,47.8858
2018-04-02,48.1641
2018-04-03,48.0969
2018-04-04,48.1161
2018-04-05,48.1038
2018-04-06,48.1641
2018-04-09,48.1929
2018-04-10,48.2217
2018-04-11,48.2121
2018-04-12,48.2242
2018-04-13,48.0925
2018-04-17,48.1353
2018-04-18,48.2263
2018-04-19,48.162
2018-04-20,48.1892
2018-04-23,48.2307
2018-04-24,48.1487
2018-04-25,47.8176
2018-04-26,48.0871
2018-04-27,48.1641
2018-04-30,48.2219
2018-05-01,48.1834
2018-05-02,48.2119
2018-05-04,48.1353
2018-05-07,48.3374
2018-05-08,48.1449
2018-05-09,48.1815
2018-05-10,48.2692
2018-05-11,48.2692
2018-05-14,48.3008
2018-05-15,48.087
2018-05-16,48.1516
2018-05-17,48.1516
2018-05-18,48.1642
2018-05-21,48.2569
2018-05-22,48.3086
2018-05-23,48.3112
2018-05-24,48.299
2018-05-25,48.4148
2018-05-29,48.5113
2018-05-30,48.4052
2018-05-31,48.5789
2018-06-01,48.5105
2018-06-04,48.458
2018-06-05,48.4615
2018-06-06,48.4615
2018-06-07,48.5162
2018-06-08,48.4107
2018-06-11,48.5167
2018-06-12,48.443
2018-06-13,48.4438
2018-06-14,48.4341
2018-06-15,48.5017
2018-06-18,48.5553
2018-06-19,48.6658
2018-06-20,48.6098
2018-06-21,48.6466
2018-06-22,48.4723
2018-06-25,48.6756
2018-06-26,48.5933
2018-06-27,48.5837
2018-06-28,48.6272
2018-06-29,48.6853
2018-07-02,48.6078
2018-07-03,48.7627
2018-07-05,48.7002
2018-07-06,48.7055
2018-07-09,48.7136
2018-07-10,48.8594
2018-07-11,48.6853
2018-07-12,48.8789
2018-07-13,48.8885
2018-07-16,48.9176
2018-07-17,48.7434
2018-07-18,48.8885
2018-07-19,48.9079
2018-07-20,48.9173
2018-07-23,48.8763
2018-07-24,48.8037
2018-07-25,48.8861
2018-07-26,48.7114
2018-07-27,48.8433
2018-07-30,48.8763
2018-07-31,49.0025
2018-08-01,48.7812
2018-08-02,48.7539
2018-08-03,48.8568
2018-08-06,48.9152
2018-08-07,48.8861
2018-08-08,48.7385
2018-08-09,48.7113
2018-08-10,48.9637
2018-08-13,49.0439
2018-08-14,49.0899
2018-08-15,49.1773
2018-08-16,49.1159
2018-08-17,49.1666
2018-08-20,49.2841
2018-08-21,49.2549
2018-08-22,49.191
2018-08-23,49.2937
2018-08-24,49.2354
2018-08-27,49.2743
2018-08-29,49.0504
2018-08-30,49.2451
2018-08-31,49.3133
2018-09-04,49.1533
2018-09-05,49.1274
2018-09-06,49.1716
2018-09-07,49.1087
2018-09-10,49.138
2018-09-11,49.0407
2018-09-12,49.0796
2018-09-13,49.0699
2018-09-14,48.9503
2018-09-17,48.9654
2018-09-18,48.9209
2018-09-19,49.0209
2018-09-20,48.9918
2018-09-21,49.021
2018-09-24,49.0015
2018-09-25,48.816
2018-09-26,48.8159
2018-09-27,48.9136
2018-09-28,48.8356
2018-10-01,48.9722
2018-10-02,49.021
2018-10-03,48.8061
2018-10-04,48.7964
2018-10-05,48.709
2018-10-08,48.8257
2018-10-09,48.8257
2018-10-10,48.6988
2018-10-11,48.4449
2018-10-12,48.6011
2018-10-15,48.6011
2018-10-16,48.6109
2018-10-17,48.436
2018-10-18,48.6207
2018-10-19,48.5816
2018-10-22,48.6304
2018-10-23,48.5965
2018-10-24,48.5227
2018-10-25,48.5227
2018-10-26,48.6201
2018-10-29,48.6108
2018-10-30,48.4101
2018-10-31,48.4929
2018-11-01,48.4936
2018-11-02,48.4723
2018-11-05,48.4723
2018-11-06,48.4737
2018-11-07,48.565
2018-11-08,48.5633
2018-11-12,48.7872
2018-11-14,48.5767
2018-11-15,48.6794
2018-11-16,48.6286
2018-11-19,48.6218
2018-11-20,48.748
2018-11-21,48.7676
2018-11-23,48.856
2018-11-26,48.5856
2018-11-27,48.7382
2018-11-28,48.7971
2018-11-29,48.8448
2018-11-30,48.9052
2018-12-03,48.7382
2018-12-04,48.8757
2018-12-06,48.9445
2018-12-07,49.1115
2018-12-10,48.9739
2018-12-12,49.0034
2018-12-13,48.9356
2018-12-14,48.9042
2018-12-17,48.9689
2018-12-18,48.9929
2018-12-19,49.2006
2018-12-20,49.1538
2018-12-21,49.2991
2018-12-24,49.2705
2018-12-26,49.3286
2018-12-27,49.3681
2018-12-28,49.2991
2018-12-31,49.2586
2019-01-02,49.238
2019-01-03,49.2696
2019-01-04,49.2631
2019-01-07,49.3385
2019-01-08,49.3287
2019-01-09,49.2499
2019-01-10,49.2499
2019-01-11,49.4458
2019-01-14,49.3106
2019-01-15,49.4174
2019-01-16,49.4055
2019-01-17,49.4295
2019-01-18,49.4222
2019-01-22,49.5066
2019-01-23,49.4
2019-01-24,49.4497
2019-01-25,49.4468
2019-01-28,49.5307
2019-01-29,49.5743
2019-01-30,49.6346
2019-01-31,49.7256
2019-02-01,49.7334
2019-02-04,49.8125
2019-02-05,49.7235
2019-02-06,49.6643
2019-02-07,49.8219
2019-02-08,49.8387
2019-02-11,49.7929
2019-02-12,49.9508
2019-02-13,49.8624
2019-02-14,50.0595
2019-02-15,49.9525
2019-02-19,50.109
2019-02-20,50.0111
2019-02-21,50.1598
2019-02-22,50.0597
2019-02-25,50.0498
2019-02-26,50.1503
2019-02-27,50.0467
2019-02-28,50.0624
2019-03-01,50.0829
2019-03-04,50.1489
2019-03-05,50.0299
2019-03-06,50.0299
2019-03-07,50.3075
2019-03-08,50.296
2019-03-11,50.2327
2019-03-12,50.3724
2019-03-13,50.3561
2019-03-14,50.2647
2019-03-15,50.4857
2019-03-18,50.3372
2019-03-19,50.5603
2019-03-20,50.5422
2019-03-21,50.7045
2019-03-22,50.9033
2019-03-25,50.9033
2019-03-26,50.909
2019-03-27,50.9847
2019-03-28,50.9932
2019-03-29,50.9934
2019-04-01,51.0624
2019-04-02,51.1121
2019-04-03,51.0624
2019-04-04,51.0922
2019-04-05,51.0823
2019-04-08,51.0226
2019-04-09,51.0474
2019-04-10,51.0823
2019-04-11,51.1817
2019-04-12,51.0226
2019-04-15,51.0791
2019-04-16,51.0624
2019-04-17,50.8635
2019-04-18,51.2016
2019-04-22,51.0409
2019-04-23,51.1223
2019-04-24,51.2386
2019-04-25,51.2918
2019-04-26,51.3374
2019-04-29,51.3716
2019-04-30,51.2647
2019-05-01,51.4304
2019-05-02,51.4214
2019-05-03,51.4771
2019-05-06,51.4192
2019-05-07,51.571
2019-05-08,51.5515
2019-05-09,51.583
2019-05-10,51.6807
2019-05-13,51.7604
2019-05-14,51.8283
2019-05-15,51.9
2019-05-16,51.8535
2019-05-17,51.9349
2019-05-20,51.9201
2019-05-21,51.8853
2019-05-22,51.9853
2019-05-23,52.14
2019-05-24,51.9301
2019-05-28,52.0389
2019-05-29,52.1899
2019-05-30,52.21
2019-05-31,52.2082
2019-06-03,52.2115
2019-06-04,52.14
2019-06-05,52.11
2019-06-06,52.2518
2019-06-07,52.35
2019-06-10,52.29
2019-06-11,52.285
2019-06-12,52.27
2019-06-13,52.27
2019-06-14,52.27
2019-06-17,52.27
2019-06-18,52.18
2019-06-19,52.18
2019-06-20,52.225
2019-06-21,52.225
2019-06-24,52.225
2019-06-25,52.225
2019-06-26,52.225
2019-06-27,52.225
2019-06-28,52.225
2019-07-01,52.225
2019-07-02,52.225
2019-07-03,52.225
2019-07-04,52.225
2019-07-05,52.225
2019-07-08,52.49
2019-07-09,52.5
2019-07-10,52.5
2019-07-11,52.5
2019-07-12,52.5
2019-07-15,52.5
2019-07-16,52.5
2019-07-17,52.625
2019-07-18,52.625
2019-07-19,52.62
2019-07-22,52.62
2019-07-23,52.62
2019-07-24,52.62
2019-07-25,52.62
2019-07-26,52.62
2019-07-29,52.62
2019-07-30,52.63
2019-07-31,52.63
2019-08-01,52.63
2019-08-02,52.63
2019-08-05,52.99
2019-08-06,52.99
2019-08-07,52.99
2019-08-08,52.99
2019-08-09,52.99
2019-08-12,52.99
2019-08-13,52.99
2019-08-14,52.99
2019-08-15,52.99
2019-08-16,53.37
2019-08-19,53.45
2019-08-20,53.45
2019-08-21,53.45
2019-08-22,53.33
2019-08-23,53.39
2019-08-26,53.45
2019-08-27,53.45
2019-08-28,53.59
2019-08-29,53.59
2019-08-30,53.59
2019-09-02,53.59
2019-09-03,53.59
2019-09-04,53.59
2019-09-05,53.59
2019-09-06,53.5
2019-09-09,53.5
2019-09-10,53.5
2019-09-11,53.5
2019-09-12,53.5
2019-09-13,53.14
2019-09-16,53.14
2019-09-17,53.14
2019-09-18,53.14
2019-09-19,53.14
2019-09-20,53.14
2019-09-23,53.14
2019-09-24,53.14
2019-09-25,53.14
2019-09-26,53.19
2019-09-27,53.19
2019-09-30,53.245
2019-10-01,53.245
2019-10-02,53.245
2019-10-03,53.245
2019-10-04,53.245
2019-10-07,53.42
2019-10-08,53.42
2019-10-09,53.42
2019-10-10,53.42
2019-10-11,53.235
2019-10-14,53.235
2019-10-15,53.235
2019-10-16,53.25
2019-10-17,53.25
2019-10-18,53.25
2019-10-21,53.25
2019-10-22,53.03
2019-10-23,53.03
2019-10-24,52.97
2019-10-25,52.97
2019-10-28,52.97
2019-10-29,53.01
2019-10-30,53.01
2019-10-31,53.275
2019-11-01,53.185
2019-11-04,53.185
2019-11-05,53.1
2019-11-06,53.21
2019-11-07,53.21
2019-11-08,53.21
2019-11-11,53.21
2019-11-12,53.21
2019-11-13,53.21
2019-11-14,53.18
2019-11-15,53.18
2019-11-18,53.2
2019-11-19,53.22
2019-11-20,53.2
2019-11-21,53.15
2019-11-22,53.21
2019-11-25,53.21
