date,close
2014-06-13,32.2541
2014-06-16,31.798
2014-06-17,32.4821
2014-06-18,32.7557
2014-06-19,32.5277
2014-06-20,32.847
2014-06-23,32.9382
2014-06-24,32.8105
2014-06-25,33.0568
2014-06-26,32.7101
2014-06-27,33.0476
2014-06-30,34.1878
2014-07-01,34.5709
2014-07-02,34.3064
2014-07-03,34.5983
2014-07-07,34.4068
2014-07-08,34.2973
2014-07-09,34.3247
2014-07-10,34.4068
2014-07-11,34.3064
2014-07-14,34.3338
2014-07-15,34.8811
2014-07-16,34.7625
2014-07-17,34.6622
2014-07-18,35.0544
2014-07-21,35.0635
2014-07-22,35.6291
2014-07-23,35.6929
2014-07-24,36.2767
2014-07-25,36.121
2014-07-28,36.1668
2014-07-29,35.9286
2014-07-30,36.4782
2014-07-31,35.7637
2014-08-01,35.9103
2014-08-04,35.9103
2014-08-05,35.6813
2014-08-06,36.0294
2014-08-07,35.1957
2014-08-08,35.269
2014-08-11,35.2141
2014-08-12,35.1957
2014-08-13,35.2232
2014-08-14,35.0766
2014-08-15,35.0308
2014-08-18,35.3331
2014-08-19,35.3515
2014-08-20,35.5255
2014-08-21,35.8553
2014-08-22,35.837
2014-08-25,36.1576
2014-08-26,36.0294
2014-08-27,35.8828
2014-08-28,35.7271
2014-08-29,35.892
2014-09-02,36.3225
2014-09-03,36.2034
2014-09-04,36.1576
2014-09-05,36.1576
2014-09-08,36.1301
2014-09-09,35.5347
2014-09-10,35.8461
2014-09-11,36.066
2014-09-12,36.5515
2014-09-15,36.5698
2014-09-16,36.7989
2014-09-17,36.8813
2014-09-18,36.8722
2014-09-19,36.35
2014-09-22,36.0385
2014-09-23,35.6904
2014-09-24,35.9286
2014-09-25,35.4064
2014-09-26,35.6721
2014-09-29,35.3698
2014-09-30,35.4797
2014-10-01,35.0125
2014-10-02,35.0034
2014-10-03,35.4522
2014-10-06,35.5255
2014-10-07,34.701
2014-10-08,35.324
2014-10-09,34.1789
2014-10-10,33.7941
2014-10-13,33.2994
2014-10-14,33.4827
2014-10-15,32.933
2014-10-16,33.1239
2014-10-17,33.3086
2014-10-20,33.3086
2014-10-21,33.7117
2014-10-22,33.3269
2014-10-23,33.4185
2014-10-24,34.1625
2014-10-27,34.4202
2014-10-28,34.1625
2014-10-29,35.589
2014-10-30,36.5738
2014-10-31,35.635
2014-11-03,35.405
2014-11-04,35.6166
2014-11-05,35.589
2014-11-06,35.6811
2014-11-07,35.8099
2014-11-10,36.3529
2014-11-11,36.3069
2014-11-12,36.5738
2014-11-13,36.4357
2014-11-14,36.5094
2014-11-17,36.5646
2014-11-18,36.5278
2014-11-19,36.6198
2014-11-20,36.7763
2014-11-21,36.8959
2014-11-24,36.8499
2014-11-25,36.9051
2014-11-26,37.0063
2014-11-28,36.8407
2014-12-01,36.4265
2014-12-02,37.0708
2014-12-03,37.1812
2014-12-04,37.1628
2014-12-05,37.8346
2014-12-08,37.9543
2014-12-09,37.9543
2014-12-10,37.5309
2014-12-11,37.31
2014-12-12,36.7394
2014-12-15,36.5554
2014-12-16,36.4633
2014-12-17,37.1352
2014-12-18,37.8346
2014-12-19,37.5953
2014-12-22,37.6874
2014-12-23,38.2212
2014-12-24,38.0003
2014-12-26,38.0003
2014-12-29,37.9911
2014-12-30,37.761
2014-12-31,37.3376
2015-01-02,37.2364
2015-01-05,36.2793
2015-01-06,35.2301
2015-01-07,35.9572
2015-01-08,36.4541
2015-01-09,35.9203
2015-01-12,35.405
2015-01-13,35.3405
2015-01-14,34.4478
2015-01-15,34.2822
2015-01-16,34.4754
2015-01-20,34.273
2015-01-21,34.5583
2015-01-22,35.635
2015-01-23,33.96
2015-01-26,34.4386
2015-01-27,33.8128
2015-01-28,32.8188
2015-01-29,33.5367
2015-01-30,33.287
2015-02-02,33.9065
2015-02-03,34.5815
2015-02-04,34.3689
2015-02-05,34.8867
2015-02-06,35.5709
2015-02-09,35.5801
2015-02-10,36.1349
2015-02-11,36.1812
2015-02-12,36.4401
2015-02-13,36.2459
2015-02-17,36.4863
2015-02-18,36.0517
2015-02-19,36.1719
2015-02-20,36.4678
2015-02-23,36.2181
2015-02-24,36.7822
2015-02-25,36.8562
2015-02-26,36.4678
2015-02-27,36.1904
2015-03-02,36.662
2015-03-03,36.662
2015-03-04,36.4678
2015-03-05,36.2366
2015-03-06,36.3199
2015-03-09,36.7914
2015-03-10,36.2366
2015-03-11,36.4493
2015-03-12,37.3924
2015-03-13,37.8548
2015-03-16,37.9565
2015-03-17,38.0397
2015-03-18,37.7531
2015-03-19,37.263
2015-03-20,37.5126
2015-03-23,37.374
2015-03-24,37.0781
2015-03-25,36.5418
2015-03-26,36.8099
2015-03-27,36.7544
2015-03-30,37.2537
2015-03-31,37.2075
2015-04-01,37.1798
2015-04-02,37.4942
2015-04-06,37.4387
2015-04-07,37.5126
2015-04-08,37.6236
2015-04-09,37.7623
2015-04-10,37.7808
2015-04-13,37.864
2015-04-14,37.9657
2015-04-15,38.0304
2015-04-16,37.9657
2015-04-17,37.4479
2015-04-20,37.7068
2015-04-21,37.9472
2015-04-22,39.2325
2015-04-23,39.3712
2015-04-24,38.8996
2015-04-27,38.8071
2015-04-28,39.5376
2015-04-29,39.6301
2015-04-30,39.3051
2015-05-01,39.6765
2015-05-04,40.1778
2015-05-05,39.825
2015-05-06,39.8621
2015-05-07,40.2056
2015-05-08,40.2984
2015-05-11,40.1499
2015-05-12,40.0849
2015-05-13,40.1685
2015-05-14,40.2613
2015-05-15,40.0014
2015-05-18,40.3541
2015-05-19,40.4191
2015-05-20,40.4934
2015-05-21,40.512
2015-05-22,40.3541
2015-05-26,40.3449
2015-05-27,40.7348
2015-05-28,40.7997
2015-05-29,40.252
2015-06-01,39.8436
2015-06-02,39.825
2015-06-03,40.2984
2015-06-04,39.8807
2015-06-05,40.252
2015-06-08,40.2335
2015-06-09,40.2892
2015-06-10,40.6048
2015-06-11,40.7348
2015-06-12,40.5491
2015-06-15,40.187
2015-06-16,40.1035
2015-06-17,40.0571
2015-06-18,40.1685
2015-06-19,40.0292
2015-06-22,40.3541
2015-06-23,40.5305
2015-06-24,40.187
2015-06-25,39.7786
2015-06-26,39.8993
2015-06-29,38.7946
2015-06-30,38.9617
2015-07-01,39.1566
2015-07-02,38.7946
2015-07-06,38.5718
2015-07-07,38.5625
2015-07-08,37.6342
2015-07-09,38.0519
2015-07-10,38.7203
2015-07-13,39.3423
2015-07-14,39.4815
2015-07-15,39.6115
2015-07-16,39.9828
2015-07-17,39.7507
2015-07-20,39.8993
2015-07-21,40.9854
2015-07-22,41.5238
2015-07-23,41.2825
2015-07-24,40.5862
2015-07-27,40.1592
2015-07-28,40.4655
2015-07-29,40.6419
2015-07-30,40.9401
2015-07-31,40.4462
2015-08-03,40.4462
2015-08-04,40.9029
2015-08-05,41.3782
2015-08-06,41.2663
2015-08-07,41.7043
2015-08-10,42.1796
2015-08-11,41.6298
2015-08-12,40.9122
2015-08-13,40.8842
2015-08-14,41.0706
2015-08-17,41.0613
2015-08-18,41.3316
2015-08-19,41.1731
2015-08-20,39.8871
2015-08-21,38.6289
2015-08-24,36.0102
2015-08-25,35.2087
2015-08-26,36.7837
2015-08-27,38.0232
2015-08-28,37.902
2015-08-31,37.0912
2015-09-01,35.7306
2015-09-02,36.3643
2015-09-03,36.6066
2015-09-04,35.8704
2015-09-08,36.6439
2015-09-09,36.327
2015-09-10,36.6532
2015-09-11,36.8676
2015-09-14,36.8676
2015-09-15,37.3335
2015-09-16,37.492
2015-09-17,37.1006
2015-09-18,36.2152
2015-09-21,36.7464
2015-09-22,36.2059
2015-09-23,36.1779
2015-09-24,35.8983
2015-09-25,36.9048
2015-09-28,35.6001
2015-09-29,35.8238
2015-09-30,36.4855
2015-10-01,36.6812
2015-10-02,36.5041
2015-10-05,37.4174
2015-10-06,37.2403
2015-10-07,37.7902
2015-10-08,38.0884
2015-10-09,37.697
2015-10-12,37.7063
2015-10-13,37.1285
2015-10-14,36.588
2015-10-15,37.7249
2015-10-16,37.7343
2015-10-19,37.436
2015-10-20,38.4425
2015-10-21,38.0605
2015-10-22,38.8153
2015-10-23,39.3745
2015-10-26,39.039
2015-10-27,38.8712
2015-10-28,40.1387
2015-10-29,39.7176
2015-10-30,38.9691
2015-11-02,39.5305
2015-11-03,39.9048
2015-11-04,39.8486
2015-11-05,40.5036
2015-11-06,41.3456
2015-11-09,40.8591
2015-11-10,40.8217
2015-11-11,41.0182
2015-11-12,40.4007
2015-11-13,39.9235
2015-11-16,40.1667
2015-11-17,40.148
2015-11-18,41.1679
2015-11-19,41.0088
2015-11-20,40.9246
2015-11-23,40.8591
2015-11-24,40.8685
2015-11-25,41.1024
2015-11-27,41.0556
2015-11-30,41.0182
2015-12-01,41.0837
2015-12-02,40.6907
2015-12-03,40.2135
2015-12-04,41.224
2015-12-07,40.7843
2015-12-08,40.3726
2015-12-09,39.6709
2015-12-10,39.5492
2015-12-11,38.1458
2015-12-14,37.7902
2015-12-15,39.334
2015-12-16,39.9515
2015-12-17,38.6042
2015-12-18,37.6312
2015-12-21,37.9774
2015-12-22,38.3516
2015-12-23,38.6884
2015-12-24,38.5762
2015-12-28,38.492
2015-12-29,39.0346
2015-12-30,38.6229
2015-12-31,38.5668
2016-01-04,37.3973
2016-01-05,37.2569
2016-01-06,36.3213
2016-01-07,35.4044
2016-01-08,34.7588
2016-01-11,35.0114
2016-01-12,35.2921
2016-01-13,34.1132
2016-01-14,34.6839
2016-01-15,33.477
2016-01-19,33.6173
2016-01-20,33.1869
2016-01-21,32.1016
2016-01-22,32.8875
2016-01-25,32.4384
2016-01-26,33.2711
2016-01-27,33.1495
2016-01-28,33.0934
2016-01-29,34.0523
2016-02-01,33.3754
2016-02-02,32.2378
2016-02-03,32.2848
2016-02-04,32.8583
2016-02-05,32.3976
2016-02-08,31.3071
2016-02-09,31.5891
2016-02-10,31.5515
2016-02-11,30.7806
2016-02-12,31.8053
2016-02-16,32.4822
2016-02-17,32.8207
2016-02-18,32.4728
2016-02-19,32.8395
2016-02-22,33.3096
2016-02-23,32.9617
2016-02-24,32.6891
2016-02-25,33.2156
2016-02-26,33.9583
2016-02-29,33.272
2016-03-01,34.5976
2016-03-02,35.1805
2016-03-03,35.4343
2016-03-04,35.8104
2016-03-07,35.8856
2016-03-08,35.2463
2016-03-09,34.9172
2016-03-10,34.6634
2016-03-11,35.4907
2016-03-14,35.3779
2016-03-15,35.2463
2016-03-16,34.9454
2016-03-17,35.1429
2016-03-18,35.8668
2016-03-21,35.848
2016-03-22,35.5941
2016-03-23,35.2745
2016-03-24,35.0489
2016-03-28,35.1053
2016-03-29,34.7574
2016-03-30,34.9172
2016-03-31,34.6258
2016-04-01,34.7198
2016-04-04,34.8232
2016-04-05,34.3343
2016-04-06,34.7574
2016-04-07,33.5352
2016-04-08,33.366
2016-04-11,33.7138
2016-04-12,33.9677
2016-04-13,35.5189
2016-04-14,35.7822
2016-04-15,35.5847
2016-04-18,36.0172
2016-04-19,36.5155
2016-04-20,37.3428
2016-04-21,38.2642
2016-04-22,38.6026
2016-04-25,38.236
2016-04-26,38.7625
2016-04-27,38.8095
2016-04-28,38.2078
2016-04-29,37.9906
2016-05-02,38.491
2016-05-03,37.5847
2016-05-04,37.0843
2016-05-05,37.1976
2016-05-06,37.3203
2016-05-09,37.1693
2016-05-10,37.9906
2016-05-11,37.6413
2016-05-12,37.5186
2016-05-13,37.2353
2016-05-16,37.5186
2016-05-17,37.613
2016-05-18,38.8403
2016-05-19,38.5476
2016-05-20,38.7742
2016-05-23,38.6798
2016-05-24,39.3501
2016-05-25,39.8505
2016-05-26,39.6806
2016-05-27,39.9071
2016-05-31,39.7089
2016-06-01,39.8883
2016-06-02,39.8033
2016-06-03,39.1991
2016-06-06,40.0204
2016-06-07,39.69
2016-06-08,39.7089
2016-06-09,39.3218
2016-06-10,38.9347
2016-06-13,38.6704
2016-06-14,37.9057
2016-06-15,38.0095
2016-06-16,37.9151
2016-06-17,37.8207
2016-06-20,38.1606
2016-06-21,38.1794
2016-06-22,38.3305
2016-06-23,39.218
2016-06-24,35.8664
2016-06-27,33.8743
2016-06-28,34.7335
2016-06-29,35.8758
2016-06-30,36.6783
2016-07-01,35.9136
2016-07-05,35.0545
2016-07-06,35.2244
2016-07-07,35.6493
2016-07-08,36.3384
2016-07-11,36.4329
2016-07-12,37.1693
2016-07-13,37.207
2016-07-14,37.4714
2016-07-15,37.5658
2016-07-18,37.698
2016-07-19,37.4903
2016-07-20,37.7735
2016-07-21,36.4423
2016-07-22,36.9993
2016-07-25,36.8671
2016-07-26,37.3864
2016-07-27,37.698
2016-07-28,37.6035
2016-07-29,37.3759
2016-08-01,37.1861
2016-08-02,36.8067
2016-08-03,37.2051
2016-08-04,36.9395
2016-08-05,38.4194
2016-08-08,38.5047
2016-08-09,38.2107
2016-08-10,37.7933
2016-08-11,37.983
2016-08-12,37.6889
2016-08-15,38.0968
2016-08-16,37.9355
2016-08-17,38.1442
2016-08-18,38.1727
2016-08-19,38.1822
2016-08-22,38.1158
2016-08-23,38.1822
2016-08-24,38.2201
2016-08-25,38.4478
2016-08-26,38.7514
2016-08-29,39.1403
2016-08-30,39.5672
2016-08-31,39.5292
2016-09-01,39.3395
2016-09-02,39.5103
2016-09-06,39.349
2016-09-07,39.1688
2016-09-08,39.3111
2016-09-09,38.8273
2016-09-12,39.33
2016-09-13,38.647
2016-09-14,38.4573
2016-09-15,38.7514
2016-09-16,38.002
2016-09-19,38.0304
2016-09-20,38.1158
2016-09-21,38.4383
2016-09-22,38.2771
2016-09-23,38.1348
2016-09-26,37.5182
2016-09-27,37.4707
2016-09-28,37.4707
2016-09-29,37.0533
2016-09-30,37.8312
2016-10-03,37.651
2016-10-04,38.1348
2016-10-05,38.7324
2016-10-06,38.6375
2016-10-07,38.4858
2016-10-10,38.5901
2016-10-11,37.8976
2016-10-12,38.0589
2016-10-13,37.0818
2016-10-14,37.4423
2016-10-17,37.281
2016-10-18,37.9735
2016-10-19,38.3529
2016-10-20,40.0794
2016-10-21,40.8383
2016-10-24,41.1799
2016-10-25,41.1704
2016-10-26,41.3696
2016-10-27,41.455
2016-10-28,41.4454
2016-10-31,41.2263
2016-11-01,41.3502
2016-11-02,40.8452
2016-11-03,41.0072
2016-11-04,40.9595
2016-11-07,41.9504
2016-11-08,41.8075
2016-11-09,43.3891
2016-11-10,44.0274
2016-11-11,44.5229
2016-11-14,45.2851
2016-11-15,45.6662
2016-11-16,44.8278
2016-11-17,45.3518
2016-11-18,45.1993
2016-11-21,45.1803
2016-11-22,45.0183
2016-11-23,45.2279
2016-11-25,45.2279
2016-11-28,44.8087
2016-11-29,44.8278
2016-11-30,45.1803
2016-12-01,46.3046
2016-12-02,45.3994
2016-12-05,45.5995
2016-12-06,45.7234
2016-12-07,46.2569
2016-12-08,46.8476
2016-12-09,46.3236
2016-12-12,45.9425
2016-12-13,45.9997
2016-12-14,45.7996
2016-12-15,46.0664
2016-12-16,45.3137
2016-12-19,45.0469
2016-12-20,45.428
2016-12-21,45.3041
2016-12-22,45.3613
2016-12-23,45.3327
2016-12-27,45.4756
2016-12-28,45.3994
2016-12-29,45.1041
2016-12-30,45.1422
2017-01-03,45.6948
2017-01-04,46.4094
2017-01-05,45.8186
2017-01-06,45.8949
2017-01-09,45.3899
2017-01-10,45.4661
2017-01-11,45.7615
2017-01-12,45.2184
2017-01-13,45.4852
2017-01-17,44.237
2017-01-18,44.0465
2017-01-19,42.7221
2017-01-20,42.4554
2017-01-23,41.798
2017-01-24,42.5221
2017-01-25,42.7888
2017-01-26,42.846
2017-01-27,42.846
2017-01-30,42.7407
2017-01-31,42.7982
2017-02-01,43.0756
2017-02-02,42.8651
2017-02-03,43.6976
2017-02-06,43.688
2017-02-07,43.4871
2017-02-08,43.1905
2017-02-09,43.5349
2017-02-10,43.5923
2017-02-13,44.1281
2017-02-14,44.7979
2017-02-15,45.3815
2017-02-16,45.0371
2017-02-17,45.1041
2017-02-21,45.4485
2017-02-22,45.2476
2017-02-23,45.2954
2017-02-24,45.0562
2017-02-27,45.0754
2017-02-28,45.1041
2017-03-01,46.4053
2017-03-02,45.9174
2017-03-03,45.8791
2017-03-06,45.8312
2017-03-07,45.6112
2017-03-08,46.1087
2017-03-09,45.86
2017-03-10,46.0896
2017-03-13,46.2618
2017-03-14,46.1757
2017-03-15,46.2427
2017-03-16,46.3766
2017-03-17,45.8408
2017-03-20,45.1711
2017-03-21,44.4152
2017-03-22,44.1664
2017-03-23,44.2812
2017-03-24,44.2525
2017-03-27,44.2525
2017-03-28,44.9701
2017-03-29,44.7022
2017-03-30,45.4772
2017-03-31,45.1902
2017-04-03,45.0945
2017-04-04,44.9414
2017-04-05,44.9701
2017-04-06,45.2667
2017-04-07,45.1136
2017-04-10,45.0275
2017-04-11,45.2189
2017-04-12,44.8649
2017-04-13,44.4152
2017-04-17,45.018
2017-04-18,44.8649
2017-04-19,44.8362
2017-04-20,44.6352
2017-04-21,44.7309
2017-04-24,45.4964
2017-04-25,45.1902
2017-04-26,45.1136
2017-04-27,45.1806
2017-04-28,45.2095
2017-05-01,45.3247
2017-05-02,45.2671
2017-05-03,45.5361
2017-05-04,45.7378
2017-05-05,45.7763
2017-05-08,45.8051
2017-05-09,45.2671
2017-05-10,45.3055
2017-05-11,45.0846
2017-05-12,44.9212
2017-05-15,45.2575
2017-05-16,45.3247
2017-05-17,44.4697
2017-05-18,44.3833
2017-05-19,44.7099
2017-05-22,44.9597
2017-05-23,45.1806
2017-05-24,45.1134
2017-05-25,45.5169
2017-05-26,45.5457
2017-05-30,45.2479
2017-05-31,45.2671
2017-06-01,45.5553
2017-06-02,45.6418
2017-06-05,45.6706
2017-06-06,45.3728
2017-06-07,46.0164
2017-06-08,46.4872
2017-06-09,47.4574
2017-06-12,47.1692
2017-06-13,47.6208
2017-06-14,47.8129
2017-06-15,47.8225
2017-06-16,47.9282
2017-06-19,48.3028
2017-06-20,47.8993
2017-06-21,47.64
2017-06-22,47.6015
2017-06-23,47.2365
2017-06-26,47.6015
2017-06-27,47.7264
2017-06-28,48.6102
2017-06-29,49.0041
2017-06-30,49.0137
2017-07-03,49.7919
2017-07-05,50.2146
2017-07-06,49.2155
2017-07-07,49.715
2017-07-10,49.8399
2017-07-11,49.446
2017-07-12,49.4268
2017-07-13,50.0128
2017-07-14,50.301
2017-07-17,51.2521
2017-07-18,51.425
2017-07-19,50.9735
2017-07-20,51.7901
2017-07-21,51.2617
2017-07-24,51.3674
2017-07-25,51.6172
2017-07-26,51.2905
2017-07-27,50.7814
2017-07-28,50.82
2017-07-31,51.177
2017-08-01,52.1324
2017-08-02,52.0263
2017-08-03,51.9394
2017-08-04,52.1324
2017-08-07,51.8333
2017-08-08,51.9105
2017-08-09,52.1517
2017-08-10,50.1348
2017-08-11,50.3664
2017-08-14,50.984
2017-08-15,51.2928
2017-08-16,51.0323
2017-08-17,49.99
2017-08-18,50.2795
2017-08-21,50.3664
2017-08-22,50.82
2017-08-23,50.9261
2017-08-24,50.9454
2017-08-25,50.8103
2017-08-28,50.4436
2017-08-29,50.2699
2017-08-30,50.5304
2017-08-31,50.4532
2017-09-01,50.5015
2017-09-05,49.411
2017-09-06,49.4785
2017-09-07,48.5231
2017-09-08,48.6679
2017-09-11,49.7294
2017-09-12,50.1734
2017-09-13,49.7874
2017-09-14,49.3434
2017-09-15,49.7584
2017-09-18,49.8935
2017-09-19,50.2216
2017-09-20,50.569
2017-09-21,50.5884
2017-09-22,50.5401
2017-09-25,50.376
2017-09-26,50.2988
2017-09-27,50.9165
2017-09-28,51.1577
2017-09-29,51.1674
2017-10-02,51.7754
2017-10-03,51.9201
2017-10-04,51.9201
2017-10-05,52.5281
2017-10-06,52.5667
2017-10-09,52.4316
2017-10-10,52.7501
2017-10-11,52.9624
2017-10-12,52.8273
2017-10-13,52.7597
2017-10-16,52.7983
2017-10-17,52.0745
2017-10-18,52.5571
2017-10-19,51.0033
2017-10-20,51.2639
2017-10-23,50.6752
2017-10-24,51.0323
2017-10-25,49.9514
2017-10-26,50.3953
2017-10-27,50.3181
2017-10-30,50.0758
2017-10-31,49.8819
2017-11-01,50.0758
2017-11-02,49.8334
2017-11-03,49.7655
2017-11-06,49.7849
2017-11-07,49.5134
2017-11-08,49.6589
2017-11-09,49.2711
2017-11-10,49.3777
2017-11-13,49.465
2017-11-14,50.2697
2017-11-15,50.3569
2017-11-16,50.6381
2017-11-17,50.8708
2017-11-20,50.9192
2017-11-21,50.8223
2017-11-22,50.832
2017-11-24,50.6381
2017-11-27,50.5896
2017-11-28,51.5106
2017-11-29,52.7516
2017-11-30,53.0716
2017-12-01,52.7904
2017-12-04,53.2946
2017-12-05,52.771
2017-12-06,52.3735
2017-12-07,52.5674
2017-12-08,53.0037
2017-12-11,52.8777
2017-12-12,53.2946
2017-12-13,52.7225
2017-12-14,52.3735
2017-12-15,52.548
2017-12-18,52.7613
2017-12-19,52.548
2017-12-20,52.3057
2017-12-21,52.7032
2017-12-22,52.3541
2017-12-26,52.1699
2017-12-27,52.199
2017-12-28,52.4705
2017-12-29,52.2184
2018-01-02,52.1796
2018-01-03,52.4996
2018-01-04,53.0231
2018-01-05,53.1588
2018-01-08,53.3818
2018-01-09,53.8666
2018-01-10,55.5535
2018-01-11,56.0674
2018-01-12,56.6394
2018-01-16,55.7862
2018-01-17,56.1256
2018-01-18,53.663
2018-01-19,54.8846
2018-01-22,55.9607
2018-01-23,55.9607
2018-01-24,56.0092
2018-01-25,55.1173
2018-01-26,56.0189
2018-01-29,55.9995
2018-01-30,55.2011
2018-01-31,55.2011
2018-02-01,55.98
2018-02-02,54.8409
2018-02-05,52.9425
2018-02-06,54.0231
2018-02-07,53.8771
2018-02-08,51.8813
2018-02-09,52.6504
2018-02-12,53.1664
2018-02-13,53.3611
2018-02-14,54.5002
2018-02-15,54.6754
2018-02-16,54.763
2018-02-20,54.9285
2018-02-21,54.9577
2018-02-22,54.4223
2018-02-23,55.3959
2018-02-26,56.642
2018-02-27,56.457
2018-02-28,55.5224
2018-03-01,54.0426
2018-03-02,53.9063
2018-03-05,54.9188
2018-03-06,55.3666
2018-03-07,55.3959
2018-03-08,54.2178
2018-03-09,55.7171
2018-03-12,54.948
2018-03-13,54.4807
2018-03-14,53.4195
2018-03-15,53.4
2018-03-16,53.5461
2018-03-19,52.9035
2018-03-20,52.9911
2018-03-21,53.1664
2018-03-22,50.6449
2018-03-23,49.389
2018-03-26,50.7617
2018-03-27,49.3792
2018-03-28,49.2721
2018-03-29,50.1678
2018-04-02,48.8243
2018-04-03,49.6421
2018-04-04,50.1191
2018-04-05,50.3625
2018-04-06,49.019
2018-04-09,49.1845
2018-04-10,50.0218
2018-04-11,49.6031
2018-04-12,50.6351
2018-04-13,50.2068
2018-04-16,50.6156
2018-04-17,50.8104
2018-04-18,50.8785
2018-04-19,53.7797
2018-04-20,53.955
2018-04-23,54.2568
2018-04-24,53.9258
2018-04-25,53.9355
2018-04-26,53.9744
2018-04-27,53.8576
2018-04-30,53.3002
2018-05-01,52.9874
2018-05-02,52.7918
2018-05-03,52.6549
2018-05-04,53.2807
2018-05-07,54.3563
2018-05-08,54.8354
2018-05-09,55.5981
2018-05-10,55.999
2018-05-11,55.911
2018-05-14,56.0283
2018-05-15,55.6274
2018-05-16,55.7937
2018-05-17,56.0088
2018-05-18,55.6959
2018-05-21,56.439
2018-05-22,56.3119
2018-05-23,56.175
2018-05-24,55.9697
2018-05-25,55.735
2018-05-29,53.9652
2018-05-30,54.1705
2018-05-31,53.5349
2018-06-01,54.1216
2018-06-04,54.5323
2018-06-05,54.3563
2018-06-06,55.3145
2018-06-07,56.3706
2018-06-08,56.2826
2018-06-11,56.4195
2018-06-12,56.3901
2018-06-13,56.0479
2018-06-14,55.5394
2018-06-15,55.6665
2018-06-18,55.9697
2018-06-19,56.0674
2018-06-20,56.0968
2018-06-21,55.8817
2018-06-22,55.4905
2018-06-25,54.4345
2018-06-26,53.9554
2018-06-27,52.9971
2018-06-28,53.0949
2018-06-29,52.7331
2018-07-02,52.8896
2018-07-03,52.0095
2018-07-05,52.0193
2018-07-06,52.0193
2018-07-09,52.9091
2018-07-10,52.8309
2018-07-11,52.2051
2018-07-12,52.3127
2018-07-13,51.8531
2018-07-16,52.5082
2018-07-17,52.8505
2018-07-18,54.4052
2018-07-19,51.5598
2018-07-20,51.2957
2018-07-23,52.0682
2018-07-24,52.9874
2018-07-25,52.1171
2018-07-26,52.2149
2018-07-27,52.2247
2018-07-30,52.549
2018-07-31,52.5588
2018-08-01,52.3721
2018-08-02,51.7332
2018-08-03,51.8708
2018-08-06,52.1263
2018-08-07,52.0379
2018-08-08,52.2345
2018-08-09,51.399
2018-08-10,50.1506
2018-08-13,49.2856
2018-08-14,50.1014
2018-08-15,50.0916
2018-08-16,50.6421
2018-08-17,50.8092
2018-08-20,51.0549
2018-08-21,51.6447
2018-08-22,51.6054
2018-08-23,51.4383
2018-08-24,51.6644
2018-08-27,52.0772
2018-08-28,51.9887
2018-08-29,51.6054
2018-08-30,51.34
2018-08-31,51.2613
2018-09-04,51.5071
2018-09-05,51.3596
2018-09-06,51.3007
2018-09-07,51.2908
2018-09-10,51.1434
2018-09-11,51.3498
2018-09-12,51.1237
2018-09-13,50.3472
2018-09-14,50.7699
2018-09-17,50.3472
2018-09-18,50.5733
2018-09-19,51.5366
2018-09-20,52.4212
2018-09-21,52.4802
2018-09-24,51.4776
2018-09-25,51.4186
2018-09-26,51.0353
2018-09-27,50.6617
2018-09-28,50.1211
2018-10-01,51.0156
2018-10-02,50.8682
2018-10-03,51.2908
2018-10-04,51.7823
2018-10-05,51.6938
2018-10-08,51.8806
2018-10-09,51.34
2018-10-10,49.8557
2018-10-11,48.3518
2018-10-12,48.2633
2018-10-15,47.6244
2018-10-16,48.5091
2018-10-17,48.3125
2018-10-18,46.9756
2018-10-19,46.5923
2018-10-22,45.6781
2018-10-23,45.4914
2018-10-24,44.5576
2018-10-25,45.3636
2018-10-26,44.6952
2018-10-29,45.2688
2018-10-30,46.4062
2018-10-31,46.8117
2018-11-01,46.9997
2018-11-02,46.6931
2018-11-05,47.4447
2018-11-06,47.7909
2018-11-07,48.236
2018-11-08,48.4931
2018-11-09,47.9689
2018-11-12,47.4546
2018-11-13,47.6722
2018-11-14,47.7019
2018-11-15,48.681
2018-11-16,48.8492
2018-11-19,49.5712
2018-11-20,48.8393
2018-11-21,49.4129
2018-11-23,49.314
2018-11-26,50.3723
2018-11-27,50.8075
2018-11-28,51.0449
2018-11-29,50.1251
2018-11-30,50.7482
2018-12-03,50.0855
2018-12-04,48.1667
2018-12-06,47.3162
2018-12-07,47.1876
2018-12-10,47.0392
2018-12-11,47.148
2018-12-12,47.5337
2018-12-13,47.5634
2018-12-14,48.1371
2018-12-17,48.4437
2018-12-18,46.2183
2018-12-19,45.0018
2018-12-20,44.5171
2018-12-21,44.1512
2018-12-24,44.0028
2018-12-26,45.6546
2018-12-27,46.3073
2018-12-28,46.1392
2018-12-31,46.5546
2019-01-02,46.9799
2019-01-03,46.0502
2019-01-04,47.3854
2019-01-07,47.2766
2019-01-08,47.0986
2019-01-09,47.237
2019-01-10,46.9502
2019-01-11,47.5535
2019-01-14,47.8898
2019-01-15,48.869
2019-01-16,49.8778
2019-01-17,50.9657
2019-01-18,52.0834
2019-01-22,52.0141
2019-01-23,52.479
2019-01-24,53.1219
2019-01-25,53.092
2019-01-28,53.1318
2019-01-29,52.3066
2019-01-30,52.2271
2019-01-31,52.0183
2019-02-01,52.3165
2019-02-04,52.0779
2019-02-05,52.3165
2019-02-06,52.0183
2019-02-07,51.8095
2019-02-08,51.5311
2019-02-11,51.7101
2019-02-12,52.5353
2019-02-13,52.1276
2019-02-14,51.4714
2019-02-15,52.6844
2019-02-19,52.6844
2019-02-20,53.0125
2019-02-21,52.6446
2019-02-22,52.9131
2019-02-25,52.6248
2019-02-26,52.7341
2019-02-27,52.4458
2019-02-28,52.1773
2019-03-01,52.3861
2019-03-04,51.6106
2019-03-05,52.3464
2019-03-06,51.7598
2019-03-07,50.9346
2019-03-08,51.1831
2019-03-11,51.5311
2019-03-12,51.6106
2019-03-13,52.1376
2019-03-14,52.4557
2019-03-15,52.8137
2019-03-18,53.6687
2019-03-19,52.8137
2019-03-20,51.6802
2019-03-21,51.5907
2019-03-22,50.2088
2019-03-25,49.99
2019-03-26,50.5468
2019-03-27,49.8111
2019-03-28,50.0994
2019-03-29,50.1392
2019-04-01,51.1632
2019-04-02,51.0539
2019-04-03,50.9445
2019-04-04,51.1533
2019-04-05,50.8848
2019-04-08,50.9544
2019-04-09,50.6959
2019-04-10,50.9942
2019-04-11,51.3919
2019-04-12,52.5054
2019-04-15,52.2967
2019-04-16,53.1318
2019-04-17,48.0712
2019-04-18,48.1308
2019-04-22,47.9121
2019-04-23,48.1905
2019-04-24,47.8723
2019-04-25,48.27
2019-04-26,48.43
2019-04-29,49.38
2019-04-30,49.66
2019-05-01,49.43
2019-05-02,49.83
2019-05-03,49.97
2019-05-06,49.33
2019-05-07,48.14
2019-05-08,48.05
2019-05-09,47.78
2019-05-10,48.1
2019-05-13,47.15
2019-05-14,47.01
2019-05-15,46.51
2019-05-16,46.54
2019-05-17,46.08
2019-05-20,45.97
2019-05-21,46.21
2019-05-22,46.16
2019-05-23,45.24
2019-05-24,45.16
2019-05-28,44.33
2019-05-29,44.06
2019-05-30,43.25
2019-05-31,42.69
2019-06-03,43.05
2019-06-04,44.29
2019-06-05,43.61
2019-06-06,43.82
2019-06-07,44.4
2019-06-10,44.9
2019-06-11,44.5
2019-06-12,44.1
2019-06-13,44.5
2019-06-14,44.65
2019-06-17,44.05
2019-06-18,43.26
2019-06-19,42.62
2019-06-20,43.095
2019-06-21,43.715
2019-06-24,43.07
2019-06-25,43.5
2019-06-26,43.175
2019-06-27,43.445
2019-06-28,43.965
2019-07-01,44.41
2019-07-02,44.14
2019-07-03,44.595
2019-07-04,44.595
2019-07-05,44.395
2019-07-08,43.1
2019-07-09,43.32
2019-07-10,42.975
2019-07-11,43.635
2019-07-12,43.56
2019-07-15,43.09
2019-07-16,43.155
2019-07-17,44.21
2019-07-18,44.865
2019-07-19,45.335
2019-07-22,45.81
2019-07-23,46.755
2019-07-24,47.115
2019-07-25,47.275
2019-07-26,47.595
2019-07-29,46.85
2019-07-30,47.045
2019-07-31,47.025
2019-08-01,45.95
2019-08-02,46.07
2019-08-05,45.105
2019-08-06,45.415
2019-08-07,44.75
2019-08-08,45.55
2019-08-09,45.795
2019-08-12,44.435
2019-08-13,43.62
2019-08-14,41.94
2019-08-15,41.71
2019-08-16,42.385
2019-08-19,42.785
2019-08-20,41.96
2019-08-21,41.92
2019-08-22,42.23
2019-08-23,40.79
2019-08-26,41.055
2019-08-27,41.005
2019-08-28,41.035
2019-08-29,41.675
2019-08-30,42.14
2019-09-02,42.105
2019-09-03,41.565
2019-09-04,41.925
2019-09-05,42.855
2019-09-06,42.985
2019-09-09,45.49
2019-09-10,45.77
2019-09-11,46.3
2019-09-12,46.335
2019-09-13,46.845
2019-09-16,46.765
2019-09-17,46.325
2019-09-18,47
2019-09-19,46.96
2019-09-20,46.49
2019-09-23,46.745
2019-09-24,46.255
2019-09-25,46.925
2019-09-26,46.6
2019-09-27,44.555
2019-09-30,45.2
2019-10-01,43.755
2019-10-02,42.475
2019-10-03,42.37
2019-10-04,42.755
2019-10-07,42.345
2019-10-08,42.33
2019-10-09,42.835
2019-10-10,43.525
2019-10-11,44.165
2019-10-14,43.965
2019-10-15,44.345
2019-10-16,44.495
2019-10-17,44.38
2019-10-18,45.39
2019-10-21,45.665
2019-10-22,46.215
2019-10-23,46.71
2019-10-24,46.24
2019-10-25,46.405
2019-10-28,46.905
2019-10-29,46.685
2019-10-30,46.605
2019-10-31,46.695
2019-11-01,47.165
2019-11-04,48.685
2019-11-05,49.115
2019-11-06,49.08
2019-11-07,49.425
2019-11-08,49.19
2019-11-11,49.015
2019-11-12,48.885
2019-11-13,48.335
2019-11-14,48.435
2019-11-15,48.47
2019-11-18,48.685
2019-11-19,48.605
2019-11-20,48.86
2019-11-21,48.6
2019-11-22,48.775
2019-11-25,49.32
