date,close
2016-03-17,13.4
2016-03-18,13.5
2016-03-21,13.5
2016-03-22,13.38
2016-03-23,13.38
2016-03-24,13.49
2016-03-28,13.36
2016-03-29,13.33
2016-03-30,13.25
2016-03-31,13.2
2016-04-01,13.5
2016-04-04,13.41
2016-04-05,13.25
2016-04-06,13.34
2016-04-07,13.3
2016-04-08,13.3
2016-04-11,13.31
2016-04-12,13.37
2016-04-13,13.41
2016-04-14,13.46
2016-04-15,13.48
2016-04-18,13.48
2016-04-19,13.35
2016-04-20,13.52
2016-04-21,13.4
2016-04-22,13.4
2016-04-25,13.41
2016-04-26,13.45
2016-04-27,13.4
2016-04-28,13.33
2016-04-29,13.1
2016-05-02,12.95
2016-05-03,13
2016-05-04,13.08
2016-05-05,12.5
2016-05-06,13.8
2016-05-09,13.18
2016-05-10,12.93
2016-05-11,13.02
2016-05-12,12.8
2016-05-13,12.5
2016-05-16,12.77
2016-05-17,12.52
2016-05-18,12.48
2016-05-19,12.68
2016-05-20,12.32
2016-05-23,12.5
2016-05-24,12.5
2016-05-25,12.52
2016-05-26,12.53
2016-05-27,13.1
2016-05-31,12.52
2016-06-01,13.45
2016-06-02,13.51
2016-06-03,13.46
2016-06-06,13.53
2016-06-07,13.75
2016-06-08,14.02
2016-06-09,13.8
2016-06-10,13.95
2016-06-13,13.41
2016-06-14,13.36
2016-06-15,14.18
2016-06-16,13.47
2016-06-17,14
2016-06-20,13.7
2016-06-21,13.73
2016-06-22,13.7876
2016-06-23,13.8161
2016-06-24,13.225
2016-06-27,12.95
2016-06-28,13.0576
2016-06-29,13.28
2016-06-30,13.15
2016-07-01,13.15
2016-07-05,13.32
2016-07-06,13.08
2016-07-07,13.34
2016-07-08,13.76
2016-07-11,13.355
2016-07-12,12.99
2016-07-13,13.03
2016-07-14,13.5
2016-07-15,13.48
2016-07-18,13.29
2016-07-19,13
2016-07-20,13.01
2016-07-21,13
2016-07-22,12.93
2016-07-25,13.08
2016-07-26,13.085
2016-07-27,13.18
2016-07-28,13.11
2016-07-29,13.13
2016-08-01,13.19
2016-08-02,13.09
2016-08-03,13.001
2016-08-04,13.01
2016-08-05,13.03
2016-08-08,13.02
2016-08-09,13.019
2016-08-10,12.93
2016-08-11,12.83
2016-08-12,13.14
2016-08-15,12.94
2016-08-16,12.71
2016-08-17,12.8
2016-08-18,12.75
2016-08-19,12.42
2016-08-22,12.5
2016-08-23,12.72
2016-08-24,12.7
2016-08-25,12.7
2016-08-26,12.95
2016-08-29,12.9999
2016-08-30,12.42
2016-08-31,12.45
2016-09-01,12.445
2016-09-02,12.54
2016-09-06,12.53
2016-09-07,12.51
2016-09-08,12.5
2016-09-09,12.5
2016-09-12,12.5
2016-09-13,12.5
2016-09-14,12.438
2016-09-15,12.38
2016-09-16,12.47
2016-09-19,12.29
2016-09-20,12.19
2016-09-21,12.2472
2016-09-22,12.1
2016-09-23,12.28
2016-09-26,12.17
2016-09-27,12.06
2016-09-28,12.095
2016-09-29,12
2016-09-30,11.9
2016-10-03,11.99
2016-10-04,12.1
2016-10-05,12.17
2016-10-06,11.91
2016-10-07,11.81
2016-10-10,11.77
2016-10-11,11.59
2016-10-12,11.26
2016-10-13,11.4
2016-10-14,11.3
2016-10-17,11.39
2016-10-18,11.54
2016-10-19,11.5
2016-10-20,11.63
2016-10-21,11.67
2016-10-24,11.63
2016-10-25,11.79
2016-10-26,11.76
2016-10-27,11.82
2016-10-28,11.88
2016-10-31,12.06
2016-11-01,11.94
2016-11-02,12.05
2016-11-03,11.92
2016-11-04,12
2016-11-07,11.86
2016-11-08,11.78
2016-11-09,13.79
2016-11-10,12.53
2016-11-11,12.1
2016-11-14,12.15
2016-11-15,11.8
2016-11-16,11.96
2016-11-17,12.01
2016-11-18,12.31
2016-11-21,12.49
2016-11-22,12.55
2016-11-23,12.57
2016-11-25,12.57
2016-11-28,13
2016-11-29,13
2016-11-30,13.84
2016-12-01,13.62
2016-12-02,14.36
2016-12-05,14.87
2016-12-06,14.94
2016-12-07,14.79
2016-12-08,14.49
2016-12-09,14
2016-12-12,13.77
2016-12-13,14.67
2016-12-14,14.76
2016-12-15,14.65
2016-12-16,14.03
2016-12-19,14.19
2016-12-20,14.3
2016-12-21,14
2016-12-22,14.23
2016-12-23,13.855
2016-12-27,14.1
2016-12-28,13.9209
2016-12-29,13.71
2016-12-30,13.57
2017-01-03,14.95
2017-01-04,14.3
2017-01-05,14.29
2017-01-06,14
2017-01-09,13.64
2017-01-10,13.7
2017-01-11,13.97
2017-01-12,13.825
2017-01-13,13.81
2017-01-17,13.8
2017-01-18,13.85
2017-01-19,13.83
2017-01-20,13.89
2017-01-23,13.63
2017-01-24,13.2
2017-01-25,13.97
2017-01-26,13.59
2017-01-27,13.87
2017-01-30,14.12
2017-01-31,14.09
2017-02-01,13.96
2017-02-02,13.98
2017-02-03,13.97
2017-02-06,13.64
2017-02-07,13.74
2017-02-08,13.5
2017-02-09,13.7
2017-02-10,13.59
2017-02-13,13.49
2017-02-14,13.53
2017-02-15,13.53
2017-02-16,13.4
2017-02-17,13.38
2017-02-21,13.32
2017-02-22,13.4
2017-02-23,13.4
2017-02-24,13.34
2017-02-27,13.38
2017-02-28,12.74
2017-03-01,12.9
2017-03-02,12.85
2017-03-03,13.11
2017-03-06,14.85
2017-03-07,14.28
2017-03-08,14.36
2017-03-09,14.25
2017-03-10,14.16
2017-03-13,15.97
2017-03-14,16
2017-03-15,20.54
2017-03-16,18.99
2017-03-17,19
2017-03-20,18.76
2017-03-21,19.43
2017-03-22,18.75
2017-03-23,18.71
2017-03-24,19.01
2017-03-27,19.58
2017-03-28,19.51
2017-03-29,19.52
2017-03-30,20.57
2017-03-31,19.95
2017-04-03,20.12
2017-04-04,19.45
2017-04-05,20.25
2017-04-06,20.13
2017-04-07,20.27
2017-04-10,20.15
2017-04-11,19.8
2017-04-12,20
2017-04-13,20.14
2017-04-17,20.08
2017-04-18,19.01
2017-04-19,19.21
2017-04-20,18.51
2017-04-21,18.33
2017-04-24,18.88
2017-04-25,19.82
2017-04-26,19.47
2017-04-27,18.59
2017-04-28,19.49
2017-05-01,19.02
2017-05-02,18.3
2017-05-03,19.09
2017-05-04,18.68
2017-05-05,18.96
2017-05-08,19.18
2017-05-09,19.26
2017-05-10,18.78
2017-05-11,18.99
2017-05-12,18.87
2017-05-15,19.88
2017-05-16,20.02
2017-05-17,20.8
2017-05-18,19.7
2017-05-19,20.22
2017-05-22,20.15
2017-05-23,20.52
2017-05-24,20.75
2017-05-25,20.75
2017-05-26,20.99
2017-05-30,20.83
2017-05-31,21.23
2017-06-01,21
2017-06-02,20.59
2017-06-05,20.685
2017-06-06,20.54
2017-06-07,20.42
2017-06-08,20.84
2017-06-09,19.885
2017-06-12,20.52
2017-06-13,21.09
2017-06-14,21.15
2017-06-15,22.63
2017-06-16,22.93
2017-06-19,23.59
2017-06-20,23.24
2017-06-21,23.27
2017-06-22,23.6
2017-06-23,23.69
2017-06-26,23.54
2017-06-27,22.91
2017-06-28,23.53
2017-06-29,23.42
2017-06-30,23.31
2017-07-03,23.11
2017-07-05,23.75
2017-07-06,23.31
2017-07-07,23.315
2017-07-10,23.15
2017-07-11,22.61
2017-07-12,22.54
2017-07-13,22.5
2017-07-14,22.95
2017-07-17,23.3
2017-07-18,23.39
2017-07-19,23.01
2017-07-20,22.94
2017-07-21,22.96
2017-07-24,23.35
2017-07-25,23.5
2017-07-26,23.5
2017-07-27,22.62
2017-07-28,23.12
2017-07-31,22.15
2017-08-01,22.58
2017-08-02,23.29
2017-08-03,23.8
2017-08-04,24.6
2017-08-07,26.96
2017-08-08,27.5
2017-08-09,26.47
2017-08-10,25.6
2017-08-11,24.38
2017-08-14,24.59
2017-08-15,25.08
2017-08-16,25.13
2017-08-17,24.83
2017-08-18,25.06
2017-08-21,24.06
2017-08-22,24.45
2017-08-23,24
2017-08-24,23.5
2017-08-25,24.2
2017-08-28,24.42
2017-08-29,24.66
2017-08-30,24.72
2017-08-31,25.15
2017-09-01,25.7
2017-09-05,25.84
2017-09-06,25.63
2017-09-07,25.43
2017-09-08,25.28
2017-09-11,25.02
2017-09-12,25.33
2017-09-13,25.23
2017-09-14,25.53
2017-09-15,25.59
2017-09-18,25.26
2017-09-19,25.6
2017-09-20,25.55
2017-09-21,25.5
2017-09-22,25.88
2017-09-25,25.78
2017-09-26,26.6
2017-09-27,27.22
2017-09-28,27.24
2017-09-29,27.27
2017-10-02,27.96
2017-10-03,30.67
2017-10-04,30.2
2017-10-05,29.67
2017-10-06,29.59
2017-10-09,29.63
2017-10-10,30
2017-10-11,31.15
2017-10-12,30.31
2017-10-13,30.45
2017-10-16,30.39
2017-10-17,29.86
2017-10-18,28.82
2017-10-19,27.41
2017-10-20,27.77
2017-10-23,27.5
2017-10-24,27.69
2017-10-25,29.08
2017-10-26,30.64
2017-10-27,31.74
2017-10-30,31.08
2017-10-31,30.45
2017-11-01,30.37
2017-11-02,29.49
2017-11-03,29.57
2017-11-06,29.62
2017-11-07,30.2
2017-11-08,30.22
2017-11-09,30.25
2017-11-10,29.99
2017-11-13,30.54
2017-11-14,31.35
2017-11-15,34.36
2017-11-16,35.42
2017-11-17,35.15
2017-11-20,34.22
2017-11-21,34.78
2017-11-22,34.61
2017-11-24,34.59
2017-11-27,33.97
2017-11-28,33.57
2017-11-29,33.22
2017-11-30,34.59
2017-12-01,34.57
2017-12-04,35.04
2017-12-05,33.71
2017-12-06,33.85
2017-12-07,34.21
2017-12-08,33.89
2017-12-11,31.17
2017-12-12,30.26
2017-12-13,31.06
2017-12-14,31.11
2017-12-15,32.88
2017-12-18,33.11
2017-12-19,32.71
2017-12-20,32.49
2017-12-21,33.96
2017-12-22,36.97
2017-12-26,35.3
2017-12-27,36.14
2017-12-28,38.52
2017-12-29,39.42
2018-01-02,41.135
2018-01-03,40.12
2018-01-04,40.34
2018-01-05,40.48
2018-01-08,41.09
2018-01-09,40.2
2018-01-10,38.82
2018-01-11,38.45
2018-01-12,38.98
2018-01-16,40.22
2018-01-17,39.52
2018-01-18,39.77
2018-01-19,39.56
2018-01-22,39.37
2018-01-23,37.35
2018-01-24,37.81
2018-01-25,36.92
2018-01-26,36.01
2018-01-29,36.26
2018-01-30,37.26
2018-01-31,37.31
2018-02-01,37.08
2018-02-02,36.99
2018-02-05,35.2
2018-02-06,32.54
2018-02-07,33.79
2018-02-08,32.5
2018-02-09,30.62
2018-02-12,30.76
2018-02-13,32.13
2018-02-14,33.73
2018-02-15,33.81
2018-02-16,33.72
2018-02-20,34.48
2018-02-21,32.78
2018-02-22,33.98
2018-02-23,33.96
2018-02-26,34.61
2018-02-27,33.45
2018-02-28,33.655
2018-03-01,34.8
2018-03-02,34.41
2018-03-05,34.76
2018-03-06,35.59
2018-03-07,35.39
2018-03-08,36.09
2018-03-09,36.6
2018-03-12,36.9
2018-03-13,35.61
2018-03-14,35.43
2018-03-15,34.53
2018-03-16,33.68
2018-03-19,34.29
2018-03-20,35.23
2018-03-21,34.39
2018-03-22,32.68
2018-03-23,31.4
2018-03-26,30.51
2018-03-27,31.27
2018-03-28,28.87
2018-03-29,29.56
2018-04-02,29.68
2018-04-03,29.99
2018-04-04,30.15
2018-04-05,29.91
2018-04-06,29.67
2018-04-09,30.43
2018-04-10,31.24
2018-04-11,31.28
2018-04-12,31.25
2018-04-13,32.05
2018-04-16,32.66
2018-04-17,32.63
2018-04-18,33.16
2018-04-19,33.63
2018-04-20,32.93
2018-04-23,32.96
2018-04-24,33.5
2018-04-25,33.38
2018-04-26,32.96
2018-04-27,33.49
2018-04-30,34.05
2018-05-01,33.42
2018-05-02,33.55
2018-05-03,33.73
2018-05-04,33.58
2018-05-07,33.62
2018-05-08,33.65
2018-05-09,34.49
2018-05-10,34.08
2018-05-11,34.34
2018-05-14,34.46
2018-05-15,33.69
2018-05-16,33.17
2018-05-17,33.01
2018-05-18,33.01
2018-05-21,33.29
2018-05-22,33.67
2018-05-23,33.59
2018-05-24,31.4
2018-05-25,30.16
2018-05-29,30.07
2018-05-30,28.7
2018-05-31,29.1
2018-06-01,27.79
2018-06-04,28.65
2018-06-05,28.73
2018-06-06,28.21
2018-06-07,28.81
2018-06-08,31.33
2018-06-11,31.98
2018-06-12,32.26
2018-06-13,32.75
2018-06-14,31.7
2018-06-15,32.76
2018-06-18,30.11
2018-06-19,30.19
2018-06-20,31.15
2018-06-21,30.41
2018-06-22,31.11
2018-06-25,30.31
2018-06-26,30.4
2018-06-27,30.27
2018-06-28,30.58
2018-06-29,30.14
2018-07-02,30.03
2018-07-03,30.06
2018-07-05,30.4
2018-07-06,30.62
2018-07-09,29.72
2018-07-10,30.1
2018-07-11,30.95
2018-07-12,31.6
2018-07-13,31.67
2018-07-16,31.68
2018-07-17,31.83
2018-07-18,33.38
2018-07-19,32.84
2018-07-20,33.81
2018-07-23,34.34
2018-07-24,33.11
2018-07-25,33.81
2018-07-26,34.38
2018-07-27,34.38
2018-07-30,32.73
2018-07-31,31.77
2018-08-01,33.61
2018-08-02,32.09
2018-08-03,31.79
2018-08-06,32
2018-08-07,31.92
2018-08-08,31.48
2018-08-09,32.2
2018-08-10,32.9
2018-08-13,31.43
2018-08-14,31.05
2018-08-15,29.46
2018-08-16,29.67
2018-08-17,29.36
2018-08-20,29.03
2018-08-21,28.99
2018-08-22,28.86
2018-08-23,28.64
2018-08-24,28.93
2018-08-27,29.3
2018-08-28,30.06
2018-08-29,29.5
2018-08-30,29.46
2018-08-31,29.26
2018-09-04,28.74
2018-09-05,28.44
2018-09-06,26.55
2018-09-07,27.79
2018-09-10,27.81
2018-09-11,27.53
2018-09-12,28.12
2018-09-13,28.35
2018-09-14,28.25
2018-09-17,28.4
2018-09-18,28.25
2018-09-19,28.4
2018-09-20,28.81
2018-09-21,28.57
2018-09-24,28.58
2018-09-25,28.88
2018-09-26,30.09
2018-09-27,32.02
2018-09-28,32.19
2018-10-01,32.69
2018-10-02,31.78
2018-10-03,32.4
2018-10-04,31.41
2018-10-05,30.53
2018-10-08,30.37
2018-10-09,30.25
2018-10-10,29.03
2018-10-11,28.72
2018-10-12,28.67
2018-10-15,28.68
2018-10-16,30.02
2018-10-17,31
2018-10-18,29.97
2018-10-19,30.18
2018-10-22,29.96
2018-10-23,29.85
2018-10-24,29.98
2018-10-25,29.77
2018-10-26,29.61
2018-10-29,29.79
2018-10-30,31.14
2018-10-31,32.77
2018-11-01,32.31
2018-11-02,32.65
2018-11-05,32.69
2018-11-06,32.33
2018-11-07,32.15
2018-11-08,32.35
2018-11-09,32.09
2018-11-12,31.75
2018-11-13,32.15
2018-11-14,37.69
2018-11-15,36.6
2018-11-16,30.16
2018-11-19,30.9
2018-11-20,31.92
2018-11-21,32.25
2018-11-23,33.91
2018-11-26,35.67
2018-11-27,35.05
2018-11-28,36.11
2018-11-29,34.31
2018-11-30,34.47
2018-12-03,35.42
2018-12-04,32.93
2018-12-06,31.31
2018-12-07,31.62
2018-12-10,30.74
2018-12-11,30.46
2018-12-12,33.24
2018-12-13,34
2018-12-14,33.89
2018-12-17,32
2018-12-18,31.89
2018-12-19,31.39
2018-12-20,28.07
2018-12-21,24.27
2018-12-24,23.92
2018-12-26,23.94
2018-12-27,24.49
2018-12-28,23.17
2018-12-31,23.09
2019-01-02,22.8
2019-01-03,21.85
2019-01-04,21.45
2019-01-07,21.44
2019-01-08,21.86
2019-01-09,22.3
2019-01-10,22.46
2019-01-11,21.55
2019-01-14,21.27
2019-01-15,22
2019-01-16,21.99
2019-01-17,21.97
2019-01-18,22.15
2019-01-22,21.95
2019-01-23,22.25
2019-01-24,21.86
2019-01-25,22.28
2019-01-28,22.24
2019-01-29,22.26
2019-01-30,22.54
2019-01-31,22.7
2019-02-01,22.81
2019-02-04,22.69
2019-02-05,22.64
2019-02-06,22.77
2019-02-07,22.62
2019-02-08,22.7
2019-02-11,22.95
2019-02-12,24.12
2019-02-13,25.13
2019-02-14,25.05
2019-02-15,25.7
2019-02-19,24.95
2019-02-20,25.04
2019-02-21,24.98
2019-02-22,26.01
2019-02-25,26.46
2019-02-26,25.47
2019-02-27,25.8
2019-02-28,26.09
2019-03-01,26.82
2019-03-04,26.62
2019-03-05,27.13
2019-03-06,27.38
2019-03-07,26.41
2019-03-08,26.9
2019-03-11,27.96
2019-03-12,28.12
2019-03-13,28
2019-03-14,28
2019-03-15,27.92
2019-03-18,28.78
2019-03-19,29
2019-03-20,29.35
2019-03-21,29.71
2019-03-22,28.58
2019-03-25,28.52
2019-03-26,28.7
2019-03-27,29.27
2019-03-28,30.23
2019-03-29,30.58
2019-04-01,30.91
2019-04-02,31.22
2019-04-03,31.62
2019-04-04,31.04
2019-04-05,31.49
2019-04-08,31.78
2019-04-09,31.21
2019-04-10,31.49
2019-04-11,31.29
2019-04-12,31.2
2019-04-15,31.36
2019-04-16,30.97
2019-04-17,30.51
2019-04-18,30.35
2019-04-22,30.44
2019-04-23,29.72
2019-04-24,29.64
2019-04-25,29.25
2019-04-26,30.06
2019-04-29,29.77
2019-04-30,30.08
2019-05-01,29.59
2019-05-02,29.77
2019-05-03,29.86
2019-05-06,30.07
2019-05-07,29.23
2019-05-08,29.28
2019-05-09,25.61
2019-05-10,25.54
2019-05-13,23.6
2019-05-14,24.1
2019-05-15,26.39
2019-05-16,26.36
2019-05-17,26.74
2019-05-20,26.86
2019-05-21,26.75
2019-05-22,26.97
2019-05-23,26.9
2019-05-24,26.81
2019-05-28,27.92
2019-05-29,28.46
2019-05-30,27.3
2019-05-31,27.61
2019-06-03,27.84
2019-06-04,27.54
2019-06-05,28.1
2019-06-06,25.82
2019-06-07,26.66
2019-06-10,27.44
2019-06-11,27.2
2019-06-12,26.68
2019-06-13,27.03
2019-06-14,26.34
2019-06-17,26.84
2019-06-18,27.825
2019-06-19,28.49
2019-06-20,28.245
2019-06-21,28.45
2019-06-24,29.045
2019-06-25,29.31
2019-06-26,29.04
2019-06-27,30.02
2019-06-28,22.24
2019-07-01,22.02
2019-07-02,21.95
2019-07-03,22.32
2019-07-04,22.32
2019-07-05,22.51
2019-07-08,21.75
2019-07-09,22.37
2019-07-10,22.23
2019-07-11,22.625
2019-07-12,22.04
2019-07-15,22.01
2019-07-16,22.215
2019-07-17,21.83
2019-07-18,21.15
2019-07-19,20.835
2019-07-22,20.18
2019-07-23,20.45
2019-07-24,20.59
2019-07-25,20.51
2019-07-26,20.64
2019-07-29,20.72
2019-07-30,20.73
2019-07-31,20.935
2019-08-01,20.715
2019-08-02,20.16
2019-08-05,19.83
2019-08-06,20.08
2019-08-07,19.99
2019-08-08,20.825
2019-08-09,20.59
2019-08-12,20.19
2019-08-13,20
2019-08-14,19.685
2019-08-15,19.99
2019-08-16,20.53
2019-08-19,20.035
2019-08-20,20.22
2019-08-21,20.445
2019-08-22,20.56
2019-08-23,20.635
2019-08-26,20.85
2019-08-27,21.31
2019-08-28,20.92
2019-08-29,21.71
2019-08-30,21.8
2019-09-02,21.78
2019-09-03,20.64
2019-09-04,21.29
2019-09-05,21.45
2019-09-06,21.315
2019-09-09,21.64
2019-09-10,21.74
2019-09-11,21.82
2019-09-12,21.965
2019-09-13,21.74
2019-09-16,20.46
2019-09-17,21.135
2019-09-18,20.74
2019-09-19,20.38
2019-09-20,20.225
2019-09-23,20.465
2019-09-24,18.94
2019-09-25,18.89
2019-09-26,18.48
2019-09-27,17.96
2019-09-30,17.83
2019-10-01,17.68
2019-10-02,17.68
2019-10-03,18.875
2019-10-04,18.745
2019-10-07,18.49
2019-10-08,17.66
2019-10-09,17.44
2019-10-10,17.265
2019-10-11,17.155
2019-10-14,18.19
2019-10-15,18.39
2019-10-16,19.52
2019-10-17,19.725
2019-10-18,19.135
2019-10-21,20
2019-10-22,20.305
2019-10-23,20.82
2019-10-24,20.555
2019-10-25,20.035
2019-10-28,19.68
2019-10-29,19.04
2019-10-30,19.29
2019-10-31,18.925
2019-11-01,20.2
2019-11-04,20.58
2019-11-05,21.015
2019-11-06,21.245
2019-11-07,22.57
2019-11-08,22.38
2019-11-11,22.415
2019-11-12,22.49
2019-11-13,22.93
2019-11-14,22.82
2019-11-15,23.34
2019-11-18,23.55
2019-11-19,23.9
2019-11-20,23.595
2019-11-21,23.59
2019-11-22,23.92
2019-11-25,23.94
