date,close
2014-06-13,13.4678
2014-06-16,13.3105
2014-06-17,13.281
2014-06-18,13.6251
2014-06-19,14.2051
2014-06-20,14.0281
2014-06-23,14.2739
2014-06-24,13.9495
2014-06-25,14.0969
2014-06-26,14.1854
2014-06-27,14.1854
2014-06-30,14.4017
2014-07-01,14.2641
2014-07-02,14.4115
2014-07-03,14.3918
2014-07-07,14.2641
2014-07-08,14.4607
2014-07-09,14.8146
2014-07-10,14.5983
2014-07-11,14.8047
2014-07-14,14.5885
2014-07-15,14.2542
2014-07-16,14.4017
2014-07-17,14.6966
2014-07-18,14.7064
2014-07-21,14.559
2014-07-22,14.4705
2014-07-23,14.4508
2014-07-24,14.2149
2014-07-25,14.5
2014-07-28,14.6278
2014-07-29,14.5885
2014-07-30,14.5
2014-07-31,14.1657
2014-08-01,14.2837
2014-08-04,14.0773
2014-08-05,14.0576
2014-08-06,14.2935
2014-08-07,14.2641
2014-08-08,14.2247
2014-08-11,14.2837
2014-08-12,14.4902
2014-08-13,14.5098
2014-08-14,14.4312
2014-08-15,14.2837
2014-08-18,14.323
2014-08-19,14.2641
2014-08-20,14.2542
2014-08-21,13.9888
2014-08-22,14.0085
2014-08-25,13.8217
2014-08-26,14.0163
2014-08-27,14.0281
2014-08-28,14.1264
2014-08-29,14.1756
2014-09-02,13.6742
2014-09-03,13.6447
2014-09-04,13.3007
2014-09-05,13.3203
2014-09-08,13.0254
2014-09-09,13.1139
2014-09-10,12.9861
2014-09-11,13.0746
2014-09-12,12.9861
2014-09-15,12.7698
2014-09-16,12.7698
2014-09-17,12.5535
2014-09-18,12.3274
2014-09-19,12.0424
2014-09-22,11.8163
2014-09-23,12.003
2014-09-24,11.885
2014-09-25,11.9735
2014-09-26,11.8064
2014-09-29,11.7081
2014-09-30,11.5607
2014-10-01,11.4624
2014-10-02,11.6295
2014-10-03,11.3346
2014-10-06,11.423
2014-10-07,11.1281
2014-10-08,11.8457
2014-10-09,11.659
2014-10-10,11.4624
2014-10-13,11.7081
2014-10-14,11.8261
2014-10-15,11.8064
2014-10-16,11.8752
2014-10-17,11.541
2014-10-20,11.6786
2014-10-21,11.8359
2014-10-22,11.5508
2014-10-23,11.6098
2014-10-24,11.4722
2014-10-27,11.3346
2014-10-28,11.5213
2014-10-29,11.1085
2014-10-30,10.5678
2014-10-31,10.1058
2014-11-03,10.4793
2014-11-04,10.0763
2014-11-05,9.8698
2014-11-06,9.9091
2014-11-07,10.6563
2014-11-10,10.0566
2014-11-11,10.4302
2014-11-12,10.4499
2014-11-13,10.2726
2014-11-14,10.7749
2014-11-17,10.834
2014-11-18,11.2673
2014-11-19,10.8044
2014-11-20,11.0113
2014-11-21,11.0506
2014-11-24,10.9325
2014-11-25,11.3264
2014-11-26,11.1885
2014-11-28,10.5779
2014-12-01,11.0408
2014-12-02,10.8635
2014-12-03,10.7059
2014-12-04,10.765
2014-12-05,10.4302
2014-12-08,10.4794
2014-12-09,10.8931
2014-12-10,10.5779
2014-12-11,10.3711
2014-12-12,10.2392
2014-12-15,9.6324
2014-12-16,9.4059
2014-12-17,9.8392
2014-12-18,10.1544
2014-12-19,10.046
2014-12-22,9.6225
2014-12-23,9.5733
2014-12-24,9.7506
2014-12-26,10.0362
2014-12-29,9.8294
2014-12-30,9.8983
2014-12-31,9.9574
2015-01-02,10.2627
2015-01-05,10.4499
2015-01-06,10.8143
2015-01-07,10.7059
2015-01-08,10.5582
2015-01-09,10.9325
2015-01-12,11.3067
2015-01-13,10.9226
2015-01-14,10.8635
2015-01-15,11.3264
2015-01-16,11.7401
2015-01-20,12.0159
2015-01-21,11.9765
2015-01-22,11.9075
2015-01-23,11.6908
2015-01-26,11.681
2015-01-27,12.0946
2015-01-28,11.6022
2015-01-29,11.4939
2015-01-30,11.681
2015-02-02,11.7696
2015-02-03,11.7302
2015-02-04,11.8386
2015-02-05,11.878
2015-02-06,11.3461
2015-02-09,11.5431
2015-02-10,11.3067
2015-02-11,11.1393
2015-02-12,11.1984
2015-02-13,11.3067
2015-02-17,11.0211
2015-02-18,11.2082
2015-02-19,10.9128
2015-02-20,10.9128
2015-02-23,10.9128
2015-02-24,10.9325
2015-02-25,11.09
2015-02-26,11.159
2015-02-27,11.2969
2015-03-02,11.1196
2015-03-03,10.9719
2015-03-04,10.8044
2015-03-05,10.7749
2015-03-06,10.1445
2015-03-09,9.9377
2015-03-10,9.79
2015-03-11,10.0165
2015-03-12,9.987
2015-03-13,10.1051
2015-03-16,10.0263
2015-03-17,9.8688
2015-03-18,10.1741
2015-03-19,10.2233
2015-03-20,10.5779
2015-03-23,10.637
2015-03-24,10.637
2015-03-25,10.44
2015-03-26,10.2824
2015-03-27,10.1642
2015-03-30,9.9082
2015-03-31,9.9279
2015-04-01,10.2726
2015-04-02,10.1445
2015-04-06,10.4893
2015-04-07,10.2923
2015-04-08,10.2135
2015-04-09,10.0854
2015-04-10,10.3908
2015-04-13,10.1938
2015-04-14,10.2233
2015-04-15,10.5188
2015-04-16,10.4991
2015-04-17,10.44
2015-04-20,10.44
2015-04-21,10.522
2015-04-22,10.243
2015-04-23,10.4597
2015-04-24,10.2332
2015-04-27,10.5385
2015-04-28,10.8832
2015-04-29,10.9522
2015-04-30,10.6665
2015-05-01,10.7749
2015-05-04,10.8438
2015-05-05,10.765
2015-05-06,10.5877
2015-05-07,10.5976
2015-05-08,10.637
2015-05-11,10.7554
2015-05-12,10.9034
2015-05-13,11.1797
2015-05-14,11.1797
2015-05-15,11.1994
2015-05-18,11.1304
2015-05-19,10.8245
2015-05-20,10.8442
2015-05-21,10.8047
2015-05-22,10.6765
2015-05-26,10.4002
2015-05-27,10.4396
2015-05-28,10.558
2015-05-29,10.5284
2015-06-01,10.341
2015-06-02,10.4594
2015-06-03,10.2719
2015-06-04,10.193
2015-06-05,10.0943
2015-06-08,10.1338
2015-06-09,9.9857
2015-06-10,10.0746
2015-06-11,9.9463
2015-06-12,9.9068
2015-06-15,9.9265
2015-06-16,9.8476
2015-06-17,10.0351
2015-06-18,10.1338
2015-06-19,9.9265
2015-06-22,9.818
2015-06-23,9.8673
2015-06-24,9.8673
2015-06-25,9.7896
2015-06-26,9.7391
2015-06-29,9.6601
2015-06-30,9.5812
2015-07-01,9.3444
2015-07-02,9.443
2015-07-06,9.5713
2015-07-07,9.2753
2015-07-08,9.1865
2015-07-09,9.2161
2015-07-10,9.063
2015-07-13,8.9497
2015-07-14,8.9694
2015-07-15,8.8707
2015-07-16,8.851
2015-07-17,8.3774
2015-07-20,7.7557
2015-07-21,8.0221
2015-07-22,7.7952
2015-07-23,7.6669
2015-07-24,7.8741
2015-07-27,7.588
2015-07-28,7.6867
2015-07-29,7.8741
2015-07-30,7.6176
2015-07-31,7.7755
2015-08-03,7.588
2015-08-04,7.5189
2015-08-05,7.5189
2015-08-06,7.7459
2015-08-07,7.8741
2015-08-10,8.1899
2015-08-11,8.3478
2015-08-12,8.6833
2015-08-13,8.3182
2015-08-14,8.259
2015-08-17,8.3971
2015-08-18,8.2096
2015-08-19,8.3675
2015-08-20,8.3872
2015-08-21,8.18
2015-08-24,7.6274
2015-08-25,7.4104
2015-08-26,7.2229
2015-08-27,7.5288
2015-08-28,7.9629
2015-08-31,7.9235
2015-09-01,7.8741
2015-09-02,7.8939
2015-09-03,7.7261
2015-09-04,7.6373
2015-09-08,8.1307
2015-09-09,7.6274
2015-09-10,7.6472
2015-09-11,7.6669
2015-09-14,7.6274
2015-09-15,7.5781
2015-09-16,7.884
2015-09-17,8.1011
2015-09-18,8.1406
2015-09-21,7.9037
2015-09-22,7.6373
2015-09-23,7.5189
2015-09-24,8.0221
2015-09-25,7.7755
2015-09-28,7.5682
2015-09-29,7.4794
2015-09-30,7.7163
2015-10-01,7.4696
2015-10-02,8.0715
2015-10-05,8.2392
2015-10-06,8.4563
2015-10-07,8.4958
2015-10-08,8.5254
2015-10-09,8.851
2015-10-12,8.5352
2015-10-13,8.555
2015-10-14,9.1372
2015-10-15,9.1076
2015-10-16,8.7129
2015-10-19,8.4563
2015-10-20,8.7326
2015-10-21,8.476
2015-10-22,8.5352
2015-10-23,8.5846
2015-10-26,8.3872
2015-10-27,8.3478
2015-10-28,8.1899
2015-10-29,7.884
2015-10-30,7.7853
2015-11-02,7.8248
2015-11-03,7.8248
2015-11-04,7.6867
2015-11-05,7.44
2015-11-06,7.1538
2015-11-09,7.2624
2015-11-10,7.0749
2015-11-11,7.1736
2015-11-12,7.1142
2015-11-13,7.1439
2015-11-16,7.0746
2015-11-17,6.7283
2015-11-18,6.8767
2015-11-19,7.0746
2015-11-20,6.8371
2015-11-23,6.847
2015-11-24,7.0647
2015-11-25,6.9955
2015-11-27,6.9064
2015-11-30,7.0845
2015-12-01,7.3022
2015-12-02,7.1933
2015-12-03,7.322
2015-12-04,7.6584
2015-12-07,7.2527
2015-12-08,7.1043
2015-12-09,7.2428
2015-12-10,7.2329
2015-12-11,7.1538
2015-12-14,6.8569
2015-12-15,6.8965
2015-12-16,7.1933
2015-12-17,6.7778
2015-12-18,6.946
2015-12-21,7.1043
2015-12-22,7.0449
2015-12-23,7.0845
2015-12-24,7.2824
2015-12-28,7.1834
2015-12-29,7.1736
2015-12-30,6.9658
2015-12-31,7.0944
2016-01-04,7.1933
2016-01-05,7.2329
2016-01-06,7.3912
2016-01-07,7.6881
2016-01-08,7.5594
2016-01-11,7.2725
2016-01-12,7.1043
2016-01-13,7.0647
2016-01-14,6.8965
2016-01-15,6.8668
2016-01-19,6.6294
2016-01-20,6.7382
2016-01-21,6.7283
2016-01-22,6.8371
2016-01-25,6.9653
2016-01-26,7.2923
2016-01-27,7.4209
2016-01-28,7.2032
2016-01-29,7.4506
2016-02-01,7.6485
2016-02-02,7.5693
2016-02-03,8.0344
2016-02-04,8.4302
2016-02-05,8.8161
2016-02-08,9.0535
2016-02-09,8.4005
2016-02-10,8.7755
2016-02-11,9.1624
2016-02-12,9.2118
2016-02-16,8.6182
2016-02-17,8.8853
2016-02-18,9.3504
2016-02-19,9.1624
2016-02-22,9.1525
2016-02-23,9.2316
2016-02-24,9.3405
2016-02-25,9.3603
2016-02-26,9.1525
2016-02-29,9.4592
2016-03-01,9.2811
2016-03-02,9.4889
2016-03-03,9.7758
2016-03-04,9.7165
2016-03-07,10.0529
2016-03-08,9.7066
2016-03-09,9.8451
2016-03-10,10.132
2016-03-11,9.944
2016-03-14,9.6769
2016-03-15,9.7956
2016-03-16,10.3398
2016-03-17,10.1983
2016-03-18,10.2112
2016-03-21,10.2508
2016-03-22,10.2903
2016-03-23,9.6769
2016-03-24,9.8055
2016-03-28,9.8748
2016-03-29,10.3497
2016-03-30,10.132
2016-03-31,10.132
2016-04-01,10.1815
2016-04-04,9.9143
2016-04-05,10.1518
2016-04-06,10.1419
2016-04-07,10.7356
2016-04-08,11.2105
2016-04-11,12.3187
2016-04-12,12.4671
2016-04-13,11.8834
2016-04-14,11.735
2016-04-15,12.0021
2016-04-18,11.9229
2016-04-19,12.2297
2016-04-20,12.0516
2016-04-21,12.1703
2016-04-22,11.9823
2016-04-25,12.0268
2016-04-26,12.2297
2016-04-27,12.3088
2016-04-28,12.6947
2016-04-29,13.4566
2016-05-02,13.1894
2016-05-03,12.7937
2016-05-04,12.1109
2016-05-05,12.3583
2016-05-06,12.7244
2016-05-09,12.1604
2016-05-10,12.487
2016-05-11,12.8041
2016-05-12,12.6554
2016-05-13,12.6356
2016-05-16,12.7843
2016-05-17,12.8834
2016-05-18,12.0113
2016-05-19,12.2491
2016-05-20,12.4077
2016-05-23,12.3284
2016-05-24,11.823
2016-05-25,11.9716
2016-05-26,11.9815
2016-05-27,11.4959
2016-05-31,11.6644
2016-06-01,11.704
2016-06-02,11.8527
2016-06-03,12.8437
2016-06-06,13.0122
2016-06-07,12.9428
2016-06-08,13.2005
2016-06-09,13.2996
2016-06-10,13.1484
2016-06-13,13.1311
2016-06-14,12.9627
2016-06-15,13.3888
2016-06-16,13.0915
2016-06-17,13.2302
2016-06-20,13.141
2016-06-21,12.9131
2016-06-22,13.2005
2016-06-23,13.1113
2016-06-24,13.7059
2016-06-27,13.914
2016-06-28,13.9041
2016-06-29,14.2213
2016-06-30,14.6474
2016-07-01,15.5195
2016-07-05,15.6582
2016-07-06,16.0547
2016-07-07,15.5294
2016-07-08,16.0448
2016-07-11,15.9754
2016-07-12,15.4204
2016-07-13,15.8267
2016-07-14,15.4898
2016-07-15,15.2717
2016-07-18,15.3312
2016-07-19,15.242
2016-07-20,14.5384
2016-07-21,14.9051
2016-07-22,15.0537
2016-07-25,14.5483
2016-07-26,14.8456
2016-07-27,15.7375
2016-07-28,15.5294
2016-07-29,15.8862
2016-08-01,16.2231
2016-08-02,16.352
2016-08-03,16.1736
2016-08-04,16.2231
2016-08-05,16.124
2016-08-08,16.3817
2016-08-09,16.6096
2016-08-10,16.9268
2016-08-11,16.8871
2016-08-12,16.6691
2016-08-15,16.6195
2016-08-16,16.4808
2016-08-17,16.1934
2016-08-18,16.461
2016-08-19,16.1339
2016-08-22,15.6979
2016-08-23,15.1925
2016-08-24,14.0528
2016-08-25,14.2609
2016-08-26,14.3798
2016-08-29,14.6078
2016-08-30,13.8942
2016-08-31,13.5374
2016-09-01,14.0528
2016-09-02,14.8952
2016-09-06,15.6682
2016-09-07,15.579
2016-09-08,15.2817
2016-09-09,14.5483
2016-09-12,14.9943
2016-09-13,14.4938
2016-09-14,14.5384
2016-09-15,14.5879
2016-09-16,14.1222
2016-09-19,14.2213
2016-09-20,14.142
2016-09-21,15.0438
2016-09-22,14.9645
2016-09-23,14.6177
2016-09-26,14.5681
2016-09-27,14.4393
2016-09-28,14.7663
2016-09-29,14.6672
2016-09-30,14.687
2016-10-03,14.2411
2016-10-04,12.8635
2016-10-05,13.141
2016-10-06,12.9527
2016-10-07,13.26
2016-10-10,13.0618
2016-10-11,12.5563
2016-10-12,12.8635
2016-10-13,13.2897
2016-10-14,12.9726
2016-10-17,12.9726
2016-10-18,13.4582
2016-10-19,13.7555
2016-10-20,13.8149
2016-10-21,13.696
2016-10-24,13.3392
2016-10-25,13.8149
2016-10-26,13.4879
2016-10-27,13.3095
2016-10-28,13.3492
2016-10-31,13.6762
2016-11-01,14.0726
2016-11-02,13.9239
2016-11-03,14.2014
2016-11-04,14.1122
2016-11-07,13.4879
2016-11-08,13.2897
2016-11-09,13.6564
2016-11-10,12.6044
2016-11-11,11.5325
2016-11-14,11.1355
2016-11-15,11.463
2016-11-16,11.3141
2016-11-17,11.0164
2016-11-18,10.9866
2016-11-21,11.1156
2016-11-22,11.1057
2016-11-23,10.6293
2016-11-25,10.679
2016-11-28,11.0759
2016-11-29,11.0164
2016-11-30,10.7286
2016-12-01,10.7782
2016-12-02,11.0561
2016-12-05,11.0362
2016-12-06,10.937
2016-12-07,11.1355
2016-12-08,11.1156
2016-12-09,10.679
2016-12-12,10.7484
2016-12-13,10.9172
2016-12-14,10.4606
2016-12-15,9.9048
2016-12-16,10.0636
2016-12-19,10.0438
2016-12-20,10.0537
2016-12-21,10.0537
2016-12-22,10.0736
2016-12-23,10.1927
2016-12-27,10.4408
2016-12-28,10.6194
2016-12-29,11.2744
2016-12-30,10.9569
2017-01-03,11.3042
2017-01-04,11.3935
2017-01-05,12.0684
2017-01-06,11.6714
2017-01-09,11.7905
2017-01-10,11.9096
2017-01-11,11.8501
2017-01-12,11.7608
2017-01-13,11.8203
2017-01-17,12.1776
2017-01-18,11.9791
2017-01-19,12.0287
2017-01-20,12.1677
2017-01-23,12.4456
2017-01-24,12.525
2017-01-25,12.3562
2017-01-26,12.0982
2017-01-27,12.2173
2017-01-30,12.118
2017-01-31,12.4555
2017-02-01,12.5051
2017-02-02,12.7135
2017-02-03,12.7036
2017-02-06,13.18
2017-02-07,13.18
2017-02-08,13.4281
2017-02-09,13.18
2017-02-10,13.3586
2017-02-13,13.2296
2017-02-14,13.2197
2017-02-15,13.2197
2017-02-16,13.3189
2017-02-17,13.1006
2017-02-21,12.9815
2017-02-22,12.8326
2017-02-23,12.8723
2017-02-24,12.7433
2017-02-27,12.0386
2017-02-28,12.0486
2017-03-01,12.1478
2017-03-02,11.6417
2017-03-03,11.7707
2017-03-06,11.4531
2017-03-07,11.4035
2017-03-08,11.3141
2017-03-09,11.1454
2017-03-10,11.3538
2017-03-13,11.4332
2017-03-14,11.1156
2017-03-15,11.8401
2017-03-16,11.7608
2017-03-17,11.7211
2017-03-20,11.8898
2017-03-21,12.1776
2017-03-22,12.1974
2017-03-23,12.0585
2017-03-24,12.0684
2017-03-27,12.2868
2017-03-28,11.9592
2017-03-29,12.0188
2017-03-30,11.8898
2017-03-31,11.9692
2017-04-03,12.1379
2017-04-04,12.2471
2017-04-05,12.2768
2017-04-06,12.2768
2017-04-07,12.2669
2017-04-10,12.3463
2017-04-11,12.6242
2017-04-12,12.8425
2017-04-13,12.8326
2017-04-17,12.7135
2017-04-18,12.654
2017-04-19,12.2173
2017-04-20,12.3066
2017-04-21,12.4456
2017-04-24,12.1974
2017-04-25,11.6814
2017-04-26,11.6913
2017-04-27,11.5523
2017-04-28,11.8401
2017-05-01,11.5821
2017-05-02,11.731
2017-05-03,11.6913
2017-05-04,11.4531
2017-05-05,11.6417
2017-05-08,11.5821
2017-05-09,11.5623
2017-05-10,11.7313
2017-05-11,11.9699
2017-05-12,12.0792
2017-05-15,12.0196
2017-05-16,12.1091
2017-05-17,12.3477
2017-05-18,12.0594
2017-05-19,12.0892
2017-05-22,12.1886
2017-05-23,11.94
2017-05-24,11.9898
2017-05-25,11.8804
2017-05-26,11.9202
2017-05-30,11.7313
2017-05-31,11.8108
2017-06-01,11.8108
2017-06-02,11.8307
2017-06-05,11.8605
2017-06-06,12.4173
2017-06-07,12.3477
2017-06-08,12.1786
2017-06-09,12.0096
2017-06-12,11.8406
2017-06-13,11.9301
2017-06-14,11.5821
2017-06-15,11.5126
2017-06-16,11.4529
2017-06-19,11.433
2017-06-20,11.3535
2017-06-21,11.5225
2017-06-22,11.6319
2017-06-23,11.8009
2017-06-26,11.771
2017-06-27,11.6517
2017-06-28,11.7213
2017-06-29,11.5523
2017-06-30,11.6219
2017-07-03,11.3734
2017-07-05,11.3933
2017-07-06,11.264
2017-07-07,11.095
2017-07-10,11.3237
2017-07-11,11.4032
2017-07-12,11.4231
2017-07-13,11.2541
2017-07-14,11.4231
2017-07-17,11.4927
2017-07-18,11.5424
2017-07-19,11.5424
2017-07-20,11.6716
2017-07-21,11.6716
2017-07-24,11.4827
2017-07-25,11.5722
2017-07-26,11.8705
2017-07-27,11.7466
2017-07-28,11.9202
2017-07-31,11.8903
2017-08-01,11.8108
2017-08-02,11.7512
2017-08-03,11.7114
2017-08-04,11.5225
2017-08-07,11.3933
2017-08-08,11.3833
2017-08-09,11.602
2017-08-10,11.8207
2017-08-11,11.8406
2017-08-14,11.7313
2017-08-15,11.5126
2017-08-16,11.7412
2017-08-17,11.7512
2017-08-18,11.7412
2017-08-21,11.8695
2017-08-22,11.7611
2017-08-23,11.781
2017-08-24,11.8506
2017-08-25,11.8606
2017-08-28,12.2582
2017-08-29,12.4173
2017-08-30,12.2383
2017-08-31,12.4868
2017-09-01,12.5375
2017-09-05,12.795
2017-09-06,12.5167
2017-09-07,12.8547
2017-09-08,12.7453
2017-09-11,12.3775
2017-09-12,12.4073
2017-09-13,12.1886
2017-09-14,12.3079
2017-09-15,12.1985
2017-09-18,12.0196
2017-09-19,12.0792
2017-09-20,11.9699
2017-09-21,11.8605
2017-09-22,11.9102
2017-09-25,12.2184
2017-09-26,12.0494
2017-09-27,11.8307
2017-09-28,11.8506
2017-09-29,11.8108
2017-10-02,11.7114
2017-10-03,11.8108
2017-10-04,11.9003
2017-10-05,11.8207
2017-10-06,11.9997
2017-10-09,12.0594
2017-10-10,11.9997
2017-10-11,12.1091
2017-10-12,12.1488
2017-10-13,12.0792
2017-10-16,11.9202
2017-10-17,11.9102
2017-10-18,11.8903
2017-10-19,11.9102
2017-10-20,11.7512
2017-10-23,11.7213
2017-10-24,11.6019
2017-10-25,11.5324
2017-10-26,11.2964
2017-10-27,11.4032
2017-10-30,11.4827
2017-10-31,11.3933
2017-11-01,11.3535
2017-11-02,11.3734
2017-11-03,11.2342
2017-11-06,11.4827
2017-11-07,11.3137
2017-11-08,11.3833
2017-11-09,11.2342
2017-11-10,11.1545
2017-11-13,11.1047
2017-11-14,11.1246
2017-11-15,11.045
2017-11-16,10.9952
2017-11-17,11.035
2017-11-20,10.9852
2017-11-21,11.0649
2017-11-22,11.2342
2017-11-24,11.1844
2017-11-27,11.2441
2017-11-28,11.2292
2017-11-29,11.0051
2017-11-30,11.0077
2017-12-01,11.0549
2017-12-04,10.8956
2017-12-05,10.7803
2017-12-06,10.7063
2017-12-07,10.6267
2017-12-08,10.6665
2017-12-11,10.5868
2017-12-12,10.6067
2017-12-13,10.9454
2017-12-14,10.786
2017-12-15,10.786
2017-12-18,10.8458
2017-12-19,10.8458
2017-12-20,11.0151
2017-12-21,10.9852
2017-12-22,11.1943
2017-12-26,11.3537
2017-12-27,11.2541
2017-12-28,11.2939
2017-12-29,11.274
2018-01-02,11.513
2018-01-03,11.4732
2018-01-04,11.4931
2018-01-05,11.513
2018-01-08,11.4433
2018-01-09,11.3139
2018-01-10,11.3836
2018-01-11,11.4234
2018-01-12,11.7222
2018-01-16,11.8616
2018-01-17,11.6624
2018-01-18,11.4633
2018-01-19,11.523
2018-01-22,11.5529
2018-01-23,11.7322
2018-01-24,12.0309
2018-01-25,11.7919
2018-01-26,11.8616
2018-01-29,11.533
2018-01-30,11.3836
2018-01-31,11.513
2018-02-01,11.4732
2018-02-02,11.1445
2018-02-05,10.9653
2018-02-06,10.73
2018-02-07,10.5868
2018-02-08,10.537
2018-02-09,10.3777
2018-02-12,10.6067
2018-02-13,10.6267
2018-02-14,11.0549
2018-02-15,11.1147
2018-02-16,10.8956
2018-02-20,10.6067
2018-02-21,10.5769
2018-02-22,10.537
2018-02-23,10.6067
2018-02-26,10.6765
2018-02-27,10.3777
2018-02-28,10.288
2018-03-01,10.3578
2018-03-02,10.3378
2018-03-05,10.308
2018-03-06,10.4872
2018-03-07,10.2781
2018-03-08,10.3279
2018-03-09,10.3279
2018-03-12,10.3677
2018-03-13,10.3777
2018-03-14,10.4076
2018-03-15,10.2482
2018-03-16,10.2183
2018-03-19,10.2084
2018-03-20,10.0889
2018-03-21,10.3478
2018-03-22,10.2183
2018-03-23,10.4374
2018-03-26,10.5669
2018-03-27,10.3876
2018-03-28,10.2283
2018-03-29,10.3777
2018-04-02,10.4474
2018-04-03,10.3179
2018-04-04,10.308
2018-04-05,10.3279
2018-04-06,10.4076
2018-04-09,10.4076
2018-04-10,10.4872
2018-04-11,10.7063
2018-04-12,10.6565
2018-04-13,10.786
2018-04-16,10.8059
2018-04-17,10.8408
2018-04-18,10.8856
2018-04-19,10.8956
2018-04-20,10.7761
2018-04-23,10.6466
2018-04-24,10.7263
2018-04-25,10.6642
2018-04-26,10.6964
2018-04-27,10.7561
2018-04-30,10.4972
2018-05-01,10.5569
2018-05-02,10.5669
2018-05-03,10.6665
2018-05-04,10.6665
2018-05-07,10.6167
2018-05-08,10.5968
2018-05-09,10.5769
2018-05-10,10.7166
2018-05-11,10.6966
2018-05-14,10.6567
2018-05-15,10.4072
2018-05-16,10.3873
2018-05-17,10.3873
2018-05-18,10.4471
2018-05-21,10.4272
2018-05-22,10.3174
2018-05-23,10.3981
2018-05-24,10.517
2018-05-25,10.3973
2018-05-29,10.3274
2018-05-30,10.4471
2018-05-31,10.3773
2018-06-01,10.3973
2018-06-04,10.3274
2018-06-05,10.3973
2018-06-06,10.4771
2018-06-07,10.4072
2018-06-08,10.4272
2018-06-11,10.4771
2018-06-12,10.4771
2018-06-13,10.4771
2018-06-14,10.5369
2018-06-15,10.3374
2018-06-18,10.2875
2018-06-19,10.1977
2018-06-20,10.1179
2018-06-21,10.0979
2018-06-22,10.2176
2018-06-25,10.0979
2018-06-26,10.0979
2018-06-27,10.0081
2018-06-28,10.0081
2018-06-29,10.1777
2018-07-02,10.1179
2018-07-03,10.2476
2018-07-05,10.3973
2018-07-06,10.3274
2018-07-09,10.3274
2018-07-10,10.3573
2018-07-11,10.1079
2018-07-12,10.1927
2018-07-13,10.0281
2018-07-16,10.0081
2018-07-17,10.0081
2018-07-18,9.9981
2018-07-19,9.9283
2018-07-20,9.9981
2018-07-23,9.8485
2018-07-24,9.9383
2018-07-25,9.9582
2018-07-26,9.8385
2018-07-27,9.8384
2018-07-30,9.7986
2018-07-31,9.8385
2018-08-01,9.7686
2018-08-02,9.6589
2018-08-03,9.7686
2018-08-06,9.6788
2018-08-07,9.5691
2018-08-08,9.609
2018-08-09,9.579
2018-08-10,9.5292
2018-08-13,9.3296
2018-08-14,9.2498
2018-08-15,8.7309
2018-08-16,8.5413
2018-08-17,8.7209
2018-08-20,8.8007
2018-08-21,8.9205
2018-08-22,8.9804
2018-08-23,8.7509
2018-08-24,8.9604
2018-08-27,9.0402
2018-08-28,8.9305
2018-08-29,8.9604
2018-08-30,8.8556
2018-08-31,8.7808
2018-09-04,8.5912
2018-09-05,8.4814
2018-09-06,8.4615
2018-09-07,8.3817
2018-09-10,8.2919
2018-09-11,8.242
2018-09-12,8.5513
2018-09-13,8.4814
2018-09-14,8.4914
2018-09-17,8.6012
2018-09-18,8.671
2018-09-19,8.8506
2018-09-20,8.9305
2018-09-21,8.7908
2018-09-24,8.9305
2018-09-25,8.9105
2018-09-26,8.7109
2018-09-27,8.7509
2018-09-28,8.8506
2018-10-01,8.8506
2018-10-02,9.0801
2018-10-03,9.0302
2018-10-04,8.9504
2018-10-05,8.8407
2018-10-08,8.8307
2018-10-09,8.691
2018-10-10,8.8307
2018-10-11,9.3994
2018-10-12,9.3396
2018-10-15,9.4294
2018-10-16,9.3795
2018-10-17,9.3096
2018-10-18,9.4194
2018-10-19,9.4394
2018-10-22,9.3795
2018-10-23,9.3795
2018-10-24,9.2796
2018-10-25,8.8407
2018-10-26,8.7808
2018-10-29,8.8307
2018-10-30,8.8007
2018-10-31,8.6611
2018-11-01,8.9804
2018-11-02,8.9604
2018-11-05,8.9804
2018-11-06,8.9504
2018-11-07,8.8806
2018-11-08,8.8706
2018-11-09,8.6508
2018-11-12,8.471
2018-11-13,8.4211
2018-11-14,8.6209
2018-11-15,8.7507
2018-11-16,8.8606
2018-11-19,8.8406
2018-11-20,8.8007
2018-11-21,9.0504
2018-11-23,8.8375
2018-11-26,8.8107
2018-11-27,8.5909
2018-11-28,8.8007
2018-11-29,8.6808
2018-11-30,8.6508
2018-12-03,8.8007
2018-12-04,8.8306
2018-12-06,8.8506
2018-12-07,9.0204
2018-12-10,8.9505
2018-12-11,8.9705
2018-12-12,9.0704
2018-12-13,9.1303
2018-12-14,8.9905
2018-12-17,9.0604
2018-12-18,9.2716
2018-12-19,8.8007
2018-12-20,9.2702
2018-12-21,9.1103
2018-12-24,9.3801
2018-12-26,9.1603
2018-12-27,9.3501
2018-12-28,9.2802
2018-12-31,9.45
2019-01-02,9.44
2019-01-03,9.6398
2019-01-04,9.5099
2019-01-07,9.48
2019-01-08,9.48
2019-01-09,9.6098
2019-01-10,9.5399
2019-01-11,9.5998
2019-01-14,9.4999
2019-01-15,9.39
2019-01-16,9.4
2019-01-17,9.42
2019-01-18,9.2702
2019-01-22,9.3201
2019-01-23,9.3101
2019-01-24,9.3301
2019-01-25,9.6198
2019-01-28,9.7696
2019-01-29,10.0094
2019-01-30,10.0993
2019-01-31,10.339
2019-02-01,10.2391
2019-02-04,10.1992
2019-02-05,10.2591
2019-02-06,10.1093
2019-02-07,10.0094
2019-02-08,10.1692
2019-02-11,10.0993
2019-02-12,10.0893
2019-02-13,10.0693
2019-02-14,10.1293
2019-02-15,10.1792
2019-02-19,10.5288
2019-02-20,10.6287
2019-02-21,10.4389
2019-02-22,10.5089
2019-02-25,10.4289
2019-02-26,10.389
2019-02-27,10.1792
2019-02-28,10.1592
2019-03-01,9.9395
2019-03-04,9.9894
2019-03-05,9.9794
2019-03-06,9.7896
2019-03-07,9.8795
2019-03-08,10.2092
2019-03-11,10.1513
2019-03-12,10.369
2019-03-13,10.4389
2019-03-14,10.1592
2019-03-15,10.1892
2019-03-18,10.1193
2019-03-19,10.1492
2019-03-20,10.379
2019-03-21,10.399
2019-03-22,10.4389
2019-03-25,10.5988
2019-03-26,10.6187
2019-03-27,10.4889
2019-03-28,10.1792
2019-03-29,10.2391
2019-04-01,9.9994
2019-04-02,10.0593
2019-04-03,10.0294
2019-04-04,10.2092
2019-04-05,10.1792
2019-04-08,10.3091
2019-04-09,10.359
2019-04-10,10.2891
2019-04-11,10.0793
2019-04-12,10.0993
2019-04-15,10.0993
2019-04-16,9.9295
2019-04-17,9.8396
2019-04-18,9.7297
2019-04-22,9.5599
2019-04-23,9.4899
2019-04-24,9.5798
2019-04-25,9.5399
2019-04-26,9.7497
2019-04-29,9.5099
2019-04-30,9.5499
2019-05-01,9.4
2019-05-02,9.2302
2019-05-03,9.3601
2019-05-06,9.3301
2019-05-07,9.5499
2019-05-08,9.43
2019-05-09,9.41
2019-05-10,9.35
2019-05-13,9.63
2019-05-14,9.59
2019-05-15,9.6
2019-05-16,9.53
2019-05-17,9.63
2019-05-20,9.59
2019-05-21,9.6
2019-05-22,9.44
2019-05-23,9.44
2019-05-24,9.43
2019-05-28,9.33
2019-05-29,9.37
2019-05-30,9.57
2019-05-31,9.9
2019-06-03,10.27
2019-06-04,10.32
2019-06-05,10.35
2019-06-06,10.44
2019-06-07,10.46
2019-06-10,10.23
2019-06-11,10.24
2019-06-12,10.39
2019-06-13,10.45
2019-06-14,10.66
2019-06-17,10.5
2019-06-18,10.5
2019-06-19,10.675
2019-06-20,11.22
2019-06-21,11.235
2019-06-24,11.495
2019-06-25,11.39
2019-06-26,11.38
2019-06-27,11.29
2019-06-28,11.29
2019-07-01,11.12
2019-07-02,11.11
2019-07-03,11.43
2019-07-04,11.43
2019-07-05,11.43
2019-07-08,11.37
2019-07-09,11.37
2019-07-10,11.605
2019-07-11,11.56
2019-07-12,11.585
2019-07-15,11.67
2019-07-16,11.725
2019-07-17,11.73
2019-07-18,12.405
2019-07-19,12.335
2019-07-22,12.415
2019-07-23,12.345
2019-07-24,12.45
2019-07-25,12.26
2019-07-26,12.225
2019-07-29,12.395
2019-07-30,12.395
2019-07-31,11.82
2019-08-01,12.39
2019-08-02,12.39
2019-08-05,12.39
2019-08-06,12.77
2019-08-07,13.16
2019-08-08,13.205
2019-08-09,13.085
2019-08-12,13.16
2019-08-13,12.82
2019-08-14,12.82
2019-08-15,12.82
2019-08-16,12.93
2019-08-19,12.55
2019-08-20,13.02
2019-08-21,12.88
2019-08-22,12.84
2019-08-23,13.3
2019-08-26,13.24
2019-08-27,13.52
2019-08-28,13.595
2019-08-29,13.35
2019-08-30,13.345
2019-09-02,13.345
2019-09-03,13.66
2019-09-04,13.7
2019-09-05,13.04
2019-09-06,13.01
2019-09-09,12.49
2019-09-10,12.4
2019-09-11,12.425
2019-09-12,12.8
2019-09-13,12.11
2019-09-16,12.23
2019-09-17,12.61
2019-09-18,12.23
2019-09-19,12.605
2019-09-20,12.605
2019-09-23,12.985
2019-09-24,13.205
2019-09-25,12.835
2019-09-26,12.71
2019-09-27,12.405
2019-09-30,12.045
2019-10-01,12.16
2019-10-02,12.16
2019-10-03,12.26
2019-10-04,12.52
2019-10-07,12.445
2019-10-08,12.63
2019-10-09,12.615
2019-10-10,12.52
2019-10-11,12.135
2019-10-14,12.26
2019-10-15,11.98
2019-10-16,11.98
2019-10-17,12.1
2019-10-18,12.1
2019-10-21,12.1
2019-10-22,11.925
2019-10-23,12.17
2019-10-24,12.475
2019-10-25,12.475
2019-10-28,12.475
2019-10-29,12.475
2019-10-30,12.475
2019-10-31,12.74
2019-11-01,12.635
2019-11-04,12.54
2019-11-05,12.195
2019-11-06,12.365
2019-11-07,12.365
2019-11-08,11.93
2019-11-11,11.935
2019-11-12,11.935
2019-11-13,12.15
2019-11-14,12.15
2019-11-15,12.15
2019-11-18,12.15
2019-11-19,12.15
2019-11-20,12.15
2019-11-21,12.15
2019-11-22,12.15
2019-11-25,12.15
