date,close
2014-06-13,102.3295
2014-06-16,102.0561
2014-06-17,103.0966
2014-06-18,104.2253
2014-06-19,103.8726
2014-06-20,105.0541
2014-06-23,105.2658
2014-06-24,104.4898
2014-06-25,105.1423
2014-06-26,105.063
2014-06-27,105.6449
2014-06-30,105.8125
2014-07-01,107.1616
2014-07-02,106.7912
2014-07-03,107.9463
2014-07-07,107.576
2014-07-08,106.7824
2014-07-09,106.8353
2014-07-10,106.0505
2014-07-11,106.7471
2014-07-14,107.3732
2014-07-15,107.8405
2014-07-16,107.7612
2014-07-17,106.4385
2014-07-18,107.7347
2014-07-21,107.2762
2014-07-22,108.2197
2014-07-23,108.1315
2014-07-24,108.0433
2014-07-25,107.8141
2014-07-28,107.1351
2014-07-29,106.5532
2014-07-30,108.8546
2014-07-31,105.4598
2014-08-01,104.9924
2014-08-04,104.9924
2014-08-05,103.511
2014-08-06,103.5728
2014-08-07,103.236
2014-08-08,105.0615
2014-08-11,105.3362
2014-08-12,105.4603
2014-08-13,106.2933
2014-08-14,106.6743
2014-08-15,106.5325
2014-08-18,107.7111
2014-08-19,108.0301
2014-08-20,108.934
2014-08-21,109.4213
2014-08-22,109.1644
2014-08-25,110.8569
2014-08-26,111.7253
2014-08-27,111.6456
2014-08-28,110.9544
2014-08-29,111.4418
2014-09-02,113.2052
2014-09-03,111.6633
2014-09-04,111.3088
2014-09-05,112.0178
2014-09-08,111.9291
2014-09-09,110.5202
2014-09-10,111.3
2014-09-11,110.6708
2014-09-12,110.6265
2014-09-15,109.6606
2014-09-16,110.5556
2014-09-17,112.1418
2014-09-18,113.0457
2014-09-19,112.2304
2014-09-22,110.5556
2014-09-23,109.7669
2014-09-24,110.9632
2014-09-25,108.9428
2014-09-26,110.0062
2014-09-29,109.51
2014-09-30,109.3327
2014-10-01,106.0274
2014-10-02,106.2667
2014-10-03,107.9681
2014-10-06,108.0124
2014-10-07,105.5134
2014-10-08,106.887
2014-10-09,103.7234
2014-10-10,101.5081
2014-10-13,99.0534
2014-10-14,99.0712
2014-10-15,96.9001
2014-10-16,97.3568
2014-10-17,99.5142
2014-10-20,100.551
2014-10-21,103.2981
2014-10-22,101.6853
2014-10-23,103.2449
2014-10-24,104.2551
2014-10-27,105.0083
2014-10-28,106.6034
2014-10-29,113.9318
2014-10-30,115.9678
2014-10-31,111.8051
2014-11-03,112.0443
2014-11-04,113.409
2014-11-05,113.9318
2014-11-06,114.7281
2014-11-07,114.8705
2014-11-10,115.8586
2014-11-11,116.0366
2014-11-12,115.9654
2014-11-13,115.7429
2014-11-14,115.1643
2014-11-17,114.7993
2014-11-18,115.9921
2014-11-19,115.7251
2014-11-20,116.1256
2014-11-21,116.9356
2014-11-24,117.6477
2014-11-25,117.6477
2014-11-26,117.6655
2014-11-28,117.2917
2014-12-01,116.3214
2014-12-02,118.0572
2014-12-03,118.7782
2014-12-04,118.9206
2014-12-05,120.3003
2014-12-08,120.9412
2014-12-09,120.5762
2014-12-10,118.9473
2014-12-11,119.1787
2014-12-12,113.6867
2014-12-15,112.5562
2014-12-16,111.1231
2014-12-17,115.0664
2014-12-18,119.5615
2014-12-19,119.5704
2014-12-22,119.9888
2014-12-23,121.7334
2014-12-24,120.8166
2014-12-26,120.4071
2014-12-29,120.4427
2014-12-30,119.4547
2014-12-31,117.7189
2015-01-02,117.5765
2015-01-05,113.8024
2015-01-06,110.7404
2015-01-07,112.7075
2015-01-08,114.7103
2015-01-09,113.6511
2015-01-12,112.4939
2015-01-13,113.3128
2015-01-14,111.2388
2015-01-15,109.3607
2015-01-16,110.9629
2015-01-20,111.408
2015-01-21,112.4583
2015-01-22,115.9209
2015-01-23,115.2533
2015-01-26,116.4105
2015-01-27,114.8349
2015-01-28,112.5028
2015-01-29,114.1673
2015-01-30,111.2121
2015-02-02,114.6124
2015-02-03,117.9593
2015-02-04,117.3896
2015-02-05,118.4446
2015-02-06,120.5099
2015-02-09,120.4204
2015-02-10,121.7437
2015-02-11,121.8062
2015-02-12,122.9953
2015-02-13,123.2099
2015-02-17,122.9596
2015-02-18,121.4665
2015-02-19,121.4576
2015-02-20,121.7705
2015-02-23,120.483
2015-02-24,121.1268
2015-02-25,120.9837
2015-02-26,121.0016
2015-02-27,119.4727
2015-03-02,120.6082
2015-03-03,120.2238
2015-03-04,119.4638
2015-03-05,120.1701
2015-03-06,118.8916
2015-03-09,119.9287
2015-03-10,116.4419
2015-03-11,116.7906
2015-03-12,120.1969
2015-03-13,119.2314
2015-03-16,121.3503
2015-03-17,120.5903
2015-03-18,121.0284
2015-03-19,119.2135
2015-03-20,121.7437
2015-03-23,120.6887
2015-03-24,118.99
2015-03-25,116.6833
2015-03-26,116.4508
2015-03-27,115.378
2015-03-30,117.1393
2015-03-31,116.9783
2015-04-01,116.6386
2015-04-02,116.3972
2015-04-06,115.7177
2015-04-07,114.5823
2015-04-08,115.0829
2015-04-09,112.0074
2015-04-10,111.3368
2015-04-13,113.2144
2015-04-14,114.6806
2015-04-15,115.2617
2015-04-16,116.9158
2015-04-17,115.5031
2015-04-20,116.7191
2015-04-21,116.5224
2015-04-22,117.6757
2015-04-23,113.6971
2015-04-24,114.2157
2015-04-27,113.268
2015-04-28,113.6703
2015-04-29,113.9832
2015-04-30,112.5991
2015-05-01,112.7159
2015-05-04,113.2372
2015-05-05,112.0059
2015-05-06,110.9903
2015-05-07,111.952
2015-05-08,113.5608
2015-05-11,112.7249
2015-05-12,112.1048
2015-05-13,113.6956
2015-05-14,115.3134
2015-05-15,115.0438
2015-05-18,115.9156
2015-05-19,115.9156
2015-05-20,115.4572
2015-05-21,115.3044
2015-05-22,115.2864
2015-05-26,113.9742
2015-05-27,114.0371
2015-05-28,114.154
2015-05-29,111.9789
2015-06-01,111.9789
2015-06-02,113.3181
2015-06-03,114.4685
2015-06-04,112.644
2015-06-05,113.7945
2015-06-08,113.3631
2015-06-09,113.5428
2015-06-10,116.7155
2015-06-11,116.5088
2015-06-12,115.3404
2015-06-15,114.9449
2015-06-16,115.4662
2015-06-17,115.3583
2015-06-18,116.374
2015-06-19,114.9
2015-06-22,116.2571
2015-06-23,116.6256
2015-06-24,115.3853
2015-06-25,114.9179
2015-06-26,115.4213
2015-06-29,111.2599
2015-06-30,112.2845
2015-07-01,113.381
2015-07-02,112.5541
2015-07-06,111.161
2015-07-07,111.2959
2015-07-08,109.6241
2015-07-09,110.6308
2015-07-10,111.161
2015-07-13,112.7519
2015-07-14,112.9496
2015-07-15,113.1833
2015-07-16,114.9449
2015-07-17,114.7112
2015-07-20,115.3044
2015-07-21,114.7202
2015-07-22,113.9742
2015-07-23,113.435
2015-07-24,111.4846
2015-07-27,110.5139
2015-07-28,112.5811
2015-07-29,113.8933
2015-07-30,114.3722
2015-07-31,113.5499
2015-08-03,113.4777
2015-08-04,113.0711
2015-08-05,113.0982
2015-08-06,111.7699
2015-08-07,111.1826
2015-08-10,113.0711
2015-08-11,111.5169
2015-08-12,110.0984
2015-08-13,109.8905
2015-08-14,111.1013
2015-08-17,112.1675
2015-08-18,110.6586
2015-08-19,109.3032
2015-08-20,107.4148
2015-08-21,103.7644
2015-08-24,98.6051
2015-08-25,96.9335
2015-08-26,101.2435
2015-08-27,103.8729
2015-08-28,103.1319
2015-08-31,101.8037
2015-09-01,98.578
2015-09-02,98.9937
2015-09-03,99.0479
2015-09-04,98.054
2015-09-08,100.358
2015-09-09,98.3883
2015-09-10,98.9937
2015-09-11,99.1382
2015-09-14,98.4154
2015-09-15,99.2466
2015-09-16,99.9605
2015-09-17,98.9575
2015-09-18,97.051
2015-09-21,98.2979
2015-09-22,97.1323
2015-09-23,96.6083
2015-09-24,96.5812
2015-09-25,97.6383
2015-09-28,93.7801
2015-09-29,96.1836
2015-09-30,98.6051
2015-10-01,99.0388
2015-10-02,98.1172
2015-10-05,101.0899
2015-10-06,100.3128
2015-10-07,101.0718
2015-10-08,101.2435
2015-10-09,100.3851
2015-10-12,99.2376
2015-10-13,97.5751
2015-10-14,97.1956
2015-10-15,99.9514
2015-10-16,100.8098
2015-10-19,100.5207
2015-10-20,101.4694
2015-10-21,100.8008
2015-10-22,103.0868
2015-10-23,104.8848
2015-10-26,104.3608
2015-10-27,102.1019
2015-10-28,104.7945
2015-10-29,104.8854
2015-10-30,104.8399
2015-11-02,106.5212
2015-11-03,107.0574
2015-11-04,105.3216
2015-11-05,106.3758
2015-11-06,108.4025
2015-11-09,106.6848
2015-11-10,105.9214
2015-11-11,105.467
2015-11-12,103.3768
2015-11-13,102.2317
2015-11-16,103.1223
2015-11-17,102.6679
2015-11-18,104.9399
2015-11-19,104.4855
2015-11-20,104.0493
2015-11-23,103.2586
2015-11-24,102.3316
2015-11-25,102.7133
2015-11-27,103.1586
2015-11-30,102.6497
2015-12-01,104.1583
2015-12-02,102.6952
2015-12-03,101.1502
2015-12-04,104.4582
2015-12-07,102.9769
2015-12-08,101.3956
2015-12-09,98.9054
2015-12-10,98.8691
2015-12-11,95.561
2015-12-14,95.3884
2015-12-15,96.2245
2015-12-16,97.7513
2015-12-17,95.5156
2015-12-18,93.6798
2015-12-21,95.8155
2015-12-22,97.3968
2015-12-23,98.7691
2015-12-24,98.0966
2015-12-28,97.9694
2015-12-29,98.6782
2015-12-30,97.5059
2015-12-31,96.7152
2016-01-04,94.7431
2016-01-05,94.3705
2016-01-06,91.1624
2016-01-07,88.2724
2016-01-08,86.2821
2016-01-11,86.9365
2016-01-12,87.3818
2016-01-13,83.9828
2016-01-14,86.4184
2016-01-15,84.3645
2016-01-19,84.101
2016-01-20,83.2558
2016-01-21,82.3106
2016-01-22,84.7462
2016-01-25,82.0834
2016-01-26,83.9374
2016-01-27,82.8014
2016-01-28,78.9935
2016-01-29,82.3833
2016-02-01,79.7841
2016-02-02,76.2852
2016-02-03,77.085
2016-02-04,77.6757
2016-02-05,75.2401
2016-02-08,73.4043
2016-02-09,71.9502
2016-02-10,73.6092
2016-02-11,69.9063
2016-02-12,73.4626
2016-02-16,76.0015
2016-02-17,77.8804
2016-02-18,77.248
2016-02-19,75.7906
2016-02-22,77.4863
2016-02-23,76.4689
2016-02-24,76.4689
2016-02-25,77.3305
2016-02-26,79.2736
2016-02-29,76.9455
2016-03-01,80.6668
2016-03-02,80.5568
2016-03-03,82.0691
2016-03-04,82.9123
2016-03-07,82.2707
2016-03-08,81.4092
2016-03-09,81.2625
2016-03-10,81.0792
2016-03-11,84.8738
2016-03-14,84.168
2016-03-15,82.5824
2016-03-16,83.8106
2016-03-17,85.5887
2016-03-18,86.4869
2016-03-21,86.2853
2016-03-22,85.5612
2016-03-23,85.0204
2016-03-24,84.3055
2016-03-28,85.5979
2016-03-29,86.3128
2016-03-30,87.596
2016-03-31,86.1661
2016-04-01,86.7711
2016-04-04,85.4054
2016-04-05,84.2414
2016-04-06,85.4604
2016-04-07,83.4439
2016-04-08,83.6823
2016-04-11,84.828
2016-04-12,86.3128
2016-04-13,89.4841
2016-04-14,89.035
2016-04-15,88.3751
2016-04-18,88.5217
2016-04-19,88.76
2016-04-20,90.5198
2016-04-21,90.584
2016-04-22,91.583
2016-04-25,90.6115
2016-04-26,91.8763
2016-04-27,92.6371
2016-04-28,89.9424
2016-04-29,87.8984
2016-05-02,89.6582
2016-05-03,87.596
2016-05-04,86.8719
2016-05-05,86.0774
2016-05-06,86.1513
2016-05-09,85.8556
2016-05-10,87.9713
2016-05-11,87.9251
2016-05-12,88.0822
2016-05-13,86.6871
2016-05-16,87.3615
2016-05-17,87.8512
2016-05-18,90.1055
2016-05-19,89.2555
2016-05-20,90.2348
2016-05-23,90.1239
2016-05-24,92.1749
2016-05-25,93.6439
2016-05-26,92.5445
2016-05-27,93.7917
2016-05-31,93.9303
2016-06-01,94.5585
2016-06-02,94.2536
2016-06-03,92.8494
2016-06-06,94.2536
2016-06-07,94.0042
2016-06-08,93.7178
2016-06-09,93.0064
2016-06-10,91.9717
2016-06-13,91.325
2016-06-14,88.8675
2016-06-15,89.3941
2016-06-16,88.9321
2016-06-17,89.3386
2016-06-20,90.8076
2016-06-21,91.1771
2016-06-22,91.6206
2016-06-23,93.9672
2016-06-24,84.3682
2016-06-27,79.0097
2016-06-28,79.176
2016-06-29,82.1971
2016-06-30,83.0101
2016-07-01,82.9362
2016-07-05,80.2385
2016-07-06,80.6819
2016-07-07,81.3748
2016-07-08,83.9247
2016-07-11,84.6823
2016-07-12,87.417
2016-07-13,86.7056
2016-07-14,88.4702
2016-07-15,88.9137
2016-07-18,89.4403
2016-07-19,89.043
2016-07-20,89.1539
2016-07-21,88.9229
2016-07-22,89.6897
2016-07-25,88.9691
2016-07-26,89.2463
2016-07-27,88.2947
2016-07-28,88.2762
2016-07-29,88.5441
2016-08-01,87.611
2016-08-02,85.9203
2016-08-03,87.5926
2016-08-04,87.4808
2016-08-05,89.8834
2016-08-08,90.1535
2016-08-09,89.6413
2016-08-10,89.1384
2016-08-11,89.5202
2016-08-12,89.0267
2016-08-15,90.1907
2016-08-16,89.902
2016-08-17,90.5353
2016-08-18,90.4887
2016-08-19,90.3397
2016-08-22,90.1535
2016-08-23,90.945
2016-08-24,90.824
2016-08-25,90.7215
2016-08-26,91.5783
2016-08-29,92.2208
2016-08-30,93.7387
2016-08-31,94.1299
2016-09-01,93.0217
2016-09-02,94.1578
2016-09-06,93.7387
2016-09-07,93.8319
2016-09-08,93.8226
2016-09-09,92.5747
2016-09-12,94.5396
2016-09-13,92.4164
2016-09-14,92.3884
2016-09-15,93.9809
2016-09-16,92.4816
2016-09-19,93.0869
2016-09-20,92.5374
2016-09-21,93.925
2016-09-22,93.9529
2016-09-23,92.7889
2016-09-26,91.1313
2016-09-27,91.6062
2016-09-28,92.3326
2016-09-29,90.7215
2016-09-30,92.9099
2016-10-03,93.8971
2016-10-04,94.0833
2016-10-05,96.0948
2016-10-06,95.7409
2016-10-07,94.2044
2016-10-10,94.6327
2016-10-11,92.8354
2016-10-12,93.2079
2016-10-13,91.9135
2016-10-14,90.4049
2016-10-17,89.7717
2016-10-18,90.4515
2016-10-19,91.3455
2016-10-20,91.122
2016-10-21,90.8612
2016-10-24,91.243
2016-10-25,90.5446
2016-10-26,83.9328
2016-10-27,84.6405
2016-10-28,83.0947
2016-10-31,82.3124
2016-11-01,81.6699
2016-11-02,80.7945
2016-11-03,82.2411
2016-11-04,82.4478
2016-11-07,85.6698
2016-11-08,85.2283
2016-11-09,95.8149
2016-11-10,103.2265
2016-11-11,104.1283
2016-11-14,107.3315
2016-11-15,107.2939
2016-11-16,107.0873
2016-11-17,106.7021
2016-11-18,106.2794
2016-11-21,107.3127
2016-11-22,106.89
2016-11-23,106.7961
2016-11-25,107.5194
2016-11-28,105.6782
2016-11-29,105.2649
2016-11-30,107.2845
2016-12-01,108.0642
2016-12-02,106.5894
2016-12-05,107.6791
2016-12-06,108.2145
2016-12-07,109.6799
2016-12-08,111.6901
2016-12-09,111.3802
2016-12-12,108.3648
2016-12-13,107.9139
2016-12-14,106.0822
2016-12-15,107.463
2016-12-16,104.9549
2016-12-19,104.6543
2016-12-20,106.5988
2016-12-21,106.0634
2016-12-22,104.9831
2016-12-23,105.1428
2016-12-27,105.5185
2016-12-28,104.1001
2016-12-29,103.2547
2016-12-30,104.2128
2017-01-03,105.0676
2017-01-04,108.2145
2017-01-05,106.843
2017-01-06,108.6466
2017-01-09,108.2145
2017-01-10,107.773
2017-01-11,108.083
2017-01-12,108.1112
2017-01-13,108.2803
2017-01-17,104.7858
2017-01-18,106.5331
2017-01-19,106.1291
2017-01-20,106.1949
2017-01-23,106.0164
2017-01-24,107.3785
2017-01-25,109.8584
2017-01-26,107.9139
2017-01-27,106.5237
2017-01-30,106.2043
2017-01-31,105.4622
2017-02-01,106.2231
2017-02-02,110.7508
2017-02-03,113.907
2017-02-06,115.8891
2017-02-07,115.7106
2017-02-08,114.2076
2017-02-09,116.9487
2017-02-10,117.4969
2017-02-13,119.2361
2017-02-14,120.8051
2017-02-15,121.807
2017-02-16,122.0811
2017-02-17,121.9204
2017-02-21,123.6029
2017-02-22,123.5178
2017-02-23,123.3288
2017-02-24,122.7144
2017-02-27,123.9242
2017-02-28,124.2929
2017-03-01,126.9205
2017-03-02,124.3874
2017-03-03,125.7674
2017-03-06,125.1719
2017-03-07,124.9356
2017-03-08,125.2948
2017-03-09,125.446
2017-03-10,124.86
2017-03-13,125.3231
2017-03-14,125.153
2017-03-15,126.3439
2017-03-16,127.223
2017-03-17,124.4914
2017-03-20,123.3382
2017-03-21,118.9714
2017-03-22,118.3476
2017-03-23,118.7729
2017-03-24,118.3949
2017-03-27,118.4138
2017-03-28,121.325
2017-03-29,120.4176
2017-03-30,122.5537
2017-03-31,122.5726
2017-04-03,122.4687
2017-04-04,121.8354
2017-04-05,121.0036
2017-04-06,122.601
2017-04-07,122.2134
2017-04-10,122.2796
2017-04-11,122.2134
2017-04-12,120.5499
2017-04-13,119.3117
2017-04-17,120.7484
2017-04-18,119.6709
2017-04-19,119.945
2017-04-20,122.4687
2017-04-21,121.4006
2017-04-24,124.6331
2017-04-25,123.7069
2017-04-26,121.9299
2017-04-27,121.4195
2017-04-28,120.8429
2017-05-01,121.7503
2017-05-02,122.0339
2017-05-03,121.9488
2017-05-04,121.8632
2017-05-05,122.5481
2017-05-08,122.1295
2017-05-09,122.6337
2017-05-10,122.805
2017-05-11,121.378
2017-05-12,119.9891
2017-05-15,122.5005
2017-05-16,123.5946
2017-05-17,117.3349
2017-05-18,118.3623
2017-05-19,119.7037
2017-05-22,119.0187
2017-05-23,116.9924
2017-05-24,115.8794
2017-05-25,116.6405
2017-05-26,116.3455
2017-05-30,115.204
2017-05-31,114.9091
2017-06-01,117.1351
2017-06-02,116.6975
2017-06-05,116.2599
2017-06-06,115.0327
2017-06-07,116.0126
2017-06-08,117.2588
2017-06-09,120.3315
2017-06-12,121.2258
2017-06-13,121.0545
2017-06-14,121.6063
2017-06-15,123.2996
2017-06-16,124.0036
2017-06-19,125.6874
2017-06-20,124.3175
2017-06-21,121.9963
2017-06-22,120.1984
2017-06-23,119.4373
2017-06-26,120.0462
2017-06-27,119.6656
2017-06-28,122.1581
2017-06-29,121.7871
2017-06-30,121.0926
2017-07-03,123.8038
2017-07-05,124.7456
2017-07-06,122.862
2017-07-07,124.9169
2017-07-10,126.3819
2017-07-11,125.0405
2017-07-12,126.8195
2017-07-13,127.6567
2017-07-14,128.1799
2017-07-17,128.1609
2017-07-18,128.0182
2017-07-19,129.4166
2017-07-20,130.1301
2017-07-21,129.702
2017-07-24,130.8626
2017-07-25,132.0803
2017-07-26,137.6074
2017-07-27,135.5621
2017-07-28,137.4171
2017-07-31,137.8262
2017-08-01,141.4489
2017-08-02,138.435
2017-08-03,139.9276
2017-08-04,141.4489
2017-08-07,140.9227
2017-08-08,142.3674
2017-08-09,141.5541
2017-08-10,137.574
2017-08-11,137.1626
2017-08-14,138.8656
2017-08-15,138.636
2017-08-16,137.1626
2017-08-17,132.7423
2017-08-18,132.7997
2017-08-21,131.5176
2017-08-22,132.7901
2017-08-23,132.5222
2017-08-24,132.417
2017-08-25,132.6179
2017-08-28,131.7951
2017-08-29,131.4411
2017-08-30,131.2689
2017-08-31,132.5222
2017-09-01,133.7756
2017-09-05,129.805
2017-09-06,129.2596
2017-09-07,126.4467
2017-09-08,127.0304
2017-09-11,130.6374
2017-09-12,131.6898
2017-09-13,131.709
2017-09-14,133.0006
2017-09-15,133.8139
2017-09-18,134.7706
2017-09-19,135.1246
2017-09-20,135.3734
2017-09-21,135.9762
2017-09-22,136.7416
2017-09-25,136.9616
2017-09-26,138.1098
2017-09-27,141.5159
2017-09-28,141.3628
2017-09-29,142.0899
2017-10-02,142.243
2017-10-03,142.9893
2017-10-04,143.3911
2017-10-05,144.0417
2017-10-06,144.4627
2017-10-09,144.1183
2017-10-10,144.7115
2017-10-11,145.2664
2017-10-12,145.984
2017-10-13,146.2997
2017-10-16,146.759
2017-10-17,145.7639
2017-10-18,146.1371
2017-10-19,145.8596
2017-10-20,147.4574
2017-10-23,147.5148
2017-10-24,147.3139
2017-10-25,150.2895
2017-10-26,155.7622
2017-10-27,153.6764
2017-10-30,151.4567
2017-10-31,149.7728
2017-11-01,150.5765
2017-11-02,153.619
2017-11-03,153.4843
2017-11-06,154.5038
2017-11-07,153.1381
2017-11-08,153.869
2017-11-09,152.965
2017-11-10,151.205
2017-11-13,151.3012
2017-11-14,151.0992
2017-11-15,151.3685
2017-11-16,151.0703
2017-11-17,152.2244
2017-11-20,154.5038
2017-11-21,153.6478
2017-11-22,153.4747
2017-11-24,153.4555
2017-11-27,153.1573
2017-11-28,155.5617
2017-11-29,157.3024
2017-11-30,156.985
2017-12-01,156.2541
2017-12-04,159.2163
2017-12-05,158.0718
2017-12-06,158.4661
2017-12-07,161.1879
2017-12-08,163.3614
2017-12-11,161.361
2017-12-12,162.1496
2017-12-13,160.053
2017-12-14,159.1201
2017-12-15,161.5052
2017-12-18,163.5153
2017-12-19,164.7752
2017-12-20,164.554
2017-12-21,165.131
2017-12-22,164.9483
2017-12-26,164.554
2017-12-27,164.4001
2017-12-28,165.0444
2017-12-29,162.9863
2018-01-02,163.4095
2018-01-03,162.6016
2018-01-04,163.1979
2018-01-05,163.7557
2018-01-08,165.4195
2018-01-09,167.4199
2018-01-10,169.103
2018-01-11,172.1325
2018-01-12,175.0754
2018-01-16,170.5264
2018-01-17,171.642
2018-01-18,170.7764
2018-01-19,171.969
2018-01-22,171.1323
2018-01-23,171.4881
2018-01-24,173.4116
2018-01-25,166.5063
2018-01-26,172.9596
2018-01-29,170.661
2018-01-30,165.4291
2018-01-31,162.2458
2018-02-01,164.5347
2018-02-02,161.0917
2018-02-05,154.2537
2018-02-06,154.4172
2018-02-07,153.9844
2018-02-08,146.6656
2018-02-09,147.9928
2018-02-12,149.9451
2018-02-13,150.6279
2018-02-14,154.4076
2018-02-15,153.7116
2018-02-16,154.4946
2018-02-20,153.4796
2018-02-21,154.0789
2018-02-22,152.7545
2018-02-23,154.949
2018-02-26,156.9211
2018-02-27,154.456
2018-02-28,151.2367
2018-03-01,148.5492
2018-03-02,145.8906
2018-03-05,150.444
2018-03-06,150.3957
2018-03-07,150.56
2018-03-08,151.2077
2018-03-09,155.7514
2018-03-12,154.5623
2018-03-13,153.6246
2018-03-14,151.7878
2018-03-15,150.2216
2018-03-16,151.8748
2018-03-19,150.85
2018-03-20,151.9134
2018-03-21,152.6095
2018-03-22,146.0357
2018-03-23,140.0709
2018-03-26,144.5759
2018-03-27,142.4104
2018-03-28,142.072
2018-03-29,143.0194
2018-04-02,137.9247
2018-04-03,139.8872
2018-04-04,140.8539
2018-04-05,141.115
2018-04-06,136.61
2018-04-09,136.6776
2018-04-10,139.4908
2018-04-11,136.668
2018-04-12,138.7561
2018-04-13,136.9193
2018-04-16,138.8141
2018-04-17,139.2782
2018-04-18,139.8099
2018-04-19,140.7379
2018-04-20,138.9108
2018-04-23,140.6509
2018-04-24,137.915
2018-04-25,136.7356
2018-04-26,137.451
2018-04-27,137.0256
2018-04-30,135.5465
2018-05-01,134.4251
2018-05-02,128.5667
2018-05-03,127.1166
2018-05-04,130.9908
2018-05-07,130.5333
2018-05-08,130.7377
2018-05-09,130.6695
2018-05-10,131.9058
2018-05-11,133.4243
2018-05-14,135.264
2018-05-15,134.4853
2018-05-16,136.1887
2018-05-17,137.6878
2018-05-18,137.2595
2018-05-21,138.7001
2018-05-22,140.4036
2018-05-23,138.3886
2018-05-24,138.8266
2018-05-25,138.447
2018-05-29,132.6455
2018-05-30,135.7994
2018-05-31,134.9428
2018-06-01,136.5197
2018-06-04,136.5684
2018-06-05,135.9454
2018-06-06,138.2231
2018-06-07,138.2913
2018-06-08,138.8364
2018-06-11,143.5379
2018-06-12,142.9636
2018-06-13,142.2725
2018-06-14,143.7229
2018-06-15,143.4114
2018-06-18,144.7936
2018-06-19,144.3556
2018-06-20,143.0415
2018-06-21,142.5548
2018-06-22,142.4672
2018-06-25,140.9195
2018-06-26,137.9603
2018-06-27,134.68
2018-06-28,134.8065
2018-06-29,136.1595
2018-07-02,137.1232
2018-07-03,135.5365
2018-07-05,137.2205
2018-07-06,137.9116
2018-07-09,141.8831
2018-07-10,140.9779
2018-07-11,139.0895
2018-07-12,138.486
2018-07-13,138.2329
2018-07-16,138.4568
2018-07-17,139.1576
2018-07-18,141.3478
2018-07-19,137.5126
2018-07-20,135.8188
2018-07-23,139.216
2018-07-24,138.6709
2018-07-25,141.3867
2018-07-26,144.4821
2018-07-27,144.7936
2018-07-30,143.0609
2018-07-31,141.7955
2018-08-01,139.0797
2018-08-02,136.5002
2018-08-03,137.9991
2018-08-06,137.5975
2018-08-07,137.911
2018-08-08,138.587
2018-08-09,136.8235
2018-08-10,134.3351
2018-08-13,133.5024
2018-08-14,135.8438
2018-08-15,134.4723
2018-08-16,135.8928
2018-08-17,136.6374
2018-08-20,138.3126
2018-08-21,138.9984
2018-08-22,138.0971
2018-08-23,136.1671
2018-08-24,138.3812
2018-08-27,141.2713
2018-08-28,141.0852
2018-08-29,140.8892
2018-08-30,139.1454
2018-08-31,139.0768
2018-09-04,140.2132
2018-09-05,140.997
2018-09-06,140.2818
2018-09-07,139.5862
2018-09-10,140.2622
2018-09-11,139.8312
2018-09-12,138.538
2018-09-13,140.4582
2018-09-14,144.4749
2018-09-17,141.1537
2018-09-18,143.0445
2018-09-19,145.4154
2018-09-20,146.3853
2018-09-21,146.9437
2018-09-24,145.6995
2018-09-25,145.0333
2018-09-26,143.6715
2018-09-27,145.964
2018-09-28,144.661
2018-10-01,145.8073
2018-10-02,145.7289
2018-10-03,147.4336
2018-10-04,148.8835
2018-10-05,146.7086
2018-10-08,147.9528
2018-10-09,145.9934
2018-10-10,140.6247
2018-10-11,132.6304
2018-10-12,133.0223
2018-10-15,132.9831
2018-10-16,134.2273
2018-10-17,135.5597
2018-10-18,131.2785
2018-10-19,133.1007
2018-10-22,130.4653
2018-10-23,129.6228
2018-10-24,120.1002
2018-10-25,123.6271
2018-10-26,119.5222
2018-10-29,120.59
2018-10-30,124.0288
2018-10-31,124.6558
2018-11-01,127.1834
2018-11-02,124.7467
2018-11-05,125.1018
2018-11-06,125.8319
2018-11-07,127.8246
2018-11-08,128.0515
2018-11-09,125.9404
2018-11-12,123.3754
2018-11-13,124.7763
2018-11-14,123.188
2018-11-15,124.9538
2018-11-16,124.8256
2018-11-19,124.2633
2018-11-20,120.5638
2018-11-21,121.9745
2018-11-23,121.9449
2018-11-26,126.2462
2018-11-27,124.4803
2018-11-28,130.5573
2018-11-29,125.8615
2018-11-30,128.0022
2018-12-03,129.1959
2018-12-04,119.7943
2018-12-06,117.7226
2018-12-07,114.2599
2018-12-10,110.9451
2018-12-11,110.1164
2018-12-12,111.1918
2018-12-13,110.659
2018-12-14,108.7057
2018-12-17,107.1963
2018-12-18,106.9398
2018-12-19,104.0493
2018-12-20,102.974
2018-12-21,98.9588
2018-12-24,96.2656
2018-12-26,101.3166
2018-12-27,102.678
2018-12-28,101.7605
2018-12-31,102.9641
2019-01-02,106.5057
2019-01-03,103.6843
2019-01-04,109.2384
2019-01-07,109.7416
2019-01-08,110.4321
2019-01-09,111.5765
2019-01-10,111.9119
2019-01-11,111.9119
2019-01-14,112.5038
2019-01-15,113.6285
2019-01-16,116.667
2019-01-17,116.9925
2019-01-18,119.4786
2019-01-22,117.6733
2019-01-23,117.2096
2019-01-24,118.1665
2019-01-25,119.4885
2019-01-28,120.1494
2019-01-29,119.745
2019-01-30,118.5611
2019-01-31,124.8947
2019-02-01,125.1807
2019-02-04,125.3781
2019-02-05,123.9772
2019-02-06,124.9834
2019-02-07,123.5332
2019-02-08,123.8785
2019-02-11,124.2534
2019-02-12,127.0946
2019-02-13,128.0515
2019-02-14,126.323
2019-02-15,129.8199
2019-02-19,131.0914
2019-02-20,132.0153
2019-02-21,130.8232
2019-02-22,134.0022
2019-02-25,131.0716
2019-02-26,130.1378
2019-02-27,131.002
2019-02-28,130.7636
2019-03-01,131.31
2019-03-04,129.7305
2019-03-05,129.2735
2019-03-06,127.0184
2019-03-07,124.0878
2019-03-08,123.5315
2019-03-11,123.5415
2019-03-12,123.7898
2019-03-13,124.0382
2019-03-14,124.2468
2019-03-15,128.2006
2019-03-18,129.502
2019-03-19,128.0218
2019-03-20,128.2801
2019-03-21,128.6973
2019-03-22,123.313
2019-03-25,122.9851
2019-03-26,125.0415
2019-03-27,124.7634
2019-03-28,126.1542
2019-03-29,127.2568
2019-04-01,131.8067
2019-04-02,135.2241
2019-04-03,135.6612
2019-04-04,136.3764
2019-04-05,137.0321
2019-04-08,137.6281
2019-04-09,135.5718
2019-04-10,137.6281
2019-04-11,138.7308
2019-04-12,141.6018
2019-04-15,140.3402
2019-04-16,143.1217
2019-04-17,142.3071
2019-04-18,142.327
2019-04-22,142.168
2019-04-23,143.8966
2019-04-24,143.0522
2019-04-25,144.1052
2019-04-26,145.6649
2019-04-29,146.7477
2019-04-30,145.804
2019-05-01,145.6351
2019-05-02,146.4
2019-05-03,147.85
2019-05-06,147.28
2019-05-07,144.27
2019-05-08,143.03
2019-05-09,142.83
2019-05-10,144.56
2019-05-13,139.38
2019-05-14,142.52
2019-05-15,142.25
2019-05-16,144.97
2019-05-17,143.79
2019-05-20,145.88
2019-05-21,148.4
2019-05-22,146.36
2019-05-23,144.36
2019-05-24,146.39
2019-05-28,144.25
2019-05-29,144.03
2019-05-30,143.35
2019-05-31,138.23
2019-06-03,140.78
2019-06-04,146.92
2019-06-05,147.5
2019-06-06,149.75
2019-06-07,149.87
2019-06-10,151.25
2019-06-11,151.92
2019-06-12,150.39
2019-06-13,151.46
2019-06-14,153.795
2019-06-17,148.235
2019-06-18,149.58
2019-06-19,148.305
2019-06-20,149.175
2019-06-21,147.37
2019-06-24,147.82
2019-06-25,144.08
2019-06-26,146.595
2019-06-27,144.23
2019-06-28,144.895
2019-07-01,145.505
2019-07-02,145.615
2019-07-03,147.89
2019-07-04,147.89
2019-07-05,149.81
2019-07-08,149.14
2019-07-09,149.46
2019-07-10,148.2
2019-07-11,149.94
2019-07-12,151.135
2019-07-15,149.83
2019-07-16,151.15
2019-07-17,148.75
2019-07-18,150.14
2019-07-19,148.9
2019-07-22,147.84
2019-07-23,149.015
2019-07-24,151.61
2019-07-25,147.095
2019-07-26,150.06
2019-07-29,149.73
2019-07-30,148.3
2019-07-31,145.26
2019-08-01,140.5
2019-08-02,135.265
2019-08-05,130.33
2019-08-06,133.47
2019-08-07,131
2019-08-08,134.77
2019-08-09,131.97
2019-08-12,125.285
2019-08-13,128.585
2019-08-14,122.61
2019-08-15,122.74
2019-08-16,126.49
2019-08-19,128.08
2019-08-20,126.295
2019-08-21,127.96
2019-08-22,128.77
2019-08-23,123.95
2019-08-26,125.77
2019-08-27,125.3
2019-08-28,125.71
2019-08-29,128.36
2019-08-30,129.035
2019-09-02,128.95
2019-09-03,127.07
2019-09-04,129.09
2019-09-05,133.57
2019-09-06,134.71
2019-09-09,137.815
2019-09-10,144.455
2019-09-11,145.46
2019-09-12,146.51
2019-09-13,147.4
2019-09-16,147.49
2019-09-17,146.225
2019-09-18,147.66
2019-09-19,147.33
2019-09-20,145.79
2019-09-23,147.165
2019-09-24,144.885
2019-09-25,145.41
2019-09-26,146.045
2019-09-27,147.34
2019-09-30,147.15
2019-10-01,140.56
2019-10-02,135.29
2019-10-03,134.895
2019-10-04,136.085
2019-10-07,135.095
2019-10-08,129.235
2019-10-09,132.25
2019-10-10,134.145
2019-10-11,138.25
2019-10-14,138.805
2019-10-15,141.425
2019-10-16,139.725
2019-10-17,140.56
2019-10-18,142.39
2019-10-21,144.305
2019-10-22,142.405
2019-10-23,143.71
2019-10-24,149.86
2019-10-25,149.69
2019-10-28,153.11
2019-10-29,153.67
2019-10-30,151.87
2019-10-31,150.795
2019-11-01,152.72
2019-11-04,155.33
2019-11-05,158.12
2019-11-06,157.67
2019-11-07,158
2019-11-08,158.38
2019-11-11,158.39
2019-11-12,158.93
2019-11-13,158.84
2019-11-14,159.14
2019-11-15,160
2019-11-18,158.05
2019-11-19,158.8
2019-11-20,158.31
2019-11-21,157.945
2019-11-22,159.685
2019-11-25,161.845
