date,close
2014-06-13,12.33
2014-06-16,13.42
2014-06-17,13.98
2014-06-18,14.99
2014-06-19,13.89
2014-06-20,15.37
2014-06-23,15.05
2014-06-24,14.19
2014-06-25,13.42
2014-06-26,14.22
2014-06-27,14.35
2014-06-30,14.31
2014-07-01,13.58
2014-07-02,13.02
2014-07-03,13.18
2014-07-07,12.4
2014-07-08,11.4
2014-07-09,12.32
2014-07-10,12.22
2014-07-11,12.35
2014-07-14,12.72
2014-07-15,12.2
2014-07-16,11.87
2014-07-17,11.11
2014-07-18,11.34
2014-07-21,11.1
2014-07-22,11.09
2014-07-23,11.66
2014-07-24,11.44
2014-07-25,11.24
2014-07-28,10.72
2014-07-29,11.95
2014-07-30,13.18
2014-07-31,12.65
2014-08-01,11.98
2014-08-04,11.76
2014-08-05,11.85
2014-08-06,11.551
2014-08-07,12.05
2014-08-08,12.89
2014-08-11,12.85
2014-08-12,13
2014-08-13,13.01
2014-08-14,14.44
2014-08-15,13.941
2014-08-18,14.58
2014-08-19,14.22
2014-08-20,13.655
2014-08-21,12.72
2014-08-22,12.8
2014-08-25,13.44
2014-08-26,15.1975
2014-08-27,14.77
2014-08-28,14.14
2014-08-29,14.57
2014-09-02,15.34
2014-09-03,16.27
2014-09-04,16.18
2014-09-05,15.82
2014-09-08,16.69
2014-09-09,16.13
2014-09-10,16.9
2014-09-11,16.96
2014-09-12,16.53
2014-09-15,15.22
2014-09-16,15.56
2014-09-17,16.07
2014-09-18,15.71
2014-09-19,15.25
2014-09-22,15.04
2014-09-23,14.95
2014-09-24,15.69
2014-09-25,14.97
2014-09-26,15.11
2014-09-29,15.05
2014-09-30,14.77
2014-10-01,13.76
2014-10-02,13.92
2014-10-03,14.03
2014-10-06,13.49
2014-10-07,12.51
2014-10-08,7.03
2014-10-09,6.92
2014-10-10,6.37
2014-10-13,6.03
2014-10-14,5.88
2014-10-15,6.47
2014-10-16,7.02
2014-10-17,6.45
2014-10-20,6.57
2014-10-21,6.8
2014-10-22,6.75
2014-10-23,6.92
2014-10-24,7.16
2014-10-27,6.96
2014-10-28,6.87
2014-10-29,6.7
2014-10-30,6.73
2014-10-31,6.52
2014-11-03,6.52
2014-11-04,6.41
2014-11-05,6.19
2014-11-06,6.305
2014-11-07,6.06
2014-11-10,6.21
2014-11-11,6.5
2014-11-12,6.53
2014-11-13,6.22
2014-11-14,6.04
2014-11-17,5.94
2014-11-18,5.95
2014-11-19,5.55
2014-11-20,5.74
2014-11-21,5.9
2014-11-24,6.165
2014-11-25,5.84
2014-11-26,5.78
2014-11-28,5.82
2014-12-01,5.39
2014-12-02,5.22
2014-12-03,5.35
2014-12-04,5
2014-12-05,5.73
2014-12-08,5.135
2014-12-09,5.71
2014-12-10,5.45
2014-12-11,5.93
2014-12-12,5.76
2014-12-15,5.45
2014-12-16,5.86
2014-12-17,6.09
2014-12-18,6.11
2014-12-19,6.39
2014-12-22,6.55
2014-12-23,6.275
2014-12-24,6.35
2014-12-26,6.52
2014-12-29,6.615
2014-12-30,7.57
2014-12-31,7.38
2015-01-02,7.71
2015-01-05,7.5
2015-01-06,6.955
2015-01-07,7.38
2015-01-08,8
2015-01-09,9.06
2015-01-12,6.9
2015-01-13,6.32
2015-01-14,6.71
2015-01-15,6.56
2015-01-16,6.86
2015-01-20,7.06
2015-01-21,6.76
2015-01-22,6.63
2015-01-23,6.43
2015-01-26,6.77
2015-01-27,6.77
2015-01-28,6.65
2015-01-29,6.6
2015-01-30,6.31
2015-02-02,6.15
2015-02-03,6.44
2015-02-04,6.21
2015-02-05,6.68
2015-02-06,6.39
2015-02-09,6.21
2015-02-10,6.32
2015-02-11,6.35
2015-02-12,6.56
2015-02-13,6.77
2015-02-17,7.11
2015-02-18,7.15
2015-02-19,7.1
2015-02-20,7.38
2015-02-23,7.83
2015-02-24,7.73
2015-02-25,7.89
2015-02-26,7.74
2015-02-27,7.53
2015-03-02,7.32
2015-03-03,7.21
2015-03-04,7.51
2015-03-05,7.94
2015-03-06,7.75
2015-03-09,7.4
2015-03-10,7.31
2015-03-11,7.55
2015-03-12,7.54
2015-03-13,7.53
2015-03-16,7.42
2015-03-17,7.54
2015-03-18,7.68
2015-03-19,7.725
2015-03-20,7.37
2015-03-23,7.05
2015-03-24,7.16
2015-03-25,6.89
2015-03-26,6.74
2015-03-27,6.98
2015-03-30,7
2015-03-31,6.765
2015-04-01,7.43
2015-04-02,7.6
2015-04-06,7.63
2015-04-07,7.75
2015-04-08,7.99
2015-04-09,7.95
2015-04-10,7.91
2015-04-13,8
2015-04-14,7.38
2015-04-15,7.09
2015-04-16,7.11
2015-04-17,7.08
2015-04-20,6.95
2015-04-21,6.74
2015-04-22,6.875
2015-04-23,7.23
2015-04-24,7.28
2015-04-27,7.05
2015-04-28,6.95
2015-04-29,7.03
2015-04-30,6.9
2015-05-01,6.97
2015-05-04,6.94
2015-05-05,6.93
2015-05-06,6.87
2015-05-07,6.86
2015-05-08,7.04
2015-05-11,6.69
2015-05-12,6.27
2015-05-13,6.17
2015-05-14,6.31
2015-05-15,6.29
2015-05-18,6.18
2015-05-19,6.08
2015-05-20,6.14
2015-05-21,6.16
2015-05-22,6.26
2015-05-26,6.12
2015-05-27,6.21
2015-05-28,6.25
2015-05-29,6.3
2015-06-01,6.21
2015-06-02,6.34
2015-06-03,6.425
2015-06-04,6.31
2015-06-05,6.56
2015-06-08,6.52
2015-06-09,6.4
2015-06-10,6.54
2015-06-11,6.78
2015-06-12,6.72
2015-06-15,6.74
2015-06-16,6.69
2015-06-17,7.2
2015-06-18,7.18
2015-06-19,7.13
2015-06-22,7.14
2015-06-23,7.44
2015-06-24,7.25
2015-06-25,7.195
2015-06-26,7.13
2015-06-29,6.9
2015-06-30,7.15
2015-07-01,6.95
2015-07-02,6.84
2015-07-06,6.88
2015-07-07,6.77
2015-07-08,6.57
2015-07-09,6.61
2015-07-10,6.68
2015-07-13,6.77
2015-07-14,6.97
2015-07-15,6.87
2015-07-16,6.89
2015-07-17,6.85
2015-07-20,6.66
2015-07-21,6.61
2015-07-22,6.58
2015-07-23,6.7
2015-07-24,6.45
2015-07-27,6.31
2015-07-28,6.28
2015-07-29,6.185
2015-07-30,6.1
2015-07-31,6.18
2015-08-03,6.04
2015-08-04,6.03
2015-08-05,6.77
2015-08-06,6.21
2015-08-07,6.11
2015-08-10,6.11
2015-08-11,5.96
2015-08-12,5.85
2015-08-13,5.77
2015-08-14,5.5
2015-08-17,5.83
2015-08-18,5.75
2015-08-19,5.55
2015-08-20,5.55
2015-08-21,5.57
2015-08-24,5.01
2015-08-25,5.16
2015-08-26,5.53
2015-08-27,5.67
2015-08-28,5.77
2015-08-31,5.93
2015-09-01,5.66
2015-09-02,5.83
2015-09-03,5.48
2015-09-04,5.52
2015-09-08,5.48
2015-09-09,5.55
2015-09-10,5.72
2015-09-11,6.4
2015-09-14,6.54
2015-09-15,7
2015-09-16,7.62
2015-09-17,7.47
2015-09-18,7.34
2015-09-21,7.41
2015-09-22,7.05
2015-09-23,6.74
2015-09-24,7.19
2015-09-25,7.26
2015-09-28,6.3
2015-09-29,5.75
2015-09-30,5.76
2015-10-01,5.64
2015-10-02,5.8
2015-10-05,6.2
2015-10-06,5.92
2015-10-07,5.69
2015-10-08,5.76
2015-10-09,5.89
2015-10-12,5.57
2015-10-13,5.26
2015-10-14,5.23
2015-10-15,5.5
2015-10-16,5.38
2015-10-19,5.25
2015-10-20,5.19
2015-10-21,4.9
2015-10-22,4.96
2015-10-23,5.35
2015-10-26,5.19
2015-10-27,5.24
2015-10-28,5.17
2015-10-29,5.19
2015-10-30,5.15
2015-11-02,5.35
2015-11-03,5.31
2015-11-04,5.47
2015-11-05,5.31
2015-11-06,5.35
2015-11-09,5.42
2015-11-10,5.45
2015-11-11,5.75
2015-11-12,5.5
2015-11-13,5.68
2015-11-16,5.73
2015-11-17,5.49
2015-11-18,5.57
2015-11-19,5.41
2015-11-20,5.39
2015-11-23,5.56
2015-11-24,5.79
2015-11-25,6.08
2015-11-27,6.29
2015-11-30,6.32
2015-12-01,6.15
2015-12-02,5.96
2015-12-03,5.5
2015-12-04,5.54
2015-12-07,6.24
2015-12-08,6.19
2015-12-09,5.98
2015-12-10,5.84
2015-12-11,5.64
2015-12-14,5.69
2015-12-15,5.58
2015-12-16,5.715
2015-12-17,6.12
2015-12-18,5.98
2015-12-21,6.1
2015-12-22,5.99
2015-12-23,6.08
2015-12-24,6.2
2015-12-28,6.19
2015-12-29,6.2
2015-12-30,6.13
2015-12-31,6.15
2016-01-04,5.98
2016-01-05,5.87
2016-01-06,5.45
2016-01-07,5.3
2016-01-08,5.36
2016-01-11,5.04
2016-01-12,4.98
2016-01-13,4.65
2016-01-14,4.79
2016-01-15,4.58
2016-01-19,3.84
2016-01-20,3.98
2016-01-21,4
2016-01-22,4.19
2016-01-25,3.84
2016-01-26,3.735
2016-01-27,3.64
2016-01-28,3.48
2016-01-29,3.48
2016-02-01,3.45
2016-02-02,3.25
2016-02-03,3.4
2016-02-04,3.69
2016-02-05,3.46
2016-02-08,3.24
2016-02-09,3.18
2016-02-10,3.21
2016-02-11,3.3
2016-02-12,3.36
2016-02-16,3.56
2016-02-17,3.94
2016-02-18,3.78
2016-02-19,3.94
2016-02-22,4.09
2016-02-23,3.88
2016-02-24,3.83
2016-02-25,3.86
2016-02-26,3.97
2016-02-29,3.9
2016-03-01,4.14
2016-03-02,4.43
2016-03-03,4.24
2016-03-04,4.33
2016-03-07,4.76
2016-03-08,4.59
2016-03-09,4.48
2016-03-10,4.35
2016-03-11,4.49
2016-03-14,4.51
2016-03-15,4.22
2016-03-16,4.21
2016-03-17,4.21
2016-03-18,4.53
2016-03-21,4.5
2016-03-22,4.82
2016-03-23,4.4
2016-03-24,4.57
2016-03-28,4.47
2016-03-29,4.91
2016-03-30,4.74
2016-03-31,4.82
2016-04-01,4.9
2016-04-04,5.03
2016-04-05,5.1
2016-04-06,5.25
2016-04-07,5.34
2016-04-08,5.19
2016-04-11,5.16
2016-04-12,5.26
2016-04-13,5.94
2016-04-14,6.18
2016-04-15,6.23
2016-04-18,6.43
2016-04-19,6.25
2016-04-20,6.14
2016-04-21,6.13
2016-04-22,6.26
2016-04-25,6.24
2016-04-26,6.01
2016-04-27,5.94
2016-04-28,5.92
2016-04-29,5.79
2016-05-02,6.02
2016-05-03,5.81
2016-05-04,5.74
2016-05-05,5.67
2016-05-06,5.59
2016-05-09,5.76
2016-05-10,5.72
2016-05-11,5.58
2016-05-12,5.33
2016-05-13,5.23
2016-05-16,5.09
2016-05-17,4.945
2016-05-18,4.99
2016-05-19,5.01
2016-05-20,5.42
2016-05-23,5.64
2016-05-24,5.75
2016-05-25,5.88
2016-05-26,5.84
2016-05-27,5.89
2016-05-31,6.13
2016-06-01,6.03
2016-06-02,6.18
2016-06-03,6.12
2016-06-06,6.24
2016-06-07,6.15
2016-06-08,6.08
2016-06-09,5.99
2016-06-10,5.85
2016-06-13,5.87
2016-06-14,5.71
2016-06-15,5.81
2016-06-16,5.93
2016-06-17,5.74
2016-06-20,5.88
2016-06-21,5.65
2016-06-22,5.68
2016-06-23,5.88
2016-06-24,5.47
2016-06-27,5.14
2016-06-28,5.31
2016-06-29,5.41
2016-06-30,5.32
2016-07-01,5.5
2016-07-05,5.37
2016-07-06,5.48
2016-07-07,5.56
2016-07-08,5.73
2016-07-11,5.77
2016-07-12,5.85
2016-07-13,5.6
2016-07-14,5.54
2016-07-15,5.81
2016-07-18,5.89
2016-07-19,5.6
2016-07-20,5.73
2016-07-21,5.58
2016-07-22,5.65
2016-07-25,5.65
2016-07-26,5.75
2016-07-27,6.01
2016-07-28,5.98
2016-07-29,5.96
2016-08-01,5.86
2016-08-02,5.74
2016-08-03,5.89
2016-08-04,5.9
2016-08-05,5.99
2016-08-08,5.9
2016-08-09,6.39
2016-08-10,5.83
2016-08-11,5.74
2016-08-12,5.96
2016-08-15,6.12
2016-08-16,6.17
2016-08-17,6.34
2016-08-18,7.06
2016-08-19,7.5
2016-08-22,7.75
2016-08-23,8.08
2016-08-24,6.89
2016-08-25,6.88
2016-08-26,6.95
2016-08-29,6.89
2016-08-30,7.08
2016-08-31,6.93
2016-09-01,7.06
2016-09-02,7.15
2016-09-06,7.16
2016-09-07,7.34
2016-09-08,7.65
2016-09-09,7.16
2016-09-12,7.22
2016-09-13,6.94
2016-09-14,7.06
2016-09-15,7.14
2016-09-16,7.08
2016-09-19,7.08
2016-09-20,7.36
2016-09-21,7.21
2016-09-22,7.27
2016-09-23,7.22
2016-09-26,7.04
2016-09-27,7.13
2016-09-28,7.04
2016-09-29,7.3
2016-09-30,7.35
2016-10-03,7.18
2016-10-04,7.29
2016-10-05,7.52
2016-10-06,7.03
2016-10-07,7.04
2016-10-10,7.24
2016-10-11,6.95
2016-10-12,6.82
2016-10-13,6.95
2016-10-14,6.64
2016-10-17,6.59
2016-10-18,6.65
2016-10-19,6.65
2016-10-20,6.83
2016-10-21,6.7
2016-10-24,6.56
2016-10-25,6.33
2016-10-26,6.15
2016-10-27,6.04
2016-10-28,5.865
2016-10-31,5.8
2016-11-01,6.02
2016-11-02,5.84
2016-11-03,5.585
2016-11-04,5.68
2016-11-07,5.87
2016-11-08,6.11
2016-11-09,4.2
2016-11-10,4.3
2016-11-11,4.18
2016-11-14,4.42
2016-11-15,4.73
2016-11-16,4.44
2016-11-17,4.51
2016-11-18,4.42
2016-11-21,4.35
2016-11-22,4.44
2016-11-23,4.49
2016-11-25,4.67
2016-11-28,4.46
2016-11-29,4.39
2016-11-30,1.44
2016-12-01,1.32
2016-12-02,1.44
2016-12-05,1.42
2016-12-06,1.38
2016-12-07,1.37
2016-12-08,1.37
2016-12-09,1.35
2016-12-12,1.28
2016-12-13,1.27
2016-12-14,1.27
2016-12-15,1.27
2016-12-16,1.24
2016-12-19,1.25
2016-12-20,1.24
2016-12-21,1.27
2016-12-22,1.37
2016-12-23,1.59
2016-12-27,1.53
2016-12-28,1.55
2016-12-29,1.65
2016-12-30,1.55
2017-01-03,1.68
2017-01-04,1.69
2017-01-05,1.6
2017-01-06,1.96
2017-01-09,1.89
2017-01-10,2.02
2017-01-11,2.23
2017-01-12,2.17
2017-01-13,2.06
2017-01-17,1.95
2017-01-18,1.96
2017-01-19,1.84
2017-01-20,1.82
2017-01-23,1.73
2017-01-24,1.75
2017-01-25,1.83
2017-01-26,1.76
2017-01-27,1.78
2017-01-30,1.75
2017-01-31,1.94
2017-02-01,1.74
2017-02-02,1.82
2017-02-03,1.9
2017-02-06,1.88
2017-02-07,1.96
2017-02-08,2.02
2017-02-09,2.05
2017-02-10,1.97
2017-02-13,1.93
2017-02-14,2.01
2017-02-15,2.12
2017-02-16,2.19
2017-02-17,2.17
2017-02-21,2.15
2017-02-22,2.14
2017-02-23,2.12
2017-02-24,2.15
2017-02-27,2.36
2017-02-28,2.26
2017-03-01,2.33
2017-03-02,2.25
2017-03-03,2.22
2017-03-06,2.18
2017-03-07,2.1
2017-03-08,2.13
2017-03-09,2.12
2017-03-10,2.12
2017-03-13,2.12
2017-03-14,2.08
2017-03-15,2.14
2017-03-16,2.08
2017-03-17,2.05
2017-03-20,1.97
2017-03-21,1.83
2017-03-22,1.8
2017-03-23,1.85
2017-03-24,1.87
2017-03-27,1.89
2017-03-28,1.82
2017-03-29,1.93
2017-03-30,1.88
2017-03-31,1.85
2017-04-03,1.82
2017-04-04,1.7
2017-04-05,1.66
2017-04-06,1.69
2017-04-07,1.66
2017-04-10,1.62
2017-04-11,1.66
2017-04-12,1.65
2017-04-13,1.58
2017-04-17,1.57
2017-04-18,1.51
2017-04-19,1.51
2017-04-20,1.51
2017-04-21,1.52
2017-04-24,1.48
2017-04-25,1.52
2017-04-26,1.53
2017-04-27,1.56
2017-04-28,1.55
2017-05-01,1.58
2017-05-02,1.56
2017-05-03,1.56
2017-05-04,1.77
2017-05-05,1.75
2017-05-08,1.66
2017-05-09,1.69
2017-05-10,1.7
2017-05-11,1.77
2017-05-12,1.7
2017-05-15,1.74
2017-05-16,1.74
2017-05-17,1.66
2017-05-18,1.63
2017-05-19,1.64
2017-05-22,1.64
2017-05-23,1.64
2017-05-24,1.6
2017-05-25,1.57
2017-05-26,1.54
2017-05-30,1.5
2017-05-31,1.44
2017-06-01,1.53
2017-06-02,1.62
2017-06-05,1.56
2017-06-06,1.65
2017-06-07,1.65
2017-06-08,1.61
2017-06-09,1.62
2017-06-12,1.58
2017-06-13,1.57
2017-06-14,1.61
2017-06-15,1.68
2017-06-16,1.59
2017-06-19,1.65
2017-06-20,1.63
2017-06-21,1.76
2017-06-22,1.73
2017-06-23,1.55
2017-06-26,1.59
2017-06-27,1.59
2017-06-28,1.63
2017-06-29,1.58
2017-06-30,1.62
2017-07-03,1.65
2017-07-05,1.67
2017-07-06,1.6
2017-07-07,1.62
2017-07-10,1.56
2017-07-11,1.53
2017-07-12,1.56
2017-07-13,1.56
2017-07-14,1.52
2017-07-17,1.55
2017-07-18,1.53
2017-07-19,1.52
2017-07-20,1.5
2017-07-21,1.51
2017-07-24,1.58
2017-07-25,1.6
2017-07-26,1.88
2017-07-27,1.85
2017-07-28,1.79
2017-07-31,1.76
2017-08-01,1.72
2017-08-02,1.69
2017-08-03,1.7
2017-08-04,1.84
2017-08-07,2.04
2017-08-08,1.92
2017-08-09,1.84
2017-08-10,1.75
2017-08-11,1.84
2017-08-14,1.94
2017-08-15,1.94
2017-08-16,1.92
2017-08-17,2.01
2017-08-18,2.12
2017-08-21,2.03
2017-08-22,2.12
2017-08-23,2.22
2017-08-24,2.81
2017-08-25,2.58
2017-08-28,2.74
2017-08-29,2.64
2017-08-30,2.74
2017-08-31,2.8
2017-09-01,2.86
2017-09-05,2.97
2017-09-06,3.01
2017-09-07,3.31
2017-09-08,3.11
2017-09-11,3.43
2017-09-12,3.44
2017-09-13,3.53
2017-09-14,2.79
2017-09-15,3.3
2017-09-18,3.31
2017-09-19,3.22
2017-09-20,3.52
2017-09-21,3.51
2017-09-22,3.55
2017-09-25,3.74
2017-09-26,3.66
2017-09-27,3.95
2017-09-28,4.22
2017-09-29,4.33
2017-10-02,4.45
2017-10-03,4.5
2017-10-04,4.4
2017-10-05,4.38
2017-10-06,4.25
2017-10-09,4.36
2017-10-10,3.99
2017-10-11,4.1
2017-10-12,4.06
2017-10-13,4
2017-10-16,3.89
2017-10-17,3.92
2017-10-18,3.9
2017-10-19,4
2017-10-20,3.87
2017-10-23,3.89
2017-10-24,3.82
2017-10-25,3.74
2017-10-26,3.39
2017-10-27,3.65
2017-10-30,3.65
2017-10-31,3.64
2017-11-01,3.51
2017-11-02,3.56
2017-11-03,3.71
2017-11-06,3.67
2017-11-07,3.57
2017-11-08,3.59
2017-11-09,3.64
2017-11-10,3.68
2017-11-13,3.61
2017-11-14,3.56
2017-11-15,3.59
2017-11-16,3.59
2017-11-17,3.7
2017-11-20,3.69
2017-11-21,3.63
2017-11-22,3.64
2017-11-24,3.7
2017-11-27,3.84
2017-11-28,3.89
2017-11-29,3.54
2017-11-30,3.57
2017-12-01,3.49
2017-12-04,3.33
2017-12-05,3.33
2017-12-06,3.46
2017-12-07,3.6
2017-12-08,3.45
2017-12-11,3.51
2017-12-12,3.55
2017-12-13,3.4
2017-12-14,3.15
2017-12-15,3.14
2017-12-18,3.23
2017-12-19,3.26
2017-12-20,3.43
2017-12-21,3.38
2017-12-22,3.71
2017-12-26,3.79
2017-12-27,3.84
2017-12-28,3.97
2017-12-29,3.68
2018-01-02,3.72
2018-01-03,4.64
2018-01-04,4.85
2018-01-05,4.87
2018-01-08,4.55
2018-01-09,4.62
2018-01-10,4.4
2018-01-11,5.04
2018-01-12,5.72
2018-01-16,5.6
2018-01-17,5.72
2018-01-18,5.72
2018-01-19,6.29
2018-01-22,6.39
2018-01-23,6.28
2018-01-24,6.11
2018-01-25,6.29
2018-01-26,6.12
2018-01-29,6.17
2018-01-30,6.14
2018-01-31,6.18
2018-02-01,6.15
2018-02-02,5.9
2018-02-05,5.45
2018-02-06,5.71
2018-02-07,5.86
2018-02-08,5.66
2018-02-09,5.59
2018-02-12,5.31
2018-02-13,5.16
2018-02-14,5.47
2018-02-15,5.83
2018-02-16,5.57
2018-02-20,5.65
2018-02-21,5.54
2018-02-22,5.54
2018-02-23,5.8
2018-02-26,6.56
2018-02-27,6.45
2018-02-28,6.48
2018-03-01,6.28
2018-03-02,6.66
2018-03-05,7.28
2018-03-06,7.46
2018-03-07,7.39
2018-03-08,7.34
2018-03-09,7.41
2018-03-12,7.54
2018-03-13,7.64
2018-03-14,7.37
2018-03-15,7.57
2018-03-16,7.53
2018-03-19,7.17
2018-03-20,7.19
2018-03-21,7.32
2018-03-22,6.91
2018-03-23,6.75
2018-03-26,6.94
2018-03-27,6.91
2018-03-28,6.72
2018-03-29,7.21
2018-04-02,6.86
2018-04-03,6.69
2018-04-04,7.11
2018-04-05,6.85
2018-04-06,6.37
2018-04-09,6.38
2018-04-10,6.76
2018-04-11,7.23
2018-04-12,7.25
2018-04-13,7.22
2018-04-16,6.84
2018-04-17,6.85
2018-04-18,7.01
2018-04-19,6.95
2018-04-20,6.97
2018-04-23,6.85
2018-04-24,6.52
2018-04-25,6.61
2018-04-26,6.74
2018-04-27,6.66
2018-04-30,6.42
2018-05-01,6.43
2018-05-02,7.14
2018-05-03,7.38
2018-05-04,7.17
2018-05-07,7.77
2018-05-08,7.75
2018-05-09,9
2018-05-10,9.12
2018-05-11,9.88
2018-05-14,9.42
2018-05-15,9.6
2018-05-16,9.51
2018-05-17,9.53
2018-05-18,10
2018-05-21,9.77
2018-05-22,9.74
2018-05-23,9.77
2018-05-24,9.77
2018-05-25,10.05
2018-05-29,10.3
2018-05-30,10.89
2018-05-31,10.72
2018-06-01,10.91
2018-06-04,10.79
2018-06-05,10.61
2018-06-06,10.69
2018-06-07,10.37
2018-06-08,10.31
2018-06-11,11.11
2018-06-12,11.35
2018-06-13,11.66
2018-06-14,11.65
2018-06-15,11.07
2018-06-18,13.73
2018-06-19,14.02
2018-06-20,13.13
2018-06-21,13.18
2018-06-22,13.26
2018-06-25,13.47
2018-06-26,13.32
2018-06-27,13.22
2018-06-28,12.95
2018-06-29,13.6
2018-07-02,14.87
2018-07-03,15.02
2018-07-05,15.3
2018-07-06,15.83
2018-07-09,16.4
2018-07-10,16.11
2018-07-11,16.42
2018-07-12,16.41
2018-07-13,16.41
2018-07-16,15.8
2018-07-17,16.45
2018-07-18,16.67
2018-07-19,16.31
2018-07-20,16.03
2018-07-23,16.51
2018-07-24,16.6
2018-07-25,16.89
2018-07-26,17.44
2018-07-27,16.07
2018-07-30,14
2018-07-31,14.57
2018-08-01,15.14
2018-08-02,15.32
2018-08-03,14.54
2018-08-06,14.24
2018-08-07,15.1
2018-08-08,16.12
2018-08-09,16.51
2018-08-10,16.89
2018-08-13,16.3
2018-08-14,16.35
2018-08-15,14.75
2018-08-16,14.33
2018-08-17,14.51
2018-08-20,14.17
2018-08-21,14.1
2018-08-22,14.39
2018-08-23,14.39
2018-08-24,14.69
2018-08-27,14.74
2018-08-28,14.73
2018-08-29,14.68
2018-08-30,14.4
2018-08-31,14.76
2018-09-04,15.31
2018-09-05,14.1
2018-09-06,19.39
2018-09-07,19.74
2018-09-10,20.3
2018-09-11,19.82
2018-09-12,19.13
2018-09-13,18.33
2018-09-14,18.91
2018-09-17,18.21
2018-09-18,18.84
2018-09-19,18.58
2018-09-20,18.88
2018-09-21,17.77
2018-09-24,18.7
2018-09-25,19.37
2018-09-26,19.11
2018-09-27,19
2018-09-28,19.17
2018-10-01,19.21
2018-10-02,19.7
2018-10-03,18.56
2018-10-04,15.33
2018-10-05,14.74
2018-10-08,13.75
2018-10-09,13.76
2018-10-10,12.64
2018-10-11,12.88
2018-10-12,13.11
2018-10-15,13.15
2018-10-16,13.87
2018-10-17,13.49
2018-10-18,13.35
2018-10-19,13.05
2018-10-22,12.98
2018-10-23,12.96
2018-10-24,11.98
2018-10-25,12.57
2018-10-26,12.66
2018-10-29,12.25
2018-10-30,12.46
2018-10-31,12.72
2018-11-01,14.22
2018-11-02,14.49
2018-11-05,14.48
2018-11-06,14.79
2018-11-07,16.01
2018-11-08,15.35
2018-11-09,14.49
2018-11-12,12.83
2018-11-13,12.47
2018-11-14,12.06
2018-11-15,12.98
2018-11-16,13.39
2018-11-19,12.21
2018-11-20,12.3
2018-11-21,12.95
2018-11-23,13
2018-11-26,13.5
2018-11-27,13.42
2018-11-28,14.8
2018-11-29,14.61
2018-11-30,14.52
2018-12-03,15.09
2018-12-04,13.53
2018-12-06,13.63
2018-12-07,13.13
2018-12-10,13.66
2018-12-11,13.62
2018-12-12,15.19
2018-12-13,14.8
2018-12-14,14.32
2018-12-17,13.96
2018-12-18,13.73
2018-12-19,13.45
2018-12-20,12.87
2018-12-21,11.21
2018-12-24,10.74
2018-12-26,11.96
2018-12-27,11.97
2018-12-28,11.94
2018-12-31,12.42
2019-01-02,13.12
2019-01-03,12.05
2019-01-04,13.18
2019-01-07,14.11
2019-01-08,14.5
2019-01-09,14.76
2019-01-10,15
2019-01-11,14.87
2019-01-14,14.22
2019-01-15,14.66
2019-01-16,14.51
2019-01-17,14.63
2019-01-18,14.52
2019-01-22,13.1
2019-01-23,12.81
2019-01-24,13.05
2019-01-25,13.72
2019-01-28,13.18
2019-01-29,13.2
2019-01-30,13.62
2019-01-31,14.12
2019-02-01,14.3
2019-02-04,14.35
2019-02-05,13.81
2019-02-06,13.84
2019-02-07,13.3
2019-02-08,15.66
2019-02-11,16.92
2019-02-12,17.35
2019-02-13,17.28
2019-02-14,17.61
2019-02-15,17.92
2019-02-19,18.13
2019-02-20,18.1
2019-02-21,18.02
2019-02-22,18.4
2019-02-25,19.12
2019-02-26,19.15
2019-02-27,19.7
2019-02-28,19.52
2019-03-01,20.18
2019-03-04,19.84
2019-03-05,19.64
2019-03-06,18
2019-03-07,18.13
2019-03-08,18.41
2019-03-11,19.06
2019-03-12,19.32
2019-03-13,19.3
2019-03-14,18.55
2019-03-15,18.62
2019-03-18,18.88
2019-03-19,18.83
2019-03-20,18.54
2019-03-21,19.07
2019-03-22,17.77
2019-03-25,18.07
2019-03-26,18.42
2019-03-27,17.76
2019-03-28,18.09
2019-03-29,18.35
2019-04-01,18.3
2019-04-02,18.78
2019-04-03,19.49
2019-04-04,19.35
2019-04-05,19.98
2019-04-08,19.75
2019-04-09,19.22
2019-04-10,19.49
2019-04-11,19.05
2019-04-12,18.32
2019-04-15,18.65
2019-04-16,19.25
2019-04-17,18.38
2019-04-18,18.17
2019-04-22,18.53
2019-04-23,19.07
2019-04-24,18.94
2019-04-25,19.05
2019-04-26,19
2019-04-29,18.34
2019-04-30,17.98
2019-05-01,17.43
2019-05-02,17.81
2019-05-03,18.14
2019-05-06,18.55
2019-05-07,18.01
2019-05-08,18.33
2019-05-09,19.45
2019-05-10,19.51
2019-05-13,18.025
2019-05-14,18.6
2019-05-15,19.17
2019-05-16,19.47
2019-05-17,19.46
2019-05-20,18.94
2019-05-21,21.35
2019-05-22,21.79
2019-05-23,21.97
2019-05-24,24.04
2019-05-28,25.02
2019-05-29,24.99
2019-05-30,24.6
2019-05-31,23.71
2019-06-03,24.41
2019-06-04,25.55
2019-06-05,26.42
2019-06-06,26.61
2019-06-07,27.05
2019-06-10,26.54
2019-06-11,26.99
2019-06-12,26.37
2019-06-13,26.07
2019-06-14,25.96
2019-06-17,26.465
2019-06-18,27.755
2019-06-19,27.41
2019-06-20,27.19
2019-06-21,27.98
2019-06-24,27.47
2019-06-25,27.37
2019-06-26,27.69
2019-06-27,28.635
2019-06-28,26.47
2019-07-01,26.505
2019-07-02,26.31
2019-07-03,26.76
2019-07-04,26.76
2019-07-05,26.54
2019-07-08,26.24
2019-07-09,26.83
2019-07-10,26.55
2019-07-11,26.325
2019-07-12,27.17
2019-07-15,27.82
2019-07-16,28.15
2019-07-17,28.55
2019-07-18,29.58
2019-07-19,29.275
2019-07-22,29.85
2019-07-23,29.785
2019-07-24,29.2
2019-07-25,28.845
2019-07-26,29.48
2019-07-29,28.65
2019-07-30,29.445
2019-07-31,29.07
2019-08-01,29.51
2019-08-02,29.16
2019-08-05,27.76
2019-08-06,28.42
2019-08-07,28.74
2019-08-08,29.075
2019-08-09,29.12
2019-08-12,29.31
2019-08-13,29.59
2019-08-14,29.79
2019-08-15,29.24
2019-08-16,31.155
2019-08-19,33.62
2019-08-20,33.795
2019-08-21,34.48
2019-08-22,32.26
2019-08-23,30.74
2019-08-26,32.175
2019-08-27,32.875
2019-08-28,34.385
2019-08-29,34.82
2019-08-30,34.27
2019-09-02,34.205
2019-09-03,33.14
2019-09-04,34.24
2019-09-05,31.845
2019-09-06,31.525
2019-09-09,28.685
2019-09-10,28.605
2019-09-11,30.9
2019-09-12,30.205
2019-09-13,29.93
2019-09-16,29.47
2019-09-17,29.51
2019-09-18,29.27
2019-09-19,29.095
2019-09-20,28.845
2019-09-23,28.9
2019-09-24,28.085
2019-09-25,28.255
2019-09-26,27.27
2019-09-27,26.97
2019-09-30,28.125
2019-10-01,28.17
2019-10-02,28.9
2019-10-03,29.9
2019-10-04,30.63
2019-10-07,31.93
2019-10-08,31.545
2019-10-09,31.29
2019-10-10,32.005
2019-10-11,32.48
2019-10-14,33.005
2019-10-15,34.23
2019-10-16,34.505
2019-10-17,36.6
2019-10-18,35.99
2019-10-21,36.485
2019-10-22,38.915
2019-10-23,39.75
2019-10-24,36.85
2019-10-25,38.52
2019-10-28,39.245
2019-10-29,39.915
2019-10-30,40.06
2019-10-31,40.01
2019-11-01,41.445
2019-11-04,39.54
2019-11-05,39.675
2019-11-06,39.095
2019-11-07,39.53
2019-11-08,42.025
2019-11-11,42.865
2019-11-12,45.245
2019-11-13,48.475
2019-11-14,48.55
2019-11-15,47.2
2019-11-18,48.075
2019-11-19,50.54
2019-11-20,48.335
2019-11-21,49.06
2019-11-22,49.18
2019-11-25,56.78
