date,close
2014-05-13,8.85
2014-05-14,8.85
2014-05-15,7.5
2014-05-19,7.5
2014-05-20,7.5
2014-05-21,6.825
2014-05-22,7.5
2014-05-23,7.275
2014-05-27,8.25
2014-05-28,8.925
2014-05-29,8.925
2014-05-30,9.15
2014-06-02,8.76
2014-06-03,8.625
2014-06-04,8.625
2014-06-05,9.675
2014-06-06,9.18
2014-06-09,8.8501
2014-06-10,9.1648
2014-06-11,10.5
2014-06-12,10.725
2014-06-13,10.1852
2014-06-16,9.45
2014-06-17,9.997
2014-06-18,9.9
2014-06-19,9.9015
2014-06-20,9.3
2014-06-23,9.15
2014-06-24,9.09
2014-06-25,8.73
2014-06-26,8.3849
2014-06-27,8.13
2014-06-30,7.95
2014-07-01,7.665
2014-07-02,7.884
2014-07-03,7.5
2014-07-07,8.099
2014-07-09,7.7359
2014-07-10,7.5
2014-07-11,7.047
2014-07-14,6.9002
2014-07-15,6.975
2014-07-16,6.795
2014-07-17,6.5102
2014-07-18,6.9
2014-07-21,7.035
2014-07-22,7.59
2014-07-23,7.275
2014-07-24,7.1514
2014-07-25,7.1514
2014-07-28,6.975
2014-07-29,7.5
2014-07-30,7.5
2014-07-31,7.575
2014-08-01,7.425
2014-08-04,7.8
2014-08-05,7.635
2014-08-06,7.8
2014-08-07,7.8
2014-08-08,7.875
2014-08-11,7.875
2014-08-12,7.425
2014-08-13,7.32
2014-08-14,7.4775
2014-08-15,7.125
2014-08-18,7.4145
2014-08-19,6.81
2014-08-20,6.75
2014-08-22,6.7797
2014-08-25,6.975
2014-08-26,6.885
2014-08-27,6.72
2014-08-28,6.9
2014-08-29,6.9
2014-09-02,6.675
2014-09-03,6.69
2014-09-04,6.675
2014-09-05,6.6
2014-09-08,7.215
2014-09-09,6.975
2014-09-10,7.05
2014-09-11,6.9
2014-09-12,7.14
2014-09-15,7.2
2014-09-16,6.9
2014-09-17,6.915
2014-09-18,7.035
2014-09-19,6.75
2014-09-22,6.12
2014-09-23,6.09
2014-09-24,6.105
2014-09-25,5.955
2014-09-26,5.835
2014-09-29,5.745
2014-09-30,5.475
2014-10-01,5.475
2014-10-02,5.94
2014-10-03,5.46
2014-10-06,5.355
2014-10-07,5.55
2014-10-08,5.541
2014-10-09,5.16
2014-10-10,5.16
2014-10-13,5.6955
2014-10-14,5.25
2014-10-15,5.055
2014-10-16,5.175
2014-10-17,5.2771
2014-10-21,5.325
2014-10-22,5.1955
2014-10-23,5.1
2014-10-24,5.295
2014-10-27,5.1175
2014-10-28,5.25
2014-10-29,5.148
2014-10-30,5.148
2014-10-31,5.5499
2014-11-03,5.985
2014-11-04,5.7
2014-11-05,5.1
2014-11-06,5.25
2014-11-07,5.175
2014-11-10,4.95
2014-11-11,5.145
2014-11-12,5.2062
2014-11-13,5.055
2014-11-14,5.925
2014-11-17,5.16
2014-11-18,5.2499
2014-11-19,4.995
2014-11-20,4.995
2014-11-21,5.055
2014-11-24,5.085
2014-11-25,5.055
2014-11-26,4.995
2014-11-28,5.28
2014-12-01,5.01
2014-12-02,5.025
2014-12-03,5.13
2014-12-04,5.085
2014-12-05,5.265
2014-12-08,5.475
2014-12-09,5.1468
2014-12-10,5.19
2014-12-11,5.25
2014-12-12,5.1
2014-12-15,5.16
2014-12-16,5.07
2014-12-17,5.04
2014-12-18,5.085
2014-12-19,5.055
2014-12-22,5.055
2014-12-23,5.2348
2014-12-24,5.055
2014-12-26,4.929
2014-12-29,4.905
2014-12-30,4.8
2014-12-31,4.725
2015-01-02,4.7262
2015-01-05,4.962
2015-01-06,4.9785
2015-01-07,5.145
2015-01-08,5.61
2015-01-09,5.58
2015-01-12,5.4435
2015-01-13,5.5485
2015-01-14,5.115
2015-01-15,5.3985
2015-01-16,5.3535
2015-01-20,5.46
2015-01-21,5.562
2015-01-22,5.613
2015-01-23,5.5965
2015-01-26,5.625
2015-01-27,5.385
2015-01-28,5.4915
2015-01-29,5.385
2015-01-30,5.385
2015-02-02,5.4
2015-02-03,5.295
2015-02-04,5.37
2015-02-05,5.535
2015-02-06,5.46
2015-02-09,5.28
2015-02-10,5.535
2015-02-11,5.49
2015-02-12,5.6388
2015-02-13,5.625
2015-02-17,5.5965
2015-02-18,5.58
2015-02-19,5.325
2015-02-20,5.4165
2015-02-23,5.31
2015-02-24,5.325
2015-02-25,5.325
2015-02-26,5.526
2015-02-27,5.5872
2015-03-02,5.676
2015-03-03,5.4
2015-03-04,5.625
2015-03-05,5.55
2015-03-06,5.94
2015-03-09,6.12
2015-03-10,6.18
2015-03-11,6.06
2015-03-12,6.0449
2015-03-13,5.9757
2015-03-16,5.8502
2015-03-17,5.925
2015-03-18,5.8788
2015-03-19,5.967
2015-03-20,5.865
2015-03-23,5.925
2015-03-24,5.7015
2015-03-25,6.45
2015-03-26,6.96
2015-03-27,6.7086
2015-03-30,6.705
2015-03-31,6.2002
2015-04-01,6.2754
2015-04-02,6.525
2015-04-06,6.255
2015-04-07,6.1048
2015-04-08,6.0598
2015-04-09,6.15
2015-04-10,6.39
2015-04-13,6.375
2015-04-14,6.48
2015-04-15,7.1219
2015-04-16,7.035
2015-04-17,7.005
2015-04-20,6.705
2015-04-21,6.39
2015-04-22,6.57
2015-04-23,6.6299
2015-04-24,6.36
2015-04-27,5.925
2015-04-28,5.685
2015-04-29,5.88
2015-04-30,5.715
2015-05-01,5.82
2015-05-04,5.67
2015-05-05,5.55
2015-05-06,5.505
2015-05-07,5.745
2015-05-08,5.595
2015-05-11,5.58
2015-05-12,5.67
2015-05-13,5.4
2015-05-14,5.31
2015-05-15,5.235
2015-05-18,5.04
2015-05-19,4.83
2015-05-20,4.92
2015-05-21,4.9855
2015-05-22,5.01
2015-05-26,4.845
2015-05-27,4.905
2015-05-28,4.89
2015-05-29,4.575
2015-06-01,4.59
2015-06-02,4.395
2015-06-03,4.365
2015-06-04,4.155
2015-06-05,4.05
2015-06-08,3.99
2015-06-09,4.035
2015-06-10,4.0348
2015-06-11,4.05
2015-06-12,4.08
2015-06-15,3.855
2015-06-16,3.57
2015-06-17,3.39
2015-06-18,3.105
2015-06-19,3.12
2015-06-22,3.4798
2015-06-23,3.3
2015-06-24,3.135
2015-06-25,3.21
2015-06-26,3.15
2015-06-29,3.15
2015-06-30,3.195
2015-07-01,3.255
2015-07-02,3.4649
2015-07-06,2.985
2015-07-07,2.865
2015-07-08,2.955
2015-07-09,3.135
2015-07-10,3.1052
2015-07-13,3.315
2015-07-14,3.3001
2015-07-15,3.225
2015-07-16,3.9375
2015-07-17,4.32
2015-07-20,4.185
2015-07-21,4.305
2015-07-22,4.53
2015-07-23,4.74
2015-07-24,4.575
2015-07-27,4.6198
2015-07-28,4.575
2015-07-29,4.515
2015-07-30,4.2945
2015-07-31,4.65
2015-08-03,4.38
2015-08-04,4.2
2015-08-05,4.2735
2015-08-06,4.245
2015-08-07,4.1706
2015-08-10,4.155
2015-08-11,4.155
2015-08-12,4.125
2015-08-13,4.035
2015-08-14,3.975
2015-08-17,3.87
2015-08-18,3.975
2015-08-19,3.9
2015-08-20,3.765
2015-08-21,3.915
2015-08-24,3.63
2015-08-25,3.525
2015-08-26,3.36
2015-08-27,3.42
2015-08-28,3.27
2015-08-31,3.18
2015-09-01,3.09
2015-09-02,3.075
2015-09-03,3.255
2015-09-04,3.27
2015-09-08,3.495
2015-09-09,3.465
2015-09-10,3.42
2015-09-11,3.6825
2015-09-14,3.54
2015-09-15,3.51
2015-09-16,3.6
2015-09-17,3.54
2015-09-18,3.585
2015-09-21,3.525
2015-09-22,3.345
2015-09-23,3.165
2015-09-24,3.21
2015-09-25,3.075
2015-09-28,3
2015-09-29,3
2015-09-30,2.82
2015-10-01,2.985
2015-10-02,3
2015-10-05,3.105
2015-10-06,3.195
2015-10-07,3.12
2015-10-08,3.21
2015-10-09,3.21
2015-10-12,3.54
2015-10-13,3.51
2015-10-14,3.315
2015-10-15,3.54
2015-10-16,3.495
2015-10-19,3.45
2015-10-20,3.465
2015-10-21,3.345
2015-10-22,3.345
2015-10-23,3.255
2015-10-26,3.135
2015-10-27,3.165
2015-10-28,4.095
2015-10-29,4.2847
2015-10-30,4.005
2015-11-02,3.693
2015-11-03,3.705
2015-11-04,3.75
2015-11-05,3.7502
2015-11-06,3.69
2015-11-09,3.315
2015-11-10,3.33
2015-11-11,3.225
2015-11-12,3.345
2015-11-13,3.27
2015-11-16,3.48
2015-11-17,3.27
2015-11-18,3.345
2015-11-19,3.3
2015-11-20,3.15
2015-11-23,3.285
2015-11-24,3.24
2015-11-25,3.36
2015-11-27,3.39
2015-11-30,3.405
2015-12-01,3.18
2015-12-02,3.285
2015-12-03,3.27
2015-12-04,3.27
2015-12-07,3.15
2015-12-08,3.3
2015-12-09,4.47
2015-12-10,4.485
2015-12-11,4.41
2015-12-14,4.305
2015-12-15,4.125
2015-12-16,4.2
2015-12-17,5.1601
2015-12-18,4.695
2015-12-21,4.815
2015-12-22,4.8
2015-12-23,4.845
2015-12-24,4.635
2015-12-28,4.845
2015-12-29,5.04
2015-12-30,4.98
2015-12-31,4.89
2016-01-04,5.25
2016-01-05,5.13
2016-01-06,5.01
2016-01-07,4.395
2016-01-08,4.095
2016-01-11,3.645
2016-01-12,3.51
2016-01-13,3.435
2016-01-14,3.345
2016-01-15,3.225
2016-01-19,3.135
2016-01-20,3.375
2016-01-21,3.03
2016-01-22,3.225
2016-01-25,3.555
2016-01-26,3.225
2016-01-27,3.225
2016-01-28,3.2252
2016-01-29,3.165
2016-02-01,3.045
2016-02-02,2.97
2016-02-03,2.9548
2016-02-04,2.955
2016-02-05,2.895
2016-02-08,2.685
2016-02-09,2.73
2016-02-10,2.715
2016-02-11,2.7008
2016-02-12,2.625
2016-02-16,2.67
2016-02-17,2.73
2016-02-18,2.73
2016-02-19,2.865
2016-02-22,2.82
2016-02-23,2.73
2016-02-24,2.73
2016-02-25,2.985
2016-02-26,3.03
2016-02-29,3.03
2016-03-01,2.94
2016-03-02,3.045
2016-03-03,2.925
2016-03-04,3.015
2016-03-07,3.09
2016-03-08,2.955
2016-03-09,2.985
2016-03-10,3.06
2016-03-11,3.015
2016-03-14,2.865
2016-03-15,2.655
2016-03-16,2.595
2016-03-17,2.61
2016-03-18,2.79
2016-03-21,2.85
2016-03-22,2.76
2016-03-23,2.595
2016-03-24,2.745
2016-03-28,2.73
2016-03-29,2.64
2016-03-30,2.67
2016-03-31,2.685
2016-04-01,2.67
2016-04-04,2.625
2016-04-05,2.685
2016-04-06,2.7087
2016-04-07,2.655
2016-04-08,2.715
2016-04-11,2.73
2016-04-12,2.715
2016-04-13,2.715
2016-04-14,2.715
2016-04-15,2.52
2016-04-18,2.55
2016-04-19,2.505
2016-04-20,2.5341
2016-04-21,2.535
2016-04-22,2.55
2016-04-25,2.565
2016-04-26,2.58
2016-04-27,2.625
2016-04-28,2.61
2016-04-29,2.6248
2016-05-02,2.535
2016-05-03,2.385
2016-05-04,2.535
2016-05-05,2.4598
2016-05-06,2.4748
2016-05-09,2.49
2016-05-10,2.475
2016-05-11,2.34
2016-05-12,2.1
2016-05-13,2.1
2016-05-16,2.01
2016-05-17,1.92
2016-05-18,1.95
2016-05-19,2.01
2016-05-20,2.07
2016-05-23,1.875
2016-05-24,1.98
2016-05-25,2.055
2016-05-26,2.07
2016-05-27,2.07
2016-05-31,2.025
2016-06-01,2.235
2016-06-02,2.415
2016-06-03,2.55
2016-06-06,2.73
2016-06-07,2.7
2016-06-08,2.835
2016-06-09,2.835
2016-06-10,2.895
2016-06-13,2.835
2016-06-14,2.895
2016-06-15,2.835
2016-06-16,2.91
2016-06-17,2.79
2016-06-20,2.895
2016-06-21,2.925
2016-06-22,2.82
2016-06-23,2.865
2016-06-24,2.805
2016-06-27,2.835
2016-06-28,2.8502
2016-06-29,2.9325
2016-06-30,2.76
2016-07-01,2.8123
2016-07-05,2.775
2016-07-06,2.775
2016-07-07,2.865
2016-07-08,2.79
2016-07-11,2.8548
2016-07-12,2.8628
2016-07-13,2.79
2016-07-14,2.8049
2016-07-15,2.8065
2016-07-18,2.8242
2016-07-19,2.7774
2016-07-20,2.775
2016-07-21,2.775
2016-07-22,2.85
2016-07-25,2.73
2016-07-26,2.775
2016-07-27,2.775
2016-07-28,2.775
2016-07-29,2.7898
2016-08-01,2.79
2016-08-02,2.91
2016-08-03,2.925
2016-08-04,2.94
2016-08-05,2.925
2016-08-08,2.775
2016-08-09,2.805
2016-08-10,2.85
2016-08-11,2.82
2016-08-12,2.79
2016-08-15,2.775
2016-08-16,2.775
2016-08-17,2.775
2016-08-18,2.775
2016-08-19,2.67
2016-08-22,2.475
2016-08-23,2.6399
2016-08-24,2.6109
2016-08-25,2.61
2016-08-26,2.55
2016-08-29,2.61
2016-08-30,2.6098
2016-08-31,2.505
2016-09-01,2.475
2016-09-02,2.505
2016-09-06,2.745
2016-09-07,2.655
2016-09-08,2.715
2016-09-09,2.58
2016-09-12,2.595
2016-09-13,2.64
2016-09-14,2.505
2016-09-15,2.475
2016-09-16,2.34
2016-09-19,2.3699
2016-09-20,2.385
2016-09-21,2.34
2016-09-22,2.265
2016-09-23,2.22
2016-09-26,2.07
2016-09-27,2.1
2016-09-28,2.175
2016-09-29,2.325
2016-09-30,2.475
2016-10-03,2.355
2016-10-04,2.31
2016-10-05,2.265
2016-10-06,2.25
2016-10-07,2.19
2016-10-10,2.07
2016-10-11,2.025
2016-10-12,2.1
2016-10-13,2.085
2016-10-14,1.965
2016-10-17,2.01
2016-10-18,1.965
2016-10-19,1.965
2016-10-20,1.95
2016-10-21,2.085
2016-10-24,1.935
2016-10-25,1.92
2016-10-26,1.89
2016-10-27,1.95
2016-10-28,1.83
2016-10-31,1.83
2016-11-01,1.785
2016-11-02,1.6725
2016-11-03,1.875
2016-11-04,1.74
2016-11-07,1.9074
2016-11-08,1.845
2016-11-09,1.8
2016-11-10,1.89
2016-11-11,1.815
2016-11-14,1.815
2016-11-15,1.965
2016-11-16,1.965
2016-11-17,2.175
2016-11-18,2.16
2016-11-21,2.445
2016-11-22,2.505
2016-11-23,2.55
2016-11-25,2.475
2016-11-28,2.37
2016-11-29,2.505
2016-11-30,2.34
2016-12-01,2.28
2016-12-02,2.265
2016-12-05,2.445
2016-12-06,2.445
2016-12-07,2.46
2016-12-08,2.415
2016-12-09,2.37
2016-12-12,2.355
2016-12-13,2.265
2016-12-14,2.205
2016-12-15,2.205
2016-12-16,2.055
2016-12-19,2.28
2016-12-20,2.325
2016-12-21,2.235
2016-12-22,2.265
2016-12-23,2.25
2016-12-27,2.25
2016-12-28,2.325
2016-12-29,2.355
2016-12-30,2.25
2017-01-03,2.175
2017-01-04,2.265
2017-01-05,2.28
2017-01-06,2.07
2017-01-09,2.25
2017-01-10,2.325
2017-01-11,2.31
2017-01-12,2.175
2017-01-13,2.1763
2017-01-17,2.25
2017-01-18,2.115
2017-01-19,2.175
2017-01-20,2.235
2017-01-23,2.16
2017-01-24,2.145
2017-01-25,2.19
2017-01-26,2.19
2017-01-27,2.22
2017-01-30,2.145
2017-01-31,2.205
2017-02-01,2.13
2017-02-02,2.13
2017-02-03,2.13
2017-02-06,2.13
2017-02-07,2.1825
2017-02-08,2.13
2017-02-09,2.175
2017-02-10,2.235
2017-02-13,2.355
2017-02-14,2.295
2017-02-15,2.19
2017-02-16,2.205
2017-02-17,2.235
2017-02-21,2.16
2017-02-22,2.145
2017-02-23,2.07
2017-02-24,2.04
2017-02-27,2.19
2017-02-28,2.115
2017-03-01,2.115
2017-03-02,2.13
2017-03-03,2.13
2017-03-06,2.115
2017-03-07,2.13
2017-03-08,2.145
2017-03-09,2.475
2017-03-10,2.49
2017-03-13,2.625
2017-03-14,2.61
2017-03-15,2.79
2017-03-16,2.805
2017-03-17,2.76
2017-03-20,2.46
2017-03-21,2.34
2017-03-22,2.31
2017-03-23,2.265
2017-03-24,2.61
2017-03-27,2.565
2017-03-28,2.445
2017-03-29,2.52
2017-03-30,2.331
2017-03-31,2.37
2017-04-03,2.415
2017-04-04,2.415
2017-04-05,2.415
2017-04-06,2.295
2017-04-07,2.37
2017-04-10,2.34
2017-04-11,2.25
2017-04-12,2.235
2017-04-13,2.175
2017-04-17,2.19
2017-04-18,2.16
2017-04-19,2.175
2017-04-20,2.25
2017-04-21,2.13
2017-04-24,2.13
2017-04-25,2.145
2017-04-26,2.34
2017-04-27,2.355
2017-04-28,2.415
2017-05-01,2.385
2017-05-02,2.415
2017-05-03,2.3552
2017-05-04,2.3928
2017-05-05,2.355
2017-05-08,2.325
2017-05-09,2.385
2017-05-10,2.385
2017-05-11,2.3401
2017-05-12,2.31
2017-05-15,2.34
2017-05-16,2.325
2017-05-17,2.265
2017-05-18,2.31
2017-05-19,2.22
2017-05-22,2.325
2017-05-23,2.28
2017-05-24,2.28
2017-05-25,2.28
2017-05-26,2.25
2017-05-30,2.25
2017-05-31,2.25
2017-06-01,2.16
2017-06-02,2.16
2017-06-05,2.13
2017-06-06,1.995
2017-06-07,1.965
2017-06-08,2.025
2017-06-09,2.175
2017-06-12,2.325
2017-06-13,2.19
2017-06-14,2.22
2017-06-15,2.1
2017-06-16,2.055
2017-06-19,2.04
2017-06-20,2.1
2017-06-21,2.13
2017-06-22,2.025
2017-06-23,2.325
2017-06-26,2.145
2017-06-27,2.145
2017-06-28,2.145
2017-06-29,2.1
2017-06-30,2.175
2017-07-03,2.205
2017-07-05,2.145
2017-07-06,2.145
2017-07-07,2.16
2017-07-10,2.085
2017-07-11,2.025
2017-07-12,2.01
2017-07-13,2.0031
2017-07-14,2.055
2017-07-17,2.1
2017-07-18,2.085
2017-07-19,2.115
2017-07-20,2.175
2017-07-21,2.175
2017-07-24,2.07
2017-07-25,2.025
2017-07-26,2.07
2017-07-27,2.07
2017-07-28,2.085
2017-07-31,2.1002
2017-08-01,2.055
2017-08-02,1.875
2017-08-03,1.785
2017-08-04,1.83
2017-08-07,1.875
2017-08-08,1.875
2017-08-09,1.815
2017-08-10,1.77
2017-08-11,1.71
2017-08-14,1.815
2017-08-15,1.98
2017-08-16,1.89
2017-08-17,1.875
2017-08-18,1.89
2017-08-21,1.86
2017-08-22,1.845
2017-08-23,1.875
2017-08-24,1.875
2017-08-25,1.845
2017-08-28,3.435
2017-08-29,4.335
2017-08-30,5.115
2017-08-31,4.785
2017-09-01,4.425
2017-09-05,4.215
2017-09-06,4.035
2017-09-07,3.99
2017-09-08,4.035
2017-09-11,4.215
2017-09-12,4.335
2017-09-13,4.275
2017-09-14,4.32
2017-09-15,4.62
2017-09-18,4.485
2017-09-19,4.41
2017-09-20,3.75
2017-09-21,3.63
2017-09-22,3.9
2017-09-25,3.93
2017-09-26,4.02
2017-09-27,4.11
2017-09-28,4.02
2017-09-29,4.08
2017-10-02,3.9
2017-10-03,3.915
2017-10-04,4.005
2017-10-05,4.095
2017-10-06,4.26
2017-10-09,4.26
2017-10-10,4.23
2017-10-11,4.365
2017-10-12,4.395
2017-10-13,4.215
2017-10-16,4.215
2017-10-17,4.215
2017-10-18,4.215
2017-10-19,4.2
2017-10-20,4.245
2017-10-23,4.215
2017-10-24,4.245
2017-10-25,4.14
2017-10-26,3.87
2017-10-27,3.96
2017-10-30,3.93
2017-10-31,4.155
2017-11-01,4.02
2017-11-02,3.7952
2017-11-03,3.75
2017-11-06,3.84
2017-11-07,3.69
2017-11-08,3.615
2017-11-09,3.63
2017-11-10,3.765
2017-11-13,3.63
2017-11-14,3.96
2017-11-15,3.93
2017-11-16,4.305
2017-11-17,4.275
2017-11-20,4.5
2017-11-21,4.32
2017-11-22,4.485
2017-11-24,4.875
2017-11-27,5.16
2017-11-28,5.58
2017-11-29,5.19
2017-11-30,5.595
2017-12-01,5.64
2017-12-04,5.685
2017-12-05,5.565
2017-12-06,5.595
2017-12-07,5.745
2017-12-08,5.94
2017-12-11,5.91
2017-12-12,5.805
2017-12-13,5.715
2017-12-14,5.52
2017-12-15,5.49
2017-12-18,5.415
2017-12-19,5.16
2017-12-20,5.25
2017-12-21,5.265
2017-12-22,5.28
2017-12-26,5.4
2017-12-27,5.535
2017-12-28,5.565
2017-12-29,5.625
2018-01-02,5.835
2018-01-03,5.595
2018-01-04,5.445
2018-01-05,5.505
2018-01-08,5.505
2018-01-09,5.505
2018-01-10,5.34
2018-01-11,5.94
2018-01-12,5.955
2018-01-16,5.79
2018-01-17,5.745
2018-01-18,5.775
2018-01-19,5.88
2018-01-22,5.9325
2018-01-23,5.895
2018-01-24,5.55
2018-01-25,5.475
2018-01-26,5.385
2018-01-29,5.22
2018-01-30,5.04
2018-01-31,5.16
2018-02-01,4.8
2018-02-02,4.905
2018-02-05,4.65
2018-02-06,4.755
2018-02-07,4.575
2018-02-08,4.23
2018-02-09,4.41
2018-02-12,4.605
2018-02-13,4.86
2018-02-14,4.905
2018-02-15,4.83
2018-02-16,4.65
2018-02-20,4.5
2018-02-21,4.2
2018-02-22,4.275
2018-02-23,4.35
2018-02-26,4.11
2018-02-27,4.29
2018-02-28,4.365
2018-03-01,4.29
2018-03-02,4.77
2018-03-05,4.62
2018-03-06,4.365
2018-03-07,4.245
2018-03-08,4.005
2018-03-09,4.5
2018-03-12,4.35
2018-03-13,4.335
2018-03-14,4.245
2018-03-15,4.215
2018-03-16,4.05
2018-03-19,4.005
2018-03-20,3.975
2018-03-21,4.065
2018-03-22,4.665
2018-03-23,4.515
2018-03-26,4.53
2018-03-27,4.62
2018-03-28,4.515
2018-03-29,4.845
2018-04-02,4.575
2018-04-03,5.1
2018-04-04,5.25
2018-04-05,5.43
2018-04-06,5.19
2018-04-09,5.175
2018-04-10,5.025
2018-04-11,5.04
2018-04-12,5.04
2018-04-13,5.01
2018-04-16,4.965
2018-04-17,5.055
2018-04-18,4.98
2018-04-19,4.875
2018-04-20,4.965
2018-04-23,4.74
2018-04-24,4.125
2018-04-25,4.44
2018-04-26,4.665
2018-04-27,4.5825
2018-04-30,4.695
2018-05-01,4.44
2018-05-02,4.32
2018-05-03,4.59
2018-05-04,4.95
2018-05-07,4.69
2018-05-08,4.63
2018-05-09,5.16
2018-05-10,5.53
2018-05-11,5.59
2018-05-14,5.6
2018-05-15,5.3
2018-05-16,5.22
2018-05-17,5.2
2018-05-18,5.14
2018-05-21,5.04
2018-05-22,4.98
2018-05-23,4.95
2018-05-24,4.96
2018-05-25,4.78
2018-05-29,4.75
2018-05-30,4.63
2018-05-31,3.91
2018-06-01,3.92
2018-06-04,4.1
2018-06-05,3.97
2018-06-06,4
2018-06-07,4
2018-06-08,3.96
2018-06-11,3.77
2018-06-12,3.76
2018-06-13,3.78
2018-06-14,3.86
2018-06-15,3.88
2018-06-18,3.92
2018-06-19,3.81
2018-06-20,3.77
2018-06-21,3.58
2018-06-22,3.63
2018-06-25,3.69
2018-06-26,3.71
2018-06-27,3.75
2018-06-28,3.9
2018-06-29,3.94
2018-07-02,3.82
2018-07-03,3.83
2018-07-05,3.95
2018-07-06,3.96
2018-07-09,3.88
2018-07-10,3.91
2018-07-11,3.75
2018-07-12,3.77
2018-07-13,3.69
2018-07-16,3.5
2018-07-17,3.66
2018-07-18,3.7
2018-07-19,3.82
2018-07-20,3.78
2018-07-23,3.8
2018-07-24,3.94
2018-07-25,3.93
2018-07-26,4.02
2018-07-27,4.09
2018-07-30,4.04
2018-07-31,4.01
2018-08-01,4.06
2018-08-02,4.12
2018-08-03,4.15
2018-08-06,4.21
2018-08-07,4.22
2018-08-08,4.31
2018-08-09,4.31
2018-08-10,4.29
2018-08-13,4.36
2018-08-14,4.36
2018-08-15,4.01
2018-08-16,4.025
2018-08-17,3.84
2018-08-20,3.84
2018-08-21,3.85
2018-08-22,3.9
2018-08-23,3.96
2018-08-24,4.03
2018-08-27,3.93
2018-08-28,3.93
2018-08-29,3.91
2018-08-30,3.82
2018-08-31,3.7
2018-09-04,3.51
2018-09-05,3.4
2018-09-06,3.39
2018-09-07,3.48
2018-09-10,3.61
2018-09-11,3.61
2018-09-12,3.55
2018-09-13,3.4
2018-09-14,3.43
2018-09-17,3.32
2018-09-18,3.06
2018-09-19,3.09
2018-09-20,3.06
2018-09-21,2.9
2018-09-24,2.94
2018-09-25,2.96
2018-09-26,2.89
2018-09-27,2.77
2018-09-28,2.57
2018-10-01,2.71
2018-10-02,2.74
2018-10-03,2.72
2018-10-04,2.73
2018-10-05,2.7
2018-10-08,2.68
2018-10-09,2.62
2018-10-10,2.49
2018-10-11,2.51
2018-10-12,2.49
2018-10-15,2.48
2018-10-16,2.63
2018-10-17,2.52
2018-10-18,2.49
2018-10-19,2.38
2018-10-22,2.41
2018-10-23,2.46
2018-10-24,2.4
2018-10-25,2.47
2018-10-26,2.34
2018-10-29,2.33
2018-10-30,2.41
2018-10-31,2.49
2018-11-01,2.54
2018-11-02,2.61
2018-11-05,2.62
2018-11-06,2.65
2018-11-07,2.7
2018-11-08,2.7
2018-11-09,2.65
2018-11-12,2.47
2018-11-13,2.62
2018-11-14,2.73
2018-11-15,2.62
2018-11-16,2.42
2018-11-19,2.31
2018-11-20,2.04
2018-11-21,2.14
2018-11-23,2.2
2018-11-26,2.14
2018-11-27,2.11
2018-11-28,2.11
2018-11-29,2.19
2018-11-30,2.25
2018-12-03,2.17
2018-12-04,2.07
2018-12-06,2.03
2018-12-07,1.94
2018-12-10,1.89
2018-12-11,1.89
2018-12-12,1.66
2018-12-13,1.58
2018-12-14,1.74
2018-12-17,1.69
2018-12-18,1.64
2018-12-19,1.61
2018-12-20,1.58
2018-12-21,1.46
2018-12-24,1.5
2018-12-26,1.56
2018-12-27,1.46
2018-12-28,1.67
2018-12-31,1.68
2019-01-02,1.81
2019-01-03,1.66
2019-01-04,1.63
2019-01-07,1.6
2019-01-08,1.76
2019-01-09,1.72
2019-01-10,1.75
2019-01-11,1.89
2019-01-14,1.86
2019-01-15,1.86
2019-01-16,1.83
2019-01-17,1.75
2019-01-18,1.72
2019-01-22,1.67
2019-01-23,1.68
2019-01-24,1.71
2019-01-25,1.97
2019-01-28,2.15
2019-01-29,2.08
2019-01-30,2.21
2019-01-31,2
2019-02-01,2.06
2019-02-04,2
2019-02-05,2.03
2019-02-06,2
2019-02-07,1.95
2019-02-08,1.85
2019-02-11,1.94
2019-02-12,1.92
2019-02-13,1.86
2019-02-14,1.87
2019-02-15,2.04
2019-02-19,2
2019-02-20,1.93
2019-02-21,1.96
2019-02-22,2.09
2019-02-25,2.02
2019-02-26,1.99
2019-02-27,1.93
2019-02-28,1.84
2019-03-01,1.83
2019-03-04,1.84
2019-03-05,1.73
2019-03-06,1.65
2019-03-07,1.76
2019-03-08,1.75
2019-03-11,1.81
2019-03-12,1.74
2019-03-13,1.78
2019-03-14,1.51
2019-03-15,1.52
2019-03-18,1.46
2019-03-19,1.48
2019-03-20,1.445
2019-03-21,1.47
2019-03-22,1.44
2019-03-25,1.45
2019-03-26,1.45
2019-03-27,1.4
2019-03-28,1.34
2019-03-29,1.31
2019-04-01,1.25
2019-04-02,1.2
2019-04-03,0.2203
2019-04-04,0.3455
2019-04-05,0.28
2019-04-08,0.272
2019-04-09,0.26
2019-04-10,0.2745
2019-04-11,0.26
2019-04-12,0.2869
2019-04-15,0.2661
2019-04-16,0.2623
2019-04-17,0.235
2019-04-18,0.2434
2019-04-22,0.2
2019-04-23,0.2
2019-04-24,0.1315
2019-04-25,0.128
2019-04-26,0.08975
2019-04-29,0.094
2019-04-30,0.107
2019-05-01,0.1
2019-05-02,0.0821
2019-05-03,0.087
