date,close
2014-06-13,25.3796
2014-06-16,27.1081
2014-06-17,27.099
2014-06-18,27.602
2014-06-19,27.6569
2014-06-20,27.7758
2014-06-23,27.4283
2014-06-24,27.1447
2014-06-25,27.0258
2014-06-26,26.6769
2014-06-27,26.8605
2014-06-30,27.136
2014-07-01,27.0258
2014-07-02,26.6401
2014-07-03,27.2279
2014-07-07,27.3564
2014-07-08,26.3096
2014-07-09,27.0718
2014-07-10,26.8146
2014-07-11,26.8238
2014-07-14,26.8146
2014-07-15,26.0065
2014-07-16,25.3729
2014-07-17,24.5648
2014-07-18,24.9688
2014-07-21,24.5831
2014-07-22,25.1066
2014-07-23,25.4096
2014-07-24,26.08
2014-07-25,24.7484
2014-07-28,24.0781
2014-07-29,23.7475
2014-07-30,24.1607
2014-07-31,23.9954
2014-08-01,23.9128
2014-08-04,23.8485
2014-08-05,24.2066
2014-08-06,24.6382
2014-08-07,24.5556
2014-08-08,24.9229
2014-08-11,25.5657
2014-08-12,26.2177
2014-08-13,26.1167
2014-08-14,25.5474
2014-08-15,25.3729
2014-08-18,26.0249
2014-08-19,26.2085
2014-08-20,26.3096
2014-08-21,26.631
2014-08-22,27.7054
2014-08-25,27.8431
2014-08-26,28.2839
2014-08-27,28.6972
2014-08-28,28.0911
2014-08-29,27.9717
2014-09-02,28.3023
2014-09-03,27.687
2014-09-04,27.3105
2014-09-05,27.0442
2014-09-08,27.0901
2014-09-09,26.5116
2014-09-10,26.5667
2014-09-11,26.5391
2014-09-12,26.2269
2014-09-15,26.08
2014-09-16,26.2545
2014-09-17,25.979
2014-09-18,26.0708
2014-09-19,25.7861
2014-09-22,25.5933
2014-09-23,25.0331
2014-09-24,24.8678
2014-09-25,24.3352
2014-09-26,25.1654
2014-09-29,25.1839
2014-09-30,25.3684
2014-10-01,25.23
2014-10-02,25.2208
2014-10-03,25.313
2014-10-06,25.2761
2014-10-07,24.8333
2014-10-08,25.5436
2014-10-09,24.4274
2014-10-10,23.9385
2014-10-13,23.9846
2014-10-14,24.3444
2014-10-15,24.2153
2014-10-16,24.4367
2014-10-17,25.0916
2014-10-20,25.313
2014-10-21,25.4329
2014-10-22,25.8757
2014-10-23,25.2484
2014-10-24,24.9348
2014-10-27,24.7595
2014-10-28,25.9034
2014-10-29,25.6728
2014-10-30,25.8388
2014-10-31,26.1986
2014-11-03,26.5399
2014-11-04,26.6599
2014-11-05,27.1303
2014-11-06,26.4754
2014-11-07,26.9919
2014-11-10,26.955
2014-11-11,26.8997
2014-11-12,26.6137
2014-11-13,26.0326
2014-11-14,25.4791
2014-11-17,25.027
2014-11-18,23.385
2014-11-19,23.4035
2014-11-20,24.2706
2014-11-21,24.6396
2014-11-24,24.6119
2014-11-25,24.3629
2014-11-26,23.7632
2014-11-28,23.6618
2014-12-01,23.6987
2014-12-02,23.754
2014-12-03,24.1415
2014-12-04,24.1507
2014-12-05,24.8057
2014-12-08,24.861
2014-12-09,25.6636
2014-12-10,25.2761
2014-12-11,24.7042
2014-12-12,24.0308
2014-12-15,23.3573
2014-12-16,24.5197
2014-12-17,25.3407
2014-12-18,25.2853
2014-12-19,25.5067
2014-12-22,25.9957
2014-12-23,26.2355
2014-12-24,25.682
2014-12-26,26.0418
2014-12-29,25.7175
2014-12-30,25.7083
2014-12-31,25.4303
2015-01-02,25.1432
2015-01-05,24.893
2015-01-06,24.365
2015-01-07,24.05
2015-01-08,24.4483
2015-01-09,23.3459
2015-01-12,23.7628
2015-01-13,24.0592
2015-01-14,24.2723
2015-01-15,23.6516
2015-01-16,23.6053
2015-01-20,23.2996
2015-01-21,22.9012
2015-01-22,23.4663
2015-01-23,22.8271
2015-01-26,22.7622
2015-01-27,23.9573
2015-01-28,23.8925
2015-01-29,24.0963
2015-01-30,23.2996
2015-02-02,23.735
2015-02-03,24.0129
2015-02-04,23.8647
2015-02-05,24.5966
2015-02-06,24.717
2015-02-09,24.9208
2015-02-10,25.1339
2015-02-11,25.032
2015-02-12,25.5137
2015-02-13,25.5137
2015-02-17,25.6897
2015-02-18,26.0696
2015-02-19,25.6527
2015-02-20,25.3006
2015-02-23,25.5045
2015-02-24,26.1344
2015-02-25,26.2734
2015-02-26,26.0418
2015-02-27,26.3382
2015-03-02,26.996
2015-03-03,26.9312
2015-03-04,26.8385
2015-03-05,27.1906
2015-03-06,26.2271
2015-03-09,26.2085
2015-03-10,25.7361
2015-03-11,25.7917
2015-03-12,27.626
2015-03-13,27.2461
2015-03-16,27.626
2015-03-17,27.6167
2015-03-18,27.8391
2015-03-19,29.3584
2015-03-20,30.1829
2015-03-23,30.4238
2015-03-24,30.711
2015-03-25,29.8864
2015-03-26,29.6919
2015-03-27,30.1849
2015-03-30,30.8732
2015-03-31,30.343
2015-04-01,30.3244
2015-04-02,30.2314
2015-04-06,30.7244
2015-04-07,30.5291
2015-04-08,30.557
2015-04-09,30.0454
2015-04-10,29.6733
2015-04-13,29.7105
2015-04-14,30.3523
2015-04-15,30.3616
2015-04-16,30.0454
2015-04-17,29.357
2015-04-20,29.9896
2015-04-21,29.7663
2015-04-22,29.9151
2015-04-23,30.3523
2015-04-24,29.5338
2015-04-27,29.2268
2015-04-28,29.6175
2015-04-29,29.171
2015-04-30,28.0734
2015-05-01,28.7245
2015-05-04,28.9477
2015-05-05,28.9291
2015-05-06,29.3105
2015-05-07,29.6919
2015-05-08,29.8965
2015-05-11,29.6919
2015-05-12,31.3011
2015-05-13,31.0686
2015-05-14,30.9291
2015-05-15,29.7012
2015-05-18,30.8267
2015-05-19,30.7151
2015-05-20,31.357
2015-05-21,31.5523
2015-05-22,31.2267
2015-05-26,30.9756
2015-05-27,30.957
2015-05-28,31.0314
2015-05-29,31.0965
2015-06-01,31.3942
2015-06-02,32.0639
2015-06-03,32.0825
2015-06-04,31.8127
2015-06-05,32.129
2015-06-08,32.2592
2015-06-09,32.1104
2015-06-10,32.0174
2015-06-11,31.9988
2015-06-12,31.7197
2015-06-15,31.6639
2015-06-16,31.8965
2015-06-17,32.0918
2015-06-18,32.3151
2015-06-19,32.1383
2015-06-22,32.3709
2015-06-23,32.2871
2015-06-24,32.2313
2015-06-25,32.5941
2015-06-26,31.8378
2015-06-29,31.7725
2015-06-30,31.6791
2015-07-01,32.0993
2015-07-02,31.9966
2015-07-06,31.9219
2015-07-07,31.1096
2015-07-08,30.5494
2015-07-09,30.2133
2015-07-10,30.2786
2015-07-13,30.5307
2015-07-14,30.344
2015-07-15,30.5774
2015-07-16,31.1283
2015-07-17,30.8202
2015-07-20,31.0722
2015-07-21,30.9789
2015-07-22,30.7268
2015-07-23,28.0005
2015-07-24,27.7764
2015-07-27,27.5617
2015-07-28,27.8324
2015-07-29,28.1592
2015-07-30,29.0182
2015-07-31,28.374
2015-08-03,28.1592
2015-08-04,28.3926
2015-08-05,28.9622
2015-08-06,28.6914
2015-08-07,28.0378
2015-08-10,26.3106
2015-08-11,26.4413
2015-08-12,26.4506
2015-08-13,26.712
2015-08-14,26.8147
2015-08-17,26.684
2015-08-18,26.9174
2015-08-19,26.5813
2015-08-20,26.0025
2015-08-21,25.4609
2015-08-24,23.5189
2015-08-25,22.7813
2015-08-26,24.2939
2015-08-27,23.715
2015-08-28,23.9297
2015-08-31,23.9951
2015-09-01,23.0147
2015-09-02,23.3602
2015-09-03,23.3789
2015-09-04,23.1081
2015-09-08,23.3602
2015-09-09,23.0521
2015-09-10,23.3602
2015-09-11,23.1174
2015-09-14,23.0801
2015-09-15,23.3322
2015-09-16,23.8644
2015-09-17,24.2565
2015-09-18,23.2762
2015-09-21,22.6786
2015-09-22,22.4546
2015-09-23,22.4172
2015-09-24,22.7627
2015-09-25,23.0708
2015-09-28,22.9675
2015-09-29,23.2397
2015-09-30,23.2866
2015-10-01,23.174
2015-10-02,23.9812
2015-10-05,25.2295
2015-10-06,24.7602
2015-10-07,24.9198
2015-10-08,25.0043
2015-10-09,25.3046
2015-10-12,25.3516
2015-10-13,24.9761
2015-10-14,24.8729
2015-10-15,24.3942
2015-10-16,24.244
2015-10-19,24.3942
2015-10-20,23.9343
2015-10-21,23.4368
2015-10-22,24.901
2015-10-23,24.7415
2015-10-26,25.192
2015-10-27,24.5538
2015-10-28,25.3609
2015-10-29,25.2671
2015-10-30,25.9241
2015-11-02,25.8584
2015-11-03,26.1588
2015-11-04,25.5581
2015-11-05,25.6895
2015-11-06,25.971
2015-11-09,25.5205
2015-11-10,26.2808
2015-11-11,26.4403
2015-11-12,25.6988
2015-11-13,25.2108
2015-11-16,25.7176
2015-11-17,24.9574
2015-11-18,25.2952
2015-11-19,24.8541
2015-11-20,24.9198
2015-11-23,24.9198
2015-11-24,25.8584
2015-11-25,26.262
2015-11-27,26.4967
2015-11-30,25.0231
2015-12-01,24.9386
2015-12-02,24.7602
2015-12-03,24.7133
2015-12-04,25.1826
2015-12-07,24.7321
2015-12-08,24.8259
2015-12-09,24.8729
2015-12-10,23.7653
2015-12-11,23.1271
2015-12-14,22.8549
2015-12-15,23.3242
2015-12-16,23.7747
2015-12-17,23.4274
2015-12-18,23.1646
2015-12-21,23.3523
2015-12-22,23.4931
2015-12-23,23.2303
2015-12-24,23.0989
2015-12-28,22.7423
2015-12-29,22.2138
2015-12-30,22.5913
2015-12-31,22.478
2016-01-04,21.6476
2016-01-05,21.5815
2016-01-06,20.402
2016-01-07,20.0811
2016-01-08,19.9396
2016-01-11,20.9115
2016-01-12,21.9307
2016-01-13,21.4211
2016-01-14,21.7514
2016-01-15,21.4306
2016-01-19,21.3928
2016-01-20,21.8741
2016-01-21,21.9024
2016-01-22,22.8461
2016-01-25,22.6196
2016-01-26,23.9784
2016-01-27,23.8086
2016-01-28,24.2427
2016-01-29,25.3373
2016-02-01,25.1486
2016-02-02,24.639
2016-02-03,24.7145
2016-02-04,24.5352
2016-02-05,24.337
2016-02-08,24.5258
2016-02-09,24.3276
2016-02-10,23.3934
2016-02-11,23.3745
2016-02-12,23.9313
2016-02-16,23.7992
2016-02-17,24.0256
2016-02-18,23.9313
2016-02-19,24.3748
2016-02-22,24.1483
2016-02-23,23.8652
2016-02-24,24.7523
2016-02-25,25.243
2016-02-26,24.6862
2016-02-29,23.8841
2016-03-01,24.7994
2016-03-02,25.4317
2016-03-03,25.3373
2016-03-04,25.5544
2016-03-07,26.0545
2016-03-08,26.0073
2016-03-09,26.4886
2016-03-10,26.2149
2016-03-11,26.7056
2016-03-14,26.0545
2016-03-15,26.2999
2016-03-16,26.8566
2016-03-17,27.9041
2016-03-18,28.357
2016-03-21,29.7631
2016-03-22,28.1306
2016-03-23,28.2344
2016-03-24,28.5363
2016-03-28,28.5552
2016-03-29,29.1147
2016-03-30,28.7733
2016-03-31,29.3044
2016-04-01,29.2285
2016-04-04,28.7828
2016-04-05,28.5837
2016-04-06,28.7544
2016-04-07,28.65
2016-04-08,28.5837
2016-04-11,28.9061
2016-04-12,29.1432
2016-04-13,29.1622
2016-04-14,29.551
2016-04-15,29.551
2016-04-18,29.57
2016-04-19,29.3518
2016-04-20,29.3992
2016-04-21,29.0389
2016-04-22,29.6838
2016-04-25,29.5605
2016-04-26,30.2433
2016-04-27,29.7501
2016-04-28,29.826
2016-04-29,29.0389
2016-05-02,29.2854
2016-05-03,29.1242
2016-05-04,28.8966
2016-05-05,29.1053
2016-05-06,29.8165
2016-05-09,29.3803
2016-05-10,29.3898
2016-05-11,27.5215
2016-05-12,27.5025
2016-05-13,26.6395
2016-05-16,27.9008
2016-05-17,27.5025
2016-05-18,27.4267
2016-05-19,26.9999
2016-05-20,27.2654
2016-05-23,27.4836
2016-05-24,28.1853
2016-05-25,28.1474
2016-05-26,27.9767
2016-05-27,27.9103
2016-05-31,27.7301
2016-06-01,28.081
2016-06-02,28.1664
2016-06-03,28.2517
2016-06-06,28.8682
2016-06-07,28.7449
2016-06-08,29.0578
2016-06-09,29.0958
2016-06-10,28.1095
2016-06-13,27.6163
2016-06-14,27.8819
2016-06-15,27.5025
2016-06-16,27.8439
2016-06-17,27.2939
2016-06-20,27.7491
2016-06-21,27.9957
2016-06-22,27.6448
2016-06-23,28.4414
2016-06-24,26.5542
2016-06-27,26.1653
2016-06-28,27.3954
2016-06-29,27.0998
2016-06-30,27.2428
2016-07-01,27.1952
2016-07-05,26.5944
2016-07-06,26.213
2016-07-07,26.1844
2016-07-08,26.6516
2016-07-11,26.7279
2016-07-12,27.2333
2016-07-13,27.1093
2016-07-14,26.9949
2016-07-15,27.2428
2016-07-18,27.3954
2016-07-19,27.1475
2016-07-20,27.2619
2016-07-21,26.8233
2016-07-22,26.9949
2016-07-25,26.9854
2016-07-26,31.5624
2016-07-27,31.181
2016-07-28,31.1142
2016-07-29,31.0284
2016-08-01,32.9355
2016-08-02,31.8485
2016-08-03,31.9438
2016-08-04,31.7531
2016-08-05,31.8008
2016-08-08,32.3253
2016-08-09,32.1727
2016-08-10,32.4683
2016-08-11,32.8592
2016-08-12,32.7162
2016-08-15,32.7925
2016-08-16,32.783
2016-08-17,32.516
2016-08-18,32.6971
2016-08-19,32.5446
2016-08-22,32.4206
2016-08-23,32.783
2016-08-24,32.8974
2016-08-25,32.9451
2016-08-26,33.0595
2016-08-29,33.0881
2016-08-30,33.0881
2016-08-31,32.5827
2016-09-01,32.2394
2016-09-02,32.4969
2016-09-06,32.4397
2016-09-07,32.3348
2016-09-08,31.7722
2016-09-09,31.038
2016-09-12,31.4957
2016-09-13,31.057
2016-09-14,30.7519
2016-09-15,30.1798
2016-09-16,30.1893
2016-09-19,30.1702
2016-09-20,29.8174
2016-09-21,30.0367
2016-09-22,30.4563
2016-09-23,30.2942
2016-09-26,30.0463
2016-09-27,29.827
2016-09-28,30.3348
2016-09-29,29.8269
2016-09-30,30.9192
2016-10-03,31.2737
2016-10-04,31.4845
2016-10-05,31.542
2016-10-06,32.0307
2016-10-07,31.7337
2016-10-10,31.475
2016-10-11,30.651
2016-10-12,30.6989
2016-10-13,30.4593
2016-10-14,30.4593
2016-10-17,30.2773
2016-10-18,30.2294
2016-10-19,30.0377
2016-10-20,29.9898
2016-10-21,30.1336
2016-10-24,30.9001
2016-10-25,32.6726
2016-10-26,31.427
2016-10-27,31.3791
2016-10-28,31.0438
2016-10-31,31.2354
2016-11-01,30.8522
2016-11-02,30.6605
2016-11-03,30.5168
2016-11-04,29.9419
2016-11-07,30.1336
2016-11-08,30.0856
2016-11-09,30.7563
2016-11-10,29.7982
2016-11-11,31.0438
2016-11-14,31.0917
2016-11-15,29.9419
2016-11-16,31.475
2016-11-17,31.7145
2016-11-18,31.8582
2016-11-21,32.481
2016-11-22,32.7684
2016-11-23,33.1517
2016-11-25,33.1996
2016-11-28,33.3912
2016-11-29,33.487
2016-11-30,33.008
2016-12-01,32.1936
2016-12-02,32.2415
2016-12-05,32.4331
2016-12-06,32.7205
2016-12-07,32.9122
2016-12-08,34.1098
2016-12-09,34.3015
2016-12-12,34.014
2016-12-13,33.9182
2016-12-14,33.2475
2016-12-15,33.1996
2016-12-16,32.5768
2016-12-19,32.7684
2016-12-20,32.5768
2016-12-21,32.6726
2016-12-22,32.1457
2016-12-23,32.481
2016-12-27,32.3852
2016-12-28,31.8748
2016-12-29,31.7785
2016-12-30,31.5378
2017-01-03,31.923
2017-01-04,32.5489
2017-01-05,31.5378
2017-01-06,31.7304
2017-01-09,30.7192
2017-01-10,31.297
2017-01-11,31.6341
2017-01-12,31.3452
2017-01-13,31.7785
2017-01-17,31.5859
2017-01-18,31.0563
2017-01-19,30.3822
2017-01-20,30.5266
2017-01-23,30.6711
2017-01-24,31.2007
2017-01-25,31.5378
2017-01-26,31.2007
2017-01-27,31.0081
2017-01-30,31.297
2017-01-31,32.8378
2017-02-01,32.3082
2017-02-02,32.8378
2017-02-03,33.6082
2017-02-06,33.4156
2017-02-07,33.6563
2017-02-08,32.7897
2017-02-09,32.6934
2017-02-10,33.0304
2017-02-13,33.0785
2017-02-14,33.5119
2017-02-15,34.0415
2017-02-16,33.6082
2017-02-17,34.0897
2017-02-21,34.7156
2017-02-22,34.4749
2017-02-23,34.0415
2017-02-24,34.2823
2017-02-27,34.186
2017-02-28,33.3193
2017-03-01,34.2341
2017-03-02,34.6675
2017-03-03,34.5712
2017-03-06,34.3786
2017-03-07,33.8489
2017-03-08,33.223
2017-03-09,32.9823
2017-03-10,33.0304
2017-03-13,33.223
2017-03-14,34.2341
2017-03-15,35.2934
2017-03-16,35.2453
2017-03-17,35.9675
2017-03-20,36.2564
2017-03-21,36.2083
2017-03-22,35.6786
2017-03-23,35.5823
2017-03-24,35.5342
2017-03-27,35.7268
2017-03-28,35.5101
2017-03-29,36.0615
2017-03-30,35.6504
2017-03-31,35.3601
2017-04-03,34.2959
2017-04-04,34.7313
2017-04-05,34.1508
2017-04-06,34.1508
2017-04-07,34.1508
2017-04-10,33.8122
2017-04-11,33.9573
2017-04-12,33.8606
2017-04-13,33.7638
2017-04-17,33.8122
2017-04-18,33.8606
2017-04-19,34.3443
2017-04-20,34.7313
2017-04-21,34.2476
2017-04-24,34.2959
2017-04-25,34.5378
2017-04-26,35.5536
2017-04-27,35.7471
2017-04-28,36.7146
2017-05-01,36.6178
2017-05-02,36.0373
2017-05-03,36.2308
2017-05-04,36.2792
2017-05-05,36.4243
2017-05-08,36.9564
2017-05-09,37.2466
2017-05-10,35.7955
2017-05-11,36.1341
2017-05-12,35.4569
2017-05-15,35.5052
2017-05-16,35.5052
2017-05-17,34.8764
2017-05-18,34.3443
2017-05-19,33.6671
2017-05-22,33.3769
2017-05-23,33.135
2017-05-24,33.1834
2017-05-25,33.4736
2017-05-26,33.4252
2017-05-30,33.3769
2017-05-31,33.6671
2017-06-01,34.1024
2017-06-02,33.7155
2017-06-05,33.6671
2017-06-06,33.7638
2017-06-07,33.6671
2017-06-08,33.9573
2017-06-09,34.3443
2017-06-12,34.1508
2017-06-13,34.4411
2017-06-14,34.7313
2017-06-15,35.0699
2017-06-16,34.8764
2017-06-19,34.9248
2017-06-20,34.8764
2017-06-21,35.1425
2017-06-22,35.0215
2017-06-23,35.4569
2017-06-26,35.8439
2017-06-27,35.3118
2017-06-28,36.206
2017-06-29,35.3312
2017-06-30,35.6228
2017-07-03,35.6228
2017-07-05,35.5256
2017-07-06,34.9424
2017-07-07,35.3312
2017-07-10,34.991
2017-07-11,34.5536
2017-07-12,34.991
2017-07-13,34.6994
2017-07-14,35.0396
2017-07-17,35.234
2017-07-18,35.7686
2017-07-19,36.206
2017-07-20,36.449
2017-07-21,36.4976
2017-07-24,36.0116
2017-07-25,36.5948
2017-07-26,36.9836
2017-07-27,38.6359
2017-07-28,37.5667
2017-07-31,37.7125
2017-08-01,37.5667
2017-08-02,37.2266
2017-08-03,37.1294
2017-08-04,37.6153
2017-08-07,37.3724
2017-08-08,37.9555
2017-08-09,38.0527
2017-08-10,37.9069
2017-08-11,37.2752
2017-08-14,38.1013
2017-08-15,37.6153
2017-08-16,37.7611
2017-08-17,36.7406
2017-08-18,36.692
2017-08-21,37.0322
2017-08-22,37.0808
2017-08-23,37.4696
2017-08-24,37.5181
2017-08-25,37.5667
2017-08-28,37.5667
2017-08-29,37.5181
2017-08-30,37.9555
2017-08-31,38.3443
2017-09-01,38.4415
2017-09-05,38.1985
2017-09-06,38.5387
2017-09-07,38.9275
2017-09-08,38.7331
2017-09-11,38.6845
2017-09-12,39.3649
2017-09-13,39.2191
2017-09-14,38.6845
2017-09-15,39.0733
2017-09-18,39.6079
2017-09-19,39.3649
2017-09-20,39.5107
2017-09-21,38.6359
2017-09-22,38.8303
2017-09-25,39.0247
2017-09-26,39.0247
2017-09-27,40.0453
2017-09-28,41.0896
2017-09-29,40.26
2017-10-02,40.9432
2017-10-03,41.1872
2017-10-04,40.992
2017-10-05,40.4064
2017-10-06,40.1624
2017-10-09,40.0648
2017-10-10,40.5528
2017-10-11,40.9432
2017-10-12,40.992
2017-10-13,41.3824
2017-10-16,41.48
2017-10-17,41.0408
2017-10-18,41.1872
2017-10-19,40.7968
2017-10-20,41.2848
2017-10-23,41.0896
2017-10-24,41.6752
2017-10-25,45.0912
2017-10-26,43.676
2017-10-27,43.3344
2017-10-30,43.7248
2017-10-31,45.1888
2017-11-01,45.0912
2017-11-02,44.5056
2017-11-03,42.8464
2017-11-06,43.2856
2017-11-07,42.7976
2017-11-08,43.8224
2017-11-09,42.2608
2017-11-10,42.212
2017-11-13,42.1632
2017-11-14,40.8944
2017-11-15,40.992
2017-11-16,41.1872
2017-11-17,41.2848
2017-11-20,41.9192
2017-11-21,42.456
2017-11-22,42.0656
2017-11-24,42.1632
2017-11-27,41.8704
2017-11-28,43.188
2017-11-29,43.8224
2017-11-30,43.2368
2017-12-01,43.0416
2017-12-04,43.0416
2017-12-05,43.3832
2017-12-06,43.2368
2017-12-07,42.7488
2017-12-08,43.0904
2017-12-11,42.7
2017-12-12,42.7
2017-12-13,43.188
2017-12-14,42.9928
2017-12-15,43.8224
2017-12-18,44.1152
2017-12-19,43.6272
2017-12-20,43.7736
2017-12-21,43.2856
2017-12-22,42.8464
2017-12-26,42.7
2017-12-27,42.5048
2017-12-28,42.8579
2017-12-29,42.6127
2018-01-02,42.6127
2018-01-03,42.8088
2018-01-04,42.3184
2018-01-05,42.7598
2018-01-08,43.5444
2018-01-09,42.8579
2018-01-10,43.2011
2018-01-11,46.0943
2018-01-12,45.3587
2018-01-16,46.7317
2018-01-17,46.8788
2018-01-18,45.9962
2018-01-19,46.8788
2018-01-22,45.0155
2018-01-23,47.075
2018-01-24,46.0943
2018-01-25,45.4568
2018-01-26,45.0155
2018-01-29,45.0155
2018-01-30,46.8298
2018-01-31,44.7212
2018-02-01,43.7405
2018-02-02,43.103
2018-02-05,41.1906
2018-02-06,41.6319
2018-02-07,42.1223
2018-02-08,42.1713
2018-02-09,42.0733
2018-02-12,42.0733
2018-02-13,42.1713
2018-02-14,43.5934
2018-02-15,44.5251
2018-02-16,44.6722
2018-02-20,42.7107
2018-02-21,42.3675
2018-02-22,43.4953
2018-02-23,43.054
2018-02-26,43.5934
2018-02-27,42.0242
2018-02-28,41.5829
2018-03-01,41.5339
2018-03-02,41.779
2018-03-05,42.3675
2018-03-06,42.0733
2018-03-07,43.5934
2018-03-08,45.1135
2018-03-09,46.0943
2018-03-12,46.8298
2018-03-13,46.0943
2018-03-14,46.5846
2018-03-15,47.5654
2018-03-16,48.2028
2018-03-19,46.9279
2018-03-20,47.0259
2018-03-21,46.7317
2018-03-22,46.7317
2018-03-23,46.6337
2018-03-26,46.0452
2018-03-27,45.8981
2018-03-28,46.0557
2018-03-29,46.4498
2018-04-02,45.5632
2018-04-03,46.5483
2018-04-04,47.0901
2018-04-05,47.5334
2018-04-06,47.5827
2018-04-09,47.1394
2018-04-10,47.5827
2018-04-11,48.026
2018-04-12,47.1394
2018-04-13,47.0409
2018-04-16,47.632
2018-04-17,48.5186
2018-04-18,48.3708
2018-04-19,47.0409
2018-04-20,46.6468
2018-04-23,45.8587
2018-04-24,47.5334
2018-04-25,47.4349
2018-04-26,51.1292
2018-04-27,49.8486
2018-04-30,50.4396
2018-05-01,49.8486
2018-05-02,49.6515
2018-05-03,48.9127
2018-05-04,49.7008
2018-05-07,49.5037
2018-05-08,49.6023
2018-05-09,45.908
2018-05-10,47.2379
2018-05-11,46.9916
2018-05-14,47.5827
2018-05-15,47.9275
2018-05-16,49.553
2018-05-17,50.4889
2018-05-18,50.7352
2018-05-21,50.6859
2018-05-22,50.7352
2018-05-23,51.08
2018-05-24,52.2622
2018-05-25,52.2129
2018-05-29,52.5085
2018-05-30,53.2966
2018-05-31,52.5085
2018-06-01,52.1144
2018-06-04,53.0995
2018-06-05,51.8188
2018-06-06,52.0651
2018-06-07,52.2622
2018-06-08,52.9025
2018-06-11,52.4592
2018-06-12,52.2622
2018-06-13,53.001
2018-06-14,53.1981
2018-06-15,53.1981
2018-06-18,53.0995
2018-06-19,53.1488
2018-06-20,53.4443
2018-06-21,53.7891
2018-06-22,53.9369
2018-06-25,53.6906
2018-06-26,53.5429
2018-06-27,52.7055
2018-06-28,52.4681
2018-06-29,52.9132
2018-07-02,53.3088
2018-07-03,53.6549
2018-07-05,54.0506
2018-07-06,54.4956
2018-07-09,54.3967
2018-07-10,54.1989
2018-07-11,53.1604
2018-07-12,53.5066
2018-07-13,54.8418
2018-07-16,54.8418
2018-07-17,55.1385
2018-07-18,55.0396
2018-07-19,55.8308
2018-07-20,56.3253
2018-07-23,56.2759
2018-07-24,56.5726
2018-07-25,59.9353
2018-07-26,59.243
2018-07-27,58.9957
2018-07-30,58.3528
2018-07-31,59.5397
2018-08-01,59.243
2018-08-02,60.4793
2018-08-03,60.7265
2018-08-06,61.5177
2018-08-07,62.1606
2018-08-08,63.4958
2018-08-09,60.9243
2018-08-10,61.0232
2018-08-13,61.0232
2018-08-14,62.0617
2018-08-15,62.7046
2018-08-16,63.7925
2018-08-17,63.5453
2018-08-20,64.3365
2018-08-21,64.7815
2018-08-22,65.3255
2018-08-23,65.2266
2018-08-24,65.5233
2018-08-27,65.375
2018-08-28,64.4848
2018-08-29,64.6826
2018-08-30,63.842
2018-08-31,64.5837
2018-09-04,63.7431
2018-09-05,64.5837
2018-09-06,64.2376
2018-09-07,63.298
2018-09-10,62.5562
2018-09-11,61.9628
2018-09-12,61.8144
2018-09-13,61.765
2018-09-14,62.6057
2018-09-17,62.5562
2018-09-18,63.9903
2018-09-19,63.0507
2018-09-20,64.0398
2018-09-21,63.9409
2018-09-24,63.842
2018-09-25,63.9903
2018-09-26,63.6442
2018-09-27,63.7037
2018-09-28,63.9517
2018-10-01,64.2494
2018-10-02,63.2968
2018-10-03,61.8977
2018-10-04,61.0543
2018-10-05,59.8636
2018-10-08,59.933
2018-10-09,59.685
2018-10-10,56.7578
2018-10-11,56.5792
2018-10-12,55.7357
2018-10-15,56.341
2018-10-16,57.0158
2018-10-17,57.0753
2018-10-18,55.5472
2018-10-19,55.6861
2018-10-22,55.8647
2018-10-23,55.448
2018-10-24,55.835
2018-10-25,58.2462
2018-10-26,57.1547
2018-10-29,57.9386
2018-10-30,59.04
2018-10-31,58.5339
2018-11-01,57.9386
2018-11-02,59.7346
2018-11-05,60.4292
2018-11-06,60.965
2018-11-07,61.1039
2018-11-08,60.0323
2018-11-09,60.7269
2018-11-12,61.0245
2018-11-13,57.4524
2018-11-14,59.2285
2018-11-15,59.3476
2018-11-16,59.7743
2018-11-19,58.524
2018-11-20,57.9981
2018-11-21,57.9287
2018-11-23,58.3057
2018-11-26,58.0279
2018-11-27,58.6034
2018-11-28,59.8338
2018-11-29,60.4292
2018-11-30,61.2925
2018-12-03,61.997
2018-12-04,58.7721
2018-12-06,58.7324
2018-12-07,58.4645
2018-12-10,58.9011
2018-12-11,59.9231
2018-12-12,60.6078
2018-12-13,61.6894
2018-12-14,60.191
2018-12-17,59.9628
2018-12-18,61.61
2018-12-19,61.3619
2018-12-20,62.3343
2018-12-21,62.1359
2018-12-24,60.5879
2018-12-26,62.8801
2018-12-27,65.966
2018-12-28,65.0145
2018-12-31,65.3334
2019-01-02,65.1839
2019-01-03,63.6893
2019-01-04,63.5399
2019-01-07,62.2445
2019-01-08,61.7463
2019-01-09,61.6567
2019-01-10,60.8596
2019-01-11,60.3514
2019-01-14,58.7771
2019-01-15,58.9863
2019-01-16,59.4845
2019-01-17,61.3976
2019-01-18,62.3043
2019-01-22,61.3677
2019-01-23,62.5933
2019-01-24,61.9157
2019-01-25,63.1712
2019-01-28,61.9456
2019-01-29,66.7482
2019-01-30,66.0308
2019-01-31,66.2201
2019-02-01,66.0109
2019-02-04,66.0408
2019-02-05,66.25
2019-02-06,67.3859
2019-02-07,67.7745
2019-02-08,68.6414
2019-02-11,68.5716
2019-02-12,69.3388
2019-02-13,70.7637
2019-02-14,70.0463
2019-02-15,70.4349
2019-02-19,71.7103
2019-02-20,72.5672
2019-02-21,73.165
2019-02-22,75.6859
2019-02-25,74.2809
2019-02-26,73.444
2019-02-27,72.6967
2019-02-28,73.5038
2019-03-01,74.9685
2019-03-04,76.5228
2019-03-05,78.2267
2019-03-06,78.5953
2019-03-07,78.0373
2019-03-08,77.9975
2019-03-11,77.6786
2019-03-12,77.2701
2019-03-13,75.2773
2019-03-14,75.9947
2019-03-15,76.483
2019-03-18,77.021
2019-03-19,76.6823
2019-03-20,75.915
2019-03-21,76.5826
2019-03-22,74.8589
2019-03-25,75.7257
2019-03-26,76.2438
2019-03-27,75.925
2019-03-28,75.9
2019-03-29,75.87
2019-04-01,75.5
2019-04-02,75.67
2019-04-03,76.25
2019-04-04,76.08
2019-04-05,76.78
2019-04-08,76.89
2019-04-09,74.58
2019-04-10,74.16
2019-04-11,74.66
2019-04-12,74.48
2019-04-15,74.97
2019-04-16,74.49
2019-04-17,74.94
2019-04-18,74.32
2019-04-22,73.71
2019-04-23,74.6
2019-04-24,75.38
2019-04-25,71.31
2019-04-26,71.27
2019-04-29,72.83
2019-04-30,72.49
2019-05-01,71.18
2019-05-02,72.17
2019-05-03,73.1
2019-05-06,72.75
2019-05-07,69.3
2019-05-08,70.18
2019-05-09,69.65
2019-05-10,69.33
2019-05-13,68.26
2019-05-14,67.92
2019-05-15,69.13
2019-05-16,68.32
2019-05-17,67.18
2019-05-20,67.54
2019-05-21,67.57
2019-05-22,67.79
2019-05-23,66.94
2019-05-24,66.3
2019-05-28,66.33
2019-05-29,65.34
2019-05-30,65.4
2019-05-31,64.78
2019-06-03,64.68
2019-06-04,66.09
2019-06-05,65.33
2019-06-06,65.36
2019-06-07,66.39
2019-06-10,68.54
2019-06-11,67.67
2019-06-12,67.37
2019-06-13,67.32
2019-06-14,67.065
2019-06-17,66.34
2019-06-18,67
2019-06-19,67.26
2019-06-20,66.615
2019-06-21,67.775
2019-06-24,66.955
2019-06-25,65.8
2019-06-26,64.33
2019-06-27,64.285
2019-06-28,65.3
2019-07-01,64.645
2019-07-02,64.065
2019-07-03,64.7
2019-07-04,64.7
2019-07-05,64.47
2019-07-08,64.59
2019-07-09,64.1
2019-07-10,63.94
2019-07-11,64.55
2019-07-12,64.92
2019-07-15,65.38
2019-07-16,66.49
2019-07-17,66.02
2019-07-18,66.725
2019-07-19,66.665
2019-07-22,66.39
2019-07-23,66.53
2019-07-24,68.64
2019-07-25,67.9
2019-07-26,68.565
2019-07-29,68.895
2019-07-30,70.245
2019-07-31,69.27
2019-08-01,69.03
2019-08-02,68.09
2019-08-05,65.34
2019-08-06,66.91
2019-08-07,66.13
2019-08-08,68.33
2019-08-09,67.845
2019-08-12,66.305
2019-08-13,67.1
2019-08-14,65.805
2019-08-15,66.14
2019-08-16,66.045
2019-08-19,67.04
2019-08-20,66.25
2019-08-21,66.67
2019-08-22,66.28
2019-08-23,63.59
2019-08-26,64.5
2019-08-27,64.82
2019-08-28,65.03
2019-08-29,65.35
2019-08-30,64.5
2019-09-02,64.35
2019-09-03,64.23
2019-09-04,64.64
2019-09-05,65.025
2019-09-06,64.91
2019-09-09,63.94
2019-09-10,63.99
2019-09-11,64.88
2019-09-12,66.455
2019-09-13,67.425
2019-09-16,67.57
2019-09-17,67.665
2019-09-18,66.415
2019-09-19,67.38
2019-09-20,67.425
2019-09-23,68.19
2019-09-24,67.835
2019-09-25,67.95
2019-09-26,68.005
2019-09-27,67.955
2019-09-30,70.03
2019-10-01,70.875
2019-10-02,71.13
2019-10-03,69.96
2019-10-04,70.98
2019-10-07,70.57
2019-10-08,68.53
2019-10-09,68.92
2019-10-10,69.45
2019-10-11,71.06
2019-10-14,71.195
2019-10-15,71.09
2019-10-16,71.075
2019-10-17,71.72
2019-10-18,71.84
2019-10-21,72.44
2019-10-22,71.845
2019-10-23,72.6
2019-10-24,73.88
2019-10-25,74.42
2019-10-28,75.19
2019-10-29,75.55
2019-10-30,77.03
2019-10-31,77.34
2019-11-01,77.135
2019-11-04,78.2
2019-11-05,78.59
2019-11-06,78.2
2019-11-07,77.55
2019-11-08,77.195
2019-11-11,76.055
2019-11-12,75.84
2019-11-13,77.2
2019-11-14,76.94
2019-11-15,75.48
2019-11-18,75.04
2019-11-19,78.04
2019-11-20,77.245
2019-11-21,68.5
2019-11-22,67.535
2019-11-25,69.095
