date,close
2013-06-03,22.04
2013-06-04,22.01
2013-06-05,21.55
2013-06-06,21.71
2013-06-07,21.66
2013-06-10,21.79
2013-06-11,21.29
2013-06-12,20.93
2013-06-13,21.51
2013-06-14,21.28
2013-06-17,21.52
2013-06-18,21.88
2013-06-19,22.15
2013-06-20,22.04
2013-06-21,22.07
2013-06-24,21.6
2013-06-25,21.8
2013-06-26,22.1
2013-06-27,22.5
2013-06-28,22.75
2013-07-01,22.73
2013-07-02,22.83
2013-07-03,22.82
2013-07-05,23.39
2013-07-08,22.86
2013-07-09,23.555
2013-07-10,23.73
2013-07-11,24.4
2013-07-12,24.39
2013-07-15,24.71
2013-07-16,24.8
2013-07-17,24.93
2013-07-18,24.61
2013-07-19,24.6
2013-07-22,24.59
2013-07-23,24.46
2013-07-24,23.54
2013-07-25,23.93
2013-07-26,24.7
2013-07-29,24.31
2013-07-30,24.62
2013-07-31,24.66
2013-08-01,24.99
2013-08-02,24.82
2013-08-05,25.5
2013-08-06,25.52
2013-08-07,25.65
2013-08-08,25.77
2013-08-09,25.7
2013-08-12,26.15
2013-08-13,26.43
2013-08-14,26.39
2013-08-15,25.8
2013-08-16,26
2013-08-19,25.9
2013-08-20,26.01
2013-08-21,25.95
2013-08-22,26.07
2013-08-23,26
2013-08-26,26.07
2013-08-27,25.48
2013-08-28,25.89
2013-08-29,25.99
2013-08-30,25.74
2013-09-03,25.54
2013-09-04,25.95
2013-09-05,25.87
2013-09-06,25.5
2013-09-09,25.88
2013-09-10,26.13
2013-09-11,26.02
2013-09-12,25.73
2013-09-13,26.01
2013-09-16,26.11
2013-09-17,26.39
2013-09-18,26.29
2013-09-19,25.38
2013-09-20,25.45
2013-09-23,25.38
2013-09-24,25.04
2013-09-25,24.53
2013-09-26,24.34
2013-09-27,23.92
2013-09-30,24.25
2013-10-01,24.66
2013-10-02,24.52
2013-10-03,24.35
2013-10-04,24.52
2013-10-07,24.27
2013-10-08,23.9
2013-10-09,23.97
2013-10-10,24.61
2013-10-11,24.79
2013-10-14,25.28
2013-10-15,25.15
2013-10-16,25.45
2013-10-17,25.57
2013-10-18,25.76
2013-10-21,25.56
2013-10-22,26.16
2013-10-23,25.03
2013-10-24,24.83
2013-10-25,24.96
2013-10-28,24.93
2013-10-29,25.09
2013-10-30,24.91
2013-10-31,25.13
2013-11-01,24.69
2013-11-04,24.69
2013-11-05,24.1
2013-11-06,25.1
2013-11-07,24.17
2013-11-08,23.37
2013-11-11,23.24
2013-11-12,23.16
2013-11-13,23.34
2013-11-14,23.18
2013-11-15,23.2
2013-11-18,23.065
2013-11-19,23.07
2013-11-20,23.08
2013-11-21,23.43
2013-11-22,23.74
2013-11-25,23.93
2013-11-26,24.13
2013-11-27,24.4
2013-11-29,24.43
2013-12-02,24.03
2013-12-03,24.1
2013-12-04,23.89
2013-12-05,24.08
2013-12-06,24.12
2013-12-09,24.01
2013-12-10,23.77
2013-12-11,23.31
2013-12-12,23.03
2013-12-13,23.07
2013-12-16,23.56
2013-12-17,23.93
2013-12-18,23.82
2013-12-19,23.76
2013-12-20,23.96
2013-12-23,24.44
2013-12-24,24.64
2013-12-26,24.59
2013-12-27,24.94
2013-12-30,24.85
2013-12-31,24.95
2014-01-02,24.88
2014-01-03,24.99
2014-01-06,24.84
2014-01-07,24.86
2014-01-08,24.9
2014-01-09,24.5
2014-01-10,24.65
2014-01-13,24.34
2014-01-14,24.86
2014-01-15,25.1
2014-01-16,24.97
2014-01-17,24.86
2014-01-21,24.76
2014-01-22,25.25
2014-01-23,25.12
2014-01-24,23.61
2014-01-27,23.48
2014-01-28,23.7
2014-01-29,23.28
2014-01-30,23.73
2014-01-31,23.44
2014-02-03,22.51
2014-02-04,22.62
2014-02-05,22.51
2014-02-06,22.64
2014-02-07,22.98
2014-02-10,22.86
2014-02-11,22.6
2014-02-12,22.9
2014-02-13,23.21
2014-02-14,23.02
2014-02-18,22.98
2014-02-19,22.99
2014-02-20,23.135
2014-02-21,22.83
2014-02-24,23
2014-02-25,22.77
2014-02-26,22.5
2014-02-27,22.64
2014-02-28,23.06
2014-03-03,22.72
2014-03-04,23.71
2014-03-05,23.84
2014-03-06,24.03
2014-03-07,24.5
2014-03-10,24.65
2014-03-11,24.59
2014-03-12,24.67
2014-03-13,24.99
2014-03-14,24.99
2014-03-17,24.905
2014-03-18,25.77
2014-03-19,25.92
2014-03-20,26.27
2014-03-21,26
2014-03-24,25.83
2014-03-25,25.7
2014-03-26,25
2014-03-27,24.45
2014-03-28,24.49
2014-03-31,25.03
2014-04-01,25.8
2014-04-02,25.83
2014-04-03,25.88
2014-04-04,25.09
2014-04-07,24.76
2014-04-08,25.06
2014-04-09,25.24
2014-04-10,24.3
2014-04-11,23.57
2014-04-14,23.6
2014-04-15,23.92
2014-04-16,23.75
2014-04-17,24.26
2014-04-21,24.45
2014-04-22,25.36
2014-04-23,25.18
2014-04-24,25.61
2014-04-25,24.04
2014-04-28,23.71
2014-04-29,23.35
2014-04-30,23.52
2014-05-01,23.11
2014-05-02,23.53
2014-05-05,23.99
2014-05-06,23.69
2014-05-07,23.78
2014-05-08,23.71
2014-05-09,23.7
2014-05-12,24.52
2014-05-13,24.4
2014-05-14,23.46
2014-05-15,23.35
2014-05-16,23.48
2014-05-19,23.755
2014-05-20,23.37
2014-05-21,23.53
2014-05-22,24.13
2014-05-23,24.33
2014-05-27,24.69
2014-05-28,24.5
2014-05-29,24.56
2014-05-30,24.33
2014-06-02,24.49
2014-06-03,24.84
2014-06-04,25.06
2014-06-05,25.7
2014-06-06,25.63
2014-06-09,26.45
2014-06-10,26.58
2014-06-11,26.48
2014-06-12,26.32
2014-06-13,26.53
2014-06-16,26.49
2014-06-17,26.51
2014-06-18,26.49
2014-06-19,26.7
2014-06-20,26.86
2014-06-23,27.39
2014-06-24,26.8
2014-06-25,26.9
2014-06-26,26.73
2014-06-27,26.69
2014-06-30,26.76
2014-07-01,27.25
2014-07-02,27.08
2014-07-03,27.44
2014-07-07,27.09
2014-07-08,26.89
2014-07-09,26.615
2014-07-10,26.36
2014-07-11,26.4
2014-07-14,26.51
2014-07-15,26.27
2014-07-16,26.17
2014-07-17,25.7
2014-07-18,26.2
2014-07-21,26.12
2014-07-22,26.5
2014-07-23,25.69
2014-07-24,25.59
2014-07-25,24.66
2014-07-28,24.71
2014-07-29,24.45
2014-07-30,24.79
2014-07-31,23.98
2014-08-01,23.96
2014-08-04,24.08
2014-08-05,24.07
2014-08-06,24.26
2014-08-07,23.81
2014-08-08,23.99
2014-08-11,24.25
2014-08-12,24.01
2014-08-13,24.12
2014-08-14,24.35
2014-08-15,24.34
2014-08-18,24.76
2014-08-19,25.04
2014-08-20,25.26
2014-08-21,25.71
2014-08-22,25.79
2014-08-25,25.82
2014-08-26,25.89
2014-08-27,25.84
2014-08-28,26.15
2014-08-29,26.64
2014-09-02,26.41
2014-09-03,26.33
2014-09-04,26.31
2014-09-05,26.49
2014-09-08,26.48
2014-09-09,26.29
2014-09-10,26.47
2014-09-11,26.3
2014-09-12,25.87
2014-09-15,25.65
2014-09-16,25.74
2014-09-17,25.82
2014-09-18,26.15
2014-09-19,25.65
2014-09-22,25.41
2014-09-23,24.98
2014-09-24,25.43
2014-09-25,24.82
2014-09-26,25.08
2014-09-29,25.43
2014-09-30,25.41
2014-10-01,25.22
2014-10-02,25.4
2014-10-03,25.44
2014-10-06,25.1
2014-10-07,24.49
2014-10-08,25.02
2014-10-09,24.59
2014-10-10,22.44
2014-10-13,21.66
2014-10-14,21.4
2014-10-15,22.34
2014-10-16,22.44
2014-10-17,22.34
2014-10-20,23.04
2014-10-21,23.58
2014-10-22,23.72
2014-10-23,24.43
2014-10-24,24.56
2014-10-27,24.49
2014-10-28,25.28
2014-10-29,25.35
2014-10-30,25.12
2014-10-31,26.07
2014-11-03,25.9
2014-11-04,25.29
2014-11-05,26.22
2014-11-06,25.97
2014-11-07,26.47
2014-11-10,27.04
2014-11-11,27.13
2014-11-12,27.32
2014-11-13,26.8
2014-11-14,26.91
2014-11-17,26.58
2014-11-18,26.85
2014-11-19,26.48
2014-11-20,26.61
2014-11-21,26.58
2014-11-24,27.01
2014-11-25,26.93
2014-11-26,27.46
2014-11-28,27.2
2014-12-01,26.97
2014-12-02,27.85
2014-12-03,28.81
2014-12-04,28.63
2014-12-05,29.01
2014-12-08,28.53
2014-12-09,29.18
2014-12-10,28.34
2014-12-11,28.305
2014-12-12,27.86
2014-12-15,27.72
2014-12-16,27.15
2014-12-17,27.92
2014-12-18,28.11
2014-12-19,27.89
2014-12-22,28.64
2014-12-23,28.24
2014-12-24,28.61
2014-12-26,28.86
2014-12-29,28.71
2014-12-30,28.41
2014-12-31,28.38
2015-01-02,28.47
2015-01-05,27.9
2015-01-06,26.83
2015-01-07,27
2015-01-08,27.71
2015-01-09,28.02
2015-01-12,27.78
2015-01-13,27.88
2015-01-14,26.87
2015-01-15,26.16
2015-01-16,26.63
2015-01-20,26.53
2015-01-21,27.03
2015-01-22,26.4
2015-01-23,27.8
2015-01-26,28.27
2015-01-27,28
2015-01-28,28.17
2015-01-29,28.75
2015-01-30,27.86
2015-02-02,28.44
2015-02-03,29.58
2015-02-04,29.58
2015-02-05,29.69
2015-02-06,29.64
2015-02-09,29.57
2015-02-10,29.93
2015-02-11,30.06
2015-02-12,30.81
2015-02-13,30.87
2015-02-17,30.98
2015-02-18,31.12
2015-02-19,31.14
2015-02-20,31.14
2015-02-23,31.03
2015-02-24,31.5
2015-02-25,31.12
2015-02-26,31.84
2015-02-27,32.24
2015-03-02,33.32
2015-03-03,33.11
2015-03-04,33.2
2015-03-05,33.31
2015-03-06,33.18
2015-03-09,33.29
2015-03-10,33
2015-03-11,33
2015-03-12,33.08
2015-03-13,33.2
2015-03-16,33.89
2015-03-17,33.86
2015-03-18,34.68
2015-03-19,36.68
2015-03-20,36.34
2015-03-23,36.78
2015-03-24,36.81
2015-03-25,35.11
2015-03-26,34.5
2015-03-27,35.13
2015-03-30,35.59
2015-03-31,35.4
2015-04-01,35.25
2015-04-02,35.21
2015-04-06,35.28
2015-04-07,34.95
2015-04-08,35.81
2015-04-09,35.79
2015-04-10,35.67
2015-04-13,35.25
2015-04-14,35.12
2015-04-15,35.58
2015-04-16,35.37
2015-04-17,34.76
2015-04-20,35.45
2015-04-21,36.14
2015-04-22,35.98
2015-04-23,35.73
2015-04-24,32.4
2015-04-27,33.01
2015-04-28,33.33
2015-04-29,33.43
2015-04-30,33.36
2015-05-01,33.98
2015-05-04,33.77
2015-05-05,32.83
2015-05-06,33
2015-05-07,33.44
2015-05-08,33.81
2015-05-11,33.88
2015-05-12,33.76
2015-05-13,33.6
2015-05-14,33.8
2015-05-15,33.6
2015-05-18,34.39
2015-05-19,34.7
2015-05-20,34.89
2015-05-21,34.79
2015-05-22,35.01
2015-05-26,34.27
2015-05-27,35.85
2015-05-28,36.11
2015-05-29,36.39
2015-06-01,36.43
2015-06-02,36.08
2015-06-03,36.06
2015-06-04,35.85
2015-06-05,36.22
2015-06-08,35.26
2015-06-09,35.02
2015-06-10,36.25
2015-06-11,36.29
2015-06-12,36.16
2015-06-15,36.27
2015-06-16,35.71
2015-06-17,35.7
2015-06-18,36.5
2015-06-19,36.13
2015-06-22,36.12
2015-06-23,36.6
2015-06-24,36.86
2015-06-25,36.97
2015-06-26,36.67
2015-06-29,35.06
2015-06-30,34.95
2015-07-01,34.76
2015-07-02,34.46
2015-07-06,34.03
2015-07-07,33.88
2015-07-08,32.7
2015-07-09,32.27
2015-07-10,33.13
2015-07-13,33.25
2015-07-14,33.77
2015-07-15,33.11
2015-07-16,33.34
2015-07-17,33.08
2015-07-20,33.02
2015-07-21,33.08
2015-07-22,31.67
2015-07-23,32.72
2015-07-24,32.73
2015-07-27,31.78
2015-07-28,32.23
2015-07-29,32.72
2015-07-30,33.12
2015-07-31,32.94
2015-08-03,32.66
2015-08-04,32.47
2015-08-05,33.32
2015-08-06,32.8
2015-08-07,33
2015-08-10,33.82
2015-08-11,32.95
2015-08-12,32.9
2015-08-13,33.05
2015-08-14,33.38
2015-08-17,34.1
2015-08-18,32.73
2015-08-19,32.62
2015-08-20,31.15
2015-08-21,30.915
2015-08-24,29.54
2015-08-25,29.03
2015-08-26,30.6
2015-08-27,31.77
2015-08-28,31.94
2015-08-31,31.76
2015-09-01,31.12
2015-09-02,31.55
2015-09-03,32.2
2015-09-04,31.56
2015-09-08,32.79
2015-09-09,33.18
2015-09-10,33.22
2015-09-11,33.26
2015-09-14,33.14
2015-09-15,33.29
2015-09-16,33.26
2015-09-17,33.04
2015-09-18,32.25
2015-09-21,31.93
2015-09-22,31.26
2015-09-23,31.7
2015-09-24,31.63
2015-09-25,32.24
2015-09-28,31.01
2015-09-29,31.54
2015-09-30,32.82
2015-10-01,32.21
2015-10-02,33.1
2015-10-05,34.03
2015-10-06,34.35
2015-10-07,35.66
2015-10-08,36.07
2015-10-09,35.27
2015-10-12,35.14
2015-10-13,34.59
2015-10-14,35.34
2015-10-15,36.52
2015-10-16,37.36
2015-10-19,35.33
2015-10-20,35.12
2015-10-21,35
2015-10-22,35.86
2015-10-23,36.26
2015-10-26,36.38
2015-10-27,36.37
2015-10-28,37.05
2015-10-29,36.78
2015-10-30,36.01
2015-11-02,36.51
2015-11-03,36.28
2015-11-04,36.9
2015-11-05,36.85
2015-11-06,38.66
2015-11-09,37.94
2015-11-10,36.91
2015-11-11,36.99
2015-11-12,35.9
2015-11-13,35.45
2015-11-16,36.15
2015-11-17,36.74
2015-11-18,36.99
2015-11-19,36.69
2015-11-20,36.75
2015-11-23,36.21
2015-11-24,33.87
2015-11-25,35.63
2015-11-27,36.13
2015-11-30,36.01
2015-12-01,36.6
2015-12-02,36.67
2015-12-03,36.59
2015-12-04,37.34
2015-12-07,36.12
2015-12-08,36
2015-12-09,34.98
2015-12-10,35.23
2015-12-11,33.95
2015-12-14,32.92
2015-12-15,32.7
2015-12-16,32.84
2015-12-17,32.34
2015-12-18,31.51
2015-12-21,31.92
2015-12-22,32.32
2015-12-23,32.71
2015-12-24,33
2015-12-28,33.06
2015-12-29,33.91
2015-12-30,33.39
2015-12-31,32.59
2016-01-04,31.65
2016-01-05,31.28
2016-01-06,30.87
2016-01-07,29.69
2016-01-08,29
2016-01-11,30.85
2016-01-12,31.33
2016-01-13,30.98
2016-01-14,31.8
2016-01-15,29.77
2016-01-19,29.83
2016-01-20,30
2016-01-21,30.56
2016-01-22,31.5
2016-01-25,30.73
2016-01-26,30.96
2016-01-27,30.42
2016-01-28,30.41
2016-01-29,31.7
2016-02-01,31.33
2016-02-02,29.89
2016-02-03,30.09
2016-02-04,31.14
2016-02-05,31.15
2016-02-08,30.8
2016-02-09,29.93
2016-02-10,30.19
2016-02-11,30.22
2016-02-12,30.88
2016-02-16,32.44
2016-02-17,33.28
2016-02-18,32.54
2016-02-19,32.43
2016-02-22,33.27
2016-02-23,32.78
2016-02-24,33.24
2016-02-25,34.34
2016-02-26,34.46
2016-02-29,34.63
2016-03-01,36.11
2016-03-02,35.96
2016-03-03,36
2016-03-04,36.21
2016-03-07,35.35
2016-03-08,34.11
2016-03-09,34.66
2016-03-10,34.4
2016-03-11,35.19
2016-03-14,34.53
2016-03-15,34.88
2016-03-16,35.89
2016-03-17,36.5
2016-03-18,37.17
2016-03-21,37.44
2016-03-22,37.58
2016-03-23,37.06
2016-03-24,38.54
2016-03-28,38.28
2016-03-29,38.8
2016-03-30,38.43
2016-03-31,38.31
2016-04-01,38.55
2016-04-04,37.96
2016-04-05,37.46
2016-04-06,37.83
2016-04-07,37.11
2016-04-08,37.19
2016-04-11,37.28
2016-04-12,36.65
2016-04-13,37.57
2016-04-14,37.42
2016-04-15,37.01
2016-04-18,37.03
2016-04-19,36.6
2016-04-20,37.14
2016-04-21,36.66
2016-04-22,37.01
2016-04-25,36.44
2016-04-26,36.96
2016-04-27,37.39
2016-04-28,36.18
2016-04-29,33.79
2016-05-02,33.8
2016-05-03,33.27
2016-05-04,32.49
2016-05-05,32.48
2016-05-06,32.56
2016-05-09,32.32
2016-05-10,32.58
2016-05-11,32.62
2016-05-12,31.43
2016-05-13,31.33
2016-05-16,31.8
2016-05-17,31.23
2016-05-18,31.59
2016-05-19,31.56
2016-05-20,32.45
2016-05-23,32.35
2016-05-24,33.34
2016-05-25,33.34
2016-05-26,33.37
2016-05-27,33.49
2016-05-31,33.83
2016-06-01,33.81
2016-06-02,33.55
2016-06-03,33.57
2016-06-06,33.92
2016-06-07,34.32
2016-06-08,34.1
2016-06-09,34.11
2016-06-10,33.32
2016-06-13,33.8
2016-06-14,33.95
2016-06-15,33.85
2016-06-16,33.65
2016-06-17,32.87
2016-06-20,33.39
2016-06-21,33.46
2016-06-22,33.3
2016-06-23,34.31
2016-06-24,31.75
2016-06-27,30.15
2016-06-28,30.94
2016-06-29,31.36
2016-06-30,32.68
2016-07-01,32.36
2016-07-05,31.4
2016-07-06,31.79
2016-07-07,32.36
2016-07-08,33.615
2016-07-11,34.05
2016-07-12,34.25
2016-07-13,34.01
2016-07-14,34.13
2016-07-15,33.88
2016-07-18,34.21
2016-07-19,34.36
2016-07-20,34.74
2016-07-21,34.33
2016-07-22,34.72
2016-07-25,34.99
2016-07-26,36.3
2016-07-27,36.11
2016-07-28,36.2
2016-07-29,39
2016-08-01,38.95
2016-08-02,37.99
2016-08-03,38.3
2016-08-04,38.4
2016-08-05,39.18
2016-08-08,39.08
2016-08-09,39.39
2016-08-10,39.13
2016-08-11,39.74
2016-08-12,39.78
2016-08-15,39.85
2016-08-16,39.47
2016-08-17,39.51
2016-08-18,39.74
2016-08-19,40.1
2016-08-22,40.41
2016-08-23,40.66
2016-08-24,40.38
2016-08-25,40.2
2016-08-26,39.71
2016-08-29,39.83
2016-08-30,40.19
2016-08-31,39.96
2016-09-01,40.39
2016-09-02,40.11
2016-09-06,39.69
2016-09-07,39.36
2016-09-08,40.73
2016-09-09,39.01
2016-09-12,40.24
2016-09-13,39.57
2016-09-14,39.52
2016-09-15,40.93
2016-09-16,41.06
2016-09-19,41.35
2016-09-20,40.62
2016-09-21,41.13
2016-09-22,42.11
2016-09-23,40.96
2016-09-26,40.24
2016-09-27,40.89
2016-09-28,41.08
2016-09-29,40.87
2016-09-30,41.98
2016-10-03,41.38
2016-10-04,41.31
2016-10-05,41.91
2016-10-06,42.42
2016-10-07,41.59
2016-10-10,40.79
2016-10-11,39.02
2016-10-12,38.48
2016-10-13,38.02
2016-10-14,38.01
2016-10-17,37.73
2016-10-18,37.92
2016-10-19,38.08
2016-10-20,38.26
2016-10-21,39.43
2016-10-24,40.36
2016-10-25,40.24
2016-10-26,42
2016-10-27,42.14
2016-10-28,42.06
2016-10-31,42.13
2016-11-01,41.96
2016-11-02,41.83
2016-11-03,47.99
2016-11-04,46.59
2016-11-07,47.84
2016-11-08,46.72
2016-11-09,47.99
2016-11-10,47.86
2016-11-11,51.1
2016-11-14,51.64
2016-11-15,53.03
2016-11-16,53.95
2016-11-17,54.46
2016-11-18,54.3
2016-11-21,54.95
2016-11-22,55.64
2016-11-23,55.85
2016-11-25,56.14
2016-11-28,55.94
2016-11-29,55.07
2016-11-30,54.75
2016-12-01,52.63
2016-12-02,52.95
2016-12-05,53.4
2016-12-06,54.45
2016-12-07,55.68
2016-12-08,56.72
2016-12-09,55.72
2016-12-12,54.34
2016-12-13,55.19
2016-12-14,54.7
2016-12-15,56.01
2016-12-16,55.49
2016-12-19,55.86
2016-12-20,56.79
2016-12-21,56.32
2016-12-22,55.76
2016-12-23,56.15
2016-12-27,56.19
2016-12-28,55.24
2016-12-29,55.29
2016-12-30,53.97
2017-01-03,54.58
2017-01-04,55.33
2017-01-05,55.07
2017-01-06,55.31
2017-01-09,55.64
2017-01-10,56.35
2017-01-11,57.25
2017-01-12,55.96
2017-01-13,56.27
2017-01-17,54.57
2017-01-18,55.47
2017-01-19,55.13
2017-01-20,56.56
2017-01-23,55.76
2017-01-24,55.5
2017-01-25,56.37
2017-01-26,56.56
2017-01-27,55.64
2017-01-30,54.39
2017-01-31,53.15
2017-02-01,53.55
2017-02-02,53.5
2017-02-03,54.55
2017-02-06,54.16
2017-02-07,54.49
2017-02-08,53.35
2017-02-09,53.68
2017-02-10,53.45
2017-02-13,53.23
2017-02-14,53.32
2017-02-15,54.23
2017-02-16,53.94
2017-02-17,54.26
2017-02-21,54.33
2017-02-22,54.31
2017-02-23,53.49
2017-02-24,53.14
2017-02-27,53.63
2017-02-28,51.82
2017-03-01,53.31
2017-03-02,52.85
2017-03-03,52.49
2017-03-06,52.49
2017-03-07,52.41
2017-03-08,52.18
2017-03-09,51.5
2017-03-10,52.03
2017-03-13,52.25
2017-03-14,51.6
2017-03-15,52.6
2017-03-16,52.72
2017-03-17,52.64
2017-03-20,52.5
2017-03-21,50.86
2017-03-22,51.28
2017-03-23,51.17
2017-03-24,51.59
2017-03-27,51.48
2017-03-28,51.88
2017-03-29,51.46
2017-03-30,51.49
2017-03-31,51.53
2017-04-03,50.92
2017-04-04,50.71
2017-04-05,48.51
2017-04-06,49.18
2017-04-07,49.57
2017-04-10,48.91
2017-04-11,48.58
2017-04-12,47.32
2017-04-13,46.81
2017-04-17,47.38
2017-04-18,48.03
2017-04-19,47.99
2017-04-20,49.53
2017-04-21,49.1
2017-04-24,50.27
2017-04-25,50.49
2017-04-26,48.99
2017-04-27,49.14
2017-04-28,46.94
2017-05-01,48.71
2017-05-02,48.71
2017-05-03,48.8
2017-05-04,49
2017-05-05,48.85
2017-05-08,48.65
2017-05-09,49.26
2017-05-10,49.74
2017-05-11,49.53
2017-05-12,49.44
2017-05-15,50.16
2017-05-16,50.62
2017-05-17,47.36
2017-05-18,47.94
2017-05-19,48.16
2017-05-22,48.36
2017-05-23,48.52
2017-05-24,49.76
2017-05-25,49.86
2017-05-26,49.12
2017-05-30,48.93
2017-05-31,49.11
2017-06-01,50.62
2017-06-02,51.24
2017-06-05,50.11
2017-06-06,50.41
2017-06-07,50.68
2017-06-08,52.79
2017-06-09,49.99
2017-06-12,48.95
2017-06-13,49.13
2017-06-14,48.22
2017-06-15,48.05
2017-06-16,48.03
2017-06-19,48.38
2017-06-20,48.03
2017-06-21,48.55
2017-06-22,48.38
2017-06-23,48.4
2017-06-26,47.92
2017-06-27,47.06
2017-06-28,47.84
2017-06-29,46.8
2017-06-30,46.8
2017-07-03,46.69
2017-07-05,47.33
2017-07-06,47.75
2017-07-07,48.55
2017-07-10,48.86
2017-07-11,49.14
2017-07-12,50.21
2017-07-13,50.24
2017-07-14,50.63
2017-07-17,50.98
2017-07-18,51.06
2017-07-19,51.76
2017-07-20,53.21
2017-07-21,52.92
2017-07-24,52.87
2017-07-25,53.55
2017-07-26,53.65
2017-07-27,53.65
2017-07-28,52.59
2017-07-31,52.08
2017-08-01,53.55
2017-08-02,52.04
2017-08-03,52.13
2017-08-04,51.78
2017-08-07,51.75
2017-08-08,51.46
2017-08-09,51.15
2017-08-10,49.43
2017-08-11,49.26
2017-08-14,50.38
2017-08-15,50.25
2017-08-16,50.63
2017-08-17,48.89
2017-08-18,48.78
2017-08-21,48.15
2017-08-22,48.86
2017-08-23,48.87
2017-08-24,49.27
2017-08-25,48.63
2017-08-28,49
2017-08-29,48.9
2017-08-30,50
2017-08-31,50.38
2017-09-01,50.58
2017-09-05,49.52
2017-09-06,49.44
2017-09-07,48.9
2017-09-08,48.8
2017-09-11,49.45
2017-09-12,49.81
2017-09-13,49.25
2017-09-14,49.41
2017-09-15,49.4
2017-09-18,50.24
2017-09-19,50.17
2017-09-20,49.56
2017-09-21,49.3
2017-09-22,49.9
2017-09-25,49.42
2017-09-26,49.26
2017-09-27,50.81
2017-09-28,51.01
2017-09-29,51.48
2017-10-02,52.47
2017-10-03,52.79
2017-10-04,52.93
2017-10-05,52.6
2017-10-06,52.6
2017-10-09,52.38
2017-10-10,52.27
2017-10-11,52.25
2017-10-12,51.76
2017-10-13,51.95
2017-10-16,51.44
2017-10-17,51.28
2017-10-18,51.84
2017-10-19,51.46
2017-10-20,51.61
2017-10-23,52.04
2017-10-24,52.5
2017-10-25,52.66
2017-10-26,52.48
2017-10-27,52.69
2017-10-30,52.64
2017-10-31,53.37
2017-11-01,53.16
2017-11-02,53.74
2017-11-03,53.87
2017-11-06,55.16
2017-11-07,53.95
2017-11-08,54.03
2017-11-09,52.84
2017-11-10,52.62
2017-11-13,52.62
2017-11-14,52.91
2017-11-15,52.51
2017-11-16,53.18
2017-11-17,53.02
2017-11-20,53.84
2017-11-21,55.22
2017-11-22,54.64
2017-11-24,55.07
2017-11-27,54.54
2017-11-28,54.45
2017-11-29,51.67
2017-11-30,52.85
2017-12-01,52.6
2017-12-04,51.15
2017-12-05,51.37
2017-12-06,51.1
2017-12-07,51.83
2017-12-08,51.03
2017-12-11,51.17
2017-12-12,50.8
2017-12-13,50.84
2017-12-14,51.39
2017-12-15,51.71
2017-12-18,53.46
2017-12-19,52.17
2017-12-20,52.94
2017-12-21,52.57
2017-12-22,52.19
2017-12-26,51.48
2017-12-27,51.74
2017-12-28,52.19
2017-12-29,51.65
2018-01-02,53.17
2018-01-03,53.85
2018-01-04,54.77
2018-01-05,55.73
2018-01-08,56.05
2018-01-09,56.87
2018-01-10,55.39
2018-01-11,57.58
2018-01-12,58.13
2018-01-16,57.54
2018-01-17,58.46
2018-01-18,57.97
2018-01-19,58.18
2018-01-22,58.97
2018-01-23,62.35
2018-01-24,63.44
2018-01-25,61.73
2018-01-26,62.77
2018-01-29,62.09
2018-01-30,61.9
2018-01-31,61.79
2018-02-01,61.81
2018-02-02,60.59
2018-02-05,57.64
2018-02-06,58.64
2018-02-07,57.51
2018-02-08,56.16
2018-02-09,57.63
2018-02-12,59.28
2018-02-13,59.17
2018-02-14,60.03
2018-02-15,60.68
2018-02-16,60.01
2018-02-20,61.46
2018-02-21,60.94
2018-02-22,61.05
2018-02-23,62.31
2018-02-26,64.24
2018-02-27,64.51
2018-02-28,64.9
2018-03-01,64.3
2018-03-02,67.3
2018-03-05,67.44
2018-03-06,67.41
2018-03-07,67.33
2018-03-08,67.18
2018-03-09,67.24
2018-03-12,66.93
2018-03-13,66.45
2018-03-14,66.24
2018-03-15,66.25
2018-03-16,66.21
2018-03-19,66.36
2018-03-20,66.57
2018-03-21,66.03
2018-03-22,65.51
2018-03-23,65.44
2018-03-26,65.84
2018-03-27,65.51
2018-03-28,64.31
2018-03-29,64.72
2018-04-02,64.53
2018-04-03,65.5
2018-04-04,65.25
2018-04-05,64.66
2018-04-06,63.68
2018-04-09,63.02
2018-04-10,64.34
2018-04-11,64.54
2018-04-12,64.26
2018-04-13,63.94
2018-04-16,63.77
2018-04-17,64
2018-04-18,63.62
2018-04-19,62.08
2018-04-20,63.12
2018-04-23,63.77
2018-04-24,64.3
2018-04-25,64.66
2018-04-26,64.74
2018-04-27,64.59
2018-04-30,64.69
2018-05-01,65.05
2018-05-02,64.92
2018-05-03,65.68
2018-05-04,65.6
2018-05-07,67.76
2018-05-08,67.43
2018-05-09,67.24
2018-05-10,66.99
2018-05-11,66.84
2018-05-14,67.71
2018-05-15,68.55
2018-05-16,68.59
2018-05-17,68.58
2018-05-18,68.6
2018-05-21,68.61
2018-05-22,68.6
2018-05-23,68.53
2018-05-24,68.73
2018-05-25,68.74
2018-05-29,68.74
