date,close
2014-06-13,50.1837
2014-06-16,50.6014
2014-06-17,51.0428
2014-06-18,51.3581
2014-06-19,51.2005
2014-06-20,51.1768
2014-06-23,51.2793
2014-06-24,50.7039
2014-06-25,50.9167
2014-06-26,50.7275
2014-06-27,50.6014
2014-06-30,49.3009
2014-07-01,49.7817
2014-07-02,50.0497
2014-07-03,50.0812
2014-07-07,50.0103
2014-07-08,49.3482
2014-07-09,49.5137
2014-07-10,49.4586
2014-07-11,49.5137
2014-07-14,49.9709
2014-07-15,50.1285
2014-07-16,49.9867
2014-07-17,49.9236
2014-07-18,50.1443
2014-07-21,49.9709
2014-07-22,50.5069
2014-07-23,50.5226
2014-07-24,52.6665
2014-07-25,53.1
2014-07-28,54.101
2014-07-29,54.5187
2014-07-30,54.3768
2014-07-31,53.3837
2014-08-01,53.1236
2014-08-04,53.502
2014-08-05,53.5808
2014-08-06,53.9749
2014-08-07,54.1167
2014-08-08,53.9039
2014-08-11,54.3768
2014-08-12,54.0773
2014-08-13,54.6133
2014-08-14,54.4793
2014-08-15,54.3453
2014-08-18,54.8813
2014-08-19,54.7867
2014-08-20,54.7709
2014-08-21,55.2517
2014-08-22,55.2438
2014-08-25,55.2123
2014-08-26,55.0547
2014-08-27,55.1571
2014-08-28,54.9601
2014-08-29,55.3778
2014-09-02,55.6143
2014-09-03,55.701
2014-09-04,55.701
2014-09-05,55.8271
2014-09-08,56.4813
2014-09-09,56.0399
2014-09-10,56.4655
2014-09-11,56.9069
2014-09-12,56.7256
2014-09-15,56.4734
2014-09-16,56.4104
2014-09-17,56.3394
2014-09-18,57.2852
2014-09-19,56.4655
2014-09-22,55.5788
2014-09-23,55.6222
2014-09-24,56.4182
2014-09-25,55.2951
2014-09-26,55.5749
2014-09-29,55.969
2014-09-30,56.2291
2014-10-01,54.2428
2014-10-02,54.3374
2014-10-03,54.8576
2014-10-06,54.2271
2014-10-07,53.2261
2014-10-08,53.7148
2014-10-09,53.0212
2014-10-10,51.7522
2014-10-13,51.0113
2014-10-14,51.1847
2014-10-15,51.1847
2014-10-16,50.4517
2014-10-17,50.8694
2014-10-20,51.3699
2014-10-21,52.0202
2014-10-22,51.0586
2014-10-23,48.7413
2014-10-24,50.1206
2014-10-27,49.8842
2014-10-28,50.5147
2014-10-29,49.6871
2014-10-30,50.231
2014-10-31,50.6251
2014-11-03,50.767
2014-11-04,50.9719
2014-11-05,50.767
2014-11-06,52.0123
2014-11-07,52.2724
2014-11-10,52.6586
2014-11-11,52.5483
2014-11-12,52.2093
2014-11-13,51.9019
2014-11-14,52.0911
2014-11-17,51.8074
2014-11-18,51.2793
2014-11-19,50.9325
2014-11-20,51.1453
2014-11-21,51.4448
2014-11-24,51.5394
2014-11-25,51.9098
2014-11-26,51.8862
2014-11-28,52.2645
2014-12-01,52.0438
2014-12-02,52.1699
2014-12-03,51.5236
2014-12-04,51.8468
2014-12-05,52.1936
2014-12-08,50.5226
2014-12-09,50.6645
2014-12-10,49.3798
2014-12-11,49.1118
2014-12-12,47.2911
2014-12-15,47.5118
2014-12-16,47.0231
2014-12-17,48.2645
2014-12-18,49.8842
2014-12-19,49.7581
2014-12-22,50.1285
2014-12-23,50.9719
2014-12-24,50.8221
2014-12-26,50.9404
2014-12-29,51.1216
2014-12-30,50.7039
2014-12-31,50.2862
2015-01-02,50.0339
2015-01-05,48.9226
2015-01-06,47.5512
2015-01-07,48.2605
2015-01-08,48.4812
2015-01-09,48.1659
2015-01-12,48.1975
2015-01-13,46.4083
2015-01-14,45.3442
2015-01-15,44.9107
2015-01-16,46.0142
2015-01-20,46.4792
2015-01-21,46.3689
2015-01-22,47.3305
2015-01-23,48.0556
2015-01-26,48.0477
2015-01-27,47.3778
2015-01-28,46.6526
2015-01-29,47.8901
2015-01-30,46.7078
2015-02-02,47.4487
2015-02-03,48.6467
2015-02-04,48.2211
2015-02-05,48.5994
2015-02-06,49.0014
2015-02-09,49.1709
2015-02-10,49.9472
2015-02-11,50.231
2015-02-12,50.2152
2015-02-13,50.8458
2015-02-17,50.5699
2015-02-18,50.2231
2015-02-19,50.6724
2015-02-20,51.1689
2015-02-23,49.7108
2015-02-24,50.1679
2015-02-25,50.5463
2015-02-26,50.0261
2015-02-27,50.1876
2015-03-02,50.1837
2015-03-03,49.1985
2015-03-04,48.8635
2015-03-05,48.8832
2015-03-06,48.2054
2015-03-09,48.5127
2015-03-10,47.1058
2015-03-11,46.826
2015-03-12,47.8034
2015-03-13,47.4999
2015-03-16,48.5758
2015-03-17,48.5994
2015-03-18,49.1433
2015-03-19,49.6399
2015-03-20,50.2783
2015-03-23,50.4123
2015-03-24,50.2862
2015-03-25,49.5374
2015-03-26,49.9551
2015-03-27,50.1364
2015-03-30,50.4596
2015-03-31,50.3413
2015-04-01,49.5374
2015-04-02,49.0093
2015-04-06,49.7778
2015-04-07,49.8566
2015-04-08,50.7354
2015-04-09,50.9601
2015-04-10,50.2862
2015-04-13,50.03
2015-04-14,50.4517
2015-04-15,51.6261
2015-04-16,51.5394
2015-04-17,50.4596
2015-04-20,50.3177
2015-04-21,50.6172
2015-04-22,51.0507
2015-04-23,53.0763
2015-04-24,52.8005
2015-04-27,52.7689
2015-04-28,53.2103
2015-04-29,54.0064
2015-04-30,52.9345
2015-05-01,52.7611
2015-05-04,52.6507
2015-05-05,52.233
2015-05-06,51.8941
2015-05-07,51.9808
2015-05-08,52.4852
2015-05-11,52.3354
2015-05-12,52.1148
2015-05-13,52.0281
2015-05-14,52.6113
2015-05-15,51.7128
2015-05-18,51.9571
2015-05-19,51.8704
2015-05-20,52.0044
2015-05-21,52.1699
2015-05-22,51.7128
2015-05-26,51.5473
2015-05-27,51.9413
2015-05-28,51.6103
2015-05-29,51.2399
2015-06-01,51.8389
2015-06-02,52.8162
2015-06-03,52.233
2015-06-04,52.0517
2015-06-05,52.2487
2015-06-08,52.0123
2015-06-09,50.7985
2015-06-10,51.9965
2015-06-11,55.4803
2015-06-12,56.6783
2015-06-15,55.1887
2015-06-16,55.4409
2015-06-17,55.2478
2015-06-18,55.7562
2015-06-19,55.5749
2015-06-22,56.0005
2015-06-23,57.2852
2015-06-24,56.4931
2015-06-25,56.4419
2015-06-26,55.9296
2015-06-29,55.0074
2015-06-30,55.299
2015-07-01,54.6842
2015-07-02,54.834
2015-07-06,54.2113
2015-07-07,53.9433
2015-07-08,53.5177
2015-07-09,54.298
2015-07-10,54.5108
2015-07-13,55.2675
2015-07-14,55.8744
2015-07-15,55.0547
2015-07-16,55.4724
2015-07-17,54.9443
2015-07-20,54.6606
2015-07-21,54.8813
2015-07-22,54.6448
2015-07-23,54.9049
2015-07-24,54.6054
2015-07-27,54.0773
2015-07-28,54.8813
2015-07-29,59.3266
2015-07-30,59.7128
2015-07-31,59.5946
2015-08-03,59.7995
2015-08-04,59.9493
2015-08-05,60.6587
2015-08-06,59.6813
2015-08-07,59.3188
2015-08-10,60.0045
2015-08-11,59.2715
2015-08-12,60.233
2015-08-13,60.5326
2015-08-14,61.1237
2015-08-17,61.2735
2015-08-18,61.5493
2015-08-19,61.1789
2015-08-20,59.7917
2015-08-21,58.2547
2015-08-24,52.8241
2015-08-25,52.1778
2015-08-26,53.9197
2015-08-27,54.8498
2015-08-28,54.1404
2015-08-31,53.6832
2015-09-01,51.5473
2015-09-02,53.1157
2015-09-03,53.4941
2015-09-04,53.5098
2015-09-08,55.0468
2015-09-09,54.3295
2015-09-10,55.0941
2015-09-11,55.5355
2015-09-14,55.7246
2015-09-15,56.9463
2015-09-16,57.5138
2015-09-17,57.6084
2015-09-18,56.9857
2015-09-21,57.4665
2015-09-22,56.8675
2015-09-23,57.0645
2015-09-24,57.5138
2015-09-25,56.6862
2015-09-28,54.5896
2015-09-29,53.297
2015-09-30,54.6054
2015-10-01,55.2517
2015-10-02,56.4104
2015-10-05,57.301
2015-10-06,56.4655
2015-10-07,57.0882
2015-10-08,58.7513
2015-10-09,59.9178
2015-10-12,59.6813
2015-10-13,58.7828
2015-10-14,57.9788
2015-10-15,58.9956
2015-10-16,59.4843
2015-10-19,59.7995
2015-10-20,59.839
2015-10-21,56.6862
2015-10-22,63.5119
2015-10-23,63.9533
2015-10-26,64.773
2015-10-27,64.8124
2015-10-28,66.3415
2015-10-29,64.4025
2015-10-30,64.7099
2015-11-02,65.2223
2015-11-03,64.4341
2015-11-04,65.1986
2015-11-05,64.7257
2015-11-06,64.6469
2015-11-09,63.3779
2015-11-10,63.9139
2015-11-11,63.7562
2015-11-12,63.2518
2015-11-13,61.4074
2015-11-16,62.5976
2015-11-17,61.8094
2015-11-18,55.5985
2015-11-19,57.2379
2015-11-20,59.1532
2015-11-23,59.768
2015-11-24,60.5956
2015-11-25,60.1858
2015-11-27,60.572
2015-11-30,60.4301
2015-12-01,61.3444
2015-12-02,60.84
2015-12-03,59.4291
2015-12-04,60.0675
2015-12-07,60.3749
2015-12-08,61.8882
2015-12-09,60.3355
2015-12-10,60.5641
2015-12-11,59.1769
2015-12-14,59.4764
2015-12-15,61.7542
2015-12-16,62.4006
2015-12-17,61.2104
2015-12-18,58.8853
2015-12-21,58.7197
2015-12-22,59.3582
2015-12-23,59.9414
2015-12-24,60.0675
2015-12-28,59.8862
2015-12-29,61.0528
2015-12-30,60.6587
2015-12-31,59.6261
2016-01-04,58.4596
2016-01-05,57.971
2016-01-06,58.3178
2016-01-07,55.9059
2016-01-08,54.9207
2016-01-11,54.2823
2016-01-12,55.7956
2016-01-13,53.0212
2016-01-14,53.1079
2016-01-15,52.2566
2016-01-19,52.0753
2016-01-20,52.4143
2016-01-21,51.563
2016-01-22,53.1552
2016-01-25,52.0596
2016-01-26,53.7463
2016-01-27,51.9413
2016-01-28,53.9985
2016-01-29,55.5355
2016-02-01,55.8823
2016-02-02,52.233
2016-02-03,53.6675
2016-02-04,52.9187
2016-02-05,50.4044
2016-02-08,49.7896
2016-02-09,49.1275
2016-02-10,49.0881
2016-02-11,49.1669
2016-02-12,50.6881
2016-02-16,51.7601
2016-02-17,54.5581
2016-02-18,54.03
2016-02-19,54.6054
2016-02-22,55.0862
2016-02-23,54.1956
2016-02-24,54.8419
2016-02-25,56.4419
2016-02-26,56.3867
2016-02-29,55.6852
2016-03-01,59.1769
2016-03-02,58.3493
2016-03-03,58.2862
2016-03-04,58.6409
2016-03-07,59.3345
2016-03-08,58.2941
2016-03-09,59.1611
2016-03-10,59.6577
2016-03-11,60.2725
2016-03-14,60.5562
2016-03-15,60.6587
2016-03-16,60.7454
2016-03-17,60.8321
2016-03-18,60.7454
2016-03-21,61.4941
2016-03-22,61.439
2016-03-23,60.4143
2016-03-24,60.438
2016-03-28,60.3749
2016-03-29,61.4784
2016-03-30,61.3129
2016-03-31,61.9355
2016-04-01,62.6922
2016-04-04,62.4794
2016-04-05,61.8804
2016-04-06,62.5818
2016-04-07,60.8951
2016-04-08,61.8725
2016-04-11,61.9119
2016-04-12,61.5966
2016-04-13,62.8183
2016-04-14,63.6932
2016-04-15,63.4883
2016-04-18,64.1346
2016-04-19,63.1651
2016-04-20,63.4646
2016-04-21,66.2311
2016-04-22,65.3405
2016-04-25,65.2538
2016-04-26,65.5691
2016-04-27,66.1287
2016-04-28,64.6705
2016-04-29,64.505
2016-05-02,65.1592
2016-05-03,63.5986
2016-05-04,63.2124
2016-05-05,63.2597
2016-05-06,64.0321
2016-05-09,64.1661
2016-05-10,65.7819
2016-05-11,65.1356
2016-05-12,65.3641
2016-05-13,64.8203
2016-05-16,65.4114
2016-05-17,64.8676
2016-05-18,65.2144
2016-05-19,64.8203
2016-05-20,65.5848
2016-05-23,65.9553
2016-05-24,67.6972
2016-05-25,65.5296
2016-05-26,66.8853
2016-05-27,67.3898
2016-05-31,66.9326
2016-06-01,67.6341
2016-06-02,68.1701
2016-06-03,67.2242
2016-06-06,67.8706
2016-06-07,68.8006
2016-06-08,69.5021
2016-06-09,69.108
2016-06-10,67.7996
2016-06-13,67.4134
2016-06-14,67.2637
2016-06-15,66.5937
2016-06-16,66.5385
2016-06-17,66.0577
2016-06-20,67.106
2016-06-21,67.1848
2016-06-22,67.0824
2016-06-23,68.0597
2016-06-24,63.4883
2016-06-27,60.706
2016-06-28,62.4636
2016-06-29,63.5513
2016-06-30,63.1257
2016-07-01,63.3385
2016-07-05,62.4715
2016-07-06,62.7158
2016-07-07,63.5986
2016-07-08,65.8449
2016-07-11,65.6085
2016-07-12,66.1838
2016-07-13,66.2784
2016-07-14,66.909
2016-07-15,66.8696
2016-07-18,66.7829
2016-07-19,67.0666
2016-07-20,67.776
2016-07-21,67.1691
2016-07-22,68.6351
2016-07-25,69.5809
2016-07-26,70.4085
2016-07-27,69.3445
2016-07-28,70.1957
2016-07-29,70.2509
2016-08-01,68.2725
2016-08-02,65.7897
2016-08-03,66.8459
2016-08-04,66.176
2016-08-05,66.9957
2016-08-08,66.9563
2016-08-09,67.0981
2016-08-10,67.4765
2016-08-11,68.7139
2016-08-12,68.6982
2016-08-15,68.9346
2016-08-16,68.2962
2016-08-17,68.5642
2016-08-18,69.2735
2016-08-19,69.045
2016-08-22,68.9346
2016-08-23,69.6046
2016-08-24,69.4075
2016-08-25,69.5809
2016-08-26,69.4627
2016-08-29,69.7858
2016-08-30,69.2656
2016-08-31,68.7297
2016-09-01,68.7927
2016-09-02,68.5563
2016-09-06,68.9977
2016-09-07,68.7454
2016-09-08,67.973
2016-09-09,65.5848
2016-09-12,66.2469
2016-09-13,65.7109
2016-09-14,65.6006
2016-09-15,66.0971
2016-09-16,65.3957
2016-09-19,65.7109
2016-09-20,65.5691
2016-09-21,66.6095
2016-09-22,67.1218
2016-09-23,66.9247
2016-09-26,66.6489
2016-09-27,67.1927
2016-09-28,67.8075
2016-09-29,66.9484
2016-09-30,67.1691
2016-10-03,66.3336
2016-10-04,66.2942
2016-10-05,66.9641
2016-10-06,66.9247
2016-10-07,66.4439
2016-10-10,66.7592
2016-10-11,65.4745
2016-10-12,65.6794
2016-10-13,65.7267
2016-10-14,65.9237
2016-10-17,65.5533
2016-10-18,67.2479
2016-10-19,68.0203
2016-10-20,68.0518
2016-10-21,67.1533
2016-10-24,67.9178
2016-10-25,66.9169
2016-10-26,66.1287
2016-10-27,65.703
2016-10-28,66.6173
2016-10-31,66.838
2016-11-01,66.9878
2016-11-02,66.0499
2016-11-03,65.774
2016-11-04,65.6163
2016-11-07,67.4055
2016-11-08,67.1848
2016-11-09,67.7444
2016-11-10,68.3513
2016-11-11,67.4292
2016-11-14,65.8449
2016-11-15,67.8233
2016-11-16,68.3119
2016-11-17,69.3445
2016-11-18,68.4302
2016-11-21,69.3445
2016-11-22,69.6913
2016-11-23,69.108
2016-11-25,69.6046
2016-11-28,68.9346
2016-11-29,69.3129
2016-11-30,68.3592
2016-12-01,67.3661
2016-12-02,67.4843
2016-12-05,70.1405
2016-12-06,69.0607
2016-12-07,70.2115
2016-12-08,70.9366
2016-12-09,70.4006
2016-12-12,70.0459
2016-12-13,71.2913
2016-12-14,71.2913
2016-12-15,72.3238
2016-12-16,71.4804
2016-12-19,72.0795
2016-12-20,72.3002
2016-12-21,72.5603
2016-12-22,71.2913
2016-12-23,71.5987
2016-12-27,71.7011
2016-12-28,70.9996
2016-12-29,70.9524
2016-12-30,70.3927
2017-01-03,71.0391
2017-01-04,71.1494
2017-01-05,71.1258
2017-01-06,71.7327
2017-01-09,71.5593
2017-01-10,71.4489
2017-01-11,72.174
2017-01-12,71.8036
2017-01-13,72.3553
2017-01-17,71.646
2017-01-18,73.7425
2017-01-19,73.0095
2017-01-20,73.2933
2017-01-23,72.8676
2017-01-24,74.381
2017-01-25,75.4608
2017-01-26,70.5583
2017-01-27,71.1415
2017-01-30,71.8272
2017-01-31,71.8745
2017-02-01,70.5102
2017-02-02,74.1822
2017-02-03,75.9143
2017-02-06,75.5184
2017-02-07,76.8546
2017-02-08,76.8942
2017-02-09,77.6167
2017-02-10,77.7453
2017-02-13,77.973
2017-02-14,78.1214
2017-02-15,79.3389
2017-02-16,79.1211
2017-02-17,79.6754
2017-02-21,79.9426
2017-02-22,79.3487
2017-02-23,79.1112
2017-02-24,79.3586
2017-02-27,79.3389
2017-02-28,78.1412
2017-03-01,79.9426
2017-03-02,78.5174
2017-03-03,79.131
2017-03-06,78.844
2017-03-07,79.0815
2017-03-08,79.1013
2017-03-09,78.2204
2017-03-10,78.7153
2017-03-13,84.06
2017-03-14,81.1798
2017-03-15,81.6648
2017-03-16,81.7242
2017-03-17,81.8726
2017-03-20,81.645
2017-03-21,80.675
2017-03-22,81.358
2017-03-23,82.5358
2017-03-24,82.2883
2017-03-27,82.7139
2017-03-28,83.1296
2017-03-29,82.7337
2017-03-30,83.2484
2017-03-31,82.5358
2017-04-03,82.5853
2017-04-04,82.4467
2017-04-05,82.1102
2017-04-06,82.2091
2017-04-07,82.2982
2017-04-10,82.5853
2017-04-11,82.8228
2017-04-12,82.1498
2017-04-13,82.1102
2017-04-17,82.5853
2017-04-18,82.2685
2017-04-19,82.3774
2017-04-20,82.8129
2017-04-21,82.2388
2017-04-24,83.5057
2017-04-25,83.189
2017-04-26,83.2583
2017-04-27,80.6057
2017-04-28,80.1109
2017-05-01,80.9126
2017-05-02,80.4573
2017-05-03,86.1583
2017-05-04,85.6634
2017-05-05,86.5839
2017-05-08,86.2968
2017-05-09,85.9306
2017-05-10,86.0989
2017-05-11,86.2177
2017-05-12,85.0398
2017-05-15,85.4456
2017-05-16,83.961
2017-05-17,81.8924
2017-05-18,81.744
2017-05-19,81.9419
2017-05-22,82.1003
2017-05-23,81.2194
2017-05-24,81.4569
2017-05-25,82.2982
2017-05-26,81.645
2017-05-30,81.3085
2017-05-31,81.6945
2017-06-01,82.0112
2017-06-02,82.5754
2017-06-05,82.4665
2017-06-06,82.0013
2017-06-07,82.417
2017-06-08,82.3576
2017-06-09,77.5177
2017-06-12,80.0218
2017-06-13,79.9228
2017-06-14,79.1508
2017-06-15,78.4481
2017-06-16,79.1013
2017-06-19,80.576
2017-06-20,79.5269
2017-06-21,79.8535
2017-06-22,80.3484
2017-06-23,80.576
2017-06-26,80.4375
2017-06-27,79.6358
2017-06-28,80.3979
2017-06-29,78.6955
2017-06-30,78.7648
2017-07-03,77.973
2017-07-05,78.5866
2017-07-06,77.8641
2017-07-07,78.458
2017-07-10,79.1112
2017-07-11,77.7552
2017-07-12,79.6061
2017-07-13,79.5467
2017-07-14,80.1603
2017-07-17,80.5958
2017-07-18,80.3781
2017-07-19,81.932
2017-07-20,81.7341
2017-07-21,81.0214
2017-07-24,80.7443
2017-07-25,80.9522
2017-07-26,80.6849
2017-07-27,78.9232
2017-07-28,78.8935
2017-07-31,78.1709
2017-08-01,78.7945
2017-08-02,78.2996
2017-08-03,76.716
2017-08-04,77.3593
2017-08-07,77.6662
2017-08-08,75.9638
2017-08-09,75.4392
2017-08-10,73.9051
2017-08-11,73.8457
2017-08-14,75.0631
2017-08-15,74.1822
2017-08-16,75.5184
2017-08-17,73.7566
2017-08-18,73.9447
2017-08-21,74.3208
2017-08-22,75.2314
2017-08-23,74.5187
2017-08-24,74.5781
2017-08-25,74.5979
2017-08-28,74.8256
2017-08-29,75.6372
2017-08-30,76.2013
2017-08-31,77.4088
2017-09-01,77.7156
2017-09-05,76.2013
2017-09-06,75.5679
2017-09-07,74.588
2017-09-08,74.3703
2017-09-11,75.4986
2017-09-12,75.7163
2017-09-13,76.3696
2017-09-14,75.845
2017-09-15,75.4392
2017-09-18,75.6867
2017-09-19,75.6965
2017-09-20,75.6867
2017-09-21,75.4986
2017-09-22,75.4491
2017-09-25,74.9542
2017-09-26,74.7761
2017-09-27,75.6867
2017-09-28,75.9093
2017-09-29,76.0331
2017-10-02,78.6856
2017-10-03,77.7058
2017-10-04,77.4979
2017-10-05,78.8638
2017-10-06,78.6559
2017-10-09,79.7941
2017-10-10,80.3682
2017-10-11,79.7446
2017-10-12,80.4672
2017-10-13,80.6354
2017-10-16,80.774
2017-10-17,81.1501
2017-10-18,81.4272
2017-10-19,81.8924
2017-10-20,82.6347
2017-10-23,82.2982
2017-10-24,82.3378
2017-10-25,81.5856
2017-10-26,80.3682
2017-10-27,81.8528
2017-10-30,81.546
2017-10-31,81.7638
2017-11-01,81.3876
2017-11-02,81.5163
2017-11-03,84.0303
2017-11-06,83.476
2017-11-07,83.6146
2017-11-08,85.0299
2017-11-09,83.1692
2017-11-10,83.3573
2017-11-13,83.3969
2017-11-14,84.347
2017-11-15,83.2583
2017-11-16,84.7627
2017-11-17,85.6238
2017-11-20,85.2477
2017-11-21,85.6733
2017-11-22,85.7921
2017-11-24,85.3665
2017-11-27,85.2675
2017-11-28,86.7917
2017-11-29,86.1088
2017-11-30,86.7323
2017-12-01,87.445
2017-12-04,85.8811
2017-12-05,86.3067
2017-12-06,86.4948
2017-12-07,86.277
2017-12-08,86.6927
2017-12-11,86.1286
2017-12-12,86.3265
2017-12-13,86.2572
2017-12-14,86.1583
2017-12-15,86.6334
2017-12-18,86.8709
2017-12-19,86.96
2017-12-20,87.2371
2017-12-21,87.2371
2017-12-22,86.9798
2017-12-26,87.0293
2017-12-27,87.534
2017-12-28,87.7221
2017-12-29,87.0985
2018-01-02,87.7815
2018-01-03,88.7316
2018-01-04,89.7709
2018-01-05,90.5429
2018-01-08,90.0381
2018-01-09,90.2559
2018-01-10,89.8897
2018-01-11,88.89
2018-01-12,89.1176
2018-01-16,89.0385
2018-01-17,90.2559
2018-01-18,90.4439
2018-01-19,91.7702
2018-01-22,92.8787
2018-01-23,93.047
2018-01-24,92.8193
2018-01-25,93.0371
2018-01-26,93.7299
2018-01-29,92.7204
2018-01-30,91.7405
2018-01-31,91.8098
2018-02-01,92.4729
2018-02-02,91.2456
2018-02-05,88.1576
2018-02-06,88.2071
2018-02-07,86.7026
2018-02-08,83.6641
2018-02-09,84.8716
2018-02-12,85.9009
2018-02-13,85.9801
2018-02-14,88.5238
2018-02-15,90.0579
2018-02-16,90.2757
2018-02-20,90.8398
2018-02-21,90.4439
2018-02-22,90.6716
2018-02-23,91.8593
2018-02-26,91.9978
2018-02-27,91.4238
2018-02-28,91.0576
2018-03-01,89.8798
2018-03-02,91.0378
2018-03-05,91.7603
2018-03-06,92.6808
2018-03-07,93.3934
2018-03-08,93.6012
2018-03-09,94.5316
2018-03-12,94.8978
2018-03-13,94.6207
2018-03-14,94.2842
2018-03-15,94.5019
2018-03-16,94.1555
2018-03-19,93.5616
2018-03-20,93.5814
2018-03-21,93.4825
2018-03-22,92.364
2018-03-23,90.6617
2018-03-26,92.8292
2018-03-27,91.5129
2018-03-28,90.7606
2018-03-29,91.8494
2018-04-02,90.3944
2018-04-03,90.9289
2018-04-04,91.7405
2018-04-05,91.7603
2018-04-06,90.8398
2018-04-09,91.3149
2018-04-10,92.4432
2018-04-11,92.6709
2018-04-12,93.5814
2018-04-13,93.9279
2018-04-16,94.9869
2018-04-17,96.521
2018-04-18,97.2138
2018-04-19,96.2241
2018-04-20,95.5807
2018-04-23,96.036
2018-04-24,95.6104
2018-04-25,95.5906
2018-04-26,100.1336
2018-04-27,102.2121
2018-04-30,101.8558
2018-05-01,103.6374
2018-05-02,103.3404
2018-05-03,103.7363
2018-05-04,104.152
2018-05-07,105.4882
2018-05-08,106.1909
2018-05-09,106.6759
2018-05-10,107.0817
2018-05-11,106.3691
2018-05-14,105.6466
2018-05-15,105.0527
2018-05-16,104.7954
2018-05-17,104.5677
2018-05-18,104.2609
2018-05-21,104.4787
2018-05-22,104.3302
2018-05-23,105.4585
2018-05-24,105.4684
2018-05-25,105.4585
2018-05-29,104.9043
2018-05-30,105.5179
2018-05-31,104.538
2018-06-01,105.7455
2018-06-04,106.4978
2018-06-05,107.6558
2018-06-06,108.1012
2018-06-07,107.1411
2018-06-08,106.8343
2018-06-11,106.0128
2018-06-12,105.5179
2018-06-13,104.7558
2018-06-14,105.7258
2018-06-15,105.8445
2018-06-18,106.379
2018-06-19,107.25
2018-06-20,107.5469
2018-06-21,106.0326
2018-06-22,104.4292
2018-06-25,103.3899
2018-06-26,103.6077
2018-06-27,101.549
2018-06-28,103.1128
2018-06-29,103.766
2018-07-02,105.6268
2018-07-03,105.2408
2018-07-05,104.7459
2018-07-06,105.4783
2018-07-09,105.993
2018-07-10,105.7752
2018-07-11,106.0623
2018-07-12,108.7247
2018-07-13,108.6455
2018-07-16,108.8435
2018-07-17,108.982
2018-07-18,109.5957
2018-07-19,108.5663
2018-07-20,107.1213
2018-07-23,106.9135
2018-07-24,106.4978
2018-07-25,108.121
2018-07-26,111.8523
2018-07-27,110.9022
2018-07-30,109.4175
2018-07-31,108.8435
2018-08-01,108.8435
2018-08-02,108.7049
2018-08-03,108.8138
2018-08-06,109.9817
2018-08-07,110.051
2018-08-08,110.2786
2018-08-09,110.0411
2018-08-10,110.2984
2018-08-13,109.8332
2018-08-14,110.5657
2018-08-15,110.2588
2018-08-16,110.1797
2018-08-17,109.7244
2018-08-20,110.0708
2018-08-21,110.1994
2018-08-22,110.9913
2018-08-23,110.8032
2018-08-24,111.8127
2018-08-27,111.8919
2018-08-28,112.1592
2018-08-29,113.2479
2018-08-30,112.9609
2018-08-31,112.852
2018-09-04,112.2581
2018-09-05,111.2288
2018-09-06,111.1397
2018-09-07,109.8233
2018-09-10,109.6551
2018-09-11,110.1104
2018-09-12,110.9814
2018-09-13,110.9418
2018-09-14,111.1694
2018-09-17,109.6056
2018-09-18,109.7145
2018-09-19,109.7739
2018-09-20,109.3087
2018-09-21,109.2295
2018-09-24,108.5663
2018-09-25,110.1401
2018-09-26,109.8629
2018-09-27,109.7541
2018-09-28,110.0213
2018-10-01,109.9817
2018-10-02,109.4472
2018-10-03,109.2988
2018-10-04,107.3687
2018-10-05,106.7848
2018-10-08,105.7258
2018-10-09,105.3694
2018-10-10,103.2316
2018-10-11,101.064
2018-10-12,101.4797
2018-10-15,100.866
2018-10-16,103.0732
2018-10-17,104.0432
2018-10-18,102.3606
2018-10-19,99.6684
2018-10-22,101.3609
2018-10-23,101.1531
2018-10-24,98.9063
2018-10-25,101.0046
2018-10-26,99.5794
2018-10-29,100.2722
2018-10-30,100.5097
2018-10-31,101.4203
2018-11-01,102.1032
2018-11-02,101.7073
2018-11-05,102.3606
2018-11-06,103.3107
2018-11-07,104.9438
2018-11-08,105.9633
2018-11-09,105.9138
2018-11-12,104.4688
2018-11-13,104.9339
2018-11-14,104.6865
2018-11-15,106.5472
2018-11-16,107.636
2018-11-19,105.993
2018-11-20,105.0329
2018-11-21,105.795
2018-11-23,105.5872
2018-11-26,106.6957
2018-11-27,107.4083
2018-11-28,110.2786
2018-11-29,109.3285
2018-11-30,107.8537
2018-12-03,109.1602
2018-12-04,107.7547
2018-12-06,108.5491
2018-12-07,106.6129
2018-12-10,107.7846
2018-12-11,108.4895
2018-12-12,109.5421
2018-12-13,109.4825
2018-12-14,108.3704
2018-12-17,105.8781
2018-12-18,105.7788
2018-12-19,105.2128
2018-12-20,102.4723
2018-12-21,100.0495
2018-12-24,98.7686
2018-12-26,100.685
2018-12-27,101.4297
2018-12-28,101.0822
2018-12-31,101.7375
2019-01-02,101.4893
2019-01-03,100.0296
2019-01-04,101.9162
2019-01-07,102.3233
2019-01-08,103.1177
2019-01-09,104.0809
2019-01-10,105.1036
2019-01-11,105.3915
2019-01-14,105.2525
2019-01-15,106.6625
2019-01-16,106.2951
2019-01-17,106.315
2019-01-18,107.9732
2019-01-22,107.4867
2019-01-23,107.8938
2019-01-24,101.1417
2019-01-25,101.9262
2019-01-28,101.2609
2019-01-29,100.4765
2019-01-30,100.8438
2019-01-31,101.8169
2019-02-01,103.0581
2019-02-04,104.1603
2019-02-05,105.332
2019-02-06,104.8554
2019-02-07,104.3787
2019-02-08,104.6866
2019-02-11,104.2993
2019-02-12,104.6965
2019-02-13,104.2695
2019-02-14,105.4511
2019-02-15,105.7391
2019-02-19,105.5306
2019-02-20,104.627
2019-02-21,104.2497
2019-02-22,104.4482
2019-02-25,104.7263
2019-02-26,104.6866
2019-02-27,104.617
2019-02-28,104.7561
2019-03-01,105.2923
2019-03-04,104.1802
2019-03-05,103.644
2019-03-06,102.8992
2019-03-07,102.4907
2019-03-08,99.6114
2019-03-11,99.7708
2019-03-12,99.8306
2019-03-13,100.1892
2019-03-14,101.2852
2019-03-15,100.5081
2019-03-18,101.1855
2019-03-19,100.8867
2019-03-20,100.1095
2019-03-21,101.325
2019-03-22,100.0896
2019-03-25,98.7346
2019-03-26,99.6213
2019-03-27,98.9837
2019-03-28,99.0833
2019-03-29,99.2926
2019-04-01,99.3224
2019-04-02,99.7608
2019-04-03,102.1022
2019-04-04,99.6413
2019-04-05,100.6077
2019-04-08,100.5579
2019-04-09,100.9763
2019-04-10,101.1855
2019-04-11,101.5343
2019-04-12,101.8929
2019-04-15,101.873
2019-04-16,101.3948
2019-04-17,99.8306
2019-04-18,99.7409
2019-04-22,99.4819
2019-04-23,100.5081
2019-04-24,100.0896
2019-04-25,99.1531
2019-04-26,100.6077
2019-04-29,100.4483
2019-04-30,100.5878
2019-05-01,100.4084
2019-05-02,98.8841
2019-05-03,98.7844
2019-05-06,98.0173
2019-05-07,97.1804
2019-05-08,97.1804
2019-05-09,96.5128
2019-05-10,96.8317
2019-05-13,94.9984
2019-05-14,95.4667
2019-05-15,95.6859
2019-05-16,96.2239
2019-05-17,95.4468
2019-05-20,94.7195
2019-05-21,95.3073
2019-05-22,95.7756
2019-05-23,94.839
2019-05-24,94.301
2019-05-28,94.6398
2019-05-29,94.042
2019-05-30,94.3907
2019-05-31,93.773
2019-06-03,93.1353
2019-06-04,94.0121
2019-06-05,94.58
2019-06-06,95.36
2019-06-07,95.86
2019-06-10,95.98
2019-06-11,95.84
2019-06-12,96.54
2019-06-13,96.82
2019-06-14,96.88
2019-06-17,97.07
2019-06-18,97.81
2019-06-19,98.745
2019-06-20,99.395
2019-06-21,99.715
2019-06-24,99.595
2019-06-25,98.36
2019-06-26,97.53
2019-06-27,97.63
2019-06-28,98.14
2019-07-01,98.37
2019-07-02,99.065
2019-07-03,99.72
2019-07-04,99.72
2019-07-05,99.625
2019-07-08,98.64
2019-07-09,98.82
2019-07-10,99.62
2019-07-11,99.52
2019-07-12,100.99
2019-07-15,101.625
2019-07-16,100.975
2019-07-17,100.55
2019-07-18,101.68
2019-07-19,101.2
2019-07-22,101.68
2019-07-23,100.875
2019-07-24,100.735
2019-07-25,95.055
2019-07-26,95.495
2019-07-29,95.315
2019-07-30,95.095
2019-07-31,94.47
2019-08-01,94.43
2019-08-02,93.565
2019-08-05,92.165
2019-08-06,91.615
2019-08-07,91.53
2019-08-08,92.24
2019-08-09,92.02
2019-08-12,91.265
2019-08-13,92.21
2019-08-14,91.31
2019-08-15,91.56
2019-08-16,92.41
2019-08-19,92.58
2019-08-20,92.01
2019-08-21,92.8
2019-08-22,93.01
2019-08-23,91.54
2019-08-26,92.095
2019-08-27,92.47
2019-08-28,92.12
2019-08-29,92.7
2019-08-30,93.01
2019-09-02,92.98
2019-09-03,92.8
2019-09-04,93.13
2019-09-05,94.45
2019-09-06,94.41
2019-09-09,95.065
2019-09-10,95.695
2019-09-11,96.44
2019-09-12,96.57
2019-09-13,95.915
2019-09-16,96.65
2019-09-17,95.665
2019-09-18,96.73
2019-09-19,96.45
2019-09-20,97.095
2019-09-23,96.41
2019-09-24,95.11
2019-09-25,95.965
2019-09-26,95.685
2019-09-27,95.76
2019-09-30,96.5
2019-10-01,96.095
2019-10-02,95.26
2019-10-03,95.65
2019-10-04,96.45
2019-10-07,96.87
2019-10-08,95.8
2019-10-09,96.575
2019-10-10,97
2019-10-11,98.29
2019-10-14,98.305
2019-10-15,99.61
2019-10-16,99.845
2019-10-17,100.715
2019-10-18,101.545
2019-10-21,103.195
2019-10-22,104.135
2019-10-23,103.7
2019-10-24,107.845
2019-10-25,105.615
2019-10-28,106.905
2019-10-29,107.29
2019-10-30,108.745
2019-10-31,108.82
2019-11-01,109.45
2019-11-04,109.345
2019-11-05,108.87
2019-11-06,109.65
2019-11-07,110.04
2019-11-08,110.745
2019-11-11,111.325
2019-11-12,111.5
2019-11-13,112
2019-11-14,111.395
2019-11-15,112.62
2019-11-18,112.56
2019-11-19,113.43
2019-11-20,112.92
2019-11-21,113.265
2019-11-22,113.865
2019-11-25,114.13
