date,close
2014-06-13,40.2221
2014-06-16,40.5987
2014-06-17,40.6388
2014-06-18,40.182
2014-06-19,40.759
2014-06-20,40.5586
2014-06-23,41.1517
2014-06-24,41.2639
2014-06-25,41.4722
2014-06-26,41.5123
2014-06-27,41.7287
2014-06-30,41.9771
2014-07-01,42.1294
2014-07-02,41.8649
2014-07-03,41.6005
2014-07-07,41.0795
2014-07-08,40.8632
2014-07-09,41.3921
2014-07-10,41.1677
2014-07-11,41.312
2014-07-14,41.32
2014-07-15,41.2719
2014-07-16,41.6005
2014-07-17,41.5764
2014-07-18,41.6726
2014-07-21,41.7607
2014-07-22,42.0492
2014-07-23,42.1454
2014-07-24,41.9611
2014-07-25,41.8409
2014-07-28,41.8329
2014-07-29,41.6806
2014-07-30,41.1998
2014-07-31,40.3903
2014-08-01,40.0618
2014-08-04,40.9193
2014-08-05,40.214
2014-08-06,40.0938
2014-08-07,40.1419
2014-08-08,40.3663
2014-08-11,41.8168
2014-08-12,41.4722
2014-08-13,41.8809
2014-08-14,42.2336
2014-08-15,42.4259
2014-08-18,42.4259
2014-08-19,42.6503
2014-08-20,42.9548
2014-08-21,42.8907
2014-08-22,42.6823
2014-08-25,42.5461
2014-08-26,43.116
2014-08-27,43.3591
2014-08-28,43.3996
2014-08-29,43.6994
2014-09-02,43.5211
2014-09-03,43.4968
2014-09-04,43.2132
2014-09-05,43.3429
2014-09-08,43.4158
2014-09-09,43.5373
2014-09-10,43.4482
2014-09-11,43.3834
2014-09-12,42.5812
2014-09-15,42.4515
2014-09-16,42.8405
2014-09-17,43.0512
2014-09-18,43.2943
2014-09-19,43.6184
2014-09-22,43.0674
2014-09-23,42.4272
2014-09-24,42.5083
2014-09-25,42.1112
2014-09-26,42.6136
2014-09-29,42.8324
2014-09-30,43.0106
2014-10-01,42.3381
2014-10-02,42.5164
2014-10-03,42.5002
2014-10-06,42.1922
2014-10-07,41.7628
2014-10-08,41.4063
2014-10-09,40.1098
2014-10-10,39.4696
2014-10-13,37.5006
2014-10-14,37.0468
2014-10-15,38.5783
2014-10-16,40.3772
2014-10-17,40.3772
2014-10-20,40.7418
2014-10-21,41.2766
2014-10-22,40.7904
2014-10-23,41.3009
2014-10-24,41.4873
2014-10-27,41.1227
2014-10-28,41.4306
2014-10-29,41.4225
2014-10-30,40.839
2014-10-31,41.0497
2014-11-03,41.2685
2014-11-04,40.1746
2014-11-05,40.6608
2014-11-06,40.5068
2014-11-07,41.3657
2014-11-10,40.9849
2014-11-11,40.9687
2014-11-12,40.9849
2014-11-13,40.523
2014-11-14,41.0902
2014-11-17,41.5359
2014-11-18,41.7628
2014-11-19,42.1598
2014-11-20,42.4596
2014-11-21,42.3786
2014-11-24,41.9167
2014-11-25,41.698
2014-11-26,42.0817
2014-11-28,39.9419
2014-12-01,38.1629
2014-12-02,39.1467
2014-12-03,39.9173
2014-12-04,39.9173
2014-12-05,39.2615
2014-12-08,37.2119
2014-12-09,37.671
2014-12-10,36.3019
2014-12-11,36.1871
2014-12-12,35.4821
2014-12-15,34.5229
2014-12-16,35.3673
2014-12-17,37.0807
2014-12-18,37.1627
2014-12-19,37.4332
2014-12-22,37.2939
2014-12-23,37.7202
2014-12-24,37.6956
2014-12-26,37.671
2014-12-29,38.0153
2014-12-30,37.9743
2014-12-31,37.671
2015-01-02,38.4662
2015-01-05,36.72
2015-01-06,35.9822
2015-01-07,36.0149
2015-01-08,36.4822
2015-01-09,36.3757
2015-01-12,34.9902
2015-01-13,34.2687
2015-01-14,34.4983
2015-01-15,34.7278
2015-01-16,35.9903
2015-01-20,35.9903
2015-01-21,36.9905
2015-01-22,36.9085
2015-01-23,36.9659
2015-01-26,37.0397
2015-01-27,36.9413
2015-01-28,36.1132
2015-01-29,36.2691
2015-01-30,36.4003
2015-02-02,37.0151
2015-02-03,37.5316
2015-02-04,37.2037
2015-02-05,37.9579
2015-02-06,37.8514
2015-02-09,37.3759
2015-02-10,37.3185
2015-02-11,36.6626
2015-02-12,37.2283
2015-02-13,37.5234
2015-02-17,37.63
2015-02-18,37.3677
2015-02-19,37.3021
2015-02-20,37.7038
2015-02-23,37.2447
2015-02-24,37.3021
2015-02-25,37.5644
2015-02-26,36.8155
2015-02-27,37.0397
2015-03-02,36.6494
2015-03-03,36.9151
2015-03-04,36.7573
2015-03-05,36.8902
2015-03-06,36.2923
2015-03-09,35.5947
2015-03-10,35.7192
2015-03-11,35.0631
2015-03-12,34.922
2015-03-13,34.7143
2015-03-16,34.4984
2015-03-17,34.5566
2015-03-18,35.3538
2015-03-19,35.0382
2015-03-20,35.2459
2015-03-23,35.8853
2015-03-24,35.3787
2015-03-25,35.495
2015-03-26,35.5365
2015-03-27,35.3206
2015-03-30,35.7441
2015-03-31,35.5448
2015-04-01,35.5697
2015-04-02,35.7691
2015-04-06,35.9352
2015-04-07,36.068
2015-04-08,36.0016
2015-04-09,36.1345
2015-04-10,36.3338
2015-04-13,36.176
2015-04-14,36.5746
2015-04-15,36.94
2015-04-16,37.0314
2015-04-17,36.7075
2015-04-20,36.8487
2015-04-21,36.7324
2015-04-22,36.6494
2015-04-23,36.9567
2015-04-24,37.1394
2015-04-27,37.0314
2015-04-28,37.0895
2015-04-29,37.4799
2015-04-30,37.7041
2015-05-01,37.9458
2015-05-04,37.6958
2015-05-05,37.7539
2015-05-06,37.3553
2015-05-07,36.7075
2015-05-08,36.9317
2015-05-11,36.666
2015-05-12,36.8487
2015-05-13,37.3304
2015-05-14,37.538
2015-05-15,37.4217
2015-05-18,37.6958
2015-05-19,37.4051
2015-05-20,37.2307
2015-05-21,37.2805
2015-05-22,37.3802
2015-05-26,36.9899
2015-05-27,36.933
2015-05-28,36.5125
2015-05-29,36.3947
2015-06-01,36.277
2015-06-02,36.4284
2015-06-03,35.7975
2015-06-04,35.1751
2015-06-05,35.4611
2015-06-08,35.1751
2015-06-09,35.1751
2015-06-10,35.091
2015-06-11,35.0405
2015-06-12,35.0489
2015-06-15,35.4443
2015-06-16,35.377
2015-06-17,35.3433
2015-06-18,35.3517
2015-06-19,34.7798
2015-06-22,34.9144
2015-06-23,34.9228
2015-06-24,34.7966
2015-06-25,34.3676
2015-06-26,34.1321
2015-06-29,33.5265
2015-06-30,33.3079
2015-07-01,32.8116
2015-07-02,33.3415
2015-07-06,33.0135
2015-07-07,33.7284
2015-07-08,33.0976
2015-07-09,33.1312
2015-07-10,33.6611
2015-07-13,33.9303
2015-07-14,34.1574
2015-07-15,33.5265
2015-07-16,33.1312
2015-07-17,32.6602
2015-07-20,31.8696
2015-07-21,31.7854
2015-07-22,30.9443
2015-07-23,30.9612
2015-07-24,31.2556
2015-07-27,31.5079
2015-07-28,32.3153
2015-07-29,33.0219
2015-07-30,32.5509
2015-07-31,32.2144
2015-08-03,31.4826
2015-08-04,31.1294
2015-08-05,29.5649
2015-08-06,29.3883
2015-08-07,29.4472
2015-08-10,30.3808
2015-08-11,30.3051
2015-08-12,31.0621
2015-08-13,30.6079
2015-08-14,30.835
2015-08-17,31.3733
2015-08-18,31.1294
2015-08-19,30.5827
2015-08-20,30.078
2015-08-21,29.2453
2015-08-24,28.3369
2015-08-25,28.421
2015-08-26,29.1074
2015-08-27,30.3737
2015-08-28,30.7929
2015-08-31,30.6389
2015-09-01,29.9972
2015-09-02,30.2282
2015-09-03,30.1512
2015-09-04,29.9459
2015-09-08,30.04
2015-09-09,29.5608
2015-09-10,29.5352
2015-09-11,28.671
2015-09-14,28.4315
2015-09-15,28.3716
2015-09-16,28.671
2015-09-17,28.8593
2015-09-18,28.6454
2015-09-21,28.8336
2015-09-22,28.2774
2015-09-23,27.2593
2015-09-24,26.9427
2015-09-25,26.8999
2015-09-28,25.3513
2015-09-29,23.9054
2015-09-30,26.0016
2015-10-01,27.0454
2015-10-02,27.9267
2015-10-05,28.9106
2015-10-06,28.7309
2015-10-07,29.3042
2015-10-08,29.5694
2015-10-09,29.6721
2015-10-12,29.1502
2015-10-13,28.671
2015-10-14,28.7994
2015-10-15,29.2443
2015-10-16,29.5009
2015-10-19,29.0304
2015-10-20,29.0047
2015-10-21,28.4657
2015-10-22,27.7726
2015-10-23,27.6101
2015-10-26,27.0197
2015-10-27,26.5834
2015-10-28,27.6358
2015-10-29,28.209
2015-10-30,28.4058
2015-11-02,28.7823
2015-11-03,29.6977
2015-11-04,28.8507
2015-11-05,28.5256
2015-11-06,28.1234
2015-11-09,27.8069
2015-11-10,27.7898
2015-11-11,27.3021
2015-11-12,26.532
2015-11-13,26.5748
2015-11-16,27.4732
2015-11-17,27.1224
2015-11-18,27.2678
2015-11-19,26.8486
2015-11-20,26.2069
2015-11-23,26.0871
2015-11-24,26.4208
2015-11-25,26.3374
2015-11-27,26.2589
2015-11-30,26.1724
2015-12-01,25.7969
2015-12-02,25.0471
2015-12-03,24.1927
2015-12-04,23.443
2015-12-07,21.987
2015-12-08,22.4665
2015-12-09,24.1579
2015-12-10,23.5127
2015-12-11,22.144
2015-12-14,21.4988
2015-12-15,21.8301
2015-12-16,22.6932
2015-12-17,21.9958
2015-12-18,22.2224
2015-12-21,22.9896
2015-12-22,23.9399
2015-12-23,25.3435
2015-12-24,25.2563
2015-12-28,24.6897
2015-12-29,24.5502
2015-12-30,24.2886
2015-12-31,25.2563
2016-01-04,25.5876
2016-01-05,25.4743
2016-01-06,24.2189
2016-01-07,23.0245
2016-01-08,23.2948
2016-01-11,22.0917
2016-01-12,22.1091
2016-01-13,20.7927
2016-01-14,22.0132
2016-01-15,21.0106
2016-01-19,19.7639
2016-01-20,18.587
2016-01-21,19.4937
2016-01-22,21.1152
2016-01-25,20.505
2016-01-26,21.307
2016-01-27,21.1937
2016-01-28,22.1353
2016-01-29,22.3706
2016-02-01,22.0045
2016-02-02,21.5686
2016-02-03,21.6209
2016-02-04,22.0045
2016-02-05,21.3855
2016-02-08,19.6593
2016-02-09,18.9008
2016-02-10,19.0403
2016-02-11,18.2034
2016-02-12,19.2234
2016-02-16,20.4352
2016-02-17,21.4901
2016-02-18,21.6035
2016-02-19,21.2111
2016-02-22,22.2573
2016-02-23,21.4814
2016-02-24,21.9173
2016-02-25,21.7619
2016-02-26,21.9935
2016-02-29,22.2696
2016-03-01,22.332
2016-03-02,23.0446
2016-03-03,23.6592
2016-03-04,23.588
2016-03-07,24.4342
2016-03-08,22.8753
2016-03-09,23.098
2016-03-10,22.8397
2016-03-11,23.3564
2016-03-14,23.2673
2016-03-15,23.0446
2016-03-16,24.0779
2016-03-17,24.5946
2016-03-18,24.4966
2016-03-21,23.8908
2016-03-22,24.2561
2016-03-23,23.392
2016-03-24,23.3386
2016-03-28,23.0891
2016-03-29,23.2406
2016-03-30,23.6949
2016-03-31,24.1314
2016-04-01,23.4989
2016-04-04,23.0446
2016-04-05,22.7595
2016-04-06,23.392
2016-04-07,23.4187
2016-04-08,23.9888
2016-04-11,23.9354
2016-04-12,24.8083
2016-04-13,24.7994
2016-04-14,24.6391
2016-04-15,24.2115
2016-04-18,24.8885
2016-04-19,25.8238
2016-04-20,26.296
2016-04-21,26.3494
2016-04-22,26.6701
2016-04-25,26.3494
2016-04-26,26.3227
2016-04-27,26.7414
2016-04-28,26.385
2016-04-29,26.7592
2016-05-02,26.4385
2016-05-03,25.8684
2016-05-04,26.0554
2016-05-05,26.4029
2016-05-06,26.3583
2016-05-09,25.9931
2016-05-10,26.0911
2016-05-11,26.3405
2016-05-12,26.6523
2016-05-13,26.5097
2016-05-16,27.1957
2016-05-17,27.4005
2016-05-18,26.8126
2016-05-19,27.2669
2016-05-20,27.6321
2016-05-23,27.5342
2016-05-24,27.2828
2016-05-25,27.582
2016-05-26,27.3282
2016-05-27,27.31
2016-05-31,27.3916
2016-06-01,27.981
2016-06-02,28.1623
2016-06-03,28.0898
2016-06-06,28.7336
2016-06-07,28.9512
2016-06-08,28.8152
2016-06-09,28.7426
2016-06-10,28.0814
2016-06-13,27.7543
2016-06-14,27.4914
2016-06-15,27.7362
2016-06-16,27.7452
2016-06-17,27.8994
2016-06-20,28.1442
2016-06-21,28.6247
2016-06-22,28.6066
2016-06-23,29.2413
2016-06-24,28.2439
2016-06-27,27.3191
2016-06-28,28.3074
2016-06-29,28.7517
2016-06-30,28.8424
2016-07-01,28.5975
2016-07-05,28.389
2016-07-06,28.2983
2016-07-07,28.2983
2016-07-08,28.5885
2016-07-11,28.5159
2016-07-12,29.3773
2016-07-13,29.0418
2016-07-14,29.2322
2016-07-15,29.0872
2016-07-18,29.2141
2016-07-19,29.1416
2016-07-20,29.341
2016-07-21,29.1506
2016-07-22,29.2866
2016-07-25,29.0146
2016-07-26,28.8514
2016-07-27,28.6157
2016-07-28,28.6066
2016-07-29,28.933
2016-08-01,28.0173
2016-08-02,28.0445
2016-08-03,28.797
2016-08-04,28.6429
2016-08-05,28.8696
2016-08-08,29.1597
2016-08-09,28.9784
2016-08-10,28.6519
2016-08-11,28.8061
2016-08-12,29.06
2016-08-15,29.1144
2016-08-16,29.1325
2016-08-17,29.0781
2016-08-18,29.341
2016-08-19,29.0418
2016-08-22,28.7698
2016-08-23,28.7657
2016-08-24,28.5169
2016-08-25,28.5537
2016-08-26,28.609
2016-08-29,28.7196
2016-08-30,28.6459
2016-08-31,28.563
2016-09-01,28.5169
2016-09-02,28.8947
2016-09-06,29.0882
2016-09-07,29.1526
2016-09-08,29.3369
2016-09-09,28.563
2016-09-12,28.5722
2016-09-13,27.6047
2016-09-14,27.6231
2016-09-15,27.4849
2016-09-16,27.5955
2016-09-19,27.9456
2016-09-20,27.7798
2016-09-21,28.4985
2016-09-22,28.9499
2016-09-23,28.8117
2016-09-26,28.7104
2016-09-27,28.4524
2016-09-28,29.0882
2016-09-29,28.8486
2016-09-30,29.0237
2016-10-03,28.7749
2016-10-04,28.3603
2016-10-05,28.5445
2016-10-06,28.3418
2016-10-07,28.2681
2016-10-10,28.8209
2016-10-11,28.6275
2016-10-12,28.609
2016-10-13,28.5906
2016-10-14,28.4616
2016-10-17,28.4985
2016-10-18,28.7749
2016-10-19,28.996
2016-10-20,28.996
2016-10-21,28.867
2016-10-24,28.8762
2016-10-25,28.4524
2016-10-26,28.4616
2016-10-27,28.3418
2016-10-28,28.047
2016-10-31,27.7706
2016-11-01,27.4757
2016-11-02,27.1901
2016-11-03,27.0519
2016-11-04,26.7663
2016-11-07,26.9874
2016-11-08,26.9597
2016-11-09,27.7429
2016-11-10,28.0378
2016-11-11,27.7245
2016-11-14,28.0378
2016-11-15,28.3603
2016-11-16,27.9088
2016-11-17,28.0009
2016-11-18,28.305
2016-11-21,28.4985
2016-11-22,28.3418
2016-11-23,28.4248
2016-11-25,28.1899
2016-11-28,27.6467
2016-11-29,27.4032
2016-11-30,28.3023
2016-12-01,27.7684
2016-12-02,27.8996
2016-12-05,27.8621
2016-12-06,27.8527
2016-12-07,27.9932
2016-12-08,28.2273
2016-12-09,28.1992
2016-12-12,28.1431
2016-12-13,28.3772
2016-12-14,27.9277
2016-12-15,28.2742
2016-12-16,28.5458
2016-12-19,28.5551
2016-12-20,28.7424
2016-12-21,29.1452
2016-12-22,29.5198
2016-12-23,29.7071
2016-12-27,29.7258
2016-12-28,29.501
2016-12-29,29.4168
2016-12-30,29.6041
2017-01-03,29.7258
2017-01-04,29.9506
2017-01-05,30.0911
2017-01-06,30.2971
2017-01-09,29.9787
2017-01-10,29.5385
2017-01-11,29.8663
2017-01-12,29.7352
2017-01-13,29.9038
2017-01-17,30.1285
2017-01-18,29.9693
2017-01-19,29.8007
2017-01-20,29.9506
2017-01-23,29.9318
2017-01-24,30.653
2017-01-25,31.2898
2017-01-26,31.73
2017-01-27,31.6176
2017-01-30,30.8497
2017-01-31,31.0089
2017-02-01,31.449
2017-02-02,31.5895
2017-02-03,31.8705
2017-02-06,31.8611
2017-02-07,31.6176
2017-02-08,31.5802
2017-02-09,31.7394
2017-02-10,31.8049
2017-02-13,31.7956
2017-02-14,32.0484
2017-02-15,32.011
2017-02-16,31.8049
2017-02-17,31.6738
2017-02-21,31.8611
2017-02-22,31.421
2017-02-23,31.3179
2017-02-24,31.0089
2017-02-27,30.8764
2017-02-28,31.1233
2017-03-01,31.4557
2017-03-02,31.3702
2017-03-03,31.3418
2017-03-06,31.3797
2017-03-07,31.2658
2017-03-08,30.6674
2017-03-09,30.411
2017-03-10,30.4015
2017-03-13,30.43
2017-03-14,30.0786
2017-03-15,30.4965
2017-03-16,30.4015
2017-03-17,30.1736
2017-03-20,30.1437
2017-03-21,29.8981
2017-03-22,29.7937
2017-03-23,29.8981
2017-03-24,30.0216
2017-03-27,29.8506
2017-03-28,29.9171
2017-03-29,30.3635
2017-03-30,30.2875
2017-03-31,30.6769
2017-04-03,30.6484
2017-04-04,30.8004
2017-04-05,30.5535
2017-04-06,31.0283
2017-04-07,30.9144
2017-04-10,30.8954
2017-04-11,30.6959
2017-04-12,30.582
2017-04-13,30.3255
2017-04-17,30.316
2017-04-18,30.4015
2017-04-19,30.1831
2017-04-20,30.24
2017-04-21,30.24
2017-04-24,30.373
2017-04-25,30.6959
2017-04-26,30.5155
2017-04-27,30.2115
2017-04-28,30.2495
2017-05-01,30.335
2017-05-02,30.1736
2017-05-03,29.8411
2017-05-04,29.0624
2017-05-05,29.6037
2017-05-08,29.7367
2017-05-09,29.4612
2017-05-10,29.9551
2017-05-11,29.7177
2017-05-12,29.7937
2017-05-15,30.0121
2017-05-16,29.8696
2017-05-17,29.3093
2017-05-18,29.3283
2017-05-19,29.8316
2017-05-22,30.0026
2017-05-23,30.1831
2017-05-24,29.9937
2017-05-25,29.6174
2017-05-26,29.4824
2017-05-30,29.0289
2017-05-31,28.8553
2017-06-01,29.0675
2017-06-02,28.7974
2017-06-05,28.8456
2017-06-06,29
2017-06-07,28.4212
2017-06-08,28.2861
2017-06-09,28.4405
2017-06-12,28.3729
2017-06-13,28.3633
2017-06-14,27.823
2017-06-15,27.4371
2017-06-16,27.852
2017-06-19,27.5432
2017-06-20,26.839
2017-06-21,26.6653
2017-06-22,26.9355
2017-06-23,27.5336
2017-06-26,27.9484
2017-06-27,27.7844
2017-06-28,28.2282
2017-06-29,28.4115
2017-06-30,28.6527
2017-07-03,29.1061
2017-07-05,28.7202
2017-07-06,28.6045
2017-07-07,28.6816
2017-07-10,28.4308
2017-07-11,28.4887
2017-07-12,28.7685
2017-07-13,28.7299
2017-07-14,29.1061
2017-07-17,29.1544
2017-07-18,29.2315
2017-07-19,29.2412
2017-07-20,28.9325
2017-07-21,28.6816
2017-07-24,28.8167
2017-07-25,29.0096
2017-07-26,28.9518
2017-07-27,28.9035
2017-07-28,28.8939
2017-07-31,28.9807
2017-08-01,28.5273
2017-08-02,29.1158
2017-08-03,28.7106
2017-08-04,28.5273
2017-08-07,28.3633
2017-08-08,27.5529
2017-08-09,27.7941
2017-08-10,27.5432
2017-08-11,27.3599
2017-08-14,27.3021
2017-08-15,26.6846
2017-08-16,26.5496
2017-08-17,26.4724
2017-08-18,26.4627
2017-08-21,26.154
2017-08-22,26.5399
2017-08-23,26.8776
2017-08-24,26.8904
2017-08-25,26.9885
2017-08-28,26.7824
2017-08-29,26.8707
2017-08-30,27.0769
2017-08-31,27.6463
2017-09-01,27.6954
2017-09-05,27.4401
2017-09-06,27.607
2017-09-07,27.6169
2017-09-08,27.4303
2017-09-11,27.5874
2017-09-12,27.6169
2017-09-13,27.8525
2017-09-14,27.8917
2017-09-15,27.7936
2017-09-18,27.8034
2017-09-19,27.6561
2017-09-20,27.5972
2017-09-21,27.391
2017-09-22,27.4107
2017-09-25,27.9703
2017-09-26,27.931
2017-09-27,27.8034
2017-09-28,27.6659
2017-09-29,27.7052
2017-10-02,27.823
2017-10-03,27.9114
2017-10-04,27.9212
2017-10-05,28.1765
2017-10-06,28.1568
2017-10-09,27.9506
2017-10-10,27.9899
2017-10-11,28.1175
2017-10-12,27.9408
2017-10-13,27.6365
2017-10-16,27.4794
2017-10-17,27.2929
2017-10-18,26.8511
2017-10-19,26.9689
2017-10-20,26.7922
2017-10-23,26.3798
2017-10-24,26.2817
2017-10-25,25.5944
2017-10-26,26.0362
2017-10-27,26.4486
2017-10-30,26.5958
2017-10-31,26.5664
2017-11-01,26.9885
2017-11-02,26.4682
2017-11-03,26.694
2017-11-06,27.0769
2017-11-07,27.2732
2017-11-08,26.8904
2017-11-09,26.7824
2017-11-10,26.6842
2017-11-13,26.2522
2017-11-14,25.8104
2017-11-15,25.997
2017-11-16,25.9773
2017-11-17,26.0166
2017-11-20,26.0853
2017-11-21,25.7024
2017-11-22,25.9086
2017-11-24,25.8595
2017-11-27,25.5159
2017-11-28,25.38
2017-11-29,25.19
2017-11-30,26.24
2017-12-01,26.62
2017-12-04,26.47
2017-12-05,26.36
2017-12-06,25.92
2017-12-07,26.38
2017-12-08,26.42
2017-12-11,26.94
2017-12-12,27.17
2017-12-13,27.29
2017-12-14,27.44
2017-12-15,27.24
2017-12-18,27.53
2017-12-19,27.16
2017-12-20,27.05
2017-12-21,27.15
2017-12-22,27.35
2017-12-26,27.5
2017-12-27,27.39
2017-12-28,27.51
2017-12-29,27.47
2018-01-02,28.06
2018-01-03,28.75
2018-01-04,28.94
2018-01-05,28.67
2018-01-08,28.85
2018-01-09,28.98
2018-01-10,29.15
2018-01-11,29.74
2018-01-12,30.01
2018-01-16,29.79
2018-01-17,29.69
2018-01-18,29.36
2018-01-19,29.74
2018-01-22,30.34
2018-01-23,30.57
2018-01-24,30.16
2018-01-25,30.24
2018-01-26,30.49
2018-01-29,29.75
2018-01-30,29.28
2018-01-31,29.35
2018-02-01,29.33
2018-02-02,28.43
2018-02-05,27.92
2018-02-06,28.55
2018-02-07,28.46
2018-02-08,27.55
2018-02-09,27.33
2018-02-12,27.8
2018-02-13,28.11
2018-02-14,28.02
2018-02-15,27.75
2018-02-16,27.39
2018-02-20,27.38
2018-02-21,27.08
2018-02-22,26.8
2018-02-23,26.95
2018-02-26,27
2018-02-27,26.79
2018-02-28,25.83
2018-03-01,25.89
2018-03-02,25.86
2018-03-05,26.09
2018-03-06,25.97
2018-03-07,25.72
2018-03-08,25.64
2018-03-09,26.09
2018-03-12,26.54
2018-03-13,26.52
2018-03-14,26.15
2018-03-15,24.85
2018-03-16,25.26
2018-03-19,24.37
2018-03-20,24.2
2018-03-21,24.54
2018-03-22,24.02
2018-03-23,23.92
2018-03-26,24
2018-03-27,23.64
2018-03-28,23.64
2018-03-29,24
2018-04-02,23.79
2018-04-03,24.03
2018-04-04,23.95
2018-04-05,24.36
2018-04-06,24.01
2018-04-09,23.98
2018-04-10,24.7
2018-04-11,24.99
2018-04-12,24.81
2018-04-13,24.85
2018-04-16,25.81
2018-04-17,26.61
2018-04-18,26.01
2018-04-19,25.75
2018-04-20,25.75
2018-04-23,26.22
2018-04-24,25.66
2018-04-25,25.86
2018-04-26,25.81
2018-04-27,25.92
2018-04-30,25.96
2018-05-01,26.04
2018-05-02,25.81
2018-05-03,25.51
2018-05-04,25.84
2018-05-07,25.99
2018-05-08,26.24
2018-05-09,26.43
2018-05-10,26.52
2018-05-11,26.44
2018-05-14,26.91
2018-05-15,26.85
2018-05-16,27.03
2018-05-17,27.33
2018-05-18,27.25
2018-05-21,27.44
2018-05-22,27.43
2018-05-23,27.3
2018-05-24,26.83
2018-05-25,26.21
2018-05-29,26.26
2018-05-30,26.71
2018-05-31,27.15
2018-06-01,26.88
2018-06-04,27.09
2018-06-05,27.1
2018-06-06,26.96
2018-06-07,27.21
2018-06-08,26.95
2018-06-11,27.37
2018-06-12,27.39
2018-06-13,26.92
2018-06-14,26.86
2018-06-15,26.26
2018-06-18,26.57
2018-06-19,26.43
2018-06-20,26.63
2018-06-21,26
2018-06-22,26.64
2018-06-25,26.01
2018-06-26,26.46
2018-06-27,26.13
2018-06-28,26.05
2018-06-29,26.58
2018-07-02,26.01
2018-07-03,26.17
2018-07-05,26.21
2018-07-06,26.38
2018-07-09,26.45
2018-07-10,26.43
2018-07-11,26.2
2018-07-12,26.5
2018-07-13,26.59
2018-07-16,26.46
2018-07-17,26.3
2018-07-18,26.64
2018-07-19,27.36
2018-07-20,27.07
2018-07-23,27.22
2018-07-24,27.32
2018-07-25,27.94
2018-07-26,28.08
2018-07-27,27.5
2018-07-30,27.82
2018-07-31,27.99
2018-08-01,28.08
2018-08-02,28.76
2018-08-03,28.95
2018-08-06,29.12
2018-08-07,28.98
2018-08-08,29.2
2018-08-09,29.28
2018-08-10,29.48
2018-08-13,28.98
2018-08-14,29.12
2018-08-15,28.65
2018-08-16,28.86
2018-08-17,29.23
2018-08-20,29.51
2018-08-21,29.23
2018-08-22,29.52
2018-08-23,29.54
2018-08-24,29.41
2018-08-27,28.81
2018-08-28,28.44
2018-08-29,28.18
2018-08-30,28.03
2018-08-31,27.87
2018-09-04,28.11
2018-09-05,28.22
2018-09-06,27.92
2018-09-07,27.86
2018-09-10,27.96
2018-09-11,28.23
2018-09-12,28.28
2018-09-13,28.08
2018-09-14,27.97
2018-09-17,27.84
2018-09-18,27.91
2018-09-19,27.76
2018-09-20,27.85
2018-09-21,27.84
2018-09-24,27.51
2018-09-25,27.33
2018-09-26,27.06
2018-09-27,27.23
2018-09-28,27.46
2018-10-01,28.05
2018-10-02,27.92
2018-10-03,28.12
2018-10-04,27.91
2018-10-05,27.95
2018-10-08,27.84
2018-10-09,28.14
2018-10-10,27.62
2018-10-11,27.12
2018-10-12,27.06
2018-10-15,27.02
2018-10-16,27.57
2018-10-17,27.19
2018-10-18,27.03
2018-10-19,27.15
2018-10-22,26.89
2018-10-23,26.52
2018-10-24,25.7
2018-10-25,25.8
2018-10-26,25.4
2018-10-29,25.29
2018-10-30,25.1
2018-10-31,24.99
2018-11-01,25.53
2018-11-02,25.27
2018-11-05,25.74
2018-11-06,25.85
2018-11-07,26.19
2018-11-08,26.21
2018-11-09,25.96
2018-11-12,25.58
2018-11-13,25.16
2018-11-14,25.08
2018-11-15,25.37
2018-11-16,25.46
2018-11-19,25.31
2018-11-20,24.71
2018-11-21,25.17
2018-11-23,24.69
2018-11-26,24.82
2018-11-27,24.7
2018-11-28,24.48
2018-11-29,24.8
2018-11-30,24.57
2018-12-03,25.24
2018-12-04,24.55
2018-12-06,24.36
2018-12-07,24.29
2018-12-10,23.9
2018-12-11,23.94
2018-12-12,24.08
2018-12-13,24.54
2018-12-14,24.3
2018-12-17,23.51
2018-12-18,22.95
2018-12-19,23.13
2018-12-20,22.55
2018-12-21,22.17
2018-12-24,21.22
2018-12-26,22.38
2018-12-27,22.01
2018-12-28,21.95
2018-12-31,22.32
2019-01-02,22.57
2019-01-03,22.82
2019-01-04,23.86
2019-01-07,24.31
2019-01-08,24.89
2019-01-09,25.11
2019-01-10,24.77
2019-01-11,24.46
2019-01-14,24.21
2019-01-15,24.66
2019-01-16,24.68
2019-01-17,24.7
2019-01-18,25.01
2019-01-22,24.36
2019-01-23,24.43
2019-01-24,24.53
2019-01-25,24.72
2019-01-28,24.64
2019-01-29,24.94
2019-01-30,25.31
2019-01-31,25.01
2019-02-01,25.28
2019-02-04,25.44
2019-02-05,25.41
2019-02-06,25.12
2019-02-07,24.56
2019-02-08,24.45
2019-02-11,24.48
2019-02-12,24.95
2019-02-13,25.22
2019-02-14,25.52
2019-02-15,25.62
2019-02-19,26.11
2019-02-20,25.85
2019-02-21,25.53
2019-02-22,25.55
2019-02-25,25.64
2019-02-26,25.31
2019-02-27,25.29
2019-02-28,24.64
2019-03-01,24.81
2019-03-04,24.87
2019-03-05,24.77
2019-03-06,24.56
2019-03-07,24.96
2019-03-08,24.78
2019-03-11,25.15
2019-03-12,25.1
2019-03-13,25.11
2019-03-14,25.1
2019-03-15,25.08
2019-03-18,25.46
2019-03-19,25.6
2019-03-20,25.7
2019-03-21,25.9
2019-03-22,25.52
2019-03-25,25.27
2019-03-26,25.42
2019-03-27,25.25
2019-03-28,25.36
2019-03-29,25.51
2019-04-01,25.74
2019-04-02,25.75
2019-04-03,25.7
2019-04-04,25.63
2019-04-05,25.81
2019-04-08,25.74
2019-04-09,25.46
2019-04-10,25.41
2019-04-11,25.58
2019-04-12,25.8
2019-04-15,25.72
2019-04-16,25.51
2019-04-17,25.29
2019-04-18,25.13
2019-04-22,25.63
2019-04-23,25.57
2019-04-24,25.41
2019-04-25,25.24
2019-04-26,25.32
2019-04-29,25.35
2019-04-30,25.08
2019-05-01,25.16
2019-05-02,24.75
2019-05-03,25
2019-05-06,24.96
2019-05-07,24.9
2019-05-08,24.94
2019-05-09,24.64
2019-05-10,25.56
2019-05-13,25.36
2019-05-14,25.49
2019-05-15,25.67
2019-05-16,25.86
2019-05-17,25.76
2019-05-20,25.7
2019-05-21,26
2019-05-22,25.94
2019-05-23,25.56
2019-05-24,25.46
2019-05-28,24.8
2019-05-29,24.76
2019-05-30,24.5
2019-05-31,24.27
2019-06-03,24.62
2019-06-04,24.9
2019-06-05,24.56
2019-06-06,24.69
2019-06-07,24.68
2019-06-10,24.77
2019-06-11,24.87
2019-06-12,25.55
2019-06-13,24.955
2019-06-14,24.695
2019-06-17,24.585
2019-06-18,24.635
2019-06-19,24.645
2019-06-20,24.715
2019-06-21,24.915
2019-06-24,24.8
2019-06-25,24.665
2019-06-26,24.805
2019-06-27,24.695
2019-06-28,24.955
2019-07-01,25.125
2019-07-02,25.085
2019-07-03,25.345
2019-07-04,25.345
2019-07-05,25.515
2019-07-08,25.445
2019-07-09,25.34
2019-07-10,25.665
2019-07-11,25.705
2019-07-12,25.795
2019-07-15,25.705
2019-07-16,25.705
2019-07-17,25.565
2019-07-18,25.355
2019-07-19,25.46
2019-07-22,25.745
2019-07-23,25.715
2019-07-24,25.675
2019-07-25,25.525
2019-07-26,25.35
2019-07-29,25.005
2019-07-30,25.035
2019-07-31,24.975
2019-08-01,24.635
2019-08-02,24.575
2019-08-05,23.905
2019-08-06,23.755
2019-08-07,23.385
2019-08-08,23.605
2019-08-09,23.51
2019-08-12,23.295
2019-08-13,23.405
2019-08-14,23.05
2019-08-15,22.945
2019-08-16,23.33
2019-08-19,23.685
2019-08-20,23.735
2019-08-21,23.745
2019-08-22,23.5
2019-08-23,22.96
2019-08-26,22.89
2019-08-27,22.29
2019-08-28,22.825
2019-08-29,23.095
2019-08-30,23.155
2019-09-02,23.145
2019-09-03,22.965
2019-09-04,23.07
2019-09-05,23.13
2019-09-06,22.93
2019-09-09,23.255
2019-09-10,23.355
2019-09-11,23.475
2019-09-12,23.305
2019-09-13,23.665
2019-09-16,24.01
2019-09-17,24.045
2019-09-18,24.095
2019-09-19,23.965
2019-09-20,24.05
2019-09-23,23.93
2019-09-24,23.675
2019-09-25,23.475
2019-09-26,23.275
2019-09-27,23.195
2019-09-30,23.305
2019-10-01,23.12
2019-10-02,22.86
2019-10-03,22.945
2019-10-04,23
2019-10-07,22.715
2019-10-08,22.455
2019-10-09,22.245
2019-10-10,22.265
2019-10-11,22.315
2019-10-14,22.155
2019-10-15,22.39
2019-10-16,22.115
2019-10-17,22.045
2019-10-18,22.215
2019-10-21,22.175
2019-10-22,22.19
2019-10-23,22.1
2019-10-24,22.085
2019-10-25,22.185
2019-10-28,21.865
2019-10-29,21.82
2019-10-30,21.815
2019-10-31,21.745
2019-11-01,22
2019-11-04,22.27
2019-11-05,22.055
2019-11-06,21.72
2019-11-07,21.425
2019-11-08,21.4
2019-11-11,21.085
2019-11-12,21
2019-11-13,20.875
2019-11-14,20.775
2019-11-15,20.99
2019-11-18,20.595
2019-11-19,20.225
2019-11-20,20.405
2019-11-21,20.815
2019-11-22,20.955
2019-11-25,21.035
