date,close
2014-04-21,22.5524
2014-04-22,22.9081
2014-04-23,23.1328
2014-04-24,22.983
2014-04-25,23.2732
2014-04-28,22.9362
2014-04-29,23.2639
2014-04-30,23.1422
2014-05-01,23.1609
2014-05-02,23.6571
2014-05-05,23.7226
2014-05-06,23.6852
2014-05-07,23.2732
2014-05-08,23.292
2014-05-09,23.2639
2014-05-12,23.3013
2014-05-13,23.3295
2014-05-14,23.7141
2014-05-15,23.3858
2014-05-16,23.0668
2014-05-19,23.0792
2014-05-20,23.0481
2014-05-21,23.1794
2014-05-22,23.1231
2014-05-23,22.9543
2014-05-27,22.1006
2014-05-28,21.7066
2014-05-29,21.6785
2014-05-30,21.9224
2014-06-02,21.4815
2014-06-03,21.4065
2014-06-04,21.5565
2014-06-05,21.838
2014-06-06,21.5753
2014-06-09,21.6128
2014-06-10,22.4383
2014-06-11,22.7197
2014-06-12,23.5171
2014-06-13,23.639
2014-06-16,23.3482
2014-06-17,23.555
2014-06-18,24.5326
2014-06-19,25.7263
2014-06-20,25.6323
2014-06-23,26.2339
2014-06-24,25.5853
2014-06-25,25.7357
2014-06-26,25.9613
2014-06-27,25.9613
2014-06-30,26.2339
2014-07-01,25.9989
2014-07-02,26.2339
2014-07-03,26.0083
2014-07-07,25.7357
2014-07-08,26.1681
2014-07-09,26.6192
2014-07-10,26.2809
2014-07-11,26.7132
2014-07-14,26.1399
2014-07-15,25.4054
2014-07-16,25.7915
2014-07-17,26.4977
2014-07-18,26.3188
2014-07-21,26.1681
2014-07-22,25.8762
2014-07-23,25.8103
2014-07-24,25.6502
2014-07-25,26.5542
2014-07-28,26.7802
2014-07-29,26.5354
2014-07-30,26.121
2014-07-31,25.8009
2014-08-01,26.1022
2014-08-04,25.848
2014-08-05,26.0645
2014-08-06,26.5165
2014-08-07,26.6672
2014-08-08,26.4224
2014-08-11,26.6013
2014-08-12,27.1474
2014-08-13,27.5429
2014-08-14,27.2981
2014-08-15,26.9309
2014-08-18,26.912
2014-08-19,26.7988
2014-08-20,26.7799
2014-08-21,25.931
2014-08-22,25.7329
2014-08-25,25.3839
2014-08-26,25.9687
2014-08-27,25.9499
2014-08-28,26.1951
2014-08-29,26.4781
2014-09-02,25.2141
2014-09-03,25.2141
2014-09-04,24.4783
2014-09-05,24.318
2014-09-08,23.686
2014-09-09,24.0538
2014-09-10,23.7897
2014-09-11,23.9689
2014-09-12,23.6954
2014-09-15,23.7803
2014-09-16,23.9221
2014-09-17,23.4778
2014-09-18,22.9863
2014-09-19,22.3814
2014-09-22,22.079
2014-09-23,22.3058
2014-09-24,22.2397
2014-09-25,22.4571
2014-09-26,22.2019
2014-09-29,22.0884
2014-09-30,21.7671
2014-10-01,21.9372
2014-10-02,22.3058
2014-10-03,21.3796
2014-10-06,21.8805
2014-10-07,21.3134
2014-10-08,23.1565
2014-10-09,22.2775
2014-10-10,21.9467
2014-10-13,22.2208
2014-10-14,22.4576
2014-10-15,22.3913
2014-10-16,22.6186
2014-10-17,21.7093
2014-10-20,22.0692
2014-10-21,21.9935
2014-10-22,21.1126
2014-10-23,21.1505
2014-10-24,21.0747
2014-10-27,20.819
2014-10-28,21.2547
2014-10-29,20.3833
2014-10-30,18.631
2014-10-31,17.788
2014-11-03,17.8543
2014-11-04,17.4375
2014-11-05,16.8882
2014-11-06,17.5701
2014-11-07,18.9625
2014-11-10,18.0532
2014-11-11,18.5552
2014-11-12,18.631
2014-11-13,18.2332
2014-11-14,19.3414
2014-11-17,19.4834
2014-11-18,20.2145
2014-11-19,19.0752
2014-11-20,19.5689
2014-11-21,19.4834
2014-11-24,19.36
2014-11-25,20.1861
2014-11-26,19.8537
2014-11-28,18.6479
2014-12-01,20.1861
2014-12-02,19.3885
2014-12-03,19.6354
2014-12-04,19.0087
2014-12-05,18.5434
2014-12-08,18.4865
2014-12-09,19.3337
2014-12-10,18.7625
2014-12-11,18.4294
2014-12-12,17.9153
2014-12-15,16.5826
2014-12-16,16.2875
2014-12-17,17.0681
2014-12-18,17.9153
2014-12-19,17.4013
2014-12-22,16.535
2014-12-23,16.3542
2014-12-24,16.8206
2014-12-26,17.4679
2014-12-29,16.9253
2014-12-30,17.6964
2014-12-31,17.6297
2015-01-02,17.9248
2015-01-05,17.9439
2015-01-06,19.3337
2015-01-07,19.1814
2015-01-08,18.7625
2015-01-09,19.7621
2015-01-12,20.4284
2015-01-13,19.417
2015-01-14,19.5601
2015-01-15,21.6497
2015-01-16,22.7184
2015-01-20,23.1287
2015-01-21,23.3195
2015-01-22,23.0905
2015-01-23,22.8424
2015-01-26,22.747
2015-01-27,23.4531
2015-01-28,22.6898
2015-01-29,22.289
2015-01-30,22.9283
2015-02-02,23.3386
2015-02-03,22.8043
2015-02-04,23.0619
2015-02-05,23.4054
2015-02-06,21.8406
2015-02-09,22.3749
2015-02-10,22.1932
2015-02-11,21.8299
2015-02-12,22.2888
2015-02-13,22.5087
2015-02-17,21.8681
2015-02-18,22.2984
2015-02-19,20.4243
2015-02-20,20.5007
2015-02-23,20.5677
2015-02-24,20.4243
2015-02-25,20.6442
2015-02-26,20.7876
2015-02-27,21.0171
2015-03-02,20.2999
2015-03-03,19.9844
2015-03-04,19.6115
2015-03-05,19.7836
2015-03-06,18.2154
2015-03-09,17.7852
2015-03-10,17.5551
2015-03-11,17.9194
2015-03-12,17.8235
2015-03-13,18.0824
2015-03-16,18.1111
2015-03-17,17.6413
2015-03-18,18.1878
2015-03-19,17.8427
2015-03-20,18.3796
2015-03-23,18.8686
2015-03-24,18.6576
2015-03-25,18.1878
2015-03-26,17.8331
2015-03-27,17.6701
2015-03-30,17.44
2015-03-31,17.3729
2015-04-01,18.2262
2015-04-02,18.0728
2015-04-06,18.5138
2015-04-07,18.255
2015-04-08,18.092
2015-04-09,18.0057
2015-04-10,18.5042
2015-04-13,18.3221
2015-04-14,18.4275
2015-04-15,19.2254
2015-04-16,19.0812
2015-04-17,19.0427
2015-04-20,18.8024
2015-04-21,18.6678
2015-04-22,18.1391
2015-04-23,18.764
2015-04-24,18.2737
2015-04-27,18.4371
2015-04-28,19.0812
2015-04-29,19.3792
2015-04-30,18.1007
2015-05-01,17.9565
2015-05-04,18.0334
2015-05-05,17.8219
2015-05-06,17.3894
2015-05-07,17.4374
2015-05-08,18.0142
2015-05-11,17.8315
2015-05-12,18.2364
2015-05-13,18.7279
2015-05-14,18.8629
2015-05-15,18.699
2015-05-18,18.7376
2015-05-19,17.9183
2015-05-20,17.8508
2015-05-21,17.7255
2015-05-22,17.6677
2015-05-26,16.858
2015-05-27,16.9351
2015-05-28,17.1665
2015-05-29,17.1183
2015-06-01,17.0797
2015-06-02,17.2918
2015-06-03,17.1086
2015-06-04,16.9641
2015-06-05,16.6171
2015-06-08,16.6845
2015-06-09,16.5592
2015-06-10,16.6845
2015-06-11,16.3568
2015-06-12,16.2412
2015-06-15,16.1062
2015-06-16,15.8549
2015-06-17,16.0869
2015-06-18,16.4059
2015-06-19,15.9225
2015-06-22,15.6905
2015-06-23,16.0192
2015-06-24,16.2319
2015-06-25,16.0095
2015-06-26,15.9612
2015-06-29,15.8162
2015-06-30,15.6615
2015-07-01,15.3521
2015-07-02,15.6422
2015-07-06,16.1449
2015-07-07,16.0482
2015-07-08,16.1545
2015-07-09,16.1159
2015-07-10,15.8935
2015-07-13,15.7968
2015-07-14,15.7193
2015-07-15,15.3314
2015-07-16,15.1956
2015-07-17,14.2453
2015-07-20,12.4998
2015-07-21,12.7907
2015-07-22,12.7907
2015-07-23,12.3931
2015-07-24,12.878
2015-07-27,12.2282
2015-07-28,12.2864
2015-07-29,12.4901
2015-07-30,12.2573
2015-07-31,12.878
2015-08-03,12.6743
2015-08-04,12.9071
2015-08-05,12.7519
2015-08-06,13.0913
2015-08-07,13.0331
2015-08-10,13.9253
2015-08-11,14.0416
2015-08-12,14.7883
2015-08-13,14.0222
2015-08-14,13.8574
2015-08-17,14.4198
2015-08-18,14.3616
2015-08-19,14.7014
2015-08-20,15.0219
2015-08-21,15.0413
2015-08-24,13.7401
2015-08-25,13.4002
2015-08-26,12.7302
2015-08-27,13.2837
2015-08-28,13.5556
2015-08-31,13.4585
2015-09-01,13.3711
2015-09-02,13.3614
2015-09-03,12.9439
2015-09-04,12.973
2015-09-08,12.8856
2015-09-09,12.3321
2015-09-10,12.3321
2015-09-11,12.2641
2015-09-14,12.2933
2015-09-15,12.2252
2015-09-16,12.9741
2015-09-17,13.1589
2015-09-18,13.1589
2015-09-21,12.906
2015-09-22,12.3614
2015-09-23,12.2155
2015-09-24,13.1394
2015-09-25,13.0032
2015-09-28,12.0696
2015-09-29,11.8751
2015-09-30,12.1766
2015-10-01,11.807
2015-10-02,12.6337
2015-10-05,12.9352
2015-10-06,13.3631
2015-10-07,13.4506
2015-10-08,13.1978
2015-10-09,14.0731
2015-10-12,13.6743
2015-10-13,13.7717
2015-10-14,15.1352
2015-10-15,15.2229
2015-10-16,14.9307
2015-10-19,14.4243
2015-10-20,15.0086
2015-10-21,14.6385
2015-10-22,14.7846
2015-10-23,15.1352
2015-10-26,14.5704
2015-10-27,14.6288
2015-10-28,14.2684
2015-10-29,12.7978
2015-10-30,12.4861
2015-11-02,12.4277
2015-11-03,12.4569
2015-11-04,12.1939
2015-11-05,11.8433
2015-11-06,11.2492
2015-11-09,11.629
2015-11-10,11.3758
2015-11-11,11.5608
2015-11-12,11.5219
2015-11-13,11.6972
2015-11-16,11.7361
2015-11-17,11.1508
2015-11-18,11.5898
2015-11-19,11.863
2015-11-20,11.5215
2015-11-23,11.3557
2015-11-24,11.5605
2015-11-25,11.463
2015-11-27,11.2679
2015-11-30,11.5215
2015-12-01,11.8337
2015-12-02,11.5508
2015-12-03,11.7752
2015-12-04,12.4191
2015-12-07,11.902
2015-12-08,11.6874
2015-12-09,11.7849
2015-12-10,11.5898
2015-12-11,11.7166
2015-12-14,10.8191
2015-12-15,10.8387
2015-12-16,11.601
2015-12-17,10.7018
2015-12-18,11.3273
2015-12-21,11.5423
2015-12-22,11.513
2015-12-23,11.5619
2015-12-24,11.8844
2015-12-28,11.5228
2015-12-29,11.4739
2015-12-30,11.2589
2015-12-31,11.298
2016-01-04,11.5912
2016-01-05,11.3273
2016-01-06,11.5423
2016-01-07,12.4317
2016-01-08,12.2069
2016-01-11,11.5423
2016-01-12,11.1997
2016-01-13,10.9256
2016-01-14,10.2109
2016-01-15,10.1032
2016-01-19,9.6333
2016-01-20,9.6529
2016-01-21,9.6137
2016-01-22,9.927
2016-01-25,10.0543
2016-01-26,10.5046
2016-01-27,10.8668
2016-01-28,10.8472
2016-01-29,11.1018
2016-02-01,11.2976
2016-02-02,11.043
2016-02-03,12.1591
2016-02-04,12.7856
2016-02-05,13.4416
2016-02-08,14.4108
2016-02-09,13.8814
2016-02-10,14.2833
2016-02-11,14.7049
2016-02-12,15.3323
2016-02-16,14.499
2016-02-17,14.6363
2016-02-18,15.4597
2016-02-19,15.146
2016-02-22,14.8225
2016-02-23,15.1264
2016-02-24,15.4695
2016-02-25,15.5774
2016-02-26,13.5873
2016-02-29,14.0383
2016-03-01,13.6265
2016-03-02,14.0971
2016-03-03,14.6755
2016-03-04,14.8323
2016-03-07,15.6068
2016-03-08,15.2539
2016-03-09,15.4009
2016-03-10,16.1852
2016-03-11,16.0479
2016-03-14,15.5088
2016-03-15,15.7247
2016-03-16,16.6768
2016-03-17,16.5394
2016-03-18,16.5591
2016-03-21,16.5198
2016-03-22,16.3235
2016-03-23,15.126
2016-03-24,15.4891
2016-03-28,15.4499
2016-03-29,16.137
2016-03-30,16.0977
2016-03-31,15.9308
2016-04-01,15.7836
2016-04-04,15.5873
2016-04-05,15.9407
2016-04-06,15.7444
2016-04-07,16.0585
2016-04-08,16.7946
2016-04-11,17.4523
2016-04-12,17.4032
2016-04-13,16.9517
2016-04-14,16.2646
2016-04-15,16.4609
2016-04-18,16.5198
2016-04-19,17.04
2016-04-20,16.7259
2016-04-21,17.2462
2016-04-22,16.7652
2016-04-25,16.6179
2016-04-26,17.2363
2016-04-27,17.5308
2016-04-28,18.5909
2016-04-29,19.7786
2016-05-02,19.1406
2016-05-03,18.7774
2016-05-04,18.1197
2016-05-05,18.3848
2016-05-06,18.8363
2016-05-09,17.9038
2016-05-10,18.3062
2016-05-11,18.3946
2016-05-12,17.6879
2016-05-13,17.629
2016-05-16,18.1492
2016-05-17,18.1296
2016-05-18,16.7259
2016-05-19,16.9713
2016-05-20,17.0498
2016-05-23,17.04
2016-05-24,16.0977
2016-05-25,16.4707
2016-05-26,16.5885
2016-05-27,16.294
2016-05-31,16.51
2016-06-01,16.5198
2016-06-02,16.6376
2016-06-03,17.9234
2016-06-06,17.8449
2016-06-07,17.7173
2016-06-08,18.0609
2016-06-09,18.3357
2016-06-10,17.7271
2016-06-13,17.7173
2016-06-14,17.4225
2016-06-15,17.8942
2016-06-16,17.3439
2016-06-17,17.5699
2016-06-20,17.4618
2016-06-21,17.2162
2016-06-22,17.737
2016-06-23,17.2948
2016-06-24,18.0613
2016-06-27,18.0809
2016-06-28,18.0318
2016-06-29,18.4641
2016-06-30,18.7982
2016-07-01,19.3387
2016-07-05,19.6335
2016-07-06,19.7514
2016-07-07,19.2994
2016-07-08,19.5844
2016-07-11,19.6925
2016-07-12,19.1225
2016-07-13,19.1422
2016-07-14,19.1127
2016-07-15,18.9555
2016-07-18,19.0832
2016-07-19,18.7295
2016-07-20,17.6584
2016-07-21,17.8254
2016-07-22,17.9925
2016-07-25,17.6977
2016-07-26,17.9826
2016-07-27,18.5231
2016-07-28,17.4225
2016-07-29,17.5699
2016-08-01,17.7665
2016-08-02,17.7861
2016-08-03,17.7665
2016-08-04,17.7173
2016-08-05,17.1572
2016-08-08,17.3537
2016-08-09,17.7959
2016-08-10,18.6312
2016-08-11,18.6312
2016-08-12,18.5526
2016-08-15,18.5133
2016-08-16,18.5034
2016-08-17,18.1792
2016-08-18,18.3757
2016-08-19,18.0121
2016-08-22,17.6289
2016-08-23,17.3832
2016-08-24,15.7717
2016-08-25,15.7815
2016-08-26,15.6734
2016-08-29,16.037
2016-08-30,15.2017
2016-08-31,14.9757
2016-09-01,15.3393
2016-09-02,15.7422
2016-09-06,16.489
2016-09-07,16.3711
2016-09-08,16.2433
2016-09-09,15.6439
2016-09-12,16.1451
2016-09-13,15.4859
2016-09-14,15.5056
2016-09-15,15.5449
2016-09-16,15.3186
2016-09-19,15.4367
2016-09-20,15.476
2016-09-21,16.5583
2016-09-22,16.8141
2016-09-23,16.391
2016-09-26,16.1647
2016-09-27,16.0073
2016-09-28,16.3222
2016-09-29,16.3812
2016-09-30,16.2533
2016-10-03,15.5252
2016-10-04,14.1774
2016-10-05,14.2167
2016-10-06,13.892
2016-10-07,13.8724
2016-10-10,13.9314
2016-10-11,13.7641
2016-10-12,14.1085
2016-10-13,14.4135
2016-10-14,14.079
2016-10-17,14.3053
2016-10-18,14.6201
2016-10-19,15.0727
2016-10-20,15.1514
2016-10-21,15.2596
2016-10-24,15.0431
2016-10-25,15.3383
2016-10-26,15.0727
2016-10-27,14.5217
2016-10-28,14.5807
2016-10-31,14.9546
2016-11-01,15.2793
2016-11-02,15.0923
2016-11-03,14.994
2016-11-04,15.053
2016-11-07,14.4823
2016-11-08,14.5119
2016-11-09,14.7775
2016-11-10,13.7346
2016-11-11,12.9279
2016-11-14,13.1345
2016-11-15,13.6166
2016-11-16,13.5083
2016-11-17,13.1935
2016-11-18,13.105
2016-11-21,13.3509
2016-11-22,13.282
2016-11-23,12.7016
2016-11-25,12.8
2016-11-28,13.3214
2016-11-29,13.223
2016-11-30,12.9771
2016-12-01,13.0066
2016-12-02,13.3411
2016-12-05,13.2722
2016-12-06,13.1541
2016-12-07,13.2722
2016-12-08,13.3116
2016-12-09,12.9869
2016-12-12,12.9475
2016-12-13,13.0559
2016-12-14,12.2381
2016-12-15,12.0115
2016-12-16,12.3465
2016-12-19,12.1888
2016-12-20,12.1395
2016-12-21,12.2381
2016-12-22,12.179
2016-12-23,12.4154
2016-12-27,12.6716
2016-12-28,12.9672
2016-12-29,13.6668
2016-12-30,13.4008
2017-01-03,13.8442
2017-01-04,14.0511
2017-01-05,14.7212
2017-01-06,14.4059
2017-01-09,14.2482
2017-01-10,14.2384
2017-01-11,14.2581
2017-01-12,14.396
2017-01-13,14.3862
2017-01-17,14.9281
2017-01-18,15.0858
2017-01-19,14.869
2017-01-20,15.1547
2017-01-23,15.5292
2017-01-24,15.8051
2017-01-25,15.7854
2017-01-26,15.3912
2017-01-27,15.5292
2017-01-30,15.5587
2017-01-31,15.9332
2017-02-01,15.7262
2017-02-02,16.1598
2017-02-03,16.0415
2017-02-06,16.5736
2017-02-07,16.4751
2017-02-08,16.6919
2017-02-09,16.5835
2017-02-10,16.751
2017-02-13,16.5145
2017-02-14,16.3766
2017-02-15,16.416
2017-02-16,17.4112
2017-02-17,17.1353
2017-02-21,16.8397
2017-02-22,16.6426
2017-02-23,16.5736
2017-02-24,16.3273
2017-02-27,15.7854
2017-02-28,15.7164
2017-03-01,15.4011
2017-03-02,14.8099
2017-03-03,14.8985
2017-03-06,14.7803
2017-03-07,14.5143
2017-03-08,14.4453
2017-03-09,14.3664
2017-03-10,14.6029
2017-03-13,14.6423
2017-03-14,14.3661
2017-03-15,15.2442
2017-03-16,15.1357
2017-03-17,15.116
2017-03-20,15.2442
2017-03-21,15.629
2017-03-22,15.7474
2017-03-23,15.6981
2017-03-24,15.629
2017-03-27,15.8362
2017-03-28,14.741
2017-03-29,14.7114
2017-03-30,14.4647
2017-03-31,14.3957
2017-04-03,14.6226
2017-04-04,14.6917
2017-04-05,14.6522
2017-04-06,14.6127
2017-04-07,14.5535
2017-04-10,14.7213
2017-04-11,15.1258
2017-04-12,15.2936
2017-04-13,15.185
2017-04-17,15.1752
2017-04-18,15.1752
2017-04-19,14.7015
2017-04-20,14.8594
2017-04-21,14.9482
2017-04-24,14.6325
2017-04-25,14.1687
2017-04-26,14.3365
2017-04-27,13.6162
2017-04-28,13.7741
2017-05-01,13.4682
2017-05-02,13.557
2017-05-03,13.3498
2017-05-04,13.2117
2017-05-05,13.4287
2017-05-08,13.5274
2017-05-09,13.4978
2017-05-10,13.705
2017-05-11,13.9319
2017-05-12,14.0306
2017-05-15,14.0109
2017-05-16,14.0997
2017-05-17,14.0701
2017-05-18,13.6951
2017-05-19,13.6557
2017-05-22,13.8629
2017-05-23,13.3695
2017-05-24,13.5077
2017-05-25,13.3695
2017-05-26,13.5373
2017-05-30,13.4287
2017-05-31,13.409
2017-06-01,13.4781
2017-06-02,13.2807
2017-06-05,13.2215
2017-06-06,13.8727
2017-06-07,13.7938
2017-06-08,13.5077
2017-06-09,13.2511
2017-06-12,13.3202
2017-06-13,13.4783
2017-06-14,13.0435
2017-06-15,12.9348
2017-06-16,12.9645
2017-06-19,12.8953
2017-06-20,12.8953
2017-06-21,13.2313
2017-06-22,13.3696
2017-06-23,13.6364
2017-06-26,13.5079
2017-06-27,13.2115
2017-06-28,13.1818
2017-06-29,12.8162
2017-06-30,12.7569
2017-07-03,12.5692
2017-07-05,12.6977
2017-07-06,12.6384
2017-07-07,12.3617
2017-07-10,12.589
2017-07-11,12.6878
2017-07-12,12.836
2017-07-13,12.7372
2017-07-14,12.8656
2017-07-17,13.0237
2017-07-18,13.251
2017-07-19,13.3696
2017-07-20,13.4585
2017-07-21,13.5573
2017-07-24,13.2708
2017-07-25,13.2609
2017-07-26,13.6265
2017-07-27,12.6581
2017-07-28,12.8953
2017-07-31,12.9743
2017-08-01,12.915
2017-08-02,12.8064
2017-08-03,12.6581
2017-08-04,12.4111
2017-08-07,12.4111
2017-08-08,12.4012
2017-08-09,12.5692
2017-08-10,12.8755
2017-08-11,12.8459
2017-08-14,12.6779
2017-08-15,12.5791
2017-08-16,12.8755
2017-08-17,13.0139
2017-08-18,12.7174
2017-08-21,12.8558
2017-08-22,12.7569
2017-08-23,12.8656
2017-08-24,12.8558
2017-08-25,12.915
2017-08-28,13.3301
2017-08-29,13.4289
2017-08-30,13.2214
2017-08-31,13.587
2017-09-01,13.587
2017-09-05,13.9032
2017-09-06,13.666
2017-09-07,14.002
2017-09-08,14.0218
2017-09-11,13.666
2017-09-12,13.666
2017-09-13,13.29
2017-09-14,13.29
2017-09-15,13.1119
2017-09-18,12.8348
2017-09-19,12.716
2017-09-20,12.6369
2017-09-21,12.6072
2017-09-22,12.7358
2017-09-25,12.9239
2017-09-26,12.7457
2017-09-27,12.5874
2017-09-28,12.627
2017-09-29,12.8249
2017-10-02,12.9931
2017-10-03,13.0525
2017-10-04,13.1218
2017-10-05,13.1218
2017-10-06,13.1614
2017-10-09,13.2405
2017-10-10,13.1614
2017-10-11,13.2207
2017-10-12,13.1515
2017-10-13,13.2603
2017-10-16,12.9239
2017-10-17,13.003
2017-10-18,13.0129
2017-10-19,13.1218
2017-10-20,12.9535
2017-10-23,12.8942
2017-10-24,12.8051
2017-10-25,12.7655
2017-10-26,12.7853
2017-10-27,12.9634
2017-10-30,13.2405
2017-10-31,12.9239
2017-11-01,13.0327
2017-11-02,12.9239
2017-11-03,12.9634
2017-11-06,13.1712
2017-11-07,13.0624
2017-11-08,13.1317
2017-11-09,13.2405
2017-11-10,13.1119
2017-11-13,13.1218
2017-11-14,13.102
2017-11-15,13.102
2017-11-16,13.102
2017-11-17,13.2702
2017-11-20,13.1416
2017-11-21,13.0921
2017-11-22,13.2207
2017-11-24,13.0228
2017-11-27,13.0822
2017-11-28,12.8942
2017-11-29,12.5181
2017-11-30,12.5082
2017-12-01,12.5874
2017-12-04,12.4291
2017-12-05,12.1619
2017-12-06,11.9541
2017-12-07,11.8947
2017-12-08,11.8353
2017-12-11,11.7166
2017-12-12,11.6572
2017-12-13,12.3511
2017-12-14,12.3114
2017-12-15,12.2619
2017-12-18,12.2718
2017-12-19,12.2123
2017-12-20,12.3907
2017-12-21,12.3709
2017-12-22,12.47
2017-12-26,12.6088
2017-12-27,12.5692
2017-12-28,12.5989
2017-12-29,12.6584
2018-01-02,13.1044
2018-01-03,13.2135
2018-01-04,13.273
2018-01-05,13.3027
2018-01-08,13.4117
2018-01-09,13.4117
2018-01-10,13.6496
2018-01-11,13.7785
2018-01-12,14.2246
2018-01-16,15.2555
2018-01-17,14.5715
2018-01-18,14.2642
2018-01-19,14.1948
2018-01-22,14.3237
2018-01-23,14.6508
2018-01-24,14.7896
2018-01-25,14.6012
2018-01-26,14.6112
2018-01-29,14.175
2018-01-30,14.0759
2018-01-31,14.1948
2018-02-01,14.1651
2018-02-02,13.5802
2018-02-05,13.3423
2018-02-06,12.9557
2018-02-07,12.6485
2018-02-08,12.5097
2018-02-09,12.2321
2018-02-12,12.7178
2018-02-13,12.5692
2018-02-14,13.0846
2018-02-15,13.6695
2018-02-16,13.382
2018-02-20,13.0053
2018-02-21,12.8368
2018-02-22,12.6385
2018-02-23,12.7278
2018-02-26,12.6683
2018-02-27,12.4205
2018-02-28,12.4006
2018-03-01,12.4403
2018-03-02,12.3412
2018-03-05,12.6385
2018-03-06,13.0846
2018-03-07,12.8665
2018-03-08,12.9062
2018-03-09,12.8963
2018-03-12,13.1837
2018-03-13,13.2135
2018-03-14,13.3425
2018-03-15,13.1738
2018-03-16,13.2631
2018-03-19,13.1936
2018-03-20,12.9752
2018-03-21,13.412
2018-03-22,13.1738
2018-03-23,13.7992
2018-03-26,13.9084
2018-03-27,13.6701
2018-03-28,13.412
2018-03-29,13.7198
2018-04-02,13.9183
2018-04-03,13.8588
2018-04-04,13.7793
2018-04-05,13.9183
2018-04-06,13.9481
2018-04-09,13.829
2018-04-10,13.8985
2018-04-11,14.2261
2018-04-12,14.1467
2018-04-13,14.2757
2018-04-16,14.2658
2018-04-17,14.236
2018-04-18,14.2956
2018-04-19,14.3055
2018-04-20,14.2261
2018-04-23,13.9779
2018-04-24,14.2559
2018-04-25,13.8488
2018-04-26,13.5609
2018-04-27,13.6503
2018-04-30,13.1936
2018-05-01,13.2532
2018-05-02,13.273
2018-05-03,13.3922
2018-05-04,13.3723
2018-05-07,13.4219
2018-05-08,13.3922
2018-05-09,13.3723
2018-05-10,13.6602
2018-05-11,13.7098
2018-05-14,13.6602
2018-05-15,13.4021
2018-05-16,13.4716
2018-05-17,13.412
2018-05-18,13.4418
2018-05-21,13.6205
2018-05-22,13.4617
2018-05-23,13.6404
2018-05-24,14.1069
2018-05-25,13.9481
2018-05-29,14.0672
2018-05-30,14.236
2018-05-31,14.2161
2018-06-01,13.9779
2018-06-04,13.7496
2018-06-05,13.9282
2018-06-06,14.0672
2018-06-07,14.0275
2018-06-08,14.0573
2018-06-11,14.1169
2018-06-12,14.1566
2018-06-13,14.1069
2018-06-14,14.2361
2018-06-15,13.8882
2018-06-18,13.9279
2018-06-19,13.6396
2018-06-20,13.5203
2018-06-21,13.3712
2018-06-22,13.6396
2018-06-25,13.3812
2018-06-26,13.3613
2018-06-27,13.1923
2018-06-28,13.2122
2018-06-29,13.6297
2018-07-02,13.4706
2018-07-03,13.8385
2018-07-05,14.0174
2018-07-06,13.8782
2018-07-09,13.7689
2018-07-10,13.7788
2018-07-11,13.1525
2018-07-12,13.2221
2018-07-13,13.1525
2018-07-16,13.0531
2018-07-17,13.1724
2018-07-18,13.3016
2018-07-19,13.2718
2018-07-20,13.5303
2018-07-23,13.1227
2018-07-24,13.232
2018-07-25,13.2817
2018-07-26,12.4467
2018-07-27,12.4268
2018-07-30,12.4665
2018-07-31,12.4268
2018-08-01,12.2578
2018-08-02,12.0987
2018-08-03,12.2677
2018-08-06,12.0987
2018-08-07,11.9595
2018-08-08,12.0589
2018-08-09,11.9695
2018-08-10,11.8402
2018-08-13,11.4525
2018-08-14,11.2835
2018-08-15,10.697
2018-08-16,10.3291
2018-08-17,10.6771
2018-08-20,10.7268
2018-08-21,10.8063
2018-08-22,11.1046
2018-08-23,10.7367
2018-08-24,11.0847
2018-08-27,11.2438
2018-08-28,11.0648
2018-08-29,11.035
2018-08-30,10.8362
2018-08-31,10.7765
2018-09-04,10.19
2018-09-05,10.1104
2018-09-06,10.1403
2018-09-07,10.2098
2018-09-10,10.011
2018-09-11,10.0011
2018-09-12,10.2302
2018-09-13,10.2202
2018-09-14,10.1903
2018-09-17,10.4991
2018-09-18,10.5788
2018-09-19,10.7581
2018-09-20,10.7282
2018-09-21,10.5589
2018-09-24,10.5987
2018-09-25,10.4194
2018-09-26,10.1206
2018-09-27,10.1206
2018-09-28,10.1605
2018-10-01,10.1804
2018-10-02,10.5091
2018-10-03,10.2601
2018-10-04,10.1704
2018-10-05,9.9513
2018-10-08,10.0907
2018-10-09,9.9015
2018-10-10,10.0708
2018-10-11,10.7581
2018-10-12,10.7183
2018-10-15,10.8179
2018-10-16,10.7382
2018-10-17,10.8478
2018-10-18,10.8677
2018-10-19,10.8378
2018-10-22,10.5191
2018-10-23,10.6286
2018-10-24,10.3995
2018-10-25,8.4571
2018-10-26,8.8057
2018-10-29,8.9452
2018-10-30,9.0049
2018-10-31,8.985
2018-11-01,9.5727
2018-11-02,9.5927
2018-11-05,9.4731
2018-11-06,9.3436
2018-11-07,9.2938
2018-11-08,9.3436
2018-11-09,9.1544
2018-11-12,8.9651
2018-11-13,8.8456
2018-11-14,9.1046
2018-11-15,9.2341
2018-11-16,9.4034
2018-11-19,9.4432
2018-11-20,9.4632
2018-11-21,9.772
2018-11-23,9.3835
2018-11-26,9.5229
2018-11-27,9.3337
2018-11-28,9.4731
2018-11-29,9.3934
2018-11-30,9.244
2018-12-03,9.4134
2018-12-04,9.4831
2018-12-06,9.4134
2018-12-07,9.3934
2018-12-10,9.5329
2018-12-11,9.4632
2018-12-12,9.6229
2018-12-13,9.4432
2018-12-14,9.1238
2018-12-17,9.3733
2018-12-18,9.6628
2018-12-19,9.2136
2018-12-20,9.4432
2018-12-21,9.2236
2018-12-24,9.6628
2018-12-26,9.543
2018-12-27,9.7227
2018-12-28,9.6528
2018-12-31,9.7826
2019-01-02,9.8026
2019-01-03,9.8625
2019-01-04,9.6928
2019-01-07,9.563
2019-01-08,9.5031
2019-01-09,9.7227
2019-01-10,9.6229
2019-01-11,9.6728
2019-01-14,10.3616
2019-01-15,10.1819
2019-01-16,10.2617
2019-01-17,10.3216
2019-01-18,10.3516
2019-01-22,10.4614
2019-01-23,10.4814
2019-01-24,10.4614
2019-01-25,10.7808
2019-01-28,10.671
2019-01-29,10.9006
2019-01-30,10.9805
2019-01-31,11.1701
2019-02-01,11.0204
2019-02-04,11.0903
2019-02-05,11.1402
2019-02-06,11.0503
2019-02-07,10.9904
2019-02-08,11.0304
2019-02-11,10.9505
2019-02-12,10.8407
2019-02-13,10.7509
2019-02-14,10.7908
2019-02-15,10.8008
2019-02-19,11.25
2019-02-20,11.4995
2019-02-21,11.4896
2019-02-22,11.1102
2019-02-25,11.0404
2019-02-26,10.7808
2019-02-27,10.5712
2019-02-28,10.5213
2019-03-01,10.5313
2019-03-04,10.8906
2019-03-05,11.0204
2019-03-06,10.6211
2019-03-07,10.5812
2019-03-08,10.701
2019-03-11,10.9006
2019-03-12,11.24
2019-03-13,11.2
2019-03-14,10.91
2019-03-15,10.85
2019-03-18,10.77
2019-03-19,10.85
2019-03-20,11.04
2019-03-21,11.16
2019-03-22,10.8
2019-03-25,11.12
2019-03-26,11.35
2019-03-27,11.4
2019-03-28,11.37
2019-03-29,11.44
2019-04-01,11.37
2019-04-02,11.47
2019-04-03,11.52
2019-04-04,11.7
2019-04-05,11.69
2019-04-08,11.76
2019-04-09,11.71
2019-04-10,11.6
2019-04-11,11.52
2019-04-12,11.61
2019-04-15,11.6
2019-04-16,11.42
2019-04-17,11.19
