date,close
2014-06-13,61.94
2014-06-16,62.36
2014-06-17,62.3
2014-06-18,63.06
2014-06-19,63.01
2014-06-20,63.05
2014-06-23,62.84
2014-06-24,62.04
2014-06-25,62.73
2014-06-26,62.05
2014-06-27,62.4
2014-06-30,62.24
2014-07-01,62.99
2014-07-02,63.19
2014-07-03,63.62
2014-07-07,62.95
2014-07-08,62.45
2014-07-09,62.49
2014-07-10,62.19
2014-07-11,61.67
2014-07-14,61.96
2014-07-15,61.82
2014-07-16,61.77
2014-07-17,62.15
2014-07-18,62.91
2014-07-21,62.53
2014-07-22,63.18
2014-07-23,63.22
2014-07-24,62.82
2014-07-25,58.26
2014-07-28,58.545
2014-07-29,58.34
2014-07-30,58.2
2014-07-31,57.6
2014-08-01,57.12
2014-08-04,56.98
2014-08-05,56.18
2014-08-06,55.99
2014-08-07,55.04
2014-08-08,55.51
2014-08-11,54.67
2014-08-12,54.33
2014-08-13,54.48
2014-08-14,54.55
2014-08-15,54.72
2014-08-18,54.71
2014-08-19,55.09
2014-08-20,55.34
2014-08-21,55.02
2014-08-22,55.15
2014-08-25,55.4
2014-08-26,55.6
2014-08-27,55.46
2014-08-28,55.6
2014-08-29,55.86
2014-09-02,54.95
2014-09-03,55.11
2014-09-04,54.98
2014-09-05,55
2014-09-08,54.68
2014-09-09,54.44
2014-09-10,54.46
2014-09-11,55.03
2014-09-12,54.82
2014-09-15,54.29
2014-09-16,54.55
2014-09-17,54.78
2014-09-18,55.49
2014-09-19,55.45
2014-09-22,55.45
2014-09-23,55.25
2014-09-24,55.98
2014-09-25,55.3
2014-09-26,54.7
2014-09-29,54.91
2014-09-30,54.73
2014-10-01,54.57
2014-10-02,54.88
2014-10-03,54.57
2014-10-06,52.95
2014-10-07,52.78
2014-10-08,54.21
2014-10-09,53.85
2014-10-10,53.94
2014-10-13,54.31
2014-10-14,55.09
2014-10-15,54.54
2014-10-16,55.19
2014-10-17,55.57
2014-10-20,56.69
2014-10-21,58.08
2014-10-22,56.96
2014-10-23,57.47
2014-10-24,57.66
2014-10-27,58.99
2014-10-28,59.49
2014-10-29,59.83
2014-10-30,60.05
2014-10-31,60.52
2014-11-03,59.62
2014-11-04,59.5
2014-11-05,59.59
2014-11-06,60.1
2014-11-07,59.65
2014-11-10,60.48
2014-11-11,61.39
2014-11-12,61.63
2014-11-13,61.45
2014-11-14,60.88
2014-11-17,61.34
2014-11-18,61.49
2014-11-19,60.54
2014-11-20,60.42
2014-11-21,60.74
2014-11-24,61.32
2014-11-25,61.84
2014-11-26,61.53
2014-11-28,61.19
2014-12-01,61.21
2014-12-02,61.65
2014-12-03,62.28
2014-12-04,62.38
2014-12-05,62.24
2014-12-08,61.35
2014-12-09,62.2
2014-12-10,60.29
2014-12-11,60.39
2014-12-12,60.03
2014-12-15,58.54
2014-12-16,58.41
2014-12-17,59.37
2014-12-18,59.95
2014-12-19,59.3
2014-12-22,59.7
2014-12-23,60
2014-12-24,60.14
2014-12-26,60.61
2014-12-29,61.32
2014-12-30,61.17
2014-12-31,60.03
2015-01-02,59.08
2015-01-05,57.99
2015-01-06,58.23
2015-01-07,59.3
2015-01-08,60.87
2015-01-09,59.99
2015-01-12,59.66
2015-01-13,60.2
2015-01-14,60.21
2015-01-15,59.68
2015-01-16,60.6
2015-01-20,60.17
2015-01-21,60.28
2015-01-22,61.08
2015-01-23,61.22
2015-01-26,60.61
2015-01-27,60.3
2015-01-28,59.37
2015-01-29,60.5
2015-01-30,60.12
2015-02-02,60.4
2015-02-03,60.63
2015-02-04,60.79
2015-02-05,61.24
2015-02-06,60.74
2015-02-09,59.74
2015-02-10,60.58
2015-02-11,60.97
2015-02-12,60.88
2015-02-13,60.98
2015-02-17,61.06
2015-02-18,62.01
2015-02-19,61.62
2015-02-20,61.79
2015-02-23,62.83
2015-02-24,62.53
2015-02-25,62.59
2015-02-26,62.9
2015-02-27,64.07
2015-03-02,64.84
2015-03-03,63.63
2015-03-04,63.95
2015-03-05,63.93
2015-03-06,63.52
2015-03-09,64.76
2015-03-10,65.29
2015-03-11,64.69
2015-03-12,65.98
2015-03-13,66.24
2015-03-16,66.45
2015-03-17,66.78
2015-03-18,68.08
2015-03-19,68.75
2015-03-20,68.97
2015-03-23,68.97
2015-03-24,69.65
2015-03-25,68.49
2015-03-26,68.26
2015-03-27,68.51
2015-03-30,70.65
2015-03-31,70.82
2015-04-01,71
2015-04-02,70.99
2015-04-06,70.86
2015-04-07,70.17
2015-04-08,71.06
2015-04-09,70.99
2015-04-10,71.09
2015-04-13,70.93
2015-04-14,71.04
2015-04-15,70.39
2015-04-16,70.91
2015-04-17,70.42
2015-04-20,70.93
2015-04-21,71.01
2015-04-22,70.99
2015-04-23,71.21
2015-04-24,71.19
2015-04-27,70.95
2015-04-28,71.72
2015-04-29,70.33
2015-04-30,63.3
2015-05-01,61.01
2015-05-04,60.53
2015-05-05,60.22
2015-05-06,60.59
2015-05-07,60.46
2015-05-08,61.54
2015-05-11,62.04
2015-05-12,62.13
2015-05-13,63.84
2015-05-14,64.39
2015-05-15,65.44
2015-05-18,67.05
2015-05-19,67.61
2015-05-20,67.12
2015-05-21,66.71
2015-05-22,66.33
2015-05-26,66.225
2015-05-27,66.91
2015-05-28,66.74
2015-05-29,67.63
2015-06-01,67.19
2015-06-02,67.46
2015-06-03,67.37
2015-06-04,66.67
2015-06-05,66.4
2015-06-08,67.12
2015-06-09,66.9
2015-06-10,67.95
2015-06-11,68.24
2015-06-12,66.88
2015-06-15,67.81
2015-06-16,68.65
2015-06-17,69.1
2015-06-18,70.48
2015-06-19,71.28
2015-06-22,72.12
2015-06-23,71.95
2015-06-24,70.91
2015-06-25,72.01
2015-06-26,70.9
2015-06-29,69.7
2015-06-30,70.07
2015-07-01,70.22
2015-07-02,69.71
2015-07-06,69.5
2015-07-07,69.38
2015-07-08,68.29
2015-07-09,68.56
2015-07-10,68.97
2015-07-13,69.61
2015-07-14,69.96
2015-07-15,69.51
2015-07-16,69.34
2015-07-17,69.14
2015-07-20,68.2
2015-07-21,67.04
2015-07-22,66.72
2015-07-23,66.72
2015-07-24,65.34
2015-07-27,56.67
2015-07-28,60.15
2015-07-29,61.49
2015-07-30,60.55
2015-07-31,60.59
2015-08-03,60.55
2015-08-04,60.28
2015-08-05,60.69
2015-08-06,59.62
2015-08-07,58.9
2015-08-10,59.5
2015-08-11,57.25
2015-08-12,56.58
2015-08-13,57.49
2015-08-14,58.05
2015-08-17,55.89
2015-08-18,58.19
2015-08-19,58.99
2015-08-20,57.62
2015-08-21,57.05
2015-08-24,54.86
2015-08-25,54.44
2015-08-26,55.7
2015-08-27,56.39
2015-08-28,57.24
2015-08-31,56
2015-09-01,53.72
2015-09-02,54.9
2015-09-03,55.17
2015-09-04,54.51
2015-09-08,56.13
2015-09-09,56.14
2015-09-10,56.72
2015-09-11,57.62
2015-09-14,56.85
2015-09-15,57.95
2015-09-16,58.48
2015-09-17,59.22
2015-09-18,58.49
2015-09-21,59.09
2015-09-22,58.11
2015-09-23,58.84
2015-09-24,58.79
2015-09-25,57
2015-09-28,54.52
2015-09-29,54.97
2015-09-30,55.43
2015-10-01,55.17
2015-10-02,56.18
2015-10-05,57.43
2015-10-06,51.69
2015-10-07,49.33
2015-10-08,49.28
2015-10-09,49.55
2015-10-12,49.48
2015-10-13,48.62
2015-10-14,48.2
2015-10-15,48.88
2015-10-16,49.99
2015-10-19,50.3
2015-10-20,50.07
2015-10-21,48.58
2015-10-22,46.17
2015-10-23,48.16
2015-10-26,48.36
2015-10-27,54.13
2015-10-28,54.53
2015-10-29,53.74
2015-10-30,53.4
2015-11-02,53.72
2015-11-03,53.16
2015-11-04,52.52
2015-11-05,54.08
2015-11-06,53.85
2015-11-09,52.89
2015-11-10,53.07
2015-11-11,51.17
2015-11-12,50.11
2015-11-13,49.96
2015-11-16,51.66
2015-11-17,52.96
2015-11-18,53.28
2015-11-19,51.14
2015-11-20,52.55
2015-11-23,52.88
2015-11-24,52.92
2015-11-25,52.32
2015-11-27,52.4
2015-11-30,52.65
2015-12-01,53.75
2015-12-02,53.14
2015-12-03,52.59
2015-12-04,54.16
2015-12-07,53.11
2015-12-08,54.07
2015-12-09,52.75
2015-12-10,53.43
2015-12-11,53.19
2015-12-14,52.07
2015-12-15,56.3
2015-12-16,57.89
2015-12-17,60.46
2015-12-18,61.1
2015-12-21,62.34
2015-12-22,61.47
2015-12-23,62.17
2015-12-24,61.72
2015-12-28,62.64
2015-12-29,63.06
2015-12-30,62.23
2015-12-31,61.66
2016-01-04,61.17
2016-01-05,61.81
2016-01-06,60.33
2016-01-07,59.32
2016-01-08,58.37
2016-01-11,58.33
2016-01-12,58.28
2016-01-13,57.44
2016-01-14,58.865
2016-01-15,57.5
2016-01-19,58.45
2016-01-20,58.79
2016-01-21,56.44
2016-01-22,57.6
2016-01-25,56.58
2016-01-26,57.99
2016-01-27,56.23
2016-01-28,55.6
2016-01-29,57
2016-02-01,57.47
2016-02-02,57.45
2016-02-03,57.47
2016-02-04,57.04
2016-02-05,54.03
2016-02-08,52.72
2016-02-09,54.07
2016-02-10,53.28
2016-02-11,52.79
2016-02-12,52.57
2016-02-16,53.93
2016-02-17,55.88
2016-02-18,54.91
2016-02-19,55.45
2016-02-22,55.9
2016-02-23,55.97
2016-02-24,56.21
2016-02-25,57
2016-02-26,58.4
2016-02-29,62.985
2016-03-01,63.77
2016-03-02,65.2
2016-03-03,64.87
2016-03-04,65.16
2016-03-07,65.74
2016-03-08,64.83
2016-03-09,64.49
2016-03-10,64.72
2016-03-11,66.25
2016-03-14,66.12
2016-03-15,64.72
2016-03-16,66.26
2016-03-17,64.36
2016-03-18,66.82
2016-03-21,66.29
2016-03-22,66.31
2016-03-23,66.14
2016-03-24,66.41
2016-03-28,65.81
2016-03-29,68.31
2016-03-30,67.63
2016-03-31,67.93
2016-04-01,69.4
2016-04-04,69.31
2016-04-05,68.69
2016-04-06,69.14
2016-04-07,69.32
2016-04-08,68.73
2016-04-11,67.27
2016-04-12,69.14
2016-04-13,69.94
2016-04-14,70.44
2016-04-15,70.45
2016-04-18,70.52
2016-04-19,70.47
2016-04-20,70.46
2016-04-21,70.83
2016-04-22,71.17
2016-04-25,70.52
2016-04-26,71.57
2016-04-27,70.92
2016-04-28,70.26
2016-04-29,70.46
2016-05-02,69.22
2016-05-03,69.87
2016-05-04,67.96
2016-05-05,68.12
2016-05-06,67.39
2016-05-09,68.05
2016-05-10,67.51
2016-05-11,66.45
2016-05-12,65.44
2016-05-13,65.51
2016-05-16,66.19
2016-05-17,65.04
2016-05-18,65.36
2016-05-19,64.62
2016-05-20,65.08
2016-05-23,65.85
2016-05-24,66.37
2016-05-25,65.98
2016-05-26,65.37
2016-05-27,66.2
2016-05-31,66.25
2016-06-01,66.4
2016-06-02,67.29
2016-06-03,65.97
2016-06-06,66.2
2016-06-07,66.43
2016-06-08,67.89
2016-06-09,67.42
2016-06-10,66.77
2016-06-13,65.72
2016-06-14,65.38
2016-06-15,64.07
2016-06-16,64.67
2016-06-17,64.46
2016-06-20,65.75
2016-06-21,65.96
2016-06-22,65.53
2016-06-23,65.68
2016-06-24,63.6
2016-06-27,62.42
2016-06-28,63.98
2016-06-29,64.95
2016-06-30,65.77
2016-07-01,65.97
2016-07-05,64.59
2016-07-06,65.13
2016-07-07,65.7
2016-07-08,67.3
2016-07-11,67.54
2016-07-12,67.7
2016-07-13,68.86
2016-07-14,69.03
2016-07-15,68.735
2016-07-18,68.88
2016-07-19,68.12
2016-07-20,68.91
2016-07-21,70.22
2016-07-22,71.23
2016-07-25,70.85
2016-07-26,71.2
2016-07-27,71.25
2016-07-28,71.14
2016-07-29,68.47
2016-08-01,65.72
2016-08-02,62.62
2016-08-03,61.15
2016-08-04,59.1
2016-08-05,59.26
2016-08-08,58.76
2016-08-09,58.55
2016-08-10,58.41
2016-08-11,58.61
2016-08-12,59.03
2016-08-15,59.35
2016-08-16,57.89
2016-08-17,57.75
2016-08-18,58.47
2016-08-19,58.53
2016-08-22,57.96
2016-08-23,57.85
2016-08-24,57.3
2016-08-25,57.24
2016-08-26,56.18
2016-08-29,56.63
2016-08-30,56.92
2016-08-31,57.12
2016-09-01,55.12
2016-09-02,55.75
2016-09-06,54.68
2016-09-07,55.13
2016-09-08,55.09
2016-09-09,54.03
2016-09-12,54.24
2016-09-13,53.19
2016-09-14,52.34
2016-09-15,53.45
2016-09-16,53.85
2016-09-19,53.73
2016-09-20,53.3
2016-09-21,53.91
2016-09-22,54.84
2016-09-23,53.53
2016-09-26,54.15
2016-09-27,54.19
2016-09-28,54.36
2016-09-29,53.92
2016-09-30,53.73
2016-10-03,53.17
2016-10-04,52.56
2016-10-05,53.5
2016-10-06,54.11
2016-10-07,54.48
2016-10-10,55.24
2016-10-11,54.4
2016-10-12,53.91
2016-10-13,53.38
2016-10-14,53.53
2016-10-17,54
2016-10-18,55.32
2016-10-19,55.18
2016-10-20,55.44
2016-10-21,55.28
2016-10-24,54.42
2016-10-25,54.19
2016-10-26,53.43
2016-10-27,52.55
2016-10-28,51.72
2016-10-31,51.45
2016-11-01,50
2016-11-02,50.55
2016-11-03,49.9
2016-11-04,49.9
2016-11-07,51.75
2016-11-08,52.55
2016-11-09,61.9
2016-11-10,64.65
2016-11-11,64.8
2016-11-14,65.45
2016-11-15,65
2016-11-16,65.45
2016-11-17,66
2016-11-18,68.1
2016-11-21,68.9
2016-11-22,70.6
2016-11-23,71.6
2016-11-25,72.4
2016-11-28,71.95
2016-11-29,72.7
2016-11-30,72.8
2016-12-01,72
2016-12-02,71.9
2016-12-05,72.95
2016-12-06,72.95
2016-12-07,74
2016-12-08,75.15
2016-12-09,75.75
2016-12-12,76.2
2016-12-13,76.4
2016-12-14,75.85
2016-12-15,74.9
2016-12-16,74.05
2016-12-19,74.75
2016-12-20,76.15
2016-12-21,75.4
2016-12-22,74.4
2016-12-23,76.5
2016-12-27,76.8
2016-12-28,76
2016-12-29,75.55
2016-12-30,75.25
2017-01-03,76.1
2017-01-04,77.05
2017-01-05,76.25
2017-01-06,76.2
2017-01-09,76.15
2017-01-10,77.55
2017-01-11,77.95
2017-01-12,78.35
2017-01-13,78.75
2017-01-17,76.6
2017-01-18,76.1
2017-01-19,75.75
2017-01-20,75.95
2017-01-23,76.25
2017-01-24,76.4
2017-01-25,76.1
2017-01-26,75.8
2017-01-27,75.75
2017-01-30,73.8
2017-01-31,74.95
2017-02-01,75.8
2017-02-02,75.8
2017-02-03,76.6
2017-02-06,75.25
2017-02-07,75.5
2017-02-08,75.55
2017-02-09,76.25
2017-02-10,76.65
2017-02-13,76.4
2017-02-14,78.45
2017-02-15,78.2
2017-02-16,78.45
2017-02-17,78.4
2017-02-21,79.45
2017-02-22,79.15
2017-02-23,80.1
2017-02-24,74.35
2017-02-27,70.2
2017-02-28,69.15
2017-03-01,69.4
2017-03-02,68.65
2017-03-03,68.5
2017-03-06,67.3
2017-03-07,68.3
2017-03-08,68.45
2017-03-09,68.5
2017-03-10,67.8
2017-03-13,68.05
2017-03-14,66.4
2017-03-15,68.4
2017-03-16,67.3
2017-03-17,67.85
2017-03-20,66.7
2017-03-21,64.75
2017-03-22,64.65
2017-03-23,64.625
2017-03-24,65.65
2017-03-27,66.45
2017-03-28,66.95
2017-03-29,66.6
2017-03-30,69.2
2017-03-31,69.05
2017-04-03,68.65
2017-04-04,67.7
2017-04-05,66.75
2017-04-06,67.1
2017-04-07,66.5
2017-04-10,67.9
2017-04-11,68
2017-04-12,68
2017-04-13,67.95
2017-04-17,68.8
2017-04-18,68.3
2017-04-19,68.4
2017-04-20,69.05
2017-04-21,70.7
2017-04-24,71.45
2017-04-25,71.7
2017-04-26,71.4
2017-04-27,70.4
2017-04-28,68.8
2017-05-01,68.25
2017-05-02,69.45
2017-05-03,68.3
2017-05-04,70.3
2017-05-05,71.05
2017-05-08,71.3
2017-05-09,71.6
2017-05-10,71.35
2017-05-11,70.85
2017-05-12,70.45
2017-05-15,71.5
2017-05-16,70.95
2017-05-17,68.7
2017-05-18,68.05
2017-05-19,68.05
2017-05-22,69.85
2017-05-23,69.8
2017-05-24,70.2
2017-05-25,69.4
2017-05-26,69.85
2017-05-30,68.7
2017-05-31,68.75
2017-06-01,69.75
2017-06-02,70.2
2017-06-05,69.7
2017-06-06,69.2
2017-06-07,69.15
2017-06-08,70.4
2017-06-09,72.15
2017-06-12,73.15
2017-06-13,73.05
2017-06-14,73.15
2017-06-15,72.05
2017-06-16,72.3
2017-06-19,72.4
2017-06-20,72.5
2017-06-21,72
2017-06-22,73.9
2017-06-23,72.65
2017-06-26,72.6
2017-06-27,72.9
2017-06-28,73.25
2017-06-29,72.85
2017-06-30,72.9
2017-07-03,73.25
2017-07-05,73.6
2017-07-06,72.1
2017-07-07,73.25
2017-07-10,72.7
2017-07-11,73.15
2017-07-12,73.25
2017-07-13,77.65
2017-07-14,80.1
2017-07-17,79.3
2017-07-18,78.35
2017-07-19,79.15
2017-07-20,80.05
2017-07-21,79.85
2017-07-24,80.25
2017-07-25,81.25
2017-07-26,79.15
2017-07-27,78.8
2017-07-28,75.9
2017-07-31,74.55
2017-08-01,71.95
2017-08-02,72.75
2017-08-03,73.05
2017-08-04,75.15
2017-08-07,78
2017-08-08,77.4
2017-08-09,78.25
2017-08-10,77.3
2017-08-11,79.05
2017-08-14,79.25
2017-08-15,78.45
2017-08-16,78.65
2017-08-17,77.9
2017-08-18,77.2
2017-08-21,77.25
2017-08-22,77.95
2017-08-23,77.675
2017-08-24,78.45
2017-08-25,78.5
2017-08-28,78.15
2017-08-29,77.1
2017-08-30,77.75
2017-08-31,80.9
2017-09-01,80.75
2017-09-05,80.05
2017-09-06,80.05
2017-09-07,80.45
2017-09-08,81.95
2017-09-11,82.8
2017-09-12,82.9
2017-09-13,82.3
2017-09-14,83.1
2017-09-15,83.75
2017-09-18,82.85
2017-09-19,80.7
2017-09-20,81
2017-09-21,82
2017-09-22,83
2017-09-25,83.2
2017-09-26,84.3
2017-09-27,85.15
2017-09-28,85.7
2017-09-29,86.3
2017-10-02,86.65
2017-10-03,88
2017-10-04,87.9
2017-10-05,86.45
2017-10-06,86.35
2017-10-09,84.95
2017-10-10,84.95
2017-10-11,85.65
2017-10-12,85.8
2017-10-13,83.9
2017-10-16,84.45
2017-10-17,85.2
2017-10-18,85.45
2017-10-19,86.25
2017-10-20,86.95
2017-10-23,84.7
2017-10-24,84.05
2017-10-25,84.5
2017-10-26,84.7
2017-10-27,84.75
2017-10-30,84.4
2017-10-31,85.3
2017-11-01,83.55
2017-11-02,84.75
2017-11-03,85.4
2017-11-06,83
2017-11-07,83.05
2017-11-08,83.05
2017-11-09,83.85
2017-11-10,83.3
2017-11-13,83.65
2017-11-14,83.5
2017-11-15,81.1
2017-11-16,82.55
2017-11-17,82
2017-11-20,82.7
2017-11-21,83.3
2017-11-22,83.65
2017-11-24,83.35
2017-11-27,83.45
2017-11-28,83.45
2017-11-29,84.65
2017-11-30,84.5
2017-12-01,89.3
2017-12-04,95.25
2017-12-05,95.7
2017-12-06,96.4
2017-12-07,98.3
2017-12-08,98.5
2017-12-11,97.35
2017-12-12,96.9
2017-12-13,96.95
2017-12-14,95.25
2017-12-15,95.8
2017-12-18,98.15
2017-12-19,98.9
2017-12-20,98.75
2017-12-21,98.45
2017-12-22,98.6
2017-12-26,98.4
2017-12-27,98.1
2017-12-28,98.3
2017-12-29,96.55
2018-01-02,96.9
2018-01-03,97.5
2018-01-04,97.5
2018-01-05,99
2018-01-08,96.5
2018-01-09,96.6
2018-01-10,95.95
2018-01-11,98.85
2018-01-12,98.25
2018-01-16,99.65
2018-01-17,99.05
2018-01-18,98.15
2018-01-19,100.8
2018-01-22,102.05
2018-01-23,101.4
2018-01-24,101.25
2018-01-25,100.75
2018-01-26,101.4
2018-01-29,101.65
2018-01-30,100
2018-01-31,99.6
2018-02-01,100.3
2018-02-02,98.55
2018-02-05,94.3
2018-02-06,95.7
2018-02-07,96.75
2018-02-08,94.15
2018-02-09,93.45
2018-02-12,94.45
2018-02-13,94.1
2018-02-14,94.75
2018-02-15,96.05
2018-02-16,97.6
2018-02-20,95
2018-02-21,96.4
2018-02-22,94.65
2018-02-23,96.45
2018-02-26,96.95
2018-02-27,100.25
2018-02-28,100.9
2018-03-01,100.85
2018-03-02,101.75
2018-03-05,99.45
2018-03-06,105.6
2018-03-07,104
2018-03-08,108.75
2018-03-09,104.65
2018-03-12,106.55
2018-03-13,103.5
2018-03-14,104.35
2018-03-15,108.45
2018-03-16,108.25
2018-03-19,107.95
2018-03-20,105.2
2018-03-21,106.85
2018-03-22,104.75
2018-03-23,104.35
2018-03-26,106.4
2018-03-27,106.5
2018-03-28,107
2018-03-29,107.1
2018-04-02,102.85
2018-04-03,106
2018-04-04,107.9
2018-04-05,109.7
2018-04-06,107.05
2018-04-09,107.25
2018-04-10,107.95
2018-04-11,107.7
2018-04-12,108.65
2018-04-13,108.45
2018-04-16,108.8
2018-04-17,110.55
2018-04-18,111
2018-04-19,110.5
2018-04-20,110.2
2018-04-23,110.05
2018-04-24,111.1
2018-04-25,92.7
2018-04-26,81.55
2018-04-27,81.4
2018-04-30,83.85
2018-05-01,86.65
2018-05-02,88.95
2018-05-03,85.85
2018-05-04,86.1
2018-05-07,85.8
2018-05-08,85.7
2018-05-09,84.95
2018-05-10,86.3
2018-05-11,87.1
2018-05-14,87.45
2018-05-15,89.6
2018-05-16,89.05
2018-05-17,91.1
2018-05-18,91.55
2018-05-21,90.2
2018-05-22,89.45
2018-05-23,89.15
2018-05-24,89.05
2018-05-25,90.35
2018-05-29,89.8
2018-05-30,92.1
2018-05-31,91.45
2018-06-01,92.55
2018-06-04,92.85
2018-06-05,91.25
2018-06-06,93.8
2018-06-07,92.85
2018-06-08,94.15
2018-06-11,95.55
2018-06-12,92.95
2018-06-13,92.55
2018-06-14,92.9
2018-06-15,93.8
2018-06-18,95.75
2018-06-19,97.9
2018-06-20,99.6
2018-06-21,98.2
2018-06-22,99.3
2018-06-25,98.25
2018-06-26,98.1
2018-06-27,97.45
2018-06-28,96
2018-06-29,95.95
2018-07-02,96.5
2018-07-03,97.55
2018-07-05,98.05
2018-07-06,98.2
2018-07-09,98.95
2018-07-10,99.05
2018-07-11,98.6
2018-07-12,98.95
2018-07-13,99.1
2018-07-16,96.9
2018-07-17,94.9
2018-07-18,95.35
2018-07-19,95.45
2018-07-20,91.9
2018-07-23,93.3
2018-07-24,91.3
2018-07-25,91.25
2018-07-26,91
2018-07-27,72
2018-07-30,72
2018-07-31,72.75
2018-08-01,75.5
2018-08-02,75.9
2018-08-03,75.05
2018-08-06,74.85
2018-08-07,75.05
2018-08-08,75.55
2018-08-09,75.9
2018-08-10,75.6
2018-08-13,75.7
2018-08-14,75.85
2018-08-15,75.2
2018-08-16,74.85
2018-08-17,74.55
2018-08-20,74.05
2018-08-21,75.4
2018-08-22,75.7
2018-08-23,75.05
2018-08-24,75.1
2018-08-27,75.95
2018-08-28,75.1
2018-08-29,74.7
2018-08-30,73.65
2018-08-31,73.5
2018-09-04,73.7
2018-09-05,73.9
2018-09-06,75.5
2018-09-07,76.3
2018-09-10,73.85
2018-09-11,74.7
2018-09-12,74.35
2018-09-13,75.2
2018-09-14,75.25
2018-09-17,73.95
2018-09-18,72.85
2018-09-19,73
2018-09-20,73.45
2018-09-21,73.5
2018-09-24,72.55
2018-09-25,71.65
2018-09-26,70.7
2018-09-27,71.75
2018-09-28,72.05
2018-10-01,72.73
2018-10-02,71.69
2018-10-03,71.25
2018-10-04,70.11
2018-10-05,69.74
2018-10-08,70.81
2018-10-09,70.79
2018-10-10,70.36
2018-10-11,66.89
2018-10-12,67.31
2018-10-15,66.62
2018-10-16,69.92
2018-10-17,68.85
2018-10-18,67.6
2018-10-19,66.78
2018-10-22,65.99
2018-10-23,66.2
2018-10-24,63.01
2018-10-25,64.17
2018-10-26,63.36
2018-10-29,62.95
2018-10-30,64.3
2018-10-31,65.06
2018-11-01,66.33
2018-11-02,67.32
2018-11-05,69.6
2018-11-06,69.86
2018-11-07,62.89
2018-11-08,64.15
2018-11-09,63.59
2018-11-12,62.46
2018-11-13,58.26
2018-11-14,56.6
2018-11-15,56.24
2018-11-16,56.06
2018-11-19,54.4
2018-11-20,53.74
2018-11-21,54.44
2018-11-23,54.16
2018-11-26,54.72
2018-11-27,53.42
2018-11-28,56
2018-11-29,55.01
2018-11-30,54.52
2018-12-03,56.75
2018-12-04,55.15
2018-12-06,55.49
2018-12-07,57.63
2018-12-10,57.9
2018-12-11,60.06
2018-12-12,58.63
2018-12-13,62.56
2018-12-14,59.95
2018-12-17,58.6
2018-12-18,57.51
2018-12-19,56.06
2018-12-20,55.55
2018-12-21,54.5
2018-12-24,53.97
2018-12-26,56.13
2018-12-27,55.79
2018-12-28,56.31
2018-12-31,56.89
2019-01-02,55.8
2019-01-03,55.25
2019-01-04,57.53
2019-01-07,59.96
2019-01-08,60.91
2019-01-09,61.01
2019-01-10,60.7
2019-01-11,60.87
2019-01-14,59.18
2019-01-15,61.06
2019-01-16,61.6
2019-01-17,62.2
2019-01-18,62.34
2019-01-22,61.25
2019-01-23,61.87
2019-01-24,63.47
2019-01-25,64.78
2019-01-28,64.77
2019-01-29,65.36
2019-01-30,65.9
2019-01-31,65.16
2019-02-01,63.52
2019-02-04,63.49
2019-02-05,63.8
2019-02-06,64.07
2019-02-07,63.22
2019-02-08,62.23
2019-02-11,62.04
2019-02-12,63.23
2019-02-13,63.5
2019-02-14,63.5
2019-02-15,64.82
2019-02-19,65.02
2019-02-20,72.45
2019-02-21,70.5
2019-02-22,72.68
2019-02-25,71.15
2019-02-26,68.9
2019-02-27,67
2019-02-28,68.11
2019-03-01,69.42
2019-03-04,68.33
2019-03-05,66.57
2019-03-06,63.82
2019-03-07,62.45
2019-03-08,64.23
2019-03-11,64.33
2019-03-12,63.72
2019-03-13,63.93
2019-03-14,64.5
2019-03-15,64.47
2019-03-18,67.2
2019-03-19,66.57
2019-03-20,65.01
2019-03-21,66.15
2019-03-22,64.63
2019-03-25,64.44
2019-03-26,64.05
2019-03-27,65.28
2019-03-28,65.22
2019-03-29,65.92
2019-04-01,65.86
2019-04-02,64.89
2019-04-03,65.07
2019-04-04,65.88
2019-04-05,66.5
2019-04-08,66.5
2019-04-09,65.47
2019-04-10,65.78
2019-04-11,64.63
2019-04-12,64.72
2019-04-15,65.44
2019-04-16,63.31
2019-04-17,61.73
2019-04-18,64.8
2019-04-22,64.94
2019-04-23,67.98
2019-04-24,69.2
2019-04-25,69.26
2019-04-26,70.96
2019-04-29,70
2019-04-30,70
2019-05-01,69.18
2019-05-02,67.37
2019-05-03,68.22
2019-05-06,70.68
2019-05-07,70.14
2019-05-08,71.06
2019-05-09,70.63
2019-05-10,70.65
2019-05-13,69.07
2019-05-14,69.63
2019-05-15,69.19
2019-05-16,68.24
2019-05-17,67.75
2019-05-20,68.68
2019-05-21,68.98
2019-05-22,68.45
2019-05-23,67.19
2019-05-24,67.52
2019-05-28,65.34
2019-05-29,66.35
2019-05-30,65.77
2019-05-31,66.03
2019-06-03,65.25
2019-06-04,66.49
2019-06-05,65.63
2019-06-06,65
2019-06-07,65.52
2019-06-10,65.37
2019-06-11,65.25
2019-06-12,64.82
2019-06-13,65.42
2019-06-14,65.57
2019-06-17,66.09
2019-06-18,66.82
2019-06-19,66.96
2019-06-20,66.78
2019-06-21,66.5
2019-06-24,66.135
2019-06-25,65.76
2019-06-26,65.885
2019-06-27,71.405
2019-06-28,73.78
2019-07-01,73.405
2019-07-02,72.955
2019-07-03,73.445
2019-07-04,73.445
2019-07-05,74.08
2019-07-08,72.855
2019-07-09,71.98
2019-07-10,72.97
2019-07-11,71.105
2019-07-12,71.37
2019-07-15,69.68
2019-07-16,70.845
2019-07-17,71.02
2019-07-18,70.95
2019-07-19,70.095
2019-07-22,68.175
2019-07-23,64.15
2019-07-24,67.075
2019-07-25,67.34
2019-07-26,68.655
2019-07-29,67.83
2019-07-30,67.69
2019-07-31,70.5
2019-08-01,69.51
2019-08-02,67.39
2019-08-05,64.88
2019-08-06,67.16
2019-08-07,68.1
2019-08-08,69.34
2019-08-09,69.135
2019-08-12,68.25
2019-08-13,68.925
2019-08-14,68.28
2019-08-15,68.44
2019-08-16,69.68
2019-08-19,68.33
2019-08-20,67.355
2019-08-21,67.865
2019-08-22,66.26
2019-08-23,64.485
2019-08-26,64.47
2019-08-27,61.385
2019-08-28,61.505
2019-08-29,62.65
2019-08-30,63.05
2019-09-02,63.06
2019-09-03,61
2019-09-04,60.5
2019-09-05,61.615
2019-09-06,61.735
2019-09-09,61.6
2019-09-10,63.86
2019-09-11,65.445
2019-09-12,64.72
2019-09-13,63.39
2019-09-16,63.19
2019-09-17,62.155
2019-09-18,61.18
2019-09-19,62.01
2019-09-20,62.175
2019-09-23,63.015
2019-09-24,62.665
2019-09-25,63.29
2019-09-26,62.17
2019-09-27,61.87
2019-09-30,62.18
2019-10-01,60.65
2019-10-02,60.71
2019-10-03,60.11
2019-10-04,60.38
2019-10-07,59.49
2019-10-08,58.14
2019-10-09,58.42
2019-10-10,58.33
2019-10-11,59.54
2019-10-14,58.205
2019-10-15,61.07
2019-10-16,61.16
2019-10-17,62.48
2019-10-18,62.36
2019-10-21,61.415
2019-10-22,63.24
2019-10-23,62.615
2019-10-24,62.67
2019-10-25,64.06
2019-10-28,64.49
2019-10-29,64.76
2019-10-30,65.24
2019-10-31,64.63
2019-11-01,67.085
2019-11-04,69.04
2019-11-05,67.595
2019-11-06,67.745
2019-11-07,67.96
2019-11-08,69.05
2019-11-11,69.17
2019-11-12,69.355
2019-11-13,71.155
2019-11-14,70.675
2019-11-15,72.5
2019-11-18,72.32
2019-11-19,74.94
2019-11-20,76.1
2019-11-21,76.735
2019-11-22,77.2
2019-11-25,79.47
