date,close
2014-06-13,11.76
2014-06-16,11.77
2014-06-17,11.43
2014-06-18,11.68
2014-06-19,12.32
2014-06-20,12.59
2014-06-23,12.7
2014-06-24,12.65
2014-06-25,12.616
2014-06-26,12.74
2014-06-27,12.8
2014-06-30,12.88
2014-07-01,12.94
2014-07-02,13.05
2014-07-03,13.18
2014-07-07,13.19
2014-07-08,13.13
2014-07-09,13.17
2014-07-10,13.1
2014-07-11,13.09
2014-07-14,12.99
2014-07-15,13
2014-07-16,13
2014-07-17,12.84
2014-07-18,12.75
2014-07-21,12.92
2014-07-22,12.84
2014-07-23,13.09
2014-07-24,13.79
2014-07-25,13.57
2014-07-28,13.49
2014-07-29,12.52
2014-07-30,12.11
2014-07-31,11.89
2014-08-01,11.5
2014-08-04,11.68
2014-08-05,11.63
2014-08-06,11.43
2014-08-07,11.26
2014-08-08,11.62
2014-08-11,11.66
2014-08-12,12.05
2014-08-13,11.98
2014-08-14,12.52
2014-08-15,12.7
2014-08-18,12.92
2014-08-19,12.95
2014-08-20,13.46
2014-08-21,13.57
2014-08-22,13.68
2014-08-25,13.94
2014-08-26,13.87
2014-08-27,14.17
2014-08-28,14.07
2014-08-29,13.9
2014-09-02,12.79
2014-09-03,12.64
2014-09-04,12.55
2014-09-05,12.95
2014-09-08,13.88
2014-09-09,14.38
2014-09-10,14.73
2014-09-11,14.4
2014-09-12,15.48
2014-09-15,15.87
2014-09-16,16.07
2014-09-17,16.37
2014-09-18,16.61
2014-09-19,16.77
2014-09-22,16.87
2014-09-23,16.86
2014-09-24,16.71
2014-09-25,16.8
2014-09-26,17.36
2014-09-29,18.05
2014-09-30,18.59
2014-10-01,18.43
2014-10-02,17.77
2014-10-03,18.48
2014-10-06,18.29
2014-10-07,18.39
2014-10-08,17.9
2014-10-09,17.78
2014-10-10,17.98
2014-10-13,17.37
2014-10-14,17.1
2014-10-15,16.46
2014-10-16,16.78
2014-10-17,17.36
2014-10-20,17.45
2014-10-21,18.9
2014-10-22,20.73
2014-10-23,21.42
2014-10-24,22.29
2014-10-27,20.65
2014-10-28,21.74
2014-10-29,21.64
2014-10-30,21.05
2014-10-31,20.74
2014-11-03,20.92
2014-11-04,20.81
2014-11-05,20.92
2014-11-06,21.14
2014-11-07,21.44
2014-11-10,22.32
2014-11-11,23.03
2014-11-12,22.79
2014-11-13,22.17
2014-11-14,22
2014-11-17,22.89
2014-11-18,22.51
2014-11-19,23.42
2014-11-20,24.66
2014-11-21,24.48
2014-11-24,25.08
2014-11-25,25.77
2014-11-26,27.13
2014-11-28,26.28
2014-12-01,26
2014-12-02,26.76
2014-12-03,26.29
2014-12-04,26.52
2014-12-05,26.31
2014-12-08,25.28
2014-12-09,25.26
2014-12-10,24.46
2014-12-11,28.04
2014-12-12,27.89
2014-12-15,26.71
2014-12-16,27.07
2014-12-17,26.78
2014-12-18,27
2014-12-19,26.2
2014-12-22,26.63
2014-12-23,26.13
2014-12-24,26.18
2014-12-26,26.66
2014-12-29,26.61
2014-12-30,26.96
2014-12-31,27.11
2015-01-02,27.8
2015-01-05,28.74
2015-01-06,26.68
2015-01-07,28.05
2015-01-08,27.9
2015-01-09,28.31
2015-01-12,28.61
2015-01-13,27.31
2015-01-14,27.68
2015-01-15,27.25
2015-01-16,27.77
2015-01-20,26.06
2015-01-21,24.76
2015-01-22,24.85
2015-01-23,28.17
2015-01-26,28.96
2015-01-27,29.76
2015-01-28,29.26
2015-01-29,28.6
2015-01-30,28.3
2015-02-02,28.73
2015-02-03,29.02
2015-02-04,29.82
2015-02-05,29.04
2015-02-06,27.77
2015-02-09,27.39
2015-02-10,27.79
2015-02-11,28.33
2015-02-12,29.77
2015-02-13,29.64
2015-02-17,29.42
2015-02-18,29.1
2015-02-19,30.2
2015-02-20,29.65
2015-02-23,30
2015-02-24,31.17
2015-02-25,31.83
2015-02-26,31.74
2015-02-27,31.85
2015-03-02,30.73
2015-03-03,30.79
2015-03-04,30.52
2015-03-05,31.08
2015-03-06,31.58
2015-03-09,31.53
2015-03-10,30.91
2015-03-11,35.65
2015-03-12,36.59
2015-03-13,36.55
2015-03-16,34.71
2015-03-17,34.87
2015-03-18,34.6
2015-03-19,34.73
2015-03-20,35.02
2015-03-23,34.15
2015-03-24,34.66
2015-03-25,32.89
2015-03-26,32.63
2015-03-27,32.96
2015-03-30,32.88
2015-03-31,33.16
2015-04-01,33.16
2015-04-02,32.63
2015-04-06,31.9
2015-04-07,31.7
2015-04-08,32.31
2015-04-09,32.05
2015-04-10,32.75
2015-04-13,33.44
2015-04-14,32.17
2015-04-15,32.87
2015-04-16,32.49
2015-04-17,32.285
2015-04-20,33.49
2015-04-21,34.36
2015-04-22,34.35
2015-04-23,35.59
2015-04-24,33.15
2015-04-27,33.23
2015-04-28,32.39
2015-04-29,31.7
2015-04-30,30.47
2015-05-01,31.52
2015-05-04,30.83
2015-05-05,29.77
2015-05-06,29.34
2015-05-07,30.18
2015-05-08,31.24
2015-05-11,32.33
2015-05-12,29.97
2015-05-13,28.99
2015-05-14,29.26
2015-05-15,29.31
2015-05-18,30.16
2015-05-19,30.15
2015-05-20,30.46
2015-05-21,30.78
2015-05-22,30.47
2015-05-26,30.62
2015-05-27,31.11
2015-05-28,31.87
2015-05-29,30.91
2015-06-01,29.07
2015-06-02,29.49
2015-06-03,30.29
2015-06-04,29.92
2015-06-05,31.21
2015-06-08,30.51
2015-06-09,29.5
2015-06-10,29.83
2015-06-11,30.32
2015-06-12,29.74
2015-06-15,30.17
2015-06-16,29.45
2015-06-17,27.69
2015-06-18,26.87
2015-06-19,27.25
2015-06-22,27.98
2015-06-23,28.16
2015-06-24,26.31
2015-06-25,25.67
2015-06-26,25.47
2015-06-29,24.73
2015-06-30,25.06
2015-07-01,24.82
2015-07-02,23.82
2015-07-06,24.27
2015-07-07,24.27
2015-07-08,23.77
2015-07-09,24.49
2015-07-10,25.77
2015-07-13,26.76
2015-07-14,26.41
2015-07-15,25.81
2015-07-16,25.9
2015-07-17,25.84
2015-07-20,25.475
2015-07-21,26.26
2015-07-22,25.27
2015-07-23,23.2
2015-07-24,22.07
2015-07-27,22.31
2015-07-28,22.92
2015-07-29,23.89
2015-07-30,23.8
2015-07-31,23.61
2015-08-03,23.92
2015-08-04,24.4
2015-08-05,24.02
2015-08-06,24.82
2015-08-07,24.14
2015-08-10,25.76
2015-08-11,24.84
2015-08-12,25.27
2015-08-13,24.5
2015-08-14,25.72
2015-08-17,25.77
2015-08-18,25.26
2015-08-19,24.74
2015-08-20,23.58
2015-08-21,22.53
2015-08-24,21.51
2015-08-25,21.55
2015-08-26,22.46
2015-08-27,23.34
2015-08-28,23.51
2015-08-31,23.59
2015-09-01,22.42
2015-09-02,22.78
2015-09-03,22.69
2015-09-04,22.59
2015-09-08,22.58
2015-09-09,22.24
2015-09-10,22.6
2015-09-11,22.82
2015-09-14,21.74
2015-09-15,22.25
2015-09-16,23.08
2015-09-17,23.79
2015-09-18,22.84
2015-09-21,22.3
2015-09-22,21.52
2015-09-23,20.91
2015-09-24,19.1
2015-09-25,19.28
2015-09-28,18.33
2015-09-29,17.8
2015-09-30,17.97
2015-10-01,18.44
2015-10-02,18.71
2015-10-05,19.45
2015-10-06,19.51
2015-10-07,21.34
2015-10-08,21.84
2015-10-09,22.39
2015-10-12,20.94
2015-10-13,20.43
2015-10-14,20.61
2015-10-15,19.99
2015-10-16,22.52
2015-10-19,20.59
2015-10-20,21.57
2015-10-21,20.8
2015-10-22,20.7
2015-10-23,21.03
2015-10-26,20.17
2015-10-27,18.79
2015-10-28,19.34
2015-10-29,19.12
2015-10-30,19.3
2015-11-02,20.09
2015-11-03,19.87
2015-11-04,19.92
2015-11-05,20.64
2015-11-06,21.88
2015-11-09,20.49
2015-11-10,20.29
2015-11-11,20.95
2015-11-12,19.85
2015-11-13,19.57
2015-11-16,19.14
2015-11-17,19.5
2015-11-18,20.22
2015-11-19,21.1
2015-11-20,20.62
2015-11-23,20.77
2015-11-24,20.35
2015-11-25,20.46
2015-11-27,21.18
2015-11-30,21.01
2015-12-01,21.4
2015-12-02,20.44
2015-12-03,19.33
2015-12-04,19.4
2015-12-07,18.89
2015-12-08,17.79
2015-12-09,18.05
2015-12-10,18.98
2015-12-11,18.42
2015-12-14,18.49
2015-12-15,18.09
2015-12-16,18.16
2015-12-17,18.96
2015-12-18,17.5
2015-12-21,17.16
2015-12-22,17.57
2015-12-23,17.95
2015-12-24,18.36
2015-12-28,18.22
2015-12-29,18.26
2015-12-30,18.39
2015-12-31,18.89
2016-01-04,18.3
2016-01-05,18.14
2016-01-06,17.91
2016-01-07,17.4
2016-01-08,16.39
2016-01-11,16.24
2016-01-12,16.17
2016-01-13,14.82
2016-01-14,15.31
2016-01-15,15.25
2016-01-19,14.62
2016-01-20,14.91
2016-01-21,15.7
2016-01-22,16.02
2016-01-25,16.05
2016-01-26,17.74
2016-01-27,17.84
2016-01-28,17.97
2016-01-29,19.53
2016-02-01,19.87
2016-02-02,19.11
2016-02-03,20
2016-02-04,20.82
2016-02-05,21.05
2016-02-08,21.24
2016-02-09,21.87
2016-02-10,21.43
2016-02-11,21.41
2016-02-12,22.02
2016-02-16,22.28
2016-02-17,22.43
2016-02-18,21.88
2016-02-19,22.07
2016-02-22,22.37
2016-02-23,21.66
2016-02-24,22.06
2016-02-25,21.68
2016-02-26,22.18
2016-02-29,22.16
2016-03-01,22.37
2016-03-02,22.065
2016-03-03,21.48
2016-03-04,21.87
2016-03-07,21.9
2016-03-08,20.2
2016-03-09,20.94
2016-03-10,20.8
2016-03-11,21.68
2016-03-14,19.77
2016-03-15,19.63
2016-03-16,20.18
2016-03-17,20.92
2016-03-18,21.6
2016-03-21,21.76
2016-03-22,21.8
2016-03-23,23.19
2016-03-24,23.66
2016-03-28,23.38
2016-03-29,25.73
2016-03-30,24.68
2016-03-31,24.19
2016-04-01,23.83
2016-04-04,23.29
2016-04-05,22.96
2016-04-06,23.1
2016-04-07,22.26
2016-04-08,22.41
2016-04-11,21.5
2016-04-12,21.9
2016-04-13,23.07
2016-04-14,22.65
2016-04-15,22.57
2016-04-18,22.74
2016-04-19,23.42
2016-04-20,23.54
2016-04-21,22.5
2016-04-22,22.66
2016-04-25,22.1
2016-04-26,23.66
2016-04-27,24.81
2016-04-28,21.69
2016-04-29,19.91
2016-05-02,20.31
2016-05-03,20.33
2016-05-04,20.23
2016-05-05,20.22
2016-05-06,20.32
2016-05-09,20.4
2016-05-10,20.52
2016-05-11,20.38
2016-05-12,20.02
2016-05-13,19.78
2016-05-16,19.45
2016-05-17,19.67
2016-05-18,18.94
2016-05-19,19.37
2016-05-20,19.84
2016-05-23,19.36
2016-05-24,19.75
2016-05-25,20.6
2016-05-26,20.81
2016-05-27,21.21
2016-05-31,21.34
2016-06-01,22.19
2016-06-02,21.35
2016-06-03,21.92
2016-06-06,22.67
2016-06-07,23.03
2016-06-08,23.32
2016-06-09,23.01
2016-06-10,22.56
2016-06-13,22.53
2016-06-14,22.18
2016-06-15,22.45
2016-06-16,22.78
2016-06-17,22.7
2016-06-20,23.21
2016-06-21,21.97
2016-06-22,18.34
2016-06-23,18.36
2016-06-24,18.01
2016-06-27,16.82
2016-06-28,16.69
2016-06-29,17.8
2016-06-30,18.07
2016-07-01,18.36
2016-07-05,17.84
2016-07-06,18.04
2016-07-07,18.04
2016-07-08,19.16
2016-07-11,19.57
2016-07-12,19.82
2016-07-13,20.76
2016-07-14,20.86
2016-07-15,21.18
2016-07-18,20.83
2016-07-19,20.18
2016-07-20,20.03
2016-07-21,19.83
2016-07-22,21.11
2016-07-25,20.29
2016-07-26,20.49
2016-07-27,20.35
2016-07-28,21.46
2016-07-29,22.53
2016-08-01,22.5
2016-08-02,22.22
2016-08-03,22.31
2016-08-04,22.21
2016-08-05,23.16
2016-08-08,23.04
2016-08-09,22.73
2016-08-10,22.46
2016-08-11,22.54
2016-08-12,21.96
2016-08-15,20.22
2016-08-16,19.68
2016-08-17,19.93
2016-08-18,19.83
2016-08-19,20.27
2016-08-22,19.91
2016-08-23,20.13
2016-08-24,19.91
2016-08-25,18.94
2016-08-26,18.9
2016-08-29,18.89
2016-08-30,19.31
2016-08-31,19.28
2016-09-01,19.76
2016-09-02,19.92
2016-09-06,19.57
2016-09-07,19.76
2016-09-08,20.04
2016-09-09,18.92
2016-09-12,19.08
2016-09-13,18.6
2016-09-14,18.74
2016-09-15,19.34
2016-09-16,19.41
2016-09-19,19.96
2016-09-20,19.42
2016-09-21,19.6
2016-09-22,19.88
2016-09-23,19.69
2016-09-26,19.07
2016-09-27,18.7
2016-09-28,19.37
2016-09-29,19.45
2016-09-30,19.33
2016-10-03,19.1
2016-10-04,18.59
2016-10-05,18.66
2016-10-06,18.55
2016-10-07,18.06
2016-10-10,18.12
2016-10-11,18
2016-10-12,17.73
2016-10-13,14.85
2016-10-14,15.23
2016-10-17,14.97
2016-10-18,15.15
2016-10-19,14.98
2016-10-20,15.97
2016-10-21,16.03
2016-10-24,16.18
2016-10-25,16.36
2016-10-26,16.2
2016-10-27,16.43
2016-10-28,15.91
2016-10-31,15.99
2016-11-01,16.15
2016-11-02,16.25
2016-11-03,16.5
2016-11-04,17.17
2016-11-07,17.71
2016-11-08,17.92
2016-11-09,18.29
2016-11-10,18.91
2016-11-11,19.01
2016-11-14,19.72
2016-11-15,19.83
2016-11-16,19.17
2016-11-17,19.22
2016-11-18,19.21
2016-11-21,18.99
2016-11-22,19.25
2016-11-23,20.07
2016-11-25,20.39
2016-11-28,20.48
2016-11-29,20.68
2016-11-30,20.73
2016-12-01,21.13
2016-12-02,20.84
2016-12-05,20.92
2016-12-06,20.79
2016-12-07,21.74
2016-12-08,22.21
2016-12-09,22.12
2016-12-12,21.45
2016-12-13,20.92
2016-12-14,20.55
2016-12-15,20.41
2016-12-16,20.21
2016-12-19,19.55
2016-12-20,20.23
2016-12-21,20.34
2016-12-22,20.05
2016-12-23,20.11
2016-12-27,20.23
2016-12-28,19.73
2016-12-29,19.6
2016-12-30,19.34
2017-01-03,20.61
2017-01-04,19.77
2017-01-05,18.31
2017-01-06,18.91
2017-01-09,18.52
2017-01-10,19.27
2017-01-11,19.58
2017-01-12,20.01
2017-01-13,20.49
2017-01-17,19.72
2017-01-18,19.68
2017-01-19,19.52
2017-01-20,19.56
2017-01-23,19.65
2017-01-24,19.96
2017-01-25,20.08
2017-01-26,20.38
2017-01-27,21.49
2017-01-30,21.78
2017-01-31,21.53
2017-02-01,22.06
2017-02-02,21.64
2017-02-03,21.96
2017-02-06,21.79
2017-02-07,21.26
2017-02-08,20.67
2017-02-09,20.27
2017-02-10,20.55
2017-02-13,20.63
2017-02-14,19.95
2017-02-15,20.16
2017-02-16,20.07
2017-02-17,19.98
2017-02-21,20.36
2017-02-22,20.33
2017-02-23,20.01
2017-02-24,20.06
2017-02-27,20.16
2017-02-28,20.04
2017-03-01,20.64
2017-03-02,19.77
2017-03-03,19.62
2017-03-06,18.92
2017-03-07,18.31
2017-03-08,18.59
2017-03-09,18.64
2017-03-10,18.86
2017-03-13,18.65
2017-03-14,18.63
2017-03-15,19.22
2017-03-16,19.8
2017-03-17,19.35
2017-03-20,18.26
2017-03-21,17.77
2017-03-22,17.92
2017-03-23,17.98
2017-03-24,17.89
2017-03-27,17.91
2017-03-28,18.86
2017-03-29,18.38
2017-03-30,18.46
2017-03-31,18.8
2017-04-03,17.99
2017-04-04,17.99
2017-04-05,17.92
2017-04-06,17.93
2017-04-07,17.95
2017-04-10,18.76
2017-04-11,18.19
2017-04-12,17.16
2017-04-13,17.29
2017-04-17,17.33
2017-04-18,17.36
2017-04-19,17.13
2017-04-20,17.06
2017-04-21,19.28
2017-04-24,19.98
2017-04-25,18.55
2017-04-26,18.22
2017-04-27,18.75
2017-04-28,18.73
2017-05-01,18.95
2017-05-02,18.9
2017-05-03,18.52
2017-05-04,18.68
2017-05-05,18.16
2017-05-08,17.71
2017-05-09,17.49
2017-05-10,17.33
2017-05-11,17.12
2017-05-12,16.68
2017-05-15,16.95
2017-05-16,16.92
2017-05-17,16.23
2017-05-18,16.59
2017-05-19,16.93
2017-05-22,16.92
2017-05-23,17.96
2017-05-24,17.68
2017-05-25,17.58
2017-05-26,17.61
2017-05-30,18.14
2017-05-31,18.42
2017-06-01,18.55
2017-06-02,18.27
2017-06-05,18.215
2017-06-06,17.71
2017-06-07,18.69
2017-06-08,18.62
2017-06-09,18.75
2017-06-12,18.64
2017-06-13,18.75
2017-06-14,19.21
2017-06-15,18.98
2017-06-16,18.73
2017-06-19,19.06
2017-06-20,18.73
2017-06-21,18.5
2017-06-22,17.93
2017-06-23,17.81
2017-06-26,18
2017-06-27,17.76
2017-06-28,17.81
2017-06-29,17.75
2017-06-30,17.53
2017-07-03,18.19
2017-07-05,18.32
2017-07-06,17.6
2017-07-07,17.3
2017-07-10,16.51
2017-07-11,16
2017-07-12,16.61
2017-07-13,16.68
2017-07-14,16.68
2017-07-17,16.99
2017-07-18,16.73
2017-07-19,16.54
2017-07-20,16.93
2017-07-21,16.95
2017-07-24,16.79
2017-07-25,17.07
2017-07-26,18.99
2017-07-27,17.72
2017-07-28,18.62
2017-07-31,18.75
2017-08-01,18.96
2017-08-02,18.3
2017-08-03,18.44
2017-08-04,19.11
2017-08-07,19.18
2017-08-08,18.96
2017-08-09,18.99
2017-08-10,19.3
2017-08-11,19.55
2017-08-14,21.6
2017-08-15,21.76
2017-08-16,22
2017-08-17,21.17
2017-08-18,21.41
2017-08-21,20.88
2017-08-22,20.58
2017-08-23,20.99
2017-08-24,21.25
2017-08-25,21.84
2017-08-28,22.23
2017-08-29,23.4
2017-08-30,24.16
2017-08-31,24.01
2017-09-01,24.74
2017-09-05,24.96
2017-09-06,25.18
2017-09-07,25.74
2017-09-08,25.83
2017-09-11,25.35
2017-09-12,25.71
2017-09-13,25.32
2017-09-14,24.85
2017-09-15,24.76
2017-09-18,25.36
2017-09-19,25.18
2017-09-20,25.51
2017-09-21,25.72
2017-09-22,26.16
2017-09-25,26.29
2017-09-26,26.49
2017-09-27,27.26
2017-09-28,26.88
2017-09-29,28.98
2017-10-02,28.24
2017-10-03,28.18
2017-10-04,28.05
2017-10-05,28.24
2017-10-06,28.09
2017-10-09,28.18
2017-10-10,28.49
2017-10-11,28.28
2017-10-12,28.91
2017-10-13,28.13
2017-10-16,26.53
2017-10-17,26.63
2017-10-18,26.6
2017-10-19,27.76
2017-10-20,27.34
2017-10-23,28.89
2017-10-24,28.74
2017-10-25,28.5
2017-10-26,28.73
2017-10-27,29.19
2017-10-30,29.01
2017-10-31,29.7
2017-11-01,29.72
2017-11-02,29.85
2017-11-03,29.17
2017-11-06,29.15
2017-11-07,28.33
2017-11-08,28.81
2017-11-09,27.91
2017-11-10,27.995
2017-11-13,28.43
2017-11-14,29
2017-11-15,28.08
2017-11-16,29.19
2017-11-17,29.06
2017-11-20,29.02
2017-11-21,29.69
2017-11-22,29.8
2017-11-24,29.27
2017-11-27,28.5
2017-11-28,28.91
2017-11-29,29.5
2017-11-30,29.96
2017-12-01,28.92
2017-12-04,29.54
2017-12-05,29.8
2017-12-06,29.86
2017-12-07,29.74
2017-12-08,29.61
2017-12-11,28.89
2017-12-12,28.87
2017-12-13,28.78
2017-12-14,27.79
2017-12-15,28.74
2017-12-18,28.81
2017-12-19,28.51
2017-12-20,28.82
2017-12-21,28.7
2017-12-22,28.99
2017-12-26,29.03
2017-12-27,28.84
2017-12-28,28.77
2017-12-29,28.73
2018-01-02,28.1
2018-01-03,27.96
2018-01-04,27.42
2018-01-05,27.09
2018-01-08,27.74
2018-01-09,27.85
2018-01-10,27.32
2018-01-11,28.64
2018-01-12,27.99
2018-01-16,27.55
2018-01-17,27.86
2018-01-18,27.9
2018-01-19,28.86
2018-01-22,28.91
2018-01-23,28.33
2018-01-24,28.45
2018-01-25,28.26
2018-01-26,29.06
2018-01-29,29.52
2018-01-30,28.03
2018-01-31,29.33
2018-02-01,30
2018-02-02,29.4
2018-02-05,29.2
2018-02-06,27.18
2018-02-07,27.72
2018-02-08,26.16
2018-02-09,26
2018-02-12,25.54
2018-02-13,26.83
2018-02-14,26.77
2018-02-15,26.37
2018-02-16,26.25
2018-02-20,25.51
2018-02-21,26.05
2018-02-22,26.86
2018-02-23,26.32
2018-02-26,27.52
2018-02-27,26.29
2018-02-28,25.82
2018-03-01,26.12
2018-03-02,26.96
2018-03-05,25.87
2018-03-06,26.06
2018-03-07,26.4
2018-03-08,26.6
2018-03-09,27.53
2018-03-12,26.93
2018-03-13,27.21
2018-03-14,26.92
2018-03-15,32.05
2018-03-16,31.8
2018-03-19,31.97
2018-03-20,31.83
2018-03-21,32.02
2018-03-22,31.26
2018-03-23,29.92
2018-03-26,30.4
2018-03-27,29.18
2018-03-28,29.52
2018-03-29,29.83
2018-04-02,28.71
2018-04-03,30.44
2018-04-04,30.31
2018-04-05,30.16
2018-04-06,29.02
2018-04-09,28.82
2018-04-10,29.77
2018-04-11,29.65
2018-04-12,29.66
2018-04-13,29.34
2018-04-16,30.67
2018-04-17,30.63
2018-04-18,30.72
2018-04-19,30.3
2018-04-20,29.95
2018-04-23,29.82
2018-04-24,28.86
2018-04-25,28.46
2018-04-26,27.73
2018-04-27,28.23
2018-04-30,27.75
2018-05-01,27.6
2018-05-02,28.11
2018-05-03,27.73
2018-05-04,27.91
2018-05-07,28.18
2018-05-08,28.75
2018-05-09,29.05
2018-05-10,30.29
2018-05-11,31.01
2018-05-14,31.33
2018-05-15,30.75
2018-05-16,30.72
2018-05-17,30.95
2018-05-18,31.31
2018-05-21,31.76
2018-05-22,30.62
2018-05-23,30.66
2018-05-24,30.92
2018-05-25,30.36
2018-05-29,30.61
2018-05-30,31.03
2018-05-31,30.08
2018-06-01,31.41
2018-06-04,30.31
2018-06-05,30.58
2018-06-06,31.44
2018-06-07,31.66
2018-06-08,32.5
2018-06-11,32.7
2018-06-12,33.87
2018-06-13,33.41
2018-06-14,32.6
2018-06-15,33.46
2018-06-18,32.86
2018-06-19,32.15
2018-06-20,32.44
2018-06-21,32.05
2018-06-22,31.98
2018-06-25,31.61
2018-06-26,31.92
2018-06-27,31.14
2018-06-28,30.97
2018-06-29,31.5
2018-07-02,31.32
2018-07-03,31.03
2018-07-05,32.87
2018-07-06,33.02
2018-07-09,33.49
2018-07-10,32.47
2018-07-11,30.58
2018-07-12,30.31
2018-07-13,29.92
2018-07-16,28.36
2018-07-17,29.72
2018-07-18,29.92
2018-07-19,30.6
2018-07-20,30.39
2018-07-23,30.44
2018-07-24,28.44
2018-07-25,28.85
2018-07-26,28.15
2018-07-27,29.1
2018-07-30,28.99
2018-07-31,28.98
2018-08-01,28.79
2018-08-02,29.77
2018-08-03,29.33
2018-08-06,29.96
2018-08-07,30.02
2018-08-08,30.07
2018-08-09,30.36
2018-08-10,31
2018-08-13,30.28
2018-08-14,30.28
2018-08-15,29.82
2018-08-16,30.09
2018-08-17,30.25
2018-08-20,30.66
2018-08-21,30.47
2018-08-22,29.54
2018-08-23,28.8
2018-08-24,28.72
2018-08-27,29.15
2018-08-28,29.39
2018-08-29,30.13
2018-08-30,30.01
2018-08-31,29.87
2018-09-04,30.29
2018-09-05,30.52
2018-09-06,30.42
2018-09-07,30.94
2018-09-10,32.28
2018-09-11,31.29
2018-09-12,31.28
2018-09-13,30.86
2018-09-14,31.18
2018-09-17,30.16
2018-09-18,31.02
2018-09-19,30.79
2018-09-20,30.32
2018-09-21,30.09
2018-09-24,30.57
2018-09-25,30.02
2018-09-26,29.69
2018-09-27,29.09
2018-09-28,29.06
2018-10-01,29.37
2018-10-02,29.17
2018-10-03,29.85
2018-10-04,28.98
2018-10-05,27.53
2018-10-08,27.45
2018-10-09,27.23
2018-10-10,25.71
2018-10-11,25.45
2018-10-12,25.16
2018-10-15,25.2
2018-10-16,26.02
2018-10-17,25.96
2018-10-18,25.14
2018-10-19,25.01
2018-10-22,24.64
2018-10-23,24.19
2018-10-24,25.26
2018-10-25,25.09
2018-10-26,24.44
2018-10-29,25.04
2018-10-30,25.41
2018-10-31,25.03
2018-11-01,25.2
2018-11-02,25.36
2018-11-05,25.24
2018-11-06,25.67
2018-11-07,25.35
2018-11-08,25.19
2018-11-09,23.9
2018-11-12,23.68
2018-11-13,23.66
2018-11-14,23.52
2018-11-15,24.3
2018-11-16,24.24
2018-11-19,24.09
2018-11-20,23.27
2018-11-21,23.1
2018-11-23,22.92
2018-11-26,22.48
2018-11-27,21.77
2018-11-28,22.38
2018-11-29,22.41
2018-11-30,22.78
2018-12-03,22.59
2018-12-04,20.42
2018-12-06,20.25
2018-12-07,20.8
2018-12-10,20.46
2018-12-11,20.69
2018-12-12,20.25
2018-12-13,19.17
2018-12-14,18.77
2018-12-17,18.69
2018-12-18,19.65
2018-12-19,18.84
2018-12-20,19.08
2018-12-21,18.64
2018-12-24,18.64
2018-12-26,19.22
2018-12-27,19.38
2018-12-28,18.91
2018-12-31,19.2
2019-01-02,19.7
2019-01-03,19.4
2019-01-04,19.82
2019-01-07,20.01
2019-01-08,20.4
2019-01-09,20.93
2019-01-10,20.71
2019-01-11,21.06
2019-01-14,21.17
2019-01-15,20.95
2019-01-16,21.45
2019-01-17,21.89
2019-01-18,22.32
2019-01-22,22.23
2019-01-23,22.38
2019-01-24,23.5
2019-01-25,23.84
2019-01-28,23.67
2019-01-29,23.87
2019-01-30,24.19
2019-01-31,23.58
2019-02-01,23.3
2019-02-04,23.58
2019-02-05,23.77
2019-02-06,23.6
2019-02-07,23.64
2019-02-08,23.14
2019-02-11,23.18
2019-02-12,23.63
2019-02-13,23.84
2019-02-14,24.06
2019-02-15,24.28
2019-02-19,24.29
2019-02-20,24.45
2019-02-21,24.46
2019-02-22,24.64
2019-02-25,24.15
2019-02-26,23.74
2019-02-27,23.32
2019-02-28,22.81
2019-03-01,22.98
2019-03-04,22.61
2019-03-05,22.56
2019-03-06,22.47
2019-03-07,22.46
2019-03-08,22.4
2019-03-11,22.98
2019-03-12,22.69
2019-03-13,22.83
2019-03-14,22.33
2019-03-15,21.89
2019-03-18,21.4
2019-03-19,19.61
2019-03-20,19.79
2019-03-21,19.6
2019-03-22,18.88
2019-03-25,18.5
2019-03-26,18.92
2019-03-27,18.69
2019-03-28,19.04
2019-03-29,18.98
2019-04-01,20.04
2019-04-02,20.33
2019-04-03,20.21
2019-04-04,20.12
2019-04-05,20.33
2019-04-08,20.26
2019-04-09,19.99
2019-04-10,19.77
2019-04-11,19.59
2019-04-12,20.4
2019-04-15,19.94
2019-04-16,19.96
2019-04-17,20.36
2019-04-18,20.25
2019-04-22,20.66
2019-04-23,20.68
2019-04-24,20.62
2019-04-25,19.82
2019-04-26,19.13
2019-04-29,20.69
2019-04-30,19.53
2019-05-01,18.66
2019-05-02,18.85
2019-05-03,19.12
2019-05-06,19.1
2019-05-07,18.63
2019-05-08,18.36
2019-05-09,18.58
2019-05-10,18.41
2019-05-13,17.35
2019-05-14,17.72
2019-05-15,17.74
2019-05-16,17.81
2019-05-17,17.36
2019-05-20,17.27
2019-05-21,17.07
2019-05-22,16.8
2019-05-23,16.58
2019-05-24,16.5
2019-05-28,16.1
2019-05-29,15.61
2019-05-30,15.56
2019-05-31,15.02
2019-06-03,15.04
2019-06-04,15.95
2019-06-05,15.35
2019-06-06,14.89
2019-06-07,15.35
2019-06-10,15.73
2019-06-11,15.39
2019-06-12,15.21
2019-06-13,15.625
2019-06-14,15.24
2019-06-17,15.085
2019-06-18,15.18
2019-06-19,14.63
2019-06-20,14.34
2019-06-21,13.67
2019-06-24,13.43
2019-06-25,13.28
2019-06-26,13.36
2019-06-27,13.99
2019-06-28,14.76
2019-07-01,14.78
2019-07-02,14.13
2019-07-03,14.52
2019-07-04,14.52
2019-07-05,14.61
2019-07-08,14.635
2019-07-09,14.27
2019-07-10,14.17
2019-07-11,13.49
2019-07-12,13.895
2019-07-15,14.515
2019-07-16,15.2
2019-07-17,14.675
2019-07-18,14.475
2019-07-19,14.8
2019-07-22,14.74
2019-07-23,14.67
2019-07-24,15.265
2019-07-25,15.54
2019-07-26,16
2019-07-29,16.305
2019-07-30,16.77
2019-07-31,16.85
2019-08-01,15.83
2019-08-02,15.595
2019-08-05,14.51
2019-08-06,14.84
2019-08-07,14.775
2019-08-08,15.29
2019-08-09,14.84
2019-08-12,14.39
2019-08-13,14.44
2019-08-14,14.19
2019-08-15,13.685
2019-08-16,14.125
2019-08-19,14.565
2019-08-20,14.56
2019-08-21,14.8
2019-08-22,14.7
2019-08-23,13.925
2019-08-26,14.08
2019-08-27,13.76
2019-08-28,14.07
2019-08-29,14.34
2019-08-30,14.36
2019-09-02,14.36
2019-09-03,14.16
2019-09-04,14.395
2019-09-05,15.535
2019-09-06,15.37
2019-09-09,17
2019-09-10,18.13
2019-09-11,18.11
2019-09-12,18.37
2019-09-13,17.96
2019-09-16,18
2019-09-17,17.945
2019-09-18,17.685
2019-09-19,17.285
2019-09-20,17.03
2019-09-23,17.06
2019-09-24,16.74
2019-09-25,17.075
2019-09-26,16.77
2019-09-27,16.645
2019-09-30,16.445
2019-10-01,15.86
2019-10-02,15.03
2019-10-03,15
2019-10-04,15.045
2019-10-07,15.3
2019-10-08,14.955
2019-10-09,15.27
2019-10-10,15.095
2019-10-11,15.76
2019-10-14,15.305
2019-10-15,15.53
2019-10-16,15.945
2019-10-17,16.235
2019-10-18,15.67
2019-10-21,16.145
2019-10-22,16.4
2019-10-23,16.285
2019-10-24,16.44
2019-10-25,16.675
2019-10-28,16.96
2019-10-29,16.725
2019-10-30,15.775
2019-10-31,15.395
2019-11-01,15.595
2019-11-04,15.87
2019-11-05,15.8
2019-11-06,15.635
2019-11-07,15.42
2019-11-08,15.15
2019-11-11,15.105
2019-11-12,15.3
2019-11-13,15.13
2019-11-14,14.9
2019-11-15,14.85
2019-11-18,14.25
2019-11-19,13.895
2019-11-20,13.875
2019-11-21,13.76
2019-11-22,13.35
2019-11-25,13.62
