date,close
2017-04-21,16.3281
2017-04-24,16.4074
2017-04-25,16.3678
2017-04-26,16.219
2017-04-27,16.1098
2017-04-28,16.1793
2017-05-01,16.1495
2017-05-02,16.1892
2017-05-03,16.1495
2017-05-04,16.209
2017-05-05,16.3281
2017-05-08,16.4372
2017-05-09,16.3578
2017-05-10,16.2686
2017-05-11,16.2983
2017-05-12,16.4471
2017-05-15,16.2785
2017-05-16,16.338
2017-05-17,16.1198
2017-05-18,16.1396
2017-05-19,16.2289
2017-05-22,16.2289
2017-05-23,16.2983
2017-05-24,16.4273
2017-05-25,16.5959
2017-05-26,16.5166
2017-05-30,16.4967
2017-05-31,16.4967
2017-06-01,16.6654
2017-06-02,16.8638
2017-06-05,16.8836
2017-06-06,16.8638
2017-06-07,16.963
2017-06-08,16.8935
2017-06-09,17.201
2017-06-12,17.449
2017-06-13,17.7169
2017-06-14,17.7268
2017-06-15,17.6772
2017-06-16,17.7367
2017-06-19,17.7665
2017-06-20,17.578
2017-06-21,17.2308
2017-06-22,16.5166
2017-06-23,16.9233
2017-06-26,17.3102
2017-06-27,17.3399
2017-06-28,17.3201
2017-06-29,17.2308
2017-06-30,16.9233
2017-07-03,16.9927
2017-07-05,17.1118
2017-07-06,16.8042
2017-07-07,17.0622
2017-07-10,17.1614
2017-07-11,17.0225
2017-07-12,17.201
2017-07-13,17.2308
2017-07-14,17.2506
2017-07-17,17.1018
2017-07-18,17.0522
2017-07-19,17.1713
2017-07-20,17.1514
2017-07-21,17.0522
2017-07-24,16.9927
2017-07-25,17.2308
2017-07-26,17.1514
2017-07-27,17.1812
2017-07-28,17.082
2017-07-31,17.201
2017-08-01,17.1713
2017-08-02,17.0721
2017-08-03,17.1118
2017-08-04,17.2804
2017-08-07,17.2308
2017-08-08,17.1118
2017-08-09,17.0126
2017-08-10,17.0919
2017-08-11,17.0721
2017-08-14,17.2209
2017-08-15,17.3201
2017-08-16,17.3498
2017-08-17,17.1514
2017-08-18,17.1217
2017-08-21,17.1713
2017-08-22,17.0919
2017-08-23,17.0423
2017-08-24,17.1018
2017-08-25,17.0622
2017-08-28,17.0026
2017-08-29,16.8638
2017-08-30,16.834
2017-08-31,16.7844
2017-09-01,17.0423
2017-09-05,16.9828
2017-09-06,16.953
2017-09-07,16.5562
2017-09-08,16.9828
2017-09-11,17.211
2017-09-12,17.3399
2017-09-13,17.3102
2017-09-14,17.3697
2017-09-15,17.4391
2017-09-18,17.6474
2017-09-19,17.6375
2017-09-20,17.8359
2017-09-21,17.9549
2017-09-22,18.0145
2017-09-25,18.1037
2017-09-26,18.1633
2017-09-27,18.5501
2017-09-28,18.7882
2017-09-29,18.7089
2017-10-02,18.9469
2017-10-03,18.6989
2017-10-04,18.57
2017-10-05,18.7882
2017-10-06,18.818
2017-10-09,18.8775
2017-10-10,18.8676
2017-10-11,18.8279
2017-10-12,18.7287
2017-10-13,18.7089
2017-10-16,18.7485
2017-10-17,18.6593
2017-10-18,18.7188
2017-10-19,18.808
2017-10-20,18.8279
2017-10-23,18.7188
2017-10-24,18.57
2017-10-25,18.6097
2017-10-26,18.5799
2017-10-27,18.6493
2017-10-30,18.5601
2017-10-31,18.57
2017-11-01,18.5898
2017-11-02,19.0957
2017-11-03,19.1552
2017-11-06,19.1255
2017-11-07,18.6295
2017-11-08,18.5005
2017-11-09,18.1037
2017-11-10,18.1732
2017-11-13,18.2029
2017-11-14,18.6692
2017-11-15,18.6593
2017-11-16,18.7287
2017-11-17,18.7882
2017-11-20,18.9469
2017-11-21,19.1949
2017-11-22,19.1354
2017-11-24,18.9965
2017-11-27,19.1255
2017-11-28,19.5024
2017-11-29,19.8893
2017-11-30,19.5719
2017-12-01,19.6711
2017-12-04,19.9092
2017-12-05,19.9191
2017-12-06,19.8496
2017-12-07,19.5322
2017-12-08,19.3636
2017-12-11,19.562
2017-12-12,19.6909
2017-12-13,19.8199
2017-12-14,19.5322
2017-12-15,19.8
2017-12-18,19.9588
2017-12-19,19.8596
2017-12-20,19.433
2017-12-21,19.552
2017-12-22,19.6909
2017-12-26,19.5124
2017-12-27,19.3536
2017-12-28,19.2346
2017-12-29,18.8973
2018-01-02,18.8973
2018-01-03,19.0461
2018-01-04,18.7684
2018-01-05,18.7684
2018-01-08,18.8576
2018-01-09,19.1255
2018-01-10,19.2148
2018-01-11,19.5719
2018-01-12,19.6314
2018-01-16,19.6016
2018-01-17,19.7306
2018-01-18,19.6711
2018-01-19,19.7405
2018-01-22,19.7405
2018-01-23,19.8199
2018-01-24,20.0381
2018-01-25,19.8794
2018-01-26,19.8199
2018-01-29,19.8298
2018-01-30,19.8992
2018-01-31,20.0183
2018-02-01,19.9786
2018-02-02,20.0282
2018-02-05,19.9885
2018-02-06,19.8992
2018-02-07,19.6909
2018-02-08,19.5124
2018-02-09,19.6512
2018-02-12,19.3636
2018-02-13,19.7207
2018-02-14,19.552
2018-02-15,19.81
2018-02-16,19.7108
2018-02-20,19.3933
2018-02-21,19.4826
2018-02-22,19.4528
2018-02-23,19.3834
2018-02-26,19.3437
2018-02-27,19.1354
2018-02-28,19.0362
2018-03-01,19.1751
2018-03-02,19.0957
2018-03-05,19.2842
2018-03-06,19.4429
2018-03-07,19.5322
2018-03-08,19.433
2018-03-09,20.4349
2018-03-12,20.7523
2018-03-13,20.5539
2018-03-14,20.3853
2018-03-15,20.5837
2018-03-16,20.9011
2018-03-19,21.0698
2018-03-20,21.0499
2018-03-21,21.2781
2018-03-22,21.0995
2018-03-23,20.921
2018-03-26,21.7741
2018-03-27,21.2285
2018-03-28,21.0797
2018-03-29,20.8119
2018-04-02,20.5539
2018-04-03,20.425
2018-04-04,20.544
2018-04-05,20.6531
2018-04-06,20.5043
2018-04-09,20.673
2018-04-10,20.6432
2018-04-11,20.425
2018-04-12,20.6135
2018-04-13,20.5738
2018-04-16,20.673
2018-04-17,20.7623
2018-04-18,21.0797
2018-04-19,21.4864
2018-04-20,21.0301
2018-04-23,19.9389
2018-04-24,20.2861
2018-04-25,20.1671
2018-04-26,20.2266
2018-04-27,20.2861
2018-04-30,20.1076
2018-05-01,20.2762
2018-05-02,19.9786
2018-05-03,19.4528
2018-05-04,20.1274
2018-05-07,20.2464
2018-05-08,20.1572
2018-05-09,19.9786
2018-05-10,20.1177
2018-05-11,20.0183
2018-05-14,19.9091
2018-05-15,19.7203
2018-05-16,19.7898
2018-05-17,19.9091
2018-05-18,19.919
2018-05-21,20.2468
2018-05-22,20.3064
2018-05-23,20.3561
2018-05-24,20.2667
2018-05-25,20.1574
2018-05-29,20.1475
2018-05-30,20.2071
2018-05-31,20.3064
2018-06-01,20.3462
2018-06-04,20.0978
2018-06-05,20.1674
2018-06-06,20.227
2018-06-07,20.2568
2018-06-08,20.2369
2018-06-11,19.8495
2018-06-12,19.5315
2018-06-13,19.6508
2018-06-14,19.6806
2018-06-15,19.6309
2018-06-18,19.6607
2018-06-19,19.8495
2018-06-20,20.0183
2018-06-21,20.2468
2018-06-22,20.0879
2018-06-25,20.3064
2018-06-26,20.1276
2018-06-27,19.7501
2018-06-28,19.6607
2018-06-29,19.7402
2018-07-02,19.8395
2018-07-03,19.7501
2018-07-05,19.7998
2018-07-06,19.7898
2018-07-09,19.76
2018-07-10,19.7799
2018-07-11,19.6408
2018-07-12,19.6309
2018-07-13,19.5713
2018-07-16,19.4819
2018-07-17,19.5017
2018-07-18,19.621
2018-07-19,19.7402
2018-07-20,20.0183
2018-07-23,20.0183
2018-07-24,20.0581
2018-07-25,20.1376
2018-07-26,20.1078
2018-07-27,19.8892
2018-07-30,19.7501
2018-07-31,19.5514
2018-08-01,19.2534
2018-08-02,19.9091
2018-08-03,19.7898
2018-08-06,19.8693
2018-08-07,19.8793
2018-08-08,19.9687
2018-08-09,20.0183
2018-08-10,20.0481
2018-08-13,20.2667
2018-08-14,20.1475
2018-08-15,20.1177
2018-08-16,20.2371
2018-08-17,20.4162
2018-08-20,20.4162
2018-08-21,20.6151
2018-08-22,20.7843
2018-08-23,20.7345
2018-08-24,20.8241
2018-08-27,20.6848
2018-08-28,20.5455
2018-08-29,20.5654
2018-08-30,20.5356
2018-08-31,20.4162
2018-09-04,19.9883
2018-09-05,20.1575
2018-09-06,20.058
2018-09-07,20.0082
2018-09-10,19.9187
2018-09-11,19.6799
2018-09-12,19.6003
2018-09-13,19.6799
2018-09-14,19.9983
2018-09-17,20.048
2018-09-18,19.8291
2018-09-19,20.0779
2018-09-20,20.0381
2018-09-21,20.5654
2018-09-24,20.1873
2018-09-25,20.1475
2018-09-26,20.2669
2018-09-27,20.2172
2018-09-28,20.2371
2018-10-01,19.9585
2018-10-02,19.9485
2018-10-03,19.9684
2018-10-04,20.1973
2018-10-05,20.1077
2018-10-08,20.3465
2018-10-09,20.4062
2018-10-10,20.3366
2018-10-11,20.1674
2018-10-12,20.247
2018-10-15,19.9883
2018-10-16,20.1276
2018-10-17,20.048
2018-10-18,19.8192
2018-10-19,19.6501
2018-10-22,19.66
2018-10-23,19.5904
2018-10-24,18.1775
2018-10-25,18.4064
2018-10-26,19.0232
2018-10-29,18.7049
2018-10-30,18.5059
2018-10-31,18.6253
2018-11-01,18.6651
2018-11-02,18.5457
2018-11-05,18.4661
2018-11-06,18.3566
2018-11-07,18.5258
2018-11-08,18.884
2018-11-09,19.1824
2018-11-12,19.0531
2018-11-13,19.1824
2018-11-14,19.3018
2018-11-15,19.541
2018-11-16,19.6107
2018-11-19,19.9894
2018-11-20,19.9396
2018-11-21,20.089
2018-11-23,19.9396
2018-11-26,19.9794
2018-11-27,19.9296
2018-11-28,19.9196
2018-11-29,19.7702
2018-11-30,19.81
2018-12-03,19.7303
2018-12-04,19.1025
2018-12-06,18.9929
2018-12-07,19.252
2018-12-10,19.5808
2018-12-11,19.4214
2018-12-12,19.5111
2018-12-13,19.6606
2018-12-14,19.7801
2018-12-17,19.8798
2018-12-18,19.4413
2018-12-19,19.1225
2018-12-20,18.9232
2018-12-21,18.9331
2018-12-24,18.6043
2018-12-26,18.9531
2018-12-27,19.0427
2018-12-28,19.3118
2018-12-31,19.4911
2019-01-02,19.6008
2019-01-03,19.7502
2019-01-04,20.2485
2019-01-07,19.7901
2019-01-08,20.1688
2019-01-09,19.6506
2019-01-10,19.82
2019-01-11,20.2086
2019-01-14,19.8897
2019-01-15,19.9495
2019-01-16,19.8997
2019-01-17,19.8897
2019-01-18,19.9495
2019-01-22,19.4314
2019-01-23,19.4613
2019-01-24,19.4314
2019-01-25,19.9794
2019-01-28,20.2584
2019-01-29,20.3581
2019-01-30,20.1787
2019-01-31,20.2385
2019-02-01,20.2086
2019-02-04,20.4378
2019-02-05,20.7069
2019-02-06,20.5275
2019-02-07,20.5873
2019-02-08,20.6271
2019-02-11,20.5275
2019-02-12,20.4478
2019-02-13,20.4278
2019-02-14,20.1384
2019-02-15,20.5276
2019-02-19,20.5476
2019-02-20,20.5476
2019-02-21,20.5476
2019-02-22,20.5376
2019-02-25,20.2881
2019-02-26,20.0786
2019-02-27,20.1783
2019-02-28,20.2881
2019-03-01,20.338
2019-03-04,20.4179
2019-03-05,19.9588
2019-03-06,19.4
2019-03-07,20.0187
2019-03-08,20.2083
2019-03-11,20.2183
2019-03-12,19.9388
2019-03-13,19.9089
2019-03-14,19.9388
2019-03-15,20.0686
2019-03-18,19.879
2019-03-19,19.4499
2019-03-20,19.5297
2019-03-21,19.2602
2019-03-22,18.891
2019-03-25,19.1305
2019-03-26,19.6095
2019-03-27,19.6195
2019-03-28,19.5397
2019-03-29,19.5297
2019-04-01,19.9788
2019-04-02,19.4698
2019-04-03,19.3101
2019-04-04,19.6494
2019-04-05,19.879
2019-04-08,19.6395
2019-04-09,19.3501
2019-04-10,19.3301
2019-04-11,19.3401
2019-04-12,19.3002
2019-04-15,19.1704
2019-04-16,19.3201
2019-04-17,19.1804
2019-04-18,19.1106
2019-04-22,18.891
2019-04-23,18.7413
2019-04-24,18.8611
2019-04-25,18.911
2019-04-26,19.0307
2019-04-29,19.2403
2019-04-30,19.0108
2019-05-01,18.7214
2019-05-02,18.7214
2019-05-03,18.8211
2019-05-06,18.9908
2019-05-07,18.9509
2019-05-08,18.9609
2019-05-09,18.9609
2019-05-10,19.1305
2019-05-13,19.0706
2019-05-14,19.5297
2019-05-15,19.38
2019-05-16,19.05
2019-05-17,19.16
2019-05-20,19.24
2019-05-21,19.62
2019-05-22,19.55
2019-05-23,19.69
2019-05-24,19.76
2019-05-28,19.58
2019-05-29,19.76
2019-05-30,19.61
2019-05-31,19.64
2019-06-03,19.3
2019-06-04,19.39
2019-06-05,19.13
2019-06-06,19.03
2019-06-07,19.2
2019-06-10,19.34
2019-06-11,19.78
2019-06-12,19.89
2019-06-13,19.9
2019-06-14,19.6
2019-06-17,19.475
2019-06-18,19.44
2019-06-19,19.33
2019-06-20,19.3
2019-06-21,19.39
2019-06-24,19.585
2019-06-25,19.71
2019-06-26,19.91
2019-06-27,19.9
2019-06-28,20.07
2019-07-01,20.14
2019-07-02,20.03
2019-07-03,19.85
2019-07-04,19.85
2019-07-05,20.08
2019-07-08,19.88
2019-07-09,20.175
2019-07-10,20.15
2019-07-11,20.005
2019-07-12,19.91
2019-07-15,19.39
2019-07-16,19.39
2019-07-17,19.42
2019-07-18,19.42
2019-07-19,19.56
2019-07-22,19.48
2019-07-23,19.59
2019-07-24,19.89
2019-07-25,19.795
2019-07-26,19.985
2019-07-29,19.845
2019-07-30,19.81
2019-07-31,19.67
2019-08-01,19.31
2019-08-02,19.22
2019-08-05,19.42
2019-08-06,19.1
2019-08-07,18.92
2019-08-08,19.1
2019-08-09,19.3
2019-08-12,19.68
2019-08-13,19.68
2019-08-14,19.35
2019-08-15,19.39
2019-08-16,19.71
2019-08-19,19.6
2019-08-20,19.57
2019-08-21,19.68
2019-08-22,19.86
2019-08-23,19.34
2019-08-26,19.64
2019-08-27,19.54
2019-08-28,19.47
2019-08-29,19.65
2019-08-30,19.64
2019-09-02,19.7
2019-09-03,19.6
2019-09-04,19.65
2019-09-05,19.74
2019-09-06,19.61
2019-09-09,19.84
2019-09-10,19.96
2019-09-11,20.13
2019-09-12,20.435
2019-09-13,20.44
2019-09-16,20.35
2019-09-17,20.395
2019-09-18,20.5
2019-09-19,20.28
2019-09-20,20.56
2019-09-23,20.685
2019-09-24,20.36
2019-09-25,20.53
2019-09-26,20.32
2019-09-27,20.2
2019-09-30,20.2
2019-10-01,20.01
2019-10-02,19.97
2019-10-03,19.89
2019-10-04,19.89
2019-10-07,19.95
2019-10-08,19.98
2019-10-09,19.78
2019-10-10,19.89
2019-10-11,20.105
2019-10-14,19.975
2019-10-15,19.76
2019-10-16,20.12
2019-10-17,20.07
2019-10-18,20.2
2019-10-21,20.375
2019-10-22,20.34
2019-10-23,20.32
2019-10-24,20.615
2019-10-25,20.635
2019-10-28,20.47
2019-10-29,20.49
2019-10-30,20.37
2019-10-31,20.28
2019-11-01,20.33
2019-11-04,20.26
2019-11-05,20.32
2019-11-06,20.32
2019-11-07,20.33
2019-11-08,20.2
2019-11-11,20.16
2019-11-12,20.3
2019-11-13,20.36
2019-11-14,20.23
2019-11-15,20.17
2019-11-18,20.35
2019-11-19,20.45
2019-11-20,20.42
2019-11-21,20.42
2019-11-22,20.32
2019-11-25,20.46
