date,close
2014-06-13,18.0605
2014-06-16,18.0017
2014-06-17,18.183
2014-06-18,18.0017
2014-06-19,17.8351
2014-06-20,18.6485
2014-06-23,19.1189
2014-06-24,18.6338
2014-06-25,18.6093
2014-06-26,18.379
2014-06-27,18.477
2014-06-30,18.8151
2014-07-01,19.261
2014-07-02,19.3443
2014-07-03,19.7607
2014-07-07,19.4668
2014-07-08,19.1924
2014-07-09,19.3639
2014-07-10,18.9719
2014-07-11,18.9915
2014-07-14,19.2169
2014-07-15,18.8543
2014-07-16,18.8641
2014-07-17,18.6289
2014-07-18,19.2071
2014-07-21,19.3884
2014-07-22,19.4864
2014-07-23,19.1287
2014-07-24,18.9082
2014-07-25,18.5995
2014-07-28,18.5211
2014-07-29,21.1229
2014-07-30,20.8926
2014-07-31,20.0792
2014-08-01,20.285
2014-08-04,20.5349
2014-08-05,20.6231
2014-08-06,20.5349
2014-08-07,20.334
2014-08-08,20.7064
2014-08-11,20.9318
2014-08-12,20.6427
2014-08-13,20.6427
2014-08-14,20.4614
2014-08-15,20.4467
2014-08-18,21.0396
2014-08-19,20.9416
2014-08-20,21.0592
2014-08-21,21.0739
2014-08-22,21.4561
2014-08-25,21.216
2014-08-26,21.167
2014-08-27,20.5888
2014-08-28,20.53
2014-08-29,20.5692
2014-09-02,21.2111
2014-09-03,21.2013
2014-09-04,20.9171
2014-09-05,20.7848
2014-09-08,20.7064
2014-09-09,20.4565
2014-09-10,20.5741
2014-09-11,20.8191
2014-09-12,20.6868
2014-09-15,20.6525
2014-09-16,20.8093
2014-09-17,21.1621
2014-09-18,21.2699
2014-09-19,21.1131
2014-09-22,20.873
2014-09-23,20.5594
2014-09-24,20.8632
2014-09-25,19.9077
2014-09-26,20.3389
2014-09-29,20.138
2014-09-30,19.7313
2014-10-01,18.9082
2014-10-02,18.9817
2014-10-03,19.3296
2014-10-06,18.9425
2014-10-07,18.6093
2014-10-08,19.0111
2014-10-09,18.0605
2014-10-10,17.5901
2014-10-13,17.2472
2014-10-14,17.9135
2014-10-15,18.0703
2014-10-16,18.3202
2014-10-17,18.2565
2014-10-20,18.5652
2014-10-21,19.1777
2014-10-22,18.6583
2014-10-23,19.0258
2014-10-24,18.8494
2014-10-27,19.0307
2014-10-28,18.2957
2014-10-29,18.0997
2014-10-30,18.6044
2014-10-31,19.3835
2014-11-03,19.7901
2014-11-04,19.8538
2014-11-05,20.1331
2014-11-06,20.0498
2014-11-07,19.9028
2014-11-10,20.0841
2014-11-11,20.0449
2014-11-12,20.2262
2014-11-13,19.9812
2014-11-14,20.089
2014-11-17,19.7803
2014-11-18,19.8048
2014-11-19,19.4521
2014-11-20,19.8342
2014-11-21,19.9077
2014-11-24,20.1625
2014-11-25,20.1135
2014-11-26,20.2899
2014-11-28,19.9469
2014-12-01,19.4864
2014-12-02,19.9126
2014-12-03,20.285
2014-12-04,20.1478
2014-12-05,20.5741
2014-12-08,20.1821
2014-12-09,20.6427
2014-12-10,20.138
2014-12-11,20.1331
2014-12-12,19.6676
2014-12-15,19.6333
2014-12-16,19.3933
2014-12-17,19.4717
2014-12-18,19.7803
2014-12-19,19.7509
2014-12-22,20.1968
2014-12-23,20.334
2014-12-24,20.5153
2014-12-26,20.6035
2014-12-29,20.726
2014-12-30,20.5447
2014-12-31,20.2507
2015-01-02,20.0106
2015-01-05,19.3443
2015-01-06,18.6632
2015-01-07,18.624
2015-01-08,18.7857
2015-01-09,18.624
2015-01-12,18.1438
2015-01-13,18.2369
2015-01-14,18.0997
2015-01-15,17.7518
2015-01-16,18.2271
2015-01-20,18.5211
2015-01-21,18.8053
2015-01-22,19.3639
2015-01-23,19.1042
2015-01-26,19.1679
2015-01-27,18.8641
2015-01-28,18.2957
2015-01-29,18.5652
2015-01-30,18.0066
2015-02-02,18.2124
2015-02-03,18.6877
2015-02-04,18.7661
2015-02-05,18.9131
2015-02-06,18.869
2015-02-09,18.7906
2015-02-10,19.1532
2015-02-11,18.9131
2015-02-12,20.0253
2015-02-13,20.4908
2015-02-17,20.2115
2015-02-18,20.3536
2015-02-19,20.4173
2015-02-20,20.8828
2015-02-23,20.6525
2015-02-24,20.8142
2015-02-25,21.3728
2015-02-26,21.5786
2015-02-27,21.897
2015-03-02,23.0387
2015-03-03,22.7447
2015-03-04,22.5977
2015-03-05,23.1367
2015-03-06,22.6173
2015-03-09,22.8084
2015-03-10,22.6565
2015-03-11,23.2494
2015-03-12,23.7198
2015-03-13,23.8128
2015-03-16,24.3028
2015-03-17,23.9892
2015-03-18,24.0725
2015-03-19,24.3175
2015-03-20,24.3567
2015-03-23,23.7932
2015-03-24,24.097
2015-03-25,23.4307
2015-03-26,23.4307
2015-03-27,23.8422
2015-03-30,24.4302
2015-03-31,24.2979
2015-04-01,23.9157
2015-04-02,24.7389
2015-04-06,25.273
2015-04-07,24.9153
2015-04-08,25.0378
2015-04-09,25.1456
2015-04-10,25.2142
2015-04-13,25.2877
2015-04-14,25.0819
2015-04-15,25.1848
2015-04-16,25.1358
2015-04-17,24.538
2015-04-20,24.6017
2015-04-21,24.5674
2015-04-22,24.8026
2015-04-23,23.6561
2015-04-24,23.2739
2015-04-27,23.0436
2015-04-28,23.4258
2015-04-29,22.8966
2015-04-30,21.995
2015-05-01,22.5046
2015-05-04,23.0338
2015-05-05,22.3135
2015-05-06,22.6663
2015-05-07,23.0289
2015-05-08,22.8035
2015-05-11,22.8231
2015-05-12,22.9505
2015-05-13,23.4209
2015-05-14,23.9255
2015-05-15,23.8814
2015-05-18,24.2146
2015-05-19,23.8961
2015-05-20,23.9549
2015-05-21,23.9402
2015-05-22,23.7688
2015-05-26,23.8814
2015-05-27,24.391
2015-05-28,24.8222
2015-05-29,24.7291
2015-06-01,24.5037
2015-06-02,24.6605
2015-06-03,25.1119
2015-06-04,24.685
2015-06-05,24.9942
2015-06-08,24.5428
2015-06-09,24.4152
2015-06-10,24.3367
2015-06-11,24.3661
2015-06-12,24.2434
2015-06-15,24.1748
2015-06-16,24.16
2015-06-17,24.322
2015-06-18,24.8421
2015-06-19,24.6016
2015-06-22,24.5133
2015-06-23,24.0325
2015-06-24,23.7528
2015-06-25,23.7626
2015-06-26,23.9098
2015-06-29,23.1591
2015-06-30,23.6007
2015-07-01,23.3112
2015-07-02,23.5271
2015-07-06,23.4976
2015-07-07,23.5369
2015-07-08,23.0561
2015-07-09,23.0364
2015-07-10,23.3406
2015-07-13,22.9432
2015-07-14,22.9677
2015-07-15,22.7322
2015-07-16,23.11
2015-07-17,22.7568
2015-07-20,22.7175
2015-07-21,22.6046
2015-07-22,22.6537
2015-07-23,22.3544
2015-07-24,22.0846
2015-07-27,21.957
2015-07-28,22.0306
2015-07-29,22.2661
2015-07-30,22.3839
2015-07-31,22.2121
2015-08-03,22.0551
2015-08-04,17.1731
2015-08-05,18.4046
2015-08-06,18.2525
2015-08-07,18.2721
2015-08-10,18.699
2015-08-11,18.3899
2015-08-12,18.2427
2015-08-13,18.1936
2015-08-14,18.1495
2015-08-17,18.1544
2015-08-18,18.2034
2015-08-19,18.1298
2015-08-20,17.7962
2015-08-21,17.4675
2015-08-24,16.9375
2015-08-25,16.4322
2015-08-26,16.599
2015-08-27,17.227
2015-08-28,17.4135
2015-08-31,17.4478
2015-09-01,16.81
2015-09-02,17.1492
2015-09-03,17.2475
2015-09-04,16.8985
2015-09-08,17.7589
2015-09-09,17.8769
2015-09-10,18.1227
2015-09-11,18.1178
2015-09-14,18.1817
2015-09-15,18.5505
2015-09-16,18.9094
2015-09-17,18.8848
2015-09-18,19.047
2015-09-21,18.1965
2015-09-22,17.5475
2015-09-23,17.1148
2015-09-24,16.5838
2015-09-25,16.6969
2015-09-28,16.4806
2015-09-29,16.4265
2015-09-30,16.8985
2015-10-01,16.8936
2015-10-02,17.395
2015-10-05,17.9064
2015-10-06,17.926
2015-10-07,17.5671
2015-10-08,17.5278
2015-10-09,17.4885
2015-10-12,17.518
2015-10-13,17.4639
2015-10-14,17.2672
2015-10-15,17.5032
2015-10-16,17.282
2015-10-19,17.2918
2015-10-20,17.3213
2015-10-21,17.0509
2015-10-22,17.4786
2015-10-23,17.9752
2015-10-26,17.8818
2015-10-27,17.3754
2015-10-28,18.1227
2015-10-29,18.0834
2015-10-30,18.4865
2015-11-02,18.6832
2015-11-03,16.7067
2015-11-04,17.2082
2015-11-05,17.2131
2015-11-06,17.4491
2015-11-09,17.7884
2015-11-10,17.749
2015-11-11,17.4786
2015-11-12,17.2082
2015-11-13,17.1787
2015-11-16,17.5622
2015-11-17,17.2721
2015-11-18,18.1866
2015-11-19,18.0932
2015-11-20,18.049
2015-11-23,18.108
2015-11-24,18.2063
2015-11-25,18.2997
2015-11-27,18.3243
2015-11-30,18.2407
2015-12-01,17.9113
2015-12-02,17.5024
2015-12-03,17.9802
2015-12-04,18.3694
2015-12-07,18.2315
2015-12-08,18.1034
2015-12-09,17.8078
2015-12-10,17.7586
2015-12-11,17.3842
2015-12-14,17.0295
2015-12-15,17.0295
2015-12-16,17.0985
2015-12-17,16.9113
2015-12-18,16.6551
2015-12-21,16.6206
2015-12-22,16.8965
2015-12-23,17.0738
2015-12-24,17.2019
2015-12-28,17.0492
2015-12-29,17.0738
2015-12-30,17.0197
2015-12-31,16.6354
2016-01-04,16.394
2016-01-05,16.064
2016-01-06,15.4778
2016-01-07,14.4433
2016-01-08,14.0147
2016-01-11,14.2118
2016-01-12,14.9655
2016-01-13,14.532
2016-01-14,14.7438
2016-01-15,14.7438
2016-01-19,14.9359
2016-01-20,14.9408
2016-01-21,14.8768
2016-01-22,15.4285
2016-01-25,15.2463
2016-01-26,15.2709
2016-01-27,15.2019
2016-01-28,15.0098
2016-01-29,15.8867
2016-02-01,15.6157
2016-02-02,15.2857
2016-02-03,15.4285
2016-02-04,15.6206
2016-02-05,15.2216
2016-02-08,14.8817
2016-02-09,15.2266
2016-02-10,15.266
2016-02-11,16.1576
2016-02-12,16.4729
2016-02-16,17.0098
2016-02-17,17.9064
2016-02-18,17.8965
2016-02-19,18.0985
2016-02-22,18.1527
2016-02-23,18.1428
2016-02-24,18.1231
2016-02-25,18.2118
2016-02-26,18.3645
2016-02-29,18.2315
2016-03-01,18.9113
2016-03-02,19.2913
2016-03-03,19.6071
2016-03-04,19.923
2016-03-07,19.8736
2016-03-08,19.5282
2016-03-09,19.5726
2016-03-10,19.6811
2016-03-11,19.4097
2016-03-14,19.3061
2016-03-15,19.163
2016-03-16,19.2172
2016-03-17,19.5726
2016-03-18,20.3721
2016-03-21,20.2734
2016-03-22,19.844
2016-03-23,19.4837
2016-03-24,18.4671
2016-03-28,18.6004
2016-03-29,18.8965
2016-03-30,19.01
2016-03-31,19.2222
2016-04-01,19.3258
2016-04-04,18.8175
2016-04-05,18.2746
2016-04-06,18.5214
2016-04-07,18.1365
2016-04-08,18.3783
2016-04-11,18.324
2016-04-12,18.5017
2016-04-13,19.2123
2016-04-14,19.1334
2016-04-15,18.9409
2016-04-18,18.7978
2016-04-19,18.5263
2016-04-20,18.5559
2016-04-21,18.3882
2016-04-22,18.551
2016-04-25,18.472
2016-04-26,18.5559
2016-04-27,18.2105
2016-04-28,17.9489
2016-04-29,17.5344
2016-05-02,17.3765
2016-05-03,20.298
2016-05-04,19.8588
2016-05-05,19.7996
2016-05-06,20.0414
2016-05-09,19.844
2016-05-10,20.1549
2016-05-11,19.9328
2016-05-12,19.8835
2016-05-13,19.5282
2016-05-16,19.7749
2016-05-17,19.5726
2016-05-18,19.4689
2016-05-19,19.4196
2016-05-20,19.7947
2016-05-23,19.9723
2016-05-24,20.4412
2016-05-25,20.6386
2016-05-26,20.9692
2016-05-27,21.2308
2016-05-31,21.2554
2016-06-01,21.4606
2016-06-02,21.5644
2016-06-03,21.8709
2016-06-06,22.0143
2016-06-07,22.0786
2016-06-08,22.2269
2016-06-09,22.0934
2016-06-10,21.693
2016-06-13,21.5249
2016-06-14,20.7092
2016-06-15,20.8575
2016-06-16,20.7339
2016-06-17,20.7883
2016-06-20,21.1541
2016-06-21,21.0997
2016-06-22,20.9712
2016-06-23,21.159
2016-06-24,20.195
2016-06-27,19.2162
2016-06-28,20.0418
2016-06-29,20.5905
2016-06-30,21.3073
2016-07-01,21.3073
2016-07-05,21.0058
2016-07-06,20.9267
2016-07-07,21.0503
2016-07-08,21.1195
2016-07-11,21.4804
2016-07-12,21.777
2016-07-13,21.5694
2016-07-14,21.5644
2016-07-15,21.4408
2016-07-18,21.4853
2016-07-19,21.4952
2016-07-20,21.693
2016-07-21,21.4705
2016-07-22,21.5941
2016-07-25,21.5595
2016-07-26,21.693
2016-07-27,22.1774
2016-07-28,22.0884
2016-07-29,22.3307
2016-08-01,22.4048
2016-08-02,24.1945
2016-08-03,23.9967
2016-08-04,24.1203
2016-08-05,24.4466
2016-08-08,24.3378
2016-08-09,24.4367
2016-08-10,24.6888
2016-08-11,24.7432
2016-08-12,24.7037
2016-08-15,24.8718
2016-08-16,24.6839
2016-08-17,24.5702
2016-08-18,24.6542
2016-08-19,24.7185
2016-08-22,24.5603
2016-08-23,24.8075
2016-08-24,24.6493
2016-08-25,24.6839
2016-08-26,24.8124
2016-08-29,24.8075
2016-08-30,24.758
2016-08-31,24.6368
2016-09-01,24.919
2016-09-02,24.9982
2016-09-06,24.6169
2016-09-07,24.81
2016-09-08,24.5575
2016-09-09,23.7852
2016-09-12,24.0575
2016-09-13,23.7802
2016-09-14,24.1119
2016-09-15,24.7457
2016-09-16,24.5427
2016-09-19,24.7308
2016-09-20,24.711
2016-09-21,25.5775
2016-09-22,25.6418
2016-09-23,25.2804
2016-09-26,25.3101
2016-09-27,25.8399
2016-09-28,26.2013
2016-09-29,26.0676
2016-09-30,26.1716
2016-10-03,25.8943
2016-10-04,25.5082
2016-10-05,25.7607
2016-10-06,25.7062
2016-10-07,25.6814
2016-10-10,26.0082
2016-10-11,25.4784
2016-10-12,25.726
2016-10-13,25.6468
2016-10-14,25.5379
2016-10-17,25.6963
2016-10-18,25.8646
2016-10-19,26.3003
2016-10-20,26.3795
2016-10-21,26.236
2016-10-24,27.038
2016-10-25,26.5726
2016-10-26,26.3399
2016-10-27,25.32
2016-10-28,25.4834
2016-10-31,25.5478
2016-11-01,25.5329
2016-11-02,24.6169
2016-11-03,24.6714
2016-11-04,25.1368
2016-11-07,27.1717
2016-11-08,27.1767
2016-11-09,27.3401
2016-11-10,26.7063
2016-11-11,27.444
2016-11-14,28.3303
2016-11-15,28.9541
2016-11-16,29.0779
2016-11-17,29.2165
2016-11-18,29.1373
2016-11-21,29.4245
2016-11-22,30.1028
2016-11-23,30.1226
2016-11-25,30.078
2016-11-28,29.7166
2016-11-29,29.875
2016-11-30,29.5999
2016-12-01,29.2876
2016-12-02,28.7522
2016-12-05,28.7671
2016-12-06,29.352
2016-12-07,29.4462
2016-12-08,31.7315
2016-12-09,31.2507
2016-12-12,31.7712
2016-12-13,31.9497
2016-12-14,31.8257
2016-12-15,32.1033
2016-12-16,31.9794
2016-12-19,32.1033
2016-12-20,31.7861
2016-12-21,31.9992
2016-12-22,32.1182
2016-12-23,31.7415
2016-12-27,32.0587
2016-12-28,31.6175
2016-12-29,31.7563
2016-12-30,31.5382
2017-01-03,31.3647
2017-01-04,32.0191
2017-01-05,31.3944
2017-01-06,31.3597
2017-01-09,31.7117
2017-01-10,32.5743
2017-01-11,32.485
2017-01-12,32.3066
2017-01-13,32.8767
2017-01-17,32.0389
2017-01-18,33.3674
2017-01-19,32.5941
2017-01-20,32.0438
2017-01-23,32.0488
2017-01-24,32.5297
2017-01-25,33.5211
2017-01-26,33.298
2017-01-27,33.1592
2017-01-30,33.2385
2017-01-31,33.4914
2017-02-01,33.6797
2017-02-02,33.6946
2017-02-03,34.5126
2017-02-06,34.0813
2017-02-07,34.1705
2017-02-08,34.5423
2017-02-09,34.8447
2017-02-10,34.6712
2017-02-13,34.7059
2017-02-14,34.5374
2017-02-15,34.6811
2017-02-16,34.924
2017-02-17,37.8934
2017-02-21,38.062
2017-02-22,38.2256
2017-02-23,37.7695
2017-02-24,38.5775
2017-02-27,38.5974
2017-02-28,38.0768
2017-03-01,39.3248
2017-03-02,39.3447
2017-03-03,39.8061
2017-03-06,39.8607
2017-03-07,39.8359
2017-03-08,39.6523
2017-03-09,39.4737
2017-03-10,39.6573
2017-03-13,39.6473
2017-03-14,39.5183
2017-03-15,39.7565
2017-03-16,39.8806
2017-03-17,40.0691
2017-03-20,40.0989
2017-03-21,38.8782
2017-03-22,39.4389
2017-03-23,39.7863
2017-03-24,39.8955
2017-03-27,40.0989
2017-03-28,40.7638
2017-03-29,40.9573
2017-03-30,41.6421
2017-03-31,41.657
2017-04-03,41.4833
2017-04-04,41.6173
2017-04-05,41.3345
2017-04-06,42.2425
2017-04-07,41.791
2017-04-10,41.5379
2017-04-11,41.131
2017-04-12,40.3817
2017-04-13,39.6126
2017-04-17,40.2478
2017-04-18,40.0939
2017-04-19,40.347
2017-04-20,41.1012
2017-04-21,40.9573
2017-04-24,41.9597
2017-04-25,42.441
2017-04-26,41.9746
2017-04-27,42.5551
2017-04-28,42.3467
2017-05-01,42.4906
2017-05-02,44.7683
2017-05-03,44.0289
2017-05-04,43.9694
2017-05-05,44.6591
2017-05-08,44.2175
2017-05-09,44.3415
2017-05-10,44.7831
2017-05-11,44.9221
2017-05-12,45.2794
2017-05-15,45.4778
2017-05-16,45.9393
2017-05-17,44.4159
2017-05-18,44.4656
2017-05-19,45.1057
2017-05-22,46.0336
2017-05-23,46.113
2017-05-24,45.8649
2017-05-25,46.1428
2017-05-26,46.4703
2017-05-30,46.113
2017-05-31,45.45
2017-06-01,46.3191
2017-06-02,46.5575
2017-06-05,46.7115
2017-06-06,47.6005
2017-06-07,47.0045
2017-06-08,47.6403
2017-06-09,46.632
2017-06-12,44.6255
2017-06-13,44.849
2017-06-14,45.0129
2017-06-15,44.5659
2017-06-16,45.301
2017-06-19,46.93
2017-06-20,45.6933
2017-06-21,45.6933
2017-06-22,45.003
2017-06-23,45.5642
2017-06-26,45.6486
2017-06-27,44.4467
2017-06-28,44.8341
2017-06-29,42.6686
2017-06-30,42.167
2017-07-03,42.2117
2017-07-05,42.7729
2017-07-06,42.5445
2017-07-07,44.2133
2017-07-10,44.4268
2017-07-11,43.8755
2017-07-12,44.7745
2017-07-13,44.3921
2017-07-14,44.4368
2017-07-17,44.2927
2017-07-18,44.104
2017-07-19,44.7497
2017-07-20,44.854
2017-07-21,45.6139
2017-07-24,47.1188
2017-07-25,47.2479
2017-07-26,47.382
2017-07-27,47.1784
2017-07-28,47.084
2017-07-31,47.2131
2017-08-01,52.2891
2017-08-02,50.4663
2017-08-03,50.3918
2017-08-04,49.8206
2017-08-07,51.4249
2017-08-08,51.0921
2017-08-09,51.0126
2017-08-10,49.5773
2017-08-11,50.4216
2017-08-14,51.5888
2017-08-15,51.6086
2017-08-16,51.6012
2017-08-17,50.3386
2017-08-18,50.4678
2017-08-21,50.0901
2017-08-22,50.7462
2017-08-23,50.5026
2017-08-24,51.3079
2017-08-25,51.0792
2017-08-28,52.4263
2017-08-29,52.6251
2017-08-30,53.7038
2017-08-31,54.1661
2017-09-01,53.8479
2017-09-05,53.3956
2017-09-06,53.2763
2017-09-07,53.6093
2017-09-08,53.6392
2017-09-11,55.1254
2017-09-12,55.4634
2017-09-13,54.8073
2017-09-14,55.3143
2017-09-15,55.6473
2017-09-18,56.8851
2017-09-19,56.6962
2017-09-20,56.2736
2017-09-21,56.3681
2017-09-22,56.383
2017-09-25,54.7278
2017-09-26,54.0567
2017-09-27,54.9365
2017-09-28,54.683
2017-09-29,54.8172
2017-10-02,55.876
2017-10-03,57.0093
2017-10-04,57.6207
2017-10-05,57.4716
2017-10-06,57.7649
2017-10-09,57.8543
2017-10-10,58.416
2017-10-11,58.3962
2017-10-12,59.0771
2017-10-13,58.7988
2017-10-16,59.7432
2017-10-17,60.0166
2017-10-18,60.628
2017-10-19,59.4649
2017-10-20,60.8616
2017-10-23,60.9809
2017-10-24,61.0306
2017-10-25,61.0257
2017-10-26,61.314
2017-10-27,62.333
2017-10-30,61.4681
2017-10-31,61.2146
2017-11-01,62.1143
2017-11-02,63.3371
2017-11-03,66.0511
2017-11-06,66.8762
2017-11-07,67.6069
2017-11-08,67.2987
2017-11-09,66.7818
2017-11-10,67.7809
2017-11-13,68.3476
2017-11-14,68.4619
2017-11-15,68.3824
2017-11-16,68.5663
2017-11-17,69.8487
2017-11-20,70.5446
2017-11-21,72.006
2017-11-22,71.156
2017-11-24,71.7674
2017-11-27,71.1958
2017-11-28,71.494
2017-11-29,67.5224
2017-11-30,68.8794
2017-12-01,68.8397
2017-12-04,62.9394
2017-12-05,62.5219
2017-12-06,61.6271
2017-12-07,62.8201
2017-12-08,64.0031
2017-12-11,63.1283
2017-12-12,63.0388
2017-12-13,62.2932
2017-12-14,60.5336
2017-12-15,60.6131
2017-12-18,61.3786
2017-12-19,62.0944
2017-12-20,61.7365
2017-12-21,61.5774
2017-12-22,61.5277
2017-12-26,60.7225
2017-12-27,61.0704
2017-12-28,61.3786
2017-12-29,60.802
2018-01-02,61.0207
2018-01-03,63.3371
2018-01-04,65.2061
2018-01-05,65.9914
2018-01-08,67.3832
2018-01-09,67.3435
2018-01-10,66.6277
2018-01-11,66.6476
2018-01-12,67.5125
2018-01-16,67.0253
2018-01-17,67.9897
2018-01-18,67.8704
2018-01-19,68.6557
2018-01-22,68.5961
2018-01-23,69.2125
2018-01-24,66.9458
2018-01-25,67.0452
2018-01-26,66.409
2018-01-29,64.9376
2018-01-30,63.1183
2018-01-31,62.0049
2018-02-01,62.7306
2018-02-02,60.8119
2018-02-05,56.2687
2018-02-06,57.6008
2018-02-07,56.6465
2018-02-08,53.3359
2018-02-09,54.6979
2018-02-12,54.5687
2018-02-13,54.8471
2018-02-14,57.7102
2018-02-15,58.4558
2018-02-16,55.4435
2018-02-20,56.1096
2018-02-21,56.6365
2018-02-22,54.2009
2018-02-23,53.8827
2018-02-26,53.5646
2018-02-27,53.2365
2018-02-28,53.3956
2018-03-01,52.7339
2018-03-02,52.7538
2018-03-05,52.2564
2018-03-06,52.8334
2018-03-07,54.6244
2018-03-08,54.3856
2018-03-09,55.8084
2018-03-12,56.0273
2018-03-13,54.6543
2018-03-14,54.5448
2018-03-15,54.1568
2018-03-16,55.0224
2018-03-19,54.1568
2018-03-20,55.8681
2018-03-21,55.4801
2018-03-22,53.8185
2018-03-23,52.4852
2018-03-26,53.7787
2018-03-27,53.0623
2018-03-28,50.5151
2018-03-29,51.729
2018-04-02,48.5749
2018-04-03,49.7988
2018-04-04,49.9281
2018-04-05,50.0873
2018-04-06,49.0426
2018-04-09,49.4505
2018-04-10,50.2067
2018-04-11,50.0077
2018-04-12,50.4654
2018-04-13,50.1868
2018-04-16,50.5947
2018-04-17,51.331
2018-04-18,50.6345
2018-04-19,49.4505
2018-04-20,50.6445
2018-04-23,49.4207
2018-04-24,48.1471
2018-04-25,47.0029
2018-04-26,47.0924
2018-04-27,45.978
2018-04-30,46.0178
2018-05-01,45.8686
2018-05-02,44.8338
2018-05-03,45.8984
2018-05-04,46.9332
2018-05-07,46.1074
2018-05-08,46.784
2018-05-09,47.9879
2018-05-10,48.2267
2018-05-11,48.1272
2018-05-14,48.963
2018-05-15,47.1521
2018-05-16,48.0277
2018-05-17,46.5687
2018-05-18,45.264
2018-05-21,45.5429
2018-05-22,46.1504
2018-05-23,46.3794
2018-05-24,46.4093
2018-05-25,46.5189
2018-05-29,46.8774
2018-05-30,46.2201
2018-05-31,45.523
2018-06-01,46.1603
2018-06-04,46.6085
2018-06-05,46.7181
2018-06-06,46.5886
2018-06-07,46.5587
2018-06-08,47.3256
2018-06-11,46.2301
2018-06-12,46.2898
2018-06-13,46.1006
2018-06-14,45.5927
2018-06-15,45.4931
2018-06-18,45.6425
2018-06-19,45.0848
2018-06-20,45.2839
2018-06-21,45.2342
2018-06-22,44.9254
2018-06-25,43.561
2018-06-26,43.82
2018-06-27,43.561
2018-06-28,43.8498
2018-06-29,44.4275
2018-07-02,44.3179
2018-07-03,44.3179
2018-07-05,45.4333
2018-07-06,46.1006
2018-07-09,46.7977
2018-07-10,48.1024
2018-07-11,45.0947
2018-07-12,45.274
2018-07-13,45.5329
2018-07-16,45.2441
2018-07-17,45.3537
2018-07-18,45.3935
2018-07-19,44.6864
2018-07-20,44.7661
2018-07-23,44.6266
2018-07-24,44.3179
2018-07-25,45.0648
2018-07-26,46.1703
2018-07-27,45.4732
2018-07-30,44.0689
2018-07-31,52.564
2018-08-01,51.0104
2018-08-02,51.6179
2018-08-03,52.6636
2018-08-06,52.7333
2018-08-07,53.0421
2018-08-08,53.0421
2018-08-09,52.7831
2018-08-10,52.4545
2018-08-13,51.7673
2018-08-14,52.2852
2018-08-15,52.086
2018-08-16,52.4398
2018-08-17,52.2604
2018-08-20,52.2604
2018-08-21,53.0578
2018-08-22,52.9881
2018-08-23,52.7688
2018-08-24,51.5128
2018-08-27,52.3003
2018-08-28,52.8784
2018-08-29,52.9083
2018-08-30,53.297
2018-08-31,53.626
2018-09-04,53.1974
2018-09-05,52.4
2018-09-06,52.4697
2018-09-07,52.8585
2018-09-10,54.1443
2018-09-11,54.4533
2018-09-12,54.6925
2018-09-13,55.3504
2018-09-14,55.5298
2018-09-17,55.1909
2018-09-18,55.7292
2018-09-19,55.9684
2018-09-20,56.6761
2018-09-21,57.942
2018-09-24,58.7693
2018-09-25,57.7526
2018-09-26,56.8555
2018-09-27,56.3073
2018-09-28,55.6394
2018-10-01,56.4967
2018-10-02,55.9285
2018-10-03,56.6561
2018-10-04,55.8687
2018-10-05,50.4164
2018-10-08,49.8283
2018-10-09,48.5624
2018-10-10,45.4625
2018-10-11,43.5188
2018-10-12,44.5754
2018-10-15,43.9374
2018-10-16,46.2898
2018-10-17,45.7515
2018-10-18,44.0869
2018-10-19,43.1599
2018-10-22,43.0603
2018-10-23,42.8509
2018-10-24,41.3159
2018-10-25,41.7645
2018-10-26,41.1066
2018-10-29,39.4819
2018-10-30,41.8342
2018-10-31,42.7014
2018-11-01,46.22
2018-11-02,46.4194
2018-11-05,44.8544
2018-11-06,46.5091
2018-11-07,47.2666
2018-11-08,46.6586
2018-11-09,44.9143
2018-11-12,41.8342
2018-11-13,41.8342
2018-11-14,41.1365
2018-11-15,41.9948
2018-11-16,42.6135
2018-11-19,40.6276
2018-11-20,40.5777
2018-11-21,40.8072
2018-11-23,40.7673
2018-11-26,41.5058
2018-11-27,40.7573
2018-11-28,42.5237
2018-11-29,42.2742
2018-11-30,43.9309
2018-12-03,47.2541
2018-12-04,44.9189
2018-12-06,43.8311
2018-12-07,41.3162
2018-12-10,41.2563
2018-12-11,40.6475
2018-12-12,41.7653
2018-12-13,39.6895
2018-12-14,39.5797
2018-12-17,38.5518
2018-12-18,38.8013
2018-12-19,37.4939
2018-12-20,36.3961
2018-12-21,35.6776
2018-12-24,34.8692
2018-12-26,37.6336
2018-12-27,37.8133
2018-12-28,37.6336
2018-12-31,38.5917
2019-01-02,38.5119
2019-01-03,36.0768
2019-01-04,37.6137
2019-01-07,38.8412
2019-01-08,40.8671
2019-01-09,41.1964
2019-01-10,42.0247
2019-01-11,41.6555
2019-01-14,41.3062
2019-01-15,41.5158
2019-01-16,41.3162
2019-01-17,41.915
2019-01-18,42.853
2019-01-22,41.416
2019-01-23,40.7872
2019-01-24,42.1345
2019-01-25,43.6814
2019-01-28,42.8131
2019-01-29,43.2922
2019-01-30,44.5496
2019-01-31,45.4079
2019-02-01,45.9368
2019-02-04,46.3959
2019-02-05,46.8948
2019-02-06,47.9527
2019-02-07,47.2641
2019-02-08,46.835
2019-02-11,47.8529
2019-02-12,49.2401
2019-02-13,49.27
2019-02-14,48.771
2019-02-15,50.6273
2019-02-19,51.3857
2019-02-20,51.1662
2019-02-21,51.0963
2019-02-22,51.725
2019-02-25,53.2519
2019-02-26,53.741
2019-02-27,53.9505
2019-02-28,53.3412
2019-03-01,54.3901
2019-03-04,54.5998
2019-03-05,53.8906
2019-03-06,52.9317
2019-03-07,52.0227
2019-03-08,51.4333
2019-03-11,52.4522
2019-03-12,52.8118
2019-03-13,53.2213
2019-03-14,52.9616
2019-03-15,54.2902
2019-03-18,54.0404
2019-03-19,53.3412
2019-03-20,53.1015
2019-03-21,53.4111
2019-03-22,50.0448
2019-03-25,50.0648
2019-03-26,50.1048
2019-03-27,49.4455
2019-03-28,50.0948
2019-03-29,50.804
2019-04-01,52.9916
2019-04-02,53.2014
2019-04-03,53.8506
2019-04-04,53.511
2019-04-05,53.1614
2019-04-08,53.6209
2019-04-09,53.0815
2019-04-10,53.6708
2019-04-11,54.2602
2019-04-12,54.7696
2019-04-15,54.5099
2019-04-16,55.9184
2019-04-17,55.9583
2019-04-18,56.4378
2019-04-22,55.0593
2019-04-23,56.7774
2019-04-24,56.0882
2019-04-25,54.6697
2019-04-26,54.8695
2019-04-29,53.6409
2019-04-30,50.3745
2019-05-01,48.2268
2019-05-02,48.2268
2019-05-03,48.966
2019-05-06,47.9971
2019-05-07,47.4477
2019-05-08,47.5576
2019-05-09,46.7685
2019-05-10,46.7585
2019-05-13,43.9615
2019-05-14,45.1003
2019-05-15,45.38
2019-05-16,44.94
2019-05-17,44.01
2019-05-20,43.36
2019-05-21,43.95
2019-05-22,43.25
2019-05-23,42.44
2019-05-24,42.4
2019-05-28,41.99
2019-05-29,41.69
2019-05-30,41.75
2019-05-31,40.6
2019-06-03,40.75
2019-06-04,42.59
2019-06-05,42.79
2019-06-06,43.16
2019-06-07,44.33
2019-06-10,45.56
2019-06-11,45.47
2019-06-12,44.7
2019-06-13,44.995
2019-06-14,43.945
2019-06-17,43.855
2019-06-18,44.65
2019-06-19,45.595
2019-06-20,46.965
2019-06-21,46.43
2019-06-24,46.28
2019-06-25,46.205
2019-06-26,47.005
2019-06-27,47.275
2019-06-28,48.04
2019-07-01,48
2019-07-02,45.46
2019-07-03,45.83
2019-07-04,45.83
2019-07-05,44.285
2019-07-08,42.76
2019-07-09,43.04
2019-07-10,42.565
2019-07-11,41.84
2019-07-12,42.61
2019-07-15,42.625
2019-07-16,43
2019-07-17,43.025
2019-07-18,42.53
2019-07-19,42.365
2019-07-22,42.88
2019-07-23,43.825
2019-07-24,44.485
2019-07-25,42.825
2019-07-26,42.155
2019-07-29,42.24
2019-07-30,45.835
2019-07-31,44.04
2019-08-01,43.435
2019-08-02,42.085
2019-08-05,42
2019-08-06,42.71
2019-08-07,43
2019-08-08,44.5
2019-08-09,43.81
2019-08-12,43.02
2019-08-13,44.985
2019-08-14,43.89
2019-08-15,43.61
2019-08-16,44.245
2019-08-19,45.365
2019-08-20,44.955
2019-08-21,44.985
2019-08-22,44.8
2019-08-23,43.12
2019-08-26,43.11
2019-08-27,43.095
2019-08-28,43.34
2019-08-29,44.585
2019-08-30,45.08
2019-09-02,45.09
2019-09-03,43.285
2019-09-04,44.795
2019-09-05,47.02
2019-09-06,47.15
2019-09-09,47.74
2019-09-10,48.135
2019-09-11,49.85
2019-09-12,50.025
2019-09-13,50.495
2019-09-16,49.895
2019-09-17,49.825
2019-09-18,50.125
2019-09-19,50.45
2019-09-20,48.275
2019-09-23,48.13
2019-09-24,47.16
2019-09-25,48.02
2019-09-26,48.135
2019-09-27,48.22
2019-09-30,49.15
2019-10-01,47.99
2019-10-02,47.335
2019-10-03,47.93
2019-10-04,49.19
2019-10-07,49.07
2019-10-08,46.235
2019-10-09,47.305
2019-10-10,46.85
2019-10-11,48.97
2019-10-14,48.755
2019-10-15,49.405
2019-10-16,48.89
2019-10-17,50.81
2019-10-18,51.06
2019-10-21,52.075
2019-10-22,52.58
2019-10-23,52.425
2019-10-24,52.255
2019-10-25,52.5
2019-10-28,54.1
2019-10-29,51.95
2019-10-30,51.895
2019-10-31,51.465
2019-11-01,52.365
2019-11-04,53.435
2019-11-05,54.395
2019-11-06,53.275
2019-11-07,53.525
2019-11-08,53.25
2019-11-11,52.85
2019-11-12,51.785
2019-11-13,51.11
2019-11-14,50.815
2019-11-15,51.28
2019-11-18,49.755
2019-11-19,50.55
2019-11-20,50.12
2019-11-21,50.215
2019-11-22,49.54
2019-11-25,50.26
