date,close
2017-06-14,12.56
2017-06-15,13.68
2017-06-16,13.89
2017-06-19,14.52
2017-06-20,14.49
2017-06-21,14.42
2017-06-22,14.95
2017-06-23,15.13
2017-06-26,15.1
2017-06-27,16.99
2017-06-28,17.4
2017-06-29,16.2
2017-06-30,16
2017-07-03,16.65
2017-07-05,17.04
2017-07-06,17.79
2017-07-07,18.42
2017-07-10,18.12
2017-07-11,17.99
2017-07-12,18.09
2017-07-13,18.72
2017-07-14,18.82
2017-07-17,18.55
2017-07-18,18.51
2017-07-19,18.52
2017-07-20,18.61
2017-07-21,18.44
2017-07-24,18.73
2017-07-25,18.55
2017-07-26,18.03
2017-07-27,17.19
2017-07-28,17.25
2017-07-31,17.12
2017-08-01,16.86
2017-08-02,16.41
2017-08-03,13.86
2017-08-04,14.41
2017-08-07,14.21
2017-08-08,13.5
2017-08-09,13.57
2017-08-10,13.65
2017-08-11,14.61
2017-08-14,15.44
2017-08-15,16.5
2017-08-16,16.61
2017-08-17,15.51
2017-08-18,15.2
2017-08-21,16
2017-08-22,16
2017-08-23,16
2017-08-24,15.97
2017-08-25,15.65
2017-08-28,16
2017-08-29,16.17
2017-08-30,16.24
2017-08-31,17.16
2017-09-01,17.4
2017-09-05,18.7
2017-09-06,19.51
2017-09-07,18.88
2017-09-08,17.64
2017-09-11,17.43
2017-09-12,16.99
2017-09-13,16.44
2017-09-14,16.38
2017-09-15,16.84
2017-09-18,17.03
2017-09-19,17.42
2017-09-20,17.8
2017-09-21,17.47
2017-09-22,16.83
2017-09-25,17.03
2017-09-26,17.32
2017-09-27,17.71
2017-09-28,17.09
2017-09-29,17.51
2017-10-02,17.4
2017-10-03,17.77
2017-10-04,18.08
2017-10-05,18.25
2017-10-06,18.87
2017-10-09,18.93
2017-10-10,19.15
2017-10-11,18.99
2017-10-12,18.36
2017-10-13,17.43
2017-10-16,17.3
2017-10-17,17.04
2017-10-18,17.14
2017-10-19,17.08
2017-10-20,17.13
2017-10-23,16.99
2017-10-24,17.03
2017-10-25,17.03
2017-10-26,16.7
2017-10-27,16.91
2017-10-30,16.85
2017-10-31,16.74
2017-11-01,16.85
2017-11-02,16.85
2017-11-03,16.77
2017-11-06,16.77
2017-11-07,16.26
2017-11-08,16.49
2017-11-09,16.56
2017-11-10,16.67
2017-11-13,16.55
2017-11-14,17.01
2017-11-15,17.2
2017-11-16,17.55
2017-11-17,17.91
2017-11-20,18
2017-11-21,18.03
2017-11-22,18.14
2017-11-24,18.92
2017-11-27,18.58
2017-11-28,18.16
2017-11-29,17.88
2017-11-30,17.11
2017-12-01,17.03
2017-12-04,16.62
2017-12-05,16.54
2017-12-06,15.92
2017-12-07,15.71
2017-12-08,15.96
2017-12-11,14.41
2017-12-12,15.87
2017-12-13,16.8
2017-12-14,16.83
2017-12-15,16.83
2017-12-18,16.53
2017-12-19,16.74
2017-12-20,16.46
2017-12-21,16.88
2017-12-22,16.63
2017-12-26,16.7
2017-12-27,16.2
2017-12-28,16.29
2017-12-29,15.9
2018-01-02,15.87
2018-01-03,15.94
2018-01-04,15.61
2018-01-05,15.57
2018-01-08,15.55
2018-01-09,15.41
2018-01-10,15.8
2018-01-11,15.72
2018-01-12,15.87
2018-01-16,15.95
2018-01-17,16.7
2018-01-18,17.21
2018-01-19,17.33
2018-01-22,16.34
2018-01-23,14.48
2018-01-24,15.47
2018-01-25,15.1
2018-01-26,15.06
2018-01-29,15.02
2018-01-30,14.93
2018-01-31,14.48
2018-02-01,14.68
2018-02-02,14.43
2018-02-05,13.53
2018-02-06,13.83
2018-02-07,14.67
2018-02-08,14.21
2018-02-09,14.12
2018-02-12,15.01
2018-02-13,15.29
2018-02-14,15.65
2018-02-15,16.77
2018-02-16,16.66
2018-02-20,16
2018-02-21,15.99
2018-02-22,16.03
2018-02-23,16.22
2018-02-26,16.18
2018-02-27,15.91
2018-02-28,15.84
2018-03-01,15.68
2018-03-02,16.12
2018-03-05,15.98
2018-03-06,16.23
2018-03-07,16.25
2018-03-08,16.23
2018-03-09,16.72
2018-03-12,16.77
2018-03-13,16.46
2018-03-14,16.75
2018-03-15,16.98
2018-03-16,17.09
2018-03-19,16.72
2018-03-20,16.98
2018-03-21,16.72
2018-03-22,16.38
2018-03-23,16.19
2018-03-26,15.315
2018-03-27,17.3
2018-03-28,17.47
2018-03-29,17.01
2018-04-02,17.11
2018-04-03,17.64
2018-04-04,18
2018-04-05,17.67
2018-04-06,17.3
2018-04-09,17.71
2018-04-10,17.98
2018-04-11,17.39
2018-04-12,17.11
2018-04-13,17.08
2018-04-16,17.13
2018-04-17,17.3
2018-04-18,17.2
2018-04-19,16.63
2018-04-20,16.3
2018-04-23,16.16
2018-04-24,16.06
2018-04-25,15.9
2018-04-26,16.22
2018-04-27,16.29
2018-04-30,16.01
2018-05-01,16.02
2018-05-02,15.88
2018-05-03,16.06
2018-05-04,16.06
2018-05-07,16.28
2018-05-08,16.28
2018-05-09,17.02
2018-05-10,16.77
2018-05-11,17.49
2018-05-14,17.19
2018-05-15,16.76
2018-05-16,16.83
2018-05-17,17
2018-05-18,17
2018-05-21,16.96
2018-05-22,16.95
2018-05-23,16.86
2018-05-24,16.6
2018-05-25,16.21
2018-05-29,16.05
2018-05-30,16.11
2018-05-31,16.02
2018-06-01,16.22
2018-06-04,16.8
2018-06-05,16.8
2018-06-06,16.78
2018-06-07,16.37
2018-06-08,16.49
2018-06-11,16.75
2018-06-12,16.76
2018-06-13,17.5
2018-06-14,17.91
2018-06-15,18.65
2018-06-18,19.02
2018-06-19,18.72
2018-06-20,18.42
2018-06-21,18.62
2018-06-22,19.05
2018-06-25,19.5
2018-06-26,19.15
2018-06-27,18.78
2018-06-28,18.34
2018-06-29,18.66
2018-07-02,19.51
2018-07-03,19.81
2018-07-05,19.97
2018-07-06,18.73
2018-07-09,18.7
2018-07-10,18.21
2018-07-11,17.88
2018-07-12,18.64
2018-07-13,18.51
2018-07-16,18.89
2018-07-17,18.55
2018-07-18,18.85
2018-07-19,18.64
2018-07-20,18.84
2018-07-23,19.57
2018-07-24,19.31
2018-07-25,19.73
2018-07-26,19.2
2018-07-27,18.76
2018-07-30,18.74
2018-07-31,19.27
2018-08-01,18.98
2018-08-02,19.05
2018-08-03,18.41
2018-08-06,18.42
2018-08-07,18.49
2018-08-08,18.11
2018-08-09,18.31
2018-08-10,18.4
2018-08-13,18.11
2018-08-14,17.02
2018-08-15,16.49
2018-08-16,16.67
2018-08-17,17.29
2018-08-20,17.09
2018-08-21,17.15
2018-08-22,17.5
2018-08-23,17.25
2018-08-24,17.14
2018-08-27,16.94
2018-08-28,16.91
2018-08-29,16.44
2018-08-30,15.98
2018-08-31,16.43
2018-09-04,16.34
2018-09-05,16.57
2018-09-06,15.68
2018-09-07,15.84
2018-09-10,15.76
2018-09-11,16.05
2018-09-12,16.24
2018-09-13,16.13
2018-09-14,16.51
2018-09-17,16.46
2018-09-18,16.44
2018-09-19,16.27
2018-09-20,16.48
2018-09-21,16.92
2018-09-24,16.86
2018-09-25,16.08
2018-09-26,15.6
2018-09-27,15.53
2018-09-28,15.54
2018-10-01,15.49
2018-10-02,15.49
2018-10-03,15.45
2018-10-04,14.82
2018-10-05,14.57
2018-10-08,14.41
2018-10-09,14.25
2018-10-10,13.57
2018-10-11,13.45
2018-10-12,13.37
2018-10-15,13.22
2018-10-16,14.59
2018-10-17,14.09
2018-10-18,13.52
2018-10-19,12.91
2018-10-22,12.5
2018-10-23,12.97
2018-10-24,12.37
2018-10-25,12.82
2018-10-26,12.29
2018-10-29,12.12
2018-10-30,11.54
2018-10-31,12.07
2018-11-01,12.3
2018-11-02,12.38
2018-11-05,12.27
2018-11-06,12.28
2018-11-07,12.47
2018-11-08,12.6
2018-11-09,12.09
2018-11-12,11.65
2018-11-13,11.66
2018-11-14,10.245
2018-11-15,11.26
2018-11-16,11.98
2018-11-19,11.78
2018-11-20,11.65
2018-11-21,11.93
2018-11-23,12.47
2018-11-26,12.77
2018-11-27,12.6
2018-11-28,13.36
2018-11-29,13.06
2018-11-30,13.22
2018-12-03,13.14
2018-12-04,12.33
2018-12-06,12.25
2018-12-07,12.07
2018-12-10,12.46
2018-12-11,12.22
2018-12-12,13.44
2018-12-13,12.55
2018-12-14,11.97
2018-12-17,11.81
2018-12-18,12.05
2018-12-19,11.85
2018-12-20,10.83
2018-12-21,10.97
2018-12-24,11.61
2018-12-26,13.43
2018-12-27,12.83
2018-12-28,13.47
2018-12-31,12.69
2019-01-02,12.77
2019-01-03,12.06
2019-01-04,12.43
2019-01-07,12.42
2019-01-08,12.29
2019-01-09,12.4
2019-01-10,11.91
2019-01-11,11.74
2019-01-14,11.27
2019-01-15,11.47
2019-01-16,11.88
2019-01-17,11.89
2019-01-18,12.05
2019-01-22,11.59
2019-01-23,11.29
2019-01-24,11.47
2019-01-25,12.01
2019-01-28,11.43
2019-01-29,11.11
2019-01-30,11.34
2019-01-31,11.75
2019-02-01,11.96
2019-02-04,12.07
2019-02-05,12.02
2019-02-06,12.02
2019-02-07,11.83
2019-02-08,12.05
2019-02-11,12.07
2019-02-12,12.3
2019-02-13,12.29
2019-02-14,12.5
2019-02-15,12.64
2019-02-19,12.83
2019-02-20,12.76
2019-02-21,12.74
2019-02-22,13.12
2019-02-25,13.13
2019-02-26,13.04
2019-02-27,12.94
2019-02-28,13.17
2019-03-01,13.49
2019-03-04,12.99
2019-03-05,12.71
2019-03-06,12.13
2019-03-07,11.99
2019-03-08,11.79
2019-03-11,11.91
2019-03-12,11.83
2019-03-13,11.72
2019-03-14,11.39
2019-03-15,11.87
2019-03-18,12.4
2019-03-19,12.05
2019-03-20,12.14
2019-03-21,12.65
2019-03-22,12.26
2019-03-25,12.48
2019-03-26,12.8
2019-03-27,12.41
2019-03-28,12.38
2019-03-29,12.25
2019-04-01,12.06
2019-04-02,11.93
2019-04-03,11.49
2019-04-04,11.44
2019-04-05,11.7
2019-04-08,11.49
2019-04-09,11.97
2019-04-10,12.22
2019-04-11,11.99
2019-04-12,11.88
2019-04-15,11.54
2019-04-16,11.67
2019-04-17,11.26
2019-04-18,11.06
2019-04-22,10.94
2019-04-23,11.34
2019-04-24,10.76
2019-04-25,10.57
2019-04-26,10.73
2019-04-29,10.21
2019-04-30,9.88
2019-05-01,9.44
2019-05-02,9.93
2019-05-03,10.12
2019-05-06,12.99
2019-05-07,12.89
2019-05-08,12.99
2019-05-09,13.01
2019-05-10,14.26
2019-05-13,14
2019-05-14,13.8
2019-05-15,14.02
2019-05-16,14.08
2019-05-17,13.93
2019-05-20,13.95
2019-05-21,14.18
2019-05-22,14.05
2019-05-23,13.84
2019-05-24,14
2019-05-28,13.76
2019-05-29,13.92
2019-05-30,14.49
2019-05-31,14.45
2019-06-03,14.45
2019-06-04,14.54
2019-06-05,15.14
2019-06-06,14.99
2019-06-07,16.56
2019-06-10,16.66
2019-06-11,16.49
2019-06-12,16.95
2019-06-13,17.25
2019-06-14,17.82
2019-06-17,17.53
2019-06-18,17.8
2019-06-19,18.01
2019-06-20,18.04
2019-06-21,17.9
2019-06-24,17.97
2019-06-25,17.92
2019-06-26,17.96
2019-06-27,18.355
2019-06-28,19.58
2019-07-01,19.12
2019-07-02,18.665
2019-07-03,18.75
2019-07-04,18.75
2019-07-05,19.565
2019-07-08,20.79
2019-07-09,20.94
2019-07-10,20.98
2019-07-11,20.13
2019-07-12,19.995
2019-07-15,19.995
2019-07-16,19.835
2019-07-17,19.2
2019-07-18,19.505
2019-07-19,19.095
2019-07-22,19.54
2019-07-23,19.23
2019-07-24,18.965
2019-07-25,18.34
2019-07-26,18.655
2019-07-29,18.375
2019-07-30,18.055
2019-07-31,18
2019-08-01,18.215
2019-08-02,18.29
2019-08-05,17.995
2019-08-06,18.96
2019-08-07,15.19
2019-08-08,15.395
2019-08-09,14.305
2019-08-12,14.145
2019-08-13,14.81
2019-08-14,15.25
2019-08-15,14.85
2019-08-16,15.37
2019-08-19,15.735
2019-08-20,15.6
2019-08-21,15.76
2019-08-22,15.25
2019-08-23,14.76
2019-08-26,15.63
2019-08-27,14.72
2019-08-28,14.99
2019-08-29,15.265
2019-08-30,14.755
2019-09-02,14.735
2019-09-03,14.325
2019-09-04,14.085
2019-09-05,14.665
2019-09-06,14.01
2019-09-09,13.705
2019-09-10,14.05
2019-09-11,14.4
2019-09-12,14.055
2019-09-13,13.785
2019-09-16,13.585
2019-09-17,14.2
2019-09-18,14.21
2019-09-19,14.06
2019-09-20,14.26
2019-09-23,13.525
2019-09-24,13.305
2019-09-25,13.44
2019-09-26,13.025
2019-09-27,12.6
2019-09-30,12.19
2019-10-01,12.32
2019-10-02,12.35
2019-10-03,12.36
2019-10-04,12.175
2019-10-07,12.025
2019-10-08,11.65
2019-10-09,11.14
2019-10-10,11.3
2019-10-11,10.935
2019-10-14,10.835
2019-10-15,11.24
2019-10-16,10.47
2019-10-17,10.81
2019-10-18,10.25
2019-10-21,9.61
2019-10-22,11.44
2019-10-23,11.085
2019-10-24,10.615
2019-10-25,10.905
2019-10-28,11.11
2019-10-29,11.005
2019-10-30,11.005
2019-10-31,11.04
2019-11-01,11.54
2019-11-04,11.495
2019-11-05,11.64
2019-11-06,11.455
2019-11-07,11.635
2019-11-08,11.935
2019-11-11,11.4
2019-11-12,11.715
2019-11-13,11.78
2019-11-14,11.23
2019-11-15,11.625
2019-11-18,11.41
2019-11-19,15.305
2019-11-20,15.185
2019-11-21,15.46
2019-11-22,16.04
2019-11-25,16.555
