date,close
2014-06-13,53.8345
2014-06-16,53.7082
2014-06-17,53.8598
2014-06-18,54.14
2014-06-19,54.2589
2014-06-20,54.2844
2014-06-23,54.14
2014-06-24,54.0381
2014-06-25,54.1145
2014-06-26,54.3693
2014-06-27,54.7005
2014-06-30,54.5477
2014-07-01,54.9468
2014-07-02,54.9978
2014-07-03,54.8279
2014-07-07,54.5222
2014-07-08,54.9044
2014-07-09,54.6241
2014-07-10,54.9383
2014-07-11,54.9298
2014-07-14,55.1591
2014-07-15,54.9978
2014-07-16,55.1082
2014-07-17,54.6326
2014-07-18,54.6326
2014-07-21,54.692
2014-07-22,55.1252
2014-07-23,55.1676
2014-07-24,54.4373
2014-07-25,53.7579
2014-07-28,54.14
2014-07-29,53.6729
2014-07-30,53.4776
2014-07-31,52.9596
2014-08-01,52.8067
2014-08-04,53.2228
2014-08-05,52.6878
2014-08-06,52.6878
2014-08-07,52.6453
2014-08-08,53.4097
2014-08-11,53.5795
2014-08-12,53.3247
2014-08-13,54.157
2014-08-14,53.8513
2014-08-15,53.4436
2014-08-18,54.5392
2014-08-19,55.2441
2014-08-20,55.5753
2014-08-21,55.5583
2014-08-22,54.8959
2014-08-25,54.76
2014-08-26,54.8619
2014-08-27,54.9808
2014-08-28,54.8194
2014-08-29,55.0657
2014-09-02,55.2525
2014-09-03,55.2186
2014-09-04,54.9638
2014-09-05,55.6772
2014-09-08,55.5838
2014-09-09,55.2016
2014-09-10,54.4627
2014-09-11,54.76
2014-09-12,52.9596
2014-09-15,52.484
2014-09-16,53.019
2014-09-17,52.9333
2014-09-18,52.2219
2014-09-19,52.0505
2014-09-22,51.6734
2014-09-23,51.7762
2014-09-24,51.8448
2014-09-25,51.8191
2014-09-26,52.4705
2014-09-29,52.479
2014-09-30,51.9305
2014-10-01,52.1448
2014-10-02,51.9305
2014-10-03,52.2305
2014-10-06,52.1876
2014-10-07,51.8705
2014-10-08,53.619
2014-10-09,53.2504
2014-10-10,52.8476
2014-10-13,53.4475
2014-10-14,54.1932
2014-10-15,54.6217
2014-10-16,54.9389
2014-10-17,54.9046
2014-10-20,56.2245
2014-10-21,56.1988
2014-10-22,56.1902
2014-10-23,57.1758
2014-10-24,56.9187
2014-10-27,57.2958
2014-10-28,57.7586
2014-10-29,57.6901
2014-10-30,57.7672
2014-10-31,59.0186
2014-11-03,59.5671
2014-11-04,59.5328
2014-11-05,59.5585
2014-11-06,59.0271
2014-11-07,58.7443
2014-11-10,59.1043
2014-11-11,58.6243
2014-11-12,57.8701
2014-11-13,57.7672
2014-11-14,57.2015
2014-11-17,57.0216
2014-11-18,57.0987
2014-11-19,56.5159
2014-11-20,56.833
2014-11-21,57.073
2014-11-24,57.4501
2014-11-25,57.3473
2014-11-26,57.8872
2014-11-28,57.6129
2014-12-01,56.353
2014-12-02,56.7644
2014-12-03,55.496
2014-12-04,55.3245
2014-12-05,55.2388
2014-12-08,55.6502
2014-12-09,56.2759
2014-12-10,55.6588
2014-12-11,55.2645
2014-12-12,54.1503
2014-12-15,52.959
2014-12-16,53.4818
2014-12-17,54.9004
2014-12-18,55.1253
2014-12-19,54.4679
2014-12-22,55.1167
2014-12-23,55.3589
2014-12-24,55.3848
2014-12-26,55.5578
2014-12-29,55.8
2014-12-30,55.6702
2014-12-31,54.7707
2015-01-02,55.5145
2015-01-05,55.6962
2015-01-06,56.8293
2015-01-07,57.4781
2015-01-08,56.8293
2015-01-09,56.3017
2015-01-12,56.665
2015-01-13,57.0802
2015-01-14,57.6251
2015-01-15,56.9331
2015-01-16,57.6424
2015-01-20,56.5958
2015-01-21,56.6217
2015-01-22,57.9451
2015-01-23,57.4521
2015-01-26,58.0316
2015-01-27,57.9884
2015-01-28,57.7895
2015-01-29,57.4954
2015-01-30,55.9124
2015-02-02,55.0475
2015-02-03,54.4679
2015-02-04,54.416
2015-02-05,55.3848
2015-02-06,53.7586
2015-02-09,53.6289
2015-02-10,54.2776
2015-02-11,54.1219
2015-02-12,54.9523
2015-02-13,54.7101
2015-02-17,53.9835
2015-02-18,54.3728
2015-02-19,53.8711
2015-02-20,54.4333
2015-02-23,55.1945
2015-02-24,54.8658
2015-02-25,54.9177
2015-02-26,54.1133
2015-02-27,54.4939
2015-03-02,54.3728
2015-03-03,54.0527
2015-03-04,53.058
2015-03-05,52.8764
2015-03-06,50.9301
2015-03-09,51.1031
2015-03-10,50.8263
2015-03-11,50.4112
2015-03-12,50.7398
2015-03-13,50.9561
2015-03-16,51.1291
2015-03-17,50.9907
2015-03-18,51.4885
2015-03-19,51.8466
2015-03-20,53.3926
2015-03-23,53.6372
2015-03-24,53.1917
2015-03-25,52.1436
2015-03-26,51.6982
2015-03-27,51.8117
2015-03-30,52.9821
2015-03-31,52.5279
2015-04-01,52.6065
2015-04-02,53.3227
2015-04-06,54.0215
2015-04-07,53.3926
2015-04-08,53.3664
2015-04-09,52.3794
2015-04-10,52.5192
2015-04-13,52.755
2015-04-14,53.4275
2015-04-15,53.183
2015-04-16,52.9559
2015-04-17,52.4406
2015-04-20,52.8423
2015-04-21,52.5366
2015-04-22,51.9427
2015-04-23,51.9864
2015-04-24,52.327
2015-04-27,51.7418
2015-04-28,51.9951
2015-04-29,50.8946
2015-04-30,49.96
2015-05-01,49.7591
2015-05-04,50.0561
2015-05-05,49.3836
2015-05-06,49.6194
2015-05-07,50.3443
2015-05-08,50.7461
2015-05-11,49.8989
2015-05-12,49.7242
2015-05-13,49.2002
2015-05-14,50.0212
2015-05-15,50.5627
2015-05-18,50.3967
2015-05-19,50.5365
2015-05-20,50.4317
2015-05-21,49.6893
2015-05-22,49.5321
2015-05-26,48.6674
2015-05-27,48.7722
2015-05-28,48.9381
2015-05-29,48.5888
2015-06-01,49.6543
2015-06-02,49.2176
2015-06-03,48.9818
2015-06-04,48.9032
2015-06-05,48.6237
2015-06-08,48.711
2015-06-09,48.6936
2015-06-10,49.1914
2015-06-11,49.4185
2015-06-12,49.7766
2015-06-15,49.6369
2015-06-16,50.2133
2015-06-17,50.5927
2015-06-18,51.519
2015-06-19,51.2808
2015-06-22,51.3161
2015-06-23,51.2455
2015-06-24,51.1132
2015-06-25,50.8662
2015-06-26,50.8397
2015-06-29,50.2574
2015-06-30,49.6046
2015-07-01,50.1516
2015-07-02,50.328
2015-07-06,50.7691
2015-07-07,51.1661
2015-07-08,50.6103
2015-07-09,50.3016
2015-07-10,50.5839
2015-07-13,50.9897
2015-07-14,51.3249
2015-07-15,51.4307
2015-07-16,52.013
2015-07-17,51.6336
2015-07-20,52.4717
2015-07-21,52.8952
2015-07-22,52.9745
2015-07-23,52.4011
2015-07-24,52.5335
2015-07-27,51.9248
2015-07-28,52.4452
2015-07-29,52.8687
2015-07-30,52.5246
2015-07-31,53.1069
2015-08-03,53.0981
2015-08-04,52.9216
2015-08-05,51.8807
2015-08-06,51.6866
2015-08-07,51.5719
2015-08-10,51.2543
2015-08-11,51.1043
2015-08-12,51.0161
2015-08-13,50.8485
2015-08-14,51.2455
2015-08-17,51.5719
2015-08-18,51.3513
2015-08-19,50.7691
2015-08-20,50.3633
2015-08-21,49.5076
2015-08-24,46.8787
2015-08-25,45.9524
2015-08-26,47.4962
2015-08-27,48.5372
2015-08-28,48.4666
2015-08-31,47.6374
2015-09-01,46.5523
2015-09-02,47.161
2015-09-03,47.3904
2015-09-04,46.3494
2015-09-08,46.6846
2015-09-09,45.873
2015-09-10,46.27
2015-09-11,46.817
2015-09-14,46.6317
2015-09-15,46.9581
2015-09-16,47.895
2015-09-17,48.5374
2015-09-18,48.234
2015-09-21,48.7961
2015-09-22,48.127
2015-09-23,48.466
2015-09-24,48.0466
2015-09-25,48.582
2015-09-28,48.0466
2015-09-29,48.5017
2015-09-30,48.3411
2015-10-01,49.0103
2015-10-02,49.3225
2015-10-05,50.2148
2015-10-06,49.9828
2015-10-07,50.8215
2015-10-08,51.1605
2015-10-09,50.9286
2015-10-12,51.5442
2015-10-13,50.7323
2015-10-14,50.2772
2015-10-15,51.2765
2015-10-16,50.652
2015-10-19,51.0356
2015-10-20,50.9196
2015-10-21,50.2148
2015-10-22,50.5003
2015-10-23,50.3218
2015-10-26,50.4468
2015-10-27,50.1969
2015-10-28,50.6787
2015-10-29,50.3486
2015-10-30,50.1077
2015-11-02,51.3033
2015-11-03,51.2141
2015-11-04,50.5984
2015-11-05,50.8126
2015-11-06,49.2333
2015-11-09,48.127
2015-11-10,48.5285
2015-11-11,48.805
2015-11-12,48.4571
2015-11-13,48.127
2015-11-16,48.8943
2015-11-17,49.153
2015-11-18,49.8936
2015-11-19,50.42
2015-11-20,51.0892
2015-11-23,51.8654
2015-11-24,51.7405
2015-11-25,52.258
2015-11-27,52.4275
2015-11-30,51.9368
2015-12-01,53.0521
2015-12-02,51.4014
2015-12-03,50.8126
2015-12-04,51.6959
2015-12-07,51.1248
2015-12-08,50.3932
2015-12-09,49.8222
2015-12-10,49.4118
2015-12-11,48.7337
2015-12-14,48.8943
2015-12-15,49.7419
2015-12-16,51.0767
2015-12-17,50.4905
2015-12-18,49.7058
2015-12-21,49.7599
2015-12-22,50.247
2015-12-23,50.4454
2015-12-24,50.725
2015-12-28,51.0858
2015-12-29,51.3112
2015-12-30,51.0587
2015-12-31,50.1568
2016-01-04,49.2097
2016-01-05,50.5266
2016-01-06,49.823
2016-01-07,48.3349
2016-01-08,47.8117
2016-01-11,47.938
2016-01-12,47.7847
2016-01-13,47.7486
2016-01-14,47.6764
2016-01-15,47.3337
2016-01-19,47.4059
2016-01-20,46.3145
2016-01-21,46.7384
2016-01-22,47.8027
2016-01-25,47.0812
2016-01-26,48.1094
2016-01-27,47.2706
2016-01-28,47.027
2016-01-29,48.1545
2016-02-01,47.8388
2016-02-02,46.8106
2016-02-03,47.009
2016-02-04,46.3416
2016-02-05,46.2153
2016-02-08,45.9086
2016-02-09,45.1961
2016-02-10,45.7192
2016-02-11,45.2322
2016-02-12,45.7102
2016-02-16,46.7204
2016-02-17,46.9098
2016-02-18,47.3337
2016-02-19,47.4329
2016-02-22,47.7756
2016-02-23,47.8117
2016-02-24,48.4341
2016-02-25,49.4352
2016-02-26,49.1556
2016-02-29,48.9121
2016-03-01,50.1838
2016-03-02,50.5536
2016-03-03,51.2211
2016-03-04,52.0238
2016-03-07,51.9246
2016-03-08,51.3834
2016-03-09,51.0316
2016-03-10,50.7881
2016-03-11,51.3383
2016-03-14,51.0046
2016-03-15,50.8873
2016-03-16,51.5097
2016-03-17,52.6912
2016-03-18,52.3936
2016-03-21,52.1749
2016-03-22,52.3024
2016-03-23,51.9106
2016-03-24,52.5212
2016-03-28,53.1773
2016-03-29,54.1343
2016-03-30,54.2619
2016-03-31,55.0183
2016-04-01,55.0365
2016-04-04,54.7266
2016-04-05,54.672
2016-04-06,54.5626
2016-04-07,53.6239
2016-04-08,53.9155
2016-04-11,53.8335
2016-04-12,53.6512
2016-04-13,54.0067
2016-04-14,54.3621
2016-04-15,55.4375
2016-04-18,55.3646
2016-04-19,55.8476
2016-04-20,55.4557
2016-04-21,53.9429
2016-04-22,54.5899
2016-04-25,55.319
2016-04-26,55.5104
2016-04-27,55.9752
2016-04-28,55.4922
2016-04-29,54.4532
2016-05-02,55.2188
2016-05-03,54.9089
2016-05-04,56.5585
2016-05-05,56.4218
2016-05-06,57.2602
2016-05-09,57.8252
2016-05-10,57.9802
2016-05-11,57.1782
2016-05-12,57.7797
2016-05-13,57.7706
2016-05-16,58.2718
2016-05-17,57.2055
2016-05-18,56.9959
2016-05-19,56.3762
2016-05-20,56.9321
2016-05-23,56.8136
2016-05-24,57.6521
2016-05-25,57.5792
2016-05-26,57.9437
2016-05-27,58.4996
2016-05-31,58.3538
2016-06-01,59.0464
2016-06-02,58.9827
2016-06-03,59.976
2016-06-06,59.4657
2016-06-07,59.9213
2016-06-08,61.4342
2016-06-09,62.1268
2016-06-10,61.9719
2016-06-13,61.4433
2016-06-14,61.1061
2016-06-15,61.7039
2016-06-16,62.3751
2016-06-17,62.2372
2016-06-20,62.4855
2016-06-21,62.3751
2016-06-22,62.6326
2016-06-23,63.1936
2016-06-24,62.0901
2016-06-27,61.6119
2016-06-28,62.4947
2016-06-29,63.4419
2016-06-30,63.3775
2016-07-01,64.0028
2016-07-05,64.2787
2016-07-06,64.4166
2016-07-07,63.8557
2016-07-08,65.4373
2016-07-11,65.9799
2016-07-12,65.7868
2016-07-13,65.9523
2016-07-14,65.7868
2016-07-15,65.9983
2016-07-18,65.9155
2016-07-19,65.8971
2016-07-20,66.3201
2016-07-21,65.4098
2016-07-22,65.6121
2016-07-25,65.9339
2016-07-26,66.0167
2016-07-27,65.9063
2016-07-28,67.111
2016-07-29,67.6995
2016-08-01,68.2421
2016-08-02,67.111
2016-08-03,66.8995
2016-08-04,66.9455
2016-08-05,66.8443
2016-08-08,66.596
2016-08-09,67.1294
2016-08-10,67.442
2016-08-11,66.9179
2016-08-12,67.4972
2016-08-15,67.2581
2016-08-16,66.4765
2016-08-17,66.2926
2016-08-18,66.4305
2016-08-19,66.5592
2016-08-22,66.734
2016-08-23,67.0006
2016-08-24,66.5225
2016-08-25,67.0098
2016-08-26,66.8167
2016-08-29,67.4788
2016-08-30,67.4972
2016-08-31,67.4788
2016-09-01,67.7271
2016-09-02,68.6743
2016-09-06,68.8398
2016-09-07,69.1249
2016-09-08,68.0857
2016-09-09,64.9408
2016-09-12,65.4741
2016-09-13,63.8649
2016-09-14,63.7545
2016-09-15,64.302
2016-09-16,64.9422
2016-09-19,65.7309
2016-09-20,65.8608
2016-09-21,67.3269
2016-09-22,68.3011
2016-09-23,68.2826
2016-09-26,68.5702
2016-09-27,68.0321
2016-09-28,69.6651
2016-09-29,68.8115
2016-09-30,68.2547
2016-10-03,66.9372
2016-10-04,66.3619
2016-10-05,64.0236
2016-10-06,63.2813
2016-10-07,63.4019
2016-10-10,64.1535
2016-10-11,63.7824
2016-10-12,63.8288
2016-10-13,64.1814
2016-10-14,64.0886
2016-10-17,64.3855
2016-10-18,64.7195
2016-10-19,64.6175
2016-10-20,64.701
2016-10-21,64.636
2016-10-24,65.0628
2016-10-25,64.4783
2016-10-26,63.17
2016-10-27,61.8338
2016-10-28,61.8431
2016-10-31,63.0122
2016-11-01,61.3235
2016-11-02,60.1636
2016-11-03,60.1915
2016-11-04,60.4698
2016-11-07,61.7503
2016-11-08,61.9916
2016-11-09,61.2029
2016-11-10,59.7647
2016-11-11,60.3028
2016-11-14,60.8039
2016-11-15,60.7482
2016-11-16,61.1565
2016-11-17,61.1101
2016-11-18,61.6111
2016-11-21,61.0544
2016-11-22,62.539
2016-11-23,62.5854
2016-11-25,63.0957
2016-11-28,63.1143
2016-11-29,64.0236
2016-11-30,63.3834
2016-12-01,63.3463
2016-12-02,64.4597
2016-12-05,65.0814
2016-12-06,65.6196
2016-12-07,67.9949
2016-12-08,68.2269
2016-12-09,68.5053
2016-12-12,68.5146
2016-12-13,69.2012
2016-12-14,66.4316
2016-12-15,66.5533
2016-12-16,67.8445
2016-12-19,68.2562
2016-12-20,68.5462
2016-12-21,68.2187
2016-12-22,68.0316
2016-12-23,68.2281
2016-12-27,68.1719
2016-12-28,67.8632
2016-12-29,68.6678
2016-12-30,69.0889
2017-01-03,69.3134
2017-01-04,70.6608
2017-01-05,70.614
2017-01-06,70.4924
2017-01-09,69.5754
2017-01-10,69.3415
2017-01-11,69.1076
2017-01-12,69.5661
2017-01-13,69.4538
2017-01-17,69.8374
2017-01-18,70.483
2017-01-19,70.2865
2017-01-20,70.3988
2017-01-23,70.8947
2017-01-24,70.6047
2017-01-25,69.8842
2017-01-26,68.9205
2017-01-27,65.9825
2017-01-30,65.3556
2017-01-31,66.2164
2017-02-01,65.393
2017-02-02,64.6913
2017-02-03,66.4784
2017-02-06,65.7767
2017-02-07,65.4492
2017-02-08,65.7018
2017-02-09,66.1603
2017-02-10,66.8527
2017-02-13,67.1801
2017-02-14,66.9182
2017-02-15,66.572
2017-02-16,66.8807
2017-02-17,66.8527
2017-02-21,68.069
2017-02-22,67.7883
2017-02-23,68.6959
2017-02-24,69.3509
2017-02-27,70.1743
2017-02-28,69.5567
2017-03-01,70.0994
2017-03-02,69.9871
2017-03-03,69.3696
2017-03-06,68.7801
2017-03-07,68.4059
2017-03-08,67.0679
2017-03-09,65.8983
2017-03-10,65.9077
2017-03-13,66.1041
2017-03-14,66.0574
2017-03-15,67.7135
2017-03-16,67.8538
2017-03-17,68.3123
2017-03-20,68.4727
2017-03-21,68.3595
2017-03-22,68.5199
2017-03-23,68.9917
2017-03-24,69.171
2017-03-27,67.7555
2017-03-28,68.1991
2017-03-29,68.2368
2017-03-30,69.0767
2017-03-31,69.3881
2017-04-03,69.5579
2017-04-04,70.3034
2017-04-05,70.4072
2017-04-06,71.1056
2017-04-07,71.8605
2017-04-10,72.4739
2017-04-11,73.3515
2017-04-12,73.8516
2017-04-13,72.974
2017-04-17,73.8139
2017-04-18,73.9177
2017-04-19,73.7006
2017-04-20,73.9177
2017-04-21,74.7387
2017-04-24,74.2197
2017-04-25,74.55
2017-04-26,74.4273
2017-04-27,74.7198
2017-04-28,73.8422
2017-05-01,74.3707
2017-05-02,73.6818
2017-05-03,73.0873
2017-05-04,73.3609
2017-05-05,74.0404
2017-05-08,73.729
2017-05-09,73.276
2017-05-10,73.7761
2017-05-11,73.1628
2017-05-12,73.2099
2017-05-15,73.6818
2017-05-16,74.314
2017-05-17,75.0124
2017-05-18,75.1633
2017-05-19,76.0126
2017-05-22,76.1448
2017-05-23,76.8148
2017-05-24,76.626
2017-05-25,76.8336
2017-05-26,76.5222
2017-05-30,76.3146
2017-05-31,76.8525
2017-06-01,78.0038
2017-06-02,79.0796
2017-06-05,78.7021
2017-06-06,78.4001
2017-06-07,78.3624
2017-06-08,78.8153
2017-06-09,80.0893
2017-06-12,81.099
2017-06-13,80.9292
2017-06-14,81.4709
2017-06-15,82.0793
2017-06-16,81.7656
2017-06-19,81.7466
2017-06-20,80.3873
2017-06-21,80.3303
2017-06-22,80.3208
2017-06-23,80.7485
2017-06-26,80.5774
2017-06-27,79.5318
2017-06-28,80.0641
2017-06-29,79.5318
2017-06-30,79.6554
2017-07-03,80.1592
2017-07-05,77.992
2017-07-06,76.6612
2017-07-07,77.4692
2017-07-10,77.5832
2017-07-11,76.8893
2017-07-12,78.106
2017-07-13,77.6783
2017-07-14,78.163
2017-07-17,79.6174
2017-07-18,79.9691
2017-07-19,80.8151
2017-07-20,80.0546
2017-07-21,79.7124
2017-07-24,80.2067
2017-07-25,80.7295
2017-07-26,82.3835
2017-07-27,82.6021
2017-07-28,82.1458
2017-07-31,82.8682
2017-08-01,82.2694
2017-08-02,82.2694
2017-08-03,82.0222
2017-08-04,81.6991
2017-08-07,80.625
2017-08-08,80.0166
2017-08-09,79.9976
2017-08-10,80.4063
2017-08-11,80.1022
2017-08-14,81.9367
2017-08-15,81.3379
2017-08-16,81.9842
2017-08-17,80.9767
2017-08-18,81.0242
2017-08-21,81.7371
2017-08-22,81.528
2017-08-23,82.4025
2017-08-24,81.8512
2017-08-25,82.2694
2017-08-28,81.4614
2017-08-29,81.8797
2017-08-30,82.3454
2017-08-31,84.4651
2017-09-01,84.7978
2017-09-05,84.5982
2017-09-06,85.3587
2017-09-07,85.9195
2017-09-08,85.8339
2017-09-11,86.6514
2017-09-12,85.7008
2017-09-13,85.0735
2017-09-14,86.9691
2017-09-15,86.8447
2017-09-18,86.6915
2017-09-19,86.1649
2017-09-20,86.0692
2017-09-21,86.4426
2017-09-22,85.399
2017-09-25,85.5043
2017-09-26,84.4512
2017-09-27,84.2023
2017-09-28,84.5948
2017-09-29,84.365
2017-10-02,85.0065
2017-10-03,84.9107
2017-10-04,84.8533
2017-10-05,85.4756
2017-10-06,85.6958
2017-10-09,86.1075
2017-10-10,86.433
2017-10-11,86.7298
2017-10-12,87.8691
2017-10-13,88.2999
2017-10-16,87.8499
2017-10-17,87.467
2017-10-18,87.7542
2017-10-19,87.6393
2017-10-20,87.0266
2017-10-23,85.7437
2017-10-24,85.1022
2017-10-25,84.8725
2017-10-26,85.1501
2017-10-27,86.9404
2017-10-30,85.983
2017-10-31,86.7298
2017-11-01,86.883
2017-11-02,87.0744
2017-11-03,88.0031
2017-11-06,88.1754
2017-11-07,88.2808
2017-11-08,88.7882
2017-11-09,88.3382
2017-11-10,87.5914
2017-11-13,88.9509
2017-11-14,88.7212
2017-11-15,87.2851
2017-11-16,89.2956
2017-11-17,88.702
2017-11-20,88.7882
2017-11-21,90.9231
2017-11-22,90.3583
2017-11-24,90.0998
2017-11-27,90.2625
2017-11-28,90.1477
2017-11-29,89.5828
2017-11-30,90.0711
2017-12-01,89.8796
2017-12-04,88.4914
2017-12-05,87.0457
2017-12-06,86.433
2017-12-07,87.1032
2017-12-08,87.4382
2017-12-11,86.8255
2017-12-12,86.883
2017-12-13,87.1223
2017-12-14,86.8909
2017-12-15,87.1802
2017-12-18,87.9611
2017-12-19,84.8469
2017-12-20,84.008
2017-12-21,83.4006
2017-12-22,84.8276
2017-12-26,84.8565
2017-12-27,85.0976
2017-12-28,85.6568
2017-12-29,85.2133
2018-01-02,84.5383
2018-01-03,84.172
2018-01-04,82.7643
2018-01-05,83.2656
2018-01-08,83.1114
2018-01-09,82.1665
2018-01-10,80.3153
2018-01-11,80.4117
2018-01-12,80.8456
2018-01-16,81.5012
2018-01-17,82.2918
2018-01-18,80.4599
2018-01-19,81.8387
2018-01-22,83.7477
2018-01-23,83.9984
2018-01-24,83.4681
2018-01-25,83.4778
2018-01-26,82.7739
2018-01-29,81.6073
2018-01-30,81.3373
2018-01-31,83.6995
2018-02-01,82.8125
2018-02-02,82.3208
2018-02-05,78.7244
2018-02-06,77.9145
2018-02-07,77.8663
2018-02-08,75.3691
2018-02-09,77.4228
2018-02-12,77.1914
2018-02-13,77.7217
2018-02-14,77.5096
2018-02-15,78.9654
2018-02-16,79.1679
2018-02-20,78.1459
2018-02-21,77.1046
2018-02-22,78.2038
2018-02-23,79.1294
2018-02-26,79.0619
2018-02-27,77.4999
2018-02-28,78.1266
2018-03-01,78.0302
2018-03-02,77.7506
2018-03-05,78.8305
2018-03-06,79.0908
2018-03-07,79.8428
2018-03-08,79.9875
2018-03-09,81.1445
2018-03-12,81.3566
2018-03-13,81.0481
2018-03-14,81.0481
2018-03-15,80.8456
2018-03-16,80.9998
2018-03-19,80.7781
2018-03-20,80.7586
2018-03-21,80.0105
2018-03-22,79.2235
2018-03-23,77.5232
2018-03-26,78.796
2018-03-27,79.7773
2018-03-28,80.7295
2018-03-29,80.3117
2018-04-02,78.6892
2018-04-03,79.5344
2018-04-04,79.6802
2018-04-05,79.8745
2018-04-06,79.2041
2018-04-09,79.1167
2018-04-10,79.6413
2018-04-11,79.8551
2018-04-12,78.8349
2018-04-13,79.583
2018-04-16,80.4963
2018-04-17,82.3132
2018-04-18,82.6241
2018-04-19,81.9246
2018-04-20,82.2355
2018-04-23,82.731
2018-04-24,83.2168
2018-04-25,83.4014
2018-04-26,85.1211
2018-04-27,86.0344
2018-04-30,87.2294
2018-05-01,87.21
2018-05-02,87.3266
2018-05-03,87.5404
2018-05-04,87.9581
2018-05-07,90.2025
2018-05-08,90.1151
2018-05-09,89.8916
2018-05-10,90.5231
2018-05-11,89.979
2018-05-14,89.1532
2018-05-15,87.9581
2018-05-16,87.0351
2018-05-17,86.3064
2018-05-18,86.9963
2018-05-21,87.861
2018-05-22,87.4238
2018-05-23,88.6577
2018-05-24,88.7257
2018-05-25,88.8131
2018-05-29,89.6876
2018-05-30,90.9701
2018-05-31,90.5814
2018-06-01,92.4858
2018-06-04,93.2242
2018-06-05,92.3497
2018-06-06,92.3497
2018-06-07,92
2018-06-08,92.3303
2018-06-11,92.2526
2018-06-12,92.2817
2018-06-13,90.63
2018-06-14,91.7279
2018-06-15,92.0097
2018-06-18,92.3497
2018-06-19,91.7432
2018-06-20,91.9193
2018-06-21,91.7921
2018-06-22,92.6921
2018-06-25,92.7703
2018-06-26,93.0931
2018-06-27,92.6236
2018-06-28,93.2496
2018-06-29,93.4746
2018-07-02,93.2203
2018-07-03,94.1887
2018-07-05,95.4799
2018-07-06,95.7048
2018-07-09,94.8245
2018-07-10,94.218
2018-07-11,94.3452
2018-07-12,94.6582
2018-07-13,94.8147
2018-07-16,94.9223
2018-07-17,93.2301
2018-07-18,92.7214
2018-07-19,93.6898
2018-07-20,90.6477
2018-07-23,90.5205
2018-07-24,90.1488
2018-07-25,91.5574
2018-07-26,93.0638
2018-07-27,92.0954
2018-07-30,91.7628
2018-07-31,93.2398
2018-08-01,93.6409
2018-08-02,94.3061
2018-08-03,95.431
2018-08-06,94.4723
2018-08-07,93.7583
2018-08-08,94.1887
2018-08-09,94.5604
2018-08-10,94.1593
2018-08-13,93.592
2018-08-14,94.1789
2018-08-15,94.2963
2018-08-16,95.0495
2018-08-17,96.8102
2018-08-20,96.057
2018-08-21,94.9321
2018-08-22,94.1495
2018-08-23,93.9246
2018-08-24,94.8147
2018-08-27,94.756
2018-08-28,95.6657
2018-08-29,95.4114
2018-08-30,94.7951
2018-08-31,95.1473
2018-09-04,93.0051
2018-09-05,94.3158
2018-09-06,94.9908
2018-09-07,94.3745
2018-09-10,94.8147
2018-09-11,95.2647
2018-09-12,94.6973
2018-09-13,95.9983
2018-09-14,95.9298
2018-09-17,96.4385
2018-09-18,94.7658
2018-09-19,93.3866
2018-09-20,95.1766
2018-09-21,95.0886
2018-09-24,92.8094
2018-09-25,92.6529
2018-09-26,91.3617
2018-09-27,91.8152
2018-09-28,94.2599
2018-10-01,93.077
2018-10-02,92.5743
2018-10-03,91.6674
2018-10-04,91.135
2018-10-05,90.9379
2018-10-08,93.0474
2018-10-09,93.7868
2018-10-10,92.3771
2018-10-11,89.3409
2018-10-12,88.7593
2018-10-15,89.6169
2018-10-16,92.3673
2018-10-17,92.1405
2018-10-18,91.9138
2018-10-19,94.0628
2018-10-22,92.594
2018-10-23,93.8459
2018-10-24,95.8076
2018-10-25,96.0541
2018-10-26,94.3487
2018-10-29,95.3936
2018-10-30,95.9555
2018-10-31,94.4275
2018-11-01,95.0091
2018-11-02,94.6345
2018-11-05,94.9303
2018-11-06,96.8723
2018-11-07,98.3706
2018-11-08,98.134
2018-11-09,97.4637
2018-11-12,97.2666
2018-11-13,97.1483
2018-11-14,97.1778
2018-11-15,96.5075
2018-11-16,98.3903
2018-11-19,97.9566
2018-11-20,97.0793
2018-11-21,97.927
2018-11-23,97.7397
2018-11-26,97.168
2018-11-27,97.5229
2018-11-28,98.7452
2018-11-29,98.8044
2018-11-30,98.5974
2018-12-03,99.8592
2018-12-04,97.582
2018-12-06,100.2436
2018-12-07,99.0015
2018-12-10,99.1691
2018-12-11,99.386
2018-12-12,97.6904
2018-12-13,98.4692
2018-12-14,98.3706
2018-12-17,95.7189
2018-12-18,96.4089
2018-12-19,94.5655
2018-12-20,93.6882
2018-12-21,91.3618
2018-12-24,87.5862
2018-12-26,90.5337
2018-12-27,90.6421
2018-12-28,90.2646
2018-12-31,91.1389
2019-01-02,88.1185
2019-01-03,88.2079
2019-01-04,90.0162
2019-01-07,90.344
2019-01-08,92.8577
2019-01-09,92.818
2019-01-10,93.4737
2019-01-11,94.3679
2019-01-14,93.3843
2019-01-15,94.8349
2019-01-16,96.1961
2019-01-17,97.289
2019-01-18,96.5736
2019-01-22,97.0506
2019-01-23,97.9746
2019-01-24,97.3586
2019-01-25,99.0377
2019-01-28,99.9418
2019-01-29,101.0546
2019-01-30,102.0283
2019-01-31,102.7933
2019-02-01,102.9225
2019-02-04,104.9195
2019-02-05,105.2474
2019-02-06,105.158
2019-02-07,106.1714
2019-02-08,106.8868
2019-02-11,107.1351
2019-02-12,105.923
2019-02-13,105.6945
2019-02-14,106.6781
2019-02-15,106.9265
2019-02-19,106.4496
2019-02-20,105.1878
2019-02-21,104.8003
2019-02-22,105.9627
2019-02-25,105.5951
2019-02-26,105.2176
2019-02-27,104.4426
2019-02-28,104.9791
2019-03-01,105.3964
2019-03-04,106.0224
2019-03-05,106.1317
2019-03-06,105.8833
2019-03-07,105.2871
2019-03-08,106.1913
2019-03-11,108.2479
2019-03-12,108.4466
2019-03-13,108.6453
2019-03-14,109.4799
2019-03-15,110.2947
2019-03-18,109.0328
2019-03-19,107.7015
2019-03-20,108.3672
2019-03-21,110.2748
2019-03-22,109.1918
2019-03-25,109.2315
2019-03-26,110.5033
2019-03-27,111.01
2019-03-28,112.3
2019-03-29,111.64
2019-04-01,111.78
2019-04-02,112.47
2019-04-03,112.24
2019-04-04,111.8
2019-04-05,111.9
2019-04-08,111.2
2019-04-09,111.19
2019-04-10,113.16
2019-04-11,113.48
2019-04-12,113.7
2019-04-15,112.71
2019-04-16,109.8
2019-04-17,109.18
2019-04-18,110.69
2019-04-22,109.45
2019-04-23,111.54
2019-04-24,112.97
2019-04-25,112.92
2019-04-26,112.93
2019-04-29,112.96
2019-04-30,114.33
2019-05-01,115
2019-05-02,112.67
2019-05-03,113.57
2019-05-06,111.38
2019-05-07,109.89
2019-05-08,110.58
2019-05-09,111.79
2019-05-10,112.14
2019-05-13,112.04
2019-05-14,112.14
2019-05-15,112.49
2019-05-16,113.31
2019-05-17,113.45
2019-05-20,112.44
2019-05-21,113.69
2019-05-22,113.35
2019-05-23,112.83
2019-05-24,113.38
2019-05-28,113.13
2019-05-29,110.34
2019-05-30,110.68
2019-05-31,111
2019-06-03,111.79
2019-06-04,111.35
2019-06-05,112.6
2019-06-06,114.45
2019-06-07,115.35
2019-06-10,114.65
2019-06-11,114.48
2019-06-12,115.6
2019-06-13,115.31
2019-06-14,115.35
2019-06-17,116
2019-06-18,116.38
2019-06-19,117.72
2019-06-20,118.22
2019-06-21,116.23
2019-06-24,116.09
2019-06-25,116.04
2019-06-26,112.72
2019-06-27,113.58
2019-06-28,115.41
2019-07-01,115.65
2019-07-02,117.405
2019-07-03,118.99
2019-07-04,118.99
2019-07-05,118.75
2019-07-08,119.105
2019-07-09,119.7
2019-07-10,120.23
2019-07-11,119.025
2019-07-12,119.145
2019-07-15,118.49
2019-07-16,118.725
2019-07-17,118.46
2019-07-18,118.93
2019-07-19,116.565
2019-07-22,116.825
2019-07-23,118.36
2019-07-24,119.005
2019-07-25,120.09
2019-07-26,120.955
2019-07-29,121.38
2019-07-30,121.74
2019-07-31,120.74
2019-08-01,120.73
2019-08-02,119.89
2019-08-05,117.54
2019-08-06,118.83
2019-08-07,120.065
2019-08-08,122.2
2019-08-09,122
2019-08-12,121.86
2019-08-13,122.67
2019-08-14,121.86
2019-08-15,122.92
2019-08-16,124.74
2019-08-19,125.025
2019-08-20,122.76
2019-08-21,123.32
2019-08-22,124.085
2019-08-23,122
2019-08-26,122.61
2019-08-27,122.105
2019-08-28,122.5
2019-08-29,123.82
2019-08-30,124.49
2019-09-02,124.45
2019-09-03,125.42
2019-09-04,126.2
2019-09-05,125.84
2019-09-06,125.425
2019-09-09,124.57
2019-09-10,122.66
2019-09-11,123.01
2019-09-12,125.53
2019-09-13,125.37
2019-09-16,125.92
2019-09-17,126.99
2019-09-18,126.235
2019-09-19,126.33
2019-09-20,127.275
2019-09-23,126.75
2019-09-24,125.685
2019-09-25,125.53
2019-09-26,126.42
2019-09-27,124.88
2019-09-30,124.935
2019-10-01,123.44
2019-10-02,123.74
2019-10-03,125.28
2019-10-04,126.01
2019-10-07,126.975
2019-10-08,125.995
2019-10-09,125.63
2019-10-10,125.79
2019-10-11,126.195
2019-10-14,126.89
2019-10-15,126.99
2019-10-16,126.28
2019-10-17,127.47
2019-10-18,128.015
2019-10-21,128.695
2019-10-22,127.95
2019-10-23,129.24
2019-10-24,133.58
2019-10-25,132.705
2019-10-28,133.29
2019-10-29,133.51
2019-10-30,134.33
2019-10-31,134.025
2019-11-01,133.63
2019-11-04,134.095
2019-11-05,130.83
2019-11-06,131.72
2019-11-07,130.73
2019-11-08,130.84
2019-11-11,130.53
2019-11-12,129.61
2019-11-13,130.925
2019-11-14,132.15
2019-11-15,132.08
2019-11-18,132.175
2019-11-19,133.6
2019-11-20,134.315
2019-11-21,132.77
2019-11-22,132.345
2019-11-25,133.61
