date,close
2014-06-13,1.73
2014-06-16,1.67
2014-06-17,1.75
2014-06-18,1.76
2014-06-19,1.76
2014-06-20,1.79
2014-06-23,1.75
2014-06-24,1.74
2014-06-25,1.75
2014-06-26,1.71
2014-06-27,1.65
2014-06-30,1.56
2014-07-01,1.67
2014-07-02,1.65
2014-07-03,1.62
2014-07-07,1.59
2014-07-08,1.54
2014-07-09,1.55
2014-07-10,1.53
2014-07-11,1.53
2014-07-14,1.55
2014-07-15,1.53
2014-07-16,1.5
2014-07-17,1.51
2014-07-18,1.54
2014-07-21,1.56
2014-07-22,1.61
2014-07-23,1.61
2014-07-24,1.6
2014-07-25,1.69
2014-07-28,1.74
2014-07-29,1.74
2014-07-30,1.71
2014-07-31,1.77
2014-08-01,1.62
2014-08-04,1.58
2014-08-05,1.54
2014-08-06,1.54
2014-08-07,1.59
2014-08-08,1.6
2014-08-11,1.63
2014-08-12,1.64
2014-08-13,1.635
2014-08-14,1.66
2014-08-15,1.64
2014-08-18,1.7
2014-08-19,1.63
2014-08-20,1.62
2014-08-21,1.58
2014-08-22,1.53
2014-08-25,1.54
2014-08-26,1.51
2014-08-27,1.47
2014-08-28,1.35
2014-08-29,1.3
2014-09-02,1.35
2014-09-03,1.32
2014-09-04,1.37
2014-09-05,1.34
2014-09-08,1.36
2014-09-09,1.33
2014-09-10,1.36
2014-09-11,1.36
2014-09-12,1.42
2014-09-15,1.39
2014-09-16,1.38
2014-09-17,1.4
2014-09-18,1.38
2014-09-19,1.29
2014-09-22,1.4
2014-09-23,1.41
2014-09-24,1.32
2014-09-25,1.29
2014-09-26,1.28
2014-09-29,1.29
2014-09-30,1.25
2014-10-01,1.2
2014-10-02,1.14
2014-10-03,1.17
2014-10-06,1.16
2014-10-07,1.17
2014-10-08,1.12
2014-10-09,1.1
2014-10-10,1.07
2014-10-13,1.08
2014-10-14,1.06
2014-10-15,1.07
2014-10-16,1.2
2014-10-17,1.18
2014-10-20,1.21
2014-10-21,1.17
2014-10-22,1.07
2014-10-23,1.18
2014-10-24,1.11
2014-10-27,1.09
2014-10-28,1.2
2014-10-29,1.15
2014-10-30,1.17
2014-10-31,1.15
2014-11-03,1.11
2014-11-04,1.09
2014-11-05,1.36
2014-11-06,1.47
2014-11-07,1.72
2014-11-10,1.9
2014-11-11,1.8
2014-11-12,1.68
2014-11-13,1.57
2014-11-14,1.81
2014-11-17,1.9
2014-11-18,1.9
2014-11-19,1.87
2014-11-20,1.94
2014-11-21,1.9
2014-11-24,1.75
2014-11-25,1.81
2014-11-26,1.87
2014-11-28,1.735
2014-12-01,1.69
2014-12-02,1.71
2014-12-03,1.81
2014-12-04,1.72
2014-12-05,1.75
2014-12-08,1.71
2014-12-09,1.76
2014-12-10,1.72
2014-12-11,1.7
2014-12-12,1.76
2014-12-15,1.61
2014-12-16,1.72
2014-12-17,1.78
2014-12-18,1.77
2014-12-19,1.68
2014-12-22,1.66
2014-12-23,1.67
2014-12-24,1.71
2014-12-26,1.67
2014-12-29,1.68
2014-12-30,1.69
2014-12-31,1.75
2015-01-02,1.77
2015-01-05,1.67
2015-01-06,1.59
2015-01-07,1.5
2015-01-08,1.47
2015-01-09,1.5
2015-01-12,1.49
2015-01-13,1.31
2015-01-14,1.19
2015-01-15,1.25
2015-01-16,1.2
2015-01-20,1.17
2015-01-21,1.11
2015-01-22,1.2
2015-01-23,1.13
2015-01-26,1.37
2015-01-27,1.441
2015-01-28,1.2701
2015-01-29,1.34
2015-01-30,1.27
2015-02-02,1.3
2015-02-03,1.31
2015-02-04,1.29
2015-02-05,1.4
2015-02-06,1.44
2015-02-09,1.42
2015-02-10,1.31
2015-02-11,1.3
2015-02-12,1.39
2015-02-13,1.36
2015-02-17,1.48
2015-02-18,1.44
2015-02-19,1.47
2015-02-20,1.48
2015-02-23,1.52
2015-02-24,1.52
2015-02-25,1.53
2015-02-26,1.43
2015-02-27,1.45
2015-03-02,1.36
2015-03-03,1.3
2015-03-04,1.46
2015-03-05,1.5
2015-03-06,1.54
2015-03-09,1.58
2015-03-10,1.55
2015-03-11,1.58
2015-03-12,1.38
2015-03-13,1.41
2015-03-16,1.45
2015-03-17,1.44
2015-03-18,1.44
2015-03-19,1.46
2015-03-20,1.47
2015-03-23,1.54
2015-03-24,1.5
2015-03-25,1.5
2015-03-26,1.47
2015-03-27,1.47
2015-03-30,1.53
2015-03-31,1.5
2015-04-01,1.49
2015-04-02,1.51
2015-04-06,1.5
2015-04-07,1.48
2015-04-08,1.44
2015-04-09,1.43
2015-04-10,1.43
2015-04-13,1.43
2015-04-14,1.44
2015-04-15,1.49
2015-04-16,1.48
2015-04-17,1.57
2015-04-20,1.86
2015-04-21,1.83
2015-04-22,2.12
2015-04-23,2.4
2015-04-24,2.31
2015-04-27,2.6
2015-04-28,2.7
2015-04-29,2.58
2015-04-30,2.6
2015-05-01,2.48
2015-05-04,2.49
2015-05-05,2.49
2015-05-06,2.35
2015-05-07,2.42
2015-05-08,2.48
2015-05-11,2.4
2015-05-12,2.46
2015-05-13,2.7
2015-05-14,2.82
2015-05-15,2.73
2015-05-18,2.66
2015-05-19,2.62
2015-05-20,2.66
2015-05-21,2.66
2015-05-22,2.7
2015-05-26,2.61
2015-05-27,2.7
2015-05-28,2.9
2015-05-29,2.99
2015-06-01,2.92
2015-06-02,2.97
2015-06-03,2.9
2015-06-04,2.88
2015-06-05,2.9
2015-06-08,2.8
2015-06-09,2.67
2015-06-10,2.79
2015-06-11,2.85
2015-06-12,2.89
2015-06-15,2.79
2015-06-16,2.75
2015-06-17,2.6
2015-06-18,2.42
2015-06-19,1.8
2015-06-22,2.02
2015-06-23,1.86
2015-06-24,1.68
2015-06-25,1.6
2015-06-26,1.64
2015-06-29,1.54
2015-06-30,1.59
2015-07-01,1.48
2015-07-02,1.41
2015-07-06,1.25
2015-07-07,1.28
2015-07-08,1.18
2015-07-09,1.29
2015-07-10,1.3
2015-07-13,1.33
2015-07-14,1.48
2015-07-15,1.47
2015-07-16,1.4
2015-07-17,1.36
2015-07-20,1.26
2015-07-21,1.4
2015-07-22,1.46
2015-07-23,1.46
2015-07-24,1.35
2015-07-27,1.31
2015-07-28,1.32
2015-07-29,1.34
2015-07-30,1.35
2015-07-31,1.34
2015-08-03,1.25
2015-08-04,1.26
2015-08-05,1.25
2015-08-06,1.32
2015-08-07,1.32
2015-08-10,1.38
2015-08-11,1.33
2015-08-12,1.32
2015-08-13,1.25
2015-08-14,1.26
2015-08-17,1.26
2015-08-18,1.25
2015-08-19,1.17
2015-08-20,1.16
2015-08-21,1.17
2015-08-24,1.03
2015-08-25,1.04
2015-08-26,0.9475
2015-08-27,1.07
2015-08-28,1.15
2015-08-31,1.24
2015-09-01,1.16
2015-09-02,1.17
2015-09-03,1.18
2015-09-04,1.13
2015-09-08,1.23
2015-09-09,1.2
2015-09-10,1.16
2015-09-11,1.13
2015-09-14,1.07
2015-09-15,1.13
2015-09-16,1.17
2015-09-17,1.2
2015-09-18,1.09
2015-09-21,1.12
2015-09-22,1.1
2015-09-23,1.07
2015-09-24,1.09
2015-09-25,1.06
2015-09-28,1.01
2015-09-29,1.01
2015-09-30,1
2015-10-01,1
2015-10-02,1.12
2015-10-05,1.12
2015-10-06,1.17
2015-10-07,1.22
2015-10-08,1.23
2015-10-09,1.22
2015-10-12,1.15
2015-10-13,1.14
2015-10-14,1.15
2015-10-15,1.18
2015-10-16,1.2
2015-10-19,1.12
2015-10-20,1.11
2015-10-21,1.08
2015-10-22,1.09
2015-10-23,1.12
2015-10-26,1.11
2015-10-27,1.08
2015-10-28,1.14
2015-10-29,1.1
2015-10-30,1.12
2015-11-02,1.11
2015-11-03,1.11
2015-11-04,1.12
2015-11-05,1.11
2015-11-06,1.1
2015-11-09,1.08
2015-11-10,1.1
2015-11-11,1.07
2015-11-12,1.06
2015-11-13,1.06
2015-11-16,1.05
2015-11-17,1.06
2015-11-18,1.08
2015-11-19,1.13
2015-11-20,1.06
2015-11-23,1.02
2015-11-24,1.03
2015-11-25,1.03
2015-11-27,1.04
2015-11-30,1.08
2015-12-01,1.12
2015-12-02,1.06
2015-12-03,1.08
2015-12-04,1.06
2015-12-07,1.03
2015-12-08,1.03
2015-12-09,1.07
2015-12-10,1.11
2015-12-11,1.04
2015-12-14,1.03
2015-12-15,1.02
2015-12-16,1.02
2015-12-17,0.9842
2015-12-18,0.9901
2015-12-21,0.9901
2015-12-22,1.01
2015-12-23,1.02
2015-12-24,0.9999
2015-12-28,1.02
2015-12-29,1.02
2015-12-30,1.01
2015-12-31,1.06
2016-01-04,1.11
2016-01-05,1.08
2016-01-06,1.08
2016-01-07,1.01
2016-01-08,1
2016-01-11,1.01
2016-01-12,0.98
2016-01-13,0.9101
2016-01-14,0.7999
2016-01-15,0.7224
2016-01-19,0.7
2016-01-20,0.6866
2016-01-21,0.7795
2016-01-22,0.82
2016-01-25,0.83
2016-01-26,0.8401
2016-01-27,0.8715
2016-01-28,0.9079
2016-01-29,0.9556
2016-02-01,0.98
2016-02-02,0.93
2016-02-03,0.9094
2016-02-04,0.915
2016-02-05,0.865
2016-02-08,0.82
2016-02-09,0.8257
2016-02-10,0.8599
2016-02-11,0.8177
2016-02-12,0.8831
2016-02-16,0.9001
2016-02-17,0.93
2016-02-18,0.91
2016-02-19,0.9
2016-02-22,0.9208
2016-02-23,0.8757
2016-02-24,0.899
2016-02-25,0.8599
2016-02-26,0.89
2016-02-29,0.8611
2016-03-01,0.9012
2016-03-02,0.9147
2016-03-03,0.8701
2016-03-04,0.92
2016-03-07,0.8591
2016-03-08,0.822
2016-03-09,0.7999
2016-03-10,0.8055
2016-03-11,0.79
2016-03-14,0.79
2016-03-15,0.7426
2016-03-16,0.7609
2016-03-17,0.8093
2016-03-18,0.84
2016-03-21,0.81
2016-03-22,0.77
2016-03-23,0.75
2016-03-24,0.7313
2016-03-28,0.7306
2016-03-29,0.7473
2016-03-30,0.7599
2016-03-31,0.748
2016-04-01,0.7724
2016-04-04,0.73
2016-04-05,0.7009
2016-04-06,0.72
2016-04-07,0.71
2016-04-08,0.7158
2016-04-11,0.7133
2016-04-12,0.7255
2016-04-13,0.7676
2016-04-14,0.75
2016-04-15,0.7549
2016-04-18,0.79
2016-04-19,0.795
2016-04-20,0.78
2016-04-21,0.799
2016-04-22,0.8057
2016-04-25,0.8157
2016-04-26,0.8
2016-04-27,0.85
2016-04-28,0.8058
2016-04-29,0.8108
2016-05-02,0.8289
2016-05-03,0.8
2016-05-04,0.761
2016-05-05,0.7814
2016-05-06,0.7805
2016-05-09,0.7501
2016-05-10,0.7697
2016-05-11,0.7896
2016-05-12,0.7607
2016-05-13,0.7495
2016-05-16,0.7899
2016-05-17,0.7521
2016-05-18,0.74
2016-05-19,0.7231
2016-05-20,0.72
2016-05-23,0.746
2016-05-24,0.73
2016-05-25,0.78
2016-05-26,0.7599
2016-05-27,0.7679
2016-05-31,0.78
2016-06-01,0.7899
2016-06-02,0.8139
2016-06-03,0.925
2016-06-06,1.12
2016-06-07,1.08
2016-06-08,0.99
2016-06-09,1
2016-06-10,1
2016-06-13,1.06
2016-06-14,1.01
2016-06-15,1.02
2016-06-16,0.9512
2016-06-17,0.9886
2016-06-20,1.01
2016-06-21,0.9855
2016-06-22,0.931
2016-06-23,0.9604
2016-06-24,0.86
2016-06-27,0.85
2016-06-28,0.82
2016-06-29,0.85
2016-06-30,0.8778
2016-07-01,0.9426
2016-07-05,0.9101
2016-07-06,0.911
2016-07-07,0.9275
2016-07-08,0.9201
2016-07-11,0.9209
2016-07-12,0.9755
2016-07-13,0.9518
2016-07-14,0.9502
2016-07-15,0.9381
2016-07-18,0.95
2016-07-19,0.9219
2016-07-20,0.9142
2016-07-21,0.9288
2016-07-22,0.9334
2016-07-25,0.9
2016-07-26,0.9296
2016-07-27,0.9336
2016-07-28,0.9325
2016-07-29,0.9601
2016-08-01,1.04
2016-08-02,0.9301
2016-08-03,0.9764
2016-08-04,0.9925
2016-08-05,0.9872
2016-08-08,1.03
2016-08-09,1.03
2016-08-10,1.06
2016-08-11,1.2
2016-08-12,1.12
2016-08-15,1.07
2016-08-16,1.12
2016-08-17,1.09
2016-08-18,1.08
2016-08-19,1.07
2016-08-22,1.04
2016-08-23,1.05
2016-08-24,1.06
2016-08-25,1.02
2016-08-26,1.01
2016-08-29,1.01
2016-08-30,1.04
2016-08-31,1.01
2016-09-01,1.02
2016-09-02,1.04
2016-09-06,1.07
2016-09-07,1.1
2016-09-08,1.14
2016-09-09,1.06
2016-09-12,1.06
2016-09-13,1.05
2016-09-14,1.03
2016-09-15,1.03
2016-09-16,1.03
2016-09-19,1.04
2016-09-20,1.06
2016-09-21,1.06
2016-09-22,1.08
2016-09-23,1.04
2016-09-26,1.05
2016-09-27,1.01
2016-09-28,1.01
2016-09-29,1.02
2016-09-30,0.9871
2016-10-03,0.9596
2016-10-04,0.91
2016-10-05,0.9369
2016-10-06,0.911
2016-10-07,0.92
2016-10-10,0.96
2016-10-11,0.9361
2016-10-12,0.9492
2016-10-13,0.9318
2016-10-14,0.9001
2016-10-17,0.9094
2016-10-18,0.89
2016-10-19,0.9301
2016-10-20,0.925
2016-10-21,0.9001
2016-10-24,0.9101
2016-10-25,0.8951
2016-10-26,0.8602
2016-10-27,0.864
2016-10-28,0.8642
2016-10-31,0.8979
2016-11-01,0.8799
2016-11-02,0.8535
2016-11-03,0.8601
2016-11-04,0.8724
2016-11-07,0.8806
2016-11-08,0.8851
2016-11-09,0.905
2016-11-10,0.9799
2016-11-11,0.923
2016-11-14,0.92
2016-11-15,0.9201
2016-11-16,0.9201
2016-11-17,0.9175
2016-11-18,0.918
2016-11-21,0.9174
2016-11-22,0.87
2016-11-23,0.8667
2016-11-25,0.8615
2016-11-28,0.8553
2016-11-29,0.821
2016-11-30,0.8786
2016-12-01,0.8866
2016-12-02,0.8894
2016-12-05,0.8909
2016-12-06,0.9104
2016-12-07,1.01
2016-12-08,0.96
2016-12-09,1.07
2016-12-12,1.1
2016-12-13,1
2016-12-14,0.9511
2016-12-15,1.02
2016-12-16,1.09
2016-12-19,0.99
2016-12-20,0.95
2016-12-21,0.9451
2016-12-22,0.99
2016-12-23,1.02
2016-12-27,1.08
2016-12-28,1.09
2016-12-29,1.09
2016-12-30,1.12
2017-01-03,1.3
2017-01-04,1.3
2017-01-05,1.39
2017-01-06,1.29
2017-01-09,1.35
2017-01-10,1.48
2017-01-11,1.66
2017-01-12,1.58
2017-01-13,1.68
2017-01-17,1.57
2017-01-18,1.49
2017-01-19,1.56
2017-01-20,1.54
2017-01-23,1.59
2017-01-24,1.8
2017-01-25,1.74
2017-01-26,1.65
2017-01-27,1.59
2017-01-30,1.57
2017-01-31,1.61
2017-02-01,1.55
2017-02-02,1.51
2017-02-03,1.61
2017-02-06,1.54
2017-02-07,1.58
2017-02-08,1.66
2017-02-09,1.7
2017-02-10,1.73
2017-02-13,1.76
2017-02-14,1.84
2017-02-15,1.73
2017-02-16,1.67
2017-02-17,1.7
2017-02-21,1.62
2017-02-22,1.58
2017-02-23,1.54
2017-02-24,1.6
2017-02-27,1.62
2017-02-28,1.49
2017-03-01,1.48
2017-03-02,1.4
2017-03-03,1.32
2017-03-06,1.29
2017-03-07,1.29
2017-03-08,1.38
2017-03-09,1.34
2017-03-10,1.31
2017-03-13,1.33
2017-03-14,1.37
2017-03-15,1.46
2017-03-16,1.54
2017-03-17,1.45
2017-03-20,1.48
2017-03-21,1.38
2017-03-22,1.31
2017-03-23,1.29
2017-03-24,1.32
2017-03-27,1.35
2017-03-28,1.35
2017-03-29,1.39
2017-03-30,1.43
2017-03-31,1.42
2017-04-03,1.35
2017-04-04,1.38
2017-04-05,1.39
2017-04-06,1.45
2017-04-07,1.51
2017-04-10,1.48
2017-04-11,1.56
2017-04-12,1.46
2017-04-13,1.44
2017-04-17,1.45
2017-04-18,1.43
2017-04-19,1.4
2017-04-20,1.41
2017-04-21,1.41
2017-04-24,1.46
2017-04-25,1.41
2017-04-26,1.35
2017-04-27,1.29
2017-04-28,1.24
2017-05-01,1.24
2017-05-02,1.26
2017-05-03,1.25
2017-05-04,1.11
2017-05-05,1.12
2017-05-08,1.2
2017-05-09,1.35
2017-05-10,1.39
2017-05-11,1.46
2017-05-12,1.54
2017-05-15,1.51
2017-05-16,1.44
2017-05-17,1.4
2017-05-18,1.36
2017-05-19,1.44
2017-05-22,1.41
2017-05-23,1.38
2017-05-24,1.34
2017-05-25,1.3
2017-05-26,1.34
2017-05-30,1.38
2017-05-31,1.39
2017-06-01,1.31
2017-06-02,1.32
2017-06-05,1.27
2017-06-06,1.29
2017-06-07,1.49
2017-06-08,1.51
2017-06-09,1.46
2017-06-12,1.42
2017-06-13,1.45
2017-06-14,1.39
2017-06-15,1.36
2017-06-16,1.32
2017-06-19,1.36
2017-06-20,1.35
2017-06-21,1.37
2017-06-22,1.4
2017-06-23,1.62
2017-06-26,1.55
2017-06-27,1.53
2017-06-28,1.52
2017-06-29,1.58
2017-06-30,1.59
2017-07-03,1.64
2017-07-05,1.58
2017-07-06,1.58
2017-07-07,1.61
2017-07-10,1.7
2017-07-11,1.69
2017-07-12,1.66
2017-07-13,1.64
2017-07-14,1.69
2017-07-17,1.75
2017-07-18,1.71
2017-07-19,1.75
2017-07-20,1.73
2017-07-21,1.69
2017-07-24,1.68
2017-07-25,1.69
2017-07-26,1.69
2017-07-27,1.66
2017-07-28,1.61
2017-07-31,1.6
2017-08-01,1.59
2017-08-02,1.53
2017-08-03,1.48
2017-08-04,1.46
2017-08-07,1.41
2017-08-08,1.42
2017-08-09,1.37
2017-08-10,1.32
2017-08-11,1.32
2017-08-14,1.36
2017-08-15,1.4
2017-08-16,1.39
2017-08-17,1.33
2017-08-18,1.33
2017-08-21,1.3
2017-08-22,1.28
2017-08-23,1.3
2017-08-24,1.36
2017-08-25,1.31
2017-08-28,1.31
2017-08-29,1.34
2017-08-30,1.3
2017-08-31,1.32
2017-09-01,1.34
2017-09-05,1.29
2017-09-06,1.31
2017-09-07,1.33
2017-09-08,1.3
2017-09-11,1.32
2017-09-12,1.39
2017-09-13,1.38
2017-09-14,1.37
2017-09-15,1.35
2017-09-18,1.37
2017-09-19,1.37
2017-09-20,1.36
2017-09-21,1.33
2017-09-22,1.35
2017-09-25,1.36
2017-09-26,1.39
2017-09-27,1.4
2017-09-28,1.39
2017-09-29,1.38
2017-10-02,1.38
2017-10-03,1.32
2017-10-04,1.3
2017-10-05,1.28
2017-10-06,1.28
2017-10-09,1.22
2017-10-10,1.25
2017-10-11,1.2
2017-10-12,1.19
2017-10-13,1.2
2017-10-16,1.19
2017-10-17,1.17
2017-10-18,1.17
2017-10-19,1.18
2017-10-20,1.2
2017-10-23,1.18
2017-10-24,1.17
2017-10-25,1.18
2017-10-26,1.14
2017-10-27,1.16
2017-10-30,1.11
2017-10-31,1.06
2017-11-01,1.09
2017-11-02,1.07
2017-11-03,1.05
2017-11-06,1.11
2017-11-07,1.07
2017-11-08,1.1
2017-11-09,1.3
2017-11-10,1.42
2017-11-13,1.38
2017-11-14,1.3
2017-11-15,1.36
2017-11-16,1.45
2017-11-17,1.49
2017-11-20,1.44
2017-11-21,1.47
2017-11-22,1.46
2017-11-24,1.49
2017-11-27,1.38
2017-11-28,1.36
2017-11-29,1.41
2017-11-30,1.33
2017-12-01,1.33
2017-12-04,1.49
2017-12-05,1.55
2017-12-06,1.54
2017-12-07,1.65
2017-12-08,1.61
2017-12-11,1.74
2017-12-12,1.68
2017-12-13,1.78
2017-12-14,1.73
2017-12-15,1.84
2017-12-18,1.84
2017-12-19,1.87
2017-12-20,1.92
2017-12-21,1.89
2017-12-22,1.8
2017-12-26,1.87
2017-12-27,1.86
2017-12-28,1.72
2017-12-29,1.77
2018-01-02,1.9
2018-01-03,1.85
2018-01-04,1.94
2018-01-05,1.98
2018-01-08,1.91
2018-01-09,1.8
2018-01-10,1.77
2018-01-11,1.69
2018-01-12,1.72
2018-01-16,1.63
2018-01-17,1.67
2018-01-18,1.61
2018-01-19,1.64
2018-01-22,1.62
2018-01-23,1.66
2018-01-24,1.63
2018-01-25,1.59
2018-01-26,1.57
2018-01-29,1.55
2018-01-30,1.56
2018-01-31,1.57
2018-02-01,1.48
2018-02-02,1.45
2018-02-05,1.4
2018-02-06,1.48
2018-02-07,1.41
2018-02-08,1.35
2018-02-09,1.32
2018-02-12,1.27
2018-02-13,1.38
2018-02-14,1.49
2018-02-15,1.48
2018-02-16,1.43
2018-02-20,1.41
2018-02-21,1.38
2018-02-22,1.39
2018-02-23,1.42
2018-02-26,1.42
2018-02-27,1.38
2018-02-28,1.3
2018-03-01,1.29
2018-03-02,1.38
2018-03-05,1.33
2018-03-06,1.38
2018-03-07,1.36
2018-03-08,1.32
2018-03-09,1.4
2018-03-12,1.36
2018-03-13,1.34
2018-03-14,1.36
2018-03-15,1.32
2018-03-16,1.34
2018-03-19,1.33
2018-03-20,1.32
2018-03-21,1.35
2018-03-22,1.33
2018-03-23,1.3
2018-03-26,1.29
2018-03-27,1.26
2018-03-28,1.26
2018-03-29,1.31
2018-04-02,1.28
2018-04-03,1.32
2018-04-04,1.35
2018-04-05,1.41
2018-04-06,1.39
2018-04-09,1.48
2018-04-10,1.5
2018-04-11,1.5
2018-04-12,1.53
2018-04-13,1.49
2018-04-16,1.64
2018-04-17,1.69
2018-04-18,1.7
2018-04-19,1.62
2018-04-20,1.6
2018-04-23,1.54
2018-04-24,1.54
2018-04-25,1.46
2018-04-26,1.53
2018-04-27,1.52
2018-04-30,1.51
2018-05-01,1.61
2018-05-02,1.7
2018-05-03,1.64
2018-05-04,1.64
2018-05-07,1.56
2018-05-08,1.56
2018-05-09,1.61
2018-05-10,1.62
2018-05-11,1.63
2018-05-14,1.62
2018-05-15,1.53
2018-05-16,1.55
2018-05-17,1.57
2018-05-18,1.6
2018-05-21,1.64
2018-05-22,1.58
2018-05-23,1.62
2018-05-24,1.65
2018-05-25,1.63
2018-05-29,1.55
2018-05-30,1.56
2018-05-31,1.5
2018-06-01,1.59
2018-06-04,1.66
2018-06-05,1.79
2018-06-06,1.73
2018-06-07,1.71
2018-06-08,1.72
2018-06-11,1.67
2018-06-12,1.64
2018-06-13,1.66
2018-06-14,1.63
2018-06-15,1.63
2018-06-18,1.59
2018-06-19,1.55
2018-06-20,1.62
2018-06-21,1.67
2018-06-22,1.76
2018-06-25,1.71
2018-06-26,1.64
2018-06-27,1.64
2018-06-28,1.58
2018-06-29,1.61
2018-07-02,1.59
2018-07-03,1.64
2018-07-05,1.67
2018-07-06,1.68
2018-07-09,1.62
2018-07-10,1.61
2018-07-11,1.62
2018-07-12,1.62
2018-07-13,1.6
2018-07-16,1.56
2018-07-17,1.54
2018-07-18,1.61
2018-07-19,1.52
2018-07-20,1.66
2018-07-23,1.56
2018-07-24,1.55
2018-07-25,1.53
2018-07-26,1.66
2018-07-27,1.65
2018-07-30,1.62
2018-07-31,1.65
2018-08-01,1.68
2018-08-02,1.75
2018-08-03,1.77
2018-08-06,1.83
2018-08-07,1.78
2018-08-08,1.74
2018-08-09,1.76
2018-08-10,1.71
2018-08-13,1.62
2018-08-14,1.7
2018-08-15,1.61
2018-08-16,1.62
2018-08-17,1.61
2018-08-20,1.66
2018-08-21,1.69
2018-08-22,1.69
2018-08-23,1.67
2018-08-24,1.63
2018-08-27,1.67
2018-08-28,1.65
2018-08-29,1.7
2018-08-30,1.67
2018-08-31,1.71
2018-09-04,1.69
2018-09-05,1.64
2018-09-06,1.62
2018-09-07,1.64
2018-09-10,1.62
2018-09-11,1.6
2018-09-12,1.7
2018-09-13,1.79
2018-09-14,1.75
2018-09-17,1.73
2018-09-18,1.74
2018-09-19,1.72
2018-09-20,1.75
2018-09-21,1.71
2018-09-24,1.68
2018-09-25,1.65
2018-09-26,1.62
2018-09-27,1.68
2018-09-28,1.72
2018-10-01,1.54
2018-10-02,1.55
2018-10-03,1.54
2018-10-04,1.54
2018-10-05,1.55
2018-10-08,1.54
2018-10-09,1.52
2018-10-10,1.43
2018-10-11,1.44
2018-10-12,1.45
2018-10-15,1.48
2018-10-16,1.48
2018-10-17,1.45
2018-10-18,1.39
2018-10-19,1.36
2018-10-22,1.37
2018-10-23,1.29
2018-10-24,1.28
2018-10-25,1.31
2018-10-26,1.21
2018-10-29,1.24
2018-10-30,1.29
2018-10-31,1.33
2018-11-01,1.33
2018-11-02,1.33
2018-11-05,1.42
2018-11-06,1.4
2018-11-07,1.47
2018-11-08,1.41
2018-11-09,1.33
2018-11-12,1.27
2018-11-13,1.26
2018-11-14,1.24
2018-11-15,1.3
2018-11-16,1.26
2018-11-19,1.26
2018-11-20,1.21
2018-11-21,1.29
2018-11-23,1.3
2018-11-26,1.33
2018-11-27,1.29
2018-11-28,1.36
2018-11-29,1.3
2018-11-30,1.32
2018-12-03,1.3
2018-12-04,1.26
2018-12-06,1.28
2018-12-07,1.3
2018-12-10,1.23
2018-12-11,1.23
2018-12-12,1.29
2018-12-13,1.28
2018-12-14,1.27
2018-12-17,1.2
2018-12-18,1.2
2018-12-19,1.16
2018-12-20,1.15
2018-12-21,1.18
2018-12-24,1.18
2018-12-26,1.24
2018-12-27,1.24
2018-12-28,1.2
2018-12-31,1.25
2019-01-02,1.28
2019-01-03,1.25
2019-01-04,1.3
2019-01-07,1.32
2019-01-08,1.29
2019-01-09,1.34
2019-01-10,1.34
2019-01-11,1.3
2019-01-14,1.3
2019-01-15,1.27
2019-01-16,1.29
2019-01-17,1.29
2019-01-18,1.29
2019-01-22,1.26
2019-01-23,1.23
2019-01-24,1.24
2019-01-25,1.29
2019-01-28,1.28
2019-01-29,1.27
2019-01-30,1.3
2019-01-31,1.3
2019-02-01,1.3
2019-02-04,1.33
2019-02-05,1.45
2019-02-06,1.4
2019-02-07,1.33
2019-02-08,1.34
2019-02-11,1.33
2019-02-12,1.35
2019-02-13,1.34
2019-02-14,1.36
2019-02-15,1.4
2019-02-19,1.44
2019-02-20,1.39
2019-02-21,1.36
2019-02-22,1.33
2019-02-25,1.32
2019-02-26,1.31
2019-02-27,1.31
2019-02-28,1.26
2019-03-01,1.26
2019-03-04,1.24
2019-03-05,1.23
2019-03-06,1.22
2019-03-07,1.24
2019-03-08,1.24
2019-03-11,1.27
2019-03-12,1.28
2019-03-13,1.29
2019-03-14,1.33
2019-03-15,1.41
2019-03-18,1.37
2019-03-19,1.38
2019-03-20,1.42
2019-03-21,1.38
2019-03-22,1.32
2019-03-25,1.36
2019-03-26,1.42
2019-03-27,1.39
2019-03-28,1.42
2019-03-29,1.4
2019-04-01,1.49
2019-04-02,1.52
2019-04-03,1.47
2019-04-04,1.48
2019-04-05,1.49
2019-04-08,1.53
2019-04-09,1.51
2019-04-10,1.56
2019-04-11,1.44
2019-04-12,1.4
2019-04-15,1.36
2019-04-16,1.36
2019-04-17,1.36
2019-04-18,1.38
2019-04-22,1.37
2019-04-23,1.42
2019-04-24,1.37
2019-04-25,1.37
2019-04-26,1.38
2019-04-29,1.39
2019-04-30,1.41
2019-05-01,1.44
2019-05-02,1.4
2019-05-03,1.46
2019-05-06,1.45
2019-05-07,1.41
2019-05-08,1.43
2019-05-09,1.38
2019-05-10,1.38
2019-05-13,1.36
2019-05-14,1.39
2019-05-15,1.39
2019-05-16,1.41
2019-05-17,1.4
2019-05-20,1.36
2019-05-21,1.37
2019-05-22,1.33
2019-05-23,1.32
2019-05-24,1.34
2019-05-28,1.3
2019-05-29,1.32
2019-05-30,1.34
2019-05-31,1.35
2019-06-03,1.35
2019-06-04,1.35
2019-06-05,1.33
2019-06-06,1.29
2019-06-07,1.29
2019-06-10,1.3
2019-06-11,1.31
2019-06-12,1.3
2019-06-13,1.315
2019-06-14,1.34
2019-06-17,1.3
2019-06-18,1.295
2019-06-19,1.295
2019-06-20,1.345
2019-06-21,1.335
2019-06-24,1.335
2019-06-25,1.335
2019-06-26,1.315
2019-06-27,1.33
2019-06-28,1.365
2019-07-01,1.365
2019-07-02,1.32
2019-07-03,1.345
2019-07-04,1.345
2019-07-05,1.35
2019-07-08,1.325
2019-07-09,1.39
2019-07-10,1.435
2019-07-11,1.435
2019-07-12,1.075
2019-07-15,1.115
2019-07-16,1.095
2019-07-17,1.095
2019-07-18,1.02
2019-07-19,1.07
2019-07-22,1.035
2019-07-23,0.9853
2019-07-24,0.9673
2019-07-25,0.9324
2019-07-26,0.9601
2019-07-29,0.9493
2019-07-30,0.9618
2019-07-31,0.9831
2019-08-01,0.9659
2019-08-02,0.9498
2019-08-05,0.9283
2019-08-06,0.9107
2019-08-07,0.8767
2019-08-08,0.9196
2019-08-09,0.915
2019-08-12,0.9097
2019-08-13,0.9346
2019-08-14,0.9273
2019-08-15,0.872
2019-08-16,0.8702
2019-08-19,0.89
2019-08-20,0.936
2019-08-21,0.9312
2019-08-22,0.9386
2019-08-23,0.872
2019-08-26,0.8785
2019-08-27,0.8965
2019-08-28,0.9099
2019-08-29,0.9276
2019-08-30,0.9395
2019-09-02,0.9395
2019-09-03,0.967
2019-09-04,0.9513
2019-09-05,0.9699
2019-09-06,1.005
2019-09-09,0.9501
2019-09-10,0.9659
2019-09-11,0.9959
2019-09-12,0.9787
2019-09-13,1.02
2019-09-16,0.9772
2019-09-17,1.005
2019-09-18,0.966
2019-09-19,0.9913
2019-09-20,0.9894
2019-09-23,0.9795
2019-09-24,0.97
2019-09-25,0.9763
2019-09-26,0.9749
2019-09-27,0.9795
2019-09-30,0.9907
2019-10-01,0.9703
2019-10-02,0.9476
2019-10-03,0.9572
2019-10-04,0.9745
2019-10-07,0.9938
2019-10-08,0.9951
2019-10-09,1.065
2019-10-10,1.135
2019-10-11,1.085
2019-10-14,1.065
2019-10-15,1.055
2019-10-16,0.9888
2019-10-17,1.055
2019-10-18,1.045
2019-10-21,1.03
2019-10-22,1.02
2019-10-23,1.015
2019-10-24,1.005
2019-10-25,0.991
2019-10-28,1
2019-10-29,1.005
2019-10-30,0.9952
2019-10-31,0.95
2019-11-01,0.9663
2019-11-04,1.005
2019-11-05,1
2019-11-06,0.9938
2019-11-07,1.025
2019-11-08,1.03
2019-11-11,1.02
2019-11-12,1.025
2019-11-13,1.005
2019-11-14,1.005
2019-11-15,1.01
2019-11-18,0.977
2019-11-19,0.9683
2019-11-20,0.9975
2019-11-21,0.99
2019-11-22,0.9415
2019-11-25,0.9149
