date,close
2014-06-13,25.3444
2014-06-16,25.3995
2014-06-17,24.9527
2014-06-18,24.6773
2014-06-19,24.561
2014-06-20,24.8302
2014-06-23,24.9405
2014-06-24,24.4814
2014-06-25,24.3958
2014-06-26,24.2978
2014-06-27,24.6406
2014-06-30,24.867
2014-07-01,25.1669
2014-07-02,24.9282
2014-07-03,25.0874
2014-07-07,24.8462
2014-07-08,25.3567
2014-07-09,25.9564
2014-07-10,25.7728
2014-07-11,25.7422
2014-07-14,25.7545
2014-07-15,25.7422
2014-07-16,26.1707
2014-07-17,26.1217
2014-07-18,26.0115
2014-07-21,26.4706
2014-07-22,26.3482
2014-07-23,26.7766
2014-07-24,27.2907
2014-07-25,27.3029
2014-07-28,27.3029
2014-07-29,27.5416
2014-07-30,27.0642
2014-07-31,26.4828
2014-08-01,25.6426
2014-08-04,25.5308
2014-08-05,25.2886
2014-08-06,25.2824
2014-08-07,23.6673
2014-08-08,23.6548
2014-08-11,24.1021
2014-08-12,23.9716
2014-08-13,24.655
2014-08-14,24.9407
2014-08-15,25.2264
2014-08-18,25.2761
2014-08-19,25.7731
2014-08-20,25.8663
2014-08-21,25.8414
2014-08-22,26.4129
2014-08-25,26.5806
2014-08-26,26.8291
2014-08-27,26.8043
2014-08-28,26.7918
2014-08-29,26.7608
2014-09-02,26.1831
2014-09-03,26.0837
2014-09-04,25.2761
2014-09-05,24.9842
2014-09-08,24.9531
2014-09-09,26.7049
2014-09-10,26.6055
2014-09-11,25.9657
2014-09-12,25.8352
2014-09-15,25.0525
2014-09-16,25.332
2014-09-17,25.7979
2014-09-18,26.3259
2014-09-19,26.5558
2014-09-22,26.4005
2014-09-23,26.152
2014-09-24,26.27
2014-09-25,25.4687
2014-09-26,25.8414
2014-09-29,26.0091
2014-09-30,25.8849
2014-10-01,25.7855
2014-10-02,25.1581
2014-10-03,25.3383
2014-10-06,24.6487
2014-10-07,24.7171
2014-10-08,24.8662
2014-10-09,25.1457
2014-10-10,23.8226
2014-10-13,22.8597
2014-10-14,22.2634
2014-10-15,23.6051
2014-10-16,23.6673
2014-10-17,23.7667
2014-10-20,24.0772
2014-10-21,24.0213
2014-10-22,24.7792
2014-10-23,24.8351
2014-10-24,24.8537
2014-10-27,24.7854
2014-10-28,25.7793
2014-10-29,25.3134
2014-10-30,25.0276
2014-10-31,25.3942
2014-11-03,25.2695
2014-11-04,24.3036
2014-11-05,23.3568
2014-11-06,23.988
2014-11-07,24.5562
2014-11-10,27.3653
2014-11-11,26.1911
2014-11-12,26.5888
2014-11-13,26.5636
2014-11-14,26.7024
2014-11-17,27.7756
2014-11-18,28.5962
2014-11-19,27.7756
2014-11-20,28.6089
2014-11-21,27.9902
2014-11-24,28.0912
2014-11-25,28.0975
2014-11-26,28.0029
2014-11-28,26.3868
2014-12-01,25.5094
2014-12-02,26.4436
2014-12-03,25.4525
2014-12-04,26.4436
2014-12-05,24.7771
2014-12-08,23.7292
2014-12-09,22.3783
2014-12-10,21.059
2014-12-11,21.6145
2014-12-12,20.9264
2014-12-15,19.9984
2014-12-16,20.2131
2014-12-17,21.5829
2014-12-18,21.9553
2014-12-19,21.564
2014-12-22,22.3846
2014-12-23,22.151
2014-12-24,22.0311
2014-12-26,21.3178
2014-12-29,21.3556
2014-12-30,21.1473
2014-12-31,20.8254
2015-01-02,20.9832
2015-01-05,21.5387
2015-01-06,20.7938
2015-01-07,21.1095
2015-01-08,21.9806
2015-01-09,23.281
2015-01-12,22.656
2015-01-13,22.7571
2015-01-14,22.9086
2015-01-15,23.4704
2015-01-16,24.1332
2015-01-20,23.3441
2015-01-21,23.3757
2015-01-22,23.6345
2015-01-23,23.0474
2015-01-26,23.988
2015-01-27,24.4488
2015-01-28,24.3415
2015-01-29,24.6635
2015-01-30,24.31
2015-02-02,24.9619
2015-02-03,25.6942
2015-02-04,25.1418
2015-02-05,25.0005
2015-02-06,24.2425
2015-02-09,24.7307
2015-02-10,24.6408
2015-02-11,24.6986
2015-02-12,24.7757
2015-02-13,24.493
2015-02-17,24.9234
2015-02-18,24.75
2015-02-19,24.1333
2015-02-20,24.3838
2015-02-23,24.3067
2015-02-24,24.0241
2015-02-25,24.2875
2015-02-26,25.0904
2015-02-27,25.5336
2015-03-02,25.63
2015-03-03,25.9319
2015-03-04,25.6942
2015-03-05,25.129
2015-03-06,24.8591
2015-03-09,24.0948
2015-03-10,23.568
2015-03-11,23.2533
2015-03-12,22.3861
2015-03-13,22.5274
2015-03-16,21.8401
2015-03-17,22.5981
2015-03-18,23.234
2015-03-19,23.7929
2015-03-20,24.159
2015-03-23,24.5573
2015-03-24,23.446
2015-03-25,22.7265
2015-03-26,22.1805
2015-03-27,22.4311
2015-03-30,22.5338
2015-03-31,22.354
2015-04-01,22.3476
2015-04-02,22.2319
2015-04-06,22.733
2015-04-07,22.9193
2015-04-08,22.9578
2015-04-09,23.0863
2015-04-10,23.7543
2015-04-13,24.159
2015-04-14,24.0691
2015-04-15,24.4673
2015-04-16,24.5894
2015-04-17,24.5251
2015-04-20,24.1076
2015-04-21,25.1482
2015-04-22,25.7649
2015-04-23,26.0218
2015-04-24,26.6
2015-04-27,25.9062
2015-04-28,26.8633
2015-04-29,26.6578
2015-04-30,25.7842
2015-05-01,26.1567
2015-05-04,25.9869
2015-05-05,25.719
2015-05-06,25.9215
2015-05-07,25.314
2015-05-08,25.4185
2015-05-11,25.7386
2015-05-12,26.5683
2015-05-13,26.8165
2015-05-14,26.3004
2015-05-15,26.2416
2015-05-18,26.0653
2015-05-19,26.2351
2015-05-20,25.5035
2015-05-21,25.8823
2015-05-22,26.4899
2015-05-26,26.1437
2015-05-27,26.1241
2015-05-28,26.4376
2015-05-29,27.1758
2015-06-01,26.7904
2015-06-02,26.8622
2015-06-03,27.1693
2015-06-04,25.8823
2015-06-05,26.6793
2015-06-08,25.9411
2015-06-09,26.418
2015-06-10,25.8954
2015-06-11,24.3406
2015-06-12,24.1708
2015-06-15,24.3014
2015-06-16,23.4849
2015-06-17,22.9427
2015-06-18,22.5964
2015-06-19,22.4788
2015-06-22,21.8648
2015-06-23,22.1326
2015-06-24,21.9824
2015-06-25,21.6688
2015-06-26,21.8256
2015-06-29,21.6884
2015-06-30,21.1919
2015-07-01,20.8914
2015-07-02,20.813
2015-07-06,20.8718
2015-07-07,20.7999
2015-07-08,21.12
2015-07-09,21.5381
2015-07-10,22.4331
2015-07-13,22.5638
2015-07-14,22.8316
2015-07-15,22.7793
2015-07-16,21.5577
2015-07-17,21.2442
2015-07-20,20.604
2015-07-21,20.9502
2015-07-22,22.5376
2015-07-23,21.3095
2015-07-24,21.3422
2015-07-27,22.0934
2015-07-28,22.1783
2015-07-29,22.6226
2015-07-30,21.2703
2015-07-31,21.2964
2015-08-03,20.9644
2015-08-04,20.9777
2015-08-05,20.1835
2015-08-06,20.3837
2015-08-07,19.6428
2015-08-10,21.0645
2015-08-11,21.0912
2015-08-12,21.4383
2015-08-13,20.2769
2015-08-14,21.5717
2015-08-17,22.3126
2015-08-18,21.8587
2015-08-19,21.525
2015-08-20,20.8843
2015-08-21,19.4426
2015-08-24,19.4493
2015-08-25,20.7174
2015-08-26,20.1768
2015-08-27,20.1901
2015-08-28,21.0178
2015-08-31,21.5517
2015-09-01,20.8576
2015-09-02,21.5717
2015-09-03,21.5317
2015-09-04,21.5183
2015-09-08,21.6118
2015-09-09,20.8976
2015-09-10,20.9377
2015-09-11,20.7374
2015-09-14,20.4705
2015-09-15,20.8976
2015-09-16,21.7586
2015-09-17,21.7987
2015-09-18,21.8587
2015-09-21,22.6063
2015-09-22,21.7786
2015-09-23,21.2113
2015-09-24,21.0979
2015-09-25,20.7575
2015-09-28,19.6562
2015-09-29,18.1544
2015-09-30,18.9086
2015-10-01,19.6896
2015-10-02,19.5093
2015-10-05,20.4304
2015-10-06,21.0912
2015-10-07,21.4983
2015-10-08,21.525
2015-10-09,20.6173
2015-10-12,21.5651
2015-10-13,21.4383
2015-10-14,22.6196
2015-10-15,22.613
2015-10-16,22.9533
2015-10-19,22.9467
2015-10-20,22.4661
2015-10-21,22.2058
2015-10-22,22.6063
2015-10-23,22.4327
2015-10-26,21.7119
2015-10-27,21.4316
2015-10-28,21.3715
2015-10-29,22.633
2015-10-30,21.8654
2015-11-02,21.6523
2015-11-03,22.0615
2015-11-04,21.3318
2015-11-05,20.2611
2015-11-06,19.8928
2015-11-09,19.3677
2015-11-10,19.32
2015-11-11,19.1359
2015-11-12,18.3652
2015-11-13,17.9629
2015-11-16,17.6969
2015-11-17,17.015
2015-11-18,17.1172
2015-11-19,17.4855
2015-11-20,16.9604
2015-11-23,16.0329
2015-11-24,16.0602
2015-11-25,17.2809
2015-11-27,17.1786
2015-11-30,16.9536
2015-12-01,16.5239
2015-12-02,16.3125
2015-12-03,15.7465
2015-12-04,14.6622
2015-12-07,13.7347
2015-12-08,14.2803
2015-12-09,15.2964
2015-12-10,14.8736
2015-12-11,14.2462
2015-12-14,12.705
2015-12-15,11.6138
2015-12-16,12.1116
2015-12-17,10.7273
2015-12-18,10.5431
2015-12-21,10.4067
2015-12-22,10.6932
2015-12-23,11.416
2015-12-24,11.7297
2015-12-28,11.2524
2015-12-29,11.7093
2015-12-30,12.023
2015-12-31,11.9821
2016-01-04,12.1185
2016-01-05,12.1048
2016-01-06,11.9071
2016-01-07,11.5456
2016-01-08,11.9343
2016-01-11,11.9343
2016-01-12,11.6343
2016-01-13,11.266
2016-01-14,11.6343
2016-01-15,11.3615
2016-01-19,10.8159
2016-01-20,10.4954
2016-01-21,11.1364
2016-01-22,12.8891
2016-01-25,12.589
2016-01-26,13.005
2016-01-27,13.2983
2016-01-28,10.4886
2016-01-29,10.9864
2016-02-01,10.9114
2016-02-02,10.925
2016-02-03,11.0137
2016-02-04,10.9932
2016-02-05,10.7477
2016-02-08,10.5036
2016-02-09,10.5387
2016-02-10,10.1944
2016-02-11,9.3513
2016-02-12,8.9298
2016-02-16,9.6745
2016-02-17,10.1031
2016-02-18,9.5691
2016-02-19,9.2108
2016-02-22,9.7869
2016-02-23,9.4708
2016-02-24,9.6464
2016-02-25,9.3162
2016-02-26,9.4848
2016-02-29,9.2038
2016-03-01,9.2108
2016-03-02,9.1897
2016-03-03,9.541
2016-03-04,9.3232
2016-03-07,9.7097
2016-03-08,9.1406
2016-03-09,9.2108
2016-03-10,9.0563
2016-03-11,9.5621
2016-03-14,9.5551
2016-03-15,9.541
2016-03-16,9.6464
2016-03-17,9.9766
2016-03-18,9.9134
2016-03-21,9.6534
2016-03-22,9.4497
2016-03-23,9.1054
2016-03-24,9.4075
2016-03-28,9.1406
2016-03-29,9.3092
2016-03-30,9.267
2016-03-31,9.4848
2016-04-01,9.3794
2016-04-04,9.2108
2016-04-05,9.2811
2016-04-06,9.1968
2016-04-07,9.1054
2016-04-08,9.3092
2016-04-11,9.4497
2016-04-12,9.6956
2016-04-13,9.6253
2016-04-14,9.2038
2016-04-15,9.0141
2016-04-18,9.0352
2016-04-19,9.3232
2016-04-20,9.3794
2016-04-21,9.2319
2016-04-22,9.4286
2016-04-25,9.2881
2016-04-26,9.2881
2016-04-27,9.8361
2016-04-28,9.52
2016-04-29,9.4848
2016-05-02,9.4778
2016-05-03,9.4848
2016-05-04,9.2393
2016-05-05,9.2393
2016-05-06,9.734
2016-05-09,9.3193
2016-05-10,8.9556
2016-05-11,9.4575
2016-05-12,9.4721
2016-05-13,9.6903
2016-05-16,9.9377
2016-05-17,9.945
2016-05-18,9.2902
2016-05-19,9.3048
2016-05-20,9.6249
2016-05-23,9.7558
2016-05-24,9.8359
2016-05-25,9.9231
2016-05-26,9.9159
2016-05-27,9.8795
2016-05-31,9.6685
2016-06-01,9.9813
2016-06-02,9.9886
2016-06-03,9.6394
2016-06-06,9.8359
2016-06-07,9.8431
2016-06-08,9.7267
2016-06-09,9.603
2016-06-10,9.5521
2016-06-13,9.7776
2016-06-14,9.5812
2016-06-15,9.6903
2016-06-16,9.5667
2016-06-17,9.6394
2016-06-20,9.7849
2016-06-21,9.7485
2016-06-22,9.8067
2016-06-23,10.0032
2016-06-24,9.7049
2016-06-27,9.4139
2016-06-28,9.8431
2016-06-29,9.945
2016-06-30,9.9741
2016-07-01,9.7776
2016-07-05,9.8359
2016-07-06,9.8868
2016-07-07,9.5157
2016-07-08,9.7267
2016-07-11,9.5667
2016-07-12,9.8213
2016-07-13,9.7485
2016-07-14,9.6394
2016-07-15,9.5012
2016-07-18,9.6467
2016-07-19,9.6394
2016-07-20,9.5958
2016-07-21,9.6103
2016-07-22,9.6249
2016-07-25,9.6321
2016-07-26,9.5448
2016-07-27,9.5303
2016-07-28,9.5157
2016-07-29,9.8213
2016-08-01,9.6321
2016-08-02,9.5448
2016-08-03,9.9209
2016-08-04,10.2394
2016-08-05,10.5787
2016-08-08,11.4157
2016-08-09,11.5816
2016-08-10,11.7248
2016-08-11,12.0113
2016-08-12,11.8605
2016-08-15,11.7173
2016-08-16,11.9887
2016-08-17,11.6419
2016-08-18,11.5589
2016-08-19,11.4986
2016-08-22,11.3327
2016-08-23,11.2573
2016-08-24,11.1669
2016-08-25,11.0688
2016-08-26,11.1141
2016-08-29,11.3478
2016-08-30,11.5665
2016-08-31,11.4308
2016-09-01,11.6871
2016-09-02,11.7097
2016-09-06,11.7776
2016-09-07,11.6042
2016-09-08,11.7022
2016-09-09,11.574
2016-09-12,11.3101
2016-09-13,11.1292
2016-09-14,11.0613
2016-09-15,11.4911
2016-09-16,11.5589
2016-09-19,11.657
2016-09-20,11.7927
2016-09-21,12.1471
2016-09-22,12.3657
2016-09-23,12.411
2016-09-26,12.6899
2016-09-27,12.328
2016-09-28,12.3733
2016-09-29,12.132
2016-09-30,12.1697
2016-10-03,11.8832
2016-10-04,11.7625
2016-10-05,11.8455
2016-10-06,11.8078
2016-10-07,11.8228
2016-10-10,12.0641
2016-10-11,11.8756
2016-10-12,11.951
2016-10-13,12.1395
2016-10-14,12.0641
2016-10-17,12.0641
2016-10-18,12.0264
2016-10-19,12.2903
2016-10-20,12.4788
2016-10-21,12.2903
2016-10-24,12.328
2016-10-25,11.951
2016-10-26,12.0641
2016-10-27,12.0264
2016-10-28,12.1395
2016-10-31,11.8756
2016-11-01,11.8379
2016-11-02,11.6117
2016-11-03,12.0641
2016-11-04,12.1903
2016-11-07,11.8409
2016-11-08,11.7632
2016-11-09,12.1903
2016-11-10,12.5009
2016-11-11,12.9279
2016-11-14,12.7338
2016-11-15,13.1609
2016-11-16,12.9279
2016-11-17,13.0056
2016-11-18,13.0444
2016-11-21,12.6562
2016-11-22,12.5785
2016-11-23,12.3068
2016-11-25,12.1903
2016-11-28,12.5009
2016-11-29,12.0738
2016-11-30,12.2679
2016-12-01,12.0738
2016-12-02,12.4232
2016-12-05,12.3068
2016-12-06,12.3456
2016-12-07,12.4232
2016-12-08,12.3456
2016-12-09,11.9962
2016-12-12,12.3068
2016-12-13,12.5009
2016-12-14,12.1126
2016-12-15,12.0738
2016-12-16,12.3844
2016-12-19,12.4232
2016-12-20,12.1903
2016-12-21,12.1515
2016-12-22,13.8208
2016-12-23,13.8597
2016-12-27,13.6267
2016-12-28,13.355
2016-12-29,14.4808
2016-12-30,15.102
2017-01-03,15.8008
2017-01-04,15.762
2017-01-05,15.6067
2017-01-06,15.3349
2017-01-09,15.0632
2017-01-10,14.5196
2017-01-11,15.5679
2017-01-12,15.4514
2017-01-13,15.4514
2017-01-17,15.529
2017-01-18,15.9173
2017-01-19,16.3055
2017-01-20,16.189
2017-01-23,16.2278
2017-01-24,16.5772
2017-01-25,16.4996
2017-01-26,16.6161
2017-01-27,16.1502
2017-01-30,15.9561
2017-01-31,15.6455
2017-02-01,15.529
2017-02-02,16.2278
2017-02-03,16.1114
2017-02-06,16.7325
2017-02-07,16.5441
2017-02-08,16.2664
2017-02-09,16.187
2017-02-10,16.2664
2017-02-13,16.2267
2017-02-14,16.6631
2017-02-15,16.5441
2017-02-16,16.068
2017-02-17,15.83
2017-02-21,15.9887
2017-02-22,15.7506
2017-02-23,15.3935
2017-02-24,15.2745
2017-02-27,15.4729
2017-02-28,15.6713
2017-03-01,15.2745
2017-03-02,14.481
2017-03-03,15.1952
2017-03-06,14.9571
2017-03-07,14.6794
2017-03-08,14.362
2017-03-09,15.2348
2017-03-10,15.3935
2017-03-13,15.0761
2017-03-14,14.9571
2017-03-15,15.2745
2017-03-16,15.3539
2017-03-17,14.9175
2017-03-20,15.2348
2017-03-21,14.9968
2017-03-22,15.0761
2017-03-23,15.0365
2017-03-24,15.1555
2017-03-27,14.9175
2017-03-28,15.1952
2017-03-29,15.2348
2017-03-30,15.3935
2017-03-31,15.4729
2017-04-03,15.7506
2017-04-04,15.9887
2017-04-05,15.4729
2017-04-06,15.3935
2017-04-07,15.7109
2017-04-10,15.5522
2017-04-11,16.0283
2017-04-12,15.7109
2017-04-13,15.4729
2017-04-17,15.4729
2017-04-18,15.3142
2017-04-19,15.1158
2017-04-20,14.8778
2017-04-21,14.6397
2017-04-24,14.362
2017-04-25,14.481
2017-04-26,14.9175
2017-04-27,14.7191
2017-04-28,14.7984
2017-05-01,14.8778
2017-05-02,14.8778
2017-05-03,14.8381
2017-05-04,14.6794
2017-05-05,14.7588
2017-05-08,15.0944
2017-05-09,15.2572
2017-05-10,15.3385
2017-05-11,15.6233
2017-05-12,16.2336
2017-05-15,16.1116
2017-05-16,16.1116
2017-05-17,15.664
2017-05-18,15.7861
2017-05-19,15.7861
2017-05-22,15.7047
2017-05-23,15.9488
2017-05-24,16.0302
2017-05-25,15.7861
2017-05-26,15.664
2017-05-30,15.2572
2017-05-31,15.2572
2017-06-01,15.2978
2017-06-02,15.1758
2017-06-05,15.0944
2017-06-06,15.2572
2017-06-07,15.2572
2017-06-08,15.1351
2017-06-09,14.9724
2017-06-12,14.8503
2017-06-13,14.5248
2017-06-14,14.3621
2017-06-15,14.6469
2017-06-16,15.2572
2017-06-19,14.7282
2017-06-20,14.0773
2017-06-21,13.7518
2017-06-22,14.1993
2017-06-23,14.5248
2017-06-26,14.2807
2017-06-27,14.3621
2017-06-28,14.24
2017-06-29,14.2807
2017-06-30,14.6876
2017-07-03,15.013
2017-07-05,14.4028
2017-07-06,14.3214
2017-07-07,14.1586
2017-07-10,14.1586
2017-07-11,14.6062
2017-07-12,14.4841
2017-07-13,14.6062
2017-07-14,14.4841
2017-07-17,14.7282
2017-07-18,14.4841
2017-07-19,14.3214
2017-07-20,14.5248
2017-07-21,14.4028
2017-07-24,14.4434
2017-07-25,14.5655
2017-07-26,14.4841
2017-07-27,14.2807
2017-07-28,14.4028
2017-07-31,14.6062
2017-08-01,14.6876
2017-08-02,15.013
2017-08-03,14.8096
2017-08-04,14.9724
2017-08-07,15.108
2017-08-08,14.482
2017-08-09,14.3568
2017-08-10,14.3568
2017-08-11,14.482
2017-08-14,14.1064
2017-08-15,13.9812
2017-08-16,13.7725
2017-08-17,13.5221
2017-08-18,13.5221
2017-08-21,13.3969
2017-08-22,13.5638
2017-08-23,14.0229
2017-08-24,14.1481
2017-08-25,14.1481
2017-08-28,14.1898
2017-08-29,14.2733
2017-08-30,14.1898
2017-08-31,14.4402
2017-09-01,14.3568
2017-09-05,14.315
2017-09-06,14.315
2017-09-07,14.4402
2017-09-08,13.9394
2017-09-11,13.9812
2017-09-12,14.2733
2017-09-13,14.1064
2017-09-14,14.2733
2017-09-15,14.1898
2017-09-18,14.1481
2017-09-19,14.1481
2017-09-20,14.1481
2017-09-21,14.1898
2017-09-22,14.1898
2017-09-25,14.2733
2017-09-26,14.6072
2017-09-27,14.315
2017-09-28,14.3985
2017-09-29,14.5237
2017-10-02,14.5237
2017-10-03,14.6072
2017-10-04,14.6907
2017-10-05,14.7324
2017-10-06,14.8993
2017-10-09,14.8576
2017-10-10,15.2332
2017-10-11,15.108
2017-10-12,15.2749
2017-10-13,15.3167
2017-10-16,15.2332
2017-10-17,15.0663
2017-10-18,14.8576
2017-10-19,14.5237
2017-10-20,15.0663
2017-10-23,14.6072
2017-10-24,14.7741
2017-10-25,14.6907
2017-10-26,14.7741
2017-10-27,14.8576
2017-10-30,14.8159
2017-10-31,14.8159
2017-11-01,15.108
2017-11-02,14.6489
2017-11-03,14.6907
2017-11-06,14.8993
2017-11-07,14.7324
2017-11-08,15.4288
2017-11-09,15.3003
2017-11-10,14.9574
2017-11-13,14.9145
2017-11-14,14.9574
2017-11-15,15.086
2017-11-16,15.0003
2017-11-17,14.9145
2017-11-20,14.9145
2017-11-21,14.7002
2017-11-22,14.8717
2017-11-24,15.0003
2017-11-27,14.9574
2017-11-28,14.786
2017-11-29,14.8717
2017-11-30,14.9145
2017-12-01,15.0003
2017-12-04,14.6574
2017-12-05,14.7002
2017-12-06,14.5288
2017-12-07,14.6574
2017-12-08,14.486
2017-12-11,14.786
2017-12-12,14.5717
2017-12-13,14.6145
2017-12-14,14.4002
2017-12-15,14.3574
2017-12-18,14.2717
2017-12-19,14.2717
2017-12-20,14.186
2017-12-21,14.3145
2017-12-22,14.0145
2017-12-26,14.1002
2017-12-27,13.8859
2017-12-28,14.3574
2017-12-29,14.3145
2018-01-02,15.1717
2018-01-03,15.5574
2018-01-04,15.3431
2018-01-05,15.086
2018-01-08,15.0003
2018-01-09,15.2145
2018-01-10,15.3003
2018-01-11,15.4717
2018-01-12,15.386
2018-01-16,15.2145
2018-01-17,15.1717
2018-01-18,15.086
2018-01-19,15.086
2018-01-22,15.4288
2018-01-23,15.6003
2018-01-24,15.6431
2018-01-25,15.386
2018-01-26,15.4288
2018-01-29,15.4288
2018-01-30,15.0003
2018-01-31,15.1288
2018-02-01,15.4288
2018-02-02,15.086
2018-02-05,14.8717
2018-02-06,15.0003
2018-02-07,14.9574
2018-02-08,14.9684
2018-02-09,14.8803
2018-02-12,15.4967
2018-02-13,15.8049
2018-02-14,15.8049
2018-02-15,15.4086
2018-02-16,15.3206
2018-02-20,15.1885
2018-02-21,15.0124
2018-02-22,14.8803
2018-02-23,14.7042
2018-02-26,14.7923
2018-02-27,14.4401
2018-02-28,14.3961
2018-03-01,14.3961
2018-03-02,14.3521
2018-03-05,14.264
2018-03-06,14.1319
2018-03-07,14.308
2018-03-08,14.22
2018-03-09,14.5281
2018-03-12,15.5407
2018-03-13,15.3206
2018-03-14,14.8363
2018-03-15,14.9244
2018-03-16,15.4086
2018-03-19,14.5281
2018-03-20,14.308
2018-03-21,14.1319
2018-03-22,13.9118
2018-03-23,13.8678
2018-03-26,13.8238
2018-03-27,13.6036
2018-03-28,13.5156
2018-03-29,13.5156
2018-04-02,13.6917
2018-04-03,13.6917
2018-04-04,13.8238
2018-04-05,13.7797
2018-04-06,13.6917
2018-04-09,13.4716
2018-04-10,14.1319
2018-04-11,14.22
2018-04-12,14.0879
2018-04-13,14.0439
2018-04-16,14.5722
2018-04-17,14.9244
2018-04-18,14.9244
2018-04-19,14.8803
2018-04-20,14.7483
2018-04-23,14.9684
2018-04-24,14.7923
2018-04-25,14.7923
2018-04-26,14.5722
2018-04-27,14.6162
2018-04-30,15.1445
2018-05-01,14.7483
2018-05-02,14.5722
2018-05-03,14.4401
2018-05-04,14.5281
2018-05-07,14.5722
2018-05-08,14.9244
2018-05-09,14.7999
2018-05-10,15.6598
2018-05-11,15.7956
2018-05-14,16.1124
2018-05-15,15.5241
2018-05-16,15.5241
2018-05-17,15.5693
2018-05-18,15.5241
2018-05-21,15.9314
2018-05-22,15.7956
2018-05-23,15.8861
2018-05-24,15.8861
2018-05-25,16.0219
2018-05-29,15.7051
2018-05-30,15.8409
2018-05-31,15.7051
2018-06-01,15.8409
2018-06-04,15.7504
2018-06-05,15.7277
2018-06-06,15.5241
2018-06-07,15.6598
2018-06-08,15.5693
2018-06-11,15.6146
2018-06-12,15.6146
2018-06-13,15.5693
2018-06-14,15.4788
2018-06-15,15.162
2018-06-18,15.5241
2018-06-19,15.4788
2018-06-20,15.5241
2018-06-21,15.4335
2018-06-22,15.5241
2018-06-25,15.2978
2018-06-26,15.4335
2018-06-27,15.343
2018-06-28,15.4788
2018-06-29,15.4335
2018-07-02,15.4788
2018-07-03,15.7051
2018-07-05,15.6598
2018-07-06,15.6598
2018-07-09,15.7051
2018-07-10,15.7956
2018-07-11,15.6146
2018-07-12,15.5241
2018-07-13,15.5693
2018-07-16,15.6598
2018-07-17,15.4788
2018-07-18,15.7956
2018-07-19,15.7051
2018-07-20,15.7504
2018-07-23,15.739
2018-07-24,15.7956
2018-07-25,16.0672
2018-07-26,16.0672
2018-07-27,16.4293
2018-07-30,16.7008
2018-07-31,17.1987
2018-08-01,17.4702
2018-08-02,17.6513
2018-08-03,17.606
2018-08-06,18.0133
2018-08-07,18.4207
2018-08-08,18.0731
2018-08-09,18.0731
2018-08-10,18.4439
2018-08-13,18.5365
2018-08-14,18.9073
2018-08-15,19
2018-08-16,18.6292
2018-08-17,19.1853
2018-08-20,19.2317
2018-08-21,19.139
2018-08-22,19.2317
2018-08-23,18.9536
2018-08-24,19.0926
2018-08-27,18.6756
2018-08-28,18.1195
2018-08-29,17.6561
2018-08-30,17.517
2018-08-31,17.2853
2018-09-04,17.4707
2018-09-05,17.1463
2018-09-06,16.9146
2018-09-07,16.9146
2018-09-10,16.9146
2018-09-11,17.0073
2018-09-12,17.0536
2018-09-13,17.1463
2018-09-14,17.1463
2018-09-17,17.0536
2018-09-18,17.1463
2018-09-19,17.0073
2018-09-20,17.1
2018-09-21,17.0073
2018-09-24,16.9146
2018-09-25,16.7756
2018-09-26,16.7292
2018-09-27,16.6829
2018-09-28,16.8682
2018-10-01,17.0443
2018-10-02,16.9146
2018-10-03,16.7385
2018-10-04,16.7663
2018-10-05,16.8034
2018-10-08,16.6551
2018-10-09,16.8312
2018-10-10,16.7292
2018-10-11,16.6829
2018-10-12,16.8497
2018-10-15,16.7663
2018-10-16,17.1926
2018-10-17,16.8682
2018-10-18,16.7848
2018-10-19,16.7478
2018-10-22,16.757
2018-10-23,17.2668
2018-10-24,16.7663
2018-10-25,16.8682
2018-10-26,17.1185
2018-10-29,18.2585
2018-10-30,18.4995
2018-10-31,18.759
2018-11-01,19.2965
2018-11-02,18.7219
2018-11-05,19.2039
2018-11-06,19.0278
2018-11-07,18.8517
2018-11-08,18.6286
2018-11-09,18.3345
2018-11-12,18.8184
2018-11-13,18.8944
2018-11-14,18.4294
2018-11-15,17.9738
2018-11-16,17.395
2018-11-19,17.4424
2018-11-20,16.911
2018-11-21,16.873
2018-11-23,16.9205
2018-11-26,16.8256
2018-11-27,16.7876
2018-11-28,16.7876
2018-11-29,16.7496
2018-11-30,16.3985
2018-12-03,16.5978
2018-12-04,16.1992
2018-12-06,16.0094
2018-12-07,16.1992
2018-12-10,16.0474
2018-12-11,15.8956
2018-12-12,15.905
2018-12-13,16.0474
2018-12-14,15.6204
2018-12-17,15.0794
2018-12-18,14.6144
2018-12-19,14.6144
2018-12-20,13.8837
2018-12-21,13.4851
2018-12-24,13.0866
2018-12-26,13.9027
2018-12-27,14.9466
2018-12-28,15.3546
2018-12-31,15.4685
2019-01-02,15.8196
2019-01-03,15.5349
2019-01-04,15.8291
2019-01-07,16.0569
2019-01-08,16.1897
2019-01-09,16.446
2019-01-10,16.1423
2019-01-11,16.0569
2019-01-14,15.981
2019-01-15,16.0379
2019-01-16,15.6963
2019-01-17,16.1992
2019-01-18,16.5029
2019-01-22,16.408
2019-01-23,16.4175
2019-01-24,16.408
2019-01-25,16.7212
2019-01-28,16.9964
2019-01-29,17.9833
2019-01-30,18.3534
2019-01-31,18.0498
2019-02-01,17.9928
2019-02-04,17.9928
2019-02-05,18.0972
2019-02-06,18.2965
2019-02-07,18.4329
2019-02-08,18.5011
2019-02-11,18.1211
2019-02-12,18.1017
2019-02-13,18.2381
2019-02-14,18.4524
2019-02-15,18.4816
2019-02-19,18.618
2019-02-20,18.355
2019-02-21,18.1211
2019-02-22,18.1991
2019-02-25,18.316
2019-02-26,18.1893
2019-02-27,18.2673
2019-02-28,18.5108
2019-03-01,18.316
2019-03-04,18.1796
2019-03-05,18.2575
2019-03-06,18.4914
2019-03-07,18.6083
2019-03-08,18.6472
2019-03-11,18.2965
2019-03-12,18.2088
2019-03-13,18.3939
2019-03-14,18.6375
2019-03-15,18.5108
2019-03-18,19.2415
2019-03-19,19.1051
2019-03-20,19.1733
2019-03-21,19.2708
2019-03-22,19.1149
2019-03-25,19.1733
2019-03-26,19.0467
2019-03-27,18.9103
2019-03-28,18.8713
2019-03-29,19.1539
2019-04-01,18.9687
2019-04-02,19.2708
2019-04-03,19.0467
2019-04-04,18.9785
2019-04-05,18.9882
2019-04-08,19.1441
2019-04-09,18.8713
2019-04-10,18.8421
2019-04-11,18.8031
2019-04-12,18.8518
2019-04-15,19.1149
2019-04-16,18.9005
2019-04-17,18.6083
2019-04-18,18.579
2019-04-22,19.1441
2019-04-23,19.0662
2019-04-24,18.9395
2019-04-25,18.92
2019-04-26,19.0954
2019-04-29,19.3097
2019-04-30,19.339
2019-05-01,19.4754
2019-05-02,19.4364
2019-05-03,19.3974
2019-05-06,19.3195
2019-05-07,18.9687
2019-05-08,19.3
2019-05-09,19.19
2019-05-10,19.59
2019-05-13,19.71
2019-05-14,19.77
2019-05-15,19.84
2019-05-16,20.05
2019-05-17,20.08
2019-05-20,19.99
2019-05-21,19.97
2019-05-22,19.83
2019-05-23,19.76
2019-05-24,19.93
2019-05-28,19.76
2019-05-29,19.72
2019-05-30,19.98
2019-05-31,19.88
2019-06-03,19.89
2019-06-04,20.26
2019-06-05,20.7
2019-06-06,21.39
2019-06-07,21.35
2019-06-10,21.21
2019-06-11,20.79
2019-06-12,20.37
2019-06-13,20.39
2019-06-14,20.19
2019-06-17,19.8
2019-06-18,19.91
2019-06-19,20.005
2019-06-20,19.965
2019-06-21,19.99
2019-06-24,20
2019-06-25,19.96
2019-06-26,20.01
2019-06-27,19.99
2019-06-28,20.02
2019-07-01,19.87
2019-07-02,20.15
2019-07-03,20.18
2019-07-04,20.18
2019-07-05,20.31
2019-07-08,20.31
2019-07-09,20.27
2019-07-10,20.315
2019-07-11,20.145
2019-07-12,20.05
2019-07-15,20.195
2019-07-16,20.07
2019-07-17,20.025
2019-07-18,20.09
2019-07-19,19.88
2019-07-22,20.03
2019-07-23,19.91
2019-07-24,20.04
2019-07-25,20.065
2019-07-26,20.165
2019-07-29,20.175
2019-07-30,20.02
2019-07-31,20.17
2019-08-01,19.92
2019-08-02,19.975
2019-08-05,19.755
2019-08-06,19.955
2019-08-07,19.99
2019-08-08,19.79
2019-08-09,19.7
2019-08-12,19.805
2019-08-13,19.79
2019-08-14,19.02
2019-08-15,18.81
2019-08-16,19.14
2019-08-19,19.555
2019-08-20,19.555
2019-08-21,19.555
2019-08-22,19.395
2019-08-23,19.27
2019-08-26,18.85
2019-08-27,18.44
2019-08-28,18.32
2019-08-29,18.81
2019-08-30,18.67
2019-09-02,18.67
2019-09-03,18.86
2019-09-04,18.99
2019-09-05,18.885
2019-09-06,19.1
2019-09-09,19.235
2019-09-10,19.16
2019-09-11,19.26
2019-09-12,19.26
2019-09-13,19.34
2019-09-16,19.52
2019-09-17,19.65
2019-09-18,19.74
2019-09-19,19.71
2019-09-20,19.78
2019-09-23,19.66
2019-09-24,19.615
2019-09-25,19.655
2019-09-26,19.735
2019-09-27,19.8
2019-09-30,19.8
2019-10-01,19.65
2019-10-02,19.61
2019-10-03,19.76
2019-10-04,19.715
2019-10-07,19.72
2019-10-08,19.72
2019-10-09,19.71
2019-10-10,19.81
2019-10-11,19.81
2019-10-14,19.75
2019-10-15,19.97
2019-10-16,20.135
2019-10-17,20.5
2019-10-18,20.42
2019-10-21,20.64
2019-10-22,20.61
2019-10-23,20.35
2019-10-24,20.35
2019-10-25,20.3
2019-10-28,20.42
2019-10-29,20.29
2019-10-30,20.11
2019-10-31,20.11
2019-11-01,20.5
2019-11-04,20.485
2019-11-05,20.6
2019-11-06,20.39
2019-11-07,20.43
2019-11-08,20
2019-11-11,19.795
2019-11-12,20.18
2019-11-13,20.125
2019-11-14,20.215
2019-11-15,20.26
2019-11-18,20.1
2019-11-19,20.1
2019-11-20,20.1
2019-11-21,20.1
2019-11-22,20.06
2019-11-25,19.915
