date,close
2013-09-04,24.9186
2013-09-05,24.4946
2013-09-06,24.0883
2013-09-09,24.4505
2013-09-10,24.2738
2013-09-11,24.265
2013-09-12,24.5123
2013-09-13,24.6536
2013-09-16,24.8303
2013-09-17,25.0246
2013-09-18,25.2101
2013-09-19,25.3338
2013-09-20,25.7666
2013-09-23,25.5899
2013-09-24,25.6429
2013-09-25,25.7136
2013-09-26,25.7313
2013-09-27,25.5988
2013-09-30,26.0228
2013-10-01,26.1111
2013-10-02,25.9874
2013-10-03,25.6341
2013-10-04,25.6164
2013-10-07,25.2896
2013-10-08,25.1924
2013-10-09,25.1394
2013-10-10,25.9521
2013-10-11,26.6588
2013-10-14,26.6764
2013-10-15,26.7383
2013-10-16,26.4556
2013-10-17,26.9856
2013-10-18,28.4872
2013-10-21,28.2134
2013-10-22,28.4166
2013-10-23,28.2223
2013-10-24,29.0223
2013-10-25,30.24
2013-10-28,29.5911
2013-10-29,29.7156
2013-10-30,29.7778
2013-10-31,29.4845
2013-11-01,29.1823
2013-11-04,29.6178
2013-11-05,29.1911
2013-11-06,29.3245
2013-11-07,29.3423
2013-11-08,29.9111
2013-11-11,29.76
2013-11-12,29.9467
2013-11-13,30.6934
2013-11-14,30.4623
2013-11-15,30.5156
2013-11-18,30.3023
2013-11-19,30.2756
2013-11-20,30.0889
2013-11-21,30.2934
2013-11-22,30.0711
2013-11-25,30.1956
2013-11-26,30.16
2013-11-27,30.2845
2013-11-29,30.4
2013-12-02,30.3289
2013-12-03,30.5956
2013-12-04,30.0445
2013-12-05,29.9734
2013-12-06,30.5423
2013-12-09,30.4445
2013-12-10,30.4445
2013-12-11,29.7067
2013-12-12,29.8667
2013-12-13,29.84
2013-12-16,30.16
2013-12-17,30.1334
2013-12-18,30.2667
2013-12-19,30.0623
2013-12-20,30.3378
2013-12-23,30.7289
2013-12-24,30.8889
2013-12-26,31.1467
2013-12-27,30.9956
2013-12-30,31.2267
2013-12-31,31.3423
2014-01-02,30.4623
2014-01-03,30.6223
2014-01-06,30.1334
2014-01-07,31.4934
2014-01-08,30.6845
2014-01-09,31.12
2014-01-10,31.04
2014-01-13,30.5956
2014-01-14,31.2267
2014-01-15,31.4502
2014-01-16,31.486
2014-01-17,30.8512
2014-01-21,31.4681
2014-01-22,31.7363
2014-01-23,31.2088
2014-01-24,30.3148
2014-01-27,29.7606
2014-01-28,30.0288
2014-01-29,30.4132
2014-01-30,30.5115
2014-01-31,30.3685
2014-02-03,29.2868
2014-02-04,29.0275
2014-02-05,28.7951
2014-02-06,29.099
2014-02-07,29.2599
2014-02-10,29.2331
2014-02-11,29.4834
2014-02-12,29.3493
2014-02-13,29.7516
2014-02-14,29.8857
2014-02-18,29.9215
2014-02-19,29.6622
2014-02-20,30.1986
2014-02-21,29.8232
2014-02-24,30.4042
2014-02-25,30.4489
2014-02-26,31.0568
2014-02-27,31.039
2014-02-28,31.0658
2014-03-03,30.3953
2014-03-04,31.03
2014-03-05,31.039
2014-03-06,31.1015
2014-03-07,31.7363
2014-03-10,30.8423
2014-03-11,30.8512
2014-03-12,30.6724
2014-03-13,30.3506
2014-03-14,30.4847
2014-03-17,30.5562
2014-03-18,31.2714
2014-03-19,31.1373
2014-03-20,31.7094
2014-03-21,31.9419
2014-03-24,32.2548
2014-03-25,32.3621
2014-03-26,31.5575
2014-03-27,31.5664
2014-03-28,31.5664
2014-03-31,32.4157
2014-04-01,32.8984
2014-04-02,33.0951
2014-04-03,33.3097
2014-04-04,32.3889
2014-04-07,32.4693
2014-04-08,32.5855
2014-04-09,32.8448
2014-04-10,32.5587
2014-04-11,32.2101
2014-04-14,31.7363
2014-04-15,31.1699
2014-04-16,32.0869
2014-04-17,32.2397
2014-04-21,32.6353
2014-04-22,33.0309
2014-04-23,32.7252
2014-04-24,32.5904
2014-04-25,32.0959
2014-04-28,31.8262
2014-04-29,31.7992
2014-04-30,32.2937
2014-05-01,32.0599
2014-05-02,32.8781
2014-05-05,32.7882
2014-05-06,32.2397
2014-05-07,32.5364
2014-05-08,31.7453
2014-05-09,32.024
2014-05-12,32.5994
2014-05-13,31.8082
2014-05-14,31.3497
2014-05-15,30.5765
2014-05-16,30.4776
2014-05-19,30.5495
2014-05-20,30.0461
2014-05-21,30.0641
2014-05-22,30.3697
2014-05-23,30.7833
2014-05-27,31.3137
2014-05-28,31.4935
2014-05-29,31.6014
2014-05-30,31.6554
2014-06-02,31.3497
2014-06-03,30.7114
2014-06-04,31.6374
2014-06-05,32.7882
2014-06-06,33.1118
2014-06-09,33.4175
2014-06-10,33.5164
2014-06-11,33.4714
2014-06-12,33.0129
2014-06-13,32.959
2014-06-16,32.4735
2014-06-17,32.8691
2014-06-18,33.0039
2014-06-19,33.1837
2014-06-20,33.5973
2014-06-23,33.6512
2014-06-24,33.4445
2014-06-25,33.8131
2014-06-26,33.6602
2014-06-27,34.2086
2014-06-30,34.793
2014-07-01,35.5392
2014-07-02,37.1395
2014-07-03,37.7329
2014-07-07,37.5441
2014-07-08,37.5891
2014-07-09,37.7689
2014-07-10,36.717
2014-07-11,36.5731
2014-07-14,36.717
2014-07-15,36.744
2014-07-16,36.7711
2014-07-17,36.8705
2014-07-18,37.6926
2014-07-21,37.5571
2014-07-22,37.9546
2014-07-23,37.4758
2014-07-24,37.5481
2014-07-25,37.1505
2014-07-28,37.015
2014-07-29,36.7982
2014-07-30,36.2651
2014-07-31,35.9037
2014-08-01,35.8224
2014-08-04,36.4549
2014-08-05,36.0573
2014-08-06,35.8495
2014-08-07,35.7231
2014-08-08,35.8857
2014-08-11,36.1567
2014-08-12,35.8315
2014-08-13,36.3645
2014-08-14,36.3735
2014-08-15,36.2561
2014-08-18,36.5091
2014-08-19,36.5
2014-08-20,36.3103
2014-08-21,36.0212
2014-08-22,35.8134
2014-08-25,35.8857
2014-08-26,36.0844
2014-08-27,36.0212
2014-08-28,35.3075
2014-08-29,35.0816
2014-09-02,35.181
2014-09-03,35.2804
2014-09-04,34.8377
2014-09-05,34.7202
2014-09-08,34.675
2014-09-09,33.8438
2014-09-10,33.88
2014-09-11,33.9161
2014-09-12,33.7083
2014-09-15,33.6903
2014-09-16,33.6722
2014-09-17,33.9974
2014-09-18,33.9432
2014-09-19,33.636
2014-09-22,33.5638
2014-09-23,33.1843
2014-09-24,33.7083
2014-09-25,32.832
2014-09-26,33.5276
2014-09-29,33.3379
2014-09-30,32.6693
2014-10-01,30.8714
2014-10-02,31.1696
2014-10-03,30.4739
2014-10-06,29.9138
2014-10-07,29.1639
2014-10-08,29.2723
2014-10-09,28.1881
2014-10-10,27.0227
2014-10-13,26.8058
2014-10-14,26.6161
2014-10-15,27.0588
2014-10-16,27.3931
2014-10-17,27.7093
2014-10-20,28.6579
2014-10-21,29.0013
2014-10-22,27.2305
2014-10-23,32.4019
2014-10-24,30.6553
2014-10-27,30.5098
2014-10-28,31.8015
2014-10-29,31.9016
2014-10-30,31.6469
2014-10-31,32.2108
2014-11-03,31.8288
2014-11-04,31.7924
2014-11-05,32.4473
2014-11-06,33.2933
2014-11-07,33.6481
2014-11-10,33.8755
2014-11-11,33.6026
2014-11-12,34.2394
2014-11-13,33.7936
2014-11-14,33.7572
2014-11-17,33.7936
2014-11-18,34.1393
2014-11-19,34.1393
2014-11-20,34.7852
2014-11-21,35.0217
2014-11-24,35.431
2014-11-25,35.149
2014-11-26,35.3309
2014-11-28,34.8033
2014-12-01,34.2121
2014-12-02,34.8306
2014-12-03,35.4765
2014-12-04,35.4856
2014-12-05,35.7585
2014-12-08,35.1945
2014-12-09,36.0587
2014-12-10,34.5668
2014-12-11,34.767
2014-12-12,33.9483
2014-12-15,33.0477
2014-12-16,33.1933
2014-12-17,33.6572
2014-12-18,34.3485
2014-12-19,35.5129
2014-12-22,35.8313
2014-12-23,36.6227
2014-12-24,36.7227
2014-12-26,36.9592
2014-12-29,37.3231
2014-12-30,37.2594
2014-12-31,36.8683
2015-01-02,36.0951
2015-01-05,34.3758
2015-01-06,33.0295
2015-01-07,31.4194
2015-01-08,30.8282
2015-01-09,30.4916
2015-01-12,30.346
2015-01-13,30.8736
2015-01-14,30.7592
2015-01-15,30.5762
2015-01-16,30.988
2015-01-20,31.1528
2015-01-21,31.4731
2015-01-22,32.2784
2015-01-23,31.9307
2015-01-26,32.9191
2015-01-27,32.8459
2015-01-28,32.0496
2015-01-29,32.4706
2015-01-30,31.8941
2015-02-02,32.672
2015-02-03,33.761
2015-02-04,33.5872
2015-02-05,35.0881
2015-02-06,34.5023
2015-02-09,34.6396
2015-02-10,34.9233
2015-02-11,35.2162
2015-02-12,35.4816
2015-02-13,36.4517
2015-02-17,36.4883
2015-02-18,36.6805
2015-02-19,36.7079
2015-02-20,36.8818
2015-02-23,37.2021
2015-02-24,38.4651
2015-02-25,38.4742
2015-02-26,39.3162
2015-02-27,38.9684
2015-03-02,39.4352
2015-03-03,38.7396
2015-03-04,38.2546
2015-03-05,37.4858
2015-03-06,37.4675
2015-03-09,37.6689
2015-03-10,37.678
2015-03-11,37.8519
2015-03-12,38.7305
2015-03-13,38.4925
2015-03-16,40.1948
2015-03-17,39.2979
2015-03-18,40.6981
2015-03-19,40.5791
2015-03-20,40.991
2015-03-23,40.5334
2015-03-24,41.1099
2015-03-25,41.3753
2015-03-26,41.1466
2015-03-27,42.9769
2015-03-30,44.1667
2015-03-31,44.1117
2015-04-01,43.9012
2015-04-02,44.066
2015-04-06,44.2948
2015-04-07,42.7847
2015-04-08,42.9586
2015-04-09,42.803
2015-04-10,42.7756
2015-04-13,42.9037
2015-04-14,43.2881
2015-04-15,43.7548
2015-04-16,42.7668
2015-04-17,41.7649
2015-04-20,42.3807
2015-04-21,42.1693
2015-04-22,42.0682
2015-04-23,41.8017
2015-04-24,41.526
2015-04-27,41.3605
2015-04-28,38.4745
2015-04-29,38.7686
2015-04-30,39.0168
2015-05-01,39.4212
2015-05-04,39.5315
2015-05-05,38.8789
2015-05-06,39.2281
2015-05-07,39.7337
2015-05-08,39.6601
2015-05-11,39.8072
2015-05-12,39.5498
2015-05-13,39.5682
2015-05-14,40.184
2015-05-15,39.6785
2015-05-18,39.9726
2015-05-19,39.6969
2015-05-20,39.8715
2015-05-21,40.5609
2015-05-22,40.2851
2015-05-26,39.5223
2015-05-27,40.0737
2015-05-28,39.8256
2015-05-29,39.3109
2015-06-01,39.1822
2015-06-02,39.8532
2015-06-03,40.616
2015-06-04,39.3109
2015-06-05,40.7263
2015-06-08,39.9818
2015-06-09,39.9543
2015-06-10,40.8366
2015-06-11,41.3513
2015-06-12,40.8366
2015-06-15,40.662
2015-06-16,41.526
2015-06-17,40.4506
2015-06-18,41.2594
2015-06-19,41.3329
2015-06-22,41.5627
2015-06-23,42.2153
2015-06-24,41.912
2015-06-25,42.4451
2015-06-26,41.5811
2015-06-29,39.9818
2015-06-30,40.184
2015-07-01,40.1748
2015-07-02,39.6418
2015-07-06,38.7502
2015-07-07,36.287
2015-07-08,35.4322
2015-07-09,35.2392
2015-07-10,35.9928
2015-07-13,36.3301
2015-07-14,37.254
2015-07-15,36.3486
2015-07-16,36.0806
2015-07-17,36.0252
2015-07-20,35.1751
2015-07-21,35.2675
2015-07-22,35.092
2015-07-23,34.2235
2015-07-24,33.3087
2015-07-27,32.9484
2015-07-28,33.1239
2015-07-29,34.6392
2015-07-30,34.7501
2015-07-31,34.399
2015-08-03,33.9925
2015-08-04,33.6044
2015-08-05,33.7338
2015-08-06,33.4751
2015-08-07,32.7359
2015-08-10,32.7082
2015-08-11,32.5326
2015-08-12,32.3293
2015-08-13,33.0685
2015-08-14,32.893
2015-08-17,32.8468
2015-08-18,33.1424
2015-08-19,32.8375
2015-08-20,32.7266
2015-08-21,31.4608
2015-08-24,30.2966
2015-08-25,30.0379
2015-08-26,30.7124
2015-08-27,31.4054
2015-08-28,31.4701
2015-08-31,31.7195
2015-09-01,30.9434
2015-09-02,30.4907
2015-09-03,30.3244
2015-09-04,29.8069
2015-09-08,29.8439
2015-09-09,29.7607
2015-09-10,29.3634
2015-09-11,29.114
2015-09-14,28.1346
2015-09-15,28.7629
2015-09-16,29.1047
2015-09-17,30.2042
2015-09-18,29.8069
2015-09-21,30.4445
2015-09-22,29.4096
2015-09-23,28.8368
2015-09-24,28.9476
2015-09-25,29.4651
2015-09-28,28.2916
2015-09-29,29.3634
2015-09-30,30.001
2015-10-01,30.0472
2015-10-02,31.3222
2015-10-05,32.5326
2015-10-06,32.9114
2015-10-07,33.1239
2015-10-08,33.9278
2015-10-09,34.6208
2015-10-12,34.7039
2015-10-13,34.7501
2015-10-14,35.092
2015-10-15,35.5817
2015-10-16,35.0827
2015-10-19,34.5838
2015-10-20,34.2235
2015-10-21,33.2533
2015-10-22,32.8584
2015-10-23,33.3323
2015-10-26,33.2394
2015-10-27,32.5517
2015-10-28,33.0163
2015-10-29,32.7933
2015-10-30,33.3509
2015-11-02,33.6947
2015-11-03,32.8491
2015-11-04,31.9105
2015-11-05,31.6039
2015-11-06,31.8269
2015-11-09,30.8326
2015-11-10,30.9906
2015-11-11,31.0463
2015-11-12,30.1728
2015-11-13,29.987
2015-11-16,30.1171
2015-11-17,30.7304
2015-11-18,31.13
2015-11-19,31.1393
2015-11-20,31.3716
2015-11-23,31.2415
2015-11-24,31.8734
2015-11-25,32.5982
2015-11-27,32.2636
2015-11-30,32.1614
2015-12-01,31.7526
2015-12-02,31.641
2015-12-03,31.1021
2015-12-04,31.0277
2015-12-07,30.1264
2015-12-08,29.2064
2015-12-09,29.0484
2015-12-10,28.8068
2015-12-11,27.5059
2015-12-14,26.9112
2015-12-15,26.6695
2015-12-16,27.4594
2015-12-17,27.3758
2015-12-18,27.1713
2015-12-21,28.0913
2015-12-22,28.9183
2015-12-23,28.844
2015-12-24,28.4584
2015-12-28,28.9555
2015-12-29,29.2715
2015-12-30,28.5745
2015-12-31,28.4723
2016-01-04,27.5616
2016-01-05,26.9112
2016-01-06,27.2271
2016-01-07,26.9855
2016-01-08,26.5859
2016-01-11,19.9696
2016-01-12,22.9804
2016-01-13,21.4671
2016-01-14,22.2074
2016-01-15,21.4203
2016-01-19,21.7389
2016-01-20,22.9476
2016-01-21,22.2823
2016-01-22,22.3667
2016-01-25,21.6639
2016-01-26,22.1793
2016-01-27,21.5889
2016-01-28,21.9169
2016-01-29,23.7254
2016-02-01,23.21
2016-02-02,22.7134
2016-02-03,22.4791
2016-02-04,22.2355
2016-02-05,21.6545
2016-02-08,21.767
2016-02-09,21.5889
2016-02-10,21.8045
2016-02-11,21.439
2016-02-12,22.2823
2016-02-16,22.882
2016-02-17,23.1257
2016-02-18,22.9195
2016-02-19,23.1163
2016-02-22,22.9851
2016-02-23,22.0481
2016-02-24,22.5728
2016-02-25,22.9289
2016-02-26,22.8727
2016-02-29,23.135
2016-03-01,23.9971
2016-03-02,24.0814
2016-03-03,25.234
2016-03-04,25.0372
2016-03-07,26.5083
2016-03-08,25.0747
2016-03-09,25.8618
2016-03-10,25.6181
2016-03-11,26.0585
2016-03-14,23.3412
2016-03-15,23.1538
2016-03-16,23.4443
2016-03-17,23.5754
2016-03-18,23.9221
2016-03-21,24.2313
2016-03-22,24.5499
2016-03-23,24.0627
2016-03-24,24.0533
2016-03-28,23.969
2016-03-29,24.906
2016-03-30,24.831
2016-03-31,25.5057
2016-04-01,25.2246
2016-04-04,24.4281
2016-04-05,24.3344
2016-04-06,23.969
2016-04-07,23.4724
2016-04-08,23.463
2016-04-11,23.3412
2016-04-12,23.969
2016-04-13,25.145
2016-04-14,25.315
2016-04-15,25.6929
2016-04-18,26.2124
2016-04-19,26.3352
2016-04-20,26.5241
2016-04-21,26.099
2016-04-22,27.0909
2016-04-25,26.3068
2016-04-26,27.6671
2016-04-27,27.2042
2016-04-28,26.373
2016-04-29,26.3446
2016-05-02,26.0046
2016-05-03,25.2772
2016-05-04,25.145
2016-05-05,24.6916
2016-05-06,24.9183
2016-05-09,24.1154
2016-05-10,24.6821
2016-05-11,24.5688
2016-05-12,24.1343
2016-05-13,23.8698
2016-05-16,24.6349
2016-05-17,23.4447
2016-05-18,22.7646
2016-05-19,22.9819
2016-05-20,23.5109
2016-05-23,23.4258
2016-05-24,23.6998
2016-05-25,24.3421
2016-05-26,24.0871
2016-05-27,24.002
2016-05-31,23.9076
2016-06-01,23.8887
2016-06-02,24.0587
2016-06-03,23.5486
2016-06-06,24.1437
2016-06-07,23.9548
2016-06-08,23.9548
2016-06-09,23.662
2016-06-10,23.2842
2016-06-13,22.7835
2016-06-14,22.3679
2016-06-15,22.4718
2016-06-16,22.434
2016-06-17,22.6418
2016-06-20,22.7552
2016-06-21,22.7268
2016-06-22,22.604
2016-06-23,23.4069
2016-06-24,21.5272
2016-06-27,20.5165
2016-06-28,19.997
2016-06-29,23.1991
2016-06-30,23.0669
2016-07-01,23.577
2016-07-05,22.9252
2016-07-06,23.6336
2016-07-07,23.6148
2016-07-08,24.3799
2016-07-11,24.7388
2016-07-12,26.0424
2016-07-13,26.5705
2016-07-14,26.7704
2016-07-15,27.1701
2016-07-18,27.0559
2016-07-19,26.8751
2016-07-20,27.1606
2016-07-21,27.1225
2016-07-22,27.3033
2016-07-25,27.0559
2016-07-26,27.4175
2016-07-27,28.0647
2016-07-28,27.7792
2016-07-29,27.8934
2016-08-01,27.8172
2016-08-02,27.5983
2016-08-03,27.665
2016-08-04,27.1796
2016-08-05,28.3216
2016-08-08,28.4929
2016-08-09,28.6547
2016-08-10,28.531
2016-08-11,20.832
2016-08-12,20.8796
2016-08-15,21.4982
2016-08-16,22.2405
2016-08-17,21.9264
2016-08-18,22.269
2016-08-19,22.7353
2016-08-22,22.84
2016-08-23,23.135
2016-08-24,22.9257
2016-08-25,23.2587
2016-08-26,24.0201
2016-08-29,24.0772
2016-08-30,24.0581
2016-08-31,24.2675
2016-09-01,24.553
2016-09-02,25.2287
2016-09-06,25.0955
2016-09-07,25.6665
2016-09-08,25.7711
2016-09-09,25.8092
2016-09-12,25.8758
2016-09-13,25.5713
2016-09-14,25.2763
2016-09-15,25.695
2016-09-16,26.2184
2016-09-19,26.7799
2016-09-20,25.9615
2016-09-21,26.6847
2016-09-22,27.4651
2016-09-23,27.7221
2016-09-26,27.0749
2016-09-27,26.8751
2016-09-28,27.4937
2016-09-29,27.0273
2016-09-30,27.7125
2016-10-03,26.9798
2016-10-04,27.1891
2016-10-05,27.3319
2016-10-06,28.0361
2016-10-07,27.6459
2016-10-10,28.0742
2016-10-11,27.4651
2016-10-12,27.5603
2016-10-13,26.837
2016-10-14,26.561
2016-10-17,26.5515
2016-10-18,26.5515
2016-10-19,27.3128
2016-10-20,27.5573
2016-10-21,27.2457
2016-10-24,27.4614
2016-10-25,26.8863
2016-10-26,26.5508
2016-10-27,30.1453
2016-10-28,28.0844
2016-10-31,27.5573
2016-11-01,27.2697
2016-11-02,27.0301
2016-11-03,27.0301
2016-11-04,27.8927
2016-11-07,28.1803
2016-11-08,28.2762
2016-11-09,29.8577
2016-11-10,30.2411
2016-11-11,31.4872
2016-11-14,32.1581
2016-11-15,32.9249
2016-11-16,32.9249
2016-11-17,30.7204
2016-11-18,30.5766
2016-11-21,30.8162
2016-11-22,31.7268
2016-11-23,32.1581
2016-11-25,31.7268
2016-11-28,31.1996
2016-11-29,31.7747
2016-11-30,31.9185
2016-12-01,31.7268
2016-12-02,31.0079
2016-12-05,33.0208
2016-12-06,33.4042
2016-12-07,34.2669
2016-12-08,35.6088
2016-12-09,36.088
2016-12-12,35.0816
2016-12-13,34.794
2016-12-14,33.8835
2016-12-15,33.7397
2016-12-16,33.1166
2016-12-19,32.6374
2016-12-20,34.5065
2016-12-21,33.3083
2016-12-22,31.5351
2016-12-23,31.7747
2016-12-27,32.5895
2016-12-28,31.9664
2016-12-29,31.9185
2016-12-30,32.0623
2017-01-03,32.4457
2017-01-04,33.1646
2017-01-05,32.3498
2017-01-06,32.9729
2017-01-09,32.7332
2017-01-10,31.2475
2017-01-11,31.397
2017-01-12,32.2169
2017-01-13,31.8793
2017-01-17,31.2524
2017-01-18,31.7829
2017-01-19,31.3488
2017-01-20,32.4581
2017-01-23,32.1687
2017-01-24,32.651
2017-01-25,33.1815
2017-01-26,33.278
2017-01-27,34.339
2017-01-30,33.4227
2017-01-31,33.278
2017-02-01,33.1815
2017-02-02,32.8921
2017-02-03,33.4709
2017-02-06,33.0851
2017-02-07,32.3134
2017-02-08,31.8793
2017-02-09,32.1205
2017-02-10,32.4098
2017-02-13,32.651
2017-02-14,32.4098
2017-02-15,32.4581
2017-02-16,32.4098
2017-02-17,32.5545
2017-02-21,33.0851
2017-02-22,33.1333
2017-02-23,32.7475
2017-02-24,32.5063
2017-02-27,32.5545
2017-02-28,32.5545
2017-03-01,33.3262
2017-03-02,32.9404
2017-03-03,33.0368
2017-03-06,32.651
2017-03-07,32.0722
2017-03-08,31.3488
2017-03-09,31.0594
2017-03-10,31.1559
2017-03-13,31.1077
2017-03-14,31.2041
2017-03-15,31.4935
2017-03-16,31.3006
2017-03-17,31.4453
2017-03-20,30.5289
2017-03-21,30.1431
2017-03-22,29.8055
2017-03-23,29.9502
2017-03-24,29.709
2017-03-27,29.9984
2017-03-28,30.0466
2017-03-29,29.709
2017-03-30,29.9502
2017-03-31,30.336
2017-04-03,29.0338
2017-04-04,28.9374
2017-04-05,28.5998
2017-04-06,29.275
2017-04-07,28.5998
2017-04-10,28.5515
2017-04-11,29.3334
2017-04-12,28.9449
2017-04-13,28.8964
2017-04-17,28.4593
2017-04-18,28.6535
2017-04-19,28.8964
2017-04-20,29.2363
2017-04-21,29.0906
2017-04-24,29.6734
2017-04-25,30.3533
2017-04-26,30.7418
2017-04-27,30.9847
2017-04-28,30.7418
2017-05-01,30.499
2017-05-02,30.4019
2017-05-03,29.9162
2017-05-04,30.0619
2017-05-05,29.5277
2017-05-08,29.1878
2017-05-09,29.1878
2017-05-10,29.5277
2017-05-11,29.1878
2017-05-12,28.7992
2017-05-15,28.9449
2017-05-16,29.2363
2017-05-17,28.3136
2017-05-18,27.3908
2017-05-19,27.7794
2017-05-22,28.265
2017-05-23,28.9935
2017-05-24,28.5564
2017-05-25,28.4107
2017-05-26,28.265
2017-05-30,28.4593
2017-05-31,28.4593
2017-06-01,28.7021
2017-06-02,29.1878
2017-06-05,28.605
2017-06-06,28.3136
2017-06-07,28.1193
2017-06-08,28.4107
2017-06-09,28.4593
2017-06-12,28.4107
2017-06-13,28.5078
2017-06-14,28.8964
2017-06-15,28.3621
2017-06-16,28.1679
2017-06-19,28.3621
2017-06-20,28.1679
2017-06-21,27.6822
2017-06-22,27.7308
2017-06-23,27.8765
2017-06-26,27.7308
2017-06-27,26.7109
2017-06-28,27.488
2017-06-29,28.5078
2017-06-30,31.0818
2017-07-03,31.3246
2017-07-05,30.2076
2017-07-06,29.3334
2017-07-07,29.722
2017-07-10,29.5277
2017-07-11,29.8191
2017-07-12,30.3618
2017-07-13,30.2151
2017-07-14,30.1174
2017-07-17,30.3618
2017-07-18,30.3129
2017-07-19,30.4107
2017-07-20,25.326
2017-07-21,26.0349
2017-07-24,25.1793
2017-07-25,24.5926
2017-07-26,25.4237
2017-07-27,25.3748
2017-07-28,26.8416
2017-07-31,25.7171
2017-08-01,25.6682
2017-08-02,25.6682
2017-08-03,25.6682
2017-08-04,26.1571
2017-08-07,25.5704
2017-08-08,25.7171
2017-08-09,25.8638
2017-08-10,26.4016
2017-08-11,26.2549
2017-08-14,28.1617
2017-08-15,27.7217
2017-08-16,27.4772
2017-08-17,28.015
2017-08-18,28.8951
2017-08-21,28.7484
2017-08-22,29.1884
2017-08-23,29.8729
2017-08-24,29.8729
2017-08-25,30.3129
2017-08-28,30.1174
2017-08-29,30.2151
2017-08-30,29.4818
2017-08-31,29.7262
2017-09-01,30.3618
2017-09-05,30.0196
2017-09-06,30.4596
2017-09-07,30.5574
2017-09-08,29.824
2017-09-11,30.0685
2017-09-12,30.264
2017-09-13,30.4596
2017-09-14,30.3129
2017-09-15,30.3618
2017-09-18,30.5085
2017-09-19,30.5574
2017-09-20,31.7308
2017-09-21,31.8286
2017-09-22,33.2953
2017-09-25,32.8553
2017-09-26,33.442
2017-09-27,34.0776
2017-09-28,33.882
2017-09-29,33.3931
2017-10-02,34.7621
2017-10-03,35.0554
2017-10-04,35.7399
2017-10-05,35.9844
2017-10-06,35.8377
2017-10-09,35.8377
2017-10-10,36.3755
2017-10-11,36.2777
2017-10-12,36.3755
2017-10-13,36.7177
2017-10-16,36.7666
2017-10-17,36.0333
2017-10-18,35.5932
2017-10-19,35.2021
2017-10-20,35.4466
2017-10-23,35.4023
2017-10-24,36.0415
2017-10-25,35.6482
2017-10-26,36.2874
2017-10-27,36.2874
2017-10-30,37.7625
2017-10-31,38.6475
2017-11-01,39.0409
2017-11-02,38.6967
2017-11-03,38.6967
2017-11-06,38.0083
2017-11-07,37.6149
2017-11-08,37.6641
2017-11-09,37.2708
2017-11-10,36.6315
2017-11-13,36.5824
2017-11-14,36.3857
2017-11-15,35.9923
2017-11-16,36.5332
2017-11-17,36.5086
2017-11-20,36.6315
2017-11-21,37.3691
2017-11-22,37.2216
2017-11-24,37.5166
2017-11-27,37.1724
2017-11-28,37.4674
2017-11-29,37.8608
2017-11-30,37.3199
2017-12-01,37.3691
2017-12-04,36.6807
2017-12-05,36.5332
2017-12-06,36.3857
2017-12-07,36.1398
2017-12-08,35.9923
2017-12-11,35.894
2017-12-12,35.7957
2017-12-13,36.0907
2017-12-14,34.8614
2017-12-15,34.7631
2017-12-18,35.7957
2017-12-19,35.894
2017-12-20,36.3365
2017-12-21,36.5824
2017-12-22,36.189
2017-12-26,36.3857
2017-12-27,36.5332
2017-12-28,36.7299
2017-12-29,36.6315
2018-01-02,36.7299
2018-01-03,37.4674
2018-01-04,38.1066
2018-01-05,38.4508
2018-01-08,38.2542
2018-01-09,37.2708
2018-01-10,38.2542
2018-01-11,39.4454
2018-01-12,38.8028
2018-01-16,37.8637
2018-01-17,38.7534
2018-01-18,37.8142
2018-01-19,38.704
2018-01-22,38.358
2018-01-23,38.3085
2018-01-24,37.9625
2018-01-25,38.9017
2018-01-26,39.8903
2018-01-29,38.5557
2018-01-30,38.0119
2018-01-31,38.5557
2018-02-01,38.6545
2018-02-02,37.5671
2018-02-05,35.5404
2018-02-06,36.183
2018-02-07,35.9359
2018-02-08,35.145
2018-02-09,35.9853
2018-02-12,36.4796
2018-02-13,36.7268
2018-02-14,38.2097
2018-02-15,42.263
2018-02-16,42.2135
2018-02-20,42.9056
2018-02-21,42.3618
2018-02-22,42.4607
2018-02-23,43.0538
2018-02-26,43.3504
2018-02-27,43.0538
2018-02-28,43.3504
2018-03-01,42.8561
2018-03-02,43.0538
2018-03-05,43.301
2018-03-06,43.2516
2018-03-07,42.609
2018-03-08,42.7078
2018-03-09,43.2021
2018-03-12,43.0538
2018-03-13,42.6584
2018-03-14,42.609
2018-03-15,42.7573
2018-03-16,43.2021
2018-03-19,43.1033
2018-03-20,43.0538
2018-03-21,42.7573
2018-03-22,42.7573
2018-03-23,42.5595
2018-03-26,42.7078
2018-03-27,42.6584
2018-03-28,42.5101
2018-03-29,42.5101
2018-04-02,42.263
2018-04-03,42.609
2018-04-04,42.5101
2018-04-05,42.6584
2018-04-06,42.4607
2018-04-09,42.3124
2018-04-10,42.4607
2018-04-11,42.6584
2018-04-12,42.564
2018-04-13,42.4647
2018-04-16,42.6634
2018-04-17,42.8124
2018-04-18,42.8124
2018-04-19,42.6137
2018-04-20,42.6137
2018-04-23,42.9614
2018-04-24,42.9614
2018-04-25,42.862
2018-04-26,42.7627
2018-04-27,42.9117
2018-04-30,42.6137
2018-05-01,42.6137
2018-05-02,42.415
2018-05-03,42.3157
2018-05-04,42.4647
2018-05-07,42.6137
2018-05-08,42.7627
2018-05-09,42.6137
2018-05-10,43.16
2018-05-11,43.2097
2018-05-14,43.5574
2018-05-15,43.8057
2018-05-16,43.756
2018-05-17,43.7064
2018-05-18,44.0044
2018-05-21,43.8554
2018-05-22,43.458
2018-05-23,43.8554
2018-05-24,43.8554
2018-05-25,43.8057
2018-05-29,43.905
2018-05-30,43.8057
2018-05-31,43.458
2018-06-01,43.5077
2018-06-04,43.5077
2018-06-05,43.8554
2018-06-06,44.0044
2018-06-07,43.9547
2018-06-08,43.905
2018-06-11,44.1534
2018-06-12,44.1534
2018-06-13,43.9547
2018-06-14,43.9547
2018-06-15,44.1037
2018-06-18,44.1037
2018-06-19,44.1037
2018-06-20,44.054
2018-06-21,44.054
2018-06-22,44.2527
2018-06-25,44.203
2018-06-26,44.203
2018-06-27,44.2527
2018-06-28,44.2527
2018-06-29,44.203
2018-07-02,44.4514
2018-07-03,44.3024
2018-07-05,44.203
2018-07-06,44.1037
2018-07-09,44.054
2018-07-10,43.8554
2018-07-11,43.905
2018-07-12,43.5607
2018-07-13,43.3112
2018-07-16,42.962
2018-07-17,43.4609
2018-07-18,43.1117
2018-07-19,42.962
2018-07-20,42.8622
2018-07-23,43.0119
2018-07-24,43.6605
2018-07-25,43.6106
2018-07-26,43.7603
2018-07-27,43.5108
2018-07-30,43.2613
2018-07-31,43.2613
2018-08-01,43.7603
2018-08-02,43.6106
2018-08-03,43.6106
2018-08-06,43.6605
2018-08-07,43.7104
2018-08-08,43.91
2018-08-09,43.8102
2018-08-10,43.7104
2018-08-13,43.6106
2018-08-14,43.7603
2018-08-15,43.6605
2018-08-16,43.6106
2018-08-17,43.5108
2018-08-20,43.91
