date,close
2014-06-13,17.0277
2014-06-16,17.4093
2014-06-17,17.5111
2014-06-18,17.7231
2014-06-19,17.774
2014-06-20,17.9012
2014-06-23,17.9436
2014-06-24,17.8757
2014-06-25,17.6892
2014-06-26,17.5705
2014-06-27,17.545
2014-06-30,17.8757
2014-07-01,17.8588
2014-07-02,17.6892
2014-07-03,17.6298
2014-07-07,17.6298
2014-07-08,17.4348
2014-07-09,17.2482
2014-07-10,17.4009
2014-07-11,17.7146
2014-07-14,17.9012
2014-07-15,17.8333
2014-07-16,17.4941
2014-07-17,17.138
2014-07-18,17.121
2014-07-21,17.1125
2014-07-22,17.1125
2014-07-23,16.9345
2014-07-24,16.926
2014-07-25,16.8836
2014-07-28,16.714
2014-07-29,16.6631
2014-07-30,16.6716
2014-07-31,16.1882
2014-08-01,16.2222
2014-08-04,16.4681
2014-08-05,16.2645
2014-08-06,16.5614
2014-08-07,16.519
2014-08-08,16.909
2014-08-11,16.9684
2014-08-12,16.1967
2014-08-13,16.3494
2014-08-14,16.6631
2014-08-15,16.3239
2014-08-18,16.4341
2014-08-19,16.4341
2014-08-20,16.4511
2014-08-21,16.2645
2014-08-22,16.2645
2014-08-25,16.7394
2014-08-26,16.6377
2014-08-27,16.5267
2014-08-28,16.4841
2014-08-29,16.7059
2014-09-02,16.3817
2014-09-03,16.2623
2014-09-04,16.2964
2014-09-05,16.5438
2014-09-08,16.3476
2014-09-09,16.194
2014-09-10,16.0489
2014-09-11,16.1513
2014-09-12,15.8954
2014-09-15,15.8783
2014-09-16,15.9039
2014-09-17,16.0489
2014-09-18,16.2537
2014-09-19,15.9978
2014-09-22,15.6565
2014-09-23,15.5797
2014-09-24,15.9722
2014-09-25,15.665
2014-09-26,15.6309
2014-09-29,15.6138
2014-09-30,15.665
2014-10-01,15.5541
2014-10-02,15.4261
2014-10-03,15.5626
2014-10-06,15.6053
2014-10-07,15.6394
2014-10-08,15.7418
2014-10-09,15.3408
2014-10-10,15.0763
2014-10-13,15.1787
2014-10-14,15.3237
2014-10-15,15.3493
2014-10-16,15.2043
2014-10-17,15.5541
2014-10-20,15.81
2014-10-21,16.0489
2014-10-22,16.0404
2014-10-23,16.2537
2014-10-24,16.0831
2014-10-27,15.8186
2014-10-28,16.0063
2014-10-29,15.938
2014-10-30,15.9892
2014-10-31,16.2111
2014-11-03,16.0575
2014-11-04,15.9807
2014-11-05,15.9636
2014-11-06,16.5694
2014-11-07,16.5097
2014-11-10,16.7656
2014-11-11,16.3732
2014-11-12,15.9892
2014-11-13,16.0063
2014-11-14,15.9295
2014-11-17,16.5097
2014-11-18,16.595
2014-11-19,16.5267
2014-11-20,16.7401
2014-11-21,16.8936
2014-11-24,16.6633
2014-11-25,16.4414
2014-11-26,16.6633
2014-11-28,16.6377
2014-12-01,16.339
2014-12-02,16.322
2014-12-03,16.5389
2014-12-04,16.3327
2014-12-05,16.5647
2014-12-08,16.3413
2014-12-09,16.2296
2014-12-10,16.264
2014-12-11,16.4702
2014-12-12,16.264
2014-12-15,15.8258
2014-12-16,15.6883
2014-12-17,15.9719
2014-12-18,16.3327
2014-12-19,16.4788
2014-12-22,16.642
2014-12-23,16.6506
2014-12-24,16.6936
2014-12-26,16.8826
2014-12-29,17.0286
2014-12-30,16.8568
2014-12-31,16.4874
2015-01-02,16.4444
2015-01-05,16.2468
2015-01-06,16.1952
2015-01-07,16.5561
2015-01-08,16.9771
2015-01-09,16.7107
2015-01-12,16.7451
2015-01-13,16.8568
2015-01-14,16.9255
2015-01-15,16.8396
2015-01-16,16.9341
2015-01-20,17.2606
2015-01-21,17.2692
2015-01-22,17.4324
2015-01-23,17.1833
2015-01-26,17.3379
2015-01-27,17.252
2015-01-28,17.1919
2015-01-29,17.1489
2015-01-30,16.8053
2015-02-02,16.9427
2015-02-03,17.0974
2015-02-04,17.106
2015-02-05,17.2262
2015-02-06,17.106
2015-02-09,17.02
2015-02-10,17.0974
2015-02-11,16.8138
2015-02-12,18.3002
2015-02-13,18.6267
2015-02-17,18.5665
2015-02-18,18.7641
2015-02-19,18.7985
2015-02-20,18.9703
2015-02-23,18.893
2015-02-24,18.6696
2015-02-25,18.5064
2015-02-26,18.4119
2015-02-27,18.5923
2015-03-02,18.6267
2015-03-03,18.6782
2015-03-04,18.6372
2015-03-05,18.5594
2015-03-06,18.0234
2015-03-09,18.2136
2015-03-10,17.8246
2015-03-11,17.8851
2015-03-12,18.2828
2015-03-13,18.2222
2015-03-16,18.5248
2015-03-17,18.8014
2015-03-18,18.9484
2015-03-19,18.8014
2015-03-20,18.8792
2015-03-23,18.8965
2015-03-24,18.5853
2015-03-25,18.7755
2015-03-26,18.7323
2015-03-27,19.3979
2015-03-30,19.6918
2015-03-31,19.6572
2015-04-01,19.8474
2015-04-02,20.003
2015-04-06,20.1154
2015-04-07,19.8301
2015-04-08,20.003
2015-04-09,20.1413
2015-04-10,20.1067
2015-04-13,20.1326
2015-04-14,20.2018
2015-04-15,19.9511
2015-04-16,19.8906
2015-04-17,19.6745
2015-04-20,19.5708
2015-04-21,19.4757
2015-04-22,19.4497
2015-04-23,19.4584
2015-04-24,19.2855
2015-04-27,19.346
2015-04-28,19.3633
2015-04-29,19.3374
2015-04-30,19.3114
2015-05-01,19.467
2015-05-04,19.5103
2015-05-05,19.2769
2015-05-06,19.2423
2015-05-07,19.493
2015-05-08,19.614
2015-05-11,19.7609
2015-05-12,19.8387
2015-05-13,19.8387
2015-05-14,20.0116
2015-05-15,20.0203
2015-05-18,20.2018
2015-05-19,20.245
2015-05-20,20.3228
2015-05-21,20.2018
2015-05-22,19.9857
2015-05-26,19.8214
2015-05-27,19.9511
2015-05-28,18.7063
2015-05-29,19.4152
2015-06-01,19.0953
2015-06-02,18.957
2015-06-03,19.0867
2015-06-04,18.8965
2015-06-05,18.836
2015-06-08,18.715
2015-06-09,18.6458
2015-06-10,18.9311
2015-06-11,18.8965
2015-06-12,18.7755
2015-06-15,18.6545
2015-06-16,18.7323
2015-06-17,18.7714
2015-06-18,18.8149
2015-06-19,18.8236
2015-06-22,19.076
2015-06-23,19.1543
2015-06-24,19.1108
2015-06-25,18.8062
2015-06-26,18.902
2015-06-29,18.5277
2015-06-30,18.4059
2015-07-01,18.4407
2015-07-02,18.1187
2015-07-06,17.8141
2015-07-07,18.2841
2015-07-08,18.2841
2015-07-09,18.2928
2015-07-10,18.4059
2015-07-13,18.4755
2015-07-14,18.4842
2015-07-15,18.2145
2015-07-16,18.4842
2015-07-17,18.3798
2015-07-20,18.4842
2015-07-21,18.2057
2015-07-22,18.2754
2015-07-23,18.2493
2015-07-24,18.0926
2015-07-27,18.1013
2015-07-28,18.3624
2015-07-29,18.7105
2015-07-30,18.7018
2015-07-31,18.8497
2015-08-03,18.8671
2015-08-04,19.076
2015-08-05,19.1456
2015-08-06,18.9716
2015-08-07,18.9803
2015-08-10,19.1456
2015-08-11,19.163
2015-08-12,19.1717
2015-08-13,20.3988
2015-08-14,20.9035
2015-08-17,21.2691
2015-08-18,20.9645
2015-08-19,20.8078
2015-08-20,20.6164
2015-08-21,20.2857
2015-08-24,19.5285
2015-08-25,19.2936
2015-08-26,19.7287
2015-08-27,19.9637
2015-08-28,19.9681
2015-08-31,20.3271
2015-09-01,19.9943
2015-09-02,20.5286
2015-09-03,20.765
2015-09-04,20.511
2015-09-08,20.9139
2015-09-09,20.9402
2015-09-10,21.1241
2015-09-11,21.2117
2015-09-14,21.019
2015-09-15,21.273
2015-09-16,21.3255
2015-09-17,21.4131
2015-09-18,21.2292
2015-09-21,21.3343
2015-09-22,21.6671
2015-09-23,22.1663
2015-09-24,22.2451
2015-09-25,22.2451
2015-09-28,22.105
2015-09-29,21.5883
2015-09-30,21.6671
2015-10-01,21.9649
2015-10-02,21.9824
2015-10-05,22.4465
2015-10-06,22.3239
2015-10-07,22.6655
2015-10-08,22.6129
2015-10-09,22.7969
2015-10-12,22.937
2015-10-13,23.0596
2015-10-14,22.5078
2015-10-15,22.1926
2015-10-16,22.7793
2015-10-19,22.9895
2015-10-20,22.6042
2015-10-21,22.8494
2015-10-22,23.4975
2015-10-23,23.6902
2015-10-26,23.5325
2015-10-27,23.5676
2015-10-28,23.4975
2015-10-29,23.7252
2015-10-30,23.6464
2015-11-02,23.6113
2015-11-03,23.5763
2015-11-04,23.5588
2015-11-05,23.6464
2015-11-06,23.3661
2015-11-09,23.2698
2015-11-10,23.6113
2015-11-11,23.3311
2015-11-12,20.5986
2015-11-13,20.5899
2015-11-16,20.5811
2015-11-17,20.5636
2015-11-18,20.5986
2015-11-19,20.695
2015-11-20,20.3709
2015-11-23,20.5373
2015-11-24,20.8614
2015-11-25,20.8526
2015-11-27,21.0803
2015-11-30,20.5986
2015-12-01,20.4585
2015-12-02,19.9606
2015-12-03,19.5552
2015-12-04,19.705
2015-12-07,19.3966
2015-12-08,19.5904
2015-12-09,19.1674
2015-12-10,19.0705
2015-12-11,19.0441
2015-12-14,19.2996
2015-12-15,19.3437
2015-12-16,19.5993
2015-12-17,19.5552
2015-12-18,19.3173
2015-12-21,19.4142
2015-12-22,19.6698
2015-12-23,19.7403
2015-12-24,19.3878
2015-12-28,19.3613
2015-12-29,19.3349
2015-12-30,19.2203
2015-12-31,18.9383
2016-01-04,18.9383
2016-01-05,19.0441
2016-01-06,18.8326
2016-01-07,18.577
2016-01-08,18.7268
2016-01-11,18.9736
2016-01-12,19.2556
2016-01-13,18.8766
2016-01-14,19.0088
2016-01-15,18.3302
2016-01-19,17.8103
2016-01-20,17.8103
2016-01-21,17.9072
2016-01-22,18.2686
2016-01-25,17.5547
2016-01-26,17.6252
2016-01-27,17.4314
2016-01-28,17.6076
2016-01-29,18.1011
2016-02-01,18.1276
2016-02-02,17.9249
2016-02-03,17.8015
2016-02-04,17.9072
2016-02-05,17.7486
2016-02-08,17.6781
2016-02-09,17.9513
2016-02-10,18.4536
2016-02-11,14.814
2016-02-12,13.8446
2016-02-16,14.2764
2016-02-17,14.0032
2016-02-18,14.3205
2016-02-19,14.4174
2016-02-22,14.8669
2016-02-23,14.8316
2016-02-24,15.0696
2016-02-25,15.1313
2016-02-26,15.2194
2016-02-29,15.096
2016-03-01,14.9991
2016-03-02,15.2435
2016-03-03,15.5457
2016-03-04,15.7679
2016-03-07,15.919
2016-03-08,15.9012
2016-03-09,15.7501
2016-03-10,15.6346
2016-03-11,16.0079
2016-03-14,16.0079
2016-03-15,16.1412
2016-03-16,16.2568
2016-03-17,16.719
2016-03-18,16.6301
2016-03-21,16.6834
2016-03-22,16.3545
2016-03-23,16.3368
2016-03-24,16.0879
2016-03-28,16.4612
2016-03-29,16.6034
2016-03-30,16.4968
2016-03-31,16.4079
2016-04-01,16.1945
2016-04-04,15.6524
2016-04-05,15.6346
2016-04-06,15.9901
2016-04-07,16.3012
2016-04-08,16.559
2016-04-11,16.4701
2016-04-12,16.479
2016-04-13,16.6034
2016-04-14,16.399
2016-04-15,16.3901
2016-04-18,16.6479
2016-04-19,16.4968
2016-04-20,16.319
2016-04-21,16.2479
2016-04-22,16.4879
2016-04-25,16.8701
2016-04-26,16.8878
2016-04-27,17.11
2016-04-28,17.0212
2016-04-29,17.0301
2016-05-02,17.1989
2016-05-03,17.0389
2016-05-04,17.0389
2016-05-05,17.0301
2016-05-06,17.1723
2016-05-09,17.3856
2016-05-10,17.3589
2016-05-11,17.2345
2016-05-12,17.2434
2016-05-13,17.27
2016-05-16,17.2078
2016-05-17,16.8345
2016-05-18,16.3368
2016-05-19,17.0834
2016-05-20,16.5945
2016-05-23,16.3279
2016-05-24,16.399
2016-05-25,16.2923
2016-05-26,16.6567
2016-05-27,16.7101
2016-05-31,16.6656
2016-06-01,16.6656
2016-06-02,16.5856
2016-06-03,16.6212
2016-06-06,16.6567
2016-06-07,16.5761
2016-06-08,16.5043
2016-06-09,16.8181
2016-06-10,16.5671
2016-06-13,16.334
2016-06-14,16.1457
2016-06-15,16.2354
2016-06-16,16.2264
2016-06-17,16.0561
2016-06-20,16.1278
2016-06-21,16.1368
2016-06-22,16.1547
2016-06-23,16.0651
2016-06-24,16.0651
2016-06-27,16.2533
2016-06-28,16.325
2016-06-29,16.5761
2016-06-30,16.8091
2016-07-01,16.6747
2016-07-05,16.3788
2016-07-06,16.9347
2016-07-07,16.6298
2016-07-08,16.7912
2016-07-11,16.9257
2016-07-12,16.845
2016-07-13,16.7823
2016-07-14,16.845
2016-07-15,16.845
2016-07-18,16.836
2016-07-19,16.7823
2016-07-20,16.8271
2016-07-21,16.8629
2016-07-22,17.1677
2016-07-25,17.4546
2016-07-26,16.9526
2016-07-27,16.2981
2016-07-28,16.2623
2016-07-29,16.4864
2016-08-01,16.1457
2016-08-02,15.7334
2016-08-03,15.9127
2016-08-04,15.7961
2016-08-05,16.0382
2016-08-08,15.814
2016-08-09,15.9127
2016-08-10,14.4783
2016-08-11,13.4025
2016-08-12,13.3128
2016-08-15,13.6804
2016-08-16,13.8597
2016-08-17,13.7521
2016-08-18,13.5908
2016-08-19,13.6535
2016-08-22,13.7252
2016-08-23,13.6535
2016-08-24,13.6535
2016-08-25,13.5011
2016-08-26,13.4742
2016-08-29,13.6445
2016-08-30,13.5206
2016-08-31,13.5115
2016-09-01,13.3484
2016-09-02,13.4753
2016-09-06,13.4843
2016-09-07,13.6112
2016-09-08,13.6475
2016-09-09,13.2306
2016-09-12,13.6203
2016-09-13,13.7743
2016-09-14,13.8287
2016-09-15,13.9284
2016-09-16,13.9737
2016-09-19,14.0824
2016-09-20,13.9193
2016-09-21,13.9374
2016-09-22,14.2002
2016-09-23,14.0824
2016-09-26,13.8378
2016-09-27,13.7109
2016-09-28,13.7834
2016-09-29,13.6837
2016-09-30,13.7018
2016-10-03,13.6022
2016-10-04,13.4662
2016-10-05,13.5659
2016-10-06,13.294
2016-10-07,13.3303
2016-10-10,13.6928
2016-10-11,13.6293
2016-10-12,13.6293
2016-10-13,13.4662
2016-10-14,13.7743
2016-10-17,13.6746
2016-10-18,14.019
2016-10-19,14.0009
2016-10-20,14.2999
2016-10-21,13.7834
2016-10-24,13.9193
2016-10-25,14.1187
2016-10-26,13.9284
2016-10-27,13.8921
2016-10-28,14.0643
2016-10-31,14.0643
2016-11-01,13.8015
2016-11-02,13.8196
2016-11-03,13.7562
2016-11-04,13.8196
2016-11-07,14.0553
2016-11-08,14.1821
2016-11-09,14.3815
2016-11-10,14.1096
2016-11-11,14.0462
2016-11-14,14.6805
2016-11-15,14.5446
2016-11-16,14.3452
2016-11-17,14.4087
2016-11-18,14.599
2016-11-21,14.6805
2016-11-22,14.6624
2016-11-23,14.1549
2016-11-25,14.463
2016-11-28,14.2999
2016-11-29,14.1187
2016-11-30,14.2103
2016-12-01,14.0271
2016-12-02,14.1736
2016-12-05,14.3934
2016-12-06,14.8237
2016-12-07,15.1716
2016-12-08,15.5928
2016-12-09,17.6713
2016-12-12,17.2043
2016-12-13,17.6713
2016-12-14,17.4057
2016-12-15,18.01
2016-12-16,17.5797
2016-12-19,17.5889
2016-12-20,17.4607
2016-12-21,17.7628
2016-12-22,17.717
2016-12-23,17.8727
2016-12-27,18.1016
2016-12-28,18.0924
2016-12-29,18.3213
2016-12-30,18.2847
2017-01-03,18.2481
2017-01-04,18.358
2017-01-05,18.2389
2017-01-06,18.01
2017-01-09,17.7994
2017-01-10,17.9002
2017-01-11,18.1108
2017-01-12,18.1108
2017-01-13,18.3488
2017-01-17,18.0009
2017-01-18,18.1382
2017-01-19,17.9826
2017-01-20,18.1291
2017-01-23,18.1657
2017-01-24,18.2206
2017-01-25,18.2756
2017-01-26,18.2939
2017-01-27,18.2847
2017-01-30,18.2572
2017-01-31,18.4129
2017-02-01,18.3488
2017-02-02,18.4678
2017-02-03,18.5319
2017-02-06,18.4678
2017-02-07,18.5319
2017-02-08,18.6143
2017-02-09,18.9531
2017-02-10,18.9623
2017-02-13,19.0813
2017-02-14,17.3874
2017-02-15,17.6713
2017-02-16,17.772
2017-02-17,17.9185
2017-02-21,17.8178
2017-02-22,17.5614
2017-02-23,17.5797
2017-02-24,17.5797
2017-02-27,17.6804
2017-02-28,17.6346
2017-03-01,17.8101
2017-03-02,17.7824
2017-03-03,17.727
2017-03-06,17.6993
2017-03-07,17.5977
2017-03-08,17.6439
2017-03-09,17.6162
2017-03-10,17.6993
2017-03-13,17.6162
2017-03-14,17.8101
2017-03-15,18.0778
2017-03-16,18.0316
2017-03-17,18.1424
2017-03-20,18.1332
2017-03-21,17.9762
2017-03-22,17.8562
2017-03-23,17.8654
2017-03-24,17.9208
2017-03-27,17.9485
2017-03-28,17.9208
2017-03-29,18.0039
2017-03-30,17.9762
2017-03-31,17.9208
2017-04-03,17.8193
2017-04-04,17.8654
2017-04-05,17.7454
2017-04-06,18.0316
2017-04-07,17.9301
2017-04-10,17.967
2017-04-11,17.9947
2017-04-12,18.087
2017-04-13,17.7916
2017-04-17,18.0501
2017-04-18,18.124
2017-04-19,18.2071
2017-04-20,18.3086
2017-04-21,18.3179
2017-04-24,18.3548
2017-04-25,18.3179
2017-04-26,18.2994
2017-04-27,18.3271
2017-04-28,18.1055
2017-05-01,17.8747
2017-05-02,17.2192
2017-05-03,17.3484
2017-05-04,17.5054
2017-05-05,17.3576
2017-05-08,17.4592
2017-05-09,17.5423
2017-05-10,17.7916
2017-05-11,17.9578
2017-05-12,17.8654
2017-05-15,18.124
2017-05-16,18.1147
2017-05-17,17.9116
2017-05-18,16.9237
2017-05-19,17.0899
2017-05-22,17.2099
2017-05-23,17.1361
2017-05-24,17.2099
2017-05-25,17.0714
2017-05-26,17.1361
2017-05-30,17.1084
2017-05-31,17.0622
2017-06-01,17.4223
2017-06-02,17.2653
2017-06-05,17.2469
2017-06-06,17.0991
2017-06-07,17.2016
2017-06-08,16.9966
2017-06-09,17.0339
2017-06-12,17.0432
2017-06-13,17.1644
2017-06-14,17.1364
2017-06-15,17.0712
2017-06-16,16.4655
2017-06-19,16.6146
2017-06-20,16.1859
2017-06-21,16.1859
2017-06-22,16.1673
2017-06-23,16.3443
2017-06-26,16.5027
2017-06-27,16.4096
2017-06-28,16.5773
2017-06-29,16.1952
2017-06-30,16.13
2017-07-03,16.0741
2017-07-05,15.8412
2017-07-06,15.8971
2017-07-07,16.13
2017-07-10,15.9343
2017-07-11,15.8691
2017-07-12,15.9996
2017-07-13,16.1487
2017-07-14,16.3537
2017-07-17,16.4189
2017-07-18,16.2977
2017-07-19,16.5493
2017-07-20,16.6798
2017-07-21,16.5866
2017-07-24,16.5121
2017-07-25,16.8196
2017-07-26,16.5307
2017-07-27,16.7357
2017-07-28,16.2139
2017-07-31,16.3909
2017-08-01,16.5027
2017-08-02,16.4282
2017-08-03,16.4562
2017-08-04,16.5027
2017-08-07,16.5773
2017-08-08,16.2139
2017-08-09,16.335
2017-08-10,16.2139
2017-08-11,16.4748
2017-08-14,16.7823
2017-08-15,16.5866
2017-08-16,16.6332
2017-08-17,16.5027
2017-08-18,16.6518
2017-08-21,16.6984
2017-08-22,16.9221
2017-08-23,16.7543
2017-08-24,16.2139
2017-08-25,16.5121
2017-08-28,16.2512
2017-08-29,16.3257
2017-08-30,16.4292
2017-08-31,16.3445
2017-09-01,16.4386
2017-09-05,16.3539
2017-09-06,16.4292
2017-09-07,16.4857
2017-09-08,16.6927
2017-09-11,17.0502
2017-09-12,16.9844
2017-09-13,17.0126
2017-09-14,17.1443
2017-09-15,17.229
2017-09-18,17.2949
2017-09-19,17.2196
2017-09-20,17.229
2017-09-21,17.0879
2017-09-22,17.0597
2017-09-25,17.2761
2017-09-26,17.643
2017-09-27,17.1632
2017-09-28,17.643
2017-09-29,17.6995
2017-10-02,17.6054
2017-10-03,17.5678
2017-10-04,17.7183
2017-10-05,17.596
2017-10-06,17.643
2017-10-09,17.596
2017-10-10,17.6901
2017-10-11,17.643
2017-10-12,17.6242
2017-10-13,17.8312
2017-10-16,17.8312
2017-10-17,17.7089
2017-10-18,17.643
2017-10-19,17.5772
2017-10-20,17.596
2017-10-23,17.4643
2017-10-24,17.4549
2017-10-25,17.5678
2017-10-26,17.6525
2017-10-27,17.8501
2017-10-30,17.5678
2017-10-31,17.9065
2017-11-01,17.8877
2017-11-02,17.6242
2017-11-03,17.2573
2017-11-06,16.9279
2017-11-07,16.8432
2017-11-08,16.9561
2017-11-09,17.2761
2017-11-10,17.596
2017-11-13,17.7842
2017-11-14,18.4146
2017-11-15,18.3958
2017-11-16,18.9698
2017-11-17,18.6122
2017-11-20,18.537
2017-11-21,18.1888
2017-11-22,18.2453
2017-11-24,18.2453
2017-11-27,18.2641
2017-11-28,18.4429
2017-11-29,18.8475
2017-11-30,18.9614
2017-12-01,19.0468
2017-12-04,19.0847
2017-12-05,18.9614
2017-12-06,19.303
2017-12-07,19.1701
2017-12-08,19.2271
2017-12-11,19.1512
2017-12-12,18.7146
2017-12-13,18.6766
2017-12-14,18.781
2017-12-15,18.6102
2017-12-18,18.781
2017-12-19,18.5533
2017-12-20,18.5817
2017-12-21,18.5438
2017-12-22,18.6577
2017-12-26,18.4394
2017-12-27,18.3635
2017-12-28,18.4394
2017-12-29,18.3255
2018-01-02,18.335
2018-01-03,18.0408
2018-01-04,18.0218
2018-01-05,18.0503
2018-01-08,18.1262
2018-01-09,18.297
2018-01-10,17.6992
2018-01-11,17.5473
2018-01-12,17.7371
2018-01-16,17.851
2018-01-17,18.2401
2018-01-18,18.1547
2018-01-19,18.354
2018-01-22,18.5058
2018-01-23,18.4963
2018-01-24,18.4109
2018-01-25,18.2876
2018-01-26,18.1927
2018-01-29,18.5058
2018-01-30,18.6197
2018-01-31,18.6102
2018-02-01,18.5912
2018-02-02,18.1927
2018-02-05,17.6422
2018-02-06,17.9364
2018-02-07,17.9839
2018-02-08,18.9424
2018-02-09,19.3315
2018-02-12,19.3599
2018-02-13,19.6162
2018-02-14,19.7965
2018-02-15,19.8439
2018-02-16,20.2615
2018-02-20,19.9388
2018-02-21,19.6636
2018-02-22,19.749
2018-02-23,20.1571
2018-02-26,20.1286
2018-02-27,19.9104
2018-02-28,19.6826
2018-03-01,19.5869
2018-03-02,19.9218
2018-03-05,20.1419
2018-03-06,20.4481
2018-03-07,20.362
2018-03-08,20.2185
2018-03-09,20.5151
2018-03-12,20.2185
2018-03-13,20.295
2018-03-14,20.4098
2018-03-15,20.0462
2018-03-16,20.2376
2018-03-19,20.2567
2018-03-20,20.2185
2018-03-21,19.9027
2018-03-22,19.6443
2018-03-23,19.874
2018-03-26,20.1706
2018-03-27,20.1036
2018-03-28,20.4768
2018-03-29,20.917
2018-04-02,20.3046
2018-04-03,20.8978
2018-04-04,21.2614
2018-04-05,21.3093
2018-04-06,21.1275
2018-04-09,21.1562
2018-04-10,21.5485
2018-04-11,21.3667
2018-04-12,21.2901
2018-04-13,21.2997
2018-04-16,21.4624
2018-04-17,21.7112
2018-04-18,21.5485
2018-04-19,21.3763
2018-04-20,21.2901
2018-04-23,21.3858
2018-04-24,21.3954
2018-04-25,21.4432
2018-04-26,21.625
2018-04-27,21.6729
2018-04-30,21.6346
2018-05-01,21.7303
2018-05-02,21.4241
2018-05-03,21.2806
2018-05-04,21.3763
2018-05-07,21.5389
2018-05-08,21.5581
2018-05-09,21.3284
2018-05-10,21.4145
2018-05-11,21.6537
2018-05-14,21.0605
2018-05-15,20.8404
2018-05-16,20.6873
2018-05-17,18.7162
2018-05-18,18.4578
2018-05-21,18.5631
2018-05-22,18.6492
2018-05-23,18.965
2018-05-24,19.2138
2018-05-25,19.1563
2018-05-29,19.1468
2018-05-30,19.8548
2018-05-31,19.4243
2018-06-01,18.965
2018-06-04,19.2233
2018-06-05,19.6443
2018-06-06,19.4609
2018-06-07,19.5575
2018-06-08,20.0691
2018-06-11,20.2428
2018-06-12,20.3587
2018-06-13,19.6637
2018-06-14,19.5768
2018-06-15,19.8374
2018-06-18,19.9629
2018-06-19,20.2815
2018-06-20,20.2815
2018-06-21,19.654
2018-06-22,19.625
2018-06-25,19.7505
2018-06-26,19.9726
2018-06-27,19.9146
2018-06-28,20.2622
2018-06-29,20.1077
2018-07-02,19.7891
2018-07-03,19.9726
2018-07-05,20.5807
2018-07-06,20.5807
2018-07-09,19.8664
2018-07-10,19.7602
2018-07-11,19.8181
2018-07-12,19.7988
2018-07-13,19.9339
2018-07-16,19.5768
2018-07-17,19.7795
2018-07-18,19.5575
2018-07-19,19.6443
2018-07-20,19.7119
2018-07-23,19.6154
2018-07-24,19.3837
2018-07-25,19.3354
2018-07-26,19.4706
2018-07-27,19.4802
2018-07-30,19.683
2018-07-31,19.6926
2018-08-01,19.403
2018-08-02,20.1077
2018-08-03,20.7255
2018-08-06,20.1367
2018-08-07,19.9822
2018-08-08,19.3741
2018-08-09,18.7852
2018-08-10,18.6887
2018-08-13,18.7659
2018-08-14,19.1617
2018-08-15,19.5478
2018-08-16,19.6057
2018-08-17,19.9146
2018-08-20,20.0401
2018-08-21,19.7988
2018-08-22,19.654
2018-08-23,19.6637
2018-08-24,19.7602
2018-08-27,19.5092
2018-08-28,19.4706
2018-08-29,19.4899
2018-08-30,19.4704
2018-08-31,19.6262
2018-09-04,19.7139
2018-09-05,19.899
2018-09-06,19.7042
2018-09-07,19.86
2018-09-10,20.1522
2018-09-11,19.9379
2018-09-12,20.162
2018-09-13,20.0159
2018-09-14,19.7821
2018-09-17,19.4801
2018-09-18,19.1198
2018-09-19,18.7983
2018-09-20,18.8665
2018-09-21,18.847
2018-09-24,18.5938
2018-09-25,18.2042
2018-09-26,18.3406
2018-09-27,18.1165
2018-09-28,18.175
2018-10-01,18.0289
2018-10-02,18.1263
2018-10-03,17.9899
2018-10-04,18.3211
2018-10-05,18.4964
2018-10-08,18.9542
2018-10-09,18.7204
2018-10-10,18.886
2018-10-11,18.3211
2018-10-12,18.2919
2018-10-15,18.4477
2018-10-16,18.662
2018-10-17,18.3308
2018-10-18,18.2334
2018-10-19,18.5646
2018-10-22,18.5841
2018-10-23,18.8957
2018-10-24,19.3535
2018-10-25,18.8276
2018-10-26,18.623
2018-10-29,18.886
2018-10-30,19.4509
2018-10-31,18.8081
2018-11-01,18.6035
2018-11-02,18.2821
2018-11-05,18.3503
2018-11-06,18.5451
2018-11-07,18.6815
2018-11-08,18.3503
2018-11-09,19.3146
2018-11-12,19.5678
2018-11-13,19.3438
2018-11-14,19.0905
2018-11-15,19.334
2018-11-16,19.1003
2018-11-19,19.4607
2018-11-20,19.6457
2018-11-21,19.0613
2018-11-23,19.11
2018-11-26,19.0516
2018-11-27,19.3243
2018-11-28,19.2269
2018-11-29,19.4038
2018-11-30,19.453
2018-12-03,19.0991
2018-12-04,19.4333
2018-12-06,19.0303
2018-12-07,18.8632
2018-12-10,18.7256
2018-12-11,18.9713
2018-12-12,19.1778
2018-12-13,19.2073
2018-12-14,18.7158
2018-12-17,18.1456
2018-12-18,17.9392
2018-12-19,18.185
2018-12-20,18.2243
2018-12-21,17.8901
2018-12-24,17.6542
2018-12-26,17.8802
2018-12-27,18.0179
2018-12-28,17.9785
2018-12-31,18.1555
2019-01-02,18.0473
2019-01-03,18.2439
2019-01-04,18.3914
2019-01-07,18.4504
2019-01-08,18.588
2019-01-09,18.4405
2019-01-10,18.7747
2019-01-11,18.9615
2019-01-14,18.8927
2019-01-15,19.1384
2019-01-16,18.9419
2019-01-17,19.1876
2019-01-18,19.2761
2019-01-22,19.3645
2019-01-23,19.3744
2019-01-24,19.0303
2019-01-25,18.9222
2019-01-28,18.9124
2019-01-29,18.8927
2019-01-30,18.8436
2019-01-31,19.3252
2019-02-01,19.2761
2019-02-04,19.3547
2019-02-05,19.6791
2019-02-06,19.5415
2019-02-07,19.974
2019-02-08,19.4923
2019-02-11,19.8069
2019-02-12,20.259
2019-02-13,20.2787
2019-02-14,20.3868
2019-02-15,20.377
2019-02-19,20.5736
2019-02-20,20.6227
2019-02-21,20.6424
2019-02-22,20.7014
2019-02-25,20.4065
2019-02-26,20.1706
2019-02-27,20.2787
2019-02-28,20.2985
2019-03-01,20.4473
2019-03-04,20.1002
2019-03-05,20.1696
2019-03-06,20.1002
2019-03-07,20.0804
2019-03-08,20.1696
2019-03-11,20.2093
2019-03-12,20.1002
2019-03-13,20.12
2019-03-14,19.9316
2019-03-15,20.1795
2019-03-18,20.1399
2019-03-19,20.1399
2019-03-20,19.9713
2019-03-21,20.3481
2019-03-22,20.5762
2019-03-25,20.715
2019-03-26,20.8737
2019-03-27,21.0125
2019-03-28,21.1017
2019-03-29,21.1414
2019-04-01,21.0125
2019-04-02,20.8241
2019-04-03,20.8935
2019-04-04,20.8935
2019-04-05,21.0026
2019-04-08,21.072
2019-04-09,20.9332
2019-04-10,21.2207
2019-04-11,21.1612
2019-04-12,21.2108
2019-04-15,21.3496
2019-04-16,21.3992
2019-04-17,21.4091
2019-04-18,21.4191
2019-04-22,21.2505
2019-04-23,21.2703
2019-04-24,21.2802
2019-04-25,21.1017
2019-04-26,21.3893
2019-04-29,21.4587
2019-04-30,21.5579
2019-05-01,21.2802
2019-05-02,21.3298
2019-05-03,21.4191
2019-05-06,21.4191
2019-05-07,21.2306
2019-05-08,21.2406
2019-05-09,21.3596
2019-05-10,21.3992
2019-05-13,21.1612
2019-05-14,20.9827
2019-05-15,21.0522
2019-05-16,22.4702
2019-05-17,22.609
2019-05-20,22.6189
2019-05-21,22.5793
2019-05-22,22.8073
2019-05-23,22.8867
2019-05-24,22.7776
2019-05-28,22.3413
2019-05-29,22.1132
2019-05-30,22.0735
2019-05-31,22.1826
2019-06-03,22.6586
2019-06-04,22.5793
2019-06-05,22.49
2019-06-06,22.64
2019-06-07,22.77
2019-06-10,22.79
2019-06-11,23
2019-06-12,23.16
2019-06-13,23.18
2019-06-14,23.275
2019-06-17,22.92
2019-06-18,22.78
2019-06-19,23.11
2019-06-20,23.2
2019-06-21,23.545
2019-06-24,23.415
2019-06-25,23.74
2019-06-26,23.18
2019-06-27,22.985
2019-06-28,23.375
2019-07-01,23.205
2019-07-02,23.435
2019-07-03,23.765
2019-07-04,23.765
2019-07-05,23.715
2019-07-08,23.61
2019-07-09,23.495
2019-07-10,23.57
2019-07-11,23.385
2019-07-12,23.37
2019-07-15,23.37
2019-07-16,23.4
2019-07-17,23.44
2019-07-18,23.59
2019-07-19,23.5
2019-07-22,23.435
2019-07-23,23.575
2019-07-24,23.705
2019-07-25,23.745
2019-07-26,23.84
2019-07-29,23.895
2019-07-30,23.86
2019-07-31,23.735
2019-08-01,23.805
2019-08-02,23.99
2019-08-05,23.84
2019-08-06,24.1
2019-08-07,24.245
2019-08-08,22.895
2019-08-09,22.325
2019-08-12,22.375
2019-08-13,22.725
2019-08-14,22.525
2019-08-15,22.615
2019-08-16,22.935
2019-08-19,23.105
2019-08-20,22.805
2019-08-21,22.735
2019-08-22,23.07
2019-08-23,22.98
2019-08-26,23.25
2019-08-27,22.955
2019-08-28,22.98
2019-08-29,22.755
2019-08-30,22.805
2019-09-02,22.815
2019-09-03,23.005
2019-09-04,23.465
2019-09-05,23.04
2019-09-06,22.765
2019-09-09,22.63
2019-09-10,22.325
2019-09-11,22.545
2019-09-12,22.45
2019-09-13,22.325
2019-09-16,22.415
2019-09-17,22.75
2019-09-18,22.845
2019-09-19,22.72
2019-09-20,22.875
2019-09-23,22.745
2019-09-24,22.925
2019-09-25,23.025
2019-09-26,22.865
2019-09-27,22.845
2019-09-30,23.11
2019-10-01,22.725
2019-10-02,22.55
2019-10-03,22.485
2019-10-04,22.515
2019-10-07,22.385
2019-10-08,22.185
2019-10-09,22.515
2019-10-10,22.345
2019-10-11,22.315
2019-10-14,22.115
2019-10-15,21.905
2019-10-16,21.73
2019-10-17,21.89
2019-10-18,21.8
2019-10-21,21.91
2019-10-22,21.765
2019-10-23,21.725
2019-10-24,21.685
2019-10-25,21.58
2019-10-28,21.605
2019-10-29,21.865
2019-10-30,21.675
2019-10-31,21.745
2019-11-01,21.515
2019-11-04,21.235
2019-11-05,21.13
2019-11-06,21.415
2019-11-07,20.905
2019-11-08,20.895
2019-11-11,21.125
2019-11-12,21.055
2019-11-13,21.21
2019-11-14,21.375
2019-11-15,21.445
2019-11-18,21.385
2019-11-19,21.575
2019-11-20,21.825
2019-11-21,21.585
2019-11-22,21.575
2019-11-25,21.565
