date,close
2014-06-13,35.3135
2014-06-16,34.8854
2014-06-17,35.9319
2014-06-18,36.6359
2014-06-19,36.7405
2014-06-20,37.1401
2014-06-23,36.8166
2014-06-24,36.6263
2014-06-25,36.7976
2014-06-26,36.9308
2014-06-27,37.473
2014-06-30,37.5587
2014-07-01,37.7299
2014-07-02,37.1401
2014-07-03,37.8155
2014-07-07,37.3303
2014-07-08,36.7024
2014-07-09,36.7024
2014-07-10,36.1126
2014-07-11,35.8462
2014-07-14,35.7606
2014-07-15,36.2648
2014-07-16,35.304
2014-07-17,34.2956
2014-07-18,35.4562
2014-07-21,35.3611
2014-07-22,35.1993
2014-07-23,35.2089
2014-07-24,35.285
2014-07-25,35.1898
2014-07-28,35.2089
2014-07-29,35.1993
2014-07-30,35.7321
2014-07-31,35.1993
2014-08-01,34.1053
2014-08-04,33.8104
2014-08-05,34.0007
2014-08-06,34.2009
2014-08-07,33.686
2014-08-08,33.8767
2014-08-11,33.9053
2014-08-12,33.7432
2014-08-13,34.0483
2014-08-14,33.686
2014-08-15,33.5716
2014-08-18,34.239
2014-08-19,34.0197
2014-08-20,33.8576
2014-08-21,34.3916
2014-08-22,34.3344
2014-08-25,34.2295
2014-08-26,34.4583
2014-08-27,34.3916
2014-08-28,33.8862
2014-08-29,34.1913
2014-09-02,34.5537
2014-09-03,34.4202
2014-09-04,34.2867
2014-09-05,34.2199
2014-09-08,34.3248
2014-09-09,33.7814
2014-09-10,34.6395
2014-09-11,35.326
2014-09-12,35.7455
2014-09-15,35.4022
2014-09-16,35.6788
2014-09-17,36.2222
2014-09-18,36.5273
2014-09-19,36.2794
2014-09-22,35.5357
2014-09-23,34.8969
2014-09-24,35.1925
2014-09-25,34.7444
2014-09-26,34.7825
2014-09-29,34.8111
2014-09-30,34.4202
2014-10-01,33.8004
2014-10-02,33.81
2014-10-03,34.2486
2014-10-06,33.7241
2014-10-07,33.0376
2014-10-08,33.9244
2014-10-09,33.2379
2014-10-10,33.0376
2014-10-13,33.6097
2014-10-14,34.3439
2014-10-15,33.2665
2014-10-16,33.7146
2014-10-17,33.4858
2014-10-20,33.7051
2014-10-21,34.6871
2014-10-22,34.0007
2014-10-23,34.506
2014-10-24,34.5537
2014-10-27,34.7539
2014-10-28,36.165
2014-10-29,36.575
2014-10-30,36.4987
2014-10-31,37.3759
2014-11-03,37.109
2014-11-04,36.9087
2014-11-05,37.0998
2014-11-06,37.4533
2014-11-07,37.2431
2014-11-10,37.6922
2014-11-11,37.5393
2014-11-12,37.9502
2014-11-13,37.1667
2014-11-14,37.2049
2014-11-17,36.7559
2014-11-18,36.861
2014-11-19,36.1922
2014-11-20,36.4501
2014-11-21,35.81
2014-11-24,36.3737
2014-11-25,36.5361
2014-11-26,36.4119
2014-11-28,35.9915
2014-12-01,34.4628
2014-12-02,35.4947
2014-12-03,36.0871
2014-12-04,35.724
2014-12-05,36.5934
2014-12-08,36.4788
2014-12-09,36.9661
2014-12-10,35.8291
2014-12-11,36.2399
2014-12-12,36.0202
2014-12-15,35.7335
2014-12-16,35.7431
2014-12-17,36.7654
2014-12-18,37.0425
2014-12-19,36.8132
2014-12-22,37.2336
2014-12-23,37.3865
2014-12-24,37.5584
2014-12-26,37.9884
2014-12-29,38.1699
2014-12-30,38.103
2014-12-31,37.7782
2015-01-02,37.1667
2015-01-05,36.1062
2015-01-06,35.1794
2015-01-07,35.1889
2015-01-08,35.7622
2015-01-09,34.4055
2015-01-12,34.2048
2015-01-13,34.329
2015-01-14,34.1857
2015-01-15,33.9373
2015-01-16,34.7208
2015-01-20,34.3577
2015-01-21,34.6061
2015-01-22,36.4883
2015-01-23,36.1157
2015-01-26,36.4119
2015-01-27,35.7049
2015-01-28,34.3195
2015-01-29,35.0552
2015-01-30,34.3386
2015-02-02,35.2845
2015-02-03,36.0297
2015-02-04,35.9722
2015-02-05,37.7454
2015-02-06,37.9946
2015-02-09,37.1607
2015-02-10,37.6112
2015-02-11,37.9084
2015-02-12,38.7806
2015-02-13,38.9915
2015-02-17,39.6432
2015-02-18,38.7806
2015-02-19,38.493
2015-02-20,38.7998
2015-02-23,38.7518
2015-02-24,39.0777
2015-02-25,39.1832
2015-02-26,39.9595
2015-02-27,40.2567
2015-03-02,40.6688
2015-03-03,40.6784
2015-03-04,40.2279
2015-03-05,40.3142
2015-03-06,40.4867
2015-03-09,40.8126
2015-03-10,39.8445
2015-03-11,40.7168
2015-03-12,42.4229
2015-03-13,42.4133
2015-03-16,42.2216
2015-03-17,42.3845
2015-03-18,42.2312
2015-03-19,42.212
2015-03-20,43.3143
2015-03-23,42.7679
2015-03-24,42.8254
2015-03-25,41.7807
2015-03-26,42.2983
2015-03-27,42.1257
2015-03-30,42.6817
2015-03-31,42.6146
2015-04-01,42.4133
2015-04-02,42.9309
2015-04-06,42.6146
2015-04-07,42.7583
2015-04-08,43.7935
2015-04-09,42.998
2015-04-10,42.8159
2015-04-13,44.1194
2015-04-14,43.7072
2015-04-15,44.522
2015-04-16,44.5795
2015-04-17,43.5635
2015-04-20,44.2344
2015-04-21,45.5188
2015-04-22,45.7584
2015-04-23,45.5955
2015-04-24,45.0875
2015-04-27,44.6849
2015-04-28,45.3175
2015-04-29,46.7013
2015-04-30,45.7884
2015-05-01,46.1247
2015-05-04,46.461
2015-05-05,46.3745
2015-05-06,46.413
2015-05-07,46.0094
2015-05-08,46.0382
2015-05-11,46.7781
2015-05-12,46.8934
2015-05-13,47.3643
2015-05-14,47.7294
2015-05-15,47.1433
2015-05-18,48.1715
2015-05-19,48.5847
2015-05-20,47.9889
2015-05-21,47.6526
2015-05-22,47.297
2015-05-26,47.0088
2015-05-27,47.6814
2015-05-28,47.8928
2015-05-29,47.5757
2015-06-01,47.4027
2015-06-02,48.6231
2015-06-03,49.6705
2015-06-04,48.7673
2015-06-05,50.0933
2015-06-08,50.4681
2015-06-09,50.939
2015-06-10,51.6693
2015-06-11,51.6981
2015-06-12,51.2945
2015-06-15,51.3618
2015-06-16,51.4675
2015-06-17,50.7276
2015-06-18,51.4098
2015-06-19,51.2753
2015-06-22,52.265
2015-06-23,52.7311
2015-06-24,52.2939
2015-06-25,52.4957
2015-06-26,52.5533
2015-06-29,51.4963
2015-06-30,52.2458
2015-07-01,52.8897
2015-07-02,51.5347
2015-07-06,50.7852
2015-07-07,50.2279
2015-07-08,50.2086
2015-07-09,50.8236
2015-07-10,52.217
2015-07-13,52.6398
2015-07-14,52.9473
2015-07-15,53.0242
2015-07-16,52.8512
2015-07-17,52.044
2015-07-20,52.9281
2015-07-21,52.7647
2015-07-22,52.4861
2015-07-23,51.8615
2015-07-24,51.0254
2015-07-27,50.0453
2015-07-28,50.1702
2015-07-29,50.5546
2015-07-30,50.7948
2015-07-31,51.0158
2015-08-03,50.6122
2015-08-04,50.3144
2015-08-05,50.6129
2015-08-06,50.0351
2015-08-07,50.0254
2015-08-10,50.9789
2015-08-11,49.9195
2015-08-12,48.8985
2015-08-13,49.5631
2015-08-14,50.2662
2015-08-17,50.3144
2015-08-18,49.8906
2015-08-19,48.8504
2015-08-20,47.0012
2015-08-21,46.9915
2015-08-24,44.2177
2015-08-25,43.3701
2015-08-26,43.9191
2015-08-27,45.8936
2015-08-28,45.489
2015-08-31,45.672
2015-09-01,43.505
2015-09-02,44.3333
2015-09-03,44.4874
2015-09-04,44.4296
2015-09-08,46.6063
2015-09-09,45.7106
2015-09-10,46.0573
2015-09-11,46.693
2015-09-14,46.8085
2015-09-15,47.502
2015-09-16,47.3479
2015-09-17,46.4425
2015-09-18,45.0845
2015-09-21,46.1825
2015-09-22,45.8454
2015-09-23,45.9417
2015-09-24,46.5966
2015-09-25,47.3768
2015-09-28,46.587
2015-09-29,46.5678
2015-09-30,47.5887
2015-10-01,46.9819
2015-10-02,46.1343
2015-10-05,47.8198
2015-10-06,48.0606
2015-10-07,49.0623
2015-10-08,50.0736
2015-10-09,49.3609
2015-10-12,49.6305
2015-10-13,49.6498
2015-10-14,48.8793
2015-10-15,50.4299
2015-10-16,50.5263
2015-10-19,50.9693
2015-10-20,52.0962
2015-10-21,50.4492
2015-10-22,52.0191
2015-10-23,52.6644
2015-10-26,52.1058
2015-10-27,51.239
2015-10-28,52.7318
2015-10-29,51.9999
2015-10-30,50.6804
2015-11-02,51.5183
2015-11-03,51.6628
2015-11-04,51.8848
2015-11-05,52.686
2015-11-06,54.8289
2015-11-09,54.3752
2015-11-10,54.047
2015-11-11,53.1203
2015-11-12,52.3192
2015-11-13,51.5373
2015-11-16,52.2709
2015-11-17,52.1261
2015-11-18,52.686
2015-11-19,52.0682
2015-11-20,52.435
2015-11-23,52.5894
2015-11-24,52.6087
2015-11-25,52.7053
2015-11-27,53.0045
2015-11-30,52.4446
2015-12-01,52.5026
2015-12-02,51.6434
2015-12-03,51.6145
2015-12-04,53.0528
2015-12-07,51.9427
2015-12-08,51.1511
2015-12-09,50.3017
2015-12-10,50.1665
2015-12-11,49.0661
2015-12-14,49.2785
2015-12-15,50.2148
2015-12-16,51.2863
2015-12-17,50.4465
2015-12-18,49.2592
2015-12-21,49.7515
2015-12-22,50.1376
2015-12-23,50.3113
2015-12-24,50.9581
2015-12-28,50.3017
2015-12-29,51.0739
2015-12-30,50.4465
2015-12-31,49.5777
2016-01-04,48.4387
2016-01-05,48.4676
2016-01-06,48.2746
2016-01-07,47.0004
2016-01-08,45.6876
2016-01-11,45.9289
2016-01-12,46.1412
2016-01-13,45.2628
2016-01-14,45.8323
2016-01-15,45.2049
2016-01-19,44.8864
2016-01-20,45.369
2016-01-21,45.7841
2016-01-22,46.7301
2016-01-25,44.6161
2016-01-26,47.3382
2016-01-27,48.3518
2016-01-28,49.5391
2016-01-29,48.1201
2016-02-01,48.0622
2016-02-02,46.4405
2016-02-03,46.1307
2016-02-04,46.1016
2016-02-05,45.3175
2016-02-08,43.5458
2016-02-09,43.1392
2016-02-10,43.7588
2016-02-11,43.2941
2016-02-12,45.2207
2016-02-16,46.3727
2016-02-17,46.0339
2016-02-18,44.4946
2016-02-19,44.8625
2016-02-22,44.969
2016-02-23,43.5168
2016-02-24,44.0541
2016-02-25,44.2913
2016-02-26,45.695
2016-02-29,44.8915
2016-03-01,46.3824
2016-03-02,46.5663
2016-03-03,46.9633
2016-03-04,46.547
2016-03-07,47.6216
2016-03-08,46.0145
2016-03-09,45.637
2016-03-10,45.9952
2016-03-11,47.5538
2016-03-14,47.3505
2016-03-15,46.6535
2016-03-16,45.9855
2016-03-17,47.1278
2016-03-18,47.428
2016-03-21,47.0698
2016-03-22,46.9923
2016-03-23,46.2953
2016-03-24,46.0048
2016-03-28,45.5789
2016-03-29,46.5567
2016-03-30,47.1666
2016-03-31,47.4957
2016-04-01,47.2053
2016-04-04,47.5054
2016-04-05,46.1404
2016-04-06,47.031
2016-04-07,46.5857
2016-04-08,46.6535
2016-04-11,47.1666
2016-04-12,47.9023
2016-04-13,49.6062
2016-04-14,49.7902
2016-04-15,49.5288
2016-04-18,50.0419
2016-04-19,49.9451
2016-04-20,50.0806
2016-04-21,49.1996
2016-04-22,49.3739
2016-04-25,48.5026
2016-04-26,49.1028
2016-04-27,48.764
2016-04-28,47.7668
2016-04-29,47.6022
2016-05-02,47.9604
2016-05-03,46.2275
2016-05-04,45.7809
2016-05-05,45.6061
2016-05-06,45.8974
2016-05-09,45.9459
2016-05-10,46.4605
2016-05-11,46.0236
2016-05-12,46.0139
2016-05-13,45.1692
2016-05-16,45.6255
2016-05-17,45.1497
2016-05-18,46.7615
2016-05-19,46.6159
2016-05-20,47.5092
2016-05-23,47.3441
2016-05-24,48.451
2016-05-25,48.6743
2016-05-26,47.9267
2016-05-27,48.218
2016-05-31,47.7519
2016-06-01,48.0529
2016-06-02,48.2762
2016-06-03,47.9073
2016-06-06,48.9171
2016-06-07,48.1694
2016-06-08,48.5869
2016-06-09,48.2568
2016-06-10,48.1694
2016-06-13,47.8005
2016-06-14,47.315
2016-06-15,47.1014
2016-06-16,46.8683
2016-06-17,46.7712
2016-06-20,47.5189
2016-06-21,48.3248
2016-06-22,47.849
2016-06-23,49.4996
2016-06-24,45.3148
2016-06-27,43.8389
2016-06-28,44.7419
2016-06-29,46.2178
2016-06-30,47.4315
2016-07-01,47.082
2016-07-05,46.0624
2016-07-06,46.4702
2016-07-07,46.9946
2016-07-08,48.2762
2016-07-11,48.7811
2016-07-12,51.16
2016-07-13,51.1017
2016-07-14,52.131
2016-07-15,52.529
2016-07-18,52.1115
2016-07-19,52.1018
2016-07-20,52.0339
2016-07-21,51.2085
2016-07-22,51.9076
2016-07-25,51.8979
2016-07-26,51.9853
2016-07-27,52.2863
2016-07-28,52.0727
2016-07-29,51.5678
2016-08-01,50.8881
2016-08-02,50.1211
2016-08-03,50.7344
2016-08-04,50.676
2016-08-05,52.5551
2016-08-08,52.0391
2016-08-09,52.4285
2016-08-10,51.7957
2016-08-11,51.8735
2016-08-12,51.8735
2016-08-15,52.6232
2016-08-16,52.2727
2016-08-17,52.8374
2016-08-18,53.3924
2016-08-19,53.5384
2016-08-22,54.0252
2016-08-23,54.1518
2016-08-24,54.2004
2016-08-25,54.4341
2016-08-26,54.8722
2016-08-29,54.9696
2016-08-30,55.3104
2016-08-31,55.1935
2016-09-01,54.6678
2016-09-02,55.2227
2016-09-06,54.6873
2016-09-07,55.1643
2016-09-08,55.7485
2016-09-09,55.0183
2016-09-12,55.7095
2016-09-13,54.2004
2016-09-14,53.5676
2016-09-15,54.0739
2016-09-16,53.5384
2016-09-19,53.6455
2016-09-20,53.5287
2016-09-21,53.8402
2016-09-22,54.1907
2016-09-23,53.811
2016-09-26,52.3409
2016-09-27,52.5356
2016-09-28,53.0321
2016-09-29,51.6399
2016-09-30,52.6524
2016-10-03,52.5356
2016-10-04,52.8666
2016-10-05,53.6066
2016-10-06,53.6844
2016-10-07,53.5579
2016-10-10,54.0155
2016-10-11,53.2658
2016-10-12,53.1587
2016-10-13,52.0098
2016-10-14,52.3117
2016-10-17,51.893
2016-10-18,52.1948
2016-10-19,52.2143
2016-10-20,50.8805
2016-10-21,49.9555
2016-10-24,49.7414
2016-10-25,49.7121
2016-10-26,49.7024
2016-10-27,50.2184
2016-10-28,49.9653
2016-10-31,50.2379
2016-11-01,49.7511
2016-11-02,48.521
2016-11-03,48.8627
2016-11-04,49.302
2016-11-07,51.1081
2016-11-08,50.5712
2016-11-09,54.1834
2016-11-10,55.8919
2016-11-11,58.2838
2016-11-14,59.8946
2016-11-15,60.4316
2016-11-16,59.5529
2016-11-17,60.5292
2016-11-18,61.896
2016-11-21,62.3841
2016-11-22,64.3367
2016-11-23,63.7509
2016-11-25,63.7021
2016-11-28,62.2865
2016-11-29,62.5794
2016-11-30,62.9699
2016-12-01,64.4831
2016-12-02,64.3855
2016-12-05,65.9964
2016-12-06,67.8513
2016-12-07,67.7537
2016-12-08,69.4133
2016-12-09,69.4621
2016-12-12,66.5333
2016-12-13,66.1428
2016-12-14,65.6058
2016-12-15,66.6798
2016-12-16,66.0452
2016-12-19,66.3381
2016-12-20,68.1442
2016-12-21,68.3882
2016-12-22,68.3394
2016-12-23,68.6811
2016-12-27,68.9252
2016-12-28,68.4371
2016-12-29,68.0465
2016-12-30,67.656
2017-01-03,67.6072
2017-01-04,68.8764
2017-01-05,67.3143
2017-01-06,67.3631
2017-01-09,66.4357
2017-01-10,67.0703
2017-01-11,68.0954
2017-01-12,65.6547
2017-01-13,66.3869
2017-01-17,63.7021
2017-01-18,61.7007
2017-01-19,61.115
2017-01-20,61.7984
2017-01-23,62.7258
2017-01-24,65.7523
2017-01-25,67.4608
2017-01-26,67.1679
2017-01-27,66.3869
2017-01-30,64.9957
2017-01-31,65.2642
2017-02-01,64.5695
2017-02-02,63.5912
2017-02-03,65.4989
2017-02-06,65.1565
2017-02-07,64.9119
2017-02-08,64.3249
2017-02-09,66.3305
2017-02-10,66.3794
2017-02-13,66.9664
2017-02-14,67.8958
2017-02-15,69.1677
2017-02-16,69.5101
2017-02-17,69.0698
2017-02-21,68.972
2017-02-22,69.2655
2017-02-23,69.2655
2017-02-24,68.2382
2017-02-27,69.0209
2017-02-28,67.8958
2017-03-01,69.4612
2017-03-02,67.3578
2017-03-03,68.1404
2017-03-06,67.5045
2017-03-07,66.624
2017-03-08,66.1348
2017-03-09,66.3305
2017-03-10,66.2327
2017-03-13,66.3794
2017-03-14,65.7924
2017-03-15,65.8413
2017-03-16,66.4283
2017-03-17,67.1621
2017-03-20,65.7924
2017-03-21,61.5367
2017-03-22,61.5367
2017-03-23,62.1237
2017-03-24,62.4172
2017-03-27,61.4878
2017-03-28,63.0531
2017-03-29,62.8575
2017-03-30,65.5234
2017-03-31,65.0098
2017-04-03,63.151
2017-04-04,62.8575
2017-04-05,61.1454
2017-04-06,62.0259
2017-04-07,62.2705
2017-04-10,61.8302
2017-04-11,62.1237
2017-04-12,61.0965
2017-04-13,59.5801
2017-04-17,60.7051
2017-04-18,60.6073
2017-04-19,61.7324
2017-04-20,63.3955
2017-04-21,63.0042
2017-04-24,64.276
2017-04-25,64.3249
2017-04-26,64.8141
2017-04-27,64.0804
2017-04-28,62.6129
2017-05-01,62.9553
2017-05-02,62.3194
2017-05-03,62.7998
2017-05-04,63.4371
2017-05-05,62.7998
2017-05-08,62.7998
2017-05-09,62.1135
2017-05-10,61.6723
2017-05-11,60.9859
2017-05-12,60.2015
2017-05-15,61.133
2017-05-16,61.3781
2017-05-17,58.8289
2017-05-18,60.1035
2017-05-19,59.4172
2017-05-22,60.2506
2017-05-23,61.6723
2017-05-24,60.6428
2017-05-25,60.3976
2017-05-26,59.6623
2017-05-30,59.2701
2017-05-31,58.9759
2017-06-01,60.1035
2017-06-02,60.4957
2017-06-05,60.2996
2017-06-06,61.035
2017-06-07,61.6232
2017-06-08,64.7118
2017-06-09,67.7513
2017-06-12,65.104
2017-06-13,64.9079
2017-06-14,66.1825
2017-06-15,65.9374
2017-06-16,64.3196
2017-06-19,65.9374
2017-06-20,63.4862
2017-06-21,62.2606
2017-06-22,61.5252
2017-06-23,60.0545
2017-06-26,60.8879
2017-06-27,60.5447
2017-06-28,60.7898
2017-06-29,61.7213
2017-06-30,61.5742
2017-07-03,63.0449
2017-07-05,62.3586
2017-07-06,61.9174
2017-07-07,62.3096
2017-07-10,61.8929
2017-07-11,62.2606
2017-07-12,62.4567
2017-07-13,62.5057
2017-07-14,61.9174
2017-07-17,62.1135
2017-07-18,62.3586
2017-07-19,64.3686
2017-07-20,64.1235
2017-07-21,63.4862
2017-07-24,63.7803
2017-07-25,64.8833
2017-07-26,62.8488
2017-07-27,63.3391
2017-07-28,62.6037
2017-07-31,62.6527
2017-08-01,63.143
2017-08-02,63.1332
2017-08-03,62.5927
2017-08-04,62.8875
2017-08-07,62.8875
2017-08-08,62.1997
2017-08-09,61.8066
2017-08-10,59.9397
2017-08-11,59.2518
2017-08-14,60.824
2017-08-15,60.6275
2017-08-16,60.5784
2017-08-17,58.957
2017-08-18,58.6623
2017-08-21,58.4657
2017-08-22,59.5466
2017-08-23,59.694
2017-08-24,59.4975
2017-08-25,60.7749
2017-08-28,60.6275
2017-08-29,61.0697
2017-08-30,61.0205
2017-08-31,61.1188
2017-09-01,61.6592
2017-09-05,60.2836
2017-09-06,59.9397
2017-09-07,57.4831
2017-09-08,58.9079
2017-09-11,60.2836
2017-09-12,61.7084
2017-09-13,62.2488
2017-09-14,61.7575
2017-09-15,61.4136
2017-09-18,61.954
2017-09-19,62.3962
2017-09-20,63.1332
2017-09-21,63.1823
2017-09-22,63.1823
2017-09-25,63.5262
2017-09-26,63.2314
2017-09-27,64.2632
2017-09-28,65.2949
2017-09-29,65.7862
2017-10-02,65.8845
2017-10-03,65.9336
2017-10-04,65.1475
2017-10-05,66.0319
2017-10-06,66.081
2017-10-09,65.8354
2017-10-10,66.2284
2017-10-11,65.5897
2017-10-12,65.0984
2017-10-13,64.8527
2017-10-16,65.1475
2017-10-17,64.0175
2017-10-18,66.1302
2017-10-19,66.1793
2017-10-20,66.2775
2017-10-23,65.6388
2017-10-24,66.1793
2017-10-25,65.4423
2017-10-26,65.9828
2017-10-27,66.081
2017-10-30,64.8527
2017-10-31,65.0493
2017-11-01,64.5088
2017-11-02,64.9914
2017-11-03,65.3853
2017-11-06,65.0406
2017-11-07,63.7112
2017-11-08,63.7112
2017-11-09,63.3666
2017-11-10,62.8742
2017-11-13,63.5143
2017-11-14,63.7605
2017-11-15,63.859
2017-11-16,63.9574
2017-11-17,64.499
2017-11-20,64.5483
2017-11-21,64.499
2017-11-22,64.5483
2017-11-24,64.1051
2017-11-27,64.3513
2017-11-28,66.1238
2017-11-29,68.2409
2017-11-30,67.6009
2017-12-01,67.207
2017-12-04,67.9455
2017-12-05,66.6654
2017-12-06,66.0253
2017-12-07,65.9269
2017-12-08,65.5822
2017-12-11,64.5483
2017-12-12,64.9421
2017-12-13,64.7452
2017-12-14,63.859
2017-12-15,65.3853
2017-12-18,66.7146
2017-12-19,66.7146
2017-12-20,66.37
2017-12-21,67.2562
2017-12-22,67.5024
2017-12-26,66.0253
2017-12-27,65.5822
2017-12-28,65.9761
2017-12-29,65.2868
2018-01-02,65.6314
2018-01-03,65.533
2018-01-04,65.9761
2018-01-05,66.0253
2018-01-08,65.9269
2018-01-09,66.6162
2018-01-10,67.5024
2018-01-11,68.3887
2018-01-12,67.5024
2018-01-16,66.8131
2018-01-17,64.0559
2018-01-18,63.3174
2018-01-19,63.0219
2018-01-22,63.0219
2018-01-23,63.7112
2018-01-24,63.662
2018-01-25,63.0219
2018-01-26,62.9973
2018-01-29,63.1696
2018-01-30,62.1849
2018-01-31,62.3326
2018-02-01,63.1617
2018-02-02,63.359
2018-02-05,61.4346
2018-02-06,61.3359
2018-02-07,61.5826
2018-02-08,59.4114
2018-02-09,60.0036
2018-02-12,61.0892
2018-02-13,61.3359
2018-02-14,62.8656
2018-02-15,63.2603
2018-02-16,65.0368
2018-02-20,64.9381
2018-02-21,65.6783
2018-02-22,64.6913
2018-02-23,65.3822
2018-02-26,65.4315
2018-02-27,64.2966
2018-02-28,63.7044
2018-03-01,64.494
2018-03-02,65.6783
2018-03-05,66.1717
2018-03-06,66.7638
2018-03-07,67.0599
2018-03-08,66.5171
2018-03-09,67.6521
2018-03-12,67.5534
2018-03-13,66.8132
2018-03-14,65.6289
2018-03-15,66.073
2018-03-16,66.4678
2018-03-19,66.4678
2018-03-20,67.3066
2018-03-21,67.356
2018-03-22,62.8162
2018-03-23,61.0398
2018-03-26,63.0136
2018-03-27,61.78
2018-03-28,62.9643
2018-03-29,63.359
2018-04-02,62.6682
2018-04-03,63.5564
2018-04-04,64.1486
2018-04-05,64.494
2018-04-06,62.9643
2018-04-09,62.6189
2018-04-10,63.9018
2018-04-11,63.9512
2018-04-12,64.8394
2018-04-13,63.211
2018-04-16,63.1123
2018-04-17,61.2372
2018-04-18,60.9905
2018-04-19,62.2241
2018-04-20,62.9643
2018-04-23,63.8525
2018-04-24,64.1979
2018-04-25,64.3459
2018-04-26,64.3953
2018-04-27,64.3953
2018-04-30,63.211
2018-05-01,63.4084
2018-05-02,62.8656
2018-05-03,62.4106
2018-05-04,62.8063
2018-05-07,63.2513
2018-05-08,63.7953
2018-05-09,64.636
2018-05-10,64.7844
2018-05-11,64.7349
2018-05-14,64.5371
2018-05-15,65.1306
2018-05-16,65.5757
2018-05-17,66.1197
2018-05-18,65.8229
2018-05-21,67.1087
2018-05-22,67.3065
2018-05-23,67.2571
2018-05-24,67.0593
2018-05-25,66.5153
2018-05-29,65.5757
2018-05-30,67.356
2018-05-31,66.3175
2018-06-01,63.9931
2018-06-04,64.8833
2018-06-05,63.6964
2018-06-06,64.2899
2018-06-07,64.9822
2018-06-08,66.4164
2018-06-11,65.5262
2018-06-12,65.0811
2018-06-13,64.636
2018-06-14,64.7844
2018-06-15,63.2019
2018-06-18,63.4986
2018-06-19,64.9328
2018-06-20,65.2789
2018-06-21,64.9822
2018-06-22,64.092
2018-06-25,63.2019
2018-06-26,62.7073
2018-06-27,61.5205
2018-06-28,61.2237
2018-06-29,60.6797
2018-07-02,61.6688
2018-07-03,61.3721
2018-07-05,61.7183
2018-07-06,62.0644
2018-07-09,63.3997
2018-07-10,62.3612
2018-07-11,62.3117
2018-07-12,60.5808
2018-07-13,59.3939
2018-07-16,59.9379
2018-07-17,59.5918
2018-07-18,61.3721
2018-07-19,61.5699
2018-07-20,62.2623
2018-07-23,62.8063
2018-07-24,62.1139
2018-07-25,61.8666
2018-07-26,62.2623
2018-07-27,61.9161
2018-07-30,61.8666
2018-07-31,61.8172
2018-08-01,62.6579
2018-08-02,63.1932
2018-08-03,62.6975
2018-08-06,62.7471
2018-08-07,62.8958
2018-08-08,63.5897
2018-08-09,62.9949
2018-08-10,62.3506
2018-08-13,62.6975
2018-08-14,63.6392
2018-08-15,63.2427
2018-08-16,64.234
2018-08-17,64.5809
2018-08-20,64.9279
2018-08-21,65.6218
2018-08-22,65.1261
2018-08-23,64.2836
2018-08-24,63.8871
2018-08-27,63.7879
2018-08-28,63.6392
2018-08-29,63.6392
2018-08-30,63.8375
2018-08-31,63.9862
2018-09-04,64.8288
2018-09-05,64.5314
2018-09-06,63.9366
2018-09-07,63.9862
2018-09-10,64.0853
2018-09-11,64.1844
2018-09-12,63.2923
2018-09-13,61.9045
2018-09-14,62.6975
2018-09-17,62.2515
2018-09-18,61.9045
2018-09-19,63.0941
2018-09-20,64.0358
2018-09-21,63.4906
2018-09-24,62.6975
2018-09-25,62.9949
2018-09-26,59.8724
2018-09-27,59.922
2018-09-28,59.6246
2018-10-01,59.0596
2018-10-02,58.6829
2018-10-03,60.5068
2018-10-04,60.4672
2018-10-05,59.3471
2018-10-08,59.8427
2018-10-09,59.4759
2018-10-10,58.564
2018-10-11,56.3832
2018-10-12,55.5109
2018-10-15,55.2234
2018-10-16,54.5295
2018-10-17,56.1453
2018-10-18,54.9657
2018-10-19,53.5581
2018-10-22,51.7143
2018-10-23,52.5668
2018-10-24,49.5831
2018-10-25,50.7131
2018-10-26,50.049
2018-10-29,50.9411
2018-10-30,51.298
2018-10-31,51.8432
2018-11-01,52.3801
2018-11-02,52.9866
2018-11-05,52.927
2018-11-06,53.0861
2018-11-07,53.2054
2018-11-08,53.6429
2018-11-09,52.9469
2018-11-12,52.1812
2018-11-13,52.6386
2018-11-14,52.2906
2018-11-15,53.3247
2018-11-16,53.8815
2018-11-19,54.4085
2018-11-20,53.5932
2018-11-21,54.1102
2018-11-23,54.2792
2018-11-26,55.5917
2018-11-27,55.6017
2018-11-28,55.8403
2018-11-29,55.8005
2018-11-30,57.0235
2018-12-03,56.586
2018-12-04,53.0562
2018-12-06,52.5392
2018-12-07,51.6741
2018-12-10,50.5009
2018-12-11,49.3773
2018-12-12,50.5903
2018-12-13,48.6813
2018-12-14,47.3887
2018-12-17,47.2196
2018-12-18,46.3745
2018-12-19,45.0918
2018-12-20,45.4299
2018-12-21,45.0521
2018-12-24,43.7793
2018-12-26,45.6089
2018-12-27,45.4299
2018-12-28,45.7481
2018-12-31,45.8376
2019-01-02,46.2751
2019-01-03,46.0861
2019-01-04,47.7466
2019-01-07,48.2637
2019-01-08,50.0136
2019-01-09,50.8091
2019-01-10,51.0278
2019-01-11,51.167
2019-01-14,51.704
2019-01-15,51.9128
2019-01-16,53.7125
2019-01-17,54.2295
2019-01-18,54.5974
2019-01-22,53.9511
2019-01-23,53.6727
2019-01-24,53.2253
2019-01-25,53.8417
2019-01-28,54.7068
2019-01-29,54.2892
2019-01-30,54.2991
2019-01-31,53.621
2019-02-01,54.0398
2019-02-04,54.688
2019-02-05,54.2991
2019-02-06,54.3091
2019-02-07,55.775
2019-02-08,55.6254
2019-02-11,56.1939
2019-02-12,56.6127
2019-02-13,56.7822
2019-02-14,56.6825
2019-02-15,58.1385
2019-02-19,58.4775
2019-02-20,59.385
2019-02-21,58.5174
2019-02-22,58.9961
2019-02-25,58.8864
2019-02-26,57.9589
2019-02-27,58.7667
2019-02-28,58.5274
2019-03-01,58.7966
2019-03-04,58.5274
2019-03-05,58.647
2019-03-06,57.4005
2019-03-07,56.513
2019-03-08,56.8121
2019-03-11,57.2011
2019-03-12,57.0415
2019-03-13,57.8792
2019-03-14,58.1285
2019-03-15,57.8193
2019-03-18,58.9761
2019-03-19,57.3307
2019-03-20,55.8149
2019-03-21,54.7678
2019-03-22,51.9756
2019-03-25,52.6038
2019-03-26,54.2493
2019-03-27,54.5783
2019-03-28,55.1268
2019-03-29,54.5484
2019-04-01,56.2637
2019-04-02,56.1939
2019-04-03,56.1739
2019-04-04,56.5828
2019-04-05,56.852
2019-04-08,56.9418
2019-04-09,55.3063
2019-04-10,55.7052
2019-04-11,55.8548
2019-04-12,56.6326
2019-04-15,55.3562
2019-04-16,57.1113
2019-04-17,57.1512
2019-04-18,55.6853
2019-04-22,55.1966
2019-04-23,57.3108
2019-04-24,56.9517
2019-04-25,57.0614
2019-04-26,57.9589
2019-04-29,58.7966
2019-04-30,57.9091
2019-05-01,57.59
2019-05-02,58.26
2019-05-03,59.06
2019-05-06,59.23
2019-05-07,58.53
2019-05-08,57.84
2019-05-09,57.63
2019-05-10,57.63
2019-05-13,55.05
2019-05-14,56.05
2019-05-15,55.52
2019-05-16,56.4
2019-05-17,56.05
2019-05-20,56.11
2019-05-21,56.31
2019-05-22,55.86
2019-05-23,54.26
2019-05-24,55.06
2019-05-28,53.97
2019-05-29,54.66
2019-05-30,53.65
2019-05-31,52.95
2019-06-03,53.66
2019-06-04,55.53
2019-06-05,55.39
2019-06-06,55.38
2019-06-07,55.06
2019-06-10,55.48
2019-06-11,56.19
2019-06-12,55.91
2019-06-13,55.71
2019-06-14,56.24
2019-06-17,55.11
2019-06-18,56.63
2019-06-19,56.74
2019-06-20,56.15
2019-06-21,56.18
2019-06-24,55.45
2019-06-25,55.48
2019-06-26,56.14
2019-06-27,56.64
2019-06-28,57.64
2019-07-01,57.99
2019-07-02,57.11
2019-07-03,57.25
2019-07-04,57.25
2019-07-05,57.76
2019-07-08,56.64
2019-07-09,56.5
2019-07-10,56.04
2019-07-11,56.51
2019-07-12,57.65
2019-07-15,56.18
2019-07-16,55.99
2019-07-17,57.615
2019-07-18,59.39
2019-07-19,58.85
2019-07-22,58.5
2019-07-23,59.45
2019-07-24,60.56
2019-07-25,60.25
2019-07-26,61.14
2019-07-29,60.505
2019-07-30,61.02
2019-07-31,60.8
2019-08-01,57.48
2019-08-02,56.85
2019-08-05,54.57
2019-08-06,55.15
2019-08-07,54.26
2019-08-08,56.24
2019-08-09,55.94
2019-08-12,54.675
2019-08-13,55.275
2019-08-14,53.85
2019-08-15,52.91
2019-08-16,54
2019-08-19,54.47
2019-08-20,53.15
2019-08-21,53.65
2019-08-22,53.325
2019-08-23,51.67
2019-08-26,52.06
2019-08-27,50.85
2019-08-28,51.17
2019-08-29,51.79
2019-08-30,52.69
2019-09-02,52.67
2019-09-03,50.79
2019-09-04,51.185
2019-09-05,52.845
2019-09-06,53.015
2019-09-09,54.41
2019-09-10,55.55
2019-09-11,57.195
2019-09-12,57
2019-09-13,57.885
2019-09-16,57.01
2019-09-17,56.43
2019-09-18,56.5
2019-09-19,55.995
2019-09-20,55.82
2019-09-23,56.32
2019-09-24,55.19
2019-09-25,56.34
2019-09-26,55.69
2019-09-27,56.59
2019-09-30,56.71
2019-10-01,55.745
2019-10-02,54.91
2019-10-03,55.24
2019-10-04,55.83
2019-10-07,55.85
2019-10-08,54.57
2019-10-09,54.595
2019-10-10,55.395
2019-10-11,56.22
2019-10-14,55.93
2019-10-15,56.98
2019-10-16,57.965
2019-10-17,57.94
2019-10-18,58.07
2019-10-21,58.95
2019-10-22,59.82
2019-10-23,59.445
2019-10-24,58.785
2019-10-25,59.73
2019-10-28,60.79
2019-10-29,61.145
2019-10-30,60.685
2019-10-31,58.835
2019-11-01,59.94
2019-11-04,60.64
2019-11-05,60.6
2019-11-06,60.15
2019-11-07,60.25
2019-11-08,60.14
2019-11-11,59.81
2019-11-12,59.825
2019-11-13,59.485
2019-11-14,59.79
2019-11-15,60
2019-11-18,60.135
2019-11-19,60.79
2019-11-20,60.445
2019-11-21,60.225
2019-11-22,60.855
2019-11-25,60.93
