date,close
2014-06-13,27.1044
2014-06-16,27.0066
2014-06-17,27.8506
2014-06-18,28.3214
2014-06-19,28.3214
2014-06-20,28.5613
2014-06-23,28.1793
2014-06-24,28.0549
2014-06-25,28.1082
2014-06-26,28.2859
2014-06-27,28.5169
2014-06-30,28.7745
2014-07-01,29.2898
2014-07-02,29.0677
2014-07-03,29.2009
2014-07-07,29.0854
2014-07-08,28.9078
2014-07-09,28.7123
2014-07-10,28.4991
2014-07-11,28.4547
2014-07-14,28.5347
2014-07-15,28.4636
2014-07-16,28.2948
2014-07-17,27.9217
2014-07-18,28.428
2014-07-21,28.4369
2014-07-22,28.8012
2014-07-23,28.8189
2014-07-24,28.8456
2014-07-25,28.2415
2014-07-28,28.1615
2014-07-29,28.4458
2014-07-30,28.8989
2014-07-31,28.2859
2014-08-01,28.2593
2014-08-04,28.6235
2014-08-05,28.3037
2014-08-06,28.6413
2014-08-07,28.7216
2014-08-08,29.1322
2014-08-11,29.1411
2014-08-12,29.0429
2014-08-13,29.15
2014-08-14,29.1054
2014-08-15,29.0161
2014-08-18,29.4356
2014-08-19,29.7703
2014-08-20,29.6945
2014-08-21,29.7302
2014-08-22,29.6677
2014-08-25,29.4713
2014-08-26,29.6766
2014-08-27,29.5427
2014-08-28,29.3107
2014-08-29,29.5874
2014-09-02,29.6231
2014-09-03,29.4356
2014-09-04,29.1768
2014-09-05,29.2571
2014-09-08,29.3731
2014-09-09,29.1054
2014-09-10,29.3731
2014-09-11,29.3821
2014-09-12,29.266
2014-09-15,28.7662
2014-09-16,28.918
2014-09-17,28.7484
2014-09-18,28.735
2014-09-19,28.32
2014-09-22,28.195
2014-09-23,27.8469
2014-09-24,28.2575
2014-09-25,27.7577
2014-09-26,27.838
2014-09-29,27.8112
2014-09-30,27.6059
2014-10-01,27.0704
2014-10-02,27.0704
2014-10-03,27.1507
2014-10-06,27.1061
2014-10-07,26.4546
2014-10-08,26.8562
2014-10-09,26.1779
2014-10-10,24.732
2014-10-13,24.2054
2014-10-14,24.2589
2014-10-15,24.1518
2014-10-16,24.5713
2014-10-17,25.4549
2014-10-20,25.5799
2014-10-21,26.4903
2014-10-22,26.0172
2014-10-23,26.9544
2014-10-24,27.0704
2014-10-27,26.9276
2014-10-28,27.5702
2014-10-29,27.4899
2014-10-30,27.4899
2014-10-31,28.2753
2014-11-03,28.8376
2014-11-04,28.668
2014-11-05,28.8287
2014-11-06,29.0251
2014-11-07,29.0786
2014-11-10,29.4356
2014-11-11,29.6141
2014-11-12,29.6677
2014-11-13,29.2642
2014-11-14,28.7173
2014-11-17,28.6366
2014-11-18,28.529
2014-11-19,28.0001
2014-11-20,28.3049
2014-11-21,28.9415
2014-11-24,29.1118
2014-11-25,28.6904
2014-11-26,28.9953
2014-11-28,28.8608
2014-12-01,28.8249
2014-12-02,28.9684
2014-12-03,29.1566
2014-12-04,29.0401
2014-12-05,28.9863
2014-12-08,28.2152
2014-12-09,28.8159
2014-12-10,27.9911
2014-12-11,28.2421
2014-12-12,27.8566
2014-12-15,27.3814
2014-12-16,27.2738
2014-12-17,27.6863
2014-12-18,28.3766
2014-12-19,27.9732
2014-12-22,28.2421
2014-12-23,28.3766
2014-12-24,28.547
2014-12-26,28.4125
2014-12-29,28.4483
2014-12-30,28.287
2014-12-31,27.8745
2015-01-02,27.9373
2015-01-05,27.3814
2015-01-06,26.969
2015-01-07,27.1573
2015-01-08,27.3366
2015-01-09,27.1573
2015-01-12,26.9152
2015-01-13,26.9242
2015-01-14,26.7269
2015-01-15,26.2786
2015-01-16,26.5924
2015-01-20,26.709
2015-01-21,26.7359
2015-01-22,27.5069
2015-01-23,27.3993
2015-01-26,27.5338
2015-01-27,27.2111
2015-01-28,26.7986
2015-01-29,27.0318
2015-01-30,26.969
2015-02-02,27.238
2015-02-03,27.749
2015-02-04,27.6863
2015-02-05,28.0001
2015-02-06,27.8387
2015-02-09,27.7221
2015-02-10,27.6145
2015-02-11,27.7042
2015-02-12,27.8666
2015-02-13,28.1462
2015-02-17,28.0109
2015-02-18,28.1643
2015-02-19,27.9658
2015-02-20,28.2364
2015-02-23,28.2004
2015-02-24,28.1011
2015-02-25,28.2545
2015-02-26,28.1282
2015-02-27,28.0921
2015-03-02,28.462
2015-03-03,28.0831
2015-03-04,28.1282
2015-03-05,28.3086
2015-03-06,28.047
2015-03-09,28.1282
2015-03-10,27.605
2015-03-11,28.2094
2015-03-12,28.2725
2015-03-13,28.3086
2015-03-16,28.9311
2015-03-17,29.2649
2015-03-18,29.6347
2015-03-19,29.6347
2015-03-20,29.6167
2015-03-23,29.4092
2015-03-24,29.5896
2015-03-25,28.8499
2015-03-26,28.6334
2015-03-27,28.7326
2015-03-30,29.0393
2015-03-31,28.904
2015-04-01,29.1476
2015-04-02,29.2378
2015-04-06,29.2198
2015-04-07,29.2739
2015-04-08,29.5896
2015-04-09,29.4543
2015-04-10,29.6618
2015-04-13,29.6979
2015-04-14,29.4724
2015-04-15,29.5896
2015-04-16,29.3912
2015-04-17,29.0754
2015-04-20,29.1566
2015-04-21,29.0484
2015-04-22,29.0664
2015-04-23,29.0213
2015-04-24,28.8589
2015-04-27,28.6424
2015-04-28,28.6604
2015-04-29,26.333
2015-04-30,25.8007
2015-05-01,25.5842
2015-05-04,25.7376
2015-05-05,25.918
2015-05-06,25.6293
2015-05-07,25.7837
2015-05-08,26.1288
2015-05-11,25.811
2015-05-12,26.0834
2015-05-13,26.3105
2015-05-14,26.9553
2015-05-15,26.9644
2015-05-18,27.1278
2015-05-19,27.2732
2015-05-20,27.2368
2015-05-21,27.2459
2015-05-22,27.3004
2015-05-26,27.3276
2015-05-27,27.364
2015-05-28,27.4911
2015-05-29,27.1642
2015-06-01,27.1097
2015-06-02,27.3186
2015-06-03,28.0179
2015-06-04,27.7545
2015-06-05,28.0996
2015-06-08,28.0451
2015-06-09,28.0088
2015-06-10,28.2268
2015-06-11,28.3812
2015-06-12,28.2268
2015-06-15,28.1178
2015-06-16,28.2358
2015-06-17,28.2449
2015-06-18,28.5446
2015-06-19,28.2722
2015-06-22,28.3902
2015-06-23,28.4992
2015-06-24,28.2358
2015-06-25,27.9815
2015-06-26,27.5456
2015-06-29,26.9099
2015-06-30,26.7555
2015-07-01,26.8554
2015-07-02,26.9553
2015-07-06,26.7555
2015-07-07,26.4739
2015-07-08,25.9018
2015-07-09,25.7383
2015-07-10,25.8291
2015-07-13,25.9835
2015-07-14,25.9563
2015-07-15,25.5839
2015-07-16,25.7655
2015-07-17,25.3569
2015-07-20,25.2479
2015-07-21,25.0117
2015-07-22,24.8755
2015-07-23,24.8664
2015-07-24,24.8029
2015-07-27,24.8029
2015-07-28,24.93
2015-07-29,24.8937
2015-07-30,25.2115
2015-07-31,26.3014
2015-08-03,26.0652
2015-08-04,26.1561
2015-08-05,26.0652
2015-08-06,26.4309
2015-08-07,26.8332
2015-08-10,27.1898
2015-08-11,26.8606
2015-08-12,26.8241
2015-08-13,26.9521
2015-08-14,26.8881
2015-08-17,27.2446
2015-08-18,27.0801
2015-08-19,26.5498
2015-08-20,26.2938
2015-08-21,26.2938
2015-08-24,25.4801
2015-08-25,25.2698
2015-08-26,26.0012
2015-08-27,26.3212
2015-08-28,26.7509
2015-08-31,26.7052
2015-09-01,25.8001
2015-09-02,25.9647
2015-09-03,26.2755
2015-09-04,25.8824
2015-09-08,26.3761
2015-09-09,26.0744
2015-09-10,25.8367
2015-09-11,25.7818
2015-09-14,25.5624
2015-09-15,25.8915
2015-09-16,26.3761
2015-09-17,26.3304
2015-09-18,25.7453
2015-09-21,25.6675
2015-09-22,25.279
2015-09-23,24.9224
2015-09-24,24.9773
2015-09-25,24.8127
2015-09-28,24.7762
2015-09-29,24.8402
2015-09-30,25.407
2015-10-01,25.1876
2015-10-02,25.6538
2015-10-05,26.5315
2015-10-06,26.5041
2015-10-07,26.6229
2015-10-08,26.6047
2015-10-09,26.4035
2015-10-12,26.4127
2015-10-13,26.1475
2015-10-14,25.9372
2015-10-15,26.0378
2015-10-16,25.8367
2015-10-19,25.8915
2015-10-20,25.8733
2015-10-21,25.6264
2015-10-22,26.111
2015-10-23,26.5864
2015-10-26,26.4127
2015-10-27,25.983
2015-10-28,27.9577
2015-10-29,28.232
2015-10-30,27.8572
2015-11-02,28.0857
2015-11-03,27.9395
2015-11-04,27.9029
2015-11-05,27.9581
2015-11-06,27.8109
2015-11-09,27.5993
2015-11-10,27.5625
2015-11-11,27.2865
2015-11-12,26.8173
2015-11-13,26.7161
2015-11-16,27.2497
2015-11-17,27.5441
2015-11-18,28.2065
2015-11-19,28.0133
2015-11-20,27.9213
2015-11-23,28.0317
2015-11-24,28.1237
2015-11-25,28.3997
2015-11-27,28.6757
2015-11-30,28.8872
2015-12-01,28.6757
2015-12-02,29.0114
2015-12-03,28.3169
2015-12-04,28.1881
2015-12-07,28.1237
2015-12-08,27.8293
2015-12-09,27.3233
2015-12-10,27.1945
2015-12-11,26.8725
2015-12-14,26.8173
2015-12-15,27.0565
2015-12-16,27.2589
2015-12-17,27.1393
2015-12-18,26.5965
2015-12-21,26.3297
2015-12-22,26.5965
2015-12-23,27.0565
2015-12-24,27.1669
2015-12-28,27.1117
2015-12-29,27.0381
2015-12-30,26.7989
2015-12-31,26.3941
2016-01-04,26.0445
2016-01-05,25.9341
2016-01-06,25.7225
2016-01-07,25.1521
2016-01-08,25.1429
2016-01-11,25.6397
2016-01-12,25.6029
2016-01-13,25.6121
2016-01-14,25.7777
2016-01-15,25.5753
2016-01-19,25.8329
2016-01-20,25.8697
2016-01-21,25.4557
2016-01-22,26.6057
2016-01-25,26.0445
2016-01-26,26.2561
2016-01-27,25.9341
2016-01-28,26.0721
2016-01-29,26.2193
2016-02-01,25.8421
2016-02-02,25.1337
2016-02-03,25.4281
2016-02-04,25.5569
2016-02-05,24.8302
2016-02-08,25.3545
2016-02-09,24.7382
2016-02-10,24.867
2016-02-11,24.9874
2016-02-12,25.3582
2016-02-16,25.9606
2016-02-17,26.4426
2016-02-18,26.7762
2016-02-19,26.9616
2016-02-22,26.9801
2016-02-23,26.4796
2016-02-24,26.6928
2016-02-25,26.6743
2016-02-26,26.6835
2016-02-29,26.7391
2016-03-01,27.1377
2016-03-02,27.3416
2016-03-03,27.527
2016-03-04,27.7123
2016-03-07,27.805
2016-03-08,27.5826
2016-03-09,27.5548
2016-03-10,27.4435
2016-03-11,27.9811
2016-03-14,27.907
2016-03-15,27.4621
2016-03-16,27.6196
2016-03-17,27.6289
2016-03-18,27.8143
2016-03-21,27.9811
2016-03-22,27.9811
2016-03-23,27.4899
2016-03-24,27.3972
2016-03-28,27.2396
2016-03-29,28.046
2016-03-30,27.6845
2016-03-31,27.907
2016-04-01,27.9255
2016-04-04,27.8235
2016-04-05,26.1182
2016-04-06,26.1367
2016-04-07,25.6733
2016-04-08,26.2665
2016-04-11,25.9235
2016-04-12,25.7938
2016-04-13,26.0811
2016-04-14,26.0255
2016-04-15,26.007
2016-04-18,25.9421
2016-04-19,25.803
2016-04-20,25.7011
2016-04-21,25.7382
2016-04-22,25.9513
2016-04-25,25.9421
2016-04-26,26.0533
2016-04-27,25.9699
2016-04-28,25.7196
2016-04-29,25.5528
2016-05-02,25.8772
2016-05-03,25.6548
2016-05-04,25.6177
2016-05-05,25.6177
2016-05-06,25.6733
2016-05-09,25.2748
2016-05-10,25.1821
2016-05-11,25.2099
2016-05-12,25.1072
2016-05-13,24.9765
2016-05-16,25.1819
2016-05-17,24.687
2016-05-18,24.9484
2016-05-19,25.0978
2016-05-20,25.5553
2016-05-23,25.6861
2016-05-24,26.1342
2016-05-25,26.1156
2016-05-26,26.5357
2016-05-27,26.6478
2016-05-31,26.6758
2016-06-01,26.7972
2016-06-02,26.9559
2016-06-03,26.8625
2016-06-06,26.9372
2016-06-07,26.8812
2016-06-08,26.8719
2016-06-09,26.7785
2016-06-10,26.5918
2016-06-13,25.9195
2016-06-14,25.8915
2016-06-15,25.9195
2016-06-16,26.0502
2016-06-17,25.8635
2016-06-20,26.1903
2016-06-21,26.1156
2016-06-22,25.9568
2016-06-23,26.3957
2016-06-24,25.4993
2016-06-27,24.2202
2016-06-28,24.659
2016-06-29,24.9484
2016-06-30,25.5834
2016-07-01,25.63
2016-07-05,25.3966
2016-07-06,25.574
2016-07-07,25.63
2016-07-08,26.0035
2016-07-11,26.1623
2016-07-12,26.5077
2016-07-13,26.9185
2016-07-14,26.7505
2016-07-15,26.7598
2016-07-18,26.7598
2016-07-19,26.7692
2016-07-20,26.8999
2016-07-21,26.7225
2016-07-22,26.9652
2016-07-25,26.6198
2016-07-26,26.3397
2016-07-27,27.5068
2016-07-28,26.6571
2016-07-29,26.7785
2016-08-01,26.6945
2016-08-02,26.5077
2016-08-03,26.2369
2016-08-04,25.9942
2016-08-05,26.1062
2016-08-08,25.9662
2016-08-09,25.9755
2016-08-10,25.9662
2016-08-11,26.0978
2016-08-12,26.2107
2016-08-15,26.38
2016-08-16,26.3518
2016-08-17,26.2577
2016-08-18,26.3142
2016-08-19,26.5117
2016-08-22,26.6245
2016-08-23,26.6809
2016-08-24,26.5022
2016-08-25,26.6903
2016-08-26,26.427
2016-08-29,26.5587
2016-08-30,26.3894
2016-08-31,26.2765
2016-09-01,26.1825
2016-09-02,26.3612
2016-09-06,26.3706
2016-09-07,26.3894
2016-09-08,26.1261
2016-09-09,25.3361
2016-09-12,25.6652
2016-09-13,25.5524
2016-09-14,25.3173
2016-09-15,25.7593
2016-09-16,25.5242
2016-09-19,25.7781
2016-09-20,25.7687
2016-09-21,26.1449
2016-09-22,26.7091
2016-09-23,26.8314
2016-09-26,26.6621
2016-09-27,26.7091
2016-09-28,26.7938
2016-09-29,26.5211
2016-09-30,26.7091
2016-10-03,26.6151
2016-10-04,26.7468
2016-10-05,26.916
2016-10-06,26.5493
2016-10-07,26.2953
2016-10-10,26.3894
2016-10-11,26.2013
2016-10-12,26.1167
2016-10-13,25.9568
2016-10-14,25.9756
2016-10-17,26.0226
2016-10-18,26.1167
2016-10-19,26.0508
2016-10-20,26.0696
2016-10-21,25.6934
2016-10-24,25.9662
2016-10-25,25.8533
2016-10-26,26.1167
2016-10-27,25.985
2016-10-28,26.0038
2016-10-31,26.4176
2016-11-01,26.2013
2016-11-02,25.684
2016-11-03,25.6276
2016-11-04,25.5806
2016-11-07,26.7844
2016-11-08,26.8032
2016-11-09,27.1252
2016-11-10,27.0116
2016-11-11,27.7503
2016-11-14,28.0439
2016-11-15,28.3565
2016-11-16,28.3659
2016-11-17,28.4228
2016-11-18,28.3849
2016-11-21,28.4322
2016-11-22,28.6122
2016-11-23,28.9058
2016-11-25,28.759
2016-11-28,28.5554
2016-11-29,28.4133
2016-11-30,27.9113
2016-12-01,28.1765
2016-12-02,28.0913
2016-12-05,28.2523
2016-12-06,28.4512
2016-12-07,28.5838
2016-12-08,28.8679
2016-12-09,28.7258
2016-12-12,28.4606
2016-12-13,28.8395
2016-12-14,28.4417
2016-12-15,28.6217
2016-12-16,28.5459
2016-12-19,28.6311
2016-12-20,28.6027
2016-12-21,28.4701
2016-12-22,28.9342
2016-12-23,29.2278
2016-12-27,29.4362
2016-12-28,28.991
2016-12-29,29.332
2016-12-30,29.1899
2017-01-03,29.2657
2017-01-04,29.7392
2017-01-05,29.6067
2017-01-06,29.5119
2017-01-09,29.5214
2017-01-10,29.6256
2017-01-11,29.7298
2017-01-12,29.2941
2017-01-13,29.4835
2017-01-17,28.7637
2017-01-18,29.0857
2017-01-19,28.9531
2017-01-20,29.2752
2017-01-23,29.3793
2017-01-24,29.9666
2017-01-25,30.2791
2017-01-26,30.0518
2017-01-27,29.4646
2017-01-30,29.6067
2017-01-31,29.7582
2017-02-01,29.9571
2017-02-02,29.9571
2017-02-03,30.1939
2017-02-06,29.9003
2017-02-07,29.7677
2017-02-08,29.6824
2017-02-09,30.1687
2017-02-10,30.2831
2017-02-13,30.3976
2017-02-14,30.2259
2017-02-15,30.3785
2017-02-16,30.4357
2017-02-17,30.5787
2017-02-21,30.8648
2017-02-22,30.8743
2017-02-23,30.9029
2017-02-24,30.9506
2017-02-27,30.9887
2017-02-28,30.7408
2017-03-01,31.2843
2017-03-02,30.6645
2017-03-03,30.7885
2017-03-06,30.7313
2017-03-07,30.6645
2017-03-08,30.655
2017-03-09,30.655
2017-03-10,30.798
2017-03-13,30.8076
2017-03-14,30.7313
2017-03-15,31.0936
2017-03-16,30.9887
2017-03-17,30.9887
2017-03-20,31.0173
2017-03-21,30.3689
2017-03-22,30.2164
2017-03-23,30.655
2017-03-24,30.5406
2017-03-27,30.531
2017-03-28,30.8648
2017-03-29,31.1127
2017-03-30,31.2652
2017-03-31,31.0459
2017-04-03,30.7027
2017-04-04,30.7599
2017-04-05,30.4834
2017-04-06,30.7313
2017-04-07,30.6741
2017-04-10,30.6359
2017-04-11,30.8457
2017-04-12,30.4262
2017-04-13,30.3117
2017-04-17,30.8076
2017-04-18,31.1699
2017-04-19,31.5799
2017-04-20,31.8945
2017-04-21,31.8945
2017-04-24,32.6383
2017-04-25,32.9911
2017-04-26,32.9434
2017-04-27,33.177
2017-04-28,33.2867
2017-05-01,32.8576
2017-05-02,32.6097
2017-05-03,32.5668
2017-05-04,32.848
2017-05-05,33.3534
2017-05-08,33.3486
2017-05-09,33.3057
2017-05-10,33.6681
2017-05-11,34.5697
2017-05-12,34.6752
2017-05-15,35.3083
2017-05-16,35.0973
2017-05-17,34.7615
2017-05-18,34.963
2017-05-19,35.596
2017-05-22,36.2483
2017-05-23,36.2387
2017-05-24,35.7016
2017-05-25,36.5936
2017-05-26,36.7375
2017-05-30,36.7759
2017-05-31,36.5936
2017-06-01,36.9293
2017-06-02,37.2651
2017-06-05,37.1308
2017-06-06,37.3802
2017-06-07,37.8118
2017-06-08,38.1955
2017-06-09,38.0804
2017-06-12,37.0924
2017-06-13,37.4089
2017-06-14,37.4377
2017-06-15,37.3034
2017-06-16,37.5336
2017-06-19,38.1667
2017-06-20,37.5912
2017-06-21,37.7255
2017-06-22,37.7543
2017-06-23,38.1763
2017-06-26,38.2434
2017-06-27,38.2051
2017-06-28,38.7039
2017-06-29,38.253
2017-06-30,38.5792
2017-07-03,38.5408
2017-07-05,38.4928
2017-07-06,38.1379
2017-07-07,38.5888
2017-07-10,38.3585
2017-07-11,38.7998
2017-07-12,39.4808
2017-07-13,39.6055
2017-07-14,40.229
2017-07-17,40.3825
2017-07-18,40.2482
2017-07-19,40.8908
2017-07-20,40.7853
2017-07-21,40.9388
2017-07-24,41.2937
2017-07-25,41.7254
2017-07-26,41.2362
2017-07-27,41.0539
2017-07-28,39.6918
2017-07-31,39.4616
2017-08-01,40.0467
2017-08-02,39.0971
2017-08-03,39.1355
2017-08-04,38.9485
2017-08-07,38.9533
2017-08-08,38.9533
2017-08-09,38.5984
2017-08-10,38.1645
2017-08-11,38.1645
2017-08-14,38.6755
2017-08-15,38.3187
2017-08-16,38.6562
2017-08-17,37.8077
2017-08-18,37.5666
2017-08-21,37.4798
2017-08-22,38.5598
2017-08-23,38.1259
2017-08-24,38.0198
2017-08-25,37.962
2017-08-28,38.338
2017-08-29,38.1162
2017-08-30,38.5598
2017-08-31,38.9455
2017-09-01,38.8491
2017-09-05,38.2127
2017-09-06,37.8945
2017-09-07,38.2512
2017-09-08,38.2127
2017-09-11,38.9166
2017-09-12,39.1287
2017-09-13,39.0226
2017-09-14,39.0323
2017-09-15,39.2348
2017-09-18,39.524
2017-09-19,39.5047
2017-09-20,39.4855
2017-09-21,39.3794
2017-09-22,39.6108
2017-09-25,39.6494
2017-09-26,39.5626
2017-09-27,40.2279
2017-09-28,40.5365
2017-09-29,40.6618
2017-10-02,41.0282
2017-10-03,41.3754
2017-10-04,41.6743
2017-10-05,41.655
2017-10-06,41.79
2017-10-09,42.1467
2017-10-10,42.6578
2017-10-11,43.1688
2017-10-12,43.2653
2017-10-13,43.0531
2017-10-16,42.8506
2017-10-17,42.6289
2017-10-18,42.5614
2017-10-19,42.0985
2017-10-20,42.5421
2017-10-23,42.33
2017-10-24,42.4264
2017-10-25,42.6674
2017-10-26,42.7639
2017-10-27,44.2391
2017-10-30,43.4388
2017-10-31,43.3906
2017-11-01,43.381
2017-11-02,43.1881
2017-11-03,43.1013
2017-11-06,44.0559
2017-11-07,43.6027
2017-11-08,43.487
2017-11-09,43.2749
2017-11-10,43.5074
2017-11-13,43.2555
2017-11-14,42.994
2017-11-15,42.9552
2017-11-16,43.2458
2017-11-17,43.0424
2017-11-20,43.0908
2017-11-21,43.304
2017-11-22,43.0036
2017-11-24,42.994
2017-11-27,42.8583
2017-11-28,42.9455
2017-11-29,41.7346
2017-11-30,42.5774
2017-12-01,42.3739
2017-12-04,41.1436
2017-12-05,41.1533
2017-12-06,41.2114
2017-12-07,41.5602
2017-12-08,41.6183
2017-12-11,41.2502
2017-12-12,40.727
2017-12-13,40.6399
2017-12-14,40.233
2017-12-15,40.6592
2017-12-18,40.6302
2017-12-19,40.727
2017-12-20,40.6883
2017-12-21,40.9111
2017-12-22,40.9402
2017-12-26,40.4655
2017-12-27,40.6205
2017-12-28,40.8239
2017-12-29,40.3298
2018-01-02,40.9789
2018-01-03,41.9089
2018-01-04,42.3061
2018-01-05,42.0736
2018-01-08,42.5677
2018-01-09,42.4224
2018-01-10,42.1705
2018-01-11,42.6064
2018-01-12,42.9261
2018-01-16,43.2943
2018-01-17,44.6312
2018-01-18,44.6796
2018-01-19,45.1156
2018-01-22,44.8637
2018-01-23,45.009
2018-01-24,44.5052
2018-01-25,44.6312
2018-01-26,45.4643
2018-01-29,45.9971
2018-01-30,45.0574
2018-01-31,48.3803
2018-02-01,48.6613
2018-02-02,48.5547
2018-02-05,46.995
2018-02-06,46.6075
2018-02-07,46.2006
2018-02-08,44.9024
2018-02-09,44.9024
2018-02-12,45.5937
2018-02-13,46.2363
2018-02-14,47.5214
2018-02-15,48.2321
2018-02-16,48.1835
2018-02-20,48.0861
2018-02-21,48.8844
2018-02-22,48.9818
2018-02-23,49.1863
2018-02-26,49.566
2018-02-27,49.05
2018-02-28,49.2252
2018-03-01,49.0792
2018-03-02,50.0625
2018-03-05,50.7245
2018-03-06,51.5716
2018-03-07,51.9123
2018-03-08,50.929
2018-03-09,51.4158
2018-03-12,51.6787
2018-03-13,50.9972
2018-03-14,50.5785
2018-03-15,50.9193
2018-03-16,51.26
2018-03-19,50.6467
2018-03-20,51.1432
2018-03-21,51.2406
2018-03-22,49.9165
2018-03-23,48.8747
2018-03-26,49.9359
2018-03-27,48.4074
2018-03-28,47.9498
2018-03-29,49.2349
2018-04-02,46.8107
2018-04-03,47.1612
2018-04-04,47.5701
2018-04-05,47.7259
2018-04-06,46.6744
2018-04-09,47.0346
2018-04-10,48.4463
2018-04-11,48.641
2018-04-12,48.9915
2018-04-13,49.2057
2018-04-16,49.1668
2018-04-17,49.7704
2018-04-18,50.0625
2018-04-19,49.2252
2018-04-20,48.9818
2018-04-23,48.6118
2018-04-24,47.8816
2018-04-25,47.424
2018-04-26,48.0764
2018-04-27,38.4085
2018-04-30,39.8105
2018-05-01,39.6839
2018-05-02,39.3724
2018-05-03,39.6547
2018-05-04,40.0831
2018-05-07,40.1415
2018-05-08,40.4433
2018-05-09,40.6673
2018-05-10,41.1833
2018-05-11,41.3595
2018-05-14,40.8113
2018-05-15,40.312
2018-05-16,40.4197
2018-05-17,40.5078
2018-05-18,40.4197
2018-05-21,40.5372
2018-05-22,40.8504
2018-05-23,40.7819
2018-05-24,40.6644
2018-05-25,40.4686
2018-05-29,40.4882
2018-05-30,40.733
2018-05-31,40.7427
2018-06-01,41.7902
2018-06-04,42.2503
2018-06-05,42.0643
2018-06-06,42.6321
2018-06-07,42.1132
2018-06-08,42.2894
2018-06-11,42.6125
2018-06-12,42.5146
2018-06-13,42.3775
2018-06-14,42.7397
2018-06-15,43.3173
2018-06-18,43.2684
2018-06-19,42.7397
2018-06-20,42.7593
2018-06-21,42.4167
2018-06-22,42.0447
2018-06-25,40.8994
2018-06-26,41.0756
2018-06-27,40.5176
2018-06-28,40.9777
2018-06-29,41.0952
2018-07-02,41.8391
2018-07-03,41.9174
2018-07-05,42.309
2018-07-06,42.6125
2018-07-09,43.0824
2018-07-10,42.867
2018-07-11,42.5342
2018-07-12,43.2096
2018-07-13,43.2096
2018-07-16,42.6223
2018-07-17,41.9077
2018-07-18,42.544
2018-07-19,42.6223
2018-07-20,42.0937
2018-07-23,41.5259
2018-07-24,41.0266
2018-07-25,41.0168
2018-07-26,41.2714
2018-07-27,43.0726
2018-07-30,42.9747
2018-07-31,42.8866
2018-08-01,43.4446
2018-08-02,43.5327
2018-08-03,43.4739
2018-08-06,44.1102
2018-08-07,43.9242
2018-08-08,43.6403
2018-08-09,43.6306
2018-08-10,43.6699
2018-08-13,44.1717
2018-08-14,44.1127
2018-08-15,43.8765
2018-08-16,43.8569
2018-08-17,44.1422
2018-08-20,44.2603
2018-08-21,44.2997
2018-08-22,44.585
2018-08-23,44.339
2018-08-24,44.5949
2018-08-27,46.2972
2018-08-28,46.3464
2018-08-29,46.74
2018-08-30,46.7498
2018-08-31,46.986
2018-09-04,47.3304
2018-09-05,47.1828
2018-09-06,47.3894
2018-09-07,47.4189
2018-09-10,47.6846
2018-09-11,47.5764
2018-09-12,47.8125
2018-09-13,47.9405
2018-09-14,48.1766
2018-09-17,47.3107
2018-09-18,47.4386
2018-09-19,47.5961
2018-09-20,47.8913
2018-09-21,47.9011
2018-09-24,47.7732
2018-09-25,48.4226
2018-09-26,47.8617
2018-09-27,47.3107
2018-09-28,47.5567
2018-10-01,47.1828
2018-10-02,46.5825
2018-10-03,46.2578
2018-10-04,45.8642
2018-10-05,45.2246
2018-10-08,44.8507
2018-10-09,45.0967
2018-10-10,43.6601
2018-10-11,42.3907
2018-10-12,43.0205
2018-10-15,42.312
2018-10-16,44.1521
2018-10-17,43.7781
2018-10-18,43.0992
2018-10-19,42.9122
2018-10-22,42.804
2018-10-23,42.7548
2018-10-24,41.82
2018-10-25,42.2037
2018-10-26,49.3082
2018-10-29,46.7892
2018-10-30,48.4817
2018-10-31,48.1865
2018-11-01,48.4915
2018-11-02,48.8753
2018-11-05,48.4521
2018-11-06,48.767
2018-11-07,49.6034
2018-11-08,49.465
2018-11-09,49.2673
2018-11-12,48.694
2018-11-13,47.8142
2018-11-14,47.6067
2018-11-15,49.0696
2018-11-16,49.3761
2018-11-19,47.4584
2018-11-20,46.4402
2018-11-21,46.4204
2018-11-23,46.0942
2018-11-26,46.7071
2018-11-27,46.628
2018-11-28,47.923
2018-11-29,48.2591
2018-11-30,48.3975
2018-12-03,49.0993
2018-12-04,48.3579
2018-12-06,47.7549
2018-12-07,46.46
2018-12-10,46.8356
2018-12-11,46.806
2018-12-12,46.4501
2018-12-13,46.3809
2018-12-14,45.5901
2018-12-17,44.562
2018-12-18,45.2342
2018-12-19,44.8289
2018-12-20,43.8305
2018-12-21,42.7728
2018-12-24,41.5669
2018-12-26,43.534
2018-12-27,43.7416
2018-12-28,43.8404
2018-12-31,44.8586
2019-01-02,44.8388
2019-01-03,42.2193
2019-01-04,44.0678
2019-01-07,44.8882
2019-01-08,46.3908
2019-01-09,46.2326
2019-01-10,46.7466
2019-01-11,46.5094
2019-01-14,46.7071
2019-01-15,46.5094
2019-01-16,45.9657
2019-01-17,45.6494
2019-01-18,45.343
2019-01-22,43.702
2019-01-23,43.2967
2019-01-24,44.4236
2019-01-25,44.6708
2019-01-28,44.1666
2019-01-29,44.3643
2019-01-30,42.6839
2019-01-31,43.7119
2019-02-01,44.0876
2019-02-04,44.0974
2019-02-05,44.2457
2019-02-06,44.4533
2019-02-07,43.9986
2019-02-08,44.3465
2019-02-11,44.7541
2019-02-12,44.7342
2019-02-13,45.1816
2019-02-14,45.0722
2019-02-15,45.5494
2019-02-19,45.1517
2019-02-20,45.4699
2019-02-21,45.7681
2019-02-22,46.285
2019-02-25,46.5335
2019-02-26,46.3844
2019-02-27,46.2055
2019-02-28,46.464
2019-03-01,46.3546
2019-03-04,46.3148
2019-03-05,46.1558
2019-03-06,45.5096
2019-03-07,44.7641
2019-03-08,44.3267
2019-03-11,45.0921
2019-03-12,45.0722
2019-03-13,44.9728
2019-03-14,44.8038
2019-03-15,44.8933
2019-03-18,44.6547
2019-03-19,44.8535
2019-03-20,44.2968
2019-03-21,45.1617
2019-03-22,43.8495
2019-03-25,44.1378
2019-03-26,43.9091
2019-03-27,43.7302
2019-03-28,44.1378
2019-03-29,44.098
2019-04-01,45.1517
2019-04-02,44.6646
2019-04-03,45.3506
2019-04-04,45.5494
2019-04-05,45.9172
2019-04-08,46.2453
2019-04-09,45.8178
2019-04-10,46.0365
2019-04-11,46.0464
2019-04-12,46.9312
2019-04-15,46.6031
2019-04-16,46.9212
2019-04-17,46.2751
2019-04-18,46.6628
2019-04-22,46.454
2019-04-23,47.0405
2019-04-24,47.3885
2019-04-25,46.9809
2019-04-26,47.4282
2019-04-29,46.8616
2019-04-30,46.8218
2019-05-01,43.4817
2019-05-02,43.5115
2019-05-03,44.0682
2019-05-06,43.2729
2019-05-07,42.4478
2019-05-08,42.3086
2019-05-09,42.08
2019-05-10,42.34
2019-05-13,40.63
2019-05-14,41.13
2019-05-15,41
2019-05-16,41.48
2019-05-17,40.2
2019-05-20,39.43
2019-05-21,39.92
2019-05-22,40.02
2019-05-23,39.45
2019-05-24,40.06
2019-05-28,39.47
2019-05-29,39.08
2019-05-30,39.22
2019-05-31,38.59
2019-06-03,38.12
2019-06-04,39.5
2019-06-05,39.64
2019-06-06,39.91
2019-06-07,40.13
2019-06-10,40.33
2019-06-11,40.02
2019-06-12,40.09
2019-06-13,40.31
2019-06-14,40.05
2019-06-17,39.98
2019-06-18,40.08
2019-06-19,40.11
2019-06-20,40.41
2019-06-21,40.19
2019-06-24,40.26
2019-06-25,40.015
2019-06-26,40.96
2019-06-27,41.545
2019-06-28,42.015
2019-07-01,42.77
2019-07-02,42.79
2019-07-03,42.78
2019-07-04,42.78
2019-07-05,42.29
2019-07-08,42.09
2019-07-09,42.32
2019-07-10,43.04
2019-07-11,42.48
2019-07-12,43.11
2019-07-15,42.935
2019-07-16,42.99
2019-07-17,43.12
2019-07-18,42.995
2019-07-19,43.21
2019-07-22,43.41
2019-07-23,44.55
2019-07-24,44.945
2019-07-25,45.225
2019-07-26,45.18
2019-07-29,45.08
2019-07-30,45.07
2019-07-31,41.845
2019-08-01,42.43
2019-08-02,42.24
2019-08-05,41.48
2019-08-06,42.04
2019-08-07,42.765
2019-08-08,43.895
2019-08-09,43.75
2019-08-12,43.2
2019-08-13,43.775
2019-08-14,42.07
2019-08-15,41.82
2019-08-16,42.815
2019-08-19,42.995
2019-08-20,42.335
2019-08-21,42.76
2019-08-22,42.75
2019-08-23,41.31
2019-08-26,42.03
2019-08-27,41.45
2019-08-28,41.325
2019-08-29,42.405
2019-08-30,41.98
2019-09-02,41.97
2019-09-03,41.41
2019-09-04,42.355
2019-09-05,43.03
2019-09-06,42.66
2019-09-09,43.19
2019-09-10,43.695
2019-09-11,44.455
2019-09-12,44.595
2019-09-13,44.185
2019-09-16,44.045
2019-09-17,43.58
2019-09-18,43.49
2019-09-19,43.445
2019-09-20,42.72
2019-09-23,42.21
2019-09-24,41.955
2019-09-25,42.045
2019-09-26,41.99
2019-09-27,41.97
2019-09-30,41.98
2019-10-01,41.25
2019-10-02,39.895
2019-10-03,40.125
2019-10-04,40.535
2019-10-07,40.24
2019-10-08,38.965
2019-10-09,39.18
2019-10-10,39.56
2019-10-11,40.73
2019-10-14,40.69
2019-10-15,40.92
2019-10-16,40.255
2019-10-17,40.93
2019-10-18,40.64
2019-10-21,41.045
2019-10-22,40.88
2019-10-23,40.76
2019-10-24,40.875
2019-10-25,40.87
2019-10-28,40.945
2019-10-29,40.91
2019-10-30,41.825
2019-10-31,41.345
2019-11-01,42.61
2019-11-04,43.28
2019-11-05,43.395
2019-11-06,42.805
2019-11-07,43.095
2019-11-08,43.405
2019-11-11,43.34
2019-11-12,43.045
2019-11-13,43.18
2019-11-14,43.04
2019-11-15,43.405
2019-11-18,42.865
2019-11-19,43.005
2019-11-20,43.285
2019-11-21,42.575
2019-11-22,42.08
2019-11-25,42.43
