date,close
2014-06-13,275.359
2014-06-16,272.8632
2014-06-17,273.6919
2014-06-18,278.8298
2014-06-19,278.7713
2014-06-20,281.1989
2014-06-23,283.1195
2014-06-24,285.2156
2014-06-25,282.8075
2014-06-26,282.8075
2014-06-27,277.9913
2014-06-30,283.4704
2014-07-01,284.8938
2014-07-02,281.9593
2014-07-03,284.2991
2014-07-07,284.7183
2014-07-08,280.7796
2014-07-09,283.7044
2014-07-10,280.2629
2014-07-11,281.3158
2014-07-14,282.1933
2014-07-15,277.2796
2014-07-16,276.0902
2014-07-17,275.944
2014-07-18,280.8284
2014-07-21,276.8214
2014-07-22,278.3716
2014-07-23,278.3326
2014-07-24,275.3785
2014-07-25,268.593
2014-07-28,268.2323
2014-07-29,267.1404
2014-07-30,265.483
2014-07-31,256.5624
2014-08-01,255.4412
2014-08-04,258.7462
2014-08-05,261.2615
2014-08-06,256.8451
2014-08-07,253.1891
2014-08-08,256.4064
2014-08-11,267.2574
2014-08-12,268.3883
2014-08-13,264.6348
2014-08-14,265.678
2014-08-15,267.9106
2014-08-18,274.6376
2014-08-19,274.9203
2014-08-20,275.9342
2014-08-21,283.5582
2014-08-22,277.9523
2014-08-25,277.9913
2014-08-26,279.2295
2014-08-27,275.8952
2014-08-28,271.0888
2014-08-29,270.8451
2014-09-02,273.1752
2014-09-03,271.9175
2014-09-04,267.0721
2014-09-05,267.3256
2014-09-08,264.1083
2014-09-09,264.6738
2014-09-10,264.4008
2014-09-11,265.6682
2014-09-12,260.5498
2014-09-15,258.2978
2014-09-16,260.7448
2014-09-17,261.4175
2014-09-18,264.1571
2014-09-19,265.2978
2014-09-22,261.437
2014-09-23,258.7657
2014-09-24,261.6808
2014-09-25,258.8437
2014-09-26,259.3702
2014-09-29,259.9161
2014-09-30,255.3242
2014-10-01,253.2671
2014-10-02,251.366
2014-10-03,252.7602
2014-10-06,254.3883
2014-10-07,251.951
2014-10-08,251.5805
2014-10-09,246.4524
2014-10-10,244.444
2014-10-13,233.6515
2014-10-14,235.9329
2014-10-15,236.2059
2014-10-16,242.6599
2014-10-17,246.2769
2014-10-20,246.5304
2014-10-21,257.6251
2014-10-22,253.2281
2014-10-23,257.0401
2014-10-24,258.561
2014-10-27,258.756
2014-10-28,266.7212
2014-10-29,263.7281
2014-10-30,261.1933
2014-10-31,264.3228
2014-11-03,265.1125
2014-11-04,267.8423
2014-11-05,267.7838
2014-11-06,272.9802
2014-11-07,271.6445
2014-11-10,276.9092
2014-11-11,273.4482
2014-11-12,275.5833
2014-11-13,272.6
2014-11-14,270.5429
2014-11-17,275.0568
2014-11-18,273.3702
2014-11-19,277.4356
2014-11-20,270.4259
2014-11-21,270.4649
2014-11-24,271.0693
2014-11-25,272.1613
2014-11-26,268.5053
2014-11-28,271.2253
2014-12-01,271.1376
2014-12-02,275.8465
2014-12-03,276.6752
2014-12-04,278.9468
2014-12-05,279.444
2014-12-08,272.7755
2014-12-09,270.5136
2014-12-10,265.1613
2014-12-11,265.093
2014-12-12,260.3061
2014-12-15,257.3521
2014-12-16,258.8437
2014-12-17,258.99
2014-12-18,262.1097
2014-12-19,272.8632
2014-12-22,272.8145
2014-12-23,274.2476
2014-12-24,274.6278
2014-12-26,276.8897
2014-12-29,276.1487
2014-12-30,281.3646
2014-12-31,277.1334
2015-01-02,281.0721
2015-01-05,266.1557
2015-01-06,260.0136
2015-01-07,265.2198
2015-01-08,270.8938
2015-01-09,271.82
2015-01-12,272.132
2015-01-13,273.9356
2015-01-14,273.3994
2015-01-15,276.3925
2015-01-16,274.8911
2015-01-20,277.8158
2015-01-21,277.8548
2015-01-22,283.7629
2015-01-23,286.2197
2015-01-26,288.4036
2015-01-27,285.1668
2015-01-28,283.8019
2015-01-29,282.8855
2015-01-30,278.937
2015-02-02,285.508
2015-02-03,288.8813
2015-02-04,288.8228
2015-02-05,308.0777
2015-02-06,309.9495
2015-02-09,314.8924
2015-02-10,308.3506
2015-02-11,310.008
2015-02-12,312.3478
2015-02-13,314.9022
2015-02-17,312.9913
2015-02-18,313.7225
2015-02-19,316.3548
2015-02-20,313.7322
2015-02-23,321.0345
2015-02-24,316.2866
2015-02-25,321.4927
2015-02-26,319.1431
2015-02-27,318.6264
2015-03-02,324.6807
2015-03-03,317.242
2015-03-04,319.1098
2015-03-05,313.3595
2015-03-06,313.5551
2015-03-09,311.1494
2015-03-10,304.1963
2015-03-11,311.1592
2015-03-12,314.8949
2015-03-13,316.8116
2015-03-16,320.7625
2015-03-17,317.017
2015-03-18,319.4032
2015-03-19,317.1735
2015-03-20,318.9631
2015-03-23,321.2417
2015-03-24,321.0559
2015-03-25,316.2836
2015-03-26,315.8142
2015-03-27,320.7332
2015-03-30,323.3247
2015-03-31,323.1096
2015-04-01,328.5762
2015-04-02,319.7357
2015-04-06,318.6404
2015-04-07,313.9659
2015-04-08,315.9315
2015-04-09,315.1003
2015-04-10,319.7748
2015-04-13,319.2174
2015-04-14,319.8335
2015-04-15,319.4032
2015-04-16,319.4227
2015-04-17,316.1075
2015-04-20,319.9802
2015-04-21,320.2833
2015-04-22,320.6158
2015-04-23,320.1268
2015-04-24,319.3934
2015-04-27,318.9533
2015-04-28,318.3274
2015-04-29,318.0438
2015-04-30,314.934
2015-05-01,320.9581
2015-05-04,318.8458
2015-05-05,318.4155
2015-05-06,318.836
2015-05-07,318.6502
2015-05-08,319.6868
2015-05-11,320.7625
2015-05-12,317.9363
2015-05-13,318.5035
2015-05-14,318.2199
2015-05-15,320.3811
2015-05-18,322.6206
2015-05-19,321.3493
2015-05-20,322.0338
2015-05-21,320.5669
2015-05-22,321.5644
2015-05-26,318.1612
2015-05-27,318.6697
2015-05-28,327.745
2015-05-29,321.7404
2015-06-01,324.4787
2015-06-02,323.4812
2015-06-03,323.8626
2015-06-04,318.8066
2015-06-05,317.7896
2015-06-08,318.8066
2015-06-09,317.995
2015-06-10,321.2026
2015-06-11,319.3934
2015-06-12,321.3493
2015-06-15,316.2151
2015-06-16,316.8997
2015-06-17,314.3982
2015-06-18,320.4802
2015-06-19,321.7554
2015-06-22,323.3054
2015-06-23,322.4421
2015-06-24,320.9805
2015-06-25,320.235
2015-06-26,318.9303
2015-06-29,316.9095
2015-06-30,320.6862
2015-07-01,324.9632
2015-07-02,323.325
2015-07-06,323.7076
2015-07-07,323.4623
2015-07-08,319.1068
2015-07-09,319.6856
2015-07-10,323.0307
2015-07-13,323.8155
2015-07-14,323.5212
2015-07-15,323.6683
2015-07-16,324.8945
2015-07-17,330.0642
2015-07-20,335.8028
2015-07-21,338.5103
2015-07-22,343.3366
2015-07-23,336.6661
2015-07-24,337.2154
2015-07-27,330.0936
2015-07-28,335.126
2015-07-29,344.6903
2015-07-30,347.3782
2015-07-31,352.5282
2015-08-03,355.8929
2015-08-04,352.6361
2015-08-05,354.137
2015-08-06,361.2195
2015-08-07,360.4151
2015-08-10,361.504
2015-08-11,362.9558
2015-08-12,366.8503
2015-08-13,370.0678
2015-08-14,376.1007
2015-08-17,375.6985
2015-08-18,375.6102
2015-08-19,372.7655
2015-08-20,364.8197
2015-08-21,356.5992
2015-08-24,349.6932
2015-08-25,354.2841
2015-08-26,360.9547
2015-08-27,365.9478
2015-08-28,369.3321
2015-08-31,367.429
2015-09-01,358.8456
2015-09-02,363.6229
2015-09-03,366.0949
2015-09-04,361.9749
2015-09-08,367.3996
2015-09-09,365.114
2015-09-10,365.8595
2015-09-11,367.8705
2015-09-14,365.784
2015-09-15,375.831
2015-09-16,377.3637
2015-09-17,379.6282
2015-09-18,379.203
2015-09-21,386.9459
2015-09-22,388.2116
2015-09-23,394.8074
2015-09-24,399.9693
2015-09-25,402.4811
2015-09-28,394.7382
2015-09-29,385.5516
2015-09-30,389.0917
2015-10-01,393.245
2015-10-02,391.1288
2015-10-05,392.4737
2015-10-06,390.4663
2015-10-07,401.8878
2015-10-08,396.4391
2015-10-09,395.5886
2015-10-12,404.35
2015-10-13,397.6653
2015-10-14,392.4144
2015-10-15,396.2215
2015-10-16,392.9483
2015-10-19,391.8902
2015-10-20,391.3958
2015-10-21,388.3303
2015-10-22,390.6542
2015-10-23,392.533
2015-10-26,399.0002
2015-10-27,396.7456
2015-10-28,399.3958
2015-10-29,402.224
2015-10-30,401.7889
2015-11-02,403.7172
2015-11-03,399.6331
2015-11-04,399.7221
2015-11-05,400.7011
2015-11-06,406.4168
2015-11-09,407.3266
2015-11-10,412.8939
2015-11-11,414.9903
2015-11-12,404.9038
2015-11-13,414.2882
2015-11-16,411.46
2015-11-17,420.2709
2015-11-18,424.4044
2015-11-19,427.9544
2015-11-20,427.4303
2015-11-23,431.4254
2015-11-24,426.6986
2015-11-25,423.8407
2015-11-27,429.2795
2015-11-30,400.889
2015-12-01,408.4044
2015-12-02,404.8939
2015-12-03,397.7938
2015-12-04,398.6047
2015-12-07,400.2363
2015-12-08,394.0855
2015-12-09,388.7456
2015-12-10,390.4366
2015-12-11,375.4354
2015-12-14,388.1721
2015-12-15,390.4069
2015-12-16,393.0769
2015-12-17,389.0225
2015-12-18,383.1387
2015-12-21,381.0918
2015-12-22,390.4069
2015-12-23,389.1016
2015-12-24,390.6047
2015-12-28,383.4552
2015-12-29,387.5293
2015-12-30,383.9496
2015-12-31,385.1659
2016-01-04,377.4527
2016-01-05,381.6653
2016-01-06,374.7828
2016-01-07,364.5776
2016-01-08,357.873
2016-01-11,357.1808
2016-01-12,358.1895
2016-01-13,351.1091
2016-01-14,356.6172
2016-01-15,348.5776
2016-01-19,349.171
2016-01-20,341.7247
2016-01-21,345.8286
2016-01-22,353.4824
2016-01-25,346.1054
2016-01-26,347.391
2016-01-27,340.37
2016-01-28,337.0474
2016-01-29,362.5702
2016-02-01,355.3118
2016-02-02,347.9052
2016-02-03,344.899
2016-02-04,329.2353
2016-02-05,320.3058
2016-02-08,309.3095
2016-02-09,311.4652
2016-02-10,316.6173
2016-02-11,307.0648
2016-02-12,317.0425
2016-02-16,338.2835
2016-02-17,340.1821
2016-02-18,336.6617
2016-02-19,339.3712
2016-02-22,334.1796
2016-02-23,333.9522
2016-02-24,346.1846
2016-02-25,350.496
2016-02-26,344.8298
2016-02-29,338.9955
2016-03-01,341.0622
2016-03-02,343.8409
2016-03-03,343.9695
2016-03-04,346.5208
2016-03-07,343.0103
2016-03-08,341.5863
2016-03-09,344.6122
2016-03-10,340.8644
2016-03-11,342.8422
2016-03-14,345.6308
2016-03-15,344.0288
2016-03-16,346.0956
2016-03-17,346.8372
2016-03-18,343.742
2016-03-21,344.0486
2016-03-22,347.7865
2016-03-23,349.1017
2016-03-24,341.1907
2016-03-28,338.7581
2016-03-29,344.9188
2016-03-30,341.2105
2016-03-31,353.3341
2016-04-01,357.3206
2016-04-04,344.0326
2016-04-05,337.3588
2016-04-06,338.6082
2016-04-07,334.6615
2016-04-08,335.663
2016-04-11,337.5571
2016-04-12,336.1589
2016-04-13,341.0179
2016-04-14,339.1536
2016-04-15,342.1187
2016-04-18,346.4819
2016-04-19,350.5278
2016-04-20,350.389
2016-04-21,350.1411
2016-04-22,354.1176
2016-04-25,344.9449
2016-04-26,349.1891
2016-04-27,356.2596
2016-04-28,357.8264
2016-04-29,349.0602
2016-05-02,358.6792
2016-05-03,353.8895
2016-05-04,357.0132
2016-05-05,357.638
2016-05-06,355.0101
2016-05-09,357.6578
2016-05-10,360.0675
2016-05-11,358.7883
2016-05-12,357.6082
2016-05-13,354.3556
2016-05-16,356.2001
2016-05-17,361.0988
2016-05-18,360.2262
2016-05-19,359.9584
2016-05-20,365.1745
2016-05-23,363.0226
2016-05-24,373.1771
2016-05-25,369.6865
2016-05-26,370.8071
2016-05-27,370.3211
2016-05-31,373.5143
2016-06-01,374.0299
2016-06-02,373.2564
2016-06-03,370.5492
2016-06-06,374.2877
2016-06-07,375.5967
2016-06-08,374.0002
2016-06-09,371.7789
2016-06-10,366.1661
2016-06-13,364.6787
2016-06-14,361.9814
2016-06-15,362.269
2016-06-16,359.1254
2016-06-17,352.6301
2016-06-20,365.8686
2016-06-21,367.7528
2016-06-22,370.7178
2016-06-23,376.033
2016-06-24,361.7533
2016-06-27,357.985
2016-06-28,364.996
2016-06-29,370.5988
2016-06-30,371.4219
2016-07-01,367.8222
2016-07-05,365.5414
2016-07-06,370.222
2016-07-07,375.9438
2016-07-08,382.5085
2016-07-11,384.1447
2016-07-12,386.2768
2016-07-13,386.0685
2016-07-14,384.8488
2016-07-15,383.4605
2016-07-18,385.1959
2016-07-19,383.758
2016-07-20,384.7595
2016-07-21,384.2637
2016-07-22,386.7428
2016-07-25,386.4255
2016-07-26,387.9229
2016-07-27,387.9527
2016-07-28,387.7246
2016-07-29,392.2068
2016-08-01,393.5456
2016-08-02,386.6933
2016-08-03,392.2167
2016-08-04,356.4976
2016-08-05,352.8384
2016-08-08,347.9496
2016-08-09,350.3593
2016-08-10,346.1249
2016-08-11,347.8504
2016-08-12,345.0738
2016-08-15,349.08
2016-08-16,342.3269
2016-08-17,345.9563
2016-08-18,347.3843
2016-08-19,347.5727
2016-08-22,347.9198
2016-08-23,346.9678
2016-08-24,341.9203
2016-08-25,338.638
2016-08-26,334.245
2016-08-29,334.1557
2016-08-30,338.8561
2016-08-31,340.8394
2016-09-01,341.841
2016-09-02,344.8358
2016-09-06,341.9699
2016-09-07,345.1729
2016-09-08,340.7403
2016-09-09,328.6521
2016-09-12,331.032
2016-09-13,322.8807
2016-09-14,323.2774
2016-09-15,321.7899
2016-09-16,318.6364
2016-09-19,326.2325
2016-09-20,327.2439
2016-09-21,332.6385
2016-09-22,335.1424
2016-09-23,334.721
2016-09-26,330.3676
2016-09-27,323.5947
2016-09-28,324.3384
2016-09-29,320.2429
2016-09-30,321.5221
2016-10-03,318.3786
2016-10-04,319.3405
2016-10-05,330.0801
2016-10-06,330.2486
2016-10-07,332.1328
2016-10-10,334.1855
2016-10-11,335.1771
2016-10-12,335.9209
2016-10-13,328.9297
2016-10-14,331.0618
2016-10-17,330.4371
2016-10-18,328.9053
2016-10-19,327.1349
2016-10-20,327.6123
2016-10-21,329.1838
2016-10-24,332.6252
2016-10-25,326.9061
2016-10-26,327.2045
2016-10-27,319.7348
2016-10-28,317.9643
2016-10-31,320.6598
2016-11-01,317.3676
2016-11-02,314.3041
2016-11-03,312.5336
2016-11-04,313.7769
2016-11-07,318.2031
2016-11-08,323.1265
2016-11-09,324.151
2016-11-10,314.7517
2016-11-11,324.0217
2016-11-14,331.561
2016-11-15,341.0001
2016-11-16,337.4194
2016-11-17,342.0743
2016-11-18,341.8853
2016-11-21,340.6718
2016-11-22,338.2946
2016-11-23,340.7514
2016-11-25,343.1485
2016-11-28,339.9756
2016-11-29,340.0353
2016-11-30,339.6275
2016-12-01,346.57
2016-12-02,346.7689
2016-12-05,349.0864
2016-12-06,352.1499
2016-12-07,366.8406
2016-12-08,371.4756
2016-12-09,370.0632
2016-12-12,366.2438
2016-12-13,368.0143
2016-12-14,364.6524
2016-12-15,366.9699
2016-12-16,368.0043
2016-12-19,370.9783
2016-12-20,370.7495
2016-12-21,369.7648
2016-12-22,365.9256
2016-12-23,369.1681
2016-12-27,367.9944
2016-12-28,367.1887
2016-12-29,368.3724
2016-12-30,367.6065
2017-01-03,366.3035
2017-01-04,369.2178
2017-01-05,369.0984
2017-01-06,368.1336
2017-01-09,366.2538
2017-01-10,367.0992
2017-01-11,366.5621
2017-01-12,365.5874
2017-01-13,367.1092
2017-01-17,365.5874
2017-01-18,366.4726
2017-01-19,365.9753
2017-01-20,366.5621
2017-01-23,370.9584
2017-01-24,376.4289
2017-01-25,378.5574
2017-01-26,376.3593
2017-01-27,378.6071
2017-01-30,378.7563
2017-01-31,374.6485
2017-02-01,372.9576
2017-02-02,368.442
2017-02-03,373.4251
2017-02-06,371.9928
2017-02-07,369.0089
2017-02-08,368.621
2017-02-09,368.5017
2017-02-10,371.6845
2017-02-13,375.9714
2017-02-14,375.4343
2017-02-15,381.5314
2017-02-16,381.8099
2017-02-17,379.1641
2017-02-21,380.1912
2017-02-22,382.1458
2017-02-23,383.8611
2017-02-24,383.1331
2017-02-27,382.8938
2017-02-28,385.2373
2017-03-01,389.4955
2017-03-02,384.7187
2017-03-03,381.1486
2017-03-06,377.2792
2017-03-07,376.1623
2017-03-08,376.6909
2017-03-09,375.2847
2017-03-10,374.4271
2017-03-13,373.38
2017-03-14,368.5533
2017-03-15,369.6503
2017-03-16,374.0083
2017-03-17,371.6548
2017-03-20,370.1589
2017-03-21,366.3793
2017-03-22,369.1916
2017-03-23,372.2232
2017-03-24,372.672
2017-03-27,383.7314
2017-03-28,379.2538
2017-03-29,379.4034
2017-03-30,379.184
2017-03-31,380.1413
2017-04-03,373.0709
2017-04-04,372.1334
2017-04-05,363.7765
2017-04-06,360.695
2017-04-07,360.1964
2017-04-10,369.2215
2017-04-11,363.9859
2017-04-12,360.4058
2017-04-13,358.9997
2017-04-17,361.3831
2017-04-18,358.7603
2017-04-19,357.0351
2017-04-20,361.6324
2017-04-21,363.5471
2017-04-24,371.8841
2017-04-25,369.7301
2017-04-26,367.8552
2017-04-27,368.3738
2017-04-28,373.4299
2017-05-01,367.8652
2017-05-02,372.8515
2017-05-03,375.3645
2017-05-04,375.1152
2017-05-05,368.4436
2017-05-08,368.1843
2017-05-09,368.5633
2017-05-10,368.9821
2017-05-11,366.3195
2017-05-12,361.1438
2017-05-15,365.4718
2017-05-16,366.1699
2017-05-17,365.8009
2017-05-18,370.7173
2017-05-19,377.6981
2017-05-22,383.3126
2017-05-23,386.3442
2017-05-24,391.9887
2017-05-25,352.4278
2017-05-26,347.3319
2017-05-30,356.5764
2017-05-31,368.2342
2017-06-01,368.2242
2017-06-02,355.4694
2017-06-05,353.2256
2017-06-06,349.0272
2017-06-07,350.1242
2017-06-08,353.6145
2017-06-09,357.1248
2017-06-12,354.891
2017-06-13,349.5457
2017-06-14,349.7751
2017-06-15,346.4443
2017-06-16,349.9845
2017-06-19,348.9374
2017-06-20,346.3346
2017-06-21,341.3883
2017-06-22,342.0963
2017-06-23,339.7827
2017-06-26,349.9945
2017-06-27,351.5502
2017-06-28,350.922
2017-06-29,353.0361
2017-06-30,365.053
2017-07-03,354.0334
2017-07-05,354.6417
2017-07-06,354.7713
2017-07-07,360.5753
2017-07-10,353.425
2017-07-11,351.2411
2017-07-12,357.9127
2017-07-13,362.9288
2017-07-14,363.2579
2017-07-17,362.4801
2017-07-18,363
2017-07-19,364.95
2017-07-20,369.6
2017-07-21,373.63
2017-07-24,373.83
2017-07-25,381.99
2017-07-26,384.94
2017-07-27,383.81
2017-07-28,386.75
2017-07-31,388.56
2017-08-01,396.3
2017-08-02,394.46
2017-08-03,391.65
2017-08-04,393.62
2017-08-07,393.4
2017-08-08,388.63
2017-08-09,391.42
2017-08-10,360.39
2017-08-11,373.61
2017-08-14,374.14
2017-08-15,375.56
2017-08-16,373.61
2017-08-17,358.8
2017-08-18,356.39
2017-08-21,358.35
2017-08-22,364.95
2017-08-23,360.85
2017-08-24,358.2
2017-08-25,355.54
2017-08-28,361.63
2017-08-29,367.41
2017-08-30,369.75
2017-08-31,373.21
2017-09-01,376.7
2017-09-05,377.32
2017-09-06,379.69
2017-09-07,380.45
2017-09-08,383.42
2017-09-11,390.21
2017-09-12,388.81
2017-09-13,386.09
2017-09-14,383.25
2017-09-15,387.53
2017-09-18,387.56
2017-09-19,376.39
2017-09-20,376.62
2017-09-21,372.28
2017-09-22,373.26
2017-09-25,376.56
2017-09-26,374.04
2017-09-27,372.74
2017-09-28,368.56
2017-09-29,374.9
2017-10-02,371.49
2017-10-03,368.02
2017-10-04,365.01
2017-10-05,362.61
2017-10-06,364.59
2017-10-09,364.14
2017-10-10,363.43
2017-10-11,363.25
2017-10-12,365.29
2017-10-13,368.56
2017-10-16,367.76
2017-10-17,367.84
2017-10-18,369.42
2017-10-19,373.13
2017-10-20,375.29
2017-10-23,381.33
2017-10-24,387.4
2017-10-25,388.25
2017-10-26,395.89
2017-10-27,394.52
2017-10-30,395.37
2017-10-31,392.64
2017-11-01,396.17
2017-11-02,393.18
2017-11-03,386.66
2017-11-06,384.2
2017-11-07,380.15
2017-11-08,380.02
2017-11-09,371.36
2017-11-10,369.67
2017-11-13,365.43
2017-11-14,363.63
2017-11-15,357.64
2017-11-16,357.9
2017-11-17,353.91
2017-11-20,352.72
2017-11-21,358.41
2017-11-22,354.87
2017-11-24,354.06
2017-11-27,354.45
2017-11-28,357.41
2017-11-29,367.58
2017-11-30,370.67
2017-12-01,378.39
2017-12-04,383.89
2017-12-05,374.31
2017-12-06,374.77
2017-12-07,378.27
2017-12-08,381.12
2017-12-11,380.33
2017-12-12,379.66
2017-12-13,378.84
2017-12-14,375.68
2017-12-15,377.68
2017-12-18,381.07
2017-12-19,381.88
2017-12-20,383.31
2017-12-21,379.91
2017-12-22,379.27
2017-12-26,380.6
2017-12-27,379.73
2017-12-28,379.18
2017-12-29,377.91
2018-01-02,379.61
2018-01-03,375.64
2018-01-04,380.02
2018-01-05,375.48
2018-01-08,373.44
2018-01-09,374.94
2018-01-10,372.96
2018-01-11,377.54
2018-01-12,373.38
2018-01-16,367.1
2018-01-17,370.07
2018-01-18,367.51
2018-01-19,371.67
2018-01-22,376.24
2018-01-23,380.69
2018-01-24,380.35
2018-01-25,378.4
2018-01-26,384
2018-01-29,374.26
2018-01-30,370.63
2018-01-31,365.08
2018-02-01,365.19
2018-02-02,359.6
2018-02-05,351.43
2018-02-06,351.69
2018-02-07,354.33
2018-02-08,351.67
2018-02-09,353.31
2018-02-12,354.34
2018-02-13,351.96
2018-02-14,355.5
2018-02-15,349.33
2018-02-16,349.45
2018-02-20,354.5
2018-02-21,351.14
2018-02-22,349.18
2018-02-23,353.63
2018-02-26,354.5
2018-02-27,348.35
2018-02-28,344
2018-03-01,335.87
2018-03-02,331.17
2018-03-05,331.69
2018-03-06,332.82
2018-03-07,329.075
2018-03-08,328.46
2018-03-09,341.44
2018-03-12,336.95
2018-03-13,340.71
2018-03-14,340.39
2018-03-15,340.56
2018-03-16,343.95
2018-03-19,343.92
2018-03-20,341.43
2018-03-21,342.06
2018-03-22,340
2018-03-23,338
2018-03-26,343.57
2018-03-27,341.57
2018-03-28,342.78
2018-03-29,345.1
2018-04-02,341.88
2018-04-03,349.51
2018-04-04,349.36
2018-04-05,357.89
2018-04-06,345.8
2018-04-09,343.92
2018-04-10,342.93
2018-04-11,343.8
2018-04-12,341.44
2018-04-13,348.4
2018-04-16,351.16
2018-04-17,349.49
2018-04-18,349.94
2018-04-19,344.65
2018-04-20,339.9
2018-04-23,343.88
2018-04-24,341.47
2018-04-25,345.55
2018-04-26,341.61
2018-04-27,343.96
2018-04-30,337.52
2018-05-01,336.22
2018-05-02,336.14
2018-05-03,333.22
2018-05-04,331.78
2018-05-07,332.08
2018-05-08,335.73
2018-05-09,336.91
2018-05-10,340.85
2018-05-11,342.77
2018-05-14,343.86
2018-05-15,355.85
2018-05-16,354.35
2018-05-17,353.96
2018-05-18,355.72
2018-05-21,355.61
2018-05-22,352.96
2018-05-23,355.48
2018-05-24,355.46
2018-05-25,355.9
2018-05-29,353.19
2018-05-30,356.57
2018-05-31,322.94
2018-06-01,342
2018-06-04,335.32
2018-06-05,338.25
2018-06-06,338.71
2018-06-07,343.29
2018-06-08,346.68
2018-06-11,351.32
2018-06-12,353.02
2018-06-13,347.53
2018-06-14,352.09
2018-06-15,361.21
2018-06-18,357.97
2018-06-19,360.27
2018-06-20,361.31
2018-06-21,362.37
2018-06-22,362.5
2018-06-25,356.43
2018-06-26,355.27
2018-06-27,355.69
2018-06-28,355.74
2018-06-29,356.15
2018-07-02,361
2018-07-03,365.4
2018-07-05,368.79
2018-07-06,369.24
2018-07-09,374.09
2018-07-10,372.39
2018-07-11,375.82
2018-07-12,376.35
2018-07-13,378.82
2018-07-16,370.55
2018-07-17,365.9
2018-07-18,365.64
2018-07-19,372.6
2018-07-20,371.9
2018-07-23,373.76
2018-07-24,368.1
2018-07-25,372.22
2018-07-26,377.98
2018-07-27,373.34
2018-07-30,371.21
2018-07-31,377.08
2018-08-01,373.48
2018-08-02,380.73
2018-08-03,381.76
2018-08-06,377.49
2018-08-07,381
2018-08-08,380.01
2018-08-09,364.26
2018-08-10,368.79
2018-08-13,368.79
2018-08-14,379.18
2018-08-15,378.19
2018-08-16,379.62
2018-08-17,381.47
2018-08-20,383.52
2018-08-21,380.99
2018-08-22,375.68
2018-08-23,380.52
2018-08-24,377
2018-08-27,377.9
2018-08-28,380.29
2018-08-29,377.47
2018-08-30,374.31
2018-08-31,374.89
2018-09-04,367
2018-09-05,365.82
2018-09-06,359.41
2018-09-07,360.05
2018-09-10,361.36
2018-09-11,357.8
2018-09-12,356.78
2018-09-13,355.67
2018-09-14,360.46
2018-09-17,355.15
2018-09-18,355.55
2018-09-19,355.47
2018-09-20,357.99
2018-09-21,350
2018-09-24,349.13
2018-09-25,349.72
2018-09-26,346.29
2018-09-27,350.5
2018-09-28,356.65
2018-10-01,353
2018-10-02,352.83
2018-10-03,353.7
2018-10-04,350.61
2018-10-05,348.34
2018-10-08,348.97
2018-10-09,346.04
2018-10-10,337.07
2018-10-11,332.22
2018-10-12,329.67
2018-10-15,335.38
2018-10-16,337.13
2018-10-17,333.57
2018-10-18,328.88
2018-10-19,328.29
2018-10-22,324.9
2018-10-23,321.48
2018-10-24,318.82
2018-10-25,323.98
2018-10-26,320.24
2018-10-29,318.92
2018-10-30,323.89
2018-10-31,326.48
2018-11-01,329.35
2018-11-02,328
2018-11-05,328.86
2018-11-06,331
2018-11-07,335.99
2018-11-08,340.96
2018-11-09,335.54
2018-11-12,339.6
2018-11-13,342.66
2018-11-14,339.1
2018-11-15,340.98
2018-11-16,338.02
2018-11-19,339.61
2018-11-20,343.82
2018-11-21,350.24
2018-11-23,348.83
2018-11-26,350.44
2018-11-27,346.75
2018-11-28,348.41
2018-11-29,348.67
2018-11-30,346.45
2018-12-03,349.64
2018-12-04,340.08
2018-12-06,345.72
2018-12-07,340.08
2018-12-10,347.87
2018-12-11,346.49
2018-12-12,349.09
2018-12-13,351.94
2018-12-14,344.49
2018-12-17,342.55
2018-12-18,338.26
2018-12-19,340.03
2018-12-20,334.37
2018-12-21,328.01
2018-12-24,322.2
2018-12-26,331.23
2018-12-27,329.31
2018-12-28,328.84
2018-12-31,328.11
2019-01-02,328.77
2019-01-03,325.46
2019-01-04,336.22
2019-01-07,340.58
2019-01-08,339.01
2019-01-09,345.51
2019-01-10,341.7
2019-01-11,345.61
2019-01-14,342.4
2019-01-15,346.88
2019-01-16,345.4
2019-01-17,346.42
2019-01-18,356.78
2019-01-22,348.36
2019-01-23,346.45
2019-01-24,344.85
2019-01-25,351.77
2019-01-28,356.34
2019-01-29,359.71
2019-01-30,360.4
2019-01-31,362.66
2019-02-01,363.82
2019-02-04,362.36
2019-02-05,361.73
2019-02-06,363.45
2019-02-07,380.26
2019-02-08,370.03
2019-02-11,371.87
2019-02-12,372.99
2019-02-13,372.18
2019-02-14,378.44
2019-02-15,376.42
2019-02-19,377.46
2019-02-20,380.75
2019-02-21,384.17
2019-02-22,376.98
2019-02-25,375
2019-02-26,376.35
2019-02-27,378.33
2019-02-28,384.59
2019-03-01,381.15
2019-03-04,370.78
2019-03-05,368.7
2019-03-06,369.38
2019-03-07,367.03
2019-03-08,365.81
2019-03-11,376.13
2019-03-12,372.36
2019-03-13,377.4
2019-03-14,376.3
2019-03-15,379.09
2019-03-18,381.96
2019-03-19,377
2019-03-20,368.62
2019-03-21,369.56
2019-03-22,359
2019-03-25,357.51
2019-03-26,361.07
2019-03-27,365.43
2019-03-28,369.54
2019-03-29,371.51
2019-04-01,376.97
2019-04-02,369.73
2019-04-03,370.1
2019-04-04,372
2019-04-05,371.05
2019-04-08,369.11
2019-04-09,370.22
2019-04-10,370.48
2019-04-11,375.2
2019-04-12,377.32
2019-04-15,370.93
2019-04-16,368.99
2019-04-17,369.77
2019-04-18,368.02
2019-04-22,366.34
2019-04-23,374.2
2019-04-24,378.76
2019-04-25,372.93
2019-04-26,378.08
2019-04-29,377.98
2019-04-30,373.17
2019-05-01,372.95
2019-05-02,381.56
2019-05-03,385.5
2019-05-06,389
2019-05-07,386.21
2019-05-08,386.3
2019-05-09,386.28
2019-05-10,392.41
2019-05-13,387.9
2019-05-14,391.33
2019-05-15,393.84
2019-05-16,402.52
2019-05-17,381.6
2019-05-20,384
2019-05-21,392.12
2019-05-22,388.42
2019-05-23,387.8
2019-05-24,389.34
2019-05-28,389.49
2019-05-29,386.51
2019-05-30,378.43
2019-05-31,368.22
2019-06-03,378.21
2019-06-04,386.62
2019-06-05,388.96
2019-06-06,389.59
2019-06-07,392.69
2019-06-10,394.26
2019-06-11,391.3
2019-06-12,382.27
2019-06-13,386.52
2019-06-14,391.065
2019-06-17,383.425
2019-06-18,385.88
2019-06-19,383.73
2019-06-20,380.705
2019-06-21,380.19
2019-06-24,379.295
2019-06-25,380.35
2019-06-26,378.31
2019-06-27,377.075
2019-06-28,379.68
2019-07-01,379.47
2019-07-02,373.78
2019-07-03,378.95
2019-07-04,378.95
2019-07-05,377.14
2019-07-08,377.2
2019-07-09,372.68
2019-07-10,372.505
2019-07-11,375.29
2019-07-12,380.86
2019-07-15,379.04
2019-07-16,380.83
2019-07-17,374.2
2019-07-18,378.09
2019-07-19,376.81
2019-07-22,377.04
2019-07-23,377.39
2019-07-24,381.75
2019-07-25,378.79
2019-07-26,385.06
2019-07-29,383.58
2019-07-30,386.985
2019-07-31,387.655
2019-08-01,376.72
2019-08-02,366.6
2019-08-05,358.48
2019-08-06,358.395
2019-08-07,357.82
2019-08-08,358.06
2019-08-09,358.92
2019-08-12,350.705
2019-08-13,354.79
2019-08-14,348.6
2019-08-15,347.375
2019-08-16,350.25
2019-08-19,353.75
2019-08-20,343.97
2019-08-21,346.135
2019-08-22,342.18
2019-08-23,339.91
2019-08-26,340.57
2019-08-27,342.74
2019-08-28,347.25
2019-08-29,345.82
2019-08-30,351.8
2019-09-02,351.82
2019-09-03,352.45
2019-09-04,350.05
2019-09-05,356.94
2019-09-06,354.68
2019-09-09,360.26
2019-09-10,364.14
2019-09-11,372.07
2019-09-12,377.425
2019-09-13,379.71
2019-09-16,384.875
2019-09-17,386.76
2019-09-18,394.93
2019-09-19,395.985
2019-09-20,390.385
2019-09-23,387.7
2019-09-24,381.22
2019-09-25,391.395
2019-09-26,392.285
2019-09-27,393.23
2019-09-30,389.655
2019-10-01,383.765
2019-10-02,376.73
2019-10-03,376.39
2019-10-04,378.22
2019-10-07,376.94
2019-10-08,372.02
2019-10-09,370.14
2019-10-10,375.17
2019-10-11,385.215
2019-10-14,380.87
2019-10-15,383.86
2019-10-16,390.23
2019-10-17,394.15
2019-10-18,396.515
2019-10-21,397.935
2019-10-22,398.42
2019-10-23,412.245
2019-10-24,417.485
2019-10-25,411.44
2019-10-28,406.33
2019-10-29,409.74
2019-10-30,407.2
2019-10-31,405.035
2019-11-01,412.29
2019-11-04,416.7
2019-11-05,421.34
2019-11-06,424.535
2019-11-07,390.66
2019-11-08,386.795
2019-11-11,385.66
2019-11-12,379.225
2019-11-13,376.27
2019-11-14,373.395
2019-11-15,371.295
2019-11-18,368.96
2019-11-19,364.03
2019-11-20,362.705
2019-11-21,363.4
2019-11-22,361.075
2019-11-25,365.3
