date,close
2014-06-13,32.0109
2014-06-16,32.2331
2014-06-17,32.1451
2014-06-18,32.2748
2014-06-19,32.5896
2014-06-20,32.4368
2014-06-23,32.1683
2014-06-24,32.1081
2014-06-25,32.2239
2014-06-26,32.1313
2014-06-27,32.1729
2014-06-30,32.3859
2014-07-01,32.4924
2014-07-02,31.9738
2014-07-03,31.5525
2014-07-07,31.3997
2014-07-08,31.3025
2014-07-09,31.5664
2014-07-10,31.5016
2014-07-11,31.3534
2014-07-14,31.247
2014-07-15,31.5386
2014-07-16,31.4136
2014-07-17,31.2192
2014-07-18,31.3812
2014-07-21,31.3118
2014-07-22,30.8858
2014-07-23,30.8627
2014-07-24,30.8442
2014-07-25,30.6404
2014-07-28,30.6173
2014-07-29,30.6127
2014-07-30,30.3256
2014-07-31,29.7145
2014-08-01,30.358
2014-08-04,30.358
2014-08-05,30.534
2014-08-06,30.7747
2014-08-07,30.6173
2014-08-08,30.8731
2014-08-11,31.2778
2014-08-12,31.1708
2014-08-13,31.1895
2014-08-14,31.3662
2014-08-15,31.3011
2014-08-18,31.5104
2014-08-19,31.6314
2014-08-20,31.6314
2014-08-21,31.7244
2014-08-22,31.5151
2014-08-25,31.6825
2014-08-26,31.6221
2014-08-27,31.6639
2014-08-28,31.6221
2014-08-29,31.743
2014-09-02,31.957
2014-09-03,31.8872
2014-09-04,32.2128
2014-09-05,32.1896
2014-09-08,32.1105
2014-09-09,32.1151
2014-09-10,32.478
2014-09-11,32.4733
2014-09-12,32.25
2014-09-15,32.3663
2014-09-16,32.5803
2014-09-17,32.7152
2014-09-18,32.6175
2014-09-19,32.6222
2014-09-22,32.6361
2014-09-23,32.4733
2014-09-24,32.8734
2014-09-25,32.585
2014-09-26,32.7757
2014-09-29,32.8966
2014-09-30,32.6361
2014-10-01,32.4082
2014-10-02,32.3059
2014-10-03,32.4687
2014-10-06,32.2221
2014-10-07,32.2966
2014-10-08,32.7803
2014-10-09,32.2686
2014-10-10,32.1477
2014-10-13,31.7011
2014-10-14,31.7616
2014-10-15,31.6221
2014-10-16,31.6209
2014-10-17,31.8081
2014-10-20,32.371
2014-10-21,32.9385
2014-10-22,32.8175
2014-10-23,32.7617
2014-10-24,33.1292
2014-10-27,33.4548
2014-10-28,33.5711
2014-10-29,33.6502
2014-10-30,34.7269
2014-10-31,33.6827
2014-11-03,33.5432
2014-11-04,34.213
2014-11-05,34.0688
2014-11-06,34.119
2014-11-07,34.2264
2014-11-10,34.3245
2014-11-11,34.6095
2014-11-12,34.7263
2014-11-13,34.6889
2014-11-14,34.3479
2014-11-17,34.5161
2014-11-18,34.6749
2014-11-19,35.0579
2014-11-20,34.8571
2014-11-21,34.8104
2014-11-24,34.8057
2014-11-25,34.8711
2014-11-26,34.9972
2014-11-28,35.8334
2014-12-01,35.5017
2014-12-02,35.3802
2014-12-03,35.3475
2014-12-04,35.6512
2014-12-05,35.8941
2014-12-08,36.1744
2014-12-09,36.0716
2014-12-10,35.8614
2014-12-11,35.8754
2014-12-12,35.5017
2014-12-15,35.469
2014-12-16,35.4223
2014-12-17,36.0062
2014-12-18,36.6135
2014-12-19,36.6462
2014-12-22,36.7536
2014-12-23,37.6178
2014-12-24,37.445
2014-12-26,37.4543
2014-12-29,37.4169
2014-12-30,37.202
2014-12-31,36.8143
2015-01-02,36.9451
2015-01-05,36.5341
2015-01-06,36.2304
2015-01-07,36.6368
2015-01-08,37.3609
2015-01-09,37.2394
2015-01-12,37.132
2015-01-13,37.2161
2015-01-14,37.4496
2015-01-15,37.7533
2015-01-16,38.4633
2015-01-20,38.5334
2015-01-21,38.4399
2015-01-22,38.9538
2015-01-23,38.2998
2015-01-26,38.6548
2015-01-27,38.3138
2015-01-28,38.1223
2015-01-29,38.6174
2015-01-30,37.8
2015-02-02,38.3418
2015-02-03,38.6268
2015-02-04,39.0519
2015-02-05,38.879
2015-02-06,38.4405
2015-02-09,38.3748
2015-02-10,38.8767
2015-02-11,39.0455
2015-02-12,39.0971
2015-02-13,39.4114
2015-02-17,39.5474
2015-02-18,39.7584
2015-02-19,39.5005
2015-02-20,40.0398
2015-02-23,40.2884
2015-02-24,40.401
2015-02-25,40.1149
2015-02-26,40.0774
2015-02-27,39.932
2015-03-02,40.1196
2015-03-03,40.0961
2015-03-04,39.8147
2015-03-05,39.9883
2015-03-06,39.2894
2015-03-09,39.7115
2015-03-10,39.2144
2015-03-11,39.4161
2015-03-12,39.8288
2015-03-13,39.5661
2015-03-16,40.1008
2015-03-17,39.871
2015-03-18,40.0164
2015-03-19,40.0258
2015-03-20,40.401
2015-03-23,40.4198
2015-03-24,40.1055
2015-03-25,39.8616
2015-03-26,39.4911
2015-03-27,39.8522
2015-03-30,40.3025
2015-03-31,40.0633
2015-04-01,40.0539
2015-04-02,40.2275
2015-04-06,40.4479
2015-04-07,40.1243
2015-04-08,40.3259
2015-04-09,40.3025
2015-04-10,40.2884
2015-04-13,40.1571
2015-04-14,40.6027
2015-04-15,40.2087
2015-04-16,40.2181
2015-04-17,39.8945
2015-04-20,39.538
2015-04-21,39.4301
2015-04-22,39.28
2015-04-23,39.3176
2015-04-24,39.3738
2015-04-27,39.1628
2015-04-28,39.1722
2015-04-29,38.7454
2015-04-30,38.07
2015-05-01,38.4264
2015-05-04,38.6047
2015-05-05,38.2998
2015-05-06,38.3561
2015-05-07,38.7641
2015-05-08,39.0362
2015-05-11,39.1675
2015-05-12,39.1018
2015-05-13,38.8345
2015-05-14,39.303
2015-05-15,39.3784
2015-05-18,39.628
2015-05-19,39.8776
2015-05-20,39.967
2015-05-21,39.854
2015-05-22,39.7645
2015-05-26,39.6091
2015-05-27,39.7222
2015-05-28,39.8069
2015-05-29,39.5432
2015-06-01,39.8116
2015-06-02,39.5103
2015-06-03,39.7316
2015-06-04,39.2277
2015-06-05,38.9028
2015-06-08,38.8981
2015-06-09,39.1241
2015-06-10,39.369
2015-06-11,39.5197
2015-06-12,39.2418
2015-06-15,38.7709
2015-06-16,38.9922
2015-06-17,39.1759
2015-06-18,39.3549
2015-06-19,39.3643
2015-06-22,39.4773
2015-06-23,39.2183
2015-06-24,38.9169
2015-06-25,38.9969
2015-06-26,39.0017
2015-06-29,38.1634
2015-06-30,38.2058
2015-07-01,38.964
2015-07-02,38.672
2015-07-06,38.526
2015-07-07,39.3454
2015-07-08,39.3596
2015-07-09,39.1712
2015-07-10,39.6091
2015-07-13,39.967
2015-07-14,39.9435
2015-07-15,39.9341
2015-07-16,40.4097
2015-07-17,40.0141
2015-07-20,40.3579
2015-07-21,39.8964
2015-07-22,40.0801
2015-07-23,39.9247
2015-07-24,39.7881
2015-07-27,39.8493
2015-07-28,40.2684
2015-07-29,40.6499
2015-07-30,40.8665
2015-07-31,40.6546
2015-08-03,41.1538
2015-08-04,41.4457
2015-08-05,42.1427
2015-08-06,42.0768
2015-08-07,42.0886
2015-08-10,42.1548
2015-08-11,41.8002
2015-08-12,42.1122
2015-08-13,42.1926
2015-08-14,42.3769
2015-08-17,42.6936
2015-08-18,42.8118
2015-08-19,42.4242
2015-08-20,41.9042
2015-08-21,40.9825
2015-08-24,40.1694
2015-08-25,39.2099
2015-08-26,40.1742
2015-08-27,40.9068
2015-08-28,41.0534
2015-08-31,40.7839
2015-09-01,39.6684
2015-09-02,40.108
2015-09-03,40.6658
2015-09-04,40.1458
2015-09-08,40.8927
2015-09-09,40.2876
2015-09-10,40.1742
2015-09-11,39.7487
2015-09-14,39.4368
2015-09-15,39.8197
2015-09-16,39.9284
2015-09-17,40.1033
2015-09-18,39.6542
2015-09-21,40.0844
2015-09-22,39.7015
2015-09-23,39.7535
2015-09-24,40.0702
2015-09-25,40.4767
2015-09-28,39.9142
2015-09-29,39.9567
2015-09-30,39.6589
2015-10-01,39.6117
2015-10-02,40.2403
2015-10-05,40.8359
2015-10-06,40.4436
2015-10-07,40.8879
2015-10-08,41.1479
2015-10-09,41.4174
2015-10-12,41.7388
2015-10-13,41.5639
2015-10-14,41.1054
2015-10-15,41.3701
2015-10-16,41.7719
2015-10-19,41.6962
2015-10-20,41.6442
2015-10-21,41.5072
2015-10-22,41.9042
2015-10-23,41.5072
2015-10-26,41.2141
2015-10-27,40.9258
2015-10-28,41.3559
2015-10-29,40.8738
2015-10-30,40.6941
2015-11-02,40.368
2015-11-03,39.7582
2015-11-04,39.64
2015-11-05,39.2382
2015-11-06,38.8657
2015-11-09,38.5952
2015-11-10,39.5064
2015-11-11,39.6061
2015-11-12,39.1979
2015-11-13,39.1694
2015-11-16,39.663
2015-11-17,39.6156
2015-11-18,40.2705
2015-11-19,40.6502
2015-11-20,40.6882
2015-11-23,40.9587
2015-11-24,41.1153
2015-11-25,41.2625
2015-11-27,41.3431
2015-11-30,40.7072
2015-12-01,41.2245
2015-12-02,40.7024
2015-12-03,40.4461
2015-12-04,41.1675
2015-12-07,41.3242
2015-12-08,41.2435
2015-12-09,40.7926
2015-12-10,40.3132
2015-12-11,39.7959
2015-12-14,39.8624
2015-12-15,40.1139
2015-12-16,40.598
2015-12-17,40.4556
2015-12-18,39.4969
2015-12-21,39.9288
2015-12-22,40.4983
2015-12-23,41.196
2015-12-24,41.0252
2015-12-28,40.5078
2015-12-29,40.9445
2015-12-30,40.878
2015-12-31,40.2848
2016-01-04,39.6345
2016-01-05,39.2976
2016-01-06,39.1125
2016-01-07,38.4813
2016-01-08,38.9464
2016-01-11,39.2121
2016-01-12,39.739
2016-01-13,37.328
2016-01-14,37.1286
2016-01-15,37.4608
2016-01-19,37.4751
2016-01-20,37.2663
2016-01-21,37.5937
2016-01-22,38.4765
2016-01-25,37.7076
2016-01-26,38.1158
2016-01-27,38.2107
2016-01-28,38.7233
2016-01-29,39.8671
2016-02-01,40.3749
2016-02-02,40.7119
2016-02-03,41.3242
2016-02-04,41.1675
2016-02-05,41.2435
2016-02-08,41.4096
2016-02-09,41.9981
2016-02-10,41.9649
2016-02-11,41.2763
2016-02-12,42.2103
2016-02-16,42.7154
2016-02-17,42.8298
2016-02-18,42.6535
2016-02-19,42.6058
2016-02-22,42.968
2016-02-23,43.3253
2016-02-24,43.6589
2016-02-25,43.9401
2016-02-26,43.697
2016-02-29,43.2491
2016-03-01,43.3539
2016-03-02,43.5303
2016-03-03,43.7209
2016-03-04,43.7352
2016-03-07,43.1967
2016-03-08,43.3301
2016-03-09,42.968
2016-03-10,43.0299
2016-03-11,43.3539
2016-03-14,43.1729
2016-03-15,43.6065
2016-03-16,43.7923
2016-03-17,43.8352
2016-03-18,43.7113
2016-03-21,43.84
2016-03-22,43.5922
2016-03-23,43.6351
2016-03-24,43.5779
2016-03-28,43.8305
2016-03-29,43.9782
2016-03-30,43.8972
2016-03-31,43.9258
2016-04-01,44.6501
2016-04-04,44.0973
2016-04-05,44.7644
2016-04-06,44.9932
2016-04-07,44.7549
2016-04-08,44.8455
2016-04-11,44.5309
2016-04-12,44.6691
2016-04-13,44.5452
2016-04-14,44.3308
2016-04-15,44.7501
2016-04-18,44.4499
2016-04-19,44.9169
2016-04-20,44.4404
2016-04-21,43.5064
2016-04-22,43.8543
2016-04-25,44.0687
2016-04-26,43.8686
2016-04-27,43.9782
2016-04-28,44.2117
2016-04-29,44.1736
2016-05-02,44.55
2016-05-03,44.6263
2016-05-04,44.7406
2016-05-05,45.3267
2016-05-06,46.1464
2016-05-09,46.2607
2016-05-10,46.6658
2016-05-11,46.0946
2016-05-12,46.5705
2016-05-13,46.1783
2016-05-16,46.1352
2016-05-17,45.7191
2016-05-18,46.3839
2016-05-19,47.3931
2016-05-20,46.1448
2016-05-23,46.757
2016-05-24,46.8192
2016-05-25,46.5609
2016-05-26,46.9627
2016-05-27,46.9531
2016-05-31,47.1014
2016-06-01,47.3214
2016-06-02,47.4601
2016-06-03,47.2927
2016-06-06,47.1636
2016-06-07,47.4123
2016-06-08,47.2879
2016-06-09,47.7471
2016-06-10,47.771
2016-06-13,47.417
2016-06-14,47.6801
2016-06-15,47.3023
2016-06-16,47.5414
2016-06-17,47.1444
2016-06-20,47.4649
2016-06-21,47.6705
2016-06-22,47.9432
2016-06-23,48.0723
2016-06-24,46.9579
2016-06-27,47.2257
2016-06-28,47.8188
2016-06-29,47.7901
2016-06-30,49.2106
2016-07-01,48.9332
2016-07-05,49.4258
2016-07-06,48.4549
2016-07-07,48.144
2016-07-08,48.4501
2016-07-11,48.6367
2016-07-12,47.6227
2016-07-13,47.8188
2016-07-14,47.8092
2016-07-15,47.9671
2016-07-18,47.7518
2016-07-19,48.1727
2016-07-20,47.6466
2016-07-21,47.5414
2016-07-22,47.9671
2016-07-25,48.0005
2016-07-26,47.2736
2016-07-27,46.7522
2016-07-28,47.1157
2016-07-29,46.9866
2016-08-01,47.4457
2016-08-02,46.9531
2016-08-03,46.69
2016-08-04,48.3927
2016-08-05,48.0771
2016-08-08,47.8618
2016-08-09,48.2827
2016-08-10,48.418
2016-08-11,48.0658
2016-08-12,48.1425
2016-08-15,47.9269
2016-08-16,47.5723
2016-08-17,47.5436
2016-08-18,47.879
2016-08-19,47.6298
2016-08-22,47.8358
2016-08-23,47.7736
2016-08-24,47.5052
2016-08-25,47.764
2016-08-26,47.4813
2016-08-29,47.9125
2016-08-30,47.6394
2016-08-31,47.6346
2016-09-01,47.7927
2016-09-02,47.8838
2016-09-06,48.2096
2016-09-07,47.0788
2016-09-08,46.4751
2016-09-09,45.4115
2016-09-12,45.5552
2016-09-13,44.9994
2016-09-14,44.8557
2016-09-15,45.1432
2016-09-16,44.8461
2016-09-19,44.9803
2016-09-20,45.4402
2016-09-21,45.8523
2016-09-22,46.7626
2016-09-23,46.1302
2016-09-26,45.9864
2016-09-27,45.9481
2016-09-28,46.3122
2016-09-29,45.5744
2016-09-30,45.9193
2016-10-03,45.0377
2016-10-04,44.3095
2016-10-05,44.3286
2016-10-06,44.4724
2016-10-07,44.9611
2016-10-10,45.0473
2016-10-11,45.009
2016-10-12,45.8427
2016-10-13,45.7852
2016-10-14,45.9193
2016-10-17,46.2643
2016-10-18,46.1876
2016-10-19,45.7469
2016-10-20,45.5073
2016-10-21,45.5265
2016-10-24,45.354
2016-10-25,46.1014
2016-10-26,45.8331
2016-10-27,45.7373
2016-10-28,46.226
2016-10-31,46.2451
2016-11-01,45.6031
2016-11-02,45.2773
2016-11-03,42.278
2016-11-04,41.9522
2016-11-07,42.575
2016-11-08,43.9262
2016-11-09,43.6387
2016-11-10,41.5785
2016-11-11,41.8851
2016-11-14,42.2579
2016-11-15,42.8834
2016-11-16,42.9218
2016-11-17,42.7486
2016-11-18,43.095
2016-11-21,43.1239
2016-11-22,43.1624
2016-11-23,42.9699
2016-11-25,43.3548
2016-11-28,43.1624
2016-11-29,43.1431
2016-11-30,42.1329
2016-12-01,41.1515
2016-12-02,41.7672
2016-12-05,42.4889
2016-12-06,43.0565
2016-12-07,43.1816
2016-12-08,42.1329
2016-12-09,42.6428
2016-12-12,42.7871
2016-12-13,42.6524
2016-12-14,43.0565
2016-12-15,43.1528
2016-12-16,43.2586
2016-12-19,42.9411
2016-12-20,43.0469
2016-12-21,42.8834
2016-12-22,42.8256
2016-12-23,43.0277
2016-12-27,43.3259
2016-12-28,42.4792
2016-12-29,43.1239
2016-12-30,42.5177
2017-01-03,42.6621
2017-01-04,43.0084
2017-01-05,43.1912
2017-01-06,43.172
2017-01-09,42.6236
2017-01-10,41.9308
2017-01-11,41.9116
2017-01-12,41.825
2017-01-13,42.1232
2017-01-17,42.8352
2017-01-18,43.0469
2017-01-19,43.2297
2017-01-20,43.8263
2017-01-23,43.807
2017-01-24,44.3458
2017-01-25,44.4805
2017-01-26,44.3555
2017-01-27,43.6242
2017-01-30,43.5953
2017-01-31,43.5088
2017-02-01,43.5376
2017-02-02,43.807
2017-02-03,44.0764
2017-02-06,43.73
2017-02-07,45.4812
2017-02-08,46.02
2017-02-09,46.2509
2017-02-10,46.4145
2017-02-13,46.5877
2017-02-14,46.6935
2017-02-15,46.9437
2017-02-16,47.2624
2017-02-17,48.0062
2017-02-21,47.9192
2017-02-22,47.9965
2017-02-23,47.9289
2017-02-24,47.8419
2017-02-27,47.8709
2017-02-28,48.1414
2017-03-01,48.5181
2017-03-02,48.4795
2017-03-03,48.151
2017-03-06,47.9772
2017-03-07,47.8613
2017-03-08,47.8226
2017-03-09,47.9385
2017-03-10,48.3249
2017-03-13,48.151
2017-03-14,48.0545
2017-03-15,48.4698
2017-03-16,48.4022
2017-03-17,48.3925
2017-03-20,48.4795
2017-03-21,48.6243
2017-03-22,48.5664
2017-03-23,48.6243
2017-03-24,48.5084
2017-03-27,48.5664
2017-03-28,48.5471
2017-03-29,48.3346
2017-03-30,48.3249
2017-03-31,48.1704
2017-04-03,48.1897
2017-04-04,48.0545
2017-04-05,47.8806
2017-04-06,48.0641
2017-04-07,47.8613
2017-04-10,48.18
2017-04-11,48.3056
2017-04-12,48.3152
2017-04-13,48.1027
2017-04-17,48.6243
2017-04-18,48.9721
2017-04-19,48.9238
2017-04-20,48.5567
2017-04-21,48.5374
2017-04-24,48.6726
2017-04-25,48.5857
2017-04-26,48.0931
2017-04-27,48.0834
2017-04-28,47.8419
2017-05-01,47.6391
2017-05-02,47.1658
2017-05-03,47.0885
2017-05-04,49.117
2017-05-05,49.0493
2017-05-08,48.8948
2017-05-09,48.576
2017-05-10,49.1363
2017-05-11,48.9431
2017-05-12,48.6716
2017-05-15,48.7201
2017-05-16,47.9736
2017-05-17,48.1966
2017-05-18,48.1675
2017-05-19,48.2256
2017-05-22,48.4971
2017-05-23,48.7783
2017-05-24,49.1855
2017-05-25,49.6412
2017-05-26,49.5442
2017-05-30,49.9611
2017-05-31,50.0872
2017-06-01,50.6592
2017-06-02,50.9695
2017-06-05,51.018
2017-06-06,51.2119
2017-06-07,51.6385
2017-06-08,51.2119
2017-06-09,51.3864
2017-06-12,51.2894
2017-06-13,51.1925
2017-06-14,51.5609
2017-06-15,51.9196
2017-06-16,51.5803
2017-06-19,52.1135
2017-06-20,51.9002
2017-06-21,51.4058
2017-06-22,51.2313
2017-06-23,51.4252
2017-06-26,51.4736
2017-06-27,51.0761
2017-06-28,50.9792
2017-06-29,50.2326
2017-06-30,50.3005
2017-07-03,50.4362
2017-07-05,50.2035
2017-07-06,50.3684
2017-07-07,50.4168
2017-07-10,50.7174
2017-07-11,50.5913
2017-07-12,50.3199
2017-07-13,50.4168
2017-07-14,51.018
2017-07-17,51.7063
2017-07-18,51.9972
2017-07-19,51.3379
2017-07-20,51.3767
2017-07-21,51.6385
2017-07-24,51.1925
2017-07-25,51.7063
2017-07-26,52.036
2017-07-27,52.162
2017-07-28,51.6773
2017-07-31,51.7257
2017-08-01,51.3961
2017-08-02,51.1246
2017-08-03,50.1938
2017-08-04,48.8558
2017-08-07,48.7589
2017-08-08,48.1869
2017-08-09,48.4002
2017-08-10,48.0705
2017-08-11,48.2944
2017-08-14,48.6447
2017-08-15,48.4403
2017-08-16,48.927
2017-08-17,48.5182
2017-08-18,48.7129
2017-08-21,49.0535
2017-08-22,49.0243
2017-08-23,48.7129
2017-08-24,48.2749
2017-08-25,48.4111
2017-08-28,48.4111
2017-08-29,48.197
2017-08-30,48.2749
2017-08-31,48.8297
2017-09-01,48.8686
2017-09-05,49.0438
2017-09-06,48.489
2017-09-07,48.1581
2017-09-08,47.8077
2017-09-11,48.2944
2017-09-12,48.1094
2017-09-13,47.9634
2017-09-14,48.3333
2017-09-15,49.0827
2017-09-18,49.2579
2017-09-19,49.219
2017-09-20,48.3625
2017-09-21,47.1945
2017-09-22,47.3113
2017-09-25,47.1751
2017-09-26,47.4379
2017-09-27,46.7566
2017-09-28,46.8344
2017-09-29,47.1556
2017-10-02,46.6495
2017-10-03,46.0947
2017-10-04,46.3673
2017-10-05,46.6495
2017-10-06,46.1823
2017-10-09,45.7638
2017-10-10,46.1142
2017-10-11,46.1337
2017-10-12,46.4451
2017-10-13,46.6787
2017-10-16,46.5814
2017-10-17,46.4256
2017-10-18,46.1434
2017-10-19,46.0169
2017-10-20,44.9463
2017-10-23,44.956
2017-10-24,44.4985
2017-10-25,44.5375
2017-10-26,44.5375
2017-10-27,44.1092
2017-10-30,43.6129
2017-10-31,43.9632
2017-11-01,44.9463
2017-11-02,44.2163
2017-11-03,42.7466
2017-11-06,42.1627
2017-11-07,42.5909
2017-11-08,43.2625
2017-11-09,42.8245
2017-11-10,43.5545
2017-11-13,44.3234
2017-11-14,44.7045
2017-11-15,43.4046
2017-11-16,44.1181
2017-11-17,43.7369
2017-11-20,43.6685
2017-11-21,43.7858
2017-11-22,43.7467
2017-11-24,43.8053
2017-11-27,44.079
2017-11-28,44.6166
2017-11-29,45.7307
2017-11-30,46.024
2017-12-01,45.7796
2017-12-04,47.2554
2017-12-05,47.187
2017-12-06,46.7081
2017-12-07,47.0404
2017-12-08,47.3043
2017-12-11,46.8743
2017-12-12,47.2945
2017-12-13,47.0404
2017-12-14,47.3629
2017-12-15,47.9494
2017-12-18,48.1448
2017-12-19,48.1057
2017-12-20,48.3599
2017-12-21,48.3794
2017-12-22,48.9169
2017-12-26,49.0245
2017-12-27,48.9267
2017-12-28,49.044
2017-12-29,49.0342
2018-01-02,48.311
2018-01-03,47.9982
2018-01-04,48.8094
2018-01-05,48.9365
2018-01-08,49.2981
2018-01-09,49.2493
2018-01-10,48.6628
2018-01-11,48.2523
2018-01-12,47.9103
2018-01-16,48.1351
2018-01-17,48.7215
2018-01-18,48.3501
2018-01-19,48.7801
2018-01-22,48.9756
2018-01-23,48.7312
2018-01-24,47.9982
2018-01-25,48.223
2018-01-26,47.9982
2018-01-29,47.8223
2018-01-30,47.9885
2018-01-31,47.7441
2018-02-01,47.3923
2018-02-02,45.2812
2018-02-05,46.3465
2018-02-06,46.7863
2018-02-07,46.2976
2018-02-08,46.3074
2018-02-09,47.4607
2018-02-12,47.5291
2018-02-13,47.5389
2018-02-14,47.988
2018-02-15,48.8029
2018-02-16,48.8716
2018-02-20,47.4972
2018-02-21,47.0652
2018-02-22,47.291
2018-02-23,48.2237
2018-02-26,49.0778
2018-02-27,48.5673
2018-02-28,48.2924
2018-03-01,48.1942
2018-03-02,49.1171
2018-03-05,49.4999
2018-03-06,49.8435
2018-03-07,49.0483
2018-03-08,50.0497
2018-03-09,49.6668
2018-03-12,49.6374
2018-03-13,49.8141
2018-03-14,48.9305
2018-03-15,48.636
2018-03-16,49.0974
2018-03-19,49.2741
2018-03-20,48.7734
2018-03-21,48.096
2018-03-22,47.4972
2018-03-23,46.4369
2018-03-26,46.5056
2018-03-27,47.2812
2018-03-28,48.3415
2018-03-29,49.441
2018-04-02,48.0371
2018-04-03,48.744
2018-04-04,49.549
2018-04-05,48.9502
2018-04-06,48.5967
2018-04-09,48.5673
2018-04-10,48.7734
2018-04-11,48.4789
2018-04-12,47.9095
2018-04-13,48.0568
2018-04-16,49.1858
2018-04-17,49.4018
2018-04-18,49.3527
2018-04-19,47.831
2018-04-20,45.0035
2018-04-23,44.5814
2018-04-24,44.6304
2018-04-25,45.0526
2018-04-26,45.298
2018-04-27,45.9264
2018-04-30,45.3569
2018-05-01,45.4551
2018-05-02,45.033
2018-05-03,46.6823
2018-05-04,46.486
2018-05-07,46.6529
2018-05-08,46.859
2018-05-09,46.8787
2018-05-10,46.8983
2018-05-11,46.5939
2018-05-14,46.3942
2018-05-15,45.8814
2018-05-16,45.9701
2018-05-17,46.049
2018-05-18,45.4869
2018-05-21,45.7729
2018-05-22,45.8321
2018-05-23,46.4436
2018-05-24,46.0885
2018-05-25,46.769
2018-05-29,46.9564
2018-05-30,47.4693
2018-05-31,46.3055
2018-06-01,46.6704
2018-06-04,46.3646
2018-06-05,46.1181
2018-06-06,46.0984
2018-06-07,46.7493
2018-06-08,47.5285
2018-06-11,48.1794
2018-06-12,49.0079
2018-06-13,48.9487
2018-06-14,49.1163
2018-06-15,49.57
2018-06-18,49.5898
2018-06-19,50.7338
2018-06-20,50.0533
2018-06-21,49.9941
2018-06-22,49.935
2018-06-25,50.8621
2018-06-26,50.9804
2018-06-27,51.5623
2018-06-28,52.4401
2018-06-29,52.4302
2018-07-02,52.2132
2018-07-03,52.5486
2018-07-05,53.5644
2018-07-06,53.9096
2018-07-09,52.7162
2018-07-10,53.7222
2018-07-11,53.9096
2018-07-12,54.1759
2018-07-13,55.1227
2018-07-16,54.1167
2018-07-17,54.0181
2018-07-18,53.0516
2018-07-19,53.3968
2018-07-20,54.2252
2018-07-23,54.0181
2018-07-24,53.9195
2018-07-25,54.1957
2018-07-26,54.5507
2018-07-27,54.6
2018-07-30,54.531
2018-07-31,55.1326
2018-08-01,54.3929
2018-08-02,56.0104
2018-08-03,56.3852
2018-08-06,56.6712
2018-08-07,55.6948
2018-08-08,55.1721
2018-08-09,54.8071
2018-08-10,54.9748
2018-08-13,55.1227
2018-08-14,54.9025
2018-08-15,55.5064
2018-08-16,56.2886
2018-08-17,56.5857
2018-08-20,57.0609
2018-08-21,56.2292
2018-08-22,55.8035
2018-08-23,55.9619
2018-08-24,55.7738
2018-08-27,55.6451
2018-08-28,55.8926
2018-08-29,55.9421
2018-08-30,55.8233
2018-08-31,56.0213
2018-09-04,55.9223
2018-09-05,57.1302
2018-09-06,57.5461
2018-09-07,58.1105
2018-09-10,57.9025
2018-09-11,58.4174
2018-09-12,58.8432
2018-09-13,58.863
2018-09-14,58.962
2018-09-17,59.2095
2018-09-18,59.1303
2018-09-19,58.4075
2018-09-20,59.0709
2018-09-21,59.4471
2018-09-24,58.5164
2018-09-25,58.4273
2018-09-26,58.8135
2018-09-27,58.3085
2018-09-28,58.7838
2018-10-01,58.962
2018-10-02,59.5462
2018-10-03,58.5065
2018-10-04,57.7243
2018-10-05,58.6055
2018-10-08,59.2095
2018-10-09,58.8333
2018-10-10,55.4074
2018-10-11,54.3282
2018-10-12,55.5163
2018-10-15,56.4867
2018-10-16,57.9323
2018-10-17,57.9323
2018-10-18,58.4867
2018-10-19,59.7343
2018-10-22,59.2986
2018-10-23,58.8729
2018-10-24,59.3283
2018-10-25,58.6946
2018-10-26,57.457
2018-10-29,58.2986
2018-10-30,59.6353
2018-10-31,58.7838
2018-11-01,64.2294
2018-11-02,65.4077
2018-11-05,65.9325
2018-11-06,67.2097
2018-11-07,65.4572
2018-11-08,63.7938
2018-11-09,64.9027
2018-11-12,65.3582
2018-11-13,64.8928
2018-11-14,65.0493
2018-11-15,65.3772
2018-11-16,64.9699
2018-11-19,64.3937
2018-11-20,63.9963
2018-11-21,65.099
2018-11-23,65.5063
2018-11-26,65.2083
2018-11-27,65.7745
2018-11-28,65.9136
2018-11-29,65.5262
2018-11-30,65.7547
2018-12-03,65.9732
2018-12-04,66.162
2018-12-06,66.2812
2018-12-07,66.3706
2018-12-10,66.1421
2018-12-11,67.9501
2018-12-12,67.3938
2018-12-13,68.725
2018-12-14,68.278
2018-12-17,65.0394
2018-12-18,65.0891
2018-12-19,64.3341
2018-12-20,64.2347
2018-12-21,64.4731
2018-12-24,62.2479
2018-12-26,64.4334
2018-12-27,65.2778
2018-12-28,65.3175
2018-12-31,65.3275
2019-01-02,64.0062
2019-01-03,63.8672
2019-01-04,64.6321
2019-01-07,65.4467
2019-01-08,65.2877
2019-01-09,65.3871
2019-01-10,66.5891
2019-01-11,66.7083
2019-01-14,66.2514
2019-01-15,66.9368
2019-01-16,66.9269
2019-01-17,66.9468
2019-01-18,67.9104
2019-01-22,65.8043
2019-01-23,65.0791
2019-01-24,63.8771
2019-01-25,63.1718
2019-01-28,63.2016
2019-01-29,63.3009
2019-01-30,62.7843
2019-01-31,64.185
2019-02-01,64.2447
2019-02-04,64.94
2019-02-05,60.0623
2019-02-06,62.3671
2019-02-07,62.1684
2019-02-08,62.9234
2019-02-11,63.7579
2019-02-12,63.7281
2019-02-13,64.3937
2019-02-14,64.1519
2019-02-15,64.4909
2019-02-19,64.7601
2019-02-20,64.7401
2019-02-21,65.9464
2019-02-22,66.076
2019-02-25,65.099
2019-02-26,65.3981
2019-02-27,65.5377
2019-02-28,65.5975
2019-03-01,65.3781
2019-03-04,65.6872
2019-03-05,65.428
2019-03-06,65.1588
2019-03-07,65.428
2019-03-08,65.4479
2019-03-11,66.2455
2019-03-12,66.1956
2019-03-13,66.734
2019-03-14,66.724
2019-03-15,67.1925
2019-03-18,66.6542
2019-03-19,66.1757
2019-03-20,65.6174
2019-03-21,66.5645
2019-03-22,66.8935
2019-03-25,67.8007
2019-03-26,68.5583
2019-03-27,69.1365
2019-03-28,71.7285
2019-03-29,71.0108
2019-04-01,71.7485
2019-04-02,71.7884
2019-04-03,71.918
2019-04-04,72.4264
2019-04-05,72.0874
2019-04-08,72.1373
2019-04-09,72.7853
2019-04-10,72.9946
2019-04-11,73.4732
2019-04-12,73.6626
2019-04-15,73.5429
2019-04-16,73.3436
2019-04-17,73.4233
2019-04-18,73.6028
2019-04-22,73.523
2019-04-23,73.214
2019-04-24,73.0544
2019-04-25,73.1741
2019-04-26,73.8919
2019-04-29,73.5629
2019-04-30,74.7193
2019-05-01,73.4133
2019-05-02,74.4302
2019-05-03,74.1112
2019-05-06,73.6227
2019-05-07,72.6557
2019-05-08,72.9548
2019-05-09,72.4264
2019-05-10,73.2837
2019-05-13,73.6825
2019-05-14,72.47
2019-05-15,73.61
2019-05-16,74.1
2019-05-17,73.88
2019-05-20,73.97
2019-05-21,74
2019-05-22,74.14
2019-05-23,75.18
2019-05-24,74.71
2019-05-28,73.09
2019-05-29,73.37
2019-05-30,74.87
2019-05-31,74.41
2019-06-03,75.97
2019-06-04,75.11
2019-06-05,77.02
2019-06-06,77.82
2019-06-07,77.98
2019-06-10,77.29
2019-06-11,76.69
2019-06-12,76.79
2019-06-13,76.745
2019-06-14,77.19
2019-06-17,77.325
2019-06-18,76.18
2019-06-19,76.105
2019-06-20,76.275
2019-06-21,76.23
2019-06-24,76.135
2019-06-25,75.48
2019-06-26,72.92
2019-06-27,73.36
2019-06-28,72.85
2019-07-01,73.055
2019-07-02,73.985
2019-07-03,75.03
2019-07-04,75.03
2019-07-05,74.27
2019-07-08,74.105
2019-07-09,73.53
2019-07-10,74.325
2019-07-11,74.795
2019-07-12,75.05
2019-07-15,75.34
2019-07-16,75.355
2019-07-17,75.425
2019-07-18,76.63
2019-07-19,75.6
2019-07-22,75.4
2019-07-23,75.075
2019-07-24,73.97
2019-07-25,74.39
2019-07-26,75.87
2019-07-29,76.14
2019-07-30,76.475
2019-07-31,75.465
2019-08-01,74.39
2019-08-02,74.26
2019-08-05,74.26
2019-08-06,74.745
2019-08-07,75.905
2019-08-08,77.085
2019-08-09,76.61
2019-08-12,77.005
2019-08-13,78.37
2019-08-14,77.71
2019-08-15,79.1
2019-08-16,79.77
2019-08-19,79.67
2019-08-20,78.185
2019-08-21,78.92
2019-08-22,79.48
2019-08-23,78.21
2019-08-26,79.02
2019-08-27,79.91
2019-08-28,80.35
2019-08-29,79.94
2019-08-30,79.99
2019-09-02,79.81
2019-09-03,79.895
2019-09-04,80.21
2019-09-05,77.455
2019-09-06,75.83
2019-09-09,73.77
2019-09-10,71.58
2019-09-11,71.88
2019-09-12,72.72
2019-09-13,72.02
2019-09-16,72.365
2019-09-17,72.74
2019-09-18,72.74
2019-09-19,72.805
2019-09-20,73
2019-09-23,73.36
2019-09-24,73.87
2019-09-25,73.36
2019-09-26,74.55
2019-09-27,75.615
2019-09-30,75.145
2019-10-01,75.495
2019-10-02,74.73
2019-10-03,75.06
2019-10-04,75.995
2019-10-07,76.135
2019-10-08,75.6
2019-10-09,75.92
2019-10-10,75.635
2019-10-11,74.26
2019-10-14,73.625
2019-10-15,72.71
2019-10-16,72.975
2019-10-17,73.775
2019-10-18,73.99
2019-10-21,73.625
2019-10-22,74.045
2019-10-23,75.155
2019-10-24,75.7
2019-10-25,74.985
2019-10-28,74.695
2019-10-29,73.675
2019-10-30,75.425
2019-10-31,69.82
2019-11-01,68.61
2019-11-04,67.145
2019-11-05,67.13
2019-11-06,67.525
2019-11-07,67.125
2019-11-08,67.485
2019-11-11,67.505
2019-11-12,67.01
2019-11-13,68.38
2019-11-14,67.925
2019-11-15,67.36
2019-11-18,68.005
2019-11-19,68.95
2019-11-20,69.82
2019-11-21,69.03
2019-11-22,68.96
2019-11-25,68.75
