date,close
2014-06-13,10.43
2014-06-16,10.43
2014-06-17,10.39
2014-06-18,10.46
2014-06-19,10.84
2014-06-20,11.17
2014-06-23,10.75
2014-06-24,10.52
2014-06-25,10.43
2014-06-26,10.76
2014-06-27,11.78
2014-06-30,12.32
2014-07-01,11.92
2014-07-02,11.64
2014-07-03,11.63
2014-07-07,11.57
2014-07-08,11.78
2014-07-09,11.75
2014-07-10,11.62
2014-07-11,11.45
2014-07-14,12.13
2014-07-15,11.98
2014-07-16,12.77
2014-07-17,13.07
2014-07-18,12.93
2014-07-21,13.08
2014-07-22,13.98
2014-07-23,13.74
2014-07-24,13.63
2014-07-25,13.59
2014-07-28,13.56
2014-07-29,13.85
2014-07-30,13.9
2014-07-31,13.22
2014-08-01,13.25
2014-08-04,13.1
2014-08-05,12.98
2014-08-06,13
2014-08-07,12.94
2014-08-08,12.87
2014-08-11,12.85
2014-08-12,12.98
2014-08-13,12.6
2014-08-14,12.81
2014-08-15,12.05
2014-08-18,12
2014-08-19,12.04
2014-08-20,12.32
2014-08-21,12.44
2014-08-22,12.49
2014-08-25,12.82
2014-08-26,13.1
2014-08-27,12.85
2014-08-28,12.84
2014-08-29,12.74
2014-09-02,12.86
2014-09-03,12.71
2014-09-04,12.68
2014-09-05,12.73
2014-09-08,12.49
2014-09-09,12.32
2014-09-10,12.28
2014-09-11,12.43
2014-09-12,12.43
2014-09-15,12.52
2014-09-16,12.4
2014-09-17,12.24
2014-09-18,11.87
2014-09-19,12.32
2014-09-22,12.22
2014-09-23,11.8
2014-09-24,11.44
2014-09-25,10.59
2014-09-26,10.79
2014-09-29,10.67
2014-09-30,10.79
2014-10-01,10.54
2014-10-02,10.3
2014-10-03,10.53
2014-10-06,10.12
2014-10-07,9.89
2014-10-08,9.98
2014-10-09,9.22
2014-10-10,9.57
2014-10-13,9.51
2014-10-14,9.61
2014-10-15,9.32
2014-10-16,9.15
2014-10-17,9.45
2014-10-20,9.12
2014-10-21,8.79
2014-10-22,9.83
2014-10-23,9.62
2014-10-24,9.51
2014-10-27,9.39
2014-10-28,9.71
2014-10-29,9.51
2014-10-30,9.95
2014-10-31,10.12
2014-11-03,10.26
2014-11-04,10.5
2014-11-05,10.6
2014-11-06,10.59
2014-11-07,11.05
2014-11-10,11.3
2014-11-11,9.23
2014-11-12,8.7
2014-11-13,8.46
2014-11-14,8.25
2014-11-17,7.41
2014-11-18,7.61
2014-11-19,7.68
2014-11-20,7.65
2014-11-21,7.52
2014-11-24,7.54
2014-11-25,7.29
2014-11-26,7.32
2014-11-28,7.35
2014-12-01,6.91
2014-12-02,6.59
2014-12-03,6.32
2014-12-04,6.09
2014-12-05,6.25
2014-12-08,6.11
2014-12-09,6.16
2014-12-10,6.26
2014-12-11,6.45
2014-12-12,6.48
2014-12-15,6.67
2014-12-16,6.73
2014-12-17,7.12
2014-12-18,7.5
2014-12-19,7.99
2014-12-22,7.95
2014-12-23,7.67
2014-12-24,7.51
2014-12-26,7.16
2014-12-29,6.92
2014-12-30,6.81
2014-12-31,7.16
2015-01-02,7.42
2015-01-05,7.49
2015-01-06,7.37
2015-01-07,7.51
2015-01-08,7.76
2015-01-09,7.34
2015-01-12,7.18
2015-01-13,7.1
2015-01-14,7.31
2015-01-15,6.97
2015-01-16,7.12
2015-01-20,7.1
2015-01-21,7.11
2015-01-22,7.15
2015-01-23,7.18
2015-01-26,7.05
2015-01-27,7
2015-01-28,7.0336
2015-01-29,7.01
2015-01-30,7.09
2015-02-02,7.02
2015-02-03,6.98
2015-02-04,6.96
2015-02-05,7.02
2015-02-06,7.26
2015-02-09,7.74
2015-02-10,7.79
2015-02-11,7.9
2015-02-12,7.87
2015-02-13,8.03
2015-02-17,7.995
2015-02-18,8.06
2015-02-19,7.9
2015-02-20,7.77
2015-02-23,7.55
2015-02-24,7.16
2015-02-25,7.13
2015-02-26,7.09
2015-02-27,7.18
2015-03-02,7.26
2015-03-03,7.49
2015-03-04,7.77
2015-03-05,7.71
2015-03-06,7.44
2015-03-09,7.17
2015-03-10,7.03
2015-03-11,7.21
2015-03-12,7.21
2015-03-13,6.98
2015-03-16,7.35
2015-03-17,7.17
2015-03-18,7.53
2015-03-19,9.24
2015-03-20,9.13
2015-03-23,9.37
2015-03-24,9.07
2015-03-25,8.79
2015-03-26,8.62
2015-03-27,8.51
2015-03-30,7.87
2015-03-31,7.81
2015-04-01,7.75
2015-04-02,8
2015-04-06,7.995
2015-04-07,8.07
2015-04-08,7.97
2015-04-09,7.86
2015-04-10,7.73
2015-04-13,7.68
2015-04-14,7.92
2015-04-15,7.89
2015-04-16,7.74
2015-04-17,7.75
2015-04-20,7.85
2015-04-21,7.6
2015-04-22,7.36
2015-04-23,7.57
2015-04-24,7.55
2015-04-27,7.51
2015-04-28,7.66
2015-04-29,8.05
2015-04-30,7.56
2015-05-01,7.45
2015-05-04,7.43
2015-05-05,7.43
2015-05-06,7.45
2015-05-07,7.75
2015-05-08,7.96
2015-05-11,7.99
2015-05-12,7.69
2015-05-13,7.75
2015-05-14,5.86
2015-05-15,5.84
2015-05-18,5.47
2015-05-19,4.965
2015-05-20,5.2
2015-05-21,4.96
2015-05-22,4.995
2015-05-26,4.87
2015-05-27,4.95
2015-05-28,5.03
2015-05-29,5.03
2015-06-01,4.88
2015-06-02,4.88
2015-06-03,4.86
2015-06-04,4.73
2015-06-05,4.83
2015-06-08,4.72
2015-06-09,4.79
2015-06-10,4.76
2015-06-11,4.95
2015-06-12,5.1
2015-06-15,5.04
2015-06-16,5.01
2015-06-17,4.92
2015-06-18,4.92
2015-06-19,4.58
2015-06-22,5.02
2015-06-23,5
2015-06-24,4.88
2015-06-25,4.7801
2015-06-26,4.99
2015-06-29,4.94
2015-06-30,4.97
2015-07-01,4.95
2015-07-02,4.96
2015-07-06,4.96
2015-07-07,4.77
2015-07-08,4.69
2015-07-09,4.89
2015-07-10,5.27
2015-07-13,5.14
2015-07-14,5.18
2015-07-15,5.09
2015-07-16,5.19
2015-07-17,5.09
2015-07-20,4.92
2015-07-21,4.84
2015-07-22,4.87
2015-07-23,4.85
2015-07-24,4.78
2015-07-27,4.5
2015-07-28,4.5
2015-07-29,4.8
2015-07-30,4.73
2015-07-31,4.64
2015-08-03,4.45
2015-08-04,4.25
2015-08-05,4.24
2015-08-06,4.37
2015-08-07,4.29
2015-08-10,4.15
2015-08-11,4.33
2015-08-12,4.73
2015-08-13,4.4
2015-08-14,4.57
2015-08-17,4.92
2015-08-18,4.7
2015-08-19,4.64
2015-08-20,4.58
2015-08-21,4.48
2015-08-24,4.255
2015-08-25,4.24
2015-08-26,4.35
2015-08-27,4.91
2015-08-28,5.17
2015-08-31,5.18
2015-09-01,4.77
2015-09-02,4.78
2015-09-03,4.8
2015-09-04,4.77
2015-09-08,4.81
2015-09-09,4.73
2015-09-10,4.67
2015-09-11,4.83
2015-09-14,4.97
2015-09-15,4.99
2015-09-16,4.99
2015-09-17,5
2015-09-18,4.91
2015-09-21,4.91
2015-09-22,4.89
2015-09-23,4.89
2015-09-24,4.76
2015-09-25,4.7
2015-09-28,4.45
2015-09-29,4.38
2015-09-30,5
2015-10-01,4.95
2015-10-02,4.68
2015-10-05,4.9896
2015-10-06,4.87
2015-10-07,4.71
2015-10-08,4.84
2015-10-09,4.74
2015-10-12,4.65
2015-10-13,4.65
2015-10-14,4.71
2015-10-15,4.75
2015-10-16,4.5
2015-10-19,4.63
2015-10-20,4.6
2015-10-21,4.56
2015-10-22,4.53
2015-10-23,4.5401
2015-10-26,4.55
2015-10-27,4.5
2015-10-28,4.5
2015-10-29,4.39
2015-10-30,4.29
2015-11-02,4.45
2015-11-03,4.69
2015-11-04,4.5
2015-11-05,4.24
2015-11-06,4.25
2015-11-09,4.33
2015-11-10,4.59
2015-11-11,4.51
2015-11-12,4.58
2015-11-13,4.54
2015-11-16,4.61
2015-11-17,4.48
2015-11-18,4.55
2015-11-19,4.55
2015-11-20,4.75
2015-11-23,4.97
2015-11-24,5
2015-11-25,4.89
2015-11-27,5.02
2015-11-30,5.42
2015-12-01,5.54
2015-12-02,5.766
2015-12-03,5.77
2015-12-04,5.75
2015-12-07,5.75
2015-12-08,5.77
2015-12-09,5.86
2015-12-10,6.19
2015-12-11,5.92
2015-12-14,5.84
2015-12-15,5.78
2015-12-16,5.93
2015-12-17,6
2015-12-18,6
2015-12-21,6.04
2015-12-22,6.39
2015-12-23,6.73
2015-12-24,6.77
2015-12-28,6.46
2015-12-29,5.96
2015-12-30,5.91
2015-12-31,6.7
2016-01-04,6.59
2016-01-05,6.35
2016-01-06,6.4
2016-01-07,6.13
2016-01-08,6.04
2016-01-11,6.11
2016-01-12,6.1
2016-01-13,6.01
2016-01-14,6.81
2016-01-15,6.13
2016-01-19,5.9
2016-01-20,5.71
2016-01-21,5.64
2016-01-22,5.58
2016-01-25,5.6
2016-01-26,5.59
2016-01-27,5.8
2016-01-28,5.68
2016-01-29,5.94
2016-02-01,5.91
2016-02-02,5.92
2016-02-03,5.94
2016-02-04,5.79
2016-02-05,5.69
2016-02-08,5.39
2016-02-09,5.42
2016-02-10,5.57
2016-02-11,5.58
2016-02-12,5.7
2016-02-16,5.62
2016-02-17,5.73
2016-02-18,5.75
2016-02-19,5.73
2016-02-22,5.82
2016-02-23,5.8
2016-02-24,5.81
2016-02-25,5.78
2016-02-26,5.8
2016-02-29,5.82
2016-03-01,5.91
2016-03-02,5.91
2016-03-03,5.95
2016-03-04,6.22
2016-03-07,6.22
2016-03-08,6.16
2016-03-09,6.2
2016-03-10,6.25
2016-03-11,6.25
2016-03-14,6.29
2016-03-15,6.23
2016-03-16,6
2016-03-17,6.29
2016-03-18,6.25
2016-03-21,6.24
2016-03-22,6.235
2016-03-23,6.195
2016-03-24,6.11
2016-03-28,6.17
2016-03-29,6.13
2016-03-30,6.3
2016-03-31,6.11
2016-04-01,6.11
2016-04-04,6.06
2016-04-05,6.03
2016-04-06,5.815
2016-04-07,5.79
2016-04-08,5.65
2016-04-11,5.67
2016-04-12,5.81
2016-04-13,5.83
2016-04-14,5.8
2016-04-15,6.1
2016-04-18,6.22
2016-04-19,6.25
2016-04-20,6.23
2016-04-21,6.2
2016-04-22,6.19
2016-04-25,6.06
2016-04-26,6.1
2016-04-27,6.18
2016-04-28,6.19
2016-04-29,6.18
2016-05-02,6.29
2016-05-03,6.27
2016-05-04,6.24
2016-05-05,6.28
2016-05-06,6.3
2016-05-09,6.3
2016-05-10,6.2
2016-05-11,6.31
2016-05-12,6.3
2016-05-13,6.3
2016-05-16,6.295
2016-05-17,6.27
2016-05-18,6.29
2016-05-19,6.36
2016-05-20,6.64
2016-05-23,7.12
2016-05-24,6.81
2016-05-25,6.77
2016-05-26,6.79
2016-05-27,6.84
2016-05-31,7.25
2016-06-01,7.27
2016-06-02,7.45
2016-06-03,7.47
2016-06-06,7.79
2016-06-07,7.78
2016-06-08,7.02
2016-06-09,5.17
2016-06-10,4.55
2016-06-13,4.03
2016-06-14,4.1
2016-06-15,4.09
2016-06-16,3.99
2016-06-17,4.01
2016-06-20,4.35
2016-06-21,4.35
2016-06-22,4.41
2016-06-23,4.42
2016-06-24,4.25
2016-06-27,3.96
2016-06-28,4.04
2016-06-29,4.03
2016-06-30,3.93
2016-07-01,4.38
2016-07-05,4.11
2016-07-06,4.07
2016-07-07,4.14
2016-07-08,4.065
2016-07-11,4.02
2016-07-12,4.13
2016-07-13,4.04
2016-07-14,4.07
2016-07-15,3.96
2016-07-18,3.94
2016-07-19,3.8797
2016-07-20,3.9
2016-07-21,3.85
2016-07-22,3.93
2016-07-25,3.84
2016-07-26,3.91
2016-07-27,3.96
2016-07-28,3.9992
2016-07-29,4
2016-08-01,3.96
2016-08-02,3.96
2016-08-03,3.96
2016-08-04,3.93
2016-08-05,3.98
2016-08-08,4
2016-08-09,4.7
2016-08-10,4.47
2016-08-11,4.41
2016-08-12,4.82
2016-08-15,5.51
2016-08-16,5.37
2016-08-17,5.52
2016-08-18,5.19
2016-08-19,5.23
2016-08-22,5.29
2016-08-23,5.45
2016-08-24,5.18
2016-08-25,5.19
2016-08-26,5.18
2016-08-29,5.23
2016-08-30,5.57
2016-08-31,5.72
2016-09-01,5.57
2016-09-02,5.59
2016-09-06,5.96
2016-09-07,5.81
2016-09-08,5.52
2016-09-09,5.14
2016-09-12,4.81
2016-09-13,4.69
2016-09-14,4.62
2016-09-15,4.93
2016-09-16,5.2
2016-09-19,5.34
2016-09-20,5.2152
2016-09-21,5.28
2016-09-22,5.32
2016-09-23,5.61
2016-09-26,5.3
2016-09-27,5.35
2016-09-28,5.45
2016-09-29,5.41
2016-09-30,5.25
2016-10-03,5.49
2016-10-04,5.59
2016-10-05,5.53
2016-10-06,5.59
2016-10-07,5.65
2016-10-10,6.25
2016-10-11,5.95
2016-10-12,6.1
2016-10-13,6.05
2016-10-14,6.1
2016-10-17,6
2016-10-18,5.9
2016-10-19,5.75
2016-10-20,5.7
2016-10-21,5.2
2016-10-24,4.85
2016-10-25,5
2016-10-26,4.95
2016-10-27,4.85
2016-10-28,5.5
2016-10-31,5.6
2016-11-01,5.95
2016-11-02,5.8
2016-11-03,6.15
2016-11-04,6.1
2016-11-07,5.9
2016-11-08,6.15
2016-11-09,6.45
2016-11-10,7.5
2016-11-11,9.2
2016-11-14,10.3
2016-11-15,8.8
2016-11-16,10.45
2016-11-17,10.2
2016-11-18,9.8
2016-11-21,11.1
2016-11-22,11.1
2016-11-23,11.25
2016-11-25,11.25
2016-11-28,12.85
2016-11-29,12.85
2016-11-30,13.5
2016-12-01,12.55
2016-12-02,11.45
2016-12-05,12.5
2016-12-06,13.45
2016-12-07,13.55
2016-12-08,14.5
2016-12-09,13.7
2016-12-12,13.2
2016-12-13,13.5
2016-12-14,13.25
2016-12-15,13.85
2016-12-16,13.2
2016-12-19,13.5
2016-12-20,13.65
2016-12-21,14.6
2016-12-22,15.95
2016-12-23,17.5
2016-12-27,18.65
2016-12-28,18.25
2016-12-29,16.05
2016-12-30,17.85
2017-01-03,16.6
2017-01-04,17.45
2017-01-05,17.2
2017-01-06,17.3
2017-01-09,17.15
2017-01-10,19.3
2017-01-11,18.7
2017-01-12,18.8
2017-01-13,19.9
2017-01-17,19.55
2017-01-18,19.8
2017-01-19,19.85
2017-01-20,20.7
2017-01-23,19.05
2017-01-24,19.55
2017-01-25,19.45
2017-01-26,19.75
2017-01-27,19.65
2017-01-30,19.5
2017-01-31,19.1
2017-02-01,19.05
2017-02-02,19.15
2017-02-03,18.95
2017-02-06,19.05
2017-02-07,19.7
2017-02-08,19.45
2017-02-09,19.75
2017-02-10,19.25
2017-02-13,17.75
2017-02-14,17.85
2017-02-15,18.5
2017-02-16,18.2
2017-02-17,18.2
2017-02-21,18.05
2017-02-22,18.05
2017-02-23,17.85
2017-02-24,17.95
2017-02-27,17.6
2017-02-28,17.95
2017-03-01,17.85
2017-03-02,17.6
2017-03-03,16.8
2017-03-06,18
2017-03-07,17.35
2017-03-08,15.65
2017-03-09,15.7
2017-03-10,15.75
2017-03-13,16.8
2017-03-14,16.8
2017-03-15,16.85
2017-03-16,16.65
2017-03-17,16.5
2017-03-20,16.5
2017-03-21,15.8
2017-03-22,15.65
2017-03-23,16.1
2017-03-24,15.55
2017-03-27,14.3
2017-03-28,14.9
2017-03-29,15.05
2017-03-30,15.95
2017-03-31,16
2017-04-03,16
2017-04-04,16.1
2017-04-05,15.95
2017-04-06,16.2
2017-04-07,16.45
2017-04-10,16.05
2017-04-11,17
2017-04-12,15.65
2017-04-13,15.1
2017-04-17,15.5
2017-04-18,15.75
2017-04-19,15.4
2017-04-20,15.8
2017-04-21,15.7
2017-04-24,15.85
2017-04-25,15.9
2017-04-26,15.9
2017-04-27,16.05
2017-04-28,16.75
2017-05-01,17.75
2017-05-02,17.05
2017-05-03,17.1
2017-05-04,20.05
2017-05-05,21.15
2017-05-08,20.15
2017-05-09,20.35
2017-05-10,20.65
2017-05-11,20.6
2017-05-12,22.3
2017-05-15,21.75
2017-05-16,21.55
2017-05-17,20.05
2017-05-18,20.5
2017-05-19,20.85
2017-05-22,20.1
2017-05-23,20.35
2017-05-24,20.95
2017-05-25,21.2
2017-05-26,21.8
2017-05-30,21.9
2017-05-31,22.25
2017-06-01,22.9
2017-06-02,22.2
2017-06-05,21.8
2017-06-06,21.15
2017-06-07,21.3
2017-06-08,21
2017-06-09,20.25
2017-06-12,21.15
2017-06-13,21.35
2017-06-14,21.95
2017-06-15,22.05
2017-06-16,24.85
2017-06-19,23.5
2017-06-20,23.9
2017-06-21,23.95
2017-06-22,24.25
2017-06-23,25.45
2017-06-26,24.1
2017-06-27,24.3
2017-06-28,24.65
2017-06-29,24.05
2017-06-30,23.5
2017-07-03,23.5
2017-07-05,23.35
2017-07-06,23.15
2017-07-07,23.55
2017-07-10,24.2
2017-07-11,24.35
2017-07-12,24.7
2017-07-13,25.5
2017-07-14,25.7
2017-07-17,26.4
2017-07-18,26.7
2017-07-19,27.95
2017-07-20,27.8
2017-07-21,28.05
2017-07-24,28.4
2017-07-25,28.65
2017-07-26,28.95
2017-07-27,27.8
2017-07-28,28.05
2017-07-31,28.05
2017-08-01,26.95
2017-08-02,27
2017-08-03,29.6
2017-08-04,31.7
2017-08-07,32.25
2017-08-08,31.4
2017-08-09,31
2017-08-10,30.95
2017-08-11,31.4
2017-08-14,33.25
2017-08-15,34.1
2017-08-16,34.3
2017-08-17,33
2017-08-18,33.1
2017-08-21,33
2017-08-22,33.7
2017-08-23,33.7
2017-08-24,34.8
2017-08-25,34.75
2017-08-28,34.85
2017-08-29,35.95
2017-08-30,36.35
2017-08-31,33.65
2017-09-01,31
2017-09-05,31.8
2017-09-06,32.55
2017-09-07,30.4
2017-09-08,29.9
2017-09-11,23.35
2017-09-12,19.75
2017-09-13,21.25
2017-09-14,21.4
2017-09-15,22.5
2017-09-18,22.85
2017-09-19,23
2017-09-20,21.9
2017-09-21,21.8
2017-09-22,21.75
2017-09-25,21.6
2017-09-26,19.05
2017-09-27,18.6
2017-09-28,14.1
2017-09-29,14.5
2017-10-02,15.55
2017-10-03,16.3
2017-10-04,16.95
2017-10-05,16.75
2017-10-06,16.9
2017-10-09,18.6
2017-10-10,18.75
2017-10-11,17.4
2017-10-12,18.1
2017-10-13,18.9
2017-10-16,21.1
2017-10-17,21.95
2017-10-18,22.75
2017-10-19,21.75
2017-10-20,21.5
2017-10-23,21
2017-10-24,21.2
2017-10-25,21
2017-10-26,20.75
2017-10-27,20.9
2017-10-30,21.05
2017-10-31,21.5
2017-11-01,21.3
2017-11-02,20.25
2017-11-03,22.5
2017-11-06,22.2
2017-11-07,23.7
2017-11-08,23.5
2017-11-09,23.8
2017-11-10,23.95
2017-11-13,24.35
2017-11-14,24.25
2017-11-15,22.95
2017-11-16,23.8
2017-11-17,23.9
2017-11-20,24.05
2017-11-21,24.1
2017-11-22,24.15
2017-11-24,24.3
2017-11-27,24.1
2017-11-28,24.25
2017-11-29,23.15
2017-11-30,23.35
2017-12-01,22.65
2017-12-04,21.225
2017-12-05,22.025
2017-12-06,21.95
2017-12-07,22
2017-12-08,22.8
2017-12-11,22.85
2017-12-12,23.8
2017-12-13,25.05
2017-12-14,27.55
2017-12-15,26.9
2017-12-18,25.9
2017-12-19,25
2017-12-20,25.45
2017-12-21,26.15
2017-12-22,24.9
2017-12-26,25
2017-12-27,24.95
2017-12-28,24.5
2017-12-29,24.95
2018-01-02,25.55
2018-01-03,25
2018-01-04,25.5
2018-01-05,27.5
2018-01-08,25.175
2018-01-09,25.4
2018-01-10,25.65
2018-01-11,25.5
2018-01-12,25.4
2018-01-16,25.2
2018-01-17,25.95
2018-01-18,26.6
2018-01-19,27.9
2018-01-22,27.3
2018-01-23,27.25
2018-01-24,27.75
2018-01-25,28.15
2018-01-26,28.5
2018-01-29,27.75
2018-01-30,25.8
2018-01-31,25.95
2018-02-01,25.95
2018-02-02,24.2
2018-02-05,23.45
2018-02-06,24.3
2018-02-07,23.65
2018-02-08,22.1
2018-02-09,22.05
2018-02-12,22.8
2018-02-13,24.65
2018-02-14,27.05
2018-02-15,31.05
2018-02-16,30
2018-02-20,29.65
2018-02-21,30.8
2018-02-22,29.15
2018-02-23,29.75
2018-02-26,30.95
2018-02-27,31.15
2018-02-28,31.2
2018-03-01,32.55
2018-03-02,32.45
2018-03-05,31.5
2018-03-06,30.7
2018-03-07,30.55
2018-03-08,30.9
2018-03-09,31.6
2018-03-12,33.15
2018-03-13,30.9
2018-03-14,29.6
2018-03-15,30.45
2018-03-16,30.15
2018-03-19,30.05
2018-03-20,31.05
2018-03-21,31.1
2018-03-22,30.05
2018-03-23,29.3
2018-03-26,29.75
2018-03-27,29
2018-03-28,29.25
2018-03-29,28.9
2018-04-02,28.55
2018-04-03,29.3
2018-04-04,30
2018-04-05,29.4
2018-04-06,28.95
2018-04-09,27.3
2018-04-10,28.3
2018-04-11,29.1
2018-04-12,28.1
2018-04-13,28.4
2018-04-16,28.6
2018-04-17,28.5
2018-04-18,28.75
2018-04-19,28.6
2018-04-20,28.45
2018-04-23,27.95
2018-04-24,28.35
2018-04-25,28.4
2018-04-26,28.5
2018-04-27,28.35
2018-04-30,28.5
2018-05-01,28.25
2018-05-02,27.65
2018-05-03,28.7
2018-05-04,26.65
2018-05-07,27.9
2018-05-08,27.8
2018-05-09,29.45
2018-05-10,28.75
2018-05-11,28.45
2018-05-14,29.2
2018-05-15,28.75
2018-05-16,28.95
2018-05-17,28.55
2018-05-18,29.1
2018-05-21,31.05
2018-05-22,32.3
2018-05-23,32.6
2018-05-24,31.05
2018-05-25,30.55
2018-05-29,30.5
2018-05-30,31.7
2018-05-31,31.9
2018-06-01,32.35
2018-06-04,33.25
2018-06-05,35
2018-06-06,34.65
2018-06-07,33.3
2018-06-08,33.4
2018-06-11,34.35
2018-06-12,34.95
2018-06-13,34.7
2018-06-14,34.25
2018-06-15,33.95
2018-06-18,34.15
2018-06-19,33.35
2018-06-20,34.15
2018-06-21,33.15
2018-06-22,33.45
2018-06-25,31.35
2018-06-26,31.3
2018-06-27,30.9
2018-06-28,32.1
2018-06-29,32.35
2018-07-02,32.5
2018-07-03,33.35
2018-07-05,34.5
2018-07-06,34.5
2018-07-09,35.5
2018-07-10,34.7
2018-07-11,34.6
2018-07-12,33.2
2018-07-13,32.7
2018-07-16,33.05
2018-07-17,32.95
2018-07-18,33.15
2018-07-19,32.35
2018-07-20,32.525
2018-07-23,32.8
2018-07-24,31.6
2018-07-25,31.55
2018-07-26,31.35
2018-07-27,31
2018-07-30,32.2
2018-07-31,33.25
2018-08-01,38.05
2018-08-02,44.15
2018-08-03,44.25
2018-08-06,43.75
2018-08-07,43.05
2018-08-08,43.7
2018-08-09,45.4
2018-08-10,46.55
2018-08-13,48.45
2018-08-14,51.35
2018-08-15,51.1
2018-08-16,50.7
2018-08-17,53.15
2018-08-20,53.25
2018-08-21,54.8
2018-08-22,56.75
2018-08-23,55.7
2018-08-24,55.85
2018-08-27,51.2
2018-08-28,51.4
2018-08-29,50.2
2018-08-30,52.05
2018-08-31,52.9
2018-09-04,53
2018-09-05,51.75
2018-09-06,52.9
2018-09-07,55.9
2018-09-10,54.7
2018-09-11,55
2018-09-12,52.45
2018-09-13,52.05
2018-09-14,52.95
2018-09-17,52.9
2018-09-18,52.25
2018-09-19,52.3
2018-09-20,53.95
2018-09-21,57.4
2018-09-24,58.1
2018-09-25,57.7
2018-09-26,54.95
2018-09-27,58.95
2018-09-28,61.65
2018-10-01,59
2018-10-02,54.6
2018-10-03,54.05
2018-10-04,54.38
2018-10-05,56.93
2018-10-08,55.96
2018-10-09,54.73
2018-10-10,50.03
2018-10-11,48.62
2018-10-12,47.42
2018-10-15,46.86
2018-10-16,50.37
2018-10-17,50.52
2018-10-18,48.69
2018-10-19,47.51
2018-10-22,48.08
2018-10-23,45.83
2018-10-24,43.47
2018-10-25,44.84
2018-10-26,42.85
2018-10-29,45
2018-10-30,49.46
2018-10-31,48.9
2018-11-01,50.74
2018-11-02,46.27
2018-11-05,39.62
2018-11-06,41.38
2018-11-07,43.53
2018-11-08,42.18
2018-11-09,41.59
2018-11-12,42.27
2018-11-13,41.22
2018-11-14,39.28
2018-11-15,39.24
2018-11-16,37.5
2018-11-19,34.5
2018-11-20,34.49
2018-11-21,35.07
2018-11-23,33.95
2018-11-26,33.13
2018-11-27,31.2
2018-11-28,33.62
2018-11-29,35.69
2018-11-30,36.82
2018-12-03,34.22
2018-12-04,32.43
2018-12-06,34.34
2018-12-07,32.77
2018-12-10,32.67
2018-12-11,33.88
2018-12-12,30.08
2018-12-13,35.82
2018-12-14,29.26
2018-12-17,30.78
2018-12-18,26.7
2018-12-19,26.83
2018-12-20,26.91
2018-12-21,26.8
2018-12-24,25.18
2018-12-26,26.81
2018-12-27,26.62
2018-12-28,26.29
2018-12-31,26.73
2019-01-02,26.16
2019-01-03,26.03
2019-01-04,27.09
2019-01-07,28.35
2019-01-08,29.52
2019-01-09,31.94
2019-01-10,32.1
2019-01-11,31.49
2019-01-14,31.1
2019-01-15,32.3
2019-01-16,32.82
2019-01-17,33.69
2019-01-18,35.78
2019-01-22,33.47
2019-01-23,34.89
2019-01-24,35.88
2019-01-25,37.52
2019-01-28,37.62
2019-01-29,36.89
2019-01-30,37.66
2019-01-31,38.34
2019-02-01,39.73
2019-02-04,39.98
2019-02-05,39.22
2019-02-06,38.44
2019-02-07,37.64
2019-02-08,38.93
2019-02-11,38.69
2019-02-12,39.38
2019-02-13,40.47
2019-02-14,40.01
2019-02-15,41.27
2019-02-19,42.98
2019-02-20,44.55
2019-02-21,44.52
2019-02-22,45.69
2019-02-25,45.24
2019-02-26,42.87
2019-02-27,39.43
2019-02-28,37.21
2019-03-01,37.21
2019-03-04,36.13
2019-03-05,36.77
2019-03-06,35.11
2019-03-07,37.84
2019-03-08,39.02
2019-03-11,38.09
2019-03-12,38.39
2019-03-13,31.77
2019-03-14,33.53
2019-03-15,34.17
2019-03-18,33.23
2019-03-19,32.54
2019-03-20,30.47
2019-03-21,31.29
2019-03-22,29.34
2019-03-25,29.65
2019-03-26,27.45
2019-03-27,27.84
2019-03-28,27.74
2019-03-29,26.82
2019-04-01,26
2019-04-02,25.4
2019-04-03,26.06
2019-04-04,26.82
2019-04-05,27.4
2019-04-08,27.14
2019-04-09,25.93
2019-04-10,26.88
2019-04-11,25.82
2019-04-12,23.85
2019-04-15,23.43
2019-04-16,24.2
2019-04-17,23.95
2019-04-18,23.85
2019-04-22,24.85
2019-04-23,26.12
2019-04-24,24.75
2019-04-25,24.55
2019-04-26,25.12
2019-04-29,25.43
2019-04-30,23.32
2019-05-01,21.88
2019-05-02,21.56
2019-05-03,23.76
2019-05-06,25.85
2019-05-07,21.94
2019-05-08,21.72
2019-05-09,21.15
2019-05-10,20.32
2019-05-13,18.86
2019-05-14,21.35
2019-05-15,23.45
2019-05-16,24.02
2019-05-17,23.72
2019-05-20,24.8
2019-05-21,26.11
2019-05-22,25.41
2019-05-23,24.62
2019-05-24,24.9
2019-05-28,23.03
2019-05-29,23.31
2019-05-30,23.47
2019-05-31,25.79
2019-06-03,26.62
2019-06-04,28.74
2019-06-05,28.72
2019-06-06,28.75
2019-06-07,29.7
2019-06-10,30.5
2019-06-11,28.92
2019-06-12,28.38
2019-06-13,28.22
2019-06-14,28.04
2019-06-17,26.125
2019-06-18,25.68
2019-06-19,25.67
2019-06-20,26.63
2019-06-21,26.55
2019-06-24,26.21
2019-06-25,24.44
2019-06-26,24.115
2019-06-27,24.6
2019-06-28,25.56
2019-07-01,26.42
2019-07-02,25.68
2019-07-03,26.14
2019-07-04,26.14
2019-07-05,26.34
2019-07-08,24.995
2019-07-09,24.265
2019-07-10,23.08
2019-07-11,22.59
2019-07-12,23.09
2019-07-15,22.005
2019-07-16,21.69
2019-07-17,21.43
2019-07-18,21.98
2019-07-19,22.42
2019-07-22,22.51
2019-07-23,21.4
2019-07-24,21.13
2019-07-25,20.315
2019-07-26,21.66
2019-07-29,22.34
2019-07-30,23.21
2019-07-31,22.03
2019-08-01,20.71
2019-08-02,21.48
2019-08-05,20.24
2019-08-06,22.03
2019-08-07,22.02
2019-08-08,21.65
2019-08-09,21.37
2019-08-12,20.58
2019-08-13,18.85
2019-08-14,16.88
2019-08-15,17.705
2019-08-16,17.515
2019-08-19,17.19
2019-08-20,18.76
2019-08-21,20.01
2019-08-22,19.03
2019-08-23,17.95
2019-08-26,18.6
2019-08-27,17.76
2019-08-28,18.275
2019-08-29,18.41
2019-08-30,18.26
2019-09-02,18.39
2019-09-03,17.68
2019-09-04,17.36
2019-09-05,16.9
2019-09-06,17.11
2019-09-09,17.91
2019-09-10,18.66
2019-09-11,19.86
2019-09-12,19.65
2019-09-13,19.61
2019-09-16,19.765
2019-09-17,20.77
2019-09-18,20.91
2019-09-19,22.675
2019-09-20,23.385
2019-09-23,23.625
2019-09-24,21.84
2019-09-25,22.16
2019-09-26,23.87
2019-09-27,23.675
2019-09-30,24.84
2019-10-01,24.54
2019-10-02,25.61
2019-10-03,26.005
2019-10-04,25.68
2019-10-07,24.9
2019-10-08,24.29
2019-10-09,24.575
2019-10-10,24.82
2019-10-11,26.32
2019-10-14,26.695
2019-10-15,27.26
2019-10-16,26.99
2019-10-17,27.71
2019-10-18,27.315
2019-10-21,26.82
2019-10-22,25.12
2019-10-23,26.31
2019-10-24,26.8
2019-10-25,27
2019-10-28,26.48
2019-10-29,26.67
2019-10-30,27.035
2019-10-31,26.43
2019-11-01,25.4
2019-11-04,24.79
2019-11-05,24.27
2019-11-06,23.67
2019-11-07,24.32
2019-11-08,24.24
2019-11-11,24.765
2019-11-12,23.33
2019-11-13,24.87
2019-11-14,23.07
2019-11-15,23.39
2019-11-18,20.51
2019-11-19,19.12
2019-11-20,18.64
2019-11-21,17.015
2019-11-22,17.94
2019-11-25,18.105
