date,close
2014-06-13,9.458
2014-06-16,9.352
2014-06-17,9.4845
2014-06-18,9.4756
2014-06-19,9.4403
2014-06-20,9.5109
2014-06-23,9.458
2014-06-24,9.3432
2014-06-25,9.4315
2014-06-26,9.4315
2014-06-27,9.4226
2014-06-30,9.3785
2014-07-01,9.5021
2014-07-02,9.4491
2014-07-03,9.5993
2014-07-07,9.5109
2014-07-08,9.3343
2014-07-09,9.3873
2014-07-10,9.3167
2014-07-11,9.3696
2014-07-14,9.3785
2014-07-15,9.4756
2014-07-16,9.3873
2014-07-17,9.0517
2014-07-18,9.0517
2014-07-21,8.9987
2014-07-22,8.9193
2014-07-23,8.9193
2014-07-24,9.0871
2014-07-25,9.1489
2014-07-28,9.0429
2014-07-29,8.9899
2014-07-30,9.0959
2014-07-31,8.9546
2014-08-01,8.778
2014-08-04,8.778
2014-08-05,8.6985
2014-08-06,8.6897
2014-08-07,8.5749
2014-08-08,8.619
2014-08-11,8.5837
2014-08-12,8.6014
2014-08-13,8.7515
2014-08-14,8.7427
2014-08-15,8.6367
2014-08-18,8.7868
2014-08-19,8.725
2014-08-20,8.7956
2014-08-21,8.9369
2014-08-22,8.9193
2014-08-25,9.0252
2014-08-26,9.0606
2014-08-27,8.9723
2014-08-28,8.9281
2014-08-29,8.9634
2014-09-02,8.9899
2014-09-03,8.9369
2014-09-04,8.9546
2014-09-05,8.9546
2014-09-08,8.9634
2014-09-09,8.831
2014-09-10,9.0528
2014-09-11,9.1238
2014-09-12,9.186
2014-09-15,9.1238
2014-09-16,9.0617
2014-09-17,9.2126
2014-09-18,9.3546
2014-09-19,9.2659
2014-09-22,9.1771
2014-09-23,9.0351
2014-09-24,9.0351
2014-09-25,8.9286
2014-09-26,8.9818
2014-09-29,8.9286
2014-09-30,8.9108
2014-10-01,8.7777
2014-10-02,8.7955
2014-10-03,8.9641
2014-10-06,8.8576
2014-10-07,8.7511
2014-10-08,8.8753
2014-10-09,8.6268
2014-10-10,8.5114
2014-10-13,8.3694
2014-10-14,8.4493
2014-10-15,8.0766
2014-10-16,8.0411
2014-10-17,8.0766
2014-10-20,8.1298
2014-10-21,8.2186
2014-10-22,8.2186
2014-10-23,8.3517
2014-10-24,8.3783
2014-10-27,8.3428
2014-10-28,8.547
2014-10-29,8.6623
2014-10-30,9.0617
2014-10-31,8.8132
2014-11-03,8.902
2014-11-04,8.8842
2014-11-05,8.973
2014-11-06,9.0795
2014-11-07,9.0173
2014-11-10,9.0795
2014-11-11,9.044
2014-11-12,9.0617
2014-11-13,9.0262
2014-11-14,9.0262
2014-11-17,8.9641
2014-11-18,8.9552
2014-11-19,8.9375
2014-11-20,8.902
2014-11-21,8.9108
2014-11-24,9.0351
2014-11-25,8.9996
2014-11-26,8.9996
2014-11-28,8.9375
2014-12-01,8.6712
2014-12-02,8.7511
2014-12-03,8.8398
2014-12-04,8.973
2014-12-05,9.2037
2014-12-08,9.2037
2014-12-09,9.2747
2014-12-10,9.0429
2014-12-11,9.0696
2014-12-12,8.9269
2014-12-15,8.7932
2014-12-16,8.8467
2014-12-17,9.1142
2014-12-18,9.3104
2014-12-19,9.3193
2014-12-22,9.3728
2014-12-23,9.5066
2014-12-24,9.5155
2014-12-26,9.5244
2014-12-29,9.569
2014-12-30,9.5423
2014-12-31,9.4174
2015-01-02,9.3728
2015-01-05,9.0518
2015-01-06,8.7486
2015-01-07,8.8021
2015-01-08,8.9358
2015-01-09,8.6772
2015-01-12,8.5078
2015-01-13,8.374
2015-01-14,8.1689
2015-01-15,8.0173
2015-01-16,8.0886
2015-01-20,7.7943
2015-01-21,7.7676
2015-01-22,8.1957
2015-01-23,8.0351
2015-01-26,8.0976
2015-01-27,7.9995
2015-01-28,7.7943
2015-01-29,7.8924
2015-01-30,7.7587
2015-02-02,7.9638
2015-02-03,8.1243
2015-02-04,8.0619
2015-02-05,8.2046
2015-02-06,8.5256
2015-02-09,8.3473
2015-02-10,8.3383
2015-02-11,8.3116
2015-02-12,8.5078
2015-02-13,8.4899
2015-02-17,8.6326
2015-02-18,8.481
2015-02-19,8.4989
2015-02-20,8.6148
2015-02-23,8.5345
2015-02-24,8.6237
2015-02-25,8.5791
2015-02-26,8.5791
2015-02-27,8.5702
2015-03-02,8.6505
2015-03-03,8.5791
2015-03-04,8.5167
2015-03-05,8.6505
2015-03-06,8.704
2015-03-09,8.704
2015-03-10,8.5167
2015-03-11,8.5526
2015-03-12,8.8663
2015-03-13,8.8843
2015-03-16,8.8574
2015-03-17,8.8663
2015-03-18,8.687
2015-03-19,8.5167
2015-03-20,8.6422
2015-03-23,8.5615
2015-03-24,8.454
2015-03-25,8.2926
2015-03-26,8.3464
2015-03-27,8.2746
2015-03-30,8.3733
2015-03-31,8.4719
2015-04-01,8.4808
2015-04-02,8.5884
2015-04-06,8.5615
2015-04-07,8.6243
2015-04-08,8.6332
2015-04-09,8.6691
2015-04-10,8.5974
2015-04-13,8.6422
2015-04-14,8.5526
2015-04-15,8.705
2015-04-16,8.696
2015-04-17,8.5974
2015-04-20,8.5974
2015-04-21,8.5884
2015-04-22,8.7229
2015-04-23,8.6243
2015-04-24,8.5884
2015-04-27,8.5705
2015-04-28,8.6422
2015-04-29,8.7857
2015-04-30,8.8125
2015-05-01,8.8125
2015-05-04,8.947
2015-05-05,8.8843
2015-05-06,8.8932
2015-05-07,8.8663
2015-05-08,8.9022
2015-05-11,9.0277
2015-05-12,9.1174
2015-05-13,9.198
2015-05-14,9.1353
2015-05-15,8.947
2015-05-18,9.1532
2015-05-19,9.3146
2015-05-20,9.198
2015-05-21,9.1801
2015-05-22,9.1622
2015-05-26,9.1263
2015-05-27,9.216
2015-05-28,9.1622
2015-05-29,9.0456
2015-06-01,8.947
2015-06-02,9.0815
2015-06-03,9.2339
2015-06-04,9.1622
2015-06-05,9.4311
2015-06-08,9.3504
2015-06-09,9.458
2015-06-10,9.6023
2015-06-11,9.5211
2015-06-12,9.5392
2015-06-15,9.467
2015-06-16,9.5572
2015-06-17,9.4129
2015-06-18,9.467
2015-06-19,9.4129
2015-06-22,9.5662
2015-06-23,9.7015
2015-06-24,9.6203
2015-06-25,9.5302
2015-06-26,9.4941
2015-06-29,9.2777
2015-06-30,9.3408
2015-07-01,9.3859
2015-07-02,9.2597
2015-07-06,9.1695
2015-07-07,9.0523
2015-07-08,8.8629
2015-07-09,9.0162
2015-07-10,9.1425
2015-07-13,9.1965
2015-07-14,9.2146
2015-07-15,9.2957
2015-07-16,9.3679
2015-07-17,9.1244
2015-07-20,9.1965
2015-07-21,9.3859
2015-07-22,9.6474
2015-07-23,9.5752
2015-07-24,9.5211
2015-07-27,9.3859
2015-07-28,9.3769
2015-07-29,9.4851
2015-07-30,9.5302
2015-07-31,9.3679
2015-08-03,9.3498
2015-08-04,9.3498
2015-08-05,9.449
2015-08-06,9.5302
2015-08-07,9.5752
2015-08-10,9.7375
2015-08-11,9.5392
2015-08-12,9.3318
2015-08-13,9.3859
2015-08-14,9.5121
2015-08-17,9.5121
2015-08-18,9.467
2015-08-19,9.2416
2015-08-20,8.9531
2015-08-21,8.7187
2015-08-24,8.0966
2015-08-25,7.9072
2015-08-26,8.34
2015-08-27,8.6195
2015-08-28,8.6736
2015-08-31,8.6466
2015-09-01,8.3039
2015-09-02,8.4212
2015-09-03,8.5023
2015-09-04,8.349
2015-09-08,8.5834
2015-09-09,8.4746
2015-09-10,8.6379
2015-09-11,8.6288
2015-09-14,8.7014
2015-09-15,8.8284
2015-09-16,8.6833
2015-09-17,8.4292
2015-09-18,8.1116
2015-09-21,8.2477
2015-09-22,8.0935
2015-09-23,8.1207
2015-09-24,8.0935
2015-09-25,8.2387
2015-09-28,7.9846
2015-09-29,8.0118
2015-09-30,8.1751
2015-10-01,8.1933
2015-10-02,8.0844
2015-10-05,8.2024
2015-10-06,8.2477
2015-10-07,8.3566
2015-10-08,8.402
2015-10-09,8.2477
2015-10-12,8.2387
2015-10-13,8.1479
2015-10-14,8.0028
2015-10-15,8.2387
2015-10-16,8.1842
2015-10-19,8.1116
2015-10-20,8.3566
2015-10-21,8.1933
2015-10-22,8.3566
2015-10-23,8.5744
2015-10-26,8.4564
2015-10-27,8.3838
2015-10-28,8.7649
2015-10-29,8.7468
2015-10-30,8.4836
2015-11-02,8.6923
2015-11-03,8.656
2015-11-04,8.7014
2015-11-05,8.8284
2015-11-06,9.1914
2015-11-09,9.0643
2015-11-10,9.1369
2015-11-11,9.028
2015-11-12,8.8919
2015-11-13,8.8103
2015-11-16,8.901
2015-11-17,8.9555
2015-11-18,9.1551
2015-11-19,9.2004
2015-11-20,9.146
2015-11-23,9.146
2015-11-24,9.1914
2015-11-25,9.1551
2015-11-27,9.2277
2015-11-30,9.2004
2015-12-01,9.3003
2015-12-02,9.1641
2015-12-03,9.0462
2015-12-04,9.3093
2015-12-07,9.1006
2015-12-08,8.7468
2015-12-09,8.6281
2015-12-10,8.7742
2015-12-11,8.555
2015-12-14,8.5459
2015-12-15,8.9202
2015-12-16,9.0755
2015-12-17,8.8837
2015-12-18,8.5368
2015-12-21,8.5733
2015-12-22,8.6737
2015-12-23,8.8472
2015-12-24,8.8655
2015-12-28,8.7924
2015-12-29,8.9111
2015-12-30,8.8107
2015-12-31,8.765
2016-01-04,8.6189
2016-01-05,8.6007
2016-01-06,8.4546
2016-01-07,8.1807
2016-01-08,7.9981
2016-01-11,7.9251
2016-01-12,7.9798
2016-01-13,7.6055
2016-01-14,7.6329
2016-01-15,7.4868
2016-01-19,7.3772
2016-01-20,7.2129
2016-01-21,7.149
2016-01-22,7.2403
2016-01-25,6.9116
2016-01-26,7.1398
2016-01-27,7.2585
2016-01-28,7.3133
2016-01-29,7.4138
2016-02-01,7.2494
2016-02-02,6.9664
2016-02-03,7.1398
2016-02-04,7.2129
2016-02-05,7.1216
2016-02-08,6.8751
2016-02-09,6.9846
2016-02-10,6.8568
2016-02-11,6.4642
2016-02-12,6.939
2016-02-16,7.1581
2016-02-17,7.1398
2016-02-18,6.9572
2016-02-19,6.9846
2016-02-22,7.2129
2016-02-23,6.9116
2016-02-24,6.7746
2016-02-25,6.8568
2016-02-26,7.0759
2016-02-29,6.8659
2016-03-01,7.2859
2016-03-02,7.4138
2016-03-03,7.5598
2016-03-04,7.6603
2016-03-07,7.6511
2016-03-08,7.3498
2016-03-09,7.2395
2016-03-10,7.3314
2016-03-11,7.5798
2016-03-14,7.5522
2016-03-15,7.4602
2016-03-16,7.3774
2016-03-17,7.4694
2016-03-18,7.5706
2016-03-21,7.5522
2016-03-22,7.5246
2016-03-23,7.4326
2016-03-24,7.4142
2016-03-28,7.405
2016-03-29,7.2671
2016-03-30,7.2671
2016-03-31,7.2211
2016-04-01,7.2579
2016-04-04,7.2395
2016-04-05,7.0463
2016-04-06,7.1843
2016-04-07,6.9911
2016-04-08,7.0555
2016-04-11,7.1383
2016-04-12,7.3314
2016-04-13,7.727
2016-04-14,7.8006
2016-04-15,8.0398
2016-04-18,8.0581
2016-04-19,8.2605
2016-04-20,8.4261
2016-04-21,8.4353
2016-04-22,8.5917
2016-04-25,8.5549
2016-04-26,8.6469
2016-04-27,8.8216
2016-04-28,8.6653
2016-04-29,8.6285
2016-05-02,8.6929
2016-05-03,8.4997
2016-05-04,8.3157
2016-05-05,8.3157
2016-05-06,8.3525
2016-05-09,8.3249
2016-05-10,8.4905
2016-05-11,8.4813
2016-05-12,8.3985
2016-05-13,8.2697
2016-05-16,8.3249
2016-05-17,8.4353
2016-05-18,8.8676
2016-05-19,8.7113
2016-05-20,8.7481
2016-05-23,8.7113
2016-05-24,8.8768
2016-05-25,9.0608
2016-05-26,8.9504
2016-05-27,9.0792
2016-05-31,9.0424
2016-06-01,9.1344
2016-06-02,9.1988
2016-06-03,8.9504
2016-06-06,9.1528
2016-06-07,9.0428
2016-06-08,9.0938
2016-06-09,8.9826
2016-06-10,8.8159
2016-06-13,8.6678
2016-06-14,8.4177
2016-06-15,8.427
2016-06-16,8.3066
2016-06-17,8.4177
2016-06-20,8.4918
2016-06-21,8.4918
2016-06-22,8.4455
2016-06-23,8.7511
2016-06-24,7.8992
2016-06-27,7.325
2016-06-28,7.6213
2016-06-29,7.7973
2016-06-30,7.8806
2016-07-01,7.7417
2016-07-05,7.4269
2016-07-06,7.5843
2016-07-07,7.6399
2016-07-08,7.8158
2016-07-11,7.9362
2016-07-12,8.177
2016-07-13,8.2047
2016-07-14,8.4085
2016-07-15,8.4455
2016-07-18,8.4826
2016-07-19,8.2233
2016-07-20,8.2603
2016-07-21,8.2788
2016-07-22,8.3622
2016-07-25,8.3066
2016-07-26,8.4733
2016-07-27,8.427
2016-07-28,8.4826
2016-07-29,8.4918
2016-08-01,8.3529
2016-08-02,8.2418
2016-08-03,8.3714
2016-08-04,8.3714
2016-08-05,8.6956
2016-08-08,8.6956
2016-08-09,8.677
2016-08-10,8.5752
2016-08-11,8.6122
2016-08-12,8.5474
2016-08-15,8.853
2016-08-16,8.8345
2016-08-17,8.8437
2016-08-18,8.9178
2016-08-19,8.9734
2016-08-22,8.9456
2016-08-23,8.9548
2016-08-24,8.9178
2016-08-25,8.9363
2016-08-26,9.066
2016-08-29,9.1308
2016-08-30,9.2327
2016-08-31,9.2327
2016-09-01,9.1215
2016-09-02,9.1956
2016-09-06,9.0984
2016-09-07,9.2848
2016-09-08,9.2569
2016-09-09,9.1636
2016-09-12,9.2475
2016-09-13,8.9586
2016-09-14,8.8747
2016-09-15,8.9772
2016-09-16,8.9119
2016-09-19,9.0052
2016-09-20,8.9958
2016-09-21,9.0238
2016-09-22,9.1077
2016-09-23,9.117
2016-09-26,8.9119
2016-09-27,9.0518
2016-09-28,9.1636
2016-09-29,9.0145
2016-09-30,9.2009
2016-10-03,9.2475
2016-10-04,9.3967
2016-10-05,9.6111
2016-10-06,9.6204
2016-10-07,9.6297
2016-10-10,9.667
2016-10-11,9.5645
2016-10-12,9.5458
2016-10-13,9.2755
2016-10-14,9.3687
2016-10-17,9.3314
2016-10-18,9.5552
2016-10-19,9.8255
2016-10-20,9.8908
2016-10-21,9.9187
2016-10-24,9.8908
2016-10-25,9.9001
2016-10-26,10.0213
2016-10-27,10.1052
2016-10-28,9.9281
2016-10-31,9.984
2016-11-01,10.1052
2016-11-02,9.7975
2016-11-03,9.7509
2016-11-04,9.8069
2016-11-07,10.217
2016-11-08,10.1518
2016-11-09,10.7577
2016-11-10,11.3543
2016-11-11,11.606
2016-11-14,12.3704
2016-11-15,12.6128
2016-11-16,12.0162
2016-11-17,12.2772
2016-11-18,12.3611
2016-11-21,12.2213
2016-11-22,12.2586
2016-11-23,12.3984
2016-11-25,12.4543
2016-11-28,12.1933
2016-11-29,12.2865
2016-11-30,12.6221
2016-12-01,12.9018
2016-12-02,12.8086
2016-12-05,13.0696
2016-12-06,13.2747
2016-12-07,13.5416
2016-12-08,13.6259
2016-12-09,13.6727
2016-12-12,13.4479
2016-12-13,13.3824
2016-12-14,13.4292
2016-12-15,13.5978
2016-12-16,13.2981
2016-12-19,13.373
2016-12-20,13.654
2016-12-21,13.6071
2016-12-22,13.6259
2016-12-23,13.6352
2016-12-27,13.7102
2016-12-28,13.5135
2016-12-29,13.27
2016-12-30,13.4479
2017-01-03,13.5135
2017-01-04,13.6914
2017-01-05,13.5135
2017-01-06,13.5603
2017-01-09,13.4573
2017-01-10,13.6352
2017-01-11,13.5978
2017-01-12,13.5135
2017-01-13,13.7476
2017-01-17,12.9048
2017-01-18,13.1389
2017-01-19,13.0921
2017-01-20,13.1483
2017-01-23,13.0265
2017-01-24,13.3356
2017-01-25,13.6914
2017-01-26,13.7663
2017-01-27,13.6165
2017-01-30,13.5322
2017-01-31,13.4948
2017-02-01,13.5416
2017-02-02,13.3449
2017-02-03,13.6914
2017-02-06,13.7008
2017-02-07,13.654
2017-02-08,13.5697
2017-02-09,14.0379
2017-02-10,14.0379
2017-02-13,14.1878
2017-02-14,14.5062
2017-02-15,14.5717
2017-02-16,14.5998
2017-02-17,14.4032
2017-02-21,14.45
2017-02-22,14.347
2017-02-23,14.3657
2017-02-24,14.2346
2017-02-27,14.3376
2017-02-28,14.3001
2017-03-01,14.8995
2017-03-02,14.347
2017-03-03,14.3844
2017-03-06,14.2627
2017-03-07,14.2814
2017-03-08,14.3049
2017-03-09,14.2955
2017-03-10,14.2297
2017-03-13,14.2203
2017-03-14,14.1921
2017-03-15,14.1074
2017-03-16,14.1544
2017-03-17,14.1544
2017-03-20,13.9946
2017-03-21,13.261
2017-03-22,13.3362
2017-03-23,13.3832
2017-03-24,13.3832
2017-03-27,13.2422
2017-03-28,13.5431
2017-03-29,13.4585
2017-03-30,13.8065
2017-03-31,13.6654
2017-04-03,13.7124
2017-04-04,13.6936
2017-04-05,13.5149
2017-04-06,13.6654
2017-04-07,13.5807
2017-04-10,13.3738
2017-04-11,13.3268
2017-04-12,13.1293
2017-04-13,12.866
2017-04-17,13.1575
2017-04-18,12.5462
2017-04-19,12.565
2017-04-20,12.8283
2017-04-21,12.6685
2017-04-24,12.9882
2017-04-25,13.0353
2017-04-26,13.1857
2017-04-27,12.9694
2017-04-28,12.9318
2017-05-01,13.0447
2017-05-02,13.0164
2017-05-03,13.2798
2017-05-04,13.4209
2017-05-05,13.4303
2017-05-08,13.4961
2017-05-09,13.3644
2017-05-10,13.4961
2017-05-11,13.3362
2017-05-12,13.2892
2017-05-15,13.4867
2017-05-16,13.6748
2017-05-17,13.1387
2017-05-18,13.1763
2017-05-19,13.2516
2017-05-22,13.2328
2017-05-23,13.609
2017-05-24,13.4209
2017-05-25,13.4303
2017-05-26,13.2892
2017-05-30,13.1387
2017-05-31,13.0164
2017-06-01,12.9694
2017-06-02,12.7343
2017-06-05,12.7249
2017-06-06,12.6967
2017-06-07,12.8479
2017-06-08,13.2639
2017-06-09,13.6137
2017-06-12,13.5759
2017-06-13,13.6326
2017-06-14,13.7083
2017-06-15,13.6137
2017-06-16,13.5759
2017-06-19,13.7083
2017-06-20,13.4908
2017-06-21,13.1977
2017-06-22,13.0843
2017-06-23,12.829
2017-06-26,12.9992
2017-06-27,13.2356
2017-06-28,13.3206
2017-06-29,13.8595
2017-06-30,13.8406
2017-07-03,14.0675
2017-07-05,14.0391
2017-07-06,13.9068
2017-07-07,13.8879
2017-07-10,13.9446
2017-07-11,13.9446
2017-07-12,13.8312
2017-07-13,14.0108
2017-07-14,13.8784
2017-07-17,13.8973
2017-07-18,13.7461
2017-07-19,13.6799
2017-07-20,13.5286
2017-07-21,13.453
2017-07-24,13.6137
2017-07-25,13.765
2017-07-26,13.661
2017-07-27,13.6043
2017-07-28,13.7083
2017-07-31,13.8028
2017-08-01,14.0202
2017-08-02,14.0202
2017-08-03,14.0864
2017-08-04,14.1242
2017-08-07,14.058
2017-08-08,14.0486
2017-08-09,13.8784
2017-08-10,13.5192
2017-08-11,13.3017
2017-08-14,13.6232
2017-08-15,13.6893
2017-08-16,13.557
2017-08-17,13.2261
2017-08-18,13.2923
2017-08-21,13.2734
2017-08-22,13.4624
2017-08-23,13.5286
2017-08-24,13.661
2017-08-25,13.661
2017-08-28,13.5097
2017-08-29,13.3868
2017-08-30,13.4624
2017-08-31,13.3395
2017-09-01,13.453
2017-09-05,12.8952
2017-09-06,12.8763
2017-09-07,12.5337
2017-09-08,12.6193
2017-09-11,12.8668
2017-09-12,13.0381
2017-09-13,13.0762
2017-09-14,13.0286
2017-09-15,13.0857
2017-09-18,13.3426
2017-09-19,13.4663
2017-09-20,13.6186
2017-09-21,13.7328
2017-09-22,13.7233
2017-09-25,13.7804
2017-09-26,13.9993
2017-09-27,14.3229
2017-09-28,14.3133
2017-09-29,14.4942
2017-10-02,14.4942
2017-10-03,14.4371
2017-10-04,14.3609
2017-10-05,14.5322
2017-10-06,14.4751
2017-10-09,14.2848
2017-10-10,14.4275
2017-10-11,14.3133
2017-10-12,14.1896
2017-10-13,14.1135
2017-10-16,14.2372
2017-10-17,14.0659
2017-10-18,14.1801
2017-10-19,14.2467
2017-10-20,14.4847
2017-10-23,14.3895
2017-10-24,14.694
2017-10-25,14.813
2017-10-26,15.0461
2017-10-27,14.9605
2017-10-30,14.8463
2017-10-31,14.7321
2017-11-01,14.8082
2017-11-02,14.951
2017-11-03,15.0461
2017-11-06,15.1128
2017-11-07,14.7226
2017-11-08,14.6179
2017-11-09,14.5418
2017-11-10,14.4371
2017-11-13,14.694
2017-11-14,14.9319
2017-11-15,15.0366
2017-11-16,14.9415
2017-11-17,15.0366
2017-11-20,15.0937
2017-11-21,14.9034
2017-11-22,14.8082
2017-11-24,14.8177
2017-11-27,14.7702
2017-11-28,15.227
2017-11-29,15.7694
2017-11-30,15.7885
2017-12-01,15.8456
2017-12-04,16.1311
2017-12-05,16.0549
2017-12-06,15.9693
2017-12-07,16.2372
2017-12-08,16.3424
2017-12-11,16.2468
2017-12-12,16.5625
2017-12-13,16.3424
2017-12-14,16.1798
2017-12-15,16.3807
2017-12-18,16.5817
2017-12-19,16.5529
2017-12-20,16.5051
2017-12-21,16.7347
2017-12-22,16.7156
2017-12-26,16.6008
2017-12-27,16.5529
2017-12-28,16.6295
2017-12-29,16.5338
2018-01-02,16.6199
2018-01-03,16.6486
2018-01-04,16.7826
2018-01-05,16.7347
2018-01-08,16.7156
2018-01-09,17.0122
2018-01-10,17.2993
2018-01-11,17.4141
2018-01-12,17.4906
2018-01-16,17.3758
2018-01-17,17.5672
2018-01-18,17.3662
2018-01-19,17.8638
2018-01-22,18.3326
2018-01-23,18.524
2018-01-24,18.591
2018-01-25,18.3135
2018-01-26,18.5431
2018-01-29,18.4283
2018-01-30,18.3231
2018-01-31,18.3996
2018-02-01,18.6962
2018-02-02,18.4187
2018-02-05,17.6629
2018-02-06,17.8638
2018-02-07,18.1413
2018-02-08,17.127
2018-02-09,17.4811
2018-02-12,17.6724
2018-02-13,18.036
2018-02-14,18.5336
2018-02-15,18.6388
2018-02-16,18.6101
2018-02-20,18.5623
2018-02-21,18.7728
2018-02-22,18.4762
2018-02-23,18.8015
2018-02-26,18.945
2018-02-27,18.7728
2018-02-28,18.5718
2018-03-01,18.4283
2018-03-02,18.6292
2018-03-05,18.8684
2018-03-06,19.0407
2018-03-07,19.012
2018-03-08,18.9927
2018-03-09,19.3291
2018-03-12,19.1465
2018-03-13,18.9447
2018-03-14,18.6467
2018-03-15,18.6179
2018-03-16,18.8678
2018-03-19,18.7909
2018-03-20,18.7044
2018-03-21,18.7717
2018-03-22,17.897
2018-03-23,17.3107
2018-03-26,18.07
2018-03-27,17.5798
2018-03-28,17.5702
2018-03-29,17.8586
2018-04-02,17.4549
2018-04-03,17.6855
2018-04-04,18.0316
2018-04-05,18.1085
2018-04-06,17.5221
2018-04-09,17.6663
2018-04-10,17.8778
2018-04-11,17.7048
2018-04-12,18.243
2018-04-13,17.7913
2018-04-16,17.7528
2018-04-17,17.253
2018-04-18,17.2146
2018-04-19,17.4453
2018-04-20,18.1565
2018-04-23,18.1277
2018-04-24,18.1373
2018-04-25,18.2815
2018-04-26,18.0796
2018-04-27,18.2622
2018-04-30,17.9739
2018-05-01,18.022
2018-05-02,17.8297
2018-05-03,17.7048
2018-05-04,17.9931
2018-05-07,18.022
2018-05-08,18.2334
2018-05-09,18.4737
2018-05-10,18.5794
2018-05-11,18.5698
2018-05-14,18.4545
2018-05-15,18.6371
2018-05-16,18.5506
2018-05-17,18.5698
2018-05-18,18.3872
2018-05-21,18.4064
2018-05-22,18.6948
2018-05-23,18.4545
2018-05-24,18.3968
2018-05-25,18.2719
2018-05-29,17.4068
2018-05-30,17.7048
2018-05-31,17.5318
2018-06-01,17.8682
2018-06-04,18.0027
2018-06-05,17.9066
2018-06-06,18.5025
2018-06-07,18.406
2018-06-08,18.4542
2018-06-11,18.2225
2018-06-12,18.2997
2018-06-13,18.2418
2018-06-14,17.9811
2018-06-15,17.9521
2018-06-18,18.0776
2018-06-19,18.2997
2018-06-20,18.2611
2018-06-21,18.2708
2018-06-22,17.8942
2018-06-25,17.7203
2018-06-26,17.5562
2018-06-27,17.2471
2018-06-28,17.3727
2018-06-29,17.1699
2018-07-02,17.2761
2018-07-03,16.9574
2018-07-05,16.8609
2018-07-06,16.9864
2018-07-09,17.4499
2018-07-10,17.2665
2018-07-11,17.083
2018-07-12,16.9188
2018-07-13,16.6194
2018-07-16,16.9092
2018-07-17,17.0347
2018-07-18,17.4403
2018-07-19,17.0154
2018-07-20,17.2085
2018-07-23,17.6431
2018-07-24,17.6431
2018-07-25,17.6624
2018-07-26,17.759
2018-07-27,17.9231
2018-07-30,18.1742
2018-07-31,17.9714
2018-08-01,18.1839
2018-08-02,18.4156
2018-08-03,18.4832
2018-08-06,18.4639
2018-08-07,18.6474
2018-08-08,18.7053
2018-08-09,18.6184
2018-08-10,18.4736
2018-08-13,18.2997
2018-08-14,18.5412
2018-08-15,18.4156
2018-08-16,18.7343
2018-08-17,18.8212
2018-08-20,18.8116
2018-08-21,18.8695
2018-08-22,18.8598
2018-08-23,18.6764
2018-08-24,18.5991
2018-08-27,18.7729
2018-08-28,18.8019
2018-08-29,18.8502
2018-08-30,18.686
2018-08-31,18.7922
2018-09-04,18.9661
2018-09-05,19.2461
2018-09-06,19.0419
2018-09-07,19.0711
2018-09-10,19.003
2018-09-11,19.11
2018-09-12,18.6237
2018-09-13,18.3514
2018-09-14,18.4487
2018-09-17,18.4584
2018-09-18,18.3903
2018-09-19,18.6334
2018-09-20,18.9544
2018-09-21,18.9057
2018-09-24,18.7599
2018-09-25,18.721
2018-09-26,18.4195
2018-09-27,18.0305
2018-09-28,17.8457
2018-10-01,17.6415
2018-10-02,17.6123
2018-10-03,17.9624
2018-10-04,18.1569
2018-10-05,18.0305
2018-10-08,18.1763
2018-10-09,18.0791
2018-10-10,17.7679
2018-10-11,17.2525
2018-10-12,16.8148
2018-10-15,16.6884
2018-10-16,16.7467
2018-10-17,16.8537
2018-10-18,16.5717
2018-10-19,16.4355
2018-10-22,15.9396
2018-10-23,15.8326
2018-10-24,15.0351
2018-10-25,15.6186
2018-10-26,15.6186
2018-10-29,15.9785
2018-10-30,16.066
2018-10-31,16.5036
2018-11-01,16.737
2018-11-02,16.7857
2018-11-05,16.844
2018-11-06,17.1552
2018-11-07,17.0385
2018-11-08,17.1844
2018-11-09,16.7662
2018-11-12,16.4647
2018-11-13,16.4161
2018-11-14,15.9201
2018-11-15,15.9979
2018-11-16,15.7548
2018-11-19,15.6867
2018-11-20,15.3949
2018-11-21,15.3852
2018-11-23,15.5214
2018-11-26,15.8909
2018-11-27,15.8131
2018-11-28,15.9785
2018-11-29,15.7645
2018-11-30,15.9979
2018-12-03,16.173
2018-12-04,15.1615
2018-12-06,15.0143
2018-12-07,14.6218
2018-12-10,14.1213
2018-12-11,13.8956
2018-12-12,13.9938
2018-12-13,13.5227
2018-12-14,13.2185
2018-12-17,13.14
2018-12-18,12.983
2018-12-19,12.6003
2018-12-20,12.669
2018-12-21,12.6199
2018-12-24,12.3353
2018-12-26,13.14
2018-12-27,13.1106
2018-12-28,13.1008
2018-12-31,13.1302
2019-01-02,13.4148
2019-01-03,13.3951
2019-01-04,13.8858
2019-01-07,14.1213
2019-01-08,14.2685
2019-01-09,14.4255
2019-01-10,14.4354
2019-01-11,14.5041
2019-01-14,14.6807
2019-01-15,14.8279
2019-01-16,15.1125
2019-01-17,15.3186
2019-01-18,15.4069
2019-01-22,15.2989
2019-01-23,15.083
2019-01-24,15.2204
2019-01-25,15.3578
2019-01-28,15.3872
2019-01-29,15.2401
2019-01-30,15.1419
2019-01-31,14.8868
2019-02-01,15.0438
2019-02-04,15.1812
2019-02-05,15.1223
2019-02-06,15.1223
2019-02-07,15.2204
2019-02-08,15.1517
2019-02-11,15.0732
2019-02-12,15.1812
2019-02-13,15.2989
2019-02-14,15.2204
2019-02-15,15.7013
2019-02-19,15.8387
2019-02-20,16.0546
2019-02-21,15.9466
2019-02-22,15.9368
2019-02-25,16.0644
2019-02-26,15.8975
2019-02-27,16.2606
2019-02-28,16.0938
2019-03-01,16.0055
2019-03-04,15.8583
2019-03-05,15.8092
2019-03-06,15.4756
2019-03-07,15.2676
2019-03-08,15.3172
2019-03-11,15.4162
2019-03-12,15.4657
2019-03-13,15.6538
2019-03-14,15.634
2019-03-15,15.5845
2019-03-18,15.8122
2019-03-19,15.4756
2019-03-20,14.8122
2019-03-21,14.2874
2019-03-22,13.3963
2019-03-25,13.3963
2019-03-26,13.7924
2019-03-27,13.832
2019-03-28,14.03
2019-03-29,14.0102
2019-04-01,14.5251
2019-04-02,14.6934
2019-04-03,14.7231
2019-04-04,14.9508
2019-04-05,14.9904
2019-04-08,15.0894
2019-04-09,14.8518
2019-04-10,14.9706
2019-04-11,15.0597
2019-04-12,15.4459
2019-04-15,15.1092
2019-04-16,15.4063
2019-04-17,15.6043
2019-04-18,15.0993
2019-04-22,15.0894
2019-04-23,15.2181
2019-04-24,15.228
2019-04-25,15.3172
2019-04-26,15.3964
2019-04-29,15.5251
2019-04-30,15.3766
2019-05-01,15.0201
2019-05-02,15.2776
2019-05-03,15.4261
2019-05-06,15.2379
2019-05-07,14.9607
2019-05-08,14.8023
2019-05-09,14.7825
2019-05-10,14.9013
2019-05-13,14.1983
2019-05-14,14.3963
2019-05-15,14.1785
2019-05-16,14.3765
2019-05-17,14.2577
2019-05-20,14.327
2019-05-21,14.4161
2019-05-22,14.2676
2019-05-23,13.931
2019-05-24,14.0498
2019-05-28,13.8023
2019-05-29,14.0102
2019-05-30,13.9211
2019-05-31,13.6934
2019-06-03,13.8419
2019-06-04,14.1884
2019-06-05,14.03
2019-06-06,14.04
2019-06-07,13.88
2019-06-10,13.99
2019-06-11,14.47
2019-06-12,14.24
2019-06-13,14.475
2019-06-14,14.635
2019-06-17,14.39
2019-06-18,14.8
2019-06-19,14.575
2019-06-20,14.57
2019-06-21,14.725
2019-06-24,14.535
2019-06-25,14.42
2019-06-26,14.455
2019-06-27,14.59
2019-06-28,14.9
2019-07-01,15.06
2019-07-02,14.8
2019-07-03,15.055
2019-07-04,15.055
2019-07-05,15.205
2019-07-08,15.13
2019-07-09,15.275
2019-07-10,15.055
2019-07-11,15.18
2019-07-12,15.23
2019-07-15,14.945
2019-07-16,14.96
2019-07-17,14.715
2019-07-18,14.79
2019-07-19,15.105
2019-07-22,15.09
2019-07-23,15.55
2019-07-24,15.945
2019-07-25,15.71
2019-07-26,16.035
2019-07-29,15.825
2019-07-30,16.035
2019-07-31,15.96
2019-08-01,15.205
2019-08-02,15.33
2019-08-05,14.57
2019-08-06,14.75
2019-08-07,14.505
2019-08-08,14.725
2019-08-09,14.66
2019-08-12,14.31
2019-08-13,14.255
2019-08-14,13.68
2019-08-15,13.565
2019-08-16,14.095
2019-08-19,14.235
2019-08-20,14.005
2019-08-21,14.145
2019-08-22,14.275
2019-08-23,13.74
2019-08-26,14.015
2019-08-27,13.85
2019-08-28,14.105
2019-08-29,14.455
2019-08-30,14.635
2019-09-02,14.61
2019-09-03,14.255
2019-09-04,14.44
2019-09-05,14.81
2019-09-06,14.835
2019-09-09,15.45
2019-09-10,15.99
2019-09-11,16.22
2019-09-12,16.275
2019-09-13,16.34
2019-09-16,16.455
2019-09-17,16.245
2019-09-18,16.335
2019-09-19,16.135
2019-09-20,15.98
2019-09-23,16.05
2019-09-24,15.865
2019-09-25,16.055
2019-09-26,15.89
2019-09-27,15.945
2019-09-30,15.835
2019-10-01,15.425
2019-10-02,15.165
2019-10-03,15.205
2019-10-04,15.38
2019-10-07,15.4
2019-10-08,14.905
2019-10-09,14.92
2019-10-10,15.135
2019-10-11,15.425
2019-10-14,15.375
2019-10-15,15.675
2019-10-16,15.545
2019-10-17,15.555
2019-10-18,15.825
2019-10-21,16.085
2019-10-22,16.275
2019-10-23,16.275
2019-10-24,16.175
2019-10-25,16.395
2019-10-28,16.505
2019-10-29,16.465
2019-10-30,16.26
2019-10-31,16.085
2019-11-01,16.515
2019-11-04,16.985
2019-11-05,17.205
2019-11-06,17.055
2019-11-07,16.91
2019-11-08,16.865
2019-11-11,16.76
2019-11-12,16.68
2019-11-13,16.405
2019-11-14,16.455
2019-11-15,16.515
2019-11-18,16.54
2019-11-19,16.52
2019-11-20,16.425
2019-11-21,16.485
2019-11-22,16.665
2019-11-25,16.83
