date,close
2014-02-19,1392.5
2014-02-20,1375
2014-02-21,1322.5
2014-02-24,1322.53
2014-02-25,1337.5
2014-02-27,1374.97
2014-02-28,1385
2014-03-03,1425
2014-03-05,1445.75
2014-03-06,1422.5
2014-03-07,1395
2014-03-10,1425
2014-03-11,1402.5
2014-03-12,1412.25
2014-03-13,1357.5
2014-03-14,1357.5
2014-03-17,1362.5
2014-03-18,1337.5
2014-03-19,1287.12
2014-03-20,1287.5
2014-03-21,1287.5
2014-03-25,1287.5
2014-03-26,1317.5
2014-03-27,1280
2014-03-28,1251.72
2014-03-31,1287.5
2014-04-01,1277.47
2014-04-02,1275
2014-04-03,1260
2014-04-04,1260
2014-04-08,1320
2014-04-09,1312.5
2014-04-10,1282.47
2014-04-14,1177.5
2014-04-15,1209.75
2014-04-16,1122.5
2014-04-17,1082.5
2014-04-22,1072.5
2014-04-23,1110
2014-04-25,1075
2014-04-28,977.5
2014-04-29,927.5
2014-04-30,1090
2014-05-01,1125
2014-05-02,1122.5
2014-05-05,1121.5
2014-05-06,1040
2014-05-07,1012.5
2014-05-08,992.5
2014-05-09,987.5
2014-05-12,1032.62
2014-05-14,1007.5
2014-05-16,945
2014-05-19,942.5
2014-05-20,902.5
2014-05-21,1030
2014-05-22,1127.5
2014-05-23,1130
2014-05-27,1125
2014-05-28,1027.5
2014-05-29,1037.5
2014-05-30,1015
2014-06-02,1011.1
2014-06-03,930
2014-06-04,875
2014-06-05,930
2014-06-06,910
2014-06-09,950
2014-06-10,962.5
2014-06-11,1002.5
2014-06-12,1047.5
2014-06-13,975
2014-06-16,1025
2014-06-17,1030
2014-06-18,1087.5
2014-06-19,1022.5
2014-06-20,995
2014-06-23,1045
2014-06-24,985
2014-06-25,1024.97
2014-06-26,1018
2014-06-27,1000.02
2014-06-30,992.5
2014-07-01,991.375
2014-07-02,1065
2014-07-03,1199.97
2014-07-07,1110
2014-07-08,1095
2014-07-09,1075
2014-07-10,1074.33
2014-07-11,1072.5
2014-07-14,1072.5
2014-07-15,1072.5
2014-07-16,1035
2014-07-17,984.975
2014-07-18,997.475
2014-07-21,988.05
2014-07-22,984.975
2014-07-23,980
2014-07-24,977.75
2014-07-25,994.975
2014-07-28,952.5
2014-07-29,1013
2014-07-30,960
2014-07-31,972.5
2014-08-01,925
2014-08-04,917.5
2014-08-05,920
2014-08-06,920
2014-08-07,945
2014-08-08,938
2014-08-11,913.3
2014-08-12,875
2014-08-13,852.5
2014-08-14,967.4
2014-08-15,902.5
2014-08-18,902.5
2014-08-19,902.5
2014-08-21,897.475
2014-08-22,887.5
2014-08-26,887.25
2014-08-27,893.975
2014-08-28,955
2014-08-29,928.625
2014-09-02,925
2014-09-03,917.5
2014-09-04,883
2014-09-05,900
2014-09-08,917.5
2014-09-09,925
2014-09-10,915
2014-09-11,920
2014-09-12,915
2014-09-15,900
2014-09-16,872.5
2014-09-17,862.5
2014-09-18,752.5
2014-09-19,752.5
2014-09-22,720
2014-09-23,734.975
2014-09-25,675
2014-09-26,652.5
2014-09-29,627.5
2014-09-30,652.5
2014-10-02,687.475
2014-10-03,652.5
2014-10-06,650
2014-10-07,610
2014-10-08,608.75
2014-10-09,617.5
2014-10-10,645
2014-10-13,642.5
2014-10-14,612.475
2014-10-15,610
2014-10-16,605.5
2014-10-17,630
2014-10-20,635
2014-10-21,630
2014-10-22,621.5
2014-10-23,635
2014-10-24,635
2014-10-27,632.5
2014-10-28,613.775
2014-10-29,630
2014-10-30,634.975
2014-10-31,575
2014-11-03,625
2014-11-04,665
2014-11-05,677.5
2014-11-06,750
2014-11-07,750
2014-11-10,727.5
2014-11-11,825
2014-11-12,785
2014-11-13,800
2014-11-14,757.5
2014-11-17,761.075
2014-11-18,735
2014-11-19,735
2014-11-20,745
2014-11-21,748.75
2014-11-24,742.5
2014-11-26,657.5
2014-11-28,612.5
2014-12-01,617.5
2014-12-02,585
2014-12-03,525
2014-12-04,540.025
2014-12-08,545
2014-12-10,495
2014-12-11,472.375
2014-12-12,490
2014-12-15,475
2014-12-16,488.75
2014-12-18,509.975
2014-12-19,562.5
2014-12-22,442.5
2014-12-23,457.5
2014-12-24,437.5
2014-12-26,453.75
2014-12-29,450
2014-12-30,450
2014-12-31,499.975
2015-01-02,457.5
2015-01-05,440
2015-01-06,440
2015-01-07,442.5
2015-01-08,432.5
2015-01-09,432.5
2015-01-12,432.5
2015-01-14,430
2015-01-16,430
2015-01-20,380
2015-01-21,400
2015-01-22,382.5
2015-01-23,357.5
2015-01-26,412.525
2015-01-27,455
2015-01-28,407.5
2015-01-29,407.5
2015-01-30,407.5
2015-02-02,462.5
2015-02-03,450
2015-02-04,435
2015-02-05,422.5
2015-02-06,437.5
2015-02-09,447.5
2015-02-10,450
2015-02-11,410
2015-02-12,415
2015-02-13,387.5
2015-02-17,367.5
2015-02-18,365
2015-02-19,365
2015-02-20,446.4
2015-02-23,617
2015-02-24,875.025
2015-02-25,1200
2015-02-26,875
2015-02-27,1037.5
2015-03-02,1037.5
2015-03-03,905.025
2015-03-04,862.5
2015-03-05,758.75
2015-03-06,814.75
2015-03-09,657.5
2015-03-10,762.5
2015-03-11,705
2015-03-12,700.025
2015-03-13,707.5
2015-03-16,722.5
2015-03-17,705
2015-03-18,690
2015-03-19,694.5
2015-03-20,637.5
2015-03-23,627.5
2015-03-24,637.5
2015-03-25,662.5
2015-03-26,632.25
2015-03-27,605
2015-03-30,605
2015-03-31,625
2015-04-01,637.5
2015-04-02,625
2015-04-06,625
2015-04-07,625
2015-04-08,637.475
2015-04-09,637.5
2015-04-10,637.5
2015-04-13,587.475
2015-04-14,574.975
2015-04-15,587.5
2015-04-16,575.25
2015-04-17,604.525
2015-04-20,590.025
2015-04-21,882
2015-04-22,724.75
2015-04-23,700
2015-04-24,722.5
2015-04-27,690
2015-04-28,649.5
2015-04-29,650
2015-04-30,602.5
2015-05-01,633.75
2015-05-04,633.75
2015-05-05,605
2015-05-06,592.5
2015-05-07,637.25
2015-05-08,626.125
2015-05-11,592.5
2015-05-12,602.5
2015-05-13,642.55
2015-05-14,644.45
2015-05-15,639.5
2015-05-18,602.5
2015-05-19,602.5
2015-05-20,617.5
2015-05-21,575.025
2015-05-22,575
2015-05-26,572.5
2015-05-27,570
2015-05-28,587.5
2015-05-29,617.5
2015-06-01,607.5
2015-06-02,615
2015-06-03,605
2015-06-04,612.5
2015-06-05,582.5
2015-06-08,612.475
2015-06-09,577.525
2015-06-10,577.525
2015-06-11,553.95
2015-06-12,557.5
2015-06-15,540
2015-06-16,555
2015-06-17,570
2015-06-19,570
2015-06-22,555
2015-06-23,610
2015-06-24,617.5
2015-06-25,620
2015-06-26,622.5
2015-06-29,620
2015-06-30,607.5
2015-07-01,587.5
2015-07-02,565
2015-07-06,592.5
2015-07-07,545
2015-07-08,545
2015-07-09,550
2015-07-10,550
2015-07-13,550.6
2015-07-14,552.525
2015-07-15,550
2015-07-16,550
2015-07-17,550
2015-07-20,537.5
2015-07-21,537.525
2015-07-22,550
2015-07-23,558.75
2015-07-24,537.5
2015-07-27,543.375
2015-07-28,522.5
2015-07-29,537.5
2015-07-30,537.5
2015-07-31,517.525
2015-08-03,517.5
2015-08-04,517.5
2015-08-05,524.575
2015-08-06,512.5
2015-08-07,512.5
2015-08-10,520
2015-08-11,577.525
2015-08-12,575
2015-08-13,597.475
2015-08-14,610
2015-08-17,570
2015-08-18,570.025
2015-08-19,610
2015-08-20,568.475
2015-08-21,556.525
2015-08-24,635
2015-08-25,625
2015-08-26,567.5
2015-08-27,567.5
2015-08-28,547.5
2015-08-31,545
2015-09-02,545
2015-09-03,545
2015-09-04,545
2015-09-08,537.5
2015-09-09,537.5
2015-09-10,585
2015-09-11,587.5
2015-09-14,587.5
2015-09-15,560
2015-09-16,585
2015-09-17,580
2015-09-18,535
2015-09-21,535
2015-09-22,522.5
2015-09-23,535
2015-09-24,535
2015-09-25,535
2015-09-28,535
2015-09-29,520.025
2015-10-01,520
2015-10-02,507.5
2015-10-05,515
2015-10-06,529.4
2015-10-07,529.4
2015-10-09,529.4
2015-10-12,529.4
2015-10-13,507.5
2015-10-14,507.5
2015-10-15,507.5
2015-10-21,527.5
2015-10-23,542.525
2015-10-26,520
2015-10-27,535.025
2015-10-28,535.025
2015-10-29,535.025
2015-10-30,535.025
2015-11-02,535.025
2015-11-03,527.5
2015-11-05,550
2015-11-06,550
2015-11-11,535
2015-11-12,525
2015-11-13,500
2015-11-16,500.025
2015-11-17,500.025
2015-11-18,455.025
2015-11-19,465.025
2015-11-20,462.5
2015-11-23,437.5
2015-11-24,462.5
2015-11-25,437.5
2015-11-27,423.1
2015-11-30,423.1
2015-12-01,405.025
2015-12-02,390
2015-12-03,432.5
2015-12-04,432.5
2015-12-07,432.5
2015-12-08,400.025
2015-12-09,397.5
2015-12-10,400
2015-12-11,412.525
2015-12-14,358.85
2015-12-15,390
2015-12-16,375
2015-12-17,366.25
2015-12-18,388.1
2015-12-21,362.825
2015-12-22,340
2015-12-23,327.5
2015-12-24,340
2015-12-28,342.5
2015-12-29,337.5
2015-12-30,375
2015-12-31,347.5
2016-01-05,407.875
2016-01-06,447.525
2016-01-07,445
2016-01-08,432.025
2016-01-11,390
2016-01-12,424.975
2016-01-13,427.5
2016-01-14,486.125
2016-01-15,486.125
2016-01-19,499.975
2016-01-20,497.475
2016-01-21,497.475
2016-01-22,350
2016-01-25,350
2016-01-26,350
2016-01-27,375
2016-01-28,364.375
2016-01-29,400
2016-02-01,400
2016-02-03,400
2016-02-08,400
2016-02-11,400
2016-02-12,422.5
2016-02-16,422.5
2016-02-17,372.5
2016-02-18,375
2016-02-25,375
2016-02-26,375
2016-02-29,375
2016-03-01,357.5
2016-03-02,357.5
2016-03-03,357.5
2016-03-04,336.05
2016-03-07,330.575
2016-03-08,290.9
2016-03-09,292.5
2016-03-10,320
2016-03-11,270
2016-03-14,325
2016-03-15,325
2016-03-16,352.15
2016-03-17,380
2016-03-18,368.125
2016-03-21,332.5
2016-03-22,350
2016-03-24,350
2016-03-30,300
2016-04-01,300
2016-04-04,315
2016-04-05,315
2016-04-06,315
2016-04-07,340.025
2016-04-08,330
2016-04-11,365
2016-04-12,352.5
2016-04-13,357.5
2016-04-14,375
2016-04-15,325
2016-04-18,325
2016-04-20,350.025
2016-04-21,390
2016-04-22,349.55
2016-04-25,362.5
2016-04-26,337.5
2016-04-27,348.75
2016-04-28,332.5
2016-04-29,330
2016-05-02,331.2
2016-05-03,355
2016-05-05,355
2016-05-06,355
2016-05-09,310.025
2016-05-11,332.5
2016-05-12,332.5
2016-05-13,310
2016-05-16,335
2016-05-17,337.5
2016-05-20,337.5
2016-05-23,337.5
2016-05-24,337.5
2016-05-25,337.5
2016-05-26,282.5
2016-05-27,275
2016-05-31,297.8
2016-06-01,297.5
2016-06-02,278.05
2016-06-03,278.05
2016-06-06,1805
2016-06-07,2812.5
2016-06-08,3437.5
2016-06-09,2775
2016-06-10,2322.5
2016-06-13,2587.5
2016-06-14,2472.5
2016-06-15,3317.5
2016-06-16,3067.5
2016-06-17,3050
2016-06-20,3075
2016-06-21,2872.5
2016-06-22,2632.5
2016-06-23,2617.5
2016-06-24,2525
2016-06-27,2352.5
2016-06-28,2457.5
2016-06-29,2267.5
2016-06-30,2287.5
2016-07-01,2137.5
2016-07-05,1900
2016-07-06,1975
2016-07-07,2075
2016-07-08,2430
2016-07-11,2367.5
2016-07-12,2442.5
2016-07-13,2230
2016-07-14,2412.5
2016-07-15,2270
2016-07-18,2022.5
2016-07-19,2052.5
2016-07-20,1935
2016-07-21,1840
2016-07-22,1965
2016-07-25,2047.5
2016-07-26,1995
2016-07-27,2050
2016-07-28,2037.5
2016-07-29,1995
2016-08-01,1937.5
2016-08-02,1949.75
2016-08-03,1935
2016-08-04,2707.5
2016-08-05,2597.5
2016-08-08,2347.5
2016-08-09,2347.5
2016-08-10,2247.5
2016-08-11,2350
2016-08-12,2275
2016-08-15,2240
2016-08-16,2382.5
2016-08-17,2600
2016-08-18,2545
2016-08-19,2487.5
2016-08-22,2525
2016-08-23,2650
2016-08-24,2577.5
2016-08-25,2550
2016-08-26,2577.5
2016-08-29,2505
2016-08-30,2337.5
2016-08-31,2305
2016-09-01,2252.5
2016-09-02,2255
2016-09-06,2365
2016-09-07,2500
2016-09-08,2410
2016-09-09,2282.5
2016-09-12,2325
2016-09-13,2240
2016-09-14,2162.5
2016-09-15,2157.5
2016-09-16,2070
2016-09-19,2125
2016-09-20,2000.03
2016-09-21,2082.5
2016-09-22,2147.5
2016-09-23,2150
2016-09-26,2087.5
2016-09-27,2245
2016-09-28,2087.5
2016-09-29,2076.25
2016-09-30,2035
2016-10-03,2045
2016-10-04,2040
2016-10-05,1975
2016-10-06,1880
2016-10-07,1887.5
2016-10-10,1877.5
2016-10-11,1827.5
2016-10-12,1825
2016-10-13,1872.5
2016-10-14,1760
2016-10-17,1590
2016-10-18,1500
2016-10-19,1435
2016-10-20,1403
2016-10-21,2475
2016-10-24,2450
2016-10-25,1777.5
2016-10-26,1830
2016-10-27,1650
2016-10-28,1610
2016-10-31,1725
2016-11-01,1550
2016-11-02,1400
2016-11-03,1350
2016-11-04,1385
2016-11-07,1325
2016-11-08,1352.5
2016-11-09,1337.5
2016-11-10,1325
2016-11-11,1467.5
2016-11-14,1455
2016-11-15,1637.5
2016-11-16,1535
2016-11-17,1482.5
2016-11-18,1405
2016-11-21,1440
2016-11-22,1405
2016-11-23,1335
2016-11-25,1362.5
2016-11-28,1350
2016-11-29,1307.5
2016-11-30,1205
2016-12-01,1067.5
2016-12-02,1135
2016-12-05,1037.5
2016-12-06,1050
2016-12-07,1085
2016-12-08,1065
2016-12-09,1302.5
2016-12-12,1080
2016-12-13,1047.5
2016-12-14,1080
2016-12-15,1052.5
2016-12-16,1040
2016-12-19,1122.5
2016-12-20,1080
2016-12-21,1072.5
2016-12-22,1055
2016-12-23,1065
2016-12-27,952.5
2016-12-28,927.5
2016-12-29,862.5
2016-12-30,825
2017-01-03,777.5
2017-01-04,855
2017-01-05,850
2017-01-06,820
2017-01-09,802.5
2017-01-10,810
2017-01-11,915
2017-01-12,915
2017-01-13,850
2017-01-17,842.5
2017-01-18,832.5
2017-01-19,837.5
2017-01-20,865
2017-01-23,987.5
2017-01-24,880
2017-01-25,897.5
2017-01-26,887.5
2017-01-27,1005
2017-01-30,1060
2017-01-31,1067.5
2017-02-01,1087.5
2017-02-02,962.5
2017-02-03,982.5
2017-02-06,992.5
2017-02-07,975
2017-02-08,927.5
2017-02-09,892.5
2017-02-10,920
2017-02-13,900
2017-02-14,912.5
2017-02-15,927.5
2017-02-16,910
2017-02-17,902.5
2017-02-21,802.5
2017-02-22,780
2017-02-23,805
2017-02-24,745
2017-02-27,767.5
2017-02-28,752.5
2017-03-01,757.5
2017-03-02,777.5
2017-03-03,812.5
2017-03-06,810
2017-03-07,690
2017-03-08,775
2017-03-09,760
2017-03-10,737.5
2017-03-13,735
2017-03-14,710
2017-03-15,677.5
2017-03-16,695
2017-03-17,675
2017-03-20,662.5
2017-03-21,667.5
2017-03-22,642.5
2017-03-23,650
2017-03-24,612.5
2017-03-27,680
2017-03-28,647.5
2017-03-29,665
2017-03-30,712.5
2017-03-31,707.5
2017-04-03,690
2017-04-04,690
2017-04-05,685
2017-04-06,687.5
2017-04-07,685
2017-04-10,677.5
2017-04-11,677.5
2017-04-12,665
2017-04-13,675
2017-04-17,652.5
2017-04-18,652.5
2017-04-19,677.5
2017-04-20,816.475
2017-04-21,737.5
2017-04-24,712.5
2017-04-25,677.5
2017-04-26,662.5
2017-04-27,665
2017-04-28,662.5
2017-05-01,655
2017-05-02,657.5
2017-05-03,655
2017-05-04,600
2017-05-05,570
2017-05-08,567.5
2017-05-09,582.5
2017-05-10,577.5
2017-05-11,607.5
2017-05-12,632.5
2017-05-15,625
2017-05-16,557.5
2017-05-17,602.5
2017-05-18,622.5
2017-05-19,611.275
2017-05-22,612.5
2017-05-23,952.5
2017-05-24,729.975
2017-05-25,680
2017-05-26,637.5
2017-05-30,692.5
2017-05-31,657.5
2017-06-01,650
2017-06-02,665
2017-06-05,665
2017-06-06,652.5
2017-06-07,647.5
2017-06-08,647.5
2017-06-09,637.5
2017-06-12,615
2017-06-13,620
2017-06-14,630
2017-06-15,612.5
2017-06-16,625
2017-06-19,592.5
2017-06-20,635
2017-06-21,640
2017-06-22,620
2017-06-23,620
2017-06-26,627.5
2017-06-27,599.975
2017-06-28,622.5
2017-06-29,622.5
2017-06-30,607.5
2017-07-03,602.5
2017-07-05,607.5
2017-07-06,622.5
2017-07-07,620
2017-07-10,620
2017-07-11,612.5
2017-07-12,605
2017-07-13,670
2017-07-14,650
2017-07-17,642.5
2017-07-18,637.5
2017-07-19,652.5
2017-07-20,670
2017-07-21,700
2017-07-24,737.5
2017-07-25,720
2017-07-26,705
2017-07-27,702
2017-07-28,687.5
2017-07-31,717.5
2017-08-01,700
2017-08-02,680
2017-08-03,672.5
2017-08-04,662.5
2017-08-07,685
2017-08-08,690
2017-08-09,670
2017-08-10,685
2017-08-11,672.5
2017-08-14,697.5
2017-08-15,737.5
2017-08-16,637.5
2017-08-17,692.5
2017-08-18,782.5
2017-08-21,775
2017-08-22,842.5
2017-08-23,820
2017-08-24,807.5
2017-08-25,877.5
2017-08-28,817.5
2017-08-29,762.5
2017-08-30,747.5
2017-08-31,742.5
2017-09-01,742.5
2017-09-05,725
2017-09-06,720
2017-09-07,707.5
2017-09-08,685
2017-09-11,647.5
2017-09-12,637.5
2017-09-13,625
2017-09-14,657.5
2017-09-15,917.5
2017-09-18,870
2017-09-19,1425
2017-09-20,1535
2017-09-21,1465
2017-09-22,1742.5
2017-09-25,2075
2017-09-26,2285
2017-09-27,2182.5
2017-09-28,2717.5
2017-09-29,3172.5
2017-10-02,3245
2017-10-03,3257.5
2017-10-04,3105
2017-10-05,3562.5
2017-10-06,3937.5
2017-10-09,5272.5
2017-10-10,6972.5
2017-10-11,8225
2017-10-12,5125
2017-10-13,5100
2017-10-16,5227.5
2017-10-17,4557.5
2017-10-18,4080
2017-10-19,4027.5
2017-10-20,4070
2017-10-23,3325
2017-10-24,3112.5
2017-10-25,2875
2017-10-26,2902.5
2017-10-27,2685
2017-10-30,2257.5
2017-10-31,2655
2017-11-01,2480
2017-11-02,2370
2017-11-03,2412.5
2017-11-06,3550
2017-11-07,3055
2017-11-08,2612.5
2017-11-09,2547.5
2017-11-10,2567.5
2017-11-13,3082.5
2017-11-14,2942.5
2017-11-15,3050
2017-11-16,3105
2017-11-17,3235
2017-11-20,3400
2017-11-21,3582.5
2017-11-22,3330
2017-11-24,3467.5
2017-11-27,3625
2017-11-28,3750
2017-11-29,3495
2017-11-30,3405
2017-12-01,3015
2017-12-04,3007.5
2017-12-05,2375
2017-12-06,1935
2017-12-07,2075
2017-12-08,2112.5
2017-12-11,2282.5
2017-12-12,2520
2017-12-13,1697.5
2017-12-14,1675
2017-12-15,1565
2017-12-18,1485
2017-12-19,1552.5
2017-12-20,1595
2017-12-21,1587.5
2017-12-22,1527.5
2017-12-26,1420
2017-12-27,1347.5
2017-12-28,1725
2017-12-29,1577.5
2018-01-02,1807.5
2018-01-03,1795
2018-01-04,1830
2018-01-05,1827.5
2018-01-08,1730
2018-01-09,1790
2018-01-10,2292.5
2018-01-11,2015
2018-01-12,1910
2018-01-16,2040
2018-01-17,1932.5
2018-01-18,2035
2018-01-19,2020
2018-01-22,2067.5
2018-01-23,2442.5
2018-01-24,2287.5
2018-01-25,2232.5
2018-01-26,2145
2018-01-29,2342.5
2018-01-30,2330
2018-01-31,2335
2018-02-01,2157.5
2018-02-02,2285
2018-02-05,2177.5
2018-02-06,1992.5
2018-02-07,1987.5
2018-02-08,2085
2018-02-09,1932.5
2018-02-12,1997.5
2018-02-13,1357.5
2018-02-14,1207.5
2018-02-15,1265
2018-02-16,1185
2018-02-20,1210
2018-02-21,1125
2018-02-22,1227.5
2018-02-23,1232.5
2018-02-26,1270
2018-02-27,1237.5
2018-02-28,1190
2018-03-01,1145
2018-03-02,1182.5
2018-03-05,1172.5
2018-03-06,1152.5
2018-03-07,1147.5
2018-03-08,1130
2018-03-09,1130
2018-03-12,1102.5
2018-03-13,1002.5
2018-03-14,985
2018-03-15,970
2018-03-16,876.25
2018-03-19,860
2018-03-20,842.5
2018-03-21,870
2018-03-22,782.5
2018-03-23,742.5
2018-03-26,765
2018-03-27,802.5
2018-03-28,736.25
2018-03-29,707.5
2018-04-02,665
2018-04-03,642.5
2018-04-04,745
2018-04-05,720
2018-04-06,735
2018-04-09,777.5
2018-04-10,715
2018-04-11,735
2018-04-12,755
2018-04-13,802.5
2018-04-16,1052.5
2018-04-17,990
2018-04-18,957.5
2018-04-19,637.5
2018-04-20,567.5
2018-04-23,615
2018-04-24,605
2018-04-25,627.5
2018-04-26,625
2018-04-27,615
2018-04-30,570
2018-05-01,542.5
2018-05-02,537.5
2018-05-03,532.5
2018-05-04,530
2018-05-07,527.5
2018-05-08,362.5
2018-05-09,196.3
2018-05-10,153.025
2018-05-11,162.775
2018-05-14,170.5
2018-05-15,163.025
2018-05-16,170.25
2018-05-17,157.625
2018-05-18,166.075
2018-05-21,152.425
2018-05-22,133.825
2018-05-23,123.25
2018-05-24,115.425
2018-05-25,101.875
2018-05-29,117.5
2018-05-30,115.25
2018-05-31,107.9
2018-06-01,108.875
2018-06-04,105.275
2018-06-05,97.3
2018-06-06,85.25
2018-06-07,92.7
2018-06-08,89.75
2018-06-11,93.85
2018-06-12,97.5
2018-06-13,92.25
2018-06-14,87.4
2018-06-15,86.25
2018-06-18,88.775
2018-06-19,112.475
2018-06-20,78
2018-06-21,84.25
2018-06-22,78.4
2018-06-25,72.5
2018-06-26,61.55
2018-06-27,52.225
2018-06-28,57.525
2018-06-29,77.5
2018-07-02,55
2018-07-03,53.025
2018-07-05,47.65
2018-07-06,46.225
2018-07-09,47.15
2018-07-10,47.925
2018-07-11,44.25
2018-07-12,45.75
2018-07-13,37.5
2018-07-16,27.75
2018-07-17,29.5
2018-07-18,27.975
2018-07-19,27
2018-07-20,25.3
2018-07-23,24.45
2018-07-24,21.25
2018-07-25,10.6
2018-07-26,6.83
2018-07-27,2
2018-07-30,0.8
2018-07-31,0.496
2018-08-01,0.228
2018-08-02,0.1
2018-08-03,0.07
2018-08-06,0.0834
2018-08-07,0.07
2018-08-08,0.0675
2018-08-09,0.0624
2018-08-10,0.05
2018-08-13,0.05
2018-08-14,0.05
2018-08-15,0.048
2018-08-16,0.03
2018-08-17,0.029
2018-08-20,0.0298
2018-08-21,0.0299
2018-08-22,0.03
2018-08-23,0.0202
2018-08-24,0.0186
2018-08-27,0.022
2018-08-28,0.0208
2018-08-29,0.0193
2018-08-30,0.0207
2018-08-31,0.0216
2018-09-04,0.024
2018-09-05,0.0265
2018-09-06,0.0225
2018-09-07,0.0235
2018-09-10,0.0211
2018-09-11,0.0205
2018-09-12,0.0215
2018-09-13,0.0218
2018-09-14,0.0214
2018-09-17,0.0155
2018-09-18,0.0124
2018-09-19,0.013
2018-09-20,0.0148
2018-09-21,0.014
2018-09-24,0.0177
2018-09-25,0.0186
2018-09-26,0.0173
2018-09-27,0.0154
2018-09-28,0.0151
2018-10-01,0.0146
2018-10-02,0.0133
2018-10-03,0.0365
2018-10-04,0.021
2018-10-05,0.0199
2018-10-08,0.0205
2018-10-09,0.0193
2018-10-10,0.0174
2018-10-11,0.0176
2018-10-12,0.0173
2018-10-15,0.0165
2018-10-16,0.0193
2018-10-17,0.02
2018-10-18,0.0172
2018-10-19,0.0168
2018-10-22,0.0169
2018-10-23,0.0195
2018-10-24,0.0188
2018-10-25,0.02
2018-10-26,0.019
2018-10-29,0.0182
2018-10-30,0.017
2018-10-31,0.0175
2018-11-01,0.0178
2018-11-02,0.0175
2018-11-05,0.0177
2018-11-06,0.0177
2018-11-07,0.0177
2018-11-08,0.0174
2018-11-09,0.0169
2018-11-12,0.0166
2018-11-13,0.017
2018-11-14,0.0176
2018-11-15,0.0167
2018-11-16,0.0167
2018-11-19,0.015
2018-11-20,0.0145
2018-11-21,0.0155
2018-11-23,0.0161
2018-11-26,0.0166
2018-11-27,0.0173
2018-11-28,0.017
2018-11-29,0.0166
2018-11-30,0.0163
2018-12-03,0.0168
2018-12-04,0.0165
2018-12-06,0.0171
2018-12-07,0.0171
2018-12-10,0.0163
2018-12-11,0.0162
2018-12-12,0.016
2018-12-13,0.0159
2018-12-14,0.0161
2018-12-17,0.0154
2018-12-18,0.0157
2018-12-19,0.0158
2018-12-20,0.0158
2018-12-21,0.0158
2018-12-24,0.0142
2018-12-26,0.0131
2018-12-27,0.0141
2018-12-28,0.0158
2018-12-31,0.016
2019-01-02,0.0164
2019-01-03,0.0162
2019-01-04,0.0161
2019-01-07,0.0168
2019-01-08,0.0164
2019-01-09,0.0177
2019-01-10,0.0167
2019-01-11,0.0168
2019-01-14,0.0162
2019-01-15,0.0163
2019-01-16,0.0139
2019-01-17,0.0139
2019-01-18,0.013
2019-01-22,0.0118
2019-01-23,0.01
2019-01-24,0.0075
2019-01-25,0.0088
2019-01-28,0.0127
2019-01-29,0.0123
2019-01-30,0.0109
2019-01-31,0.0105
2019-02-01,0.011
2019-02-04,0.0109
2019-02-05,0.0105
2019-02-06,0.0105
2019-02-07,0.0102
2019-02-08,0.01
2019-02-11,0.01
2019-02-12,0.0093
2019-02-13,0.00805
2019-02-14,0.0075
2019-02-15,0.0072
