date,close
2014-06-13,0.68
2014-06-16,0.67
2014-06-17,0.78
2014-06-18,0.77
2014-06-19,0.77
2014-06-20,0.7994
2014-06-23,0.785
2014-06-24,0.742
2014-06-25,0.72
2014-06-26,0.79
2014-06-27,0.7899
2014-06-30,0.79
2014-07-01,0.78
2014-07-02,0.74
2014-07-03,0.72
2014-07-07,0.7197
2014-07-08,0.725
2014-07-09,0.73
2014-07-10,0.729
2014-07-11,0.7199
2014-07-14,0.6949
2014-07-15,0.632
2014-07-16,0.63
2014-07-17,0.644
2014-07-18,0.668
2014-07-21,0.7
2014-07-22,0.7
2014-07-23,0.6925
2014-07-24,0.7
2014-07-25,0.74
2014-07-28,0.7276
2014-07-29,0.71
2014-07-30,0.7
2014-07-31,0.71
2014-08-01,0.675
2014-08-04,0.673
2014-08-05,0.698
2014-08-06,0.695
2014-08-07,0.7195
2014-08-08,0.66
2014-08-11,0.6499
2014-08-12,0.6994
2014-08-13,0.66
2014-08-14,0.652
2014-08-15,0.66
2014-08-18,0.64
2014-08-19,0.635
2014-08-20,0.63
2014-08-21,0.5959
2014-08-22,0.64
2014-08-25,0.6185
2014-08-26,0.62
2014-08-27,0.62
2014-08-28,0.62
2014-08-29,0.6101
2014-09-02,0.62
2014-09-03,0.6199
2014-09-04,0.603
2014-09-05,0.6095
2014-09-08,0.63
2014-09-09,0.65
2014-09-10,0.69
2014-09-11,0.66
2014-09-12,0.66
2014-09-15,0.67
2014-09-16,0.65
2014-09-17,0.65
2014-09-18,0.6439
2014-09-19,0.62
2014-09-22,0.6
2014-09-23,0.6221
2014-09-24,0.659
2014-09-25,0.6502
2014-09-26,0.67
2014-09-29,0.709
2014-09-30,0.6622
2014-10-01,0.6395
2014-10-02,0.64
2014-10-03,0.62
2014-10-06,0.61
2014-10-07,0.6
2014-10-08,0.64
2014-10-09,0.6
2014-10-10,0.5848
2014-10-13,0.5899
2014-10-14,0.5997
2014-10-15,0.63
2014-10-16,0.63
2014-10-17,0.64
2014-10-20,0.63
2014-10-21,0.628
2014-10-22,0.6099
2014-10-23,0.56
2014-10-24,0.58
2014-10-27,0.589
2014-10-28,0.59
2014-10-29,0.5801
2014-10-30,0.57
2014-10-31,0.53
2014-11-03,0.53
2014-11-04,0.53
2014-11-05,0.5
2014-11-06,0.495
2014-11-07,0.4976
2014-11-10,0.506
2014-11-11,0.5079
2014-11-12,0.5
2014-11-13,0.495
2014-11-14,0.5
2014-11-17,0.4815
2014-11-18,0.487
2014-11-19,0.4703
2014-11-20,0.474
2014-11-21,0.53
2014-11-24,0.4954
2014-11-25,0.4794
2014-11-26,0.493
2014-11-28,0.4884
2014-12-01,0.49
2014-12-02,0.4621
2014-12-03,0.47
2014-12-04,0.48
2014-12-05,0.496
2014-12-08,0.46
2014-12-09,0.4813
2014-12-10,0.45
2014-12-11,0.49
2014-12-12,0.47
2014-12-15,0.43
2014-12-16,0.418
2014-12-17,0.4286
2014-12-18,0.45
2014-12-19,0.45
2014-12-22,0.4301
2014-12-23,0.4313
2014-12-24,0.444
2014-12-26,0.47
2014-12-29,0.4252
2014-12-30,0.4366
2014-12-31,0.47
2015-01-02,0.44
2015-01-05,0.4471
2015-01-06,0.445
2015-01-07,0.4327
2015-01-08,0.4757
2015-01-09,0.48
2015-01-12,0.525
2015-01-13,0.47
2015-01-14,0.52
2015-01-15,0.503
2015-01-16,0.49
2015-01-20,0.5105
2015-01-21,0.51
2015-01-22,0.5288
2015-01-23,0.519
2015-01-26,0.525
2015-01-27,0.518
2015-01-28,0.47
2015-01-29,0.4801
2015-01-30,0.482
2015-02-02,0.475
2015-02-03,0.475
2015-02-04,0.5
2015-02-05,0.51
2015-02-06,0.509
2015-02-09,0.54
2015-02-10,0.5168
2015-02-11,0.5188
2015-02-12,0.5101
2015-02-13,0.5199
2015-02-17,0.5095
2015-02-18,0.5091
2015-02-19,0.5064
2015-02-20,0.489
2015-02-23,0.48
2015-02-24,0.4715
2015-02-25,0.4764
2015-02-26,0.45
2015-02-27,0.4599
2015-03-02,0.4415
2015-03-03,0.4401
2015-03-04,0.44
2015-03-05,0.43
2015-03-06,0.4119
2015-03-09,0.4098
2015-03-10,0.3939
2015-03-11,0.41
2015-03-12,0.4232
2015-03-13,0.4075
2015-03-16,0.4
2015-03-17,0.405
2015-03-18,0.425
2015-03-19,0.45
2015-03-20,0.45
2015-03-23,0.479
2015-03-24,0.4684
2015-03-25,0.481
2015-03-26,0.475
2015-03-27,0.4699
2015-03-30,0.463
2015-03-31,0.421
2015-04-01,0.4311
2015-04-02,0.46
2015-04-06,0.4456
2015-04-07,0.4386
2015-04-08,0.44
2015-04-09,0.4342
2015-04-10,0.48
2015-04-13,0.444
2015-04-14,0.45
2015-04-15,0.485
2015-04-16,0.5092
2015-04-17,0.48
2015-04-20,0.4842
2015-04-21,0.4864
2015-04-22,0.4675
2015-04-23,0.4686
2015-04-24,0.48
2015-04-27,0.4601
2015-04-28,0.4725
2015-04-29,0.48
2015-04-30,0.4857
2015-05-01,0.5
2015-05-04,0.48
2015-05-05,0.465
2015-05-06,0.454
2015-05-07,0.48
2015-05-08,0.503
2015-05-11,0.51
2015-05-12,0.52
2015-05-13,0.5455
2015-05-14,0.5687
2015-05-15,0.56
2015-05-18,0.56
2015-05-19,0.53
2015-05-20,0.54
2015-05-21,0.5247
2015-05-22,0.54
2015-05-26,0.522
2015-05-27,0.5201
2015-05-28,0.5216
2015-05-29,0.52
2015-06-01,0.5198
2015-06-02,0.5232
2015-06-03,0.5203
2015-06-04,0.52
2015-06-05,0.5027
2015-06-08,0.5192
2015-06-09,0.512
2015-06-10,0.52
2015-06-11,0.52
2015-06-12,0.5208
2015-06-15,0.52
2015-06-16,0.5299
2015-06-17,0.5301
2015-06-18,0.5338
2015-06-19,0.5208
2015-06-22,0.525
2015-06-23,0.505
2015-06-24,0.5
2015-06-25,0.5
2015-06-26,0.495
2015-06-29,0.48
2015-06-30,0.474
2015-07-01,0.47
2015-07-02,0.46
2015-07-06,0.44
2015-07-07,0.425
2015-07-08,0.4016
2015-07-09,0.4144
2015-07-10,0.4195
2015-07-13,0.4
2015-07-14,0.4
2015-07-15,0.376
2015-07-16,0.3697
2015-07-17,0.37
2015-07-20,0.345
2015-07-21,0.3518
2015-07-22,0.3599
2015-07-23,0.34
2015-07-24,0.3474
2015-07-27,0.3432
2015-07-28,0.38
2015-07-29,0.3917
2015-07-30,0.42
2015-07-31,0.4147
2015-08-03,0.4076
2015-08-04,0.38
2015-08-05,0.3817
2015-08-06,0.4099
2015-08-07,0.37
2015-08-10,0.3871
2015-08-11,0.3859
2015-08-12,0.4
2015-08-13,0.384
2015-08-14,0.3865
2015-08-17,0.375
2015-08-18,0.36
2015-08-19,0.38
2015-08-20,0.4
2015-08-21,0.4095
2015-08-24,0.375
2015-08-25,0.3296
2015-08-26,0.33
2015-08-27,0.33
2015-08-28,0.3567
2015-08-31,0.34
2015-09-01,0.338
2015-09-02,0.3718
2015-09-03,0.3656
2015-09-04,0.3472
2015-09-08,0.335
2015-09-09,0.363
2015-09-10,0.4
2015-09-11,0.41
2015-09-14,0.4164
2015-09-15,0.4091
2015-09-16,0.4312
2015-09-17,0.4204
2015-09-18,0.43
2015-09-21,0.439
2015-09-22,0.4233
2015-09-23,0.4155
2015-09-24,0.4439
2015-09-25,0.4171
2015-09-28,0.4
2015-09-29,0.389
2015-09-30,0.38
2015-10-01,0.389
2015-10-02,0.37
2015-10-05,0.38
2015-10-06,0.3977
2015-10-07,0.38
2015-10-08,0.3808
2015-10-09,0.4122
2015-10-12,0.41
2015-10-13,0.375
2015-10-14,0.4
2015-10-15,0.41
2015-10-16,0.4076
2015-10-19,0.38
2015-10-20,0.4064
2015-10-21,0.408
2015-10-22,0.396
2015-10-23,0.4
2015-10-26,0.411
2015-10-27,0.39
2015-10-28,0.4121
2015-10-29,0.41
2015-10-30,0.4
2015-11-02,0.4001
2015-11-03,0.4121
2015-11-04,0.43
2015-11-05,0.435
2015-11-06,0.4383
2015-11-09,0.4727
2015-11-10,0.54
2015-11-11,0.55
2015-11-12,0.5761
2015-11-13,0.56
2015-11-16,0.54
2015-11-17,0.53
2015-11-18,0.5701
2015-11-19,0.574
2015-11-20,0.565
2015-11-23,0.5513
2015-11-24,0.5535
2015-11-25,0.58
2015-11-27,0.532
2015-11-30,0.545
2015-12-01,0.55
2015-12-02,0.5289
2015-12-03,0.545
2015-12-04,0.55
2015-12-07,0.57
2015-12-08,0.5694
2015-12-09,0.588
2015-12-10,0.5912
2015-12-11,0.6094
2015-12-14,0.62
2015-12-15,0.63
2015-12-16,0.6231
2015-12-17,0.6307
2015-12-18,0.6412
2015-12-21,0.6488
2015-12-22,0.6384
2015-12-23,0.64
2015-12-24,0.6553
2015-12-28,0.6639
2015-12-29,0.663
2015-12-30,0.6701
2015-12-31,0.6758
2016-01-04,0.68
2016-01-05,0.6662
2016-01-06,0.6607
2016-01-07,0.6646
2016-01-08,0.6491
2016-01-11,0.6129
2016-01-12,0.5751
2016-01-13,0.6201
2016-01-14,0.5859
2016-01-15,0.5952
2016-01-19,0.54
2016-01-20,0.567
2016-01-21,0.5996
2016-01-22,0.6038
2016-01-25,0.6169
2016-01-26,0.6523
2016-01-27,0.6599
2016-01-28,0.6477
2016-01-29,0.6448
2016-02-01,0.6914
2016-02-02,0.69
2016-02-03,0.7287
2016-02-04,0.7352
2016-02-05,0.7398
2016-02-08,0.7715
2016-02-09,0.771
2016-02-10,0.77
2016-02-11,0.8015
2016-02-12,0.7602
2016-02-16,0.7539
2016-02-17,0.7701
2016-02-18,0.81
2016-02-19,0.8452
2016-02-22,0.8794
2016-02-23,0.87
2016-02-24,0.855
2016-02-25,0.8944
2016-02-26,0.8688
2016-02-29,0.92
2016-03-01,0.97
2016-03-02,1.08
2016-03-03,1.1199
2016-03-04,1.01
2016-03-07,1.02
2016-03-08,1.01
2016-03-09,0.982
2016-03-10,0.98
2016-03-11,1
2016-03-14,0.97
2016-03-15,0.9411
2016-03-16,1.02
2016-03-17,0.9981
2016-03-18,1
2016-03-21,0.95
2016-03-22,0.9607
2016-03-23,0.91
2016-03-24,0.9649
2016-03-28,0.925
2016-03-29,1
2016-03-30,1.04
2016-03-31,1.04
2016-04-01,1.0999
2016-04-04,1.08
2016-04-05,1.06
2016-04-06,1.1
2016-04-07,1.12
2016-04-08,1.17
2016-04-11,1.25
2016-04-12,1.22
2016-04-13,1.25
2016-04-14,1.15
2016-04-15,1.22
2016-04-18,1.2
2016-04-19,1.27
2016-04-20,1.21
2016-04-21,1.19
2016-04-22,1.24
2016-04-25,1.16
2016-04-26,1.18
2016-04-27,1.22
2016-04-28,1.27
2016-04-29,1.27
2016-05-02,1.23
2016-05-03,1.22
2016-05-04,1.28
2016-05-05,1.32
2016-05-06,1.65
2016-05-09,1.44
2016-05-10,1.5
2016-05-11,1.55
2016-05-12,1.54
2016-05-13,1.485
2016-05-16,1.5
2016-05-17,1.54
2016-05-18,1.51
2016-05-19,1.6
2016-05-20,1.63
2016-05-23,1.78
2016-05-24,1.65
2016-05-25,1.61
2016-05-26,1.6475
2016-05-27,1.62
2016-05-31,1.56
2016-06-01,1.51
2016-06-02,1.6
2016-06-03,1.62
2016-06-06,1.71
2016-06-07,1.635
2016-06-08,1.71
2016-06-09,1.76
2016-06-10,1.66
2016-06-13,1.77
2016-06-14,1.76
2016-06-15,1.7783
2016-06-16,1.72
2016-06-17,1.76
2016-06-20,1.77
2016-06-21,1.67
2016-06-22,1.71
2016-06-23,1.75
2016-06-24,1.78
2016-06-27,1.7301
2016-06-28,1.75
2016-06-29,1.77
2016-06-30,1.86
2016-07-01,1.95
2016-07-05,2.04
2016-07-06,1.97
2016-07-07,1.84
2016-07-08,1.89
2016-07-11,1.85
2016-07-12,1.75
2016-07-13,1.77
2016-07-14,1.72
2016-07-15,1.68
2016-07-18,1.61
2016-07-19,1.67
2016-07-20,1.61
2016-07-21,1.59
2016-07-22,1.57
2016-07-25,1.41
2016-07-26,1.4
2016-07-27,1.42
2016-07-28,1.45
2016-07-29,1.5
2016-08-01,1.57
2016-08-02,1.56
2016-08-03,1.51
2016-08-04,1.5
2016-08-05,1.42
2016-08-08,1.46
2016-08-09,1.93
2016-08-10,2.51
2016-08-11,2.9
2016-08-12,2.82
2016-08-15,2.72
2016-08-16,2.81
2016-08-17,2.91
2016-08-18,2.95
2016-08-19,2.93
2016-08-22,2.84
2016-08-23,2.69
2016-08-24,2.44
2016-08-25,2.46
2016-08-26,2.46
2016-08-29,2.48
2016-08-30,2.45
2016-08-31,2.34
2016-09-01,2.46
2016-09-02,2.52
2016-09-06,2.72
2016-09-07,2.74
2016-09-08,2.63
2016-09-09,2.52
2016-09-12,2.49
2016-09-13,2.36
2016-09-14,2.38
2016-09-15,2.28
2016-09-16,2.22
2016-09-19,2.27
2016-09-20,2.33
2016-09-21,2.4
2016-09-22,2.46
2016-09-23,2.37
2016-09-26,2.39
2016-09-27,2.45
2016-09-28,2.41
2016-09-29,2.59
2016-09-30,2.54
2016-10-03,2.38
2016-10-04,2.25
2016-10-05,2.27
2016-10-06,2.19
2016-10-07,2.47
2016-10-10,2.34
2016-10-11,2.27
2016-10-12,2.38
2016-10-13,2.46
2016-10-14,2.55
2016-10-17,2.67
2016-10-18,2.61
2016-10-19,2.54
2016-10-20,2.61
2016-10-21,2.51
2016-10-24,2.39
2016-10-25,2.52
2016-10-26,2.47
2016-10-27,2.38
2016-10-28,2.36
2016-10-31,2.39
2016-11-01,2.46
2016-11-02,2.36
2016-11-03,2.42
2016-11-04,2.37
2016-11-07,2.34
2016-11-08,2.3
2016-11-09,2.39
2016-11-10,2.39
2016-11-11,2.15
2016-11-14,1.97
2016-11-15,2.19
2016-11-16,2.24
2016-11-17,2.28
2016-11-18,2.48
2016-11-21,2.23
2016-11-22,2.29
2016-11-23,2.26
2016-11-25,2.15
2016-11-28,2.27
2016-11-29,2.2505
2016-11-30,2.2389
2016-12-01,2.29
2016-12-02,2.4
2016-12-05,2.46
2016-12-06,2.42
2016-12-07,2.41
2016-12-08,2.429
2016-12-09,2.25
2016-12-12,2.16
2016-12-13,2.275
2016-12-14,2.09
2016-12-15,2.02
2016-12-16,2.005
2016-12-19,1.94
2016-12-20,1.89
2016-12-21,1.965
2016-12-22,1.91
2016-12-23,2
2016-12-27,2.07
2016-12-28,2.11
2016-12-29,2.25
2016-12-30,2.13
2017-01-03,2.195
2017-01-04,2.2199
2017-01-05,2.315
2017-01-06,2.25
2017-01-09,2.25
2017-01-10,2.23
2017-01-11,2.27
2017-01-12,2.25
2017-01-13,2.23
2017-01-17,2.22
2017-01-18,2.16
2017-01-19,2.14
2017-01-20,2.24
2017-01-23,2.52
2017-01-24,2.56
2017-01-25,2.49
2017-01-26,2.6
2017-01-27,2.78
2017-01-30,2.71
2017-01-31,2.78
2017-02-01,2.73
2017-02-02,2.8
2017-02-03,2.84
2017-02-06,2.92
2017-02-07,2.89
2017-02-08,2.88
2017-02-09,2.88
2017-02-10,2.84
2017-02-13,2.79
2017-02-14,2.76
2017-02-15,2.74
2017-02-16,2.75
2017-02-17,2.77
2017-02-21,2.77
2017-02-22,2.75
2017-02-23,2.755
2017-02-24,2.71
2017-02-27,2.68
2017-02-28,2.61
2017-03-01,2.57
2017-03-02,2.42
2017-03-03,2.41
2017-03-06,2.34
2017-03-07,2.41
2017-03-08,2.34
2017-03-09,2.4
2017-03-10,2.46
2017-03-13,2.59
2017-03-14,2.58
2017-03-15,2.61
2017-03-16,2.54
2017-03-17,2.63
2017-03-20,2.56
2017-03-21,2.6
2017-03-22,2.71
2017-03-23,2.73
2017-03-24,2.59
2017-03-27,2.53
2017-03-28,2.31
2017-03-29,2.31
2017-03-30,2.2
2017-03-31,2.16
2017-04-03,2.09
2017-04-04,2.06
2017-04-05,2.07
2017-04-06,2.02
2017-04-07,1.99
2017-04-10,2.02
2017-04-11,2.09
2017-04-12,2.04
2017-04-13,2
2017-04-17,2
2017-04-18,1.92
2017-04-19,1.9
2017-04-20,1.9
2017-04-21,1.89
2017-04-24,1.87
2017-04-25,1.78
2017-04-26,1.79
2017-04-27,1.71
2017-04-28,1.7
2017-05-01,1.58
2017-05-02,1.67
2017-05-03,1.65
2017-05-04,1.55
2017-05-05,1.57
2017-05-08,1.57
2017-05-09,1.55
2017-05-10,1.53
2017-05-11,1.61
2017-05-12,1.66
2017-05-15,1.62
2017-05-16,1.63
2017-05-17,1.67
2017-05-18,1.61
2017-05-19,1.6
2017-05-22,1.72
2017-05-23,1.55
2017-05-24,1.57
2017-05-25,1.61
2017-05-26,1.67
2017-05-30,1.66
2017-05-31,1.65
2017-06-01,1.64
2017-06-02,1.71
2017-06-05,1.72
2017-06-06,1.92
2017-06-07,1.89
2017-06-08,1.83
2017-06-09,1.86
2017-06-12,1.93
2017-06-13,2.01
2017-06-14,2.01
2017-06-15,1.88
2017-06-16,1.92
2017-06-19,1.79
2017-06-20,1.83
2017-06-21,1.8
2017-06-22,1.83
2017-06-23,1.85
2017-06-26,1.88
2017-06-27,1.75
2017-06-28,1.76
2017-06-29,1.71
2017-06-30,1.71
2017-07-03,1.69
2017-07-05,1.72
2017-07-06,1.71
2017-07-07,1.74
2017-07-10,1.76
2017-07-11,1.76
2017-07-12,1.73
2017-07-13,1.69
2017-07-14,1.71
2017-07-17,1.76
2017-07-18,1.76
2017-07-19,1.76
2017-07-20,1.75
2017-07-21,1.75
2017-07-24,1.7
2017-07-25,1.67
2017-07-26,1.69
2017-07-27,1.64
2017-07-28,1.69
2017-07-31,1.7
2017-08-01,1.68
2017-08-02,1.66
2017-08-03,1.68
2017-08-04,1.66
2017-08-07,1.68
2017-08-08,1.635
2017-08-09,1.66
2017-08-10,1.64
2017-08-11,1.62
2017-08-14,1.64
2017-08-15,1.64
2017-08-16,1.67
2017-08-17,1.66
2017-08-18,1.65
2017-08-21,1.71
2017-08-22,1.79
2017-08-23,1.785
2017-08-24,1.75
2017-08-25,1.73
2017-08-28,1.84
2017-08-29,1.77
2017-08-30,1.79
2017-08-31,1.78
2017-09-01,1.82
2017-09-05,1.86
2017-09-06,1.87
2017-09-07,1.89
2017-09-08,1.93
2017-09-11,1.86
2017-09-12,1.87
2017-09-13,1.81
2017-09-14,1.79
2017-09-15,1.78
2017-09-18,1.7093
2017-09-19,1.71
2017-09-20,1.67
2017-09-21,1.63
2017-09-22,1.69
2017-09-25,1.63
2017-09-26,1.56
2017-09-27,1.56
2017-09-28,1.62
2017-09-29,1.62
2017-10-02,1.6
2017-10-03,1.595
2017-10-04,1.62
2017-10-05,1.66
2017-10-06,1.64
2017-10-09,1.66
2017-10-10,1.67
2017-10-11,1.66
2017-10-12,1.6
2017-10-13,1.615
2017-10-16,1.53
2017-10-17,1.55
2017-10-18,1.58
2017-10-19,1.56
2017-10-20,1.53
2017-10-23,1.52
2017-10-24,1.47
2017-10-25,1.44
2017-10-26,1.35
2017-10-27,1.4
2017-10-30,1.36
2017-10-31,1.32
2017-11-01,1.3
2017-11-02,1.33
2017-11-03,1.275
2017-11-06,1.3
2017-11-07,1.52
2017-11-08,1.47
2017-11-09,1.48
2017-11-10,1.58
2017-11-13,1.53
2017-11-14,1.45
2017-11-15,1.47
2017-11-16,1.48
2017-11-17,1.47
2017-11-20,1.49
2017-11-21,1.5
2017-11-22,1.49
2017-11-24,1.49
2017-11-27,1.49
2017-11-28,1.475
2017-11-29,1.47
2017-11-30,1.41
2017-12-01,1.44
2017-12-04,1.43
2017-12-05,1.48
2017-12-06,1.42
2017-12-07,1.44
2017-12-08,1.41
2017-12-11,1.4
2017-12-12,1.44
2017-12-13,1.49
2017-12-14,1.6
2017-12-15,1.66
2017-12-18,1.64
2017-12-19,1.64
2017-12-20,1.72
2017-12-21,1.77
2017-12-22,1.73
2017-12-26,1.76
2017-12-27,1.76
2017-12-28,1.79
2017-12-29,1.75
2018-01-02,1.8
2018-01-03,1.73
2018-01-04,1.73
2018-01-05,1.7
2018-01-08,1.64
2018-01-09,1.59
2018-01-10,1.59
2018-01-11,1.545
2018-01-12,1.58
2018-01-16,1.61
2018-01-17,1.6
2018-01-18,1.62
2018-01-19,1.84
2018-01-22,1.79
2018-01-23,1.78
2018-01-24,1.87
2018-01-25,1.82
2018-01-26,1.99
2018-01-29,1.9
2018-01-30,1.85
2018-01-31,1.8
2018-02-01,1.85
2018-02-02,1.61
2018-02-05,1.69
2018-02-06,1.68
2018-02-07,1.73
2018-02-08,1.75
2018-02-09,1.74
2018-02-12,1.73
2018-02-13,1.77
2018-02-14,1.76
2018-02-15,1.74
2018-02-16,1.69
2018-02-20,1.67
2018-02-21,1.66
2018-02-22,1.65
2018-02-23,1.65
2018-02-26,1.66
2018-02-27,1.64
2018-02-28,1.65
2018-03-01,1.66
2018-03-02,1.62
2018-03-05,1.63
2018-03-06,1.61
2018-03-07,1.6
2018-03-08,1.64
2018-03-09,1.65
2018-03-12,1.65
2018-03-13,1.69
2018-03-14,1.63
2018-03-15,1.62
2018-03-16,1.65
2018-03-19,1.68
2018-03-20,1.61
2018-03-21,1.66
2018-03-22,1.66
2018-03-23,1.66
2018-03-26,1.64
2018-03-27,1.61
2018-03-28,1.6
2018-03-29,1.63
2018-04-02,1.64
2018-04-03,1.63
2018-04-04,1.65
2018-04-05,1.65
2018-04-06,1.63
2018-04-09,1.66
2018-04-10,1.67
2018-04-11,1.685
2018-04-12,1.67
2018-04-13,1.66
2018-04-16,1.72
2018-04-17,1.76
2018-04-18,1.75
2018-04-19,1.75
2018-04-20,1.71
2018-04-23,1.7
2018-04-24,1.69
2018-04-25,1.62
2018-04-26,1.65
2018-04-27,1.6
2018-04-30,1.55
2018-05-01,1.56
2018-05-02,1.61
2018-05-03,1.57
2018-05-04,1.56
2018-05-07,1.6
2018-05-08,1.59
2018-05-09,1.57
2018-05-10,1.605
2018-05-11,1.63
2018-05-14,1.56
2018-05-15,1.56
2018-05-16,1.55
2018-05-17,1.51
2018-05-18,1.54
2018-05-21,1.51
2018-05-22,1.51
2018-05-23,1.53
2018-05-24,1.55
2018-05-25,1.57
2018-05-29,1.59
2018-05-30,1.58
2018-05-31,1.52
2018-06-01,1.54
2018-06-04,1.525
2018-06-05,1.53
2018-06-06,1.51
2018-06-07,1.49
2018-06-08,1.45
2018-06-11,1.32
2018-06-12,1.18
2018-06-13,1.27
2018-06-14,1.21
2018-06-15,1.22
2018-06-18,1.17
2018-06-19,1.33
2018-06-20,1.32
2018-06-21,1.34
2018-06-22,1.34
2018-06-25,1.3
2018-06-26,1.3
2018-06-27,1.35
2018-06-28,1.34
2018-06-29,1.365
2018-07-02,1.37
2018-07-03,1.37
2018-07-05,1.41
2018-07-06,1.47
2018-07-09,1.43
2018-07-10,1.47
2018-07-11,1.44
2018-07-12,1.45
2018-07-13,1.44
2018-07-16,1.45
2018-07-17,1.54
2018-07-18,1.54
2018-07-19,1.59
2018-07-20,1.59
2018-07-23,1.51
2018-07-24,1.51
2018-07-25,1.63
2018-07-26,1.66
2018-07-27,1.7
2018-07-30,1.75
2018-07-31,1.74
2018-08-01,1.69
2018-08-02,1.62
2018-08-03,1.62
2018-08-06,1.61
2018-08-07,1.64
2018-08-08,1.63
2018-08-09,1.64
2018-08-10,1.64
2018-08-13,1.6
2018-08-14,1.6
2018-08-15,1.48
2018-08-16,1.44
2018-08-17,1.42
2018-08-20,1.54
2018-08-21,1.51
2018-08-22,1.54
2018-08-23,1.5
2018-08-24,1.66
2018-08-27,1.64
2018-08-28,1.62
2018-08-29,1.63
2018-08-30,1.54
2018-08-31,1.56
2018-09-04,1.51
2018-09-05,1.49
2018-09-06,1.46
2018-09-07,1.48
2018-09-10,1.46
2018-09-11,1.46
2018-09-12,1.5
2018-09-13,1.5
2018-09-14,1.5
2018-09-17,1.62
2018-09-18,1.73
2018-09-19,1.71
2018-09-20,1.81
2018-09-21,1.77
2018-09-24,1.84
2018-09-25,1.77
2018-09-26,1.8
2018-09-27,1.73
2018-09-28,1.72
2018-10-01,1.64
2018-10-02,1.73
2018-10-03,1.69
2018-10-04,1.72
2018-10-05,1.75
2018-10-08,1.81
2018-10-09,1.76
2018-10-10,1.755
2018-10-11,1.805
2018-10-12,1.79
2018-10-15,1.7
2018-10-16,1.75
2018-10-17,1.69
2018-10-18,1.65
2018-10-19,1.63
2018-10-22,1.615
2018-10-23,1.61
2018-10-24,1.64
2018-10-25,1.57
2018-10-26,1.56
2018-10-29,1.48
2018-10-30,1.49
2018-10-31,1.49
2018-11-01,1.43
2018-11-02,1.42
2018-11-05,1.43
2018-11-06,1.45
2018-11-07,1.44
2018-11-08,1.5
2018-11-09,1.44
2018-11-12,1.34
2018-11-13,1.27
2018-11-14,1.26
2018-11-15,1.2
2018-11-16,1.27
2018-11-19,1.28
2018-11-20,1.24
2018-11-21,1.27
2018-11-23,1.22
2018-11-26,1.2
2018-11-27,1.12
2018-11-28,1.16
2018-11-29,1.18
2018-11-30,1.21
2018-12-03,1.21
2018-12-04,1.21
2018-12-06,1.21
2018-12-07,1.26
2018-12-10,1.19
2018-12-11,1.2
2018-12-12,1.23
2018-12-13,1.24
2018-12-14,1.24
2018-12-17,1.22
2018-12-18,1.23
2018-12-19,1.11
2018-12-20,1.13
2018-12-21,1.14
2018-12-24,1.11
2018-12-26,1.18
2018-12-27,1.19
2018-12-28,1.24
2018-12-31,1.25
2019-01-02,1.28
2019-01-03,1.32
2019-01-04,1.29
2019-01-07,1.29
2019-01-08,1.29
2019-01-09,1.29
2019-01-10,1.3
2019-01-11,1.28
2019-01-14,1.28
2019-01-15,1.25
2019-01-16,1.27
2019-01-17,1.2
2019-01-18,1.15
2019-01-22,1.16
2019-01-23,1.19
2019-01-24,1.18
2019-01-25,1.22
2019-01-28,1.26
2019-01-29,1.3
2019-01-30,1.36
2019-01-31,1.33
2019-02-01,1.32
2019-02-04,1.26
2019-02-05,1.24
2019-02-06,1.25
2019-02-07,1.25
2019-02-08,1.25
2019-02-11,1.26
2019-02-12,1.275
2019-02-13,1.26
2019-02-14,1.24
2019-02-15,1.27
2019-02-19,1.28
2019-02-20,1.26
2019-02-21,1.23
2019-02-22,1.23
2019-02-25,1.14
2019-02-26,1.15
2019-02-27,1.15
2019-02-28,1.15
2019-03-01,1.16
2019-03-04,1.13
2019-03-05,1.15
2019-03-06,1.1
2019-03-07,1.12
2019-03-08,1.18
2019-03-11,1.15
2019-03-12,1.15
2019-03-13,1.18
2019-03-14,1.12
2019-03-15,1.07
2019-03-18,1.03
2019-03-19,1.05
2019-03-20,1.02
2019-03-21,1.04
2019-03-22,1.06
2019-03-25,1.06
2019-03-26,1.04
2019-03-27,1.06
2019-03-28,1.03
2019-03-29,1.02
2019-04-01,1.04
2019-04-02,1.03
2019-04-03,1.03
2019-04-04,1.04
2019-04-05,1.06
2019-04-08,1.1
2019-04-09,1.13
2019-04-10,1.11
2019-04-11,1.06
2019-04-12,1.06
2019-04-15,1.01
2019-04-16,1
2019-04-17,1.01
2019-04-18,0.9894
2019-04-22,0.925
2019-04-23,0.926
2019-04-24,0.944
2019-04-25,0.9842
2019-04-26,1.05
2019-04-29,1.04
2019-04-30,1.03
2019-05-01,1
2019-05-02,1
2019-05-03,1.01
2019-05-06,1.01
2019-05-07,1.03
2019-05-08,1.04
2019-05-09,1.06
2019-05-10,1.02
2019-05-13,1.03
2019-05-14,1.04
2019-05-15,1.05
2019-05-16,1.06
2019-05-17,1.02
2019-05-20,0.974
2019-05-21,1.07
2019-05-22,1.04
2019-05-23,1.05
2019-05-24,1.01
2019-05-28,1
2019-05-29,1.01
2019-05-30,1.05
2019-05-31,1.08
2019-06-03,1.14
2019-06-04,1.18
2019-06-05,1.17
2019-06-06,1.14
2019-06-07,1.13
2019-06-10,1.06
2019-06-11,1.06
2019-06-12,1.08
2019-06-13,1.075
2019-06-14,1.09
2019-06-17,1.025
2019-06-18,1.055
2019-06-19,1.045
2019-06-20,1.09
2019-06-21,1.06
2019-06-24,1.005
2019-06-25,1.06
2019-06-26,1.055
2019-06-27,1.06
2019-06-28,1.06
2019-07-01,1.06
2019-07-02,1.02
2019-07-03,1.03
2019-07-04,1.03
2019-07-05,1.03
2019-07-08,1.025
2019-07-09,0.9901
2019-07-10,0.9949
2019-07-11,0.9949
2019-07-12,0.9949
2019-07-15,0.9547
2019-07-16,0.9399
2019-07-17,0.9421
2019-07-18,0.97
2019-07-19,1.07
2019-07-22,1.085
2019-07-23,1.05
2019-07-24,1.06
2019-07-25,0.9949
2019-07-26,1.03
2019-07-29,1.005
2019-07-30,1.02
2019-07-31,1.02
2019-08-01,1.055
2019-08-02,1.025
2019-08-05,1.08
2019-08-06,1.01
2019-08-07,1.015
2019-08-08,1.035
2019-08-09,1
2019-08-12,0.9452
2019-08-13,0.9086
2019-08-14,0.8789
2019-08-15,0.8488
2019-08-16,0.9007
2019-08-19,0.8793
2019-08-20,0.9248
2019-08-21,0.9256
2019-08-22,0.9289
2019-08-23,0.9976
2019-08-26,0.9976
2019-08-27,1.03
2019-08-28,1.025
2019-08-29,1
2019-08-30,1.01
2019-09-02,1.01
2019-09-03,1.02
2019-09-04,1.02
2019-09-05,1
2019-09-06,1.015
2019-09-09,0.9945
2019-09-10,0.9161
2019-09-11,0.8972
2019-09-12,0.85
2019-09-13,0.8545
2019-09-16,0.9002
2019-09-17,0.8978
2019-09-18,0.8919
2019-09-19,0.9188
2019-09-20,1.01
2019-09-23,0.9525
2019-09-24,0.9112
2019-09-25,0.9096
2019-09-26,0.8351
2019-09-27,0.8216
2019-09-30,0.7764
2019-10-01,0.7707
2019-10-02,0.766
2019-10-03,0.766
2019-10-04,0.7343
2019-10-07,0.8018
2019-10-08,0.7983
2019-10-09,0.7814
2019-10-10,0.7644
2019-10-11,0.8225
2019-10-14,0.868
2019-10-15,0.8439
2019-10-16,0.8304
2019-10-17,0.8452
2019-10-18,0.811
2019-10-21,0.7945
2019-10-22,0.7935
2019-10-23,0.791
2019-10-24,0.8063
2019-10-25,0.8058
2019-10-28,0.7978
2019-10-29,0.7685
2019-10-30,0.7672
2019-10-31,0.7615
2019-11-01,0.7635
2019-11-04,0.7913
2019-11-05,0.789
2019-11-06,0.7813
2019-11-07,0.7602
2019-11-08,0.7561
2019-11-11,0.7652
2019-11-12,0.7741
2019-11-13,0.7697
2019-11-14,0.7729
2019-11-15,0.7749
2019-11-18,0.7749
2019-11-19,0.7621
2019-11-20,0.7507
2019-11-21,0.7519
2019-11-22,0.7374
2019-11-25,0.7137
