date,close
2017-08-01,18.35
2017-08-02,17.95
2017-08-03,17.75
2017-08-04,17.7
2017-08-07,17.8
2017-08-08,17.9
2017-08-09,18.85
2017-08-10,18.55
2017-08-11,18.65
2017-08-14,18.9
2017-08-15,18.65
2017-08-16,18.75
2017-08-17,18.45
2017-08-18,18.15
2017-08-21,18.125
2017-08-22,17.95
2017-08-23,17.7
2017-08-24,17.6
2017-08-25,17.65
2017-08-28,17.45
2017-08-29,17.45
2017-08-30,17.05
2017-08-31,16.55
2017-09-01,16.5
2017-09-05,16.1
2017-09-06,16.45
2017-09-07,16.725
2017-09-08,16.65
2017-09-11,16.75
2017-09-12,17.05
2017-09-13,17.3
2017-09-14,17.45
2017-09-15,19.3
2017-09-18,19.4
2017-09-19,19.6
2017-09-20,20.25
2017-09-21,19.95
2017-09-22,20
2017-09-25,19.9
2017-09-26,19.85
2017-09-27,20
2017-09-28,20.075
2017-09-29,20.5
2017-10-02,20.3
2017-10-03,20.4
2017-10-04,20.35
2017-10-05,20.35
2017-10-06,20.35
2017-10-09,20.55
2017-10-10,20.4
2017-10-11,20.45
2017-10-12,20.25
2017-10-13,20.5
2017-10-16,20.35
2017-10-17,20.4
2017-10-18,20.5
2017-10-19,20.2
2017-10-20,20
2017-10-23,20.15
2017-10-24,20.1
2017-10-25,19.9
2017-10-26,19.9
2017-10-27,19.9
2017-10-30,20.25
2017-10-31,20.15
2017-11-01,20.15
2017-11-02,20.5
2017-11-03,20.55
2017-11-06,20.9
2017-11-07,21.05
2017-11-08,21.1
2017-11-09,21.55
2017-11-10,21.65
2017-11-13,21.7
2017-11-14,21.9
2017-11-15,22.1
2017-11-16,22.15
2017-11-17,22.15
2017-11-20,22
2017-11-21,22.35
2017-11-22,22.5
2017-11-24,22.65
2017-11-27,22.2
2017-11-28,22.3
2017-11-29,22.35
2017-11-30,22.8
2017-12-01,23.35
2017-12-04,23.6
2017-12-05,23.875
2017-12-06,23.9
2017-12-07,23.85
2017-12-08,23.85
2017-12-11,23.8
2017-12-12,23.65
2017-12-13,23.4
2017-12-14,23.3
2017-12-15,23.15
2017-12-18,23.4
2017-12-19,23.45
2017-12-20,23.3
2017-12-21,23.55
2017-12-22,23.4
2017-12-26,23.1
2017-12-27,23.4
2017-12-28,23.25
2017-12-29,23.3
2018-01-02,23.4
2018-01-03,23.5
2018-01-04,23.4
2018-01-05,23.6
2018-01-08,23.5
2018-01-09,23.45
2018-01-10,23.2
2018-01-11,23.25
2018-01-12,23.55
2018-01-16,24.25
2018-01-17,24.95
2018-01-18,24.45
2018-01-19,25.25
2018-01-22,26
2018-01-23,26.1
2018-01-24,25.9
2018-01-25,25.85
2018-01-26,25.8
2018-01-29,25.65
2018-01-30,25.35
2018-01-31,25.45
2018-02-01,25.7
2018-02-02,24.9
2018-02-05,24.65
2018-02-06,25.3
2018-02-07,25.4
2018-02-08,25.25
2018-02-09,25.45
2018-02-12,25.55
2018-02-13,25.5
2018-02-14,26.2
2018-02-15,26.7
2018-02-16,26.75
2018-02-20,26.6
2018-02-21,26.45
2018-02-22,26.65
2018-02-23,26.7
2018-02-26,26.75
2018-02-27,26.6
2018-02-28,27.45
2018-03-01,27.825
2018-03-02,27.95
2018-03-05,27.9
2018-03-06,28.85
2018-03-07,29
2018-03-08,28.8
2018-03-09,29.1
2018-03-12,29.4
2018-03-13,29.25
2018-03-14,28.8
2018-03-15,28.9
2018-03-16,28.4
2018-03-19,27.5
2018-03-20,27.35
2018-03-21,27.35
2018-03-22,26.6
2018-03-23,26.2
2018-03-26,26.5
2018-03-27,26.05
2018-03-28,26.3
2018-03-29,27.55
2018-04-02,26.6
2018-04-03,26.75
2018-04-04,26.8
2018-04-05,26.85
2018-04-06,26.35
2018-04-09,26.65
2018-04-10,27.1
2018-04-11,27.4
2018-04-12,27.75
2018-04-13,28.05
2018-04-16,28
2018-04-17,28.2
2018-04-18,28.35
2018-04-19,28.9
2018-04-20,29.3
2018-04-23,33.45
2018-04-24,31.45
2018-04-25,30.95
2018-04-26,30.85
2018-04-27,31.25
2018-04-30,31.15
2018-05-01,31.5
2018-05-02,33
2018-05-03,32.95
2018-05-04,33.3
2018-05-07,33.6
2018-05-08,32.5
2018-05-09,32.4
2018-05-10,35.7
2018-05-11,33.45
2018-05-14,36.45
2018-05-15,35.75
2018-05-16,37.15
2018-05-17,36.6
2018-05-18,36.05
2018-05-21,36.7
2018-05-22,36.6
2018-05-23,36.3
2018-05-24,36.05
2018-05-25,36.05
2018-05-29,34.85
2018-05-30,34.65
2018-05-31,34
2018-06-01,35.85
2018-06-04,36
2018-06-05,36.7
2018-06-06,36.6
2018-06-07,36.45
2018-06-08,36.65
2018-06-11,36.625
2018-06-12,38.1
2018-06-13,36.75
2018-06-14,37.7
2018-06-15,37.8
2018-06-18,36.25
2018-06-19,35.7
2018-06-20,37.1
2018-06-21,38.9
2018-06-22,37.3
2018-06-25,35.65
2018-06-26,34.5
2018-06-27,33.25
2018-06-28,35.55
2018-06-29,36.3
2018-07-02,36.65
2018-07-03,36.65
2018-07-05,36.1
2018-07-06,36.35
2018-07-09,36.4
2018-07-10,36.15
2018-07-11,35.35
2018-07-12,36.05
2018-07-13,36.2
2018-07-16,37.2
2018-07-17,37.9
2018-07-18,37.95
2018-07-19,37.65
2018-07-20,36.8
2018-07-23,37.35
2018-07-24,37.2
2018-07-25,37.5
2018-07-26,36.95
2018-07-27,35.6
2018-07-30,34.6
2018-07-31,34.3
2018-08-01,33.35
2018-08-02,32.8
2018-08-03,32.65
2018-08-06,32.55
2018-08-07,31.95
2018-08-08,31.95
2018-08-09,31.75
2018-08-10,31.9
2018-08-13,28.45
2018-08-14,28.025
2018-08-15,26.7
2018-08-16,28.05
2018-08-17,28
2018-08-20,27.65
2018-08-21,27.75
2018-08-22,27.8
2018-08-23,27.3
2018-08-24,27.85
2018-08-27,28.75
2018-08-28,28.9
2018-08-29,29.15
2018-08-30,28.25
2018-08-31,28.4
2018-09-04,25.85
2018-09-05,25.05
2018-09-06,24.25
2018-09-07,24.3
2018-09-10,24.15
2018-09-11,24
2018-09-12,23.75
2018-09-13,23.5
2018-09-14,25.1
2018-09-17,24.8
2018-09-18,24.45
2018-09-19,24.6
2018-09-20,25.7
2018-09-21,25.1
2018-09-24,24.95
2018-09-25,25.15
2018-09-26,24.9
2018-09-27,25.6
2018-09-28,24.9
2018-10-01,24.49
2018-10-02,24.17
2018-10-03,24.27
2018-10-04,23.43
2018-10-05,22.91
2018-10-08,22.83
2018-10-09,22.86
2018-10-10,22.15
2018-10-11,22.97
2018-10-12,23.38
2018-10-15,23.66
2018-10-16,24.12
2018-10-17,24.21
2018-10-18,23.6
2018-10-19,23.25
2018-10-22,22.45
2018-10-23,21.62
2018-10-24,20.76
2018-10-25,21.11
2018-10-26,20.58
2018-10-29,19.84
2018-10-30,20.21
2018-10-31,20.77
2018-11-01,21.76
2018-11-02,21.06
2018-11-05,20.12
2018-11-06,19.82
2018-11-07,18.03
2018-11-08,18.22
2018-11-09,17.31
2018-11-12,16.76
2018-11-13,16.35
2018-11-14,16.94
2018-11-15,17.25
2018-11-16,17.7
2018-11-19,17.27
2018-11-20,17.01
2018-11-21,18.3
2018-11-23,18.89
2018-11-26,19.19
2018-11-27,19.12
2018-11-28,19.32
2018-11-29,19.31
2018-11-30,19.77
2018-12-03,19.69
2018-12-04,18.92
2018-12-06,18.47
2018-12-07,17.9
2018-12-10,17.35
2018-12-11,17.24
2018-12-12,17
2018-12-13,16.41
2018-12-14,16.31
2018-12-17,16.34
2018-12-18,15.91
2018-12-19,15.55
2018-12-20,15.46
2018-12-21,16.47
2018-12-24,15.94
2018-12-26,16.7
2018-12-27,16.67
2018-12-28,16.33
2018-12-31,16.52
2019-01-02,16.84
2019-01-03,16.6
2019-01-04,17.03
2019-01-07,17.83
2019-01-08,17.83
2019-01-09,18.98
2019-01-10,18.78
2019-01-11,18.82
2019-01-14,17.93
2019-01-15,17.18
2019-01-16,17.71
2019-01-17,17.93
2019-01-18,17.94
2019-01-22,17.98
2019-01-23,17.49
2019-01-24,17.8
2019-01-25,18
2019-01-28,17.9
2019-01-29,17.63
2019-01-30,17.61
2019-01-31,18.11
2019-02-01,17.56
2019-02-04,17.51
2019-02-05,17.09
2019-02-06,17.05
2019-02-07,16.28
2019-02-08,16.3
2019-02-11,16.21
2019-02-12,16.29
2019-02-13,16.55
2019-02-14,16
2019-02-15,16.1
2019-02-19,16.52
2019-02-20,16.9
2019-02-21,16.68
2019-02-22,16.73
2019-02-25,16.62
2019-02-26,17.43
2019-02-27,16.63
2019-02-28,16.62
2019-03-01,16.6
2019-03-04,15.83
2019-03-05,15.71
2019-03-06,17.66
2019-03-07,17.56
2019-03-08,16.97
2019-03-11,16.94
2019-03-12,16.62
2019-03-13,16.2
2019-03-14,16.25
2019-03-15,16.64
2019-03-18,16.95
2019-03-19,16.97
2019-03-20,17.06
2019-03-21,17.7
2019-03-22,17.19
2019-03-25,17.98
2019-03-26,18.43
2019-03-27,17.53
2019-03-28,17.45
2019-03-29,17.51
2019-04-01,18.19
2019-04-02,18.04
2019-04-03,17.98
2019-04-04,18.35
2019-04-05,18.87
2019-04-08,18.68
2019-04-09,18.49
2019-04-10,18.69
2019-04-11,18.76
2019-04-12,19.24
2019-04-15,19.04
2019-04-16,19.54
2019-04-17,19.2
2019-04-18,19.38
2019-04-22,19.08
2019-04-23,19.01
2019-04-24,18.97
2019-04-25,18.65
2019-04-26,19.08
2019-04-29,18.82
2019-04-30,18.89
2019-05-01,18.19
2019-05-02,17.99
2019-05-03,18.03
2019-05-06,17.88
2019-05-07,17.59
2019-05-08,17.49
2019-05-09,20.11
2019-05-10,19.73
2019-05-13,18.59
2019-05-14,18.49
2019-05-15,18.25
2019-05-16,18.57
2019-05-17,17.92
2019-05-20,17.87
2019-05-21,17.39
2019-05-22,17.31
2019-05-23,16.8
2019-05-24,16.98
2019-05-28,16.93
2019-05-29,16.49
2019-05-30,16.32
2019-05-31,16.56
2019-06-03,16.66
2019-06-04,17.04
2019-06-05,17.03
2019-06-06,16.59
2019-06-07,16.85
2019-06-10,16.88
2019-06-11,16.79
2019-06-12,16.33
2019-06-13,16.595
2019-06-14,16.5
2019-06-17,16.34
2019-06-18,16.71
2019-06-19,16.71
2019-06-20,16.705
2019-06-21,16.645
2019-06-24,16.33
2019-06-25,16.16
2019-06-26,16.245
2019-06-27,17.045
2019-06-28,16.98
2019-07-01,17.15
2019-07-02,16.665
2019-07-03,16.665
2019-07-04,16.665
2019-07-05,16.935
2019-07-08,16.43
2019-07-09,16.125
2019-07-10,16
2019-07-11,16.03
2019-07-12,16.29
2019-07-15,16.43
2019-07-16,16.955
2019-07-17,16.595
2019-07-18,15.925
2019-07-19,15.8
2019-07-22,15.665
2019-07-23,16.005
2019-07-24,16.395
2019-07-25,16.335
2019-07-26,16.69
2019-07-29,16.63
2019-07-30,16.225
2019-07-31,15.555
2019-08-01,15.47
2019-08-02,15.335
2019-08-05,15.125
2019-08-06,15.04
2019-08-07,15.07
2019-08-08,15.56
2019-08-09,16.005
2019-08-12,12.965
2019-08-13,13.415
2019-08-14,13.25
2019-08-15,13.465
2019-08-16,13.935
2019-08-19,14.14
2019-08-20,13.985
2019-08-21,14.005
2019-08-22,14.245
2019-08-23,14.015
2019-08-26,14.225
2019-08-27,14.505
2019-08-28,14.795
2019-08-29,15.145
2019-08-30,15.205
2019-09-02,15.185
2019-09-03,15.345
2019-09-04,15.74
2019-09-05,16.205
2019-09-06,16.26
2019-09-09,16.445
2019-09-10,16.28
2019-09-11,16.18
2019-09-12,16.28
2019-09-13,16.195
2019-09-16,16.5
2019-09-17,16.23
2019-09-18,15.765
2019-09-19,15.515
2019-09-20,15.815
2019-09-23,15.53
2019-09-24,15.01
2019-09-25,15.315
2019-09-26,15.31
2019-09-27,15.065
2019-09-30,14.97
2019-10-01,15.31
2019-10-02,19.915
2019-10-03,20.24
2019-10-04,20.98
2019-10-07,20.6
2019-10-08,19.53
2019-10-09,19.9
2019-10-10,19.945
2019-10-11,20.085
2019-10-14,19.905
2019-10-15,19.845
2019-10-16,19.915
2019-10-17,19.89
2019-10-18,19.71
2019-10-21,19.795
2019-10-22,19.715
2019-10-23,19.915
2019-10-24,20.28
2019-10-25,20.305
2019-10-28,20.3
2019-10-29,20.19
2019-10-30,20.63
2019-10-31,21.77
2019-11-01,22.155
2019-11-04,21.5
2019-11-05,21.515
2019-11-06,21.465
2019-11-07,21.905
2019-11-08,21.755
2019-11-11,21.725
2019-11-12,21.775
2019-11-13,21.8
2019-11-14,21.855
2019-11-15,22.475
2019-11-18,22.85
2019-11-19,22.85
2019-11-20,22.895
2019-11-21,23.205
2019-11-22,23.755
2019-11-25,23.865
