date,close
2014-06-13,64.2254
2014-06-16,64.5784
2014-06-17,64.7187
2014-06-18,65.4416
2014-06-19,65.7732
2014-06-20,65.8583
2014-06-23,65.3055
2014-06-24,65.5754
2014-06-25,65.6954
2014-06-26,65.6354
2014-06-27,65.7982
2014-06-30,65.9782
2014-07-01,65.9868
2014-07-02,65.3868
2014-07-03,65.1297
2014-07-07,65.224
2014-07-08,65.2154
2014-07-09,65.1897
2014-07-10,65.2068
2014-07-11,65.1554
2014-07-14,65.1468
2014-07-15,65.0611
2014-07-16,65.1297
2014-07-17,64.4355
2014-07-18,65.044
2014-07-21,64.8897
2014-07-22,64.9926
2014-07-23,64.9154
2014-07-24,65.0869
2014-07-25,64.6326
2014-07-28,64.9326
2014-07-29,64.6583
2014-07-30,64.2212
2014-07-31,63.1156
2014-08-01,63.1241
2014-08-04,63.1241
2014-08-05,62.6185
2014-08-06,62.387
2014-08-07,62.4385
2014-08-08,63.3298
2014-08-11,63.4155
2014-08-12,63.2698
2014-08-13,63.7241
2014-08-14,64.0069
2014-08-15,64.0498
2014-08-18,64.2898
2014-08-19,64.744
2014-08-20,64.9583
2014-08-21,65.1383
2014-08-22,65.0183
2014-08-25,65.344
2014-08-26,65.0783
2014-08-27,65.3697
2014-08-28,65.404
2014-08-29,65.6868
2014-09-02,65.464
2014-09-03,65.6011
2014-09-04,65.464
2014-09-05,65.9439
2014-09-08,65.6268
2014-09-09,65.0783
2014-09-10,65.1297
2014-09-11,65.4297
2014-09-12,64.7012
2014-09-15,64.804
2014-09-16,65.1983
2014-09-17,65.0783
2014-09-18,64.9926
2014-09-19,65.0954
2014-09-22,64.6755
2014-09-23,64.1269
2014-09-24,64.3232
2014-09-25,63.6149
2014-09-26,63.9518
2014-09-29,63.9777
2014-09-30,63.8049
2014-10-01,63.2434
2014-10-02,63.2002
2014-10-03,63.6667
2014-10-06,63.6062
2014-10-07,62.9583
2014-10-08,64.1505
2014-10-09,62.9065
2014-10-10,62.872
2014-10-13,62.3536
2014-10-14,62.8028
2014-10-15,62.3104
2014-10-16,62.535
2014-10-17,63.0274
2014-10-20,63.7531
2014-10-21,64.6083
2014-10-22,64.5133
2014-10-23,65.0921
2014-10-24,65.619
2014-10-27,65.6104
2014-10-28,66.2669
2014-10-29,66.1805
2014-10-30,67.5195
2014-10-31,67.5109
2014-11-03,67.6578
2014-11-04,67.4332
2014-11-05,68.0465
2014-11-06,67.7009
2014-11-07,67.9342
2014-11-10,68.1933
2014-11-11,68.0465
2014-11-12,67.7614
2014-11-13,67.5195
2014-11-14,67.2172
2014-11-17,67.58
2014-11-18,67.8478
2014-11-19,67.7614
2014-11-20,67.8133
2014-11-21,68.1156
2014-11-24,68.0897
2014-11-25,68.0379
2014-11-26,68.1502
2014-11-28,68.1502
2014-12-01,67.9169
2014-12-02,68.3402
2014-12-03,68.513
2014-12-04,68.4007
2014-12-05,68.392
2014-12-08,68.2193
2014-12-09,68.392
2014-12-10,67.3122
2014-12-11,67.7787
2014-12-12,66.6643
2014-12-15,66.2237
2014-12-16,66.2324
2014-12-17,67.4504
2014-12-18,68.8326
2014-12-19,69.0572
2014-12-22,69.3077
2014-12-23,69.541
2014-12-24,69.9504
2014-12-26,70.3769
2014-12-29,70.8732
2014-12-30,70.1071
2014-12-31,69.1233
2015-01-02,69.1581
2015-01-05,68.0264
2015-01-06,67.5824
2015-01-07,68.3659
2015-01-08,69.341
2015-01-09,68.8012
2015-01-12,68.4356
2015-01-13,68.5575
2015-01-14,68.6706
2015-01-15,68.54
2015-01-16,69.2887
2015-01-20,69.4454
2015-01-21,69.8981
2015-01-22,70.4727
2015-01-23,70.1593
2015-01-26,70.3247
2015-01-27,69.9155
2015-01-28,69.1756
2015-01-29,69.9068
2015-01-30,68.7751
2015-02-02,69.4715
2015-02-03,70.3769
2015-02-04,69.8111
2015-02-05,70.3334
2015-02-06,69.3236
2015-02-09,68.9492
2015-02-10,69.6718
2015-02-11,69.1233
2015-02-12,69.5238
2015-02-13,69.2713
2015-02-17,69.3758
2015-02-18,69.8111
2015-02-19,69.5847
2015-02-20,69.7937
2015-02-23,69.872
2015-02-24,69.9591
2015-02-25,69.6282
2015-02-26,69.3497
2015-02-27,69.1581
2015-03-02,68.8621
2015-03-03,68.8012
2015-03-04,68.4007
2015-03-05,68.54
2015-03-06,67.2429
2015-03-09,67.4605
2015-03-10,66.7293
2015-03-11,66.5638
2015-03-12,67.4779
2015-03-13,66.9382
2015-03-16,67.7913
2015-03-17,67.713
2015-03-18,68.8186
2015-03-19,68.392
2015-03-20,69.2887
2015-03-23,69.3758
2015-03-24,68.7751
2015-03-25,68.0629
2015-03-26,67.7822
2015-03-27,67.9576
2015-03-30,68.6857
2015-03-31,68.3699
2015-04-01,68.3436
2015-04-02,68.4752
2015-04-06,69.2559
2015-04-07,68.8261
2015-04-08,68.6945
2015-04-09,68.8261
2015-04-10,69.2998
2015-04-13,68.8436
2015-04-14,69.2384
2015-04-15,69.5892
2015-04-16,69.3436
2015-04-17,68.7647
2015-04-20,69.405
2015-04-21,69.0191
2015-04-22,69.1945
2015-04-23,69.5278
2015-04-24,69.6068
2015-04-27,69.0366
2015-04-28,69.4401
2015-04-29,69.2033
2015-04-30,68.712
2015-05-01,69.0541
2015-05-04,69.2208
2015-05-05,68.3436
2015-05-06,68.1068
2015-05-07,68.1155
2015-05-08,68.7734
2015-05-11,68.4664
2015-05-12,68.3348
2015-05-13,68.2471
2015-05-14,68.8612
2015-05-15,69.1155
2015-05-18,69.3524
2015-05-19,69.2998
2015-05-20,69.3787
2015-05-21,69.5103
2015-05-22,69.3349
2015-05-26,68.7208
2015-05-27,69.0805
2015-05-28,69.1682
2015-05-29,68.7647
2015-06-01,68.712
2015-06-02,68.4489
2015-06-03,68.2734
2015-06-04,67.7822
2015-06-05,67.5102
2015-06-08,67.2997
2015-06-09,67.2559
2015-06-10,67.9664
2015-06-11,68.2471
2015-06-12,67.6155
2015-06-15,67.2997
2015-06-16,67.6769
2015-06-17,67.9138
2015-06-18,68.484
2015-06-19,68.1068
2015-06-22,68.3611
2015-06-23,68.1243
2015-06-24,67.6169
2015-06-25,67.2365
2015-06-26,67.6346
2015-06-29,66.5377
2015-06-30,66.4758
2015-07-01,66.8473
2015-07-02,67.0684
2015-07-06,66.8473
2015-07-07,67.7673
2015-07-08,67.0596
2015-07-09,66.9358
2015-07-10,67.4753
2015-07-13,67.9442
2015-07-14,68.0769
2015-07-15,67.8999
2015-07-16,68.4661
2015-07-17,67.8999
2015-07-20,67.7319
2015-07-21,67.263
2015-07-22,67.263
2015-07-23,66.8031
2015-07-24,66.2016
2015-07-27,66.2546
2015-07-28,66.9004
2015-07-29,67.3603
2015-07-30,67.5284
2015-07-31,67.5107
2015-08-03,67.4311
2015-08-04,67.0684
2015-08-05,67.3161
2015-08-06,67.3161
2015-08-07,67.3338
2015-08-10,67.8999
2015-08-11,67.6876
2015-08-12,68.068
2015-08-13,67.9088
2015-08-14,68.2715
2015-08-17,68.5722
2015-08-18,68.3865
2015-08-19,67.9619
2015-08-20,67.1834
2015-08-21,65.7946
2015-08-24,63.5036
2015-08-25,62.336
2015-08-26,63.6894
2015-08-27,65.087
2015-08-28,65.3347
2015-08-31,64.9985
2015-09-01,63.194
2015-09-02,63.7955
2015-09-03,64.2024
2015-09-04,63.3178
2015-09-08,64.8128
2015-09-09,63.9194
2015-09-10,64.0167
2015-09-11,64.229
2015-09-14,64.052
2015-09-15,64.7243
2015-09-16,65.5027
2015-09-17,65.6266
2015-09-18,64.7509
2015-09-21,65.0428
2015-09-22,64.4147
2015-09-23,64.2997
2015-09-24,64.512
2015-09-25,64.8265
2015-09-28,63.7643
2015-09-29,63.8601
2015-09-30,64.9336
2015-10-01,64.523
2015-10-02,65.3888
2015-10-05,66.683
2015-10-06,66.558
2015-10-07,67.04
2015-10-08,67.8522
2015-10-09,67.7897
2015-10-12,67.8879
2015-10-13,67.5488
2015-10-14,67.3256
2015-10-15,67.9326
2015-10-16,68.2003
2015-10-19,68.1468
2015-10-20,68.2539
2015-10-21,67.995
2015-10-22,69.1911
2015-10-23,69.075
2015-10-26,68.7983
2015-10-27,68.3967
2015-10-28,68.8162
2015-10-29,68.5663
2015-10-30,68.6109
2015-11-02,69.2357
2015-11-03,69.3874
2015-11-04,69.2535
2015-11-05,69.1554
2015-11-06,68.2271
2015-11-09,67.8969
2015-11-10,68.2449
2015-11-11,68.2896
2015-11-12,67.1293
2015-11-13,66.7097
2015-11-16,67.8344
2015-11-17,67.2185
2015-11-18,68.12
2015-11-19,68.3342
2015-11-20,68.4859
2015-11-23,68.5752
2015-11-24,68.7626
2015-11-25,68.7448
2015-11-27,68.8073
2015-11-30,68.6823
2015-12-01,69.1911
2015-12-02,68.1289
2015-12-03,67.2899
2015-12-04,68.3431
2015-12-07,67.9415
2015-12-08,67.5755
2015-12-09,67.2185
2015-12-10,66.9775
2015-12-11,66.1564
2015-12-14,66.3259
2015-12-15,67.0846
2015-12-16,68.1378
2015-12-17,67.4595
2015-12-18,66.4018
2015-12-21,66.7633
2015-12-22,67.4684
2015-12-23,68.4949
2015-12-24,68.3894
2015-12-28,68.3084
2015-12-29,68.7227
2015-12-30,68.3894
2015-12-31,67.6869
2016-01-04,67.1555
2016-01-05,67.5608
2016-01-06,66.8763
2016-01-07,65.6874
2016-01-08,65.237
2016-01-11,65.3901
2016-01-12,65.4532
2016-01-13,64.4714
2016-01-14,65.5973
2016-01-15,64.6786
2016-01-19,64.8497
2016-01-20,63.7419
2016-01-21,63.931
2016-01-22,65.165
2016-01-25,64.1112
2016-01-26,65.1019
2016-01-27,64.9128
2016-01-28,65.6333
2016-01-29,67.0654
2016-02-01,67.2276
2016-02-02,66.6241
2016-02-03,67.4978
2016-02-04,67.3897
2016-02-05,67.1555
2016-02-08,67.2095
2016-02-09,67.1825
2016-02-10,66.9303
2016-02-11,66.0927
2016-02-12,66.8493
2016-02-16,67.6239
2016-02-17,68.4165
2016-02-18,68.6957
2016-02-19,68.6146
2016-02-22,69.3802
2016-02-23,68.9659
2016-02-24,69.2181
2016-02-25,69.7945
2016-02-26,69.128
2016-02-29,69.0019
2016-03-01,69.6324
2016-03-02,70.2449
2016-03-03,70.8573
2016-03-04,71.4788
2016-03-07,71.8211
2016-03-08,71.4068
2016-03-09,71.9021
2016-03-10,72.0372
2016-03-11,72.6857
2016-03-14,72.4876
2016-03-15,72.4155
2016-03-16,73.001
2016-03-17,73.7215
2016-03-18,73.6135
2016-03-21,73.6135
2016-03-22,73.3884
2016-03-23,72.9254
2016-03-24,72.9163
2016-03-28,72.989
2016-03-29,73.8967
2016-03-30,74.0056
2016-03-31,74.1327
2016-04-01,74.3596
2016-04-04,73.9511
2016-04-05,73.0071
2016-04-06,73.4337
2016-04-07,72.8619
2016-04-08,73.1705
2016-04-11,73.107
2016-04-12,73.9874
2016-04-13,74.3505
2016-04-14,73.9965
2016-04-15,74.1508
2016-04-18,74.5048
2016-04-19,74.9678
2016-04-20,74.3324
2016-04-21,73.3339
2016-04-22,73.9058
2016-04-25,73.7787
2016-04-26,74.2144
2016-04-27,74.9769
2016-04-28,74.5321
2016-04-29,74.4685
2016-05-02,74.877
2016-05-03,74.2235
2016-05-04,74.1508
2016-05-05,73.9874
2016-05-06,74.1418
2016-05-09,74.1418
2016-05-10,74.8498
2016-05-11,74.6138
2016-05-12,74.8589
2016-05-13,74.2053
2016-05-16,74.6955
2016-05-17,73.815
2016-05-18,73.2068
2016-05-19,73.2613
2016-05-20,73.5881
2016-05-23,73.4156
2016-05-24,74.2235
2016-05-25,74.6773
2016-05-26,74.9042
2016-05-27,75.2038
2016-05-31,75.2492
2016-06-01,75.4398
2016-06-02,75.6486
2016-06-03,75.9027
2016-06-06,76.3747
2016-06-07,76.638
2016-06-08,76.9103
2016-06-09,76.992
2016-06-10,76.4655
2016-06-13,75.8301
2016-06-14,75.9027
2016-06-15,75.6758
2016-06-16,75.9844
2016-06-17,76.1024
2016-06-20,76.4699
2016-06-21,76.6346
2016-06-22,76.415
2016-06-23,77.4306
2016-06-24,75.6097
2016-06-27,74.4842
2016-06-28,75.3627
2016-06-29,76.5248
2016-06-30,78.0346
2016-07-01,78.0529
2016-07-05,77.5954
2016-07-06,78.0346
2016-07-07,77.5588
2016-07-08,78.5836
2016-07-11,78.9222
2016-07-12,79.4437
2016-07-13,79.5718
2016-07-14,79.6176
2016-07-15,79.8555
2016-07-18,79.7274
2016-07-19,79.5444
2016-07-20,79.5444
2016-07-21,79.3797
2016-07-22,79.9104
2016-07-25,79.5718
2016-07-26,79.5352
2016-07-27,79.2607
2016-07-28,79.3614
2016-07-29,79.5993
2016-08-01,79.3339
2016-08-02,78.8032
2016-08-03,78.8856
2016-08-04,78.9313
2016-08-05,79.2607
2016-08-08,79.3156
2016-08-09,79.2333
2016-08-10,79.1784
2016-08-11,79.6084
2016-08-12,79.4529
2016-08-15,79.4437
2016-08-16,78.8307
2016-08-17,79.3248
2016-08-18,79.9013
2016-08-19,79.462
2016-08-22,79.3339
2016-08-23,79.4346
2016-08-24,79.0869
2016-08-25,79.3339
2016-08-26,78.6751
2016-08-29,79.215
2016-08-30,78.849
2016-08-31,78.7941
2016-09-01,78.611
2016-09-02,79.3339
2016-09-06,79.6542
2016-09-07,79.8189
2016-09-08,79.8555
2016-09-09,77.5496
2016-09-12,78.5287
2016-09-13,77.2842
2016-09-14,77.1561
2016-09-15,77.7875
2016-09-16,77.7967
2016-09-19,78.245
2016-09-20,78.0346
2016-09-21,79.3339
2016-09-22,79.947
2016-09-23,79.5627
2016-09-26,79.0767
2016-09-27,78.9475
2016-09-28,79.5102
2016-09-29,78.6985
2016-09-30,79.0398
2016-10-03,78.6062
2016-10-04,77.5916
2016-10-05,77.7853
2016-10-06,77.8683
2016-10-07,77.5455
2016-10-10,78.0067
2016-10-11,77.0566
2016-10-12,77.4717
2016-10-13,77.361
2016-10-14,77.3149
2016-10-17,77.2134
2016-10-18,77.5732
2016-10-19,77.8314
2016-10-20,77.3149
2016-10-21,77.1489
2016-10-24,77.2319
2016-10-25,77.3333
2016-10-26,77.2688
2016-10-27,76.826
2016-10-28,76.9736
2016-10-31,77.527
2016-11-01,76.5032
2016-11-02,75.7468
2016-11-03,75.6085
2016-11-04,75.4424
2016-11-07,76.8998
2016-11-08,77.3518
2016-11-09,78.0251
2016-11-10,78.0436
2016-11-11,78.1081
2016-11-14,78.8553
2016-11-15,79.5748
2016-11-16,79.3165
2016-11-17,79.4917
2016-11-18,79.4456
2016-11-21,80.1928
2016-11-22,80.4971
2016-11-23,80.285
2016-11-25,80.8108
2016-11-28,80.8384
2016-11-29,80.9122
2016-11-30,80.4602
2016-12-01,80.3034
2016-12-02,80.4418
2016-12-05,81.0229
2016-12-06,81.2535
2016-12-07,82.2958
2016-12-08,82.508
2016-12-09,82.84
2016-12-12,82.8216
2016-12-13,83.3012
2016-12-14,82.1943
2016-12-15,82.5264
2016-12-16,82.7478
2016-12-19,82.9784
2016-12-20,83.3381
2016-12-21,83.0102
2016-12-22,82.9172
2016-12-23,82.9451
2016-12-27,83.1775
2016-12-28,82.3037
2016-12-29,82.6198
2016-12-30,82.3316
2017-01-03,82.6848
2017-01-04,83.1217
2017-01-05,82.9916
2017-01-06,83.1682
2017-01-09,82.2851
2017-01-10,82.1922
2017-01-11,82.7127
2017-01-12,82.4432
2017-01-13,82.5547
2017-01-17,82.471
2017-01-18,82.657
2017-01-19,82.0434
2017-01-20,82.4989
2017-01-23,82.2479
2017-01-24,82.9916
2017-01-25,83.8282
2017-01-26,83.54
2017-01-27,83.3913
2017-01-30,82.8893
2017-01-31,83.4378
2017-02-01,82.8615
2017-02-02,83.1775
2017-02-03,83.7352
2017-02-06,83.3355
2017-02-07,83.2519
2017-02-08,83.382
2017-02-09,83.5679
2017-02-10,84.0699
2017-02-13,84.4603
2017-02-14,84.4696
2017-02-15,84.6369
2017-02-16,84.7485
2017-02-17,84.5812
2017-02-21,85.1203
2017-02-22,85.0831
2017-02-23,85.362
2017-02-24,85.6966
2017-02-27,85.771
2017-02-28,85.7896
2017-03-01,86.7099
2017-03-02,86.2079
2017-03-03,86.1986
2017-03-06,85.864
2017-03-07,85.613
2017-03-08,84.8507
2017-03-09,84.702
2017-03-10,85.0738
2017-03-13,85.2783
2017-03-14,84.9344
2017-03-15,86.0778
2017-03-16,85.6595
2017-03-17,85.8268
2017-03-20,85.5668
2017-03-21,84.8043
2017-03-22,84.9065
2017-03-23,84.9251
2017-03-24,84.7951
2017-03-27,84.4673
2017-03-28,85.1043
2017-03-29,85.1886
2017-03-30,85.4134
2017-03-31,85.3385
2017-04-03,84.9169
2017-04-04,85.0668
2017-04-05,84.9357
2017-04-06,85.3572
2017-04-07,85.1324
2017-04-10,85.3853
2017-04-11,85.6663
2017-04-12,85.4415
2017-04-13,84.7764
2017-04-17,85.3197
2017-04-18,85.2823
2017-04-19,85.1511
2017-04-20,85.479
2017-04-21,85.404
2017-04-24,86.2284
2017-04-25,86.8092
2017-04-26,86.4345
2017-04-27,86.3876
2017-04-28,85.7132
2017-05-01,85.3853
2017-05-02,85.404
2017-05-03,85.404
2017-05-04,85.1886
2017-05-05,85.8537
2017-05-08,85.7694
2017-05-09,85.4228
2017-05-10,85.8256
2017-05-11,85.2916
2017-05-12,85.1136
2017-05-15,85.5727
2017-05-16,85.1511
2017-05-17,84.3642
2017-05-18,84.3736
2017-05-19,84.9919
2017-05-22,85.479
2017-05-23,85.6476
2017-05-24,85.8349
2017-05-25,86.2096
2017-05-26,86.2659
2017-05-30,86.1534
2017-05-31,86.3783
2017-06-01,87.315
2017-06-02,87.2963
2017-06-05,87.0527
2017-06-06,86.5656
2017-06-07,86.6312
2017-06-08,86.6312
2017-06-09,87.4368
2017-06-12,87.671
2017-06-13,88.0176
2017-06-14,88.027
2017-06-15,88.0738
2017-06-16,88.4298
2017-06-19,88.5234
2017-06-20,87.8771
2017-06-21,87.2588
2017-06-22,87.1839
2017-06-23,87.2963
2017-06-26,87.671
2017-06-27,87.1698
2017-06-28,87.5097
2017-06-29,86.9432
2017-06-30,87.0565
2017-07-03,87.4247
2017-07-05,86.9999
2017-07-06,86.1502
2017-07-07,86.4617
2017-07-10,86.2918
2017-07-11,86.103
2017-07-12,86.4617
2017-07-13,86.5373
2017-07-14,86.8394
2017-07-17,86.9904
2017-07-18,86.8205
2017-07-19,87.5097
2017-07-20,87.774
2017-07-21,87.8401
2017-07-24,87.5003
2017-07-25,87.9629
2017-07-26,87.5569
2017-07-27,87.7835
2017-07-28,87.3114
2017-07-31,87.5852
2017-08-01,87.6608
2017-08-02,87.5286
2017-08-03,87.4153
2017-08-04,87.6135
2017-08-07,87.6608
2017-08-08,87.6135
2017-08-09,87.3775
2017-08-10,86.5656
2017-08-11,86.3201
2017-08-14,86.9055
2017-08-15,86.7544
2017-08-16,86.8677
2017-08-17,85.8103
2017-08-18,85.8009
2017-08-21,85.8669
2017-08-22,86.5089
2017-08-23,86.4712
2017-08-24,86.3296
2017-08-25,86.7733
2017-08-28,86.9149
2017-08-29,86.7638
2017-08-30,86.8677
2017-08-31,86.9055
2017-09-01,87.2642
2017-09-05,86.9055
2017-09-06,87.0848
2017-09-07,87.0282
2017-09-08,87.3398
2017-09-11,88.1139
2017-09-12,88.1422
2017-09-13,88.0856
2017-09-14,88.3594
2017-09-15,88.5388
2017-09-18,88.6143
2017-09-19,88.6237
2017-09-20,88.6898
2017-09-21,88.4632
2017-09-22,88.4444
2017-09-25,89.058
2017-09-26,88.9512
2017-09-27,88.9131
2017-09-28,89.2366
2017-09-29,89.1034
2017-10-02,89.4269
2017-10-03,89.484
2017-10-04,89.7123
2017-10-05,89.8265
2017-10-06,89.4745
2017-10-09,89.5506
2017-10-10,90.1119
2017-10-11,90.1976
2017-10-12,90.464
2017-10-13,90.4069
2017-10-16,90.3974
2017-10-17,90.3212
2017-10-18,90.2927
2017-10-19,90.4164
2017-10-20,90.9302
2017-10-23,90.797
2017-10-24,90.7875
2017-10-25,90.2737
2017-10-26,90.4735
2017-10-27,90.4354
2017-10-30,90.0168
2017-10-31,90.15
2017-11-01,90.0073
2017-11-02,90.2451
2017-11-03,90.188
2017-11-06,90.1595
2017-11-07,90.188
2017-11-08,90.3878
2017-11-09,90.3022
2017-11-10,90.2927
2017-11-13,90.5972
2017-11-14,90.9111
2017-11-15,90.15
2017-11-16,90.6067
2017-11-17,90.6162
2017-11-20,90.7304
2017-11-21,90.9777
2017-11-22,90.9682
2017-11-24,90.9302
2017-11-27,91.168
2017-11-28,92.2907
2017-11-29,93.0995
2017-11-30,93.8036
2017-12-01,93.5752
2017-12-04,94.0604
2017-12-05,93.3183
2017-12-06,93.2612
2017-12-07,93.6133
2017-12-08,94.2317
2017-12-11,94.3459
2017-12-12,93.9463
2017-12-13,94.2412
2017-12-14,93.6513
2017-12-15,94.3554
2017-12-18,94.7455
2017-12-19,94.2544
2017-12-20,94.0914
2017-12-21,94.0722
2017-12-22,94.3024
2017-12-26,94.4175
2017-12-27,94.4559
2017-12-28,94.6765
2017-12-29,94.5326
2018-01-02,94.6477
2018-01-03,94.7724
2018-01-04,94.6956
2018-01-05,94.8971
2018-01-08,95.463
2018-01-09,95.1464
2018-01-10,94.993
2018-01-11,95.8946
2018-01-12,96.2686
2018-01-16,95.5013
2018-01-17,96.2015
2018-01-18,95.7411
2018-01-19,96.4413
2018-01-22,96.8921
2018-01-23,97.0935
2018-01-24,96.9208
2018-01-25,97.2278
2018-01-26,98.139
2018-01-29,97.2757
2018-01-30,96.5084
2018-01-31,96.5468
2018-02-01,96.1344
2018-02-02,94.475
2018-02-05,91.2428
2018-02-06,91.8086
2018-02-07,91.7127
2018-02-08,89.1231
2018-02-09,90.3987
2018-02-12,91.4634
2018-02-13,91.8086
2018-02-14,92.6815
2018-02-15,93.8516
2018-02-16,93.9859
2018-02-20,92.998
2018-02-21,92.2786
2018-02-22,92.5855
2018-02-23,94.2161
2018-02-26,94.6573
2018-02-27,93.42
2018-02-28,92.4417
2018-03-01,91.5689
2018-03-02,92.058
2018-03-05,93.1802
2018-03-06,93.1035
2018-03-07,92.7198
2018-03-08,92.7678
2018-03-09,93.8324
2018-03-12,93.6981
2018-03-13,93.3816
2018-03-14,92.9596
2018-03-15,92.9404
2018-03-16,93.5447
2018-03-19,92.5951
2018-03-20,92.48
2018-03-21,92.4992
2018-03-22,90.9237
2018-03-23,89.4346
2018-03-26,91.1171
2018-03-27,91.0301
2018-03-28,91.0301
2018-03-29,91.9777
2018-04-02,90.3822
2018-04-03,91.4459
2018-04-04,92.2678
2018-04-05,93.0607
2018-04-06,91.5716
2018-04-09,91.6683
2018-04-10,92.5579
2018-04-11,92.3548
2018-04-12,92.1808
2018-04-13,92.4225
2018-04-16,93.4475
2018-04-17,94.0664
2018-04-18,93.931
2018-04-19,93.2638
2018-04-20,92.7126
2018-04-23,93.022
2018-04-24,92.732
2018-04-25,92.9253
2018-04-26,93.5732
2018-04-27,93.7956
2018-04-30,93.1381
2018-05-01,92.7126
2018-05-02,92.4709
2018-05-03,92.4129
2018-05-04,93.3025
2018-05-07,93.1381
2018-05-08,92.4999
2018-05-09,92.9157
2018-05-10,93.7666
2018-05-11,93.9213
2018-05-14,94.0374
2018-05-15,93.7376
2018-05-16,94.0954
2018-05-17,94.1824
2018-05-18,93.9793
2018-05-21,94.6079
2018-05-22,94.3661
2018-05-23,94.4918
2018-05-24,94.7239
2018-05-25,94.3951
2018-05-29,93.8923
2018-05-30,95.1107
2018-05-31,94.4338
2018-06-01,94.5112
2018-06-04,94.6562
2018-06-05,94.8496
2018-06-06,94.7239
2018-06-07,95.1107
2018-06-08,95.3718
2018-06-11,95.4781
2018-06-12,95.7295
2018-06-13,95.0043
2018-06-14,95.2267
2018-06-15,95.2751
2018-06-18,95.3718
2018-06-19,95.4685
2018-06-20,95.5362
2018-06-21,95.043
2018-06-22,95.3331
2018-06-25,95.2074
2018-06-26,95.3363
2018-06-27,95.0926
2018-06-28,95.3363
2018-06-29,95.2876
2018-07-02,95.2388
2018-07-03,95.5313
2018-07-05,96.165
2018-07-06,96.7694
2018-07-09,96.5257
2018-07-10,97.0132
2018-07-11,96.399
2018-07-12,96.4477
2018-07-13,96.438
2018-07-16,96.0967
2018-07-17,96.204
2018-07-18,96.1845
2018-07-19,96.4087
2018-07-20,95.9213
2018-07-23,95.7848
2018-07-24,95.9993
2018-07-25,96.282
2018-07-26,96.8279
2018-07-27,96.5452
2018-07-30,96.6622
2018-07-31,97.4519
2018-08-01,96.5647
2018-08-02,96.9157
2018-08-03,97.5104
2018-08-06,97.5494
2018-08-07,97.6761
2018-08-08,97.4811
2018-08-09,97.6469
2018-08-10,97.2569
2018-08-13,97.0522
2018-08-14,97.9686
2018-08-15,97.2764
2018-08-16,98.2903
2018-08-17,98.8557
2018-08-20,99.3334
2018-08-21,99.3139
2018-08-22,98.7777
2018-08-23,98.612
2018-08-24,98.8752
2018-08-27,99.0215
2018-08-28,98.8655
2018-08-29,99.0215
2018-08-30,98.6413
2018-08-31,98.4755
2018-09-04,98.5243
2018-09-05,99.158
2018-09-06,99.1677
2018-09-07,98.7485
2018-09-10,99.119
2018-09-11,99.0507
2018-09-12,99.3724
2018-09-13,99.5187
2018-09-14,99.6259
2018-09-17,99.5674
2018-09-18,99.7527
2018-09-19,99.0702
2018-09-20,99.4212
2018-09-21,99.6649
2018-09-24,98.8655
2018-09-25,98.1343
2018-09-26,97.622
2018-09-27,97.6614
2018-09-28,98.094
2018-10-01,98.3398
2018-10-02,98.625
2018-10-03,98.4283
2018-10-04,98.4382
2018-10-05,98.566
2018-10-08,98.9692
2018-10-09,98.5267
2018-10-10,96.7862
2018-10-11,94.3968
2018-10-12,94.7606
2018-10-15,94.7311
2018-10-16,96.0389
2018-10-17,95.7439
2018-10-18,95.4293
2018-10-19,95.8816
2018-10-22,95.1343
2018-10-23,94.682
2018-10-24,93.5118
2018-10-25,94.033
2018-10-26,92.5187
2018-10-29,93.1677
2018-10-30,94.4165
2018-10-31,94.269
2018-11-01,94.7803
2018-11-02,94.6426
2018-11-05,95.7046
2018-11-06,96.4421
2018-11-07,97.4942
2018-11-08,97.2484
2018-11-09,96.5699
2018-11-12,95.9406
2018-11-13,95.6653
2018-11-14,95.036
2018-11-15,95.2326
2018-11-16,95.8029
2018-11-19,95.5866
2018-11-20,93.9052
2018-11-21,93.7577
2018-11-23,93.1677
2018-11-26,94.3575
2018-11-27,94.7901
2018-11-28,95.6358
2018-11-29,95.5571
2018-11-30,96.2159
2018-12-03,97.1599
2018-12-04,95.2326
2018-12-06,94.6525
2018-12-07,93.8167
2018-12-10,93.5413
2018-12-11,93.6888
2018-12-12,94.0527
2018-12-13,93.9052
2018-12-14,93.0497
2018-12-17,90.7846
2018-12-18,90.2295
2018-12-19,89.2977
2018-12-20,88.4156
2018-12-21,87.3649
2018-12-24,84.4508
2018-12-26,87.4244
2018-12-27,88.0191
2018-12-28,87.92
2018-12-31,88.5246
2019-01-02,88.2272
2019-01-03,87.4244
2019-01-04,89.5257
2019-01-07,90.0511
2019-01-08,90.9828
2019-01-09,91.1315
2019-01-10,91.637
2019-01-11,91.5775
2019-01-14,90.7746
2019-01-15,91.3396
2019-01-16,91.3396
2019-01-17,92.0929
2019-01-18,93.0445
2019-01-22,92.1524
2019-01-23,92.4894
2019-01-24,92.4399
2019-01-25,92.7471
2019-01-28,92.42
2019-01-29,92.7471
2019-01-30,93.3419
2019-01-31,94.5511
2019-02-01,94.5611
2019-02-04,94.7494
2019-02-05,94.9575
2019-02-06,94.7989
2019-02-07,94.6304
2019-02-08,94.8089
2019-02-11,94.7989
2019-02-12,95.6811
2019-02-13,95.9785
2019-02-14,95.5324
2019-02-15,96.1866
2019-02-19,96.6921
2019-02-20,97.2968
2019-02-21,97.1283
2019-02-22,97.6933
2019-02-25,97.4455
2019-02-26,97.2472
2019-02-27,97.4256
2019-02-28,97.2869
2019-03-01,97.7032
2019-03-04,97.4256
2019-03-05,97.3761
2019-03-06,96.9598
2019-03-07,96.5435
2019-03-08,96.4245
2019-03-11,97.5248
2019-03-12,97.8519
2019-03-13,98.1393
2019-03-14,97.9708
2019-03-15,98.3078
2019-03-18,98.8332
2019-03-19,98.1889
2019-03-20,97.39
2019-03-21,98.5
2019-03-22,97.08
2019-03-25,97.07
2019-03-26,98.16
2019-03-27,97.79
2019-03-28,97.82
2019-03-29,98.18
2019-04-01,99.28
2019-04-02,99.05
2019-04-03,99.18
2019-04-04,99.56
2019-04-05,100.22
2019-04-08,100.1
2019-04-09,99.35
2019-04-10,99.65
2019-04-11,99.99
2019-04-12,100.57
2019-04-15,100.17
2019-04-16,100.5
2019-04-17,100.41
2019-04-18,100.28
2019-04-22,100.06
2019-04-23,100.72
2019-04-24,100.43
2019-04-25,100.08
2019-04-26,100.64
2019-04-29,100.6
2019-04-30,101.06
2019-05-01,100
2019-05-02,99.91
2019-05-03,100.96
2019-05-06,100.43
2019-05-07,99.42
2019-05-08,98.78
2019-05-09,98.33
2019-05-10,99.14
2019-05-13,97.44
2019-05-14,98.07
2019-05-15,98.21
2019-05-16,98.62
2019-05-17,98.16
2019-05-20,97.69
2019-05-21,98.37
2019-05-22,97.74
2019-05-23,96.93
2019-05-24,97.08
2019-05-28,95.49
2019-05-29,94.9
2019-05-30,94.84
2019-05-31,93.61
2019-06-03,94.96
2019-06-04,96.73
2019-06-05,97.13
2019-06-06,97.64
2019-06-07,97.65
2019-06-10,97.63
2019-06-11,97.83
2019-06-12,97.9
2019-06-13,98.355
2019-06-14,98.73
2019-06-17,97.51
2019-06-18,97.915
2019-06-19,98.35
2019-06-20,98.98
2019-06-21,99.39
2019-06-24,98.985
2019-06-25,98.66
2019-06-26,98.275
2019-06-27,98.56
2019-06-28,99.34
2019-07-01,99.58
2019-07-02,99.72
2019-07-03,100.66
2019-07-04,100.66
2019-07-05,100.72
2019-07-08,100.47
2019-07-09,100.04
2019-07-10,100.29
2019-07-11,100.17
2019-07-12,101.155
2019-07-15,100.935
2019-07-16,100.92
2019-07-17,100.285
2019-07-18,100.6
2019-07-19,100.4
2019-07-22,99.99
2019-07-23,100.59
2019-07-24,101.4
2019-07-25,100.66
2019-07-26,101.36
2019-07-29,101.16
2019-07-30,100.94
2019-07-31,100.33
2019-08-01,99.16
2019-08-02,98.755
2019-08-05,96.5
2019-08-06,97.3
2019-08-07,96.98
2019-08-08,98.42
2019-08-09,97.84
2019-08-12,96.59
2019-08-13,97.58
2019-08-14,95.25
2019-08-15,95.51
2019-08-16,96.77
2019-08-19,97.95
2019-08-20,97.515
2019-08-21,97.89
2019-08-22,98.16
2019-08-23,95.39
2019-08-26,96.15
2019-08-27,95.76
2019-08-28,96.56
2019-08-29,97.67
2019-08-30,97.97
2019-09-02,97.98
2019-09-03,97.72
2019-09-04,98.8
2019-09-05,99.735
2019-09-06,99.81
2019-09-09,100.865
2019-09-10,101.6
2019-09-11,103.14
2019-09-12,103.21
2019-09-13,103.07
2019-09-16,102.86
2019-09-17,102.78
2019-09-18,102.71
2019-09-19,102.255
2019-09-20,102.06
2019-09-23,102.55
2019-09-24,100.97
2019-09-25,101.67
2019-09-26,101.92
2019-09-27,101.57
2019-09-30,102.155
2019-10-01,100.69
2019-10-02,98.68
2019-10-03,98.875
2019-10-04,100.42
2019-10-07,100.02
2019-10-08,98.33
2019-10-09,99.03
2019-10-10,99.74
2019-10-11,101.43
2019-10-14,100.51
2019-10-15,101.23
2019-10-16,100.89
2019-10-17,101.02
2019-10-18,101.595
2019-10-21,102.03
2019-10-22,102.5
2019-10-23,102.795
2019-10-24,102.59
2019-10-25,102.79
2019-10-28,102.87
2019-10-29,103.05
2019-10-30,102.76
2019-10-31,101.82
2019-11-01,103.22
2019-11-04,103.92
2019-11-05,103.985
2019-11-06,103.66
2019-11-07,103.86
2019-11-08,103.895
2019-11-11,103.625
2019-11-12,103.6
2019-11-13,103.54
2019-11-14,103.46
2019-11-15,103.88
2019-11-18,103.89
2019-11-19,103.21
2019-11-20,103.01
2019-11-21,102.995
2019-11-22,103.39
2019-11-25,103.705
