date,close
2014-06-13,14.27
2014-06-16,14.89
2014-06-17,15.76
2014-06-18,17.1
2014-06-19,16.83
2014-06-20,15.41
2014-06-23,15.42
2014-06-24,14.27
2014-06-25,15.15
2014-06-26,14.85
2014-06-27,14.67
2014-06-30,15.64
2014-07-01,15.73
2014-07-02,16.04
2014-07-03,15.6
2014-07-07,14.6
2014-07-08,13.44
2014-07-09,13.25
2014-07-10,13.1
2014-07-11,13.19
2014-07-14,13.26
2014-07-15,12.81
2014-07-16,12.19
2014-07-17,11.9
2014-07-18,12.07
2014-07-21,12.27
2014-07-22,12.76
2014-07-23,13.44
2014-07-24,13.3
2014-07-25,13.09
2014-07-28,13.14
2014-07-29,13.28
2014-07-30,13.49
2014-07-31,12.99
2014-08-01,13.01
2014-08-04,13.74
2014-08-05,13.47
2014-08-06,14.03
2014-08-07,13.42
2014-08-08,13.22
2014-08-11,14
2014-08-12,13.8
2014-08-13,14.01
2014-08-14,14
2014-08-15,14.01
2014-08-18,14.62
2014-08-19,13.955
2014-08-20,14.98
2014-08-21,14.52
2014-08-22,15.65
2014-08-25,16.31
2014-08-26,15.94
2014-08-27,15.24
2014-08-28,14.78
2014-08-29,14.56
2014-09-02,14.87
2014-09-03,14.26
2014-09-04,14.1
2014-09-05,14.43
2014-09-08,14.83
2014-09-09,13.46
2014-09-10,14.22
2014-09-11,13.43
2014-09-12,13.17
2014-09-15,12.61
2014-09-16,13.17
2014-09-17,13.18
2014-09-18,13.17
2014-09-19,13.14
2014-09-22,13.07
2014-09-23,13.41
2014-09-24,13.45
2014-09-25,13.09
2014-09-26,13.28
2014-09-29,13.61
2014-09-30,13.78
2014-10-01,13.34
2014-10-02,13.36
2014-10-03,13.45
2014-10-06,13.44
2014-10-07,13.53
2014-10-08,13.47
2014-10-09,12.2
2014-10-10,11.79
2014-10-13,12.02
2014-10-14,12.04
2014-10-15,12.42
2014-10-16,12.65
2014-10-17,13.27
2014-10-20,13.5
2014-10-21,13.5
2014-10-22,13.27
2014-10-23,12.5
2014-10-24,11.81
2014-10-27,10.81
2014-10-28,11.27
2014-10-29,10.73
2014-10-30,8.99
2014-10-31,10.3
2014-11-03,10.71
2014-11-04,10.99
2014-11-05,10.82
2014-11-06,10.27
2014-11-07,10.3
2014-11-10,10.87
2014-11-11,10.55
2014-11-12,11
2014-11-13,11.08
2014-11-14,11.85
2014-11-17,10.5
2014-11-18,10.225
2014-11-19,10.09
2014-11-20,10.51
2014-11-21,10.62
2014-11-24,10.65
2014-11-25,10.33
2014-11-26,10.6
2014-11-28,10.14
2014-12-01,10.21
2014-12-02,10.12
2014-12-03,10
2014-12-04,10.74
2014-12-05,10.31
2014-12-08,9.29
2014-12-09,9.49
2014-12-10,9.31
2014-12-11,9.17
2014-12-12,9.35
2014-12-15,9.05
2014-12-16,9.24
2014-12-17,9.21
2014-12-18,8.72
2014-12-19,8.47
2014-12-22,8.94
2014-12-23,9.2
2014-12-24,9.73
2014-12-26,9.37
2014-12-29,8.87
2014-12-30,8.64
2014-12-31,9.19
2015-01-02,9.32
2015-01-05,9.82
2015-01-06,9.59
2015-01-07,9.56
2015-01-08,10.11
2015-01-09,9.93
2015-01-12,9.76
2015-01-13,9.76
2015-01-14,9.9
2015-01-15,9.61
2015-01-16,10.02
2015-01-20,10.2
2015-01-21,10.18
2015-01-22,10.42
2015-01-23,10.7
2015-01-26,10.7
2015-01-27,10.42
2015-01-28,10.28
2015-01-29,10.6
2015-01-30,10.7
2015-02-02,10.82
2015-02-03,11.49
2015-02-04,11.05
2015-02-05,11.14
2015-02-06,10.61
2015-02-09,10.63
2015-02-10,10.45
2015-02-11,10.47
2015-02-12,10.49
2015-02-13,10.5
2015-02-17,10.53
2015-02-18,10.52
2015-02-19,10.43
2015-02-20,10.46
2015-02-23,10.49
2015-02-24,10.35
2015-02-25,10.21
2015-02-26,9.95
2015-02-27,9.93
2015-03-02,9.53
2015-03-03,9.09
2015-03-04,8.96
2015-03-05,9
2015-03-06,9.14
2015-03-09,8.94
2015-03-10,8.96
2015-03-11,8.83
2015-03-12,8.91
2015-03-13,8.99
2015-03-16,9.02
2015-03-17,9.01
2015-03-18,9.29
2015-03-19,8.65
2015-03-20,8.5
2015-03-23,8.91
2015-03-24,8.74
2015-03-25,8.58
2015-03-26,8.72
2015-03-27,10.3
2015-03-30,9.92
2015-03-31,11.87
2015-04-01,11.93
2015-04-02,11.76
2015-04-06,11.53
2015-04-07,11.9
2015-04-08,12.3
2015-04-09,12.47
2015-04-10,12.38
2015-04-13,12.24
2015-04-14,11.81
2015-04-15,11.17
2015-04-16,11.52
2015-04-17,11.54
2015-04-20,11.9
2015-04-21,12.32
2015-04-22,14.86
2015-04-23,14.99
2015-04-24,14.38
2015-04-27,14.48
2015-04-28,14.44
2015-04-29,15
2015-04-30,14.09
2015-05-01,14.75
2015-05-04,14.78
2015-05-05,14.24
2015-05-06,14.04
2015-05-07,13.92
2015-05-08,13.92
2015-05-11,14.78
2015-05-12,14.27
2015-05-13,14.51
2015-05-14,14.52
2015-05-15,14.69
2015-05-18,14.46
2015-05-19,15
2015-05-20,14.91
2015-05-21,14.99
2015-05-22,13.72
2015-05-26,15
2015-05-27,13.92
2015-05-28,13.67
2015-05-29,13.24
2015-06-01,13.44
2015-06-02,13.35
2015-06-03,13.49
2015-06-04,12.95
2015-06-05,13.19
2015-06-08,12.7
2015-06-09,12.43
2015-06-10,15.53
2015-06-11,14.86
2015-06-12,15.1
2015-06-15,13.9
2015-06-16,13.5
2015-06-17,13.86
2015-06-18,13.54
2015-06-19,12.99
2015-06-22,13.32
2015-06-23,13.55
2015-06-24,13.35
2015-06-25,13.16
2015-06-26,12.19
2015-06-29,12.03
2015-06-30,12.52
2015-07-01,12.02
2015-07-02,11.4
2015-07-06,10.39
2015-07-07,9.42
2015-07-08,9.11
2015-07-09,10
2015-07-10,9.92
2015-07-13,10.13
2015-07-14,10.73
2015-07-15,10.26
2015-07-16,10.18
2015-07-17,10.35
2015-07-20,10.33
2015-07-21,10.68
2015-07-22,10.42
2015-07-23,10.24
2015-07-24,10.7
2015-07-27,10.11
2015-07-28,10.03
2015-07-29,10.11
2015-07-30,9.88
2015-07-31,10.32
2015-08-03,9.64
2015-08-04,9.77
2015-08-05,9.84
2015-08-06,9.96
2015-08-07,9.66
2015-08-10,10.18
2015-08-11,9.82
2015-08-12,9.78
2015-08-13,9.78
2015-08-14,9.79
2015-08-17,10.2
2015-08-18,9.82
2015-08-19,9.59
2015-08-20,8.51
2015-08-21,5.59
2015-08-24,5.83
2015-08-25,6.2
2015-08-26,6.2
2015-08-27,6.47
2015-08-28,7.31
2015-08-31,7.13
2015-09-01,7.16
2015-09-02,7.19
2015-09-03,7.04
2015-09-04,7.25
2015-09-08,7.67
2015-09-09,7.77
2015-09-10,8.09
2015-09-11,7.65
2015-09-14,7.39
2015-09-15,7.4
2015-09-16,7.99
2015-09-17,7.54
2015-09-18,7.49
2015-09-21,7.62
2015-09-22,7.82
2015-09-23,7.63
2015-09-24,7.88
2015-09-25,7.77
2015-09-28,7.73
2015-09-29,7.63
2015-09-30,7.82
2015-10-01,7.41
2015-10-02,7.95
2015-10-05,7.62
2015-10-06,7.61
2015-10-07,7.73
2015-10-08,7.7
2015-10-09,7.58
2015-10-12,7.74
2015-10-13,7.65
2015-10-14,7.45
2015-10-15,7.55
2015-10-16,8.04
2015-10-19,7.835
2015-10-20,7.76
2015-10-21,7.37
2015-10-22,7.33
2015-10-23,7.58
2015-10-26,7.54
2015-10-27,7.36
2015-10-28,7.39
2015-10-29,7.7
2015-10-30,7.51
2015-11-02,7.82
2015-11-03,8.15
2015-11-04,8.53
2015-11-05,8.46
2015-11-06,8.68
2015-11-09,9.1
2015-11-10,8.53
2015-11-11,8.71
2015-11-12,8.74
2015-11-13,8.58
2015-11-16,8.91
2015-11-17,8.22
2015-11-18,8.4
2015-11-19,8.94
2015-11-20,8.68
2015-11-23,8.74
2015-11-24,8.76
2015-11-25,8.87
2015-11-27,8.41
2015-11-30,7.38
2015-12-01,7.34
2015-12-02,7.15
2015-12-03,6.83
2015-12-04,7
2015-12-07,6.85
2015-12-08,6.92
2015-12-09,6.92
2015-12-10,6.8
2015-12-11,6.82
2015-12-14,6.98
2015-12-15,7.11
2015-12-16,7.48
2015-12-17,7.7
2015-12-18,7.95
2015-12-21,8.25
2015-12-22,8.31
2015-12-23,8.08
2015-12-24,8.22
2015-12-28,8.03
2015-12-29,8.08
2015-12-30,8.03
2015-12-31,8.24
2016-01-04,7.74
2016-01-05,7.62
2016-01-06,7.7
2016-01-07,6.99
2016-01-08,7.24
2016-01-11,6.69
2016-01-12,6.88
2016-01-13,6.54
2016-01-14,6.55
2016-01-15,6.5
2016-01-19,6.43
2016-01-20,6
2016-01-21,7.07
2016-01-22,7.12
2016-01-25,7.13
2016-01-26,7.07
2016-01-27,7.01
2016-01-28,7.09
2016-01-29,7.31
2016-02-01,7.4
2016-02-02,7.04
2016-02-03,7
2016-02-04,7.16
2016-02-05,7.07
2016-02-08,6.97
2016-02-09,6.73
2016-02-10,7.01
2016-02-11,6.89
2016-02-12,6.9
2016-02-16,6.23
2016-02-17,6.78
2016-02-18,6.81
2016-02-19,7.01
2016-02-22,7.24
2016-02-23,7.25
2016-02-24,7.12
2016-02-25,7.08
2016-02-26,7.14
2016-02-29,7.14
2016-03-01,7.36
2016-03-02,8.18
2016-03-03,8.68
2016-03-04,8.7
2016-03-07,8.61
2016-03-08,8.42
2016-03-09,8.31
2016-03-10,8.1
2016-03-11,8.5
2016-03-14,9.52
2016-03-15,9.23
2016-03-16,9.35
2016-03-17,9.54
2016-03-18,9.54
2016-03-21,9.98
2016-03-22,9.47
2016-03-23,8.9
2016-03-24,8.93
2016-03-28,8.14
2016-03-29,7.91
2016-03-30,7.56
2016-03-31,7.89
2016-04-01,8.28
2016-04-04,7.89
2016-04-05,8
2016-04-06,9.3
2016-04-07,9
2016-04-08,9.02
2016-04-11,9
2016-04-12,9.2
2016-04-13,9
2016-04-14,8.94
2016-04-15,9.01
2016-04-18,8.86
2016-04-19,8.95
2016-04-20,8.91
2016-04-21,8.79
2016-04-22,8.47
2016-04-25,8.27
2016-04-26,8.23
2016-04-27,8.34
2016-04-28,8.31
2016-04-29,8.27
2016-05-02,8.48
2016-05-03,8.2
2016-05-04,8.34
2016-05-05,8.96
2016-05-06,9.13
2016-05-09,8.98
2016-05-10,8.78
2016-05-11,8.66
2016-05-12,8.21
2016-05-13,8.09
2016-05-16,8.42
2016-05-17,8.73
2016-05-18,8.77
2016-05-19,8.54
2016-05-20,8.34
2016-05-23,8.2
2016-05-24,7.8
2016-05-25,7
2016-05-26,7.14
2016-05-27,7.24
2016-05-31,7.25
2016-06-01,7.2
2016-06-02,7.11
2016-06-03,7.12
2016-06-06,7.2
2016-06-07,7.3
2016-06-08,7.26
2016-06-09,7.01
2016-06-10,6.63
2016-06-13,6.79
2016-06-14,6.71
2016-06-15,7.09
2016-06-16,6.8
2016-06-17,6.75
2016-06-20,6.86
2016-06-21,6.65
2016-06-22,6.73
2016-06-23,6.95
2016-06-24,6.84
2016-06-27,6.37
2016-06-28,6.43
2016-06-29,6.46
2016-06-30,6.48
2016-07-01,6.51
2016-07-05,6.3
2016-07-06,6.72
2016-07-07,6.59
2016-07-08,6.62
2016-07-11,6.8
2016-07-12,6.75
2016-07-13,6.81
2016-07-14,6.8
2016-07-15,6.88
2016-07-18,6.71
2016-07-19,6.7
2016-07-20,6.77
2016-07-21,6.7
2016-07-22,6.58
2016-07-25,6.28
2016-07-26,6.18
2016-07-27,6.15
2016-07-28,6.07
2016-07-29,5.98
2016-08-01,5.98
2016-08-02,5.91
2016-08-03,6.04
2016-08-04,5.98
2016-08-05,5.99
2016-08-08,5.97
2016-08-09,5.99
2016-08-10,5.92
2016-08-11,5.9
2016-08-12,6.045
2016-08-15,5.97
2016-08-16,5.72
2016-08-17,5.32
2016-08-18,5.42
2016-08-19,5.62
2016-08-22,5.81
2016-08-23,5.72
2016-08-24,5.44
2016-08-25,5.58
2016-08-26,5.58
2016-08-29,5.68
2016-08-30,5.51
2016-08-31,5.61
2016-09-01,5.38
2016-09-02,5.38
2016-09-06,5.51
2016-09-07,5.6
2016-09-08,5.59
2016-09-09,5.35
2016-09-12,5.28
2016-09-13,5.29
2016-09-14,5.24
2016-09-15,5.17
2016-09-16,5.08
2016-09-19,5.05
2016-09-20,5.22
2016-09-21,5.15
2016-09-22,5.09
2016-09-23,5.05
2016-09-26,5.05
2016-09-27,5.05
2016-09-28,4.73
2016-09-29,4.07
2016-09-30,3.85
2016-10-03,4.21
2016-10-04,4.08
2016-10-05,4.1
2016-10-06,3.98
2016-10-07,3.78
2016-10-10,3.89
2016-10-11,3.9
2016-10-12,4.1
2016-10-13,3.89
2016-10-14,3.77
2016-10-17,3.77
2016-10-18,3.73
2016-10-19,3.88
2016-10-20,3.79
2016-10-21,3.91
2016-10-24,3.75
2016-10-25,3.87
2016-10-26,3.71
2016-10-27,3.51
2016-10-28,3.545
2016-10-31,3.36
2016-11-01,3.41
2016-11-02,3.24
2016-11-03,2.83
2016-11-04,2.91
2016-11-07,2.92
2016-11-08,2.93
2016-11-09,3
2016-11-10,2.91
2016-11-11,2.79
2016-11-14,2.74
2016-11-15,2.8
2016-11-16,3.02
2016-11-17,3.03
2016-11-18,3.16
2016-11-21,3.13
2016-11-22,3.1
2016-11-23,3.12
2016-11-25,3.22
2016-11-28,3.25
2016-11-29,3.23
2016-11-30,3.31
2016-12-01,3.07
2016-12-02,3.05
2016-12-05,2.94
2016-12-06,3.0676
2016-12-07,3.15
2016-12-08,3.14
2016-12-09,3.12
2016-12-12,2.99
2016-12-13,2.8
2016-12-14,2.89
2016-12-15,2.76
2016-12-16,2.82
2016-12-19,2.69
2016-12-20,2.7
2016-12-21,2.72
2016-12-22,2.55
2016-12-23,2.45
2016-12-27,2.59
2016-12-28,2.55
2016-12-29,2.49
2016-12-30,2.56
2017-01-03,2.6
2017-01-04,2.69
2017-01-05,2.72
2017-01-06,2.75
2017-01-09,2.67
2017-01-10,2.67
2017-01-11,2.68
2017-01-12,2.52
2017-01-13,2.63
2017-01-17,2.58
2017-01-18,2.66
2017-01-19,2.64
2017-01-20,2.69
2017-01-23,2.57
2017-01-24,2.44
2017-01-25,2.53
2017-01-26,2.54
2017-01-27,2.58
2017-01-30,2.69
2017-01-31,2.57
2017-02-01,2.61
2017-02-02,2.68
2017-02-03,2.55
2017-02-06,2.5
2017-02-07,2.44
2017-02-08,2.38
2017-02-09,2.31
2017-02-10,2.38
2017-02-13,2.45
2017-02-14,2.43
2017-02-15,2.39
2017-02-16,2.38
2017-02-17,2.42
2017-02-21,2.35
2017-02-22,2.25
2017-02-23,2.21
2017-02-24,2.18
2017-02-27,2.1
2017-02-28,2.16
2017-03-01,1.98
2017-03-02,2.08
2017-03-03,2
2017-03-06,2.25
2017-03-07,2.12
2017-03-08,2.1
2017-03-09,2.07
2017-03-10,2.1079
2017-03-13,2.01
2017-03-14,1.87
2017-03-15,1.69
2017-03-16,1.7
2017-03-17,1.64
2017-03-20,1.7364
2017-03-21,1.7
2017-03-22,1.7
2017-03-23,1.67
2017-03-24,1.76
2017-03-27,1.64
2017-03-28,1.56
2017-03-29,1.51
2017-03-30,1.4812
2017-03-31,1.56
2017-04-03,1.5842
2017-04-04,1.55
2017-04-05,1.5
2017-04-06,1.5
2017-04-07,1.49
2017-04-10,1.49
2017-04-11,1.5
2017-04-12,1.54
2017-04-13,1.47
2017-04-17,1.45
2017-04-18,1.44
2017-04-19,1.32
2017-04-20,1.19
2017-04-21,1.18
2017-04-24,1.185
2017-04-25,1.16
2017-04-26,1.1098
2017-04-27,1.11
2017-04-28,1.14
2017-05-01,1.14
2017-05-02,1.12
2017-05-03,1.12
2017-05-04,1.09
2017-05-05,1.08
2017-05-08,1.1
2017-05-09,1.06
2017-05-10,0.9563
2017-05-11,0.97
2017-05-12,0.996
2017-05-15,1.09
2017-05-16,1.13
2017-05-17,1.07
2017-05-18,1.02
2017-05-19,1.1
2017-05-22,1.0501
2017-05-23,0.9784
2017-05-24,0.9502
2017-05-25,0.9969
2017-05-26,0.9609
2017-05-30,0.95
2017-05-31,0.9396
2017-06-01,1.3383
2017-06-02,1.69
2017-06-05,1.38
2017-06-06,1.4
2017-06-07,1.43
2017-06-08,1.4
2017-06-09,1.31
2017-06-12,1.25
2017-06-13,1.32
2017-06-14,1.3
2017-06-15,1.27
2017-06-16,1.36
2017-06-19,1.33
2017-06-20,1.27
2017-06-21,1.19
2017-06-22,1.24
2017-06-23,1.19
2017-06-26,1.21
2017-06-27,1.19
2017-06-28,1.13
2017-06-29,1.19
2017-06-30,1.16
2017-07-03,1.13
2017-07-05,1.1
2017-07-06,1.02
2017-07-07,0.98
2017-07-10,0.97
2017-07-11,1
2017-07-12,0.99
2017-07-13,0.94
2017-07-14,0.97
2017-07-17,0.95
2017-07-18,0.96
2017-07-19,0.92
2017-07-20,0.9201
2017-07-21,0.9201
2017-07-24,0.95
2017-07-25,0.93
2017-07-26,0.876
2017-07-27,0.875
2017-07-28,0.8401
2017-07-31,0.81
2017-08-01,0.81
2017-08-02,0.8
2017-08-03,0.7801
2017-08-04,0.762
2017-08-07,0.7988
2017-08-08,0.79
2017-08-09,0.7635
2017-08-10,0.7673
2017-08-11,0.758
2017-08-14,0.7501
2017-08-15,0.77
2017-08-16,0.81
2017-08-17,0.85
2017-08-18,0.83
2017-08-21,0.91
2017-08-22,0.84
2017-08-23,0.8299
2017-08-24,0.8001
2017-08-25,0.819
2017-08-28,0.79
2017-08-29,0.814
2017-08-30,0.82
2017-08-31,0.8299
2017-09-01,0.81
2017-09-05,0.8006
2017-09-06,0.7901
2017-09-07,0.8
2017-09-08,0.8
2017-09-11,0.8
2017-09-12,0.8104
2017-09-13,0.8
2017-09-14,0.8001
2017-09-15,0.79
2017-09-18,0.8
2017-09-19,0.7955
2017-09-20,0.8
2017-09-21,0.8
2017-09-22,0.8101
2017-09-25,0.81
2017-09-26,0.81
2017-09-27,0.9106
2017-09-28,0.86
2017-09-29,0.85
2017-10-02,0.86
2017-10-03,0.8529
2017-10-04,0.85
2017-10-05,0.845
2017-10-06,1.0099
2017-10-09,1.2
2017-10-10,1.15
2017-10-11,1.12
2017-10-12,1.06
2017-10-13,1.09
2017-10-16,1.09
2017-10-17,1.13
2017-10-18,1.28
2017-10-19,1.21
2017-10-20,1.23
2017-10-23,1.15
2017-10-24,1.12
2017-10-25,1.17
2017-10-26,1.13
2017-10-27,1.09
2017-10-30,1.08
2017-10-31,1.07
2017-11-01,1.09
2017-11-02,1.07
2017-11-03,1.08
2017-11-06,1.02
2017-11-07,1.03
2017-11-08,1.03
2017-11-09,1.08
2017-11-10,1.08
2017-11-13,1.26
2017-11-14,1.21
2017-11-15,1.02
2017-11-16,1.06
2017-11-17,1.0972
2017-11-20,1.1
2017-11-21,1.03
2017-11-22,1.06
2017-11-24,1.03
2017-11-27,1.02
2017-11-28,0.96
2017-11-29,1.03
2017-11-30,0.9893
2017-12-01,0.9701
2017-12-04,0.95
2017-12-05,0.95
2017-12-06,0.95
2017-12-07,0.93
2017-12-08,0.9651
2017-12-11,1.01
2017-12-12,1.03
2017-12-13,1.06
2017-12-14,1.04
2017-12-15,1.02
2017-12-18,1.0321
2017-12-19,3.05
2017-12-20,1.94
2017-12-21,2.14
2017-12-22,1.78
2017-12-26,1.68
2017-12-27,1.69
2017-12-28,1.66
2017-12-29,1.69
2018-01-02,2.1
2018-01-03,1.85
2018-01-04,2.39
2018-01-05,2.72
2018-01-08,2.61
2018-01-09,2.52
2018-01-10,2.72
2018-01-11,2.89
2018-01-12,2.7
2018-01-16,2.32
2018-01-17,2.29
2018-01-18,2.45
2018-01-19,2.47
2018-01-22,2.31
2018-01-23,2.32
2018-01-24,2.25
2018-01-25,2.16
2018-01-26,2.02
2018-01-29,1.92
2018-01-30,1.85
2018-01-31,1.69
2018-02-01,1.61
2018-02-02,1.42
2018-02-05,1.37
2018-02-06,1.36
2018-02-07,1.34
2018-02-08,1.25
2018-02-09,1.24
2018-02-12,1.29
2018-02-13,1.28
2018-02-14,1.63
2018-02-15,1.56
2018-02-16,1.42
2018-02-20,1.4201
2018-02-21,1.41
2018-02-22,1.38
2018-02-23,1.41
2018-02-26,1.47
2018-02-27,1.39
2018-02-28,1.33
2018-03-01,1.28
2018-03-02,1.3
2018-03-05,1.3
2018-03-06,1.3
2018-03-07,1.28
2018-03-08,1.27
2018-03-09,1.32
2018-03-12,1.34
2018-03-13,1.2896
2018-03-14,1.29
2018-03-15,1.4
2018-03-16,1.35
2018-03-19,1.2893
2018-03-20,1.28
2018-03-21,1.44
2018-03-22,1.45
2018-03-23,1.27
2018-03-26,1.26
2018-03-27,1.23
2018-03-28,1.1
2018-03-29,1.07
2018-04-02,1.06
2018-04-03,1.02
2018-04-04,1.09
2018-04-05,1.1
2018-04-06,1.1
2018-04-09,1.12
2018-04-10,1.21
2018-04-11,1.27
2018-04-12,1.39
2018-04-13,1.2413
2018-04-16,1.24
2018-04-17,1.26
2018-04-18,1.29
2018-04-19,1.27
2018-04-20,1.28
2018-04-23,1.22
2018-04-24,1.22
2018-04-25,1.18
2018-04-26,1.21
2018-04-27,1.26
2018-04-30,1.25
2018-05-01,1.3
2018-05-02,1.28
2018-05-03,1.29
2018-05-04,1.3
2018-05-07,1.22
2018-05-08,1.26
2018-05-09,1.29
2018-05-10,1.28
2018-05-11,1.27
2018-05-14,1.3
2018-05-15,1.24
2018-05-16,1.24
2018-05-17,1.24
2018-05-18,1.23
2018-05-21,1.25
2018-05-22,1.2699
2018-05-23,1.28
2018-05-24,1.4096
2018-05-25,1.3134
2018-05-29,1.3
2018-05-30,1.37
2018-05-31,1.35
2018-06-01,1.35
2018-06-04,1.37
2018-06-05,1.39
2018-06-06,1.39
2018-06-07,1.29
2018-06-08,1.29
2018-06-11,1.3
2018-06-12,1.26
2018-06-13,1.19
2018-06-14,1.2
2018-06-15,1.18
2018-06-18,1.19
2018-06-19,1.15
2018-06-20,1.16
2018-06-21,1.15
2018-06-22,1.13
2018-06-25,1.1312
2018-06-26,1.14
2018-06-27,1.13
2018-06-28,1.09
2018-06-29,1.1
2018-07-02,1.09
2018-07-03,1.07
2018-07-05,1.15
2018-07-06,1.1901
2018-07-09,1.15
2018-07-10,1.1597
2018-07-11,1.2274
2018-07-12,1.32
2018-07-13,1.43
2018-07-16,1.43
2018-07-17,1.42
2018-07-18,1.3392
2018-07-19,1.359
2018-07-20,1.36
2018-07-23,1.28
2018-07-24,1.3401
2018-07-25,1.3
2018-07-26,1.31
2018-07-27,1.3242
2018-07-30,1.25
2018-07-31,1.25
2018-08-01,1.25
2018-08-02,1.2
2018-08-03,1.146
2018-08-06,1.13
2018-08-07,1.12
2018-08-08,1.13
2018-08-09,1.15
2018-08-10,1.1777
2018-08-13,1.17
2018-08-14,1.2
2018-08-15,1.13
2018-08-16,1.14
2018-08-17,1.167
2018-08-20,1.21
2018-08-21,1.23
2018-08-22,1.21
2018-08-23,1.17
2018-08-24,1.17
2018-08-27,1.19
2018-08-28,1.21
2018-08-29,1.17
2018-08-30,1.12
2018-08-31,1.14
2018-09-04,1.13
2018-09-05,1.1125
2018-09-06,1.1156
2018-09-07,1.1
2018-09-10,1.1
2018-09-11,1.1
2018-09-12,1.09
2018-09-13,1.1
2018-09-14,1.06
2018-09-17,1.06
2018-09-18,1.06
2018-09-19,1.06
2018-09-20,1.1
2018-09-21,1.11
2018-09-24,1.17
2018-09-25,1.08
2018-09-26,1.1
2018-09-27,1.11
2018-09-28,1.11
2018-10-01,1.08
2018-10-02,1.03
2018-10-03,1.03
2018-10-04,1.1051
2018-10-05,1.0865
2018-10-08,1.09
2018-10-09,1.03
2018-10-10,1.0249
2018-10-11,1.02
2018-10-12,1.02
2018-10-15,1.0399
2018-10-16,1.04
2018-10-17,1.0996
2018-10-18,1.22
2018-10-19,1.22
2018-10-22,1.23
2018-10-23,1.23
2018-10-24,1.2
2018-10-25,1.19
2018-10-26,1.1
2018-10-29,1.0601
2018-10-30,1.14
2018-10-31,1.0876
2018-11-01,1.12
2018-11-02,1.143
2018-11-05,1.1586
2018-11-06,1.16
2018-11-07,1.16
2018-11-08,1.2
2018-11-09,1.21
2018-11-12,1.2066
2018-11-13,1.24
2018-11-14,1.23
2018-11-15,1.27
2018-11-16,1.26
2018-11-19,1.28
2018-11-20,1.33
2018-11-21,1.41
2018-11-23,1.4818
2018-11-26,1.51
2018-11-27,1.48
2018-11-28,1.45
2018-11-29,1.5
2018-11-30,1.48
2018-12-03,1.48
2018-12-04,1.31
2018-12-06,1.34
2018-12-07,1.3348
2018-12-10,1.29
2018-12-11,1.32
2018-12-12,1.323
2018-12-13,1.28
2018-12-14,1.26
2018-12-17,1.2332
2018-12-18,1.2632
2018-12-19,1.6399
2018-12-20,1.23
2018-12-21,1.15
2018-12-24,1.0242
2018-12-26,1.05
2018-12-27,1.07
2018-12-28,1.06
2018-12-31,1.1273
2019-01-02,1.09
2019-01-03,1.03
2019-01-04,1.08
2019-01-07,1.13
2019-01-08,1.15
2019-01-09,1.15
2019-01-10,1.17
2019-01-11,1.15
2019-01-14,1.1698
2019-01-15,1.19
2019-01-16,1.15
2019-01-17,1.18
2019-01-18,1.14
2019-01-22,1.09
2019-01-23,1.1167
2019-01-24,1.1527
2019-01-25,1.14
2019-01-28,1.1306
2019-01-29,1.14
2019-01-30,1.13
2019-01-31,1.18
2019-02-01,1.16
2019-02-04,1.17
2019-02-05,1.1799
2019-02-06,1.2
2019-02-07,1.12
2019-02-08,1.15
2019-02-11,1.14
2019-02-12,1.11
2019-02-13,1.1
2019-02-14,1.13
2019-02-15,1.1168
2019-02-19,1.1367
2019-02-20,1.1116
2019-02-21,1.12
2019-02-22,1.16
2019-02-25,1.21
2019-02-26,1.13
2019-02-27,1.18
2019-02-28,1.1866
2019-03-01,1.2111
2019-03-04,1.2241
2019-03-05,1.36
2019-03-06,1.3
2019-03-07,1.23
2019-03-08,1.17
2019-03-11,1.31
2019-03-12,1.3
2019-03-13,1.29
2019-03-14,1.24
2019-03-15,1.2088
2019-03-18,1.18
2019-03-19,1.19
2019-03-20,1.17
2019-03-21,1.19
2019-03-22,1.19
2019-03-25,1.2
2019-03-26,1.2
2019-03-27,1.1741
2019-03-28,1.195
2019-03-29,1.25
2019-04-01,1.26
2019-04-02,1.25
2019-04-03,1.25
2019-04-04,1.28
2019-04-05,1.285
2019-04-08,1.33
2019-04-09,1.311
2019-04-10,1.382
2019-04-11,1.38
2019-04-12,1.31
2019-04-15,1.3215
2019-04-16,1.31
2019-04-17,1.3
2019-04-18,1.29
2019-04-22,1.23
2019-04-23,1.25
2019-04-24,1.255
2019-04-25,1.23
2019-04-26,1.21
2019-04-29,1.22
2019-04-30,1.26
2019-05-01,1.2201
2019-05-02,1.23
2019-05-03,1.22
2019-05-06,1.18
2019-05-07,1.15
2019-05-08,1.14
2019-05-09,1.14
2019-05-10,1.12
2019-05-13,1.11
2019-05-14,1.11
2019-05-15,1.1101
2019-05-16,1.1
2019-05-17,0.8839
