date,close
2014-06-13,419.6749
2014-06-16,418.8886
2014-06-17,416.8445
2014-06-18,409.7687
2014-06-19,408.5108
2014-06-20,406.3094
2014-06-23,407.4101
2014-06-24,415.2721
2014-06-25,412.1273
2014-06-26,413.6997
2014-06-27,413.0708
2014-06-30,415.2721
2014-07-01,405.366
2014-07-02,403.7936
2014-07-03,397.1895
2014-07-07,400.4915
2014-07-08,407.8818
2014-07-09,402.3784
2014-07-10,406.4667
2014-07-11,405.2087
2014-07-14,397.1895
2014-07-15,396.875
2014-07-16,391.5288
2014-07-17,393.4157
2014-07-18,393.4157
2014-07-21,396.246
2014-07-22,392.1578
2014-07-23,393.7302
2014-07-24,394.3591
2014-07-25,403.0074
2014-07-28,401.2777
2014-07-29,405.7591
2014-07-30,408.1963
2014-07-31,430.9962
2014-08-01,436.4996
2014-08-04,430.526
2014-08-05,441.5313
2014-08-06,439.4604
2014-08-07,445.4623
2014-08-08,430.5244
2014-08-11,428.4803
2014-08-12,421.4029
2014-08-13,421.4029
2014-08-14,416.6889
2014-08-15,419.9893
2014-08-18,407.0956
2014-08-19,400.6488
2014-08-20,396.0888
2014-08-21,391.8433
2014-08-22,393.8874
2014-08-25,388.8557
2014-08-26,386.6543
2014-08-27,386.0254
2014-08-28,387.9123
2014-08-29,386.8116
2014-09-02,388.8557
2014-09-03,387.9123
2014-09-04,388.384
2014-09-05,384.453
2014-09-08,385.5537
2014-09-09,391.6861
2014-09-10,388.2268
2014-09-11,389.3274
2014-09-12,393.4157
2014-09-15,390.2709
2014-09-16,383.5095
2014-09-17,381.4921
2014-09-18,374.5468
2014-09-19,373.2889
2014-09-22,379.893
2014-09-23,387.2833
2014-09-24,377.3772
2014-09-25,394.0446
2014-09-26,383.824
2014-09-29,385.8681
2014-09-30,387.5978
2014-10-01,403.6363
2014-10-02,404.108
2014-10-03,389.013
2014-10-06,389.9564
2014-10-07,408.668
2014-10-08,388.6985
2014-10-09,411.1839
2014-10-10,419.5176
2014-10-13,436.8141
2014-10-14,435.8706
2014-10-15,450.6512
2014-10-16,454.2678
2014-10-17,431.1534
2014-10-20,428.7948
2014-10-21,412.1273
2014-10-22,422.8197
2014-10-23,406.7811
2014-10-24,397.8184
2014-10-27,396.5605
2014-10-28,383.824
2014-10-29,385.2392
2014-10-30,339.7967
2014-10-31,358.8228
2014-11-03,359.2945
2014-11-04,358.1938
2014-11-05,351.747
2014-11-06,347.187
2014-11-07,345.3268
2014-11-10,343.5705
2014-11-11,343.0987
2014-11-12,342.7843
2014-11-13,339.7967
2014-11-14,340.5829
2014-11-17,339.9539
2014-11-18,337.2808
2014-11-19,336.8091
2014-11-20,335.394
2014-11-21,330.3623
2014-11-24,329.4188
2014-11-25,329.1043
2014-11-26,328.4754
2014-11-28,327.8464
2014-12-01,330.6767
2014-12-02,325.4862
2014-12-03,323.2864
2014-12-04,324.2299
2014-12-05,320.7706
2014-12-08,325.3306
2014-12-09,328.9471
2014-12-10,343.5705
2014-12-11,339.1677
2014-12-12,355.9925
2014-12-15,364.3262
2014-12-16,370.6158
2014-12-17,352.3759
2014-12-18,326.274
2014-12-19,325.4878
2014-12-22,315.5817
2014-12-23,312.9086
2014-12-24,312.5941
2014-12-26,311.6506
2014-12-29,312.2796
2014-12-30,315.1099
2014-12-31,323.2864
2015-01-02,323.4437
2015-01-05,340.2684
2015-01-06,348.6022
2015-01-07,335.5512
2015-01-08,317.3113
2015-01-09,325.1733
2015-01-12,330.834
2015-01-13,332.4064
2015-01-14,342.9415
2015-01-15,349.0739
2015-01-16,338.5388
2015-01-20,337.1236
2015-01-21,334.4505
2015-01-22,319.9844
2015-01-23,327.3747
2015-01-26,327.2174
2015-01-27,343.4132
2015-01-28,355.049
2015-01-29,341.0546
2015-01-30,355.049
2015-02-02,344.3567
2015-02-03,327.2174
2015-02-04,325.0161
2015-02-05,315.2672
2015-02-06,316.5251
2015-02-09,321.2423
2015-02-10,313.775
2015-02-11,312.9086
2015-02-12,306.7762
2015-02-13,304.2603
2015-02-17,303.1597
2015-02-18,303.4741
2015-02-19,305.361
2015-02-20,297.8135
2015-02-23,298.7569
2015-02-24,293.8825
2015-02-25,293.4107
2015-02-26,293.2535
2015-02-27,297.499
2015-03-02,290.1087
2015-03-03,293.7252
2015-03-04,298.8167
2015-03-05,297.1845
2015-03-06,310.55
2015-03-09,303.4741
2015-03-10,319.0409
2015-03-11,320.6133
2015-03-12,306.6189
2015-03-13,313.852
2015-03-16,302.059
2015-03-17,308.3486
2015-03-18,297.0273
2015-03-19,302.059
2015-03-20,293.568
2015-03-23,294.3542
2015-03-24,299.3859
2015-03-25,314.3237
2015-03-26,316.3679
2015-03-27,314.481
2015-03-30,300.6438
2015-03-31,309.921
2015-04-01,314.3237
2015-04-02,311.0217
2015-04-06,304.7321
2015-04-07,305.0465
2015-04-08,303.6298
2015-04-09,300.4866
2015-04-10,295.6121
2015-04-13,299.2286
2015-04-14,296.3983
2015-04-15,292.939
2015-04-16,292.7818
2015-04-17,306.4617
2015-04-20,295.848
2015-04-21,299.8576
2015-04-22,295.6907
2015-04-23,294.0397
2015-04-24,293.0963
2015-04-27,294.9832
2015-04-28,291.6811
2015-04-29,295.1404
2015-04-30,304.5748
2015-05-01,296.0838
2015-05-04,293.2535
2015-05-05,300.0164
2015-05-06,303.1597
2015-05-07,299.0714
2015-05-08,286.0204
2015-05-11,289.637
2015-05-12,291.0521
2015-05-13,291.3666
2015-05-14,282.4039
2015-05-15,281.146
2015-05-18,279.5736
2015-05-19,279.1019
2015-05-20,279.7308
2015-05-21,279.4163
2015-05-22,281.4605
2015-05-26,290.2675
2015-05-27,285.077
2015-05-28,285.706
2015-05-29,291.2094
2015-06-01,289.9514
2015-06-02,291.6811
2015-06-03,288.2218
2015-06-04,295.7694
2015-06-05,298.9142
2015-06-08,302.8452
2015-06-09,303.3169
2015-06-10,291.0521
2015-06-11,288.6935
2015-06-12,295.1404
2015-06-15,300.6438
2015-06-16,295.2976
2015-06-17,293.4107
2015-06-18,284.9198
2015-06-19,288.8508
2015-06-22,284.6053
2015-06-23,283.3474
2015-06-24,289.1653
2015-06-25,295.1404
2015-06-26,292.3101
2015-06-29,308.9775
2015-06-30,308.6631
2015-07-01,300.4866
2015-07-02,302.059
2015-07-06,303.7886
2015-07-07,299.0714
2015-07-08,312.4368
2015-07-09,310.55
2015-07-10,299.5431
2015-07-13,288.379
2015-07-14,285.2342
2015-07-15,284.9198
2015-07-16,281.4605
2015-07-17,282.5612
2015-07-20,282.4039
2015-07-21,289.9514
2015-07-22,294.0397
2015-07-23,298.4424
2015-07-24,308.0341
2015-07-27,314.0092
2015-07-28,304.4176
2015-07-29,298.2852
2015-07-30,298.2852
2015-07-31,301.1155
2015-08-03,305.99
2015-08-04,308.6631
2015-08-05,308.3486
2015-08-06,314.0092
2015-08-07,316.0534
2015-08-10,302.8452
2015-08-11,313.852
2015-08-12,313.223
2015-08-13,312.9086
2015-08-14,309.7638
2015-08-17,305.6755
2015-08-18,306.4617
2015-08-19,315.4244
2015-08-20,334.765
2015-08-21,365.4269
2015-08-24,404.5798
2015-08-25,420.3038
2015-08-26,371.0875
2015-08-27,346.7153
2015-08-28,346.0863
2015-08-31,353.1621
2015-09-01,381.3082
2015-09-02,362.1248
2015-09-03,361.3386
2015-09-04,378.4779
2015-09-08,350.3318
2015-09-09,365.1124
2015-09-10,360.3952
2015-09-11,352.2187
2015-09-14,357.4155
2015-09-15,342.4698
2015-09-16,332.8781
2015-09-17,337.5953
2015-09-18,354.4201
2015-09-21,346.4008
2015-09-22,358.5083
2015-09-23,360.5524
2015-09-24,365.8986
2015-09-25,358.98
2015-09-28,379.893
2015-09-29,377.0627
2015-09-30,359.9235
2015-10-01,360.8669
2015-10-02,347.0298
2015-10-05,327.3747
2015-10-06,327.2174
2015-10-07,320.2989
2015-10-08,311.8079
2015-10-09,309.921
2015-10-12,307.4052
2015-10-13,310.7072
2015-10-14,318.0975
2015-10-15,305.99
2015-10-16,302.2162
2015-10-19,301.5872
2015-10-20,301.7445
2015-10-21,304.2603
2015-10-22,287.2784
2015-10-23,278.9446
2015-10-26,280.3598
2015-10-27,282.4039
2015-10-28,272.9695
2015-10-29,274.0702
2015-10-30,278.1584
2015-11-02,270.2964
2015-11-03,266.3654
2015-11-04,268.095
2015-11-05,268.095
2015-11-06,266.0509
2015-11-09,272.9695
2015-11-10,271.5543
2015-11-11,274.0702
2015-11-12,286.3349
2015-11-13,295.7694
2015-11-16,283.9763
2015-11-17,283.3474
2015-11-18,271.0826
2015-11-19,271.0826
2015-11-20,266.8371
2015-11-23,267.7805
2015-11-24,267.1516
2015-11-25,266.9943
2015-11-27,267.1516
2015-11-30,270.1391
2015-12-01,262.9061
2015-12-02,269.3529
2015-12-03,280.9887
2015-12-04,263.0633
2015-12-07,267.9378
2015-12-08,274.8564
2015-12-09,278.7874
2015-12-10,274.8564
2015-12-11,289.1653
2015-12-14,283.0329
2015-12-15,275.7998
2015-12-16,265.5792
2015-12-17,276.9005
2015-12-18,294.6687
2015-12-21,288.0646
2015-12-22,279.8881
2015-12-23,271.0826
2015-12-24,273.5984
2015-12-28,273.9129
2015-12-29,265.7364
2015-12-30,270.4536
2015-12-31,278.7874
2016-01-04,291.5239
2016-01-05,291.5239
2016-01-06,303.4741
2016-01-07,324.8588
2016-01-08,335.2367
2016-01-11,332.2491
2016-01-12,324.5444
2016-01-13,346.0863
2016-01-14,332.0919
2016-01-15,354.8918
2016-01-19,353.0049
2016-01-20,368.8862
2016-01-21,360.8669
2016-01-22,347.0298
2016-01-25,360.0807
2016-01-26,341.0546
2016-01-27,354.8918
2016-01-28,346.2435
2016-01-29,322.6575
2016-02-01,322.6575
2016-02-02,339.1677
2016-02-03,328.0036
2016-02-04,322.6575
2016-02-05,335.0795
2016-02-08,345.3001
2016-02-09,345.7718
2016-02-10,351.9042
2016-02-11,369.0434
2016-02-12,346.4008
2016-02-16,332.0919
2016-02-17,315.2672
2016-02-18,317.783
2016-02-19,318.5692
2016-02-22,305.0465
2016-02-23,315.5817
2016-02-24,312.7513
2016-02-25,300.3293
2016-02-26,303.3169
2016-02-29,309.4493
2016-03-01,290.4232
2016-03-02,288.8508
2016-03-03,285.8632
2016-03-04,283.0329
2016-03-07,279.4163
2016-03-08,284.1336
2016-03-09,282.5612
2016-03-10,282.0894
2016-03-11,271.2398
2016-03-14,270.6109
2016-03-15,269.6659
2016-03-16,265.8937
2016-03-17,258.9751
2016-03-18,253.4717
2016-03-21,252.8427
2016-03-22,254.1163
2016-03-23,257.5599
2016-03-24,257.0882
2016-03-28,256.1447
2016-03-29,251.8993
2016-03-30,248.44
2016-03-31,250.0124
2016-04-01,245.1379
2016-04-04,247.4965
2016-04-05,253.1572
2016-04-06,247.811
2016-04-07,254.8868
2016-04-08,253.9434
2016-04-11,254.5723
2016-04-12,247.6538
2016-04-13,239.7917
2016-04-14,239.0055
2016-04-15,239.949
2016-04-18,235.5462
2016-04-19,233.8166
2016-04-20,231.9297
2016-04-21,235.7035
2016-04-22,235.0745
2016-04-25,236.3325
2016-04-26,235.8607
2016-04-27,233.6594
2016-04-28,241.9931
2016-04-29,244.3517
2016-05-02,239.32
2016-05-03,245.1379
2016-05-04,248.9117
2016-05-05,248.6554
2016-05-06,244.8234
2016-05-09,246.2386
2016-05-10,236.8042
2016-05-11,244.509
2016-05-12,244.3517
2016-05-13,252.2137
2016-05-16,244.3517
2016-05-17,251.4275
2016-05-18,250.9558
2016-05-19,255.3586
2016-05-20,251.8993
2016-05-23,252.2137
2016-05-24,243.4083
2016-05-25,237.4331
2016-05-26,238.2193
2016-05-27,236.1752
2016-05-31,239.6345
2016-06-01,239.32
2016-06-02,237.2759
2016-06-03,238.0621
2016-06-06,233.5021
2016-06-07,233.0304
2016-06-08,230.5146
2016-06-09,231.3008
2016-06-10,235.7035
2016-06-13,240.5779
2016-06-14,242.7793
2016-06-15,243.7228
2016-06-16,240.4207
2016-06-17,242.7793
2016-06-20,236.9614
2016-06-21,236.3325
2016-06-22,238.5338
2016-06-23,229.0994
2016-06-24,252.371
2016-06-27,263.3778
2016-06-28,251.1131
2016-06-29,238.8483
2016-06-30,229.7283
2016-07-01,228.3132
2016-07-05,232.8732
2016-07-06,229.2566
2016-07-07,230.3573
2016-07-08,220.4512
2016-07-11,217.6208
2016-07-12,213.0609
2016-07-13,212.4319
2016-07-14,207.5574
2016-07-15,207.4002
2016-07-18,206.614
2016-07-19,205.6706
2016-07-20,204.5699
2016-07-21,206.9285
2016-07-22,205.3561
2016-07-25,207.8719
2016-07-26,208.5009
2016-07-27,208.1864
2016-07-28,208.9726
2016-07-29,209.7588
2016-08-01,210.7023
2016-08-02,214.0043
2016-08-03,212.5105
2016-08-04,212.2747
2016-08-05,205.985
2016-08-08,205.7492
2016-08-09,205.6706
2016-08-10,206.4568
2016-08-11,202.3685
2016-08-12,203.6264
2016-08-15,201.5823
2016-08-16,204.2554
2016-08-17,203.1547
2016-08-18,202.054
2016-08-19,203.4692
2016-08-22,204.2554
2016-08-23,203.6264
2016-08-24,205.6155
2016-08-25,206.7712
2016-08-26,208.6581
2016-08-29,204.8843
2016-08-30,205.985
2016-08-31,208.1864
2016-09-01,207.243
2016-09-02,205.3561
2016-09-06,203.1547
2016-09-07,203.3119
2016-09-08,204.8843
2016-09-09,217.6208
2016-09-12,209.2871
2016-09-13,217.7781
2016-09-14,218.8788
2016-09-15,212.7464
2016-09-16,215.8912
2016-09-19,215.7339
2016-09-20,215.2622
2016-09-21,209.7572
2016-09-22,206.614
2016-09-23,210.545
2016-09-26,216.2057
2016-09-27,211.6457
2016-09-28,208.0292
2016-09-29,214.476
2016-09-30,208.8154
2016-10-03,210.4035
2016-10-04,213.3753
2016-10-05,209.3657
2016-10-06,209.6016
2016-10-07,210.7023
2016-10-10,207.5574
2016-10-11,214.1615
2016-10-12,213.5326
2016-10-13,215.2622
2016-10-14,213.6898
2016-10-17,216.0484
2016-10-18,213.0609
2016-10-19,211.3312
2016-10-20,212.7464
2016-10-21,213.0609
2016-10-24,210.7023
2016-10-25,212.196
2016-10-26,211.4885
2016-10-27,212.2747
2016-10-28,212.5891
2016-10-31,213.5326
2016-11-01,216.9919
2016-11-02,219.8222
2016-11-03,220.6084
2016-11-04,221.8663
2016-11-07,208.6581
2016-11-08,204.8843
2016-11-09,196.7078
2016-11-10,189.4748
2016-11-11,188.2169
2016-11-14,187.7451
2016-11-15,186.1727
2016-11-16,186.8017
2016-11-17,186.1727
2016-11-18,186.9589
2016-11-21,184.2859
2016-11-22,182.2417
2016-11-23,180.8266
2016-11-25,178.9397
2016-11-28,179.8831
2016-11-29,178.7824
2016-11-30,178.6252
2016-12-01,176.7383
2016-12-02,177.5245
2016-12-05,176.4238
2016-12-06,175.1659
2016-12-07,167.3039
2016-12-08,165.1025
2016-12-09,161.8005
2016-12-12,160.5425
2016-12-13,157.8694
2016-12-14,160.5425
2016-12-15,159.2846
2016-12-16,159.1274
2016-12-19,158.4984
2016-12-20,156.1398
2016-12-21,156.7688
2016-12-22,157.3977
2016-12-23,157.0832
2016-12-27,156.7688
2016-12-28,159.4419
2016-12-29,159.7563
2016-12-30,160.6998
2017-01-03,158.6556
2017-01-04,156.926
2017-01-05,157.7122
2017-01-06,156.297
2017-01-09,157.7122
2017-01-10,158.8129
2017-01-11,156.4543
2017-01-12,157.7908
2017-01-13,158.1839
2017-01-17,159.3632
2017-01-18,159.835
2017-01-19,161.368
2017-01-20,159.206
2017-01-23,159.6384
2017-01-24,157.2012
2017-01-25,153.3095
2017-01-26,152.6412
2017-01-27,152.8771
2017-01-30,155.7074
2017-01-31,158.2625
2017-02-01,157.6336
2017-02-02,157.6729
2017-02-03,153.2702
2017-02-06,153.6633
2017-02-07,152.9557
2017-02-08,153.0343
2017-02-09,150.4005
2017-02-10,148.1205
2017-02-13,145.0543
2017-02-14,142.8137
2017-02-15,140.2192
2017-02-16,140.062
2017-02-17,140.1406
2017-02-21,137.782
2017-02-22,136.9565
2017-02-23,136.3668
2017-02-24,136.0916
2017-02-27,135.5806
2017-02-28,135.8558
2017-03-01,129.9593
2017-03-02,132.0034
2017-03-03,132.1606
2017-03-06,132.8289
2017-03-07,133.4186
2017-03-08,134.5979
2017-03-09,134.4799
2017-03-10,133.6151
2017-03-13,133.9689
2017-03-14,134.7944
2017-03-15,132.593
2017-03-16,133.1041
2017-03-17,133.2613
2017-03-20,133.4205
2017-03-21,137.9785
2017-03-22,138.2537
2017-03-23,138.1358
2017-03-24,139.433
2017-03-27,140.5337
2017-03-28,137.3889
2017-03-29,138.1751
2017-03-30,136.9958
2017-03-31,138.0965
2017-04-03,138.4896
2017-04-04,137.664
2017-04-05,138.3323
2017-04-06,138.0965
2017-04-07,138.1751
2017-04-10,138.2144
2017-04-11,138.3716
2017-04-12,139.4723
2017-04-13,142.1847
2017-04-17,138.6468
2017-04-18,140.8088
2017-04-19,143.3247
2017-04-20,139.5116
2017-04-21,139.944
2017-04-24,135.5413
2017-04-25,131.0206
2017-04-26,131.4924
2017-04-27,131.3351
2017-04-28,132.1606
2017-05-01,132.5537
2017-05-02,132.082
2017-05-03,131.9248
2017-05-04,132.0427
2017-05-05,130.9813
2017-05-08,130.7062
2017-05-09,131.3351
2017-05-10,131.6496
2017-05-11,131.8855
2017-05-12,132.4751
2017-05-15,130.9027
2017-05-16,130.8241
2017-05-17,137.2709
2017-05-18,136.4061
2017-05-19,133.4972
2017-05-22,131.8068
2017-05-23,130.9813
2017-05-24,129.6841
2017-05-25,128.2296
2017-05-26,128.3082
2017-05-30,128.9765
2017-05-31,129.3303
2017-06-01,127.011
2017-06-02,125.871
2017-06-05,126.1069
2017-06-06,126.9717
2017-06-07,126.1855
2017-06-08,126.1855
2017-06-09,124.6917
2017-06-12,125.1634
2017-06-13,123.5517
2017-06-14,122.4903
2017-06-15,122.9621
2017-06-16,122.3331
2017-06-19,120.0924
2017-06-20,120.8786
2017-06-21,121.8221
2017-06-22,122.1759
2017-06-23,122.1759
2017-06-26,122.0579
2017-06-27,123.6303
2017-06-28,121.3503
2017-06-29,124.1414
2017-06-30,123.0014
2017-07-03,120.8786
2017-07-05,120.7214
2017-07-06,123.2372
2017-07-07,121.5862
2017-07-10,121.5469
2017-07-11,121.7828
2017-07-12,119.66
2017-07-13,119.3062
2017-07-14,117.9304
2017-07-17,118.0876
2017-07-18,118.9131
2017-07-19,117.9304
2017-07-20,118.1662
2017-07-21,118.8738
2017-07-24,119.4635
2017-07-25,118.2842
2017-07-26,116.7511
2017-07-27,115.2966
2017-07-28,114.8249
2017-07-31,113.7242
2017-08-01,112.7021
2017-08-02,112.0338
2017-08-03,111.798
2017-08-04,110.8545
2017-08-07,110.4614
2017-08-08,110.6973
2017-08-09,111.2083
2017-08-10,113.9994
2017-08-11,113.7635
2017-08-14,111.7587
2017-08-15,111.68
2017-08-16,110.9725
2017-08-17,115.218
2017-08-18,116.5152
2017-08-21,116.0828
2017-08-22,112.8987
2017-08-23,114.1959
2017-08-24,114.589
2017-08-25,114.0387
2017-08-28,114.1566
2017-08-29,113.1345
2017-08-30,112.7021
2017-08-31,111.7587
2017-09-01,111.2083
2017-09-05,114.7069
2017-09-06,113.8814
2017-09-07,114.1566
2017-09-08,113.9207
2017-09-11,109.9504
2017-09-12,109.0463
2017-09-13,108.4566
2017-09-14,107.6311
2017-09-15,106.7663
2017-09-18,105.8228
2017-09-19,105.1546
2017-09-20,104.7615
2017-09-21,105.4691
2017-09-22,105.7442
2017-09-25,106.3339
2017-09-26,106.4911
2017-09-27,105.7049
2017-09-28,105.2725
2017-09-29,104.8794
2017-10-02,102.796
2017-10-03,101.538
2017-10-04,101.3415
2017-10-05,99.8477
2017-10-06,99.887
2017-10-09,100.005
2017-10-10,99.0222
2017-10-11,98.4719
2017-10-12,98.9043
2017-10-13,98.3932
2017-10-16,97.4105
2017-10-17,96.9781
2017-10-18,94.8946
2017-10-19,94.7767
2017-10-20,92.8505
2017-10-23,93.3222
2017-10-24,91.396
2017-10-25,92.6933
2017-10-26,91.8284
2017-10-27,91.514
2017-10-30,92.4967
2017-10-31,92.1429
2017-11-01,91.514
2017-11-02,90.6491
2017-11-03,90.4133
2017-11-06,90.2167
2017-11-07,90.0988
2017-11-08,90.0988
2017-11-09,91.0029
2017-11-10,91.2781
2017-11-13,91.0422
2017-11-14,91.4746
2017-11-15,93.0471
2017-11-16,90.6884
2017-11-17,91.8284
2017-11-20,90.9636
2017-11-21,89.1947
2017-11-22,89.8236
2017-11-24,89.5091
2017-11-27,89.1947
2017-11-28,86.325
2017-11-29,85.0671
2017-11-30,81.5685
2017-12-01,81.8044
2017-12-04,81.1754
2017-12-05,82.2761
2017-12-06,82.6299
2017-12-07,82.0402
2017-12-08,80.743
2017-12-11,80.1533
2017-12-12,78.8954
2017-12-13,78.1092
2017-12-14,78.8168
2017-12-15,77.6768
2017-12-18,76.183
2017-12-19,76.5368
2017-12-20,76.8906
2017-12-21,76.4189
2017-12-22,76.6547
2017-12-26,76.8292
2017-12-27,76.6323
2017-12-28,76.081
2017-12-29,76.7898
2018-01-02,76.1991
2018-01-03,75.254
2018-01-04,73.8757
2018-01-05,72.0249
2018-01-08,72.1037
2018-01-09,71.1586
2018-01-10,71.2767
2018-01-11,69.6622
2018-01-12,67.8113
2018-01-16,67.8507
2018-01-17,65.3304
2018-01-18,65.9605
2018-01-19,65.6455
2018-01-22,64.5428
2018-01-23,64.5428
2018-01-24,64.1097
2018-01-25,63.2039
2018-01-26,61.7469
2018-01-29,62.9283
2018-01-30,65.4879
2018-01-31,64.9366
2018-02-01,64.7004
2018-02-02,69.7409
2018-02-05,79.0738
2018-02-06,73.6395
2018-02-07,73.9939
2018-02-08,83.0512
2018-02-09,79.3101
2018-02-12,75.3722
2018-02-13,74.9784
2018-02-14,72.6156
2018-02-15,69.7803
2018-02-16,69.7015
2018-02-20,71.9068
2018-02-21,73.3638
2018-02-22,71.7886
2018-02-23,68.7564
2018-02-26,65.4879
2018-02-27,67.8507
2018-02-28,70.8435
2018-03-01,74.3877
2018-03-02,75.1359
2018-03-05,71.8674
2018-03-06,71.8674
2018-03-07,72.4581
2018-03-08,71.7099
2018-03-09,67.9295
2018-03-12,69.0715
2018-03-13,70.6073
2018-03-14,72.655
2018-03-15,71.6705
2018-03-16,71.2373
2018-03-19,73.8364
2018-03-20,72.8519
2018-03-21,73.2536
2018-03-22,79.723
2018-03-23,84.0622
2018-03-26,76.9617
2018-03-27,80.1569
2018-03-28,80.3147
2018-03-29,77.1983
2018-04-02,82.287
2018-04-03,78.224
2018-04-04,75.936
2018-04-05,73.6481
2018-04-06,78.8946
2018-04-09,78.3818
2018-04-10,74.1609
2018-04-11,76.0938
2018-04-12,73.372
2018-04-13,74.4765
2018-04-16,72.583
2018-04-17,70.6895
2018-04-18,71.0051
2018-04-19,71.6757
2018-04-20,73.5297
2018-04-23,73.6481
2018-04-24,77.5139
2018-04-25,77.0011
2018-04-26,74.6737
2018-04-27,74.7921
2018-04-30,76.0938
2018-05-01,76.8433
2018-05-02,78.4607
2018-05-03,78.5001
2018-05-04,75.1865
2018-05-07,74.3976
2018-05-08,74.3187
2018-05-09,72.583
2018-05-10,70.8079
2018-05-11,69.8611
2018-05-14,69.3089
2018-05-15,70.9657
2018-05-16,70.374
2018-05-17,70.6895
2018-05-18,70.6895
2018-05-21,68.1649
2018-05-22,69.6245
2018-05-23,69.1905
2018-05-24,69.94
2018-05-25,70.374
2018-05-29,73.7664
2018-05-30,70.8868
2018-05-31,72.938
2018-06-01,71.1235
2018-06-04,69.4667
2018-06-05,69.6245
2018-06-06,66.7054
2018-06-07,66.0348
2018-06-08,65.4036
2018-06-11,65.3247
2018-06-12,65.3247
2018-06-13,66.3503
2018-06-14,66.4292
2018-06-15,67.2182
2018-06-18,67.9677
2018-06-19,70.4134
2018-06-20,70.6305
2018-06-21,72.4892
2018-06-22,71.5005
2018-06-25,74.3083
2018-06-26,74.0711
2018-06-27,75.5738
2018-06-28,74.5852
2018-06-29,74.0711
2018-07-02,73.8733
2018-07-03,74.9015
2018-07-05,73.3592
2018-07-06,72.4496
2018-07-09,69.5232
2018-07-10,68.3763
2018-07-11,70.1559
2018-07-12,68.3368
2018-07-13,67.6249
2018-07-16,67.269
2018-07-17,66.7945
2018-07-18,66.1617
2018-07-19,67.1504
2018-07-20,67.3086
2018-07-23,67.4668
2018-07-24,65.8058
2018-07-25,64.4612
2018-07-26,63.6307
2018-07-27,64.2239
2018-07-30,65.3312
2018-07-31,64.5798
2018-08-01,65.2521
2018-08-02,65.2917
2018-08-03,64.2239
2018-08-06,63.9075
2018-08-07,62.998
2018-08-08,63.3539
2018-08-09,63.6703
2018-08-10,65.0544
2018-08-13,66.0826
2018-08-14,65.3312
2018-08-15,66.2803
2018-08-16,63.0375
2018-08-17,62.2861
2018-08-20,61.6138
2018-08-21,61.1393
2018-08-22,61.772
2018-08-23,62.3652
2018-08-24,61.4161
2018-08-27,59.4388
2018-08-28,59.4783
2018-08-29,58.9247
2018-08-30,59.8342
2018-08-31,60.032
2018-09-04,60.1111
2018-09-05,59.9529
2018-09-06,59.7551
2018-09-07,60.2692
2018-09-10,60.7833
2018-09-11,59.9529
2018-09-12,59.8738
2018-09-13,58.806
2018-09-14,58.8456
2018-09-17,59.4783
2018-09-18,58.0942
2018-09-19,57.066
2018-09-20,55.4841
2018-09-21,55.0886
2018-09-24,56.0773
2018-09-25,56.5123
2018-09-26,57.2518
2018-09-27,56.8945
2018-09-28,56.8151
2018-10-01,55.5049
2018-10-02,54.8299
2018-10-03,54.5123
2018-10-04,55.7431
2018-10-05,56.9342
2018-10-08,56.5769
2018-10-09,57.0136
2018-10-10,62.2544
2018-10-11,66.4629
2018-10-12,64.1998
2018-10-15,64.9145
2018-10-16,60.7457
2018-10-17,61.3015
2018-10-18,63.6043
2018-10-19,63.1279
2018-10-22,64.0807
2018-10-23,65.0336
2018-10-24,69.8377
2018-10-25,66.3835
2018-10-26,68.8848
2018-10-29,70.87
2018-10-30,67.1776
2018-10-31,65.1924
2018-11-01,63.2073
2018-11-02,64.1998
2018-11-05,62.572
2018-11-06,61.3015
2018-11-07,57.4106
2018-11-08,57.1724
2018-11-09,58.4429
2018-11-12,62.572
2018-11-13,63.3264
2018-11-14,64.8351
2018-11-15,63.1279
2018-11-16,62.2147
2018-11-19,65.1924
2018-11-20,69.5201
2018-11-21,69.4406
2018-11-23,71.0685
2018-11-26,67.9716
2018-11-27,67.0188
2018-11-28,61.9368
2018-11-29,62.1353
2018-11-30,60.7854
2018-12-03,58.562
2018-12-04,63.7234
2018-12-06,64.5969
2018-12-07,68.8848
2018-12-10,68.6863
2018-12-11,69.0833
2018-12-12,67.7334
2018-12-13,67.3364
2018-12-14,71.267
2018-12-17,75.7534
2018-12-18,74.9991
2018-12-19,78.4929
2018-12-20,83.2573
2018-12-21,87.8629
2018-12-24,94.8506
2018-12-26,81.187
2018-12-27,78.5153
2018-12-28,79.1533
2018-12-31,76.5614
2019-01-02,76.4816
2019-01-03,82.782
2019-01-04,74.7271
2019-01-07,73.7302
2019-01-08,71.3775
2019-01-09,70.58
2019-01-10,69.5433
2019-01-11,69.5034
2019-01-14,70.3806
2019-01-15,69.0249
2019-01-16,67.7887
2019-01-17,66.3931
2019-01-18,63.6815
2019-01-22,65.9146
2019-01-23,64.6784
2019-01-24,64.8379
2019-01-25,63.4423
2019-01-28,65.0772
2019-01-29,64.6385
2019-01-30,61.289
2019-01-31,61.2491
2019-02-01,60.8902
2019-02-04,59.694
2019-02-05,58.4977
2019-02-06,58.6572
2019-02-07,59.9332
2019-02-08,60.4915
2019-02-11,60.8105
2019-02-12,58.1787
2019-02-13,57.3812
2019-02-14,57.9394
2019-02-15,54.9487
2019-02-19,54.8291
2019-02-20,54.3905
2019-02-21,55.1082
2019-02-22,54.0316
2019-02-25,53.6328
2019-02-26,53.7923
2019-02-27,54.2709
2019-02-28,54.7095
2019-03-01,53.912
2019-03-04,55.2677
2019-03-05,55.3874
2019-03-06,56.2646
2019-03-07,57.5805
2019-03-08,57.6204
2019-03-11,56.3045
2019-03-12,56.9425
2019-03-13,55.9058
2019-03-14,55.826
2019-03-15,55.0285
2019-03-18,54.5899
2019-03-19,54.6696
2019-03-20,55.68
2019-03-21,54.32
2019-03-22,57.2
2019-03-25,57.16
2019-03-26,56.2
2019-03-27,56.48
2019-03-28,55.84
2019-03-29,54.52
2019-04-01,52.52
2019-04-02,52.96
2019-04-03,52.76
2019-04-04,51.68
2019-04-05,51.44
2019-04-08,52.04
2019-04-09,53.08
2019-04-10,53.08
2019-04-11,53.16
2019-04-12,51.64
2019-04-15,51.76
2019-04-16,51.4
2019-04-17,51.44
2019-04-18,50.76
2019-04-22,51
2019-04-23,50.28
2019-04-24,50.6
2019-04-25,51.32
2019-04-26,50.96
2019-04-29,50.92
2019-04-30,50.64
2019-05-01,51.64
2019-05-02,52.4
2019-05-03,51.24
2019-05-06,51.6
2019-05-07,54.4
2019-05-08,54.4
2019-05-09,55.04
2019-05-10,54.24
2019-05-13,58.24
2019-05-14,56.68
2019-05-15,56.04
2019-05-16,54.56
2019-05-17,55.16
2019-05-20,55.72
2019-05-21,54.56
2019-05-22,55.08
2019-05-23,56.88
2019-05-24,56.2
2019-05-28,57.88
2019-05-29,59.36
2019-05-30,59
2019-05-31,61.49
2019-06-03,61.56
2019-06-04,57.72
2019-06-05,56.22
2019-06-06,55.06
2019-06-07,53.38
2019-06-10,52.93
2019-06-11,53
2019-06-12,53.22
2019-06-13,52.53
2019-06-14,52.325
2019-06-17,52.4
2019-06-18,50.83
2019-06-19,50.28
2019-06-20,49.2
2019-06-21,48.68
2019-06-24,48.9
2019-06-25,49.58
2019-06-26,49.62
2019-06-27,50.18
2019-06-28,49.61
2019-07-01,49.33
2019-07-02,48.77
2019-07-03,47.775
2019-07-04,47.775
2019-07-05,47.7
2019-07-08,48.41
2019-07-09,48.82
2019-07-10,48.08
2019-07-11,47.18
2019-07-12,45.87
2019-07-15,45.8
2019-07-16,45.57
2019-07-17,46.11
2019-07-18,46.4
2019-07-19,46.195
2019-07-22,46.535
2019-07-23,45.64
2019-07-24,46.09
2019-07-25,46.8
2019-07-26,46.57
2019-07-29,46.37
2019-07-30,46.58
2019-07-31,47.92
2019-08-01,49.77
2019-08-02,50.2
2019-08-05,54.68
2019-08-06,52.71
2019-08-07,52.935
2019-08-08,50.74
2019-08-09,50.72
2019-08-12,53.145
2019-08-13,50.86
2019-08-14,55.01
2019-08-15,54.37
2019-08-16,52.72
2019-08-19,51.03
2019-08-20,52.16
2019-08-21,50.76
2019-08-22,50.25
2019-08-23,54.66
2019-08-26,52.95
2019-08-27,52.9
2019-08-28,51.59
2019-08-29,49.51
2019-08-30,49.39
2019-09-02,49.22
2019-09-03,50.9
2019-09-04,49.45
2019-09-05,47.32
2019-09-06,47.13
2019-09-09,46.77
2019-09-10,46.68
2019-09-11,45.475
2019-09-12,44.96
2019-09-13,44.87
2019-09-16,45.55
2019-09-17,45.445
2019-09-18,45.28
2019-09-19,45.62
2019-09-20,46.05
2019-09-23,46.115
2019-09-24,46.9
2019-09-25,45.8
2019-09-26,46.18
2019-09-27,46.79
2019-09-30,46.03
2019-10-01,47.995
2019-10-02,50.8
2019-10-03,50.38
2019-10-04,47.78
2019-10-07,48.32
2019-10-08,49.76
2019-10-09,48.97
2019-10-10,48.14
2019-10-11,46.34
2019-10-14,46.65
2019-10-15,45.145
2019-10-16,45.48
2019-10-17,45.395
2019-10-18,46.44
2019-10-21,46.52
2019-10-22,46.44
2019-10-23,46.4
2019-10-24,46.42
2019-10-25,45.775
2019-10-28,45.165
2019-10-29,45.12
2019-10-30,44.765
2019-10-31,45.7
2019-11-01,44.035
2019-11-04,43.255
2019-11-05,42.97
2019-11-06,43.235
2019-11-07,42.27
2019-11-08,42.19
2019-11-11,42.19
2019-11-12,42.11
2019-11-13,41.72
2019-11-14,41.66
2019-11-15,40.875
2019-11-18,40.585
2019-11-19,40.92
2019-11-20,41.55
2019-11-21,41.66
2019-11-22,41.15
2019-11-25,40.44
