date,close
2014-06-13,52.1552
2014-06-16,52.6253
2014-06-17,53.0042
2014-06-18,53.9203
2014-06-19,53.2392
2014-06-20,53.3735
2014-06-23,53.738
2014-06-24,53.3111
2014-06-25,53.2488
2014-06-26,53.172
2014-06-27,53.0473
2014-06-30,51.8578
2014-07-01,51.5029
2014-07-02,50.582
2014-07-03,49.7858
2014-07-07,48.8266
2014-07-08,47.9345
2014-07-09,47.215
2014-07-10,46.0927
2014-07-11,45.5651
2014-07-14,46.5243
2014-07-15,46.2653
2014-07-16,46.1502
2014-07-17,46.6011
2014-07-18,47.5891
2014-07-21,48.0592
2014-07-22,48.3182
2014-07-23,51.714
2014-07-24,54.1313
2014-07-25,53.7092
2014-07-28,53.6996
2014-07-29,54.0833
2014-07-30,54.6301
2014-07-31,53.9395
2014-08-01,53.5749
2014-08-04,53.997
2014-08-05,53.8046
2014-08-06,54.4972
2014-08-07,53.4775
2014-08-08,53.2659
2014-08-11,55.1225
2014-08-12,54.3241
2014-08-13,54.4299
2014-08-14,54.6511
2014-08-15,55.1225
2014-08-18,56.0172
2014-08-19,55.9883
2014-08-20,55.921
2014-08-21,55.565
2014-08-22,55.7671
2014-08-25,57.3544
2014-08-26,57.2582
2014-08-27,57.0561
2014-08-28,56.4116
2014-08-29,56.681
2014-09-02,57.287
2014-09-03,57.7392
2014-09-04,56.1903
2014-09-05,57.0465
2014-09-08,57.5083
2014-09-09,57.5949
2014-09-10,57.7007
2014-09-11,57.008
2014-09-12,56.8156
2014-09-15,55.8055
2014-09-16,56.3635
2014-09-17,56.5751
2014-09-18,59.288
2014-09-19,59.4034
2014-09-22,58.2394
2014-09-23,57.0465
2014-09-24,58.3933
2014-09-25,57.768
2014-09-26,59.0571
2014-09-29,59.692
2014-09-30,59.5092
2014-10-01,59.4996
2014-10-02,59.4323
2014-10-03,60.0768
2014-10-06,60.3173
2014-10-07,59.6439
2014-10-08,60.3269
2014-10-09,59.7882
2014-10-10,60.1538
2014-10-13,60.1826
2014-10-14,60.6925
2014-10-15,62.1547
2014-10-16,61.3515
2014-10-17,60.4712
2014-10-20,61.5198
2014-10-21,63.136
2014-10-22,58.8262
2014-10-23,58.9224
2014-10-24,59.7882
2014-10-27,60.7117
2014-10-28,61.6064
2014-10-29,61.5583
2014-10-30,61.7892
2014-10-31,62.1932
2014-11-03,62.1163
2014-11-04,62.6563
2014-11-05,63.4085
2014-11-06,63.2928
2014-11-07,63.0324
2014-11-10,62.637
2014-11-11,62.936
2014-11-12,63.5628
2014-11-13,63.7171
2014-11-14,63.1192
2014-11-17,61.4605
2014-11-18,61.1326
2014-11-19,60.7758
2014-11-20,61.663
2014-11-21,60.5057
2014-11-24,62.0102
2014-11-25,61.7305
2014-11-26,62.5599
2014-11-28,63.2349
2014-12-01,61.9234
2014-12-02,62.936
2014-12-03,64.3151
2014-12-04,64.9708
2014-12-05,65.6749
2014-12-08,65.5688
2014-12-09,66.8803
2014-12-10,66.4464
2014-12-11,67.3047
2014-12-12,66.0124
2014-12-15,66.0606
2014-12-16,66.157
2014-12-17,67.5651
2014-12-18,69.6578
2014-12-19,68.9923
2014-12-22,69.0791
2014-12-23,69.7156
2014-12-24,69.7253
2014-12-26,70.6415
2014-12-29,69.6578
2014-12-30,69.4263
2014-12-31,69.1563
2015-01-02,67.8447
2015-01-05,66.5332
2015-01-06,65.2505
2015-01-07,65.8388
2015-01-08,69.1466
2015-01-09,68.9634
2015-01-12,68.4619
2015-01-13,70.0242
2015-01-14,70.3618
2015-01-15,68.0858
2015-01-16,69.8314
2015-01-20,69.5903
2015-01-21,69.002
2015-01-22,71.7891
2015-01-23,71.384
2015-01-26,71.7119
2015-01-27,71.5094
2015-01-28,70.6511
2015-01-29,73.2453
2015-01-30,73.2646
2015-02-02,72.4063
2015-02-03,73.2453
2015-02-04,75.203
2015-02-05,77.5465
2015-02-06,78.7712
2015-02-09,77.2186
2015-02-10,77.847
2015-02-11,78.2337
2015-02-12,79.1619
2015-02-13,78.5238
2015-02-17,77.0929
2015-02-18,77.847
2015-02-19,76.9189
2015-02-20,76.3485
2015-02-23,77.412
2015-02-24,77.441
2015-02-25,77.1799
2015-02-26,78.2434
2015-02-27,76.9479
2015-03-02,78.1757
2015-03-03,77.6053
2015-03-04,81.0085
2015-03-05,83.1548
2015-03-06,81.4145
2015-03-09,82.4393
2015-03-10,81.7529
2015-03-11,82.8647
2015-03-12,83.1451
2015-03-13,82.6617
2015-03-16,83.1741
2015-03-17,83.7929
2015-03-18,84.0152
2015-03-19,84.4116
2015-03-20,85.8521
2015-03-23,84.0442
2015-03-24,82.9614
2015-03-25,80.3317
2015-03-26,80.7184
2015-03-27,81.1922
2015-03-30,83.5995
2015-03-31,80.148
2015-04-01,80.119
2015-04-02,81.7142
2015-04-06,82.594
2015-04-07,83.1548
2015-04-08,84.5953
2015-04-09,84.3729
2015-04-10,85.1464
2015-04-13,85.2237
2015-04-14,86.3355
2015-04-15,85.6298
2015-04-16,86.8093
2015-04-17,84.4116
2015-04-20,85.7748
2015-04-21,87.022
2015-04-22,85.7168
2015-04-23,85.7555
2015-04-24,85.011
2015-04-27,84.924
2015-04-28,86.8576
2015-04-29,86.1035
2015-04-30,83.0001
2015-05-01,82.1396
2015-05-04,82.159
2015-05-05,80.7247
2015-05-06,81.3061
2015-05-07,82.3915
2015-05-08,82.0523
2015-05-11,83.409
2015-05-12,83.3606
2015-05-13,83.409
2015-05-14,84.5719
2015-05-15,84.7851
2015-05-18,86.3454
2015-05-19,85.9383
2015-05-20,85.6282
2015-05-21,85.2794
2015-05-22,85.008
2015-05-26,83.8839
2015-05-27,86.4713
2015-05-28,86.2678
2015-05-29,85.7155
2015-06-01,86.2097
2015-06-02,85.7542
2015-06-03,85.1728
2015-06-04,83.8161
2015-06-05,83.9711
2015-06-08,83.6125
2015-06-09,82.7501
2015-06-10,83.8936
2015-06-11,84.0002
2015-06-12,83.6416
2015-06-15,84.3006
2015-06-16,84.601
2015-06-17,85.9674
2015-06-18,86.452
2015-06-19,88.6809
2015-06-22,92.3246
2015-06-23,93.2259
2015-06-24,94.2434
2015-06-25,94.3306
2015-06-26,93.8654
2015-06-29,89.4658
2015-06-30,89.9019
2015-07-01,91.8304
2015-07-02,91.5687
2015-07-06,93.8751
2015-07-07,94.4566
2015-07-08,94.757
2015-07-09,96.5401
2015-07-10,100.087
2015-07-13,98.5946
2015-07-14,97.7902
2015-07-15,96.7921
2015-07-16,98.362
2015-07-17,98.1779
2015-07-20,97.8193
2015-07-21,97.1216
2015-07-22,94.9218
2015-07-23,94.9218
2015-07-24,93.5553
2015-07-27,94.9218
2015-07-28,94.6407
2015-07-29,95.1253
2015-07-30,94.069
2015-07-31,94.7764
2015-08-03,94.8927
2015-08-04,94.1546
2015-08-05,96.3784
2015-08-06,95.0966
2015-08-07,94.747
2015-08-10,94.5916
2015-08-11,93.3778
2015-08-12,92.6106
2015-08-13,91.8046
2015-08-14,93.5914
2015-08-17,94.7081
2015-08-18,94.6693
2015-08-19,95.2228
2015-08-20,93.7759
2015-08-21,91.2414
2015-08-24,87.0173
2015-08-25,86.3375
2015-08-26,88.3379
2015-08-27,89.1731
2015-08-28,88.804
2015-08-31,87.8038
2015-09-01,89.0565
2015-09-02,93.8342
2015-09-03,93.4166
2015-09-04,92.1057
2015-09-08,93.7079
2015-09-09,93.8245
2015-09-10,94.3294
2015-09-11,94.5333
2015-09-14,94.1546
2015-09-15,94.4848
2015-09-16,94.679
2015-09-17,93.7079
2015-09-18,93.5331
2015-09-21,94.2323
2015-09-22,93.1447
2015-09-23,96.1259
2015-09-24,94.3391
2015-09-25,96.6406
2015-09-28,91.96
2015-09-29,88.1923
2015-09-30,90.1927
2015-10-01,91.2997
2015-10-02,92.261
2015-10-05,94.1255
2015-10-06,90.6296
2015-10-07,92.096
2015-10-08,92.7369
2015-10-09,91.96
2015-10-12,94.1546
2015-10-13,91.8241
2015-10-14,91.5133
2015-10-15,93.7079
2015-10-16,93.9313
2015-10-19,93.1641
2015-10-20,93.3195
2015-10-21,84.3468
2015-10-22,86.959
2015-10-23,87.4057
2015-10-26,93.0864
2015-10-27,92.5038
2015-10-28,97.296
2015-10-29,99.913
2015-10-30,98.3788
2015-11-02,96.3257
2015-11-03,96.209
2015-11-04,95.8879
2015-11-05,96.3063
2015-11-06,97.1236
2015-11-09,96.4814
2015-11-10,97.2695
2015-11-11,98.4469
2015-11-12,97.3085
2015-11-13,95.9171
2015-11-16,98.0285
2015-11-17,98.982
2015-11-18,100.8112
2015-11-19,100.6945
2015-11-20,103.7983
2015-11-23,104.4502
2015-11-24,102.3583
2015-11-25,103.1367
2015-11-27,104.7518
2015-11-30,103.8956
2015-12-01,103.8177
2015-12-02,103.5648
2015-12-03,106.5421
2015-12-04,110.8038
2015-12-07,110.4924
2015-12-08,109.8697
2015-12-09,106.5518
2015-12-10,106.2308
2015-12-11,103.7691
2015-12-14,105.3453
2015-12-15,105.0826
2015-12-16,106.2697
2015-12-17,105.0048
2015-12-18,102.0469
2015-12-21,102.7669
2015-12-22,101.9691
2015-12-23,101.9302
2015-12-24,108.1281
2015-12-28,109.6557
2015-12-29,111.1541
2015-12-30,109.9086
2015-12-31,108.5757
2016-01-04,106.3281
2016-01-05,107.1162
2016-01-06,105.8221
2016-01-07,104.168
2016-01-08,102.8739
2016-01-11,103.6426
2016-01-12,103.4091
2016-01-13,100.1204
2016-01-14,101.6188
2016-01-15,99.0209
2016-01-19,99.6144
2016-01-20,100.5193
2016-01-21,99.1571
2016-01-22,100.5096
2016-01-25,99.2155
2016-01-26,101.5604
2016-01-27,105.3551
2016-01-28,108.9454
2016-01-29,113.0903
2016-02-01,112.633
2016-02-02,111.5335
2016-02-03,110.7649
2016-02-04,108.4978
2016-02-05,103.7204
2016-02-08,102.4945
2016-02-09,104.3477
2016-02-10,102.6993
2016-02-11,103.5089
2016-02-12,106.1424
2016-02-16,108.064
2016-02-17,111.3413
2016-02-18,109.1564
2016-02-19,111.3218
2016-02-22,108.5126
2016-02-23,112.4142
2016-02-24,113.1458
2016-02-25,116.3158
2016-02-26,116.9498
2016-02-29,115.5452
2016-03-01,115.3989
2016-03-02,117.0083
2016-03-03,117.7887
2016-03-04,123.1826
2016-03-07,119.0274
2016-03-08,120.7441
2016-03-09,119.5834
2016-03-10,122.8314
2016-03-11,121.856
2016-03-14,121.1245
2016-03-15,120.0418
2016-03-16,120.0711
2016-03-17,120.6368
2016-03-18,121.2903
2016-03-21,119.3395
2016-03-22,118.9689
2016-03-23,118.1691
2016-03-24,117.2424
2016-03-28,118.0325
2016-03-29,120.8124
2016-03-30,120.5783
2016-03-31,121.7585
2016-04-01,125.4162
2016-04-04,123.3972
2016-04-05,120.0808
2016-04-06,122.3047
2016-04-07,120.9489
2016-04-08,119.9833
2016-04-11,118.5592
2016-04-12,118.8713
2016-04-13,121.9243
2016-04-14,122.5973
2016-04-15,121.6122
2016-04-18,121.3879
2016-04-19,123.0753
2016-04-20,125.9332
2016-04-21,125.0846
2016-04-22,126.2746
2016-04-25,125.4162
2016-04-26,126.2161
2016-04-27,122.6169
2016-04-28,120.7051
2016-04-29,119.7394
2016-05-02,120.2759
2016-05-03,117.8862
2016-05-04,119.7102
2016-05-05,121.3488
2016-05-06,122.373
2016-05-09,124.158
2016-05-10,124.246
2016-05-11,125.8
2016-05-12,128.9375
2016-05-13,127.6473
2016-05-16,129.6021
2016-05-17,128.2728
2016-05-18,130.4036
2016-05-19,130.1299
2016-05-20,131.3907
2016-05-23,131.3321
2016-05-24,135.3394
2016-05-25,136.8348
2016-05-26,135.6228
2016-05-27,137.4017
2016-05-31,136.7762
2016-06-01,137.4701
2016-06-02,138.252
2016-06-03,138.4964
2016-06-06,140.0113
2016-06-07,138.5452
2016-06-08,140.3045
2016-06-09,139.0144
2016-06-10,138.6332
2016-06-13,138.858
2016-06-14,138.2911
2016-06-15,138.3986
2016-06-16,139.2978
2016-06-17,137.3039
2016-06-20,137.7633
2016-06-21,135.5935
2016-06-22,136.092
2016-06-23,140.8714
2016-06-24,136.0333
2016-06-27,132.7982
2016-06-28,138.0663
2016-06-29,138.8091
2016-06-30,142.1127
2016-07-01,140.3436
2016-07-05,141.321
2016-07-06,146.638
2016-07-07,145.8952
2016-07-08,148.2898
2016-07-11,147.4004
2016-07-12,147.6643
2016-07-13,147.2929
2016-07-14,148.0846
2016-07-15,147.9868
2016-07-18,146.5794
2016-07-19,148.5928
2016-07-20,148.6124
2016-07-21,147.9575
2016-07-22,149.2868
2016-07-25,150.0003
2016-07-26,150.2348
2016-07-27,150.3228
2016-07-28,156.1481
2016-07-29,158.0051
2016-08-01,157.8194
2016-08-02,158.1713
2016-08-03,158.0833
2016-08-04,158.7381
2016-08-05,159.1486
2016-08-08,158.1126
2016-08-09,158.044
2016-08-10,158.7
2016-08-11,158.5825
2016-08-12,158.8076
2016-08-15,161.0299
2016-08-16,159.63
2016-08-17,161.1572
2016-08-18,163.3794
2016-08-19,163.2032
2016-08-22,161.7837
2016-08-23,161.3627
2016-08-24,161.8914
2016-08-25,162.4592
2016-08-26,162.6648
2016-08-29,164.28
2016-08-30,165.3863
2016-08-31,164.9947
2016-09-01,165.9639
2016-09-02,168.9106
2016-09-06,165.3275
2016-09-07,165.4646
2016-09-08,165.1709
2016-09-09,167.775
2016-09-12,168.4015
2016-09-13,165.9443
2016-09-14,165.9541
2016-09-15,169.6937
2016-09-16,169.1259
2016-09-19,167.1484
2016-09-20,169.1945
2016-09-21,169.6937
2016-09-22,169.2042
2016-09-23,167.1582
2016-09-26,164.3486
2016-09-27,166.6883
2016-09-28,167.4127
2016-09-29,162.6452
2016-09-30,162.1067
2016-10-03,160.7068
2016-10-04,158.7881
2016-10-05,157.8972
2016-10-06,156.9672
2016-10-07,155.8414
2016-10-10,155.4792
2016-10-11,153.5898
2016-10-12,153.9128
2016-10-13,151.7004
2016-10-14,150.9759
2016-10-17,149.0865
2016-10-18,151.4948
2016-10-19,150.1144
2016-10-20,148.2152
2016-10-21,149.018
2016-10-24,150.0361
2016-10-25,149.018
2016-10-26,149.9284
2016-10-27,147.4712
2016-10-28,146.972
2016-10-31,147.5887
2016-11-01,145.1902
2016-11-02,144.5833
2016-11-03,144.691
2016-11-04,147.3048
2016-11-07,150.1585
2016-11-08,152.2081
2016-11-09,158.1313
2016-11-10,156.8172
2016-11-11,158.7883
2016-11-14,162.407
2016-11-15,160.4456
2016-11-16,162.6227
2016-11-17,167.7123
2016-11-18,166.1825
2016-11-21,166.8003
2016-11-22,166.1041
2016-11-23,165.2018
2016-11-25,166.3394
2016-11-28,165.8785
2016-11-29,165.6922
2016-11-30,162.5639
2016-12-01,159.7494
2016-12-02,158.7687
2016-12-05,160.8869
2016-12-06,163.1621
2016-12-07,160.3084
2016-12-08,161.7499
2016-12-09,163.7407
2016-12-12,164.9371
2016-12-13,165.6628
2016-12-14,161.338
2016-12-15,163.8878
2016-12-16,159.2492
2016-12-19,157.5429
2016-12-20,154.0223
2016-12-21,150.6979
2016-12-22,147.295
2016-12-23,146.5252
2016-12-27,146.5987
2016-12-28,145.5592
2016-12-29,142.7153
2016-12-30,144.0784
2017-01-03,147.2754
2017-01-04,149.9624
2017-01-05,149.7565
2017-01-06,154.1106
2017-01-09,153.7576
2017-01-10,153.0417
2017-01-11,153.9537
2017-01-12,153.3261
2017-01-13,153.8164
2017-01-17,152.5023
2017-01-18,153.483
2017-01-19,152.2277
2017-01-20,153.8556
2017-01-23,152.3846
2017-01-24,155.2972
2017-01-25,172.5862
2017-01-26,176.9207
2017-01-27,176.3421
2017-01-30,177.8327
2017-01-31,183.6284
2017-02-01,184.5012
2017-02-02,184.462
2017-02-03,187.5707
2017-02-06,186.5998
2017-02-07,186.0005
2017-02-08,184.1635
2017-02-09,185.0083
2017-02-10,183.525
2017-02-13,186.4524
2017-02-14,186.7177
2017-02-15,188.3091
2017-02-16,188.2993
2017-02-17,189.6746
2017-02-21,189.3406
2017-02-22,191.5804
2017-02-23,191.4134
2017-02-24,192.7199
2017-02-27,191.5509
2017-02-28,191.7866
2017-03-01,194.2524
2017-03-02,188.5645
2017-03-03,190.431
2017-03-06,189.3995
2017-03-07,189.1441
2017-03-08,187.6018
2017-03-09,188.7217
2017-03-10,188.1224
2017-03-13,188.2993
2017-03-14,187.867
2017-03-15,187.7491
2017-03-16,187.4151
2017-03-17,186.698
2017-03-20,186.4819
2017-03-21,181.1771
2017-03-22,184.6351
2017-03-23,183.7018
2017-03-24,184.3895
2017-03-27,181.7273
2017-03-28,182.631
2017-03-29,181.8451
2017-03-30,182.6605
2017-03-31,184.1832
2017-04-03,183.8492
2017-04-04,182.5917
2017-04-05,176.9235
2017-04-06,178.3381
2017-04-07,179.5071
2017-04-10,180.0278
2017-04-11,179.7134
2017-04-12,177.6308
2017-04-13,174.9293
2017-04-17,179.4776
2017-04-18,179.8313
2017-04-19,179.7625
2017-04-20,182.0318
2017-04-21,181.3441
2017-04-24,182.3363
2017-04-25,181.4129
2017-04-26,191.1186
2017-04-27,192.4252
2017-04-28,189.1244
2017-05-01,188.7315
2017-05-02,186.03
2017-05-03,183.5446
2017-05-04,183.2106
2017-05-05,184.527
2017-05-08,182.7293
2017-05-09,183.5756
2017-05-10,185.1698
2017-05-11,185.3371
2017-05-12,183.428
2017-05-15,185.3962
2017-05-16,181.7845
2017-05-17,179.4423
2017-05-18,179.1569
2017-05-19,183.4378
2017-05-22,182.4537
2017-05-23,185.0124
2017-05-24,188.6339
2017-05-25,192.4522
2017-05-26,191.0843
2017-05-30,188.1714
2017-05-31,187.5514
2017-06-01,188.9193
2017-06-02,188.5552
2017-06-05,187.4726
2017-06-06,185.0025
2017-06-07,191.6551
2017-06-08,196.1623
2017-06-09,198.7309
2017-06-12,201.0927
2017-06-13,202.8739
2017-06-14,203.4743
2017-06-15,204.045
2017-06-16,202.4114
2017-06-19,204.6257
2017-06-20,204.1434
2017-06-21,199.2327
2017-06-22,198.5636
2017-06-23,198.1896
2017-06-26,197.6582
2017-06-27,194.4992
2017-06-28,198.5537
2017-06-29,200.2857
2017-06-30,197.9042
2017-07-03,200.1578
2017-07-05,202.4803
2017-07-06,190.3069
2017-07-07,190.9564
2017-07-10,191.8913
2017-07-11,190.1691
2017-07-12,190.671
2017-07-13,191.0843
2017-07-14,187.3841
2017-07-17,187.4234
2017-07-18,189.5294
2017-07-19,191.5272
2017-07-20,191.5862
2017-07-21,191.8224
2017-07-24,193.6233
2017-07-25,196.3099
2017-07-26,201.8898
2017-07-27,202.254
2017-07-28,204.5371
2017-07-31,199.6658
2017-08-01,200.9746
2017-08-02,202.3032
2017-08-03,201.8111
2017-08-04,202.7362
2017-08-07,198.6816
2017-08-08,194.6107
2017-08-09,196.2076
2017-08-10,192.6196
2017-08-11,189.7117
2017-08-14,190.5003
2017-08-15,189.7413
2017-08-16,190.2243
2017-08-17,189.2878
2017-08-18,186.0152
2017-08-21,188.8541
2017-08-22,190.5791
2017-08-23,191.3184
2017-08-24,187.8881
2017-08-25,187.8782
2017-08-28,187.208
2017-08-29,186.1729
2017-08-30,188.6668
2017-08-31,190.1947
2017-09-01,186.2814
2017-09-05,184.7929
2017-09-06,174.0584
2017-09-07,173.7036
2017-09-08,175.8327
2017-09-11,177.2423
2017-09-12,177.5085
2017-09-13,178.1886
2017-09-14,178.6223
2017-09-15,176.6213
2017-09-18,177.8535
2017-09-19,177.4099
2017-09-20,178.7406
2017-09-21,176.9466
2017-09-22,179.8939
2017-09-25,175.951
2017-09-26,173.6839
2017-09-27,176.296
2017-09-28,180.2981
2017-09-29,181.8752
2017-10-02,183.1369
2017-10-03,182.4272
2017-10-04,181.4119
2017-10-05,183.9748
2017-10-06,184.7732
2017-10-09,186.6658
2017-10-10,184.9704
2017-10-11,188.9724
2017-10-12,187.4544
2017-10-13,188.5485
2017-10-16,189.6427
2017-10-17,188.657
2017-10-18,190.7171
2017-10-19,185.9758
2017-10-20,187.5431
2017-10-23,188.5091
2017-10-24,187.3657
2017-10-25,177.1142
2017-10-26,176.8678
2017-10-27,173.0826
2017-10-30,170.5789
2017-10-31,171.5153
2017-11-01,173.2206
2017-11-02,173.9796
2017-11-03,174.4724
2017-11-06,177.3803
2017-11-07,175.7904
2017-11-08,176.5212
2017-11-09,172.3242
2017-11-10,171.3268
2017-11-13,172.3439
2017-11-14,171.7712
2017-11-15,175.6028
2017-11-16,174.0524
2017-11-17,178.1506
2017-11-20,181.0046
2017-11-21,186.0608
2017-11-22,185.6361
2017-11-24,186.12
2017-11-27,186.2089
2017-11-28,191.0182
2017-11-29,193.5956
2017-11-30,192.8352
2017-12-01,192.9142
2017-12-04,194.7313
2017-12-05,193.645
2017-12-06,194.5733
2017-12-07,193.1611
2017-12-08,193.5561
2017-12-11,194.3659
2017-12-12,194.751
2017-12-13,193.803
2017-12-14,192.6377
2017-12-15,191.4329
2017-12-18,196.8742
2017-12-19,199.5801
2017-12-20,200.38
2017-12-21,199.2048
2017-12-22,199.2344
2017-12-26,198.5135
2017-12-27,198.4938
2017-12-28,199.2937
2017-12-29,199.2344
2018-01-02,201.091
2018-01-03,198.4345
2018-01-04,203.9647
2018-01-05,204.6461
2018-01-08,204.8238
2018-01-09,202.0094
2018-01-10,203.8067
2018-01-11,199.0073
2018-01-12,201.1799
2018-01-16,203.8857
2018-01-17,204.7843
2018-01-18,205.2682
2018-01-19,205.7916
2018-01-22,198.7505
2018-01-23,193.5364
2018-01-24,193.2994
2018-01-25,191.1663
2018-01-26,191.0774
2018-01-29,188.4111
2018-01-30,189.4579
2018-01-31,193.7635
2018-02-01,193.1611
2018-02-02,193.8425
2018-02-05,194.672
2018-02-06,192.8253
2018-02-07,192.5785
2018-02-08,186.6631
2018-02-09,186.8014
2018-02-12,189.1122
2018-02-13,191.3093
2018-02-14,195.565
2018-02-15,196.8516
2018-02-16,199.3259
2018-02-20,198.0591
2018-02-21,199.9098
2018-02-22,197.3465
2018-02-23,195.6442
2018-02-26,197.6137
2018-02-27,198.9399
2018-02-28,200.3156
2018-03-01,203.4827
2018-03-02,200.7907
2018-03-05,207.0456
2018-03-06,209.2922
2018-03-07,210.2918
2018-03-08,214.498
2018-03-09,216.6259
2018-03-12,220.8519
2018-03-13,221.6635
2018-03-14,221.2676
2018-03-15,221.7822
2018-03-16,222.2771
2018-03-19,220.456
2018-03-20,221.9109
2018-03-21,221.0696
2018-03-22,218.9616
2018-03-23,217.2791
2018-03-26,219.4267
2018-03-27,215.0424
2018-03-28,210.7866
2018-03-29,215.2007
2018-04-02,210.084
2018-04-03,211.2122
2018-04-04,210.0543
2018-04-05,206.2934
2018-04-06,204.5515
2018-04-09,205.6699
2018-04-10,204.2546
2018-04-11,203.7301
2018-04-12,201.3845
2018-04-13,199.989
2018-04-16,202.295
2018-04-17,203.8686
2018-04-18,200.9985
2018-04-19,200.5828
2018-04-20,200.4146
2018-04-23,199.9791
2018-04-24,198.8113
2018-04-25,197.2376
2018-04-26,197.4257
2018-04-27,197.2079
2018-04-30,196.5844
2018-05-01,199.4447
2018-05-02,199.9395
2018-05-03,196.9506
2018-05-04,199.6624
2018-05-07,201.9189
2018-05-08,201.6215
2018-05-09,204.0512
2018-05-10,202.9207
2018-05-11,204.0314
2018-05-14,197.9818
2018-05-15,199.6578
2018-05-16,200.5702
2018-05-17,201.1454
2018-05-18,203.0298
2018-05-21,208.8513
2018-05-22,208.5736
2018-05-23,208.2761
2018-05-24,210.081
2018-05-25,208.8116
2018-05-29,209.1984
2018-05-30,214.3654
2018-05-31,211.886
2018-06-01,215.0596
2018-06-04,216.1505
2018-06-05,206.9769
2018-06-06,209.5257
2018-06-07,210.6959
2018-06-08,213.1158
2018-06-11,216.339
2018-06-12,213.691
2018-06-13,214.9307
2018-06-14,215.5158
2018-06-15,213.334
2018-06-18,212.1042
2018-06-19,212.5604
2018-06-20,211.2811
2018-06-21,209.9422
2018-06-22,209.2579
2018-06-25,203.724
2018-06-26,201.0363
2018-06-27,198.6562
2018-06-28,200.9768
2018-06-29,196.2264
2018-07-02,199.0628
2018-07-03,197.952
2018-07-05,198.1405
2018-07-06,200.8777
2018-07-09,201.1256
2018-07-10,199.9653
2018-07-11,202.4248
2018-07-12,204.8843
2018-07-13,204.1603
2018-07-16,204.2793
2018-07-17,205.8761
2018-07-18,208.0281
2018-07-19,207.1852
2018-07-20,208.4843
2018-07-23,208.7719
2018-07-24,207.8695
2018-07-25,201.2347
2018-07-26,198.7157
2018-07-27,196.9603
2018-07-30,190.623
2018-07-31,192.1702
2018-08-01,191.9321
2018-08-02,189.2346
2018-08-03,188.0743
2018-08-06,188.1139
2018-08-07,187.8759
2018-08-08,185.1028
2018-08-09,184.8543
2018-08-10,185.3413
2018-08-13,184.8344
2018-08-14,185.3115
2018-08-15,186.1067
2018-08-16,186.8323
2018-08-17,187.9355
2018-08-20,188.8698
2018-08-21,189.5159
2018-08-22,189.5855
2018-08-23,188.0349
2018-08-24,186.2458
2018-08-27,186.0868
2018-08-28,187.3789
2018-08-29,188.8897
2018-08-30,188.8301
2018-08-31,188.6711
2018-09-04,193.2035
2018-09-05,190.0328
2018-09-06,183.0553
2018-09-07,185.8284
2018-09-10,181.8824
2018-09-11,183.254
2018-09-12,182.9757
2018-09-13,182.1905
2018-09-14,182.3396
2018-09-17,178.7018
2018-09-18,180.5406
2018-09-19,181.5146
2018-09-20,182.1309
2018-09-21,180.7592
2018-09-24,183.0652
2018-09-25,180.5207
2018-09-26,178.1054
2018-09-27,177.0916
2018-09-28,177.4096
2018-10-01,172.8375
2018-10-02,177.022
2018-10-03,182.0315
2018-10-04,190.3707
2018-10-05,188.3927
2018-10-08,184.9338
2018-10-09,187.5479
2018-10-10,185.6793
2018-10-11,184.079
2018-10-12,186.3651
2018-10-15,188.5816
2018-10-16,192.4282
2018-10-17,194.8832
2018-10-18,193.5414
2018-10-19,196.235
2018-10-22,195.1516
2018-10-23,191.7026
2018-10-24,207.6654
2018-10-25,209.375
2018-10-26,206.5025
2018-10-29,207.7747
2018-10-30,215.945
2018-10-31,208.4009
2018-11-01,207.3274
2018-11-02,212.496
2018-11-05,205.8365
2018-11-06,206.4241
2018-11-07,207.2408
2018-11-08,205.3883
2018-11-09,207.6392
2018-11-12,206.5636
2018-11-13,206.952
2018-11-14,209.2427
2018-11-15,209.183
2018-11-16,212.6091
2018-11-19,213.7843
2018-11-20,216.1547
2018-11-21,214.0233
2018-11-23,212.639
2018-11-26,214.2425
2018-11-27,216.9515
2018-11-28,215.1289
2018-11-29,214.1827
2018-11-30,216.8519
2018-12-03,218.4056
2018-12-04,221.0947
2018-12-06,221.015
2018-12-07,223.8237
2018-12-10,225.4869
2018-12-11,227.7677
2018-12-12,227.3494
2018-12-13,228.4151
2018-12-14,225.5865
2018-12-17,218.4753
2018-12-18,212.5095
2018-12-19,212.1908
2018-12-20,208.5356
2018-12-21,204.0238
2018-12-24,198.5261
2018-12-26,203.6454
2018-12-27,205.0198
2018-12-28,206.713
2018-12-31,210.4578
2019-01-02,208.3663
2019-01-03,206.9221
2019-01-04,213.4357
2019-01-07,215.9854
2019-01-08,215.8161
2019-01-09,212.2804
2019-01-10,211.8123
2019-01-11,211.7326
2019-01-14,206.7428
2019-01-15,210.0295
2019-01-16,215.3779
2019-01-17,215.1189
2019-01-18,218.296
2019-01-22,217.4196
2019-01-23,218.9235
2019-01-24,217.8678
2019-01-25,218.565
2019-01-28,217.4196
2019-01-29,212.639
2019-01-30,209.3722
2019-01-31,213.9038
2019-02-01,212.7585
2019-02-04,215.5571
2019-02-05,217.7582
2019-02-06,217.9574
2019-02-07,219.6207
2019-02-08,219.78
2019-02-11,222.6584
2019-02-12,225.0142
2019-02-13,227.8292
2019-02-14,226.3618
2019-02-15,229.107
2019-02-19,232.1317
2019-02-20,233.1599
2019-02-21,234.7471
2019-02-22,238.5504
2019-02-25,240.9661
2019-02-26,240.0278
2019-02-27,244.0707
2019-02-28,243.4517
2019-03-01,242.6631
2019-03-04,237.1428
2019-03-05,233.5092
2019-03-06,230.1152
2019-03-07,225.0441
2019-03-08,225.2737
2019-03-11,226.7611
2019-03-12,229.3765
2019-03-13,230.0653
2019-03-14,231.4029
2019-03-15,233.0301
2019-03-18,237.2227
2019-03-19,235.2063
2019-03-20,236.8034
2019-03-21,239.7383
2019-03-22,237.9215
2019-03-25,238.7001
2019-03-26,243.2521
2019-03-27,244.6496
2019-03-28,246.0871
2019-03-29,245.6479
2019-04-01,246.2868
2019-04-02,248.2533
2019-04-03,246.2468
2019-04-04,247.9738
2019-04-05,253.4442
2019-04-08,257.6867
2019-04-09,258.5352
2019-04-10,258.0061
2019-04-11,256.7683
2019-04-12,259.3937
2019-04-15,261.2804
2019-04-16,262.4583
2019-04-17,261.7695
2019-04-18,263.4566
2019-04-22,261.6697
2019-04-23,262.039
2019-04-24,263.9157
2019-04-25,264.9939
2019-04-26,269.2064
2019-04-29,275.8148
2019-04-30,277.8413
2019-05-01,281.5447
2019-05-02,282.4132
2019-05-03,285.5477
2019-05-06,289.93
2019-05-07,279.87
2019-05-08,280.82
2019-05-09,278
2019-05-10,280.95
2019-05-13,281.65
2019-05-14,287.39
2019-05-15,287
2019-05-16,289.43
2019-05-17,292.17
2019-05-20,293.59
2019-05-21,292.04
2019-05-22,292.49
2019-05-23,291.62
2019-05-24,288.32
2019-05-28,281.07
2019-05-29,281.32
2019-05-30,283.96
2019-05-31,297.82
2019-06-03,294.22
2019-06-04,299.12
2019-06-05,316.8
2019-06-06,326.86
2019-06-07,334.61
2019-06-10,339.9
2019-06-11,333.99
2019-06-12,325.28
2019-06-13,315.86
2019-06-14,320.17
2019-06-17,319.5
2019-06-18,319.075
2019-06-19,330.175
2019-06-20,330.38
2019-06-21,332.46
2019-06-24,334.86
2019-06-25,319.98
2019-06-26,313.44
2019-06-27,316.93
2019-06-28,319.35
2019-07-01,322.235
2019-07-02,330.91
2019-07-03,338.52
2019-07-04,338.52
2019-07-05,343.78
2019-07-08,342.81
2019-07-09,342.25
2019-07-10,348.96
2019-07-11,353.43
2019-07-12,356.97
2019-07-15,360.71
2019-07-16,363.19
2019-07-17,368.1
2019-07-18,373.1
2019-07-19,366.57
2019-07-22,370.81
2019-07-23,367.25
2019-07-24,333.96
2019-07-25,343.775
2019-07-26,348.39
2019-07-29,336.76
2019-07-30,335.87
2019-07-31,337.58
2019-08-01,340.41
2019-08-02,340.85
2019-08-05,341.955
2019-08-06,345.09
2019-08-07,349.6
2019-08-08,352.055
2019-08-09,362.67
2019-08-12,363.22
2019-08-13,366.99
2019-08-14,356.88
2019-08-15,365.61
2019-08-16,366.36
2019-08-19,369.645
2019-08-20,375.41
2019-08-21,389.025
2019-08-22,392.33
2019-08-23,387.08
2019-08-26,395.195
2019-08-27,405.46
2019-08-28,404.58
2019-08-29,392.25
2019-08-30,398.115
2019-09-02,397.72
2019-09-03,401.635
2019-09-04,408.62
2019-09-05,411.57
2019-09-06,419.325
2019-09-09,369.225
2019-09-10,341.775
2019-09-11,341.155
2019-09-12,344.855
2019-09-13,330.86
2019-09-16,333.98
2019-09-17,342.485
2019-09-18,345.07
2019-09-19,343.535
2019-09-20,339.3
2019-09-23,336.44
2019-09-24,337.12
2019-09-25,333.46
2019-09-26,331.86
2019-09-27,324.13
2019-09-30,327.65
2019-10-01,324.73
2019-10-02,318.455
2019-10-03,336.94
2019-10-04,346.9
2019-10-07,348.28
2019-10-08,346.7
2019-10-09,355.34
2019-10-10,359.27
2019-10-11,348.305
2019-10-14,349.19
2019-10-15,348.005
2019-10-16,340.38
2019-10-17,349.445
2019-10-18,352.65
2019-10-21,353.35
2019-10-22,340.8
2019-10-23,341.55
2019-10-24,349.06
2019-10-25,343.745
2019-10-28,348.67
2019-10-29,351.4
2019-10-30,358.86
2019-10-31,368.465
2019-11-01,365.82
2019-11-04,358.42
2019-11-05,343.385
2019-11-06,348.49
2019-11-07,349.43
2019-11-08,346.51
2019-11-11,359.34
2019-11-12,365.515
2019-11-13,373.76
2019-11-14,378.99
2019-11-15,381.03
2019-11-18,389.67
2019-11-19,400.04
2019-11-20,404.735
2019-11-21,394.105
2019-11-22,392
2019-11-25,397.865
