date,close
2014-06-13,38.52
2014-06-16,39.76
2014-06-17,39.6467
2014-06-18,39.5267
2014-06-19,39.9334
2014-06-20,39.7934
2014-06-23,40.2667
2014-06-24,39.88
2014-06-25,40.2534
2014-06-26,40.2467
2014-06-27,41.2467
2014-06-30,41.6334
2014-07-01,41.2
2014-07-02,41.1467
2014-07-03,41.5267
2014-07-07,41.1067
2014-07-08,40.9467
2014-07-09,41.4934
2014-07-10,40.9667
2014-07-11,40.8134
2014-07-14,40.3267
2014-07-15,40.5067
2014-07-16,41.3067
2014-07-17,41.1534
2014-07-18,41.1
2014-07-21,40.5467
2014-07-22,40.1467
2014-07-23,40.2067
2014-07-24,40.2334
2014-07-25,40.1734
2014-07-28,40.0867
2014-07-29,40.2267
2014-07-30,39.8867
2014-07-31,39.56
2014-08-01,40.0334
2014-08-04,39.98
2014-08-05,39.9534
2014-08-06,39.7067
2014-08-07,39.4734
2014-08-08,39.62
2014-08-11,40.1134
2014-08-12,39.9934
2014-08-13,40.8
2014-08-14,40.56
2014-08-15,40.82
2014-08-18,41.8134
2014-08-19,41.8934
2014-08-20,43.3334
2014-08-21,42.42
2014-08-22,43.3867
2014-08-25,44.1734
2014-08-26,44.5067
2014-08-27,44.8267
2014-08-28,44.1467
2014-08-29,44.5734
2014-09-02,44.5867
2014-09-03,43.76
2014-09-04,43.4934
2014-09-05,43.3
2014-09-08,43.7934
2014-09-09,43.6067
2014-09-10,43.8134
2014-09-11,43.8867
2014-09-12,44.5067
2014-09-15,44.2867
2014-09-16,44.3134
2014-09-17,44.0934
2014-09-18,43.9667
2014-09-19,43.9467
2014-09-22,43.9934
2014-09-23,44.68
2014-09-24,44.6067
2014-09-25,44.3334
2014-09-26,44.4
2014-09-29,44.3067
2014-09-30,44.08
2014-10-01,42.8334
2014-10-02,42.2067
2014-10-03,42.9734
2014-10-06,42.36
2014-10-07,42.5867
2014-10-08,43.0667
2014-10-09,42.7934
2014-10-10,42.1134
2014-10-13,40.3934
2014-10-14,40.1734
2014-10-15,41.1467
2014-10-16,41.3467
2014-10-17,42
2014-10-20,42.32
2014-10-21,42.8867
2014-10-22,42.2467
2014-10-23,43.0667
2014-10-24,43.1734
2014-10-27,43.8534
2014-10-28,48.66
2014-10-29,49.8134
2014-10-30,49.3867
2014-10-31,50.5067
2014-11-03,50.1734
2014-11-04,49.94
2014-11-05,50.02
2014-11-06,49.92
2014-11-07,50.1
2014-11-10,49.7867
2014-11-11,49.6667
2014-11-12,49.8267
2014-11-13,49.1467
2014-11-14,49.0067
2014-11-17,48.8667
2014-11-18,48.8067
2014-11-19,48.52
2014-11-20,48.3734
2014-11-21,47.8267
2014-11-24,48.2534
2014-11-25,48.5134
2014-11-26,48.6
2014-11-28,48.6934
2014-12-01,48.1534
2014-12-02,48.2334
2014-12-03,48.5067
2014-12-04,48.3534
2014-12-05,49.2267
2014-12-08,49.0134
2014-12-09,48.66
2014-12-10,48.14
2014-12-11,48.4334
2014-12-12,48.3467
2014-12-15,47.7534
2014-12-16,47.2067
2014-12-17,47.6267
2014-12-18,48.42
2014-12-19,50.0467
2014-12-22,50.12
2014-12-23,50.1467
2014-12-24,50.3467
2014-12-26,50.18
2014-12-29,50.7134
2014-12-30,50.3067
2014-12-31,50.1734
2015-01-02,50.1734
2015-01-05,49.4267
2015-01-06,49.3
2015-01-07,49.38
2015-01-08,49.9167
2015-01-09,49.2134
2015-01-12,49.2334
2015-01-13,49.2467
2015-01-14,48.36
2015-01-15,48.1134
2015-01-16,49.1
2015-01-20,48.7334
2015-01-21,48.7867
2015-01-22,49.82
2015-01-23,49.7
2015-01-26,50.0334
2015-01-27,50.1467
2015-01-28,50.1067
2015-01-29,50.42
2015-01-30,50.5
2015-02-02,50.52
2015-02-03,51.3867
2015-02-04,51.3867
2015-02-05,50.9467
2015-02-06,52.0734
2015-02-09,51.3867
2015-02-10,52.39
2015-02-11,51.5534
2015-02-12,52.1267
2015-02-13,52.48
2015-02-17,52.36
2015-02-18,52.0467
2015-02-19,51.84
2015-02-20,52.3534
2015-02-23,52.7467
2015-02-24,52.7234
2015-02-25,52.4934
2015-02-26,52.3
2015-02-27,52.2334
2015-03-02,52.54
2015-03-03,52.34
2015-03-04,51.6934
2015-03-05,51.3267
2015-03-06,50.7
2015-03-09,50.7734
2015-03-10,50.2467
2015-03-11,50.58
2015-03-12,51.2067
2015-03-13,52.13
2015-03-16,51.8734
2015-03-17,52.34
2015-03-18,53.0134
2015-03-19,52.8867
2015-03-20,53.2334
2015-03-23,53.7067
2015-03-24,53.86
2015-03-25,53.4867
2015-03-26,53
2015-03-27,53.82
2015-03-30,56.2934
2015-03-31,56.4334
2015-04-01,55.92
2015-04-02,55.9467
2015-04-06,55.96
2015-04-07,55.3267
2015-04-08,55.7
2015-04-09,55.4934
2015-04-10,55.5934
2015-04-13,54.94
2015-04-14,55.4534
2015-04-15,55.4334
2015-04-16,55.12
2015-04-17,54.9467
2015-04-20,55.3134
2015-04-21,54.8534
2015-04-22,54.82
2015-04-23,54.44
2015-04-24,54.4867
2015-04-27,54.12
2015-04-28,54.5867
2015-04-29,54.6467
2015-04-30,53.5334
2015-05-01,55.3334
2015-05-04,56.4934
2015-05-05,55.66
2015-05-06,55.6467
2015-05-07,55.8634
2015-05-08,55.6334
2015-05-11,55.1267
2015-05-12,55.2067
2015-05-13,54.9934
2015-05-14,56.12
2015-05-15,56.0534
2015-05-18,56.84
2015-05-19,56.9334
2015-05-20,57.33
2015-05-21,56.9534
2015-05-22,57.3067
2015-05-26,57.2934
2015-05-27,57.8867
2015-05-28,57.7134
2015-05-29,56.9534
2015-06-01,56.7334
2015-06-02,56.6067
2015-06-03,57.5134
2015-06-04,57.2534
2015-06-05,57.6
2015-06-08,56.64
2015-06-09,56.9234
2015-06-10,56.7734
2015-06-11,57.07
2015-06-12,56.8134
2015-06-15,56.7067
2015-06-16,56.7334
2015-06-17,56.5867
2015-06-18,56.8734
2015-06-19,56.7867
2015-06-22,57.0267
2015-06-23,56.9
2015-06-24,56.1667
2015-06-25,56.44
2015-06-26,55.9334
2015-06-29,54.96
2015-06-30,55.66
2015-07-01,55.94
2015-07-02,55.7
2015-07-06,55.5334
2015-07-07,55.4467
2015-07-08,54.64
2015-07-09,54.86
2015-07-10,55.2467
2015-07-13,55.7734
2015-07-14,56.0667
2015-07-15,55.5067
2015-07-16,55.7134
2015-07-17,54.8867
2015-07-20,54.86
2015-07-21,54.24
2015-07-22,54.5267
2015-07-23,54.1267
2015-07-24,53.5267
2015-07-27,54.7534
2015-07-28,54.8
2015-07-29,55.6934
2015-07-30,55.54
2015-07-31,55.6
2015-08-03,55.0667
2015-08-04,55.52
2015-08-05,51.8134
2015-08-06,50.96
2015-08-07,52.4334
2015-08-10,52.1267
2015-08-11,50.8467
2015-08-12,50.8134
2015-08-13,51.1867
2015-08-14,51.3534
2015-08-17,52.4667
2015-08-18,52.1267
2015-08-19,50.9467
2015-08-20,48.88
2015-08-21,48.02
2015-08-24,45.8934
2015-08-25,47.1267
2015-08-26,46.7467
2015-08-27,47.4134
2015-08-28,47.3534
2015-08-31,46.96
2015-09-01,46.92
2015-09-02,47.2467
2015-09-03,47.4067
2015-09-04,47.4667
2015-09-08,48.5
2015-09-09,49.12
2015-09-10,48.5467
2015-09-11,48.6867
2015-09-14,49.0934
2015-09-15,50.4
2015-09-16,50.4867
2015-09-17,51.5934
2015-09-18,50.6667
2015-09-21,50.1467
2015-09-22,48.9334
2015-09-23,48.72
2015-09-24,48.7467
2015-09-25,47.2067
2015-09-28,45.8534
2015-09-29,45.8667
2015-09-30,48.0934
2015-10-01,159.49
2015-10-02,171.5
2015-10-05,173.66
2015-10-06,173.57
2015-10-07,170.87
2015-10-08,170.45
2015-10-09,172.01
2015-10-12,172.51
2015-10-13,176.44
2015-10-14,175.03
2015-10-15,182.69
2015-10-16,177.08
2015-10-19,173.12
2015-10-20,175.42
2015-10-21,174.62
2015-10-22,175.69
2015-10-23,179.95
2015-10-26,181.82
2015-10-27,181.79
2015-10-28,182.18
2015-10-29,181.86
2015-10-30,178.5
2015-11-02,177.71
2015-11-03,173.96
2015-11-04,172.59
2015-11-05,169.72
2015-11-06,170.15
2015-11-09,173.36
2015-11-10,173.37
2015-11-11,173.48
2015-11-12,170.15
2015-11-13,169.95
2015-11-16,171.72
2015-11-17,171.19
2015-11-18,169.64
2015-11-19,166.85
2015-11-20,165.76
2015-11-23,167.41
2015-11-24,165.71
2015-11-25,164.98
2015-11-27,165.8
2015-11-30,162.46
2015-12-01,164.7
2015-12-02,163.62
2015-12-03,161.89
2015-12-04,162
2015-12-07,159.86
2015-12-08,157.51
2015-12-09,158.28
2015-12-10,158
2015-12-11,158.46
2015-12-14,160.45
2015-12-15,164.39
2015-12-16,165.52
2015-12-17,164.46
2015-12-18,161.04
2015-12-21,158.26
2015-12-22,160.3
2015-12-23,161.7
2015-12-24,161.12
2015-12-28,160.16
2015-12-29,161.97
2015-12-30,160.2
2015-12-31,161.8
2016-01-04,154.05
2016-01-05,154.5
2016-01-06,156.09
2016-01-07,154.52
2016-01-08,153.84
2016-01-11,154.38
2016-01-12,153.67
2016-01-13,150.05
2016-01-14,148.62
2016-01-15,147.39
2016-01-19,147.75
2016-01-20,146.69
2016-01-21,147.16
2016-01-22,151.52
2016-01-25,151.51
2016-01-26,152.27
2016-01-27,150.99
2016-01-28,151.46
2016-01-29,154.08
2016-02-01,153.69
2016-02-02,149.63
2016-02-03,150
2016-02-04,150.17
2016-02-05,148.17
2016-02-08,141
2016-02-09,145.93
2016-02-10,146.77
2016-02-11,151.94
2016-02-12,151.58
2016-02-16,150.39
2016-02-17,149.89
2016-02-18,150.95
2016-02-19,150.94
2016-02-22,151.69
2016-02-23,153.4
2016-02-24,154.17
2016-02-25,154.15
2016-02-26,154.44
2016-02-29,155
2016-03-01,160.5
2016-03-02,161.67
2016-03-03,162.06
2016-03-04,161.28
2016-03-07,166.25
2016-03-08,165.48
2016-03-09,167.25
2016-03-10,167.4
2016-03-11,169.07
2016-03-14,166.25
2016-03-15,167.03
2016-03-16,166.58
2016-03-17,165.83
2016-03-18,163.65
2016-03-21,165.03
2016-03-22,163.84
2016-03-23,161.92
2016-03-24,161
2016-03-28,164.2
2016-03-29,166.68
2016-03-30,166.61
2016-03-31,166.36
2016-04-01,164.4
2016-04-04,161.81
2016-04-05,163.25
2016-04-06,162.29
2016-04-07,158.78
2016-04-08,161.78
2016-04-11,162.21
2016-04-12,161.69
2016-04-13,164.21
2016-04-14,163.13
2016-04-15,161.3
2016-04-18,162.18
2016-04-19,164.45
2016-04-20,159.74
2016-04-21,157.57
2016-04-22,161.13
2016-04-25,160.39
2016-04-26,158.6
2016-04-27,159.45
2016-04-28,158.44
2016-04-29,156.98
2016-05-02,162.67
2016-05-03,162.05
2016-05-04,159.95
2016-05-05,162.52
2016-05-06,161.6
2016-05-09,162.53
2016-05-10,160.94
2016-05-11,159.92
2016-05-12,159.44
2016-05-13,160.21
2016-05-16,161.83
2016-05-17,160.14
2016-05-18,162.14
2016-05-19,162.15
2016-05-20,163.28
2016-05-23,165.28
2016-05-24,167.02
2016-05-25,166.34
2016-05-26,165.93
2016-05-27,166.49
2016-05-31,167.53
2016-06-01,168.96
2016-06-02,168.79
2016-06-03,167.28
2016-06-06,167.51
2016-06-07,168
2016-06-08,168.55
2016-06-09,168.54
2016-06-10,170
2016-06-13,169.09
2016-06-14,169.51
2016-06-15,170.14
2016-06-16,169.61
2016-06-17,170
2016-06-20,171.62
2016-06-21,171
2016-06-22,170.2
2016-06-23,173.88
2016-06-24,170.65
2016-06-27,167.3
2016-06-28,165.05
2016-06-29,172.68
2016-06-30,172.51
2016-07-01,174.06
2016-07-05,171.49
2016-07-06,170.91
2016-07-07,170.45
2016-07-08,172.02
2016-07-11,173.19
2016-07-12,177
2016-07-13,176.45
2016-07-14,176.09
2016-07-15,175.42
2016-07-18,178.45
2016-07-19,178.43
2016-07-20,179.74
2016-07-21,180.19
2016-07-22,182.74
2016-07-25,181.08
2016-07-26,181.47
2016-07-27,181.84
2016-07-28,182.77
2016-07-29,182.79
2016-08-01,183.25
2016-08-02,181.07
2016-08-03,181.18
2016-08-04,181.95
2016-08-05,183.68
2016-08-08,183.69
2016-08-09,183.92
2016-08-10,184.26
2016-08-11,184.4
2016-08-12,182.99
2016-08-15,184.38
2016-08-16,186.3
2016-08-17,187.77
2016-08-18,188.12
2016-08-19,184.19
2016-08-22,182.15
2016-08-23,181.5
2016-08-24,179.87
2016-08-25,180.13
2016-08-26,179.68
2016-08-29,180.53
2016-08-30,182.37
2016-08-31,180.65
2016-09-01,180.49
2016-09-02,180.89
2016-09-06,178.85
2016-09-07,181.4
2016-09-08,178.01
2016-09-09,175.06
2016-09-12,173.18
2016-09-13,173.32
2016-09-14,175.57
2016-09-15,173.91
2016-09-16,171.35
2016-09-19,172.62
2016-09-20,171.84
2016-09-21,173.91
2016-09-22,172.9
2016-09-23,171.58
2016-09-26,170.62
2016-09-27,170
2016-09-28,168.48
2016-09-29,167.11
2016-09-30,169.41
2016-10-03,172.4
2016-10-04,170.2
2016-10-05,168.7
2016-10-06,167.84
2016-10-07,167.96
2016-10-10,168.81
2016-10-11,168.55
2016-10-12,168.13
2016-10-13,166.35
2016-10-14,165.03
2016-10-17,161.42
2016-10-18,164.64
2016-10-19,166.41
2016-10-20,164.06
2016-10-21,168.21
2016-10-24,166.07
2016-10-25,163.43
2016-10-26,162.98
2016-10-27,163.54
2016-10-28,164.05
2016-10-31,165.49
2016-11-01,164.07
2016-11-02,162.43
2016-11-03,161.46
2016-11-04,162.14
2016-11-07,165.11
2016-11-08,167.51
2016-11-09,167.99
2016-11-10,169.75
2016-11-11,171.58
2016-11-14,171.72
2016-11-15,172.16
2016-11-16,172.62
2016-11-17,175.75
2016-11-18,173.14
2016-11-21,173.5
2016-11-22,172.92
2016-11-23,172.37
2016-11-25,173.3
2016-11-28,173.29
2016-11-29,173.36
2016-11-30,173.64
2016-12-01,174.55
2016-12-02,171.21
2016-12-05,173.4
2016-12-06,174.65
2016-12-07,178.19
2016-12-08,176.52
2016-12-09,175.2
2016-12-12,172.15
2016-12-13,173.33
2016-12-14,173.9
2016-12-15,173.07
2016-12-16,173.09
2016-12-19,173.29
2016-12-20,174.85
2016-12-21,175.68
2016-12-22,173.85
2016-12-23,175.06
2016-12-27,175.61
2016-12-28,175.74
2016-12-29,173.87
2016-12-30,171.51
2017-01-03,174.65
2017-01-04,176.15
2017-01-05,175.05
2017-01-06,174.65
2017-01-09,174.51
2017-01-10,174
2017-01-11,174.76
2017-01-12,173.34
2017-01-13,173.32
2017-01-17,172.82
2017-01-18,169.11
2017-01-19,168.24
2017-01-20,169.68
2017-01-23,167.51
2017-01-24,171.49
2017-01-25,170.89
2017-01-26,172
2017-01-27,172.78
2017-01-30,176.48
2017-01-31,175.67
2017-02-01,174.77
2017-02-02,175.06
2017-02-03,175.37
2017-02-06,177.13
2017-02-07,174.65
2017-02-08,173.65
2017-02-09,172.14
2017-02-10,171.99
2017-02-13,173.49
2017-02-14,173.74
2017-02-15,174.3
2017-02-16,179.31
2017-02-17,175.3
2017-02-21,176.74
2017-02-22,179.28
2017-02-23,179.37
2017-02-24,178.99
2017-02-27,176.32
2017-02-28,179.36
2017-03-01,183.48
2017-03-02,186.64
2017-03-03,189.64
2017-03-06,190.59
2017-03-07,190.11
2017-03-08,194.1
2017-03-09,197.78
2017-03-10,202.22
2017-03-13,202.5
2017-03-14,200.44
2017-03-15,200.03
2017-03-16,199.62
2017-03-17,198.72
2017-03-20,198.49
2017-03-21,195.43
2017-03-22,195.37
2017-03-23,196.17
2017-03-24,196.48
2017-03-27,198
2017-03-28,199.18
2017-03-29,201.12
2017-03-30,199.45
2017-03-31,199.71
2017-04-03,196.94
2017-04-04,199.14
2017-04-05,196.49
2017-04-06,204.63
2017-04-07,204.58
2017-04-10,202.04
2017-04-11,200.05
2017-04-12,199.21
2017-04-13,197.08
2017-04-17,199.97
2017-04-18,198.76
2017-04-19,198.9
2017-04-20,200.95
2017-04-21,199.58
2017-04-24,198.11
2017-04-25,199.39
2017-04-26,199.89
2017-04-27,201.13
2017-04-28,201.77
2017-05-01,202.33
2017-05-02,203.28
2017-05-03,199.25
2017-05-04,196.62
2017-05-05,202.02
2017-05-08,200.58
2017-05-09,202.09
2017-05-10,201.5
2017-05-11,202.5
2017-05-12,200.58
2017-05-15,199.7
2017-05-16,198.99
2017-05-17,196.02
2017-05-18,196.85
2017-05-19,196.96
2017-05-22,197.63
2017-05-23,196.51
2017-05-24,195.16
2017-05-25,194.54
2017-05-26,195.67
2017-05-30,195.39
2017-05-31,195.41
2017-06-01,196.85
2017-06-02,199.63
2017-06-05,197.08
2017-06-06,194.47
2017-06-07,194.29
2017-06-08,194.29
2017-06-09,194.72
2017-06-12,195.31
2017-06-13,193.85
2017-06-14,195.5
2017-06-15,195.44
2017-06-16,195.24
2017-06-19,197.73
2017-06-20,195.47
2017-06-21,197.69
2017-06-22,197.6
2017-06-23,199.24
2017-06-26,199.78
2017-06-27,197.3
2017-06-28,200.5
2017-06-29,197.83
2017-06-30,196.9
2017-07-03,196.71
2017-07-05,196.21
2017-07-06,192.83
2017-07-07,194.78
2017-07-10,193.1
2017-07-11,191.2
2017-07-12,194.15
2017-07-13,194.96
2017-07-14,196.46
2017-07-17,198.25
2017-07-18,199.74
2017-07-19,206.15
2017-07-20,210.6
2017-07-21,210.64
2017-07-24,214.15
2017-07-25,215.29
2017-07-26,217.28
2017-07-27,218.6
2017-07-28,219.82
2017-07-31,219.72
2017-08-01,219.44
2017-08-02,217.45
2017-08-03,216.87
2017-08-04,216.66
2017-08-07,216.94
2017-08-08,215.28
2017-08-09,215.96
2017-08-10,215.04
2017-08-11,215.66
2017-08-14,216.44
2017-08-15,216.09
2017-08-16,217.42
2017-08-17,208.15
2017-08-18,209.69
2017-08-21,212.46
2017-08-22,213.76
2017-08-23,211.55
2017-08-24,214.52
2017-08-25,215.82
2017-08-28,213.16
2017-08-29,210.36
2017-08-30,211.08
2017-08-31,212.51
2017-09-01,209.44
2017-09-05,223.79
2017-09-06,225.8
2017-09-07,220.49
2017-09-08,220.01
2017-09-11,224.17
2017-09-12,224.54
2017-09-13,222.09
2017-09-14,218.63
2017-09-15,219.59
2017-09-18,216.81
2017-09-19,214.51
2017-09-20,214.64
2017-09-21,213.48
2017-09-22,213.6
2017-09-25,209.96
2017-09-26,209.62
2017-09-27,216.17
2017-09-28,215.49
2017-09-29,214.1
2017-10-02,214.57
2017-10-03,213.21
2017-10-04,214.74
2017-10-05,214.25
2017-10-06,211.73
2017-10-09,209.58
2017-10-10,209.18
2017-10-11,210.83
2017-10-12,215.08
2017-10-13,214.25
2017-10-16,217.75
2017-10-17,214.01
2017-10-18,209.98
2017-10-19,214.92
2017-10-20,219.38
2017-10-23,219.61
2017-10-24,217.18
2017-10-25,214.2
2017-10-26,216.24
2017-10-27,224.15
2017-10-30,220.27
2017-10-31,222.69
2017-11-01,225.75
2017-11-02,221
2017-11-03,228.9
2017-11-06,227.31
2017-11-07,225.17
2017-11-08,229.06
2017-11-09,229.69
2017-11-10,229.63
2017-11-13,225
2017-11-14,222.71
2017-11-15,221.18
2017-11-16,219.07
2017-11-17,218.46
2017-11-20,215
2017-11-21,214.9
2017-11-22,214.15
2017-11-24,214.98
2017-11-27,214.31
2017-11-28,213.93
2017-11-29,215.57
2017-11-30,216.65
2017-12-01,217.07
2017-12-04,218.5
2017-12-05,212.25
2017-12-06,211.59
2017-12-07,213.24
2017-12-08,214.09
2017-12-11,213.2
2017-12-12,212.45
2017-12-13,210.83
2017-12-14,209.87
2017-12-15,210.13
2017-12-18,213.38
2017-12-19,214.03
2017-12-20,212.23
2017-12-21,213.97
2017-12-22,211.51
2017-12-26,211.81
2017-12-27,212.72
2017-12-28,213.03
2017-12-29,210.85
2018-01-02,209.43
2018-01-03,211.3
2018-01-04,211.08
2018-01-05,212.87
2018-01-08,210.33
2018-01-09,210.41
2018-01-10,207.9
2018-01-11,211.64
2018-01-12,212.99
2018-01-16,211.56
2018-01-17,211.33
2018-01-18,210.44
2018-01-19,212
2018-01-22,211.3
2018-01-23,211.04
2018-01-24,214.07
2018-01-25,212.08
2018-01-26,214
2018-01-29,214.61
2018-01-30,214.23
2018-01-31,215.84
2018-02-01,217.75
2018-02-02,220.69
2018-02-05,220.94
2018-02-06,218.49
2018-02-07,217.03
2018-02-08,210.77
2018-02-09,209.24
2018-02-12,208.74
2018-02-13,210.03
2018-02-14,219.96
2018-02-15,226.15
2018-02-16,226.98
2018-02-20,229.98
2018-02-21,232.14
2018-02-22,229.56
2018-02-23,231.97
2018-02-26,246.78
2018-02-27,242.76
2018-02-28,244.2
2018-03-01,240
2018-03-02,239.33
2018-03-05,242.92
2018-03-06,242.56
2018-03-07,242.56
2018-03-08,244.36
2018-03-09,244.62
2018-03-12,249.78
2018-03-13,246.85
2018-03-14,247.81
2018-03-15,247.35
2018-03-16,243.87
2018-03-19,238.36
2018-03-20,241.94
2018-03-21,244.06
2018-03-22,244.4
2018-03-23,241.66
2018-03-26,245.31
2018-03-27,243.6
2018-03-28,242.52
2018-03-29,245.8
2018-04-02,242.82
2018-04-03,241.76
2018-04-04,242.33
2018-04-05,244.78
2018-04-06,245.12
2018-04-09,245.72
2018-04-10,245.71
2018-04-11,244.25
2018-04-12,240.67
2018-04-13,241.48
2018-04-16,242.72
2018-04-17,242.65
2018-04-18,244.18
2018-04-19,243.57
2018-04-20,244.65
2018-04-23,242.39
2018-04-24,241.52
2018-04-25,240.99
2018-04-26,242.5
2018-04-27,245.13
2018-04-30,243.02
2018-05-01,238.91
2018-05-02,237.96
2018-05-03,246.79
2018-05-04,251.06
2018-05-07,250.57
2018-05-08,249.38
2018-05-09,251.31
2018-05-10,252.88
2018-05-11,254.2
2018-05-14,260.9
2018-05-15,266.55
2018-05-16,267.22
2018-05-17,266.56
2018-05-18,266.83
2018-05-21,265.27
2018-05-22,263.54
2018-05-23,264
2018-05-24,265.48
2018-05-25,265.57
2018-05-29,263.23
2018-05-30,264.67
2018-05-31,262.04
2018-06-01,263.68
2018-06-04,263.68
2018-06-05,265.47
2018-06-06,268.41
2018-06-07,271.55
2018-06-08,274.34
2018-06-11,275.51
2018-06-12,276.29
2018-06-13,273.7
2018-06-14,274.55
2018-06-15,274.9
2018-06-18,280
2018-06-19,276.01
2018-06-20,282.38
2018-06-21,278.66
2018-06-22,278.64
2018-06-25,273.5
2018-06-26,271.66
2018-06-27,266.23
2018-06-28,303.29
2018-06-29,310.19
2018-07-02,321.37
2018-07-03,316.33
2018-07-05,319.05
2018-07-06,327.3
2018-07-09,322.02
2018-07-10,320.19
2018-07-11,319.83
2018-07-12,321.17
2018-07-13,326.32
2018-07-16,325.24
2018-07-17,324.6
2018-07-18,323
2018-07-19,322.98
2018-07-20,323.74
2018-07-23,321.56
2018-07-24,313.21
2018-07-25,314.59
2018-07-26,315.32
2018-07-27,310.73
2018-07-30,309.61
2018-07-31,312.18
2018-08-01,309.55
2018-08-02,312.97
2018-08-03,311.14
2018-08-06,315.14
2018-08-07,320.16
2018-08-08,316.52
2018-08-09,318.44
2018-08-10,319.44
2018-08-13,309.55
2018-08-14,312.86
2018-08-15,309.86
2018-08-16,303.11
2018-08-17,298.17
2018-08-20,297.22
2018-08-21,303
2018-08-22,297.95
2018-08-23,297.25
2018-08-24,296.49
2018-08-27,293.93
2018-08-28,299.41
2018-08-29,302.95
2018-08-30,303.52
2018-08-31,301.94
2018-09-04,307.52
2018-09-05,302.12
2018-09-06,300.71
2018-09-07,308.4
2018-09-10,313.81
2018-09-11,310.45
2018-09-12,311.62
2018-09-13,312.53
2018-09-14,309.1
2018-09-17,304.43
2018-09-18,307.14
2018-09-19,303.26
2018-09-20,305.27
2018-09-21,304.16
2018-09-24,303.35
2018-09-25,309.55
2018-09-26,306.84
2018-09-27,311.4
2018-09-28,315.32
2018-10-01,309.75
2018-10-02,310.13
2018-10-03,308.75
2018-10-04,309.47
2018-10-05,300.62
2018-10-08,290.9
2018-10-09,291.45
2018-10-10,280.77
2018-10-11,280.71
2018-10-12,288.01
2018-10-15,291.45
2018-10-16,298.95
2018-10-17,292.16
2018-10-18,285.96
2018-10-19,287.41
2018-10-22,286.37
2018-10-23,281.74
2018-10-24,272.26
2018-10-25,276.35
2018-10-26,270.93
2018-10-29,271.15
2018-10-30,275.85
2018-10-31,276.62
2018-11-01,271.25
2018-11-02,262.09
2018-11-05,273.99
2018-11-06,274.63
2018-11-07,277.43
2018-11-08,272.5
2018-11-09,271.04
2018-11-12,264.76
2018-11-13,262.66
2018-11-14,252.56
2018-11-15,256.35
2018-11-16,257.59
2018-11-19,250.91
2018-11-20,254.21
2018-11-21,260
2018-11-23,261.13
2018-11-26,264.92
2018-11-27,261.03
2018-11-28,274.63
2018-11-29,272.21
2018-11-30,270.02
2018-12-03,270.11
2018-12-04,262
2018-12-06,271.02
2018-12-07,271.48
2018-12-10,279.18
2018-12-11,268.99
2018-12-12,266.55
2018-12-13,262.76
2018-12-14,261.49
2018-12-17,265
2018-12-18,259.21
2018-12-19,257.4
2018-12-20,252.68
2018-12-21,247.02
2018-12-24,242.54
2018-12-26,255.55
2018-12-27,258.16
2018-12-28,262.35
2018-12-31,267.7
2019-01-02,265.61
2019-01-03,260.78
2019-01-04,266.32
2019-01-07,268.48
2019-01-08,269.4
2019-01-09,270.73
2019-01-10,277.62
2019-01-11,280.09
2019-01-14,274.4
2019-01-15,271.64
2019-01-16,271.09
2019-01-17,271.66
2019-01-18,274.59
2019-01-22,273.72
2019-01-23,274.32
2019-01-24,277.52
2019-01-25,278.93
2019-01-28,279.94
2019-01-29,274.89
2019-01-30,276.87
2019-01-31,277.9
2019-02-01,279.06
2019-02-04,279.77
2019-02-05,287.49
2019-02-06,284.13
2019-02-07,283.22
2019-02-08,287.88
2019-02-11,288.38
2019-02-12,290.39
2019-02-13,289.35
2019-02-14,290.02
2019-02-15,291.71
2019-02-19,295.31
2019-02-20,295.18
2019-02-21,295.03
2019-02-22,297.43
2019-02-25,291.81
2019-02-26,289.16
2019-02-27,287.97
2019-02-28,288.14
2019-03-01,293.19
2019-03-04,289
2019-03-05,291.81
2019-03-06,294.32
2019-03-07,295.1
2019-03-08,293.51
2019-03-11,297.07
2019-03-12,296.01
2019-03-13,296.85
2019-03-14,295.02
2019-03-15,297.3
2019-03-18,294.48
2019-03-19,292.2
2019-03-20,291.67
2019-03-21,294.93
2019-03-22,286.64
2019-03-25,286.42
2019-03-26,286.11
2019-03-27,288.29
2019-03-28,293.5
2019-03-29,293.13
2019-04-01,293.07
2019-04-02,297.4
2019-04-03,298.7
2019-04-04,295.26
2019-04-05,297.25
2019-04-08,296.99
2019-04-09,300.21
2019-04-10,303.75
2019-04-11,303.79
2019-04-12,305.33
2019-04-15,307.3
2019-04-16,309.84
2019-04-17,307.72
2019-04-18,308.2
2019-04-22,304.14
2019-04-23,307.71
2019-04-24,309.79
2019-04-25,307.26
2019-04-26,312.05
2019-04-29,312.35
2019-04-30,312.44
2019-05-01,308.39
2019-05-02,308.85
2019-05-03,307.22
2019-05-06,309.56
2019-05-07,304.83
2019-05-08,295.3
2019-05-09,296.12
2019-05-10,301.69
2019-05-13,302.26
2019-05-14,302.41
2019-05-15,301.68
2019-05-16,304.49
2019-05-17,301.43
2019-05-20,303.42
2019-05-21,306.21
2019-05-22,302.28
2019-05-23,301.63
2019-05-24,298.39
2019-05-28,300.12
2019-05-29,296.76
2019-05-30,295.59
2019-05-31,295.84
2019-06-03,292.82
2019-06-04,299.99
2019-06-05,305.05
2019-06-06,302.37
2019-06-07,296.91
2019-06-10,292.7
2019-06-11,288.27
2019-06-12,287.94
2019-06-13,290.37
2019-06-14,293.15
2019-06-17,292.945
2019-06-18,290.26
2019-06-19,288.79
2019-06-20,287.08
2019-06-21,282.685
2019-06-24,279.29
2019-06-25,272.64
2019-06-26,275.38
2019-06-27,277.375
2019-06-28,279.785
2019-07-01,278.39
2019-07-02,281.28
2019-07-03,284.68
2019-07-04,284.68
2019-07-05,285.315
2019-07-08,281.45
2019-07-09,283.17
2019-07-10,285.71
2019-07-11,287
2019-07-12,290.29
2019-07-15,289.62
2019-07-16,289.02
2019-07-17,287.09
2019-07-18,285.12
2019-07-19,282.54
2019-07-22,284.105
2019-07-23,284.62
2019-07-24,285.79
2019-07-25,287.595
2019-07-26,289.33
2019-07-29,287.5
2019-07-30,289.63
2019-07-31,290.665
2019-08-01,289.86
2019-08-02,289.42
2019-08-05,281.22
2019-08-06,285.89
2019-08-07,288.71
2019-08-08,296.33
2019-08-09,293.85
2019-08-12,287.16
2019-08-13,290.725
2019-08-14,285.76
2019-08-15,287.39
2019-08-16,290.605
2019-08-19,294.11
2019-08-20,266.87
2019-08-21,261.06
2019-08-22,261.77
2019-08-23,254.11
2019-08-26,252.285
2019-08-27,249.32
2019-08-28,250.685
2019-08-29,248.065
2019-08-30,252.475
2019-09-02,252.47
2019-09-03,249.2
2019-09-04,248.295
2019-09-05,253.72
2019-09-06,253.56
2019-09-09,252.685
2019-09-10,254.74
2019-09-11,258.345
2019-09-12,264.605
2019-09-13,268.59
2019-09-16,270.67
2019-09-17,272.015
2019-09-18,268.385
2019-09-19,269.47
2019-09-20,269.105
2019-09-23,272.89
2019-09-24,265.18
2019-09-25,266.1
2019-09-26,264.6
2019-09-27,262.61
2019-09-30,263.605
2019-10-01,263.48
2019-10-02,260.34
2019-10-03,263.19
2019-10-04,267.05
2019-10-07,266.64
2019-10-08,262.21
2019-10-09,262.29
2019-10-10,263.45
2019-10-11,264.37
2019-10-14,263.73
2019-10-15,265.94
2019-10-16,266.28
2019-10-17,267.81
2019-10-18,265.36
2019-10-21,265.735
2019-10-22,266.67
2019-10-23,269.25
2019-10-24,268.235
2019-10-25,267.28
2019-10-28,267.76
2019-10-29,269.67
2019-10-30,267.95
2019-10-31,266.875
2019-11-01,270.39
2019-11-04,265.46
2019-11-05,271.075
2019-11-06,275.38
2019-11-07,278.745
2019-11-08,278.62
2019-11-11,269.8
2019-11-12,275.57
2019-11-13,275.79
2019-11-14,273.665
2019-11-15,270.895
2019-11-18,275.35
2019-11-19,277.09
2019-11-20,274.73
2019-11-21,274.245
2019-11-22,275.01
2019-11-25,274.375
