date,close
2014-06-17,5.5899
2014-06-26,5.5899
2014-07-01,5.5899
2014-07-02,5.3029
2014-07-14,5.3029
2014-07-25,5.2953
2014-08-14,6.0431
2014-08-15,5.3633
2014-08-21,5.6654
2014-08-28,6.7985
2014-08-29,8.3093
2014-09-03,9.0572
2014-09-11,9.4424
2014-09-18,9.0572
2014-09-23,9.0572
2014-09-24,9.0572
2014-09-30,9.4424
2014-10-07,9.0647
2014-11-17,9.0572
2014-11-18,9.0572
2014-11-19,9.0572
2014-11-20,9.0572
2014-11-21,9.0572
2014-11-24,9.0572
2014-11-25,9.0572
2014-11-26,9.0572
2014-11-28,9.0572
2014-12-01,9.0572
2014-12-02,9.0572
2014-12-03,9.0572
2014-12-04,9.0572
2014-12-05,9.0572
2014-12-08,9.0572
2014-12-09,9.0572
2014-12-10,9.0572
2014-12-11,9.0572
2014-12-12,9.0572
2014-12-15,9.0572
2014-12-16,9.0572
2014-12-17,9.0572
2014-12-18,9.0572
2014-12-19,9.0572
2014-12-22,9.0572
2014-12-23,9.0572
2014-12-24,9.0572
2014-12-26,8.9439
2014-12-29,9.0586
2014-12-30,9.0586
2014-12-31,9.9461
2015-01-02,9.9461
2015-01-05,9.9461
2015-01-06,9.9461
2015-01-07,9.9461
2015-01-08,9.9461
2015-01-09,9.9461
2015-01-12,9.9461
2015-01-13,9.9461
2015-01-14,9.9461
2015-01-15,9.9461
2015-01-16,9.9461
2015-01-20,9.9461
2015-01-21,9.9461
2015-01-22,9.9461
2015-01-23,9.9461
2015-01-26,9.9461
2015-01-27,9.9461
2015-01-28,9.9461
2015-01-29,9.9461
2015-01-30,9.9461
2015-02-02,9.9461
2015-02-03,9.9461
2015-02-04,9.9461
2015-02-05,9.9461
2015-02-06,9.9461
2015-02-09,9.9461
2015-02-10,9.9461
2015-02-11,9.9461
2015-02-12,9.9461
2015-02-13,9.9461
2015-02-17,9.9461
2015-02-18,9.9461
2015-02-19,9.9461
2015-02-20,9.9461
2015-02-23,9.9461
2015-02-24,9.9461
2015-02-25,9.9461
2015-02-26,9.9461
2015-02-27,9.5636
2015-03-02,9.8384
2015-03-03,9.7285
2015-03-04,9.7285
2015-03-05,9.7242
2015-03-06,9.7242
2015-03-09,9.7242
2015-03-10,9.9308
2015-03-11,9.9461
2015-03-12,9.9461
2015-03-13,9.9461
2015-03-16,9.7166
2015-03-17,9.7166
2015-03-18,9.7166
2015-03-19,9.7166
2015-03-20,9.7166
2015-03-23,9.7166
2015-03-24,9.7166
2015-03-25,9.9079
2015-03-26,9.9079
2015-03-27,9.9079
2015-03-30,9.9079
2015-03-31,9.9155
2015-04-01,9.9461
2015-04-02,9.9461
2015-04-06,9.6502
2015-04-07,9.7395
2015-04-08,9.7395
2015-04-09,9.4259
2015-04-10,9.4259
2015-04-13,9.4259
2015-04-14,9.7625
2015-04-15,9.7625
2015-04-16,9.7625
2015-04-17,9.9461
2015-04-20,9.181
2015-04-21,9.181
2015-04-22,9.181
2015-04-23,9.181
2015-04-24,9.181
2015-04-27,9.181
2015-04-28,9.181
2015-04-29,9.181
2015-04-30,9.181
2015-05-01,9.181
2015-05-04,9.181
2015-05-05,9.0051
2015-05-06,9.0051
2015-05-07,9.0051
2015-05-08,9.0051
2015-05-11,9.2239
2015-05-12,9.0676
2015-05-13,9.2239
2015-05-14,9.2239
2015-05-15,8.5908
2015-05-18,8.7706
2015-05-19,8.6767
2015-05-20,8.6767
2015-05-21,8.6767
2015-05-22,8.6767
2015-05-26,8.6767
2015-05-27,8.6767
2015-05-28,9.263
2015-05-29,9.263
2015-06-01,9.263
2015-06-02,9.263
2015-06-03,9.263
2015-06-04,8.5986
2015-06-05,8.5907
2015-06-08,8.5986
2015-06-09,8.5986
2015-06-10,8.4579
2015-06-11,8.4579
2015-06-12,8.5986
2015-06-15,8.7315
2015-06-16,8.7432
2015-06-17,8.708
2015-06-18,8.8644
2015-06-19,8.7393
2015-06-22,8.8707
2015-06-23,8.9113
2015-06-24,8.9204
2015-06-25,8.9191
2015-06-26,8.9089
2015-06-29,8.7627
2015-06-30,8.9191
2015-07-01,8.9113
2015-07-02,8.9191
2015-07-06,8.9269
2015-07-07,8.9425
2015-07-08,9.3802
2015-07-09,9.3802
2015-07-10,9.2865
2015-07-13,9.5366
2015-07-14,9.3642
2015-07-15,9.6226
2015-07-16,9.3832
2015-07-17,9.7582
2015-07-20,9.8858
2015-07-21,9.7582
2015-07-22,9.7582
2015-07-23,9.7582
2015-07-24,9.7582
2015-07-27,9.5747
2015-07-28,9.5747
2015-07-29,9.5747
2015-07-30,9.5747
2015-07-31,9.5747
2015-08-03,9.696
2015-08-04,9.7069
2015-08-05,9.8259
2015-08-06,9.8939
2015-08-07,9.9737
2015-08-10,10.0534
2015-08-11,9.9896
2015-08-12,10.0295
2015-08-13,9.992
2015-08-14,9.9765
2015-08-17,10.1572
2015-08-18,10.0933
2015-08-19,10.0535
2015-08-20,10.0535
2015-08-21,9.7344
2015-08-24,9.7343
2015-08-25,9.7742
2015-08-26,9.5747
2015-08-27,9.5747
2015-08-28,9.5747
2015-08-31,9.5747
2015-09-01,9.5747
2015-09-02,9.7662
2015-09-03,9.7662
2015-09-04,9.7662
2015-09-08,9.7024
2015-09-09,9.7024
2015-09-10,9.7024
2015-09-11,9.7662
2015-09-14,9.5466
2015-09-15,9.5466
2015-09-16,9.5466
2015-09-17,9.6553
2015-09-18,9.7661
2015-09-21,9.7742
2015-09-22,9.7742
2015-09-23,9.8859
2015-09-24,9.8859
2015-09-25,10.0854
2015-09-28,9.7343
2015-09-29,10.1492
2015-09-30,10.1492
2015-10-01,10.3567
2015-10-02,10.7636
2015-10-05,10.6519
2015-10-06,10.6519
2015-10-07,10.6439
2015-10-08,10.6439
2015-10-09,10.6439
2015-10-12,10.6439
2015-10-13,10.6918
2015-10-14,10.6918
2015-10-15,10.6918
2015-10-16,9.2918
2015-10-19,9.2556
2015-10-20,9.1758
2015-10-21,8.7768
2015-10-22,8.9603
2015-10-23,9.0162
2015-10-26,8.8327
2015-10-27,8.8327
2015-10-28,9.1359
2015-10-29,9.1359
2015-10-30,9.1358
2015-11-02,10.2928
2015-11-03,10.8753
2015-11-04,11.1625
2015-11-05,11.2113
2015-11-06,11.2326
2015-11-09,10.9269
2015-11-10,10.9675
2015-11-11,11.2409
2015-11-12,11.1876
2015-11-13,11.1876
2015-11-16,11.2519
2015-11-17,11.3738
2015-11-18,11.3413
2015-11-19,11.2925
2015-11-20,11.0489
2015-11-23,11.3738
2015-11-24,11.2925
2015-11-25,11.2925
2015-11-27,11.2925
2015-11-30,11.26
2015-12-01,11.3656
2015-12-02,11.2113
2015-12-03,11.3242
2015-12-04,11.13
2015-12-07,11.13
2015-12-08,11.325
2015-12-09,11.1382
2015-12-10,11.0488
2015-12-11,11.0497
2015-12-14,11.3575
2015-12-15,11.3738
2015-12-16,11.6175
2015-12-17,11.2925
2015-12-18,11.3738
2015-12-21,11.0894
2015-12-22,11.0894
2015-12-23,11.1495
2015-12-24,11.1495
2015-12-28,11.1495
2015-12-29,11.2925
2015-12-30,11.6987
2015-12-31,12.1455
2016-01-04,11.5037
2016-01-05,11.5362
2016-01-06,11.2194
2016-01-07,10.8213
2016-01-08,10.8457
2016-01-11,10.7888
2016-01-12,10.7238
2016-01-13,10.7238
2016-01-14,10.7157
2016-01-15,10.6068
2016-01-19,10.5203
2016-01-20,10.5203
2016-01-21,10.4801
2016-01-22,10.671
2016-01-25,10.671
2016-01-26,10.7034
2016-01-27,10.6426
2016-01-28,10.9675
2016-01-29,11.0488
2016-02-01,10.7157
2016-02-02,10.7238
2016-02-03,10.7113
2016-02-04,10.8201
2016-02-05,10.6156
2016-02-08,10.3597
2016-02-09,10.5874
2016-02-10,10.1361
2016-02-11,10.1444
2016-02-12,10.1444
2016-02-16,10.3514
2016-02-17,10.1029
2016-02-18,9.9953
2016-02-19,10.1444
2016-02-22,10.3431
2016-02-23,10.4963
2016-02-24,10.4342
2016-02-25,10.4342
2016-02-26,10.6698
2016-02-29,10.7738
2016-03-01,10.7691
2016-03-02,10.6827
2016-03-03,10.8068
2016-03-04,10.9164
2016-03-07,10.9311
2016-03-08,10.5585
2016-03-09,10.5585
2016-03-10,10.6954
2016-03-11,10.7655
2016-03-14,10.7655
2016-03-15,10.7655
2016-03-16,10.8297
2016-03-17,10.8297
2016-03-18,10.7655
2016-03-21,10.9642
2016-03-22,10.782
2016-03-23,10.5999
2016-03-24,10.5585
2016-03-28,10.3928
2016-03-29,10.9311
2016-03-30,10.931
2016-03-31,10.931
2016-04-01,11.0305
2016-04-04,11.9414
2016-04-05,12.1733
2016-04-06,12.314
2016-04-07,12.3223
2016-04-08,12.1319
2016-04-11,12.1319
2016-04-12,11.9288
2016-04-13,12.2326
2016-04-14,12.1732
2016-04-15,11.8503
2016-04-18,11.9367
2016-04-19,12.0076
2016-04-20,12.1733
2016-04-21,12.0242
2016-04-22,12.0076
2016-04-25,11.9662
2016-04-26,11.8917
2016-04-27,12.0033
2016-04-28,12.0905
2016-04-29,13.0842
2016-05-02,13.2498
2016-05-03,13.2338
2016-05-04,13.0014
2016-05-05,13.1949
2016-05-06,13.2791
2016-05-09,13.3254
2016-05-10,13.2454
2016-05-11,13.0519
2016-05-12,13.0014
2016-05-13,12.6648
2016-05-16,13.094
2016-05-17,13.2118
2016-05-18,13.136
2016-05-19,13.2286
2016-05-20,13.5905
2016-05-23,13.8766
2016-05-24,14.0701
2016-05-25,13.8008
2016-05-26,13.7672
2016-05-27,11.3857
2016-05-31,11.9327
2016-06-01,12.8415
2016-06-02,12.7069
2016-06-03,12.7826
2016-06-06,13.4895
2016-06-07,12.9088
2016-06-08,13.0351
2016-06-09,12.9341
2016-06-10,12.8331
2016-06-13,12.2777
2016-06-14,12.7658
2016-06-15,12.6395
2016-06-16,12.791
2016-06-17,12.993
2016-06-20,12.9677
2016-06-21,12.8499
2016-06-22,13.2286
2016-06-23,13.582
2016-06-24,13.6578
2016-06-27,13.3969
2016-06-28,14.1795
2016-06-29,14.7181
2016-06-30,15.9214
2016-07-01,15.568
2016-07-05,16.2496
2016-07-06,16.1991
2016-07-07,16.9228
2016-07-08,17.3773
2016-07-11,17.7139
2016-07-12,17.6718
2016-07-13,17.1669
2016-07-14,17.3857
2016-07-15,17.4614
2016-07-18,17.5961
2016-07-19,17.6297
2016-07-20,17.6802
2016-07-21,17.6213
2016-07-22,17.7139
2016-07-25,17.697
2016-07-26,17.7475
2016-07-27,17.6465
2016-07-28,17.6802
2016-07-29,17.7223
2016-08-01,17.6802
2016-08-02,16.7041
2016-08-03,17.007
2016-08-04,16.7258
2016-08-05,16.7429
2016-08-08,15.8482
2016-08-09,16.4446
2016-08-10,15.8567
2016-08-11,15.5585
2016-08-12,14.9706
2016-08-15,15.1325
2016-08-16,14.8769
2016-08-17,15.0388
2016-08-18,14.7491
2016-08-19,14.9109
2016-08-22,15.2944
2016-08-23,14.9195
2016-08-24,14.8343
2016-08-25,14.5786
2016-08-26,14.8513
2016-08-29,14.8428
2016-08-30,15.0814
2016-08-31,14.8769
2016-09-01,14.8769
2016-09-02,14.9791
2016-09-06,14.6127
2016-09-07,13.7522
2016-09-08,14.1185
2016-09-09,14.11
2016-09-12,13.7862
2016-09-13,13.1046
2016-09-14,13.8714
2016-09-15,13.8714
2016-09-16,14.11
2016-09-19,14.306
2016-09-20,14.3827
2016-09-21,14.6979
2016-09-22,14.4082
2016-09-23,14.715
2016-09-26,14.5105
2016-09-27,14.4764
2016-09-28,14.2463
2016-09-29,13.6499
2016-09-30,13.1898
2016-10-03,12.9512
2016-10-04,12.8405
2016-10-05,12.7638
2016-10-06,12.3548
2016-10-07,12.0395
2016-10-10,12.636
2016-10-11,11.8691
2016-10-12,12.014
2016-10-13,12.2185
2016-10-14,11.8521
2016-10-17,12.457
2016-10-18,12.0821
2016-10-19,12.2014
2016-10-20,11.5709
2016-10-21,11.2727
2016-10-24,11.5027
2016-10-25,11.4431
2016-10-26,11.7328
2016-10-27,12.132
2016-10-28,11.8456
2016-10-31,12.375
2016-11-01,11.0559
2016-11-02,10.7869
2016-11-03,10.8997
2016-11-04,11.2121
2016-11-07,10.2141
2016-11-08,10.379
2016-11-09,10.7088
2016-11-10,11.2121
2016-11-11,11.3249
2016-11-14,11.5939
2016-11-15,11.9931
2016-11-16,11.6373
2016-11-17,11.5071
2016-11-18,11.4638
2016-11-21,11.4724
2016-11-22,11.6981
2016-11-23,11.9671
2016-11-25,12.1059
2016-11-28,11.672
2016-11-29,11.889
2016-11-30,11.915
2016-12-01,12.1493
2016-12-02,11.9931
2016-12-05,12.3142
2016-12-06,12.5746
2016-12-07,12.8002
2016-12-08,13.3382
2016-12-09,13.4077
2016-12-12,13.2688
2016-12-13,13.1213
2016-12-14,13.2862
2016-12-15,13.2775
2016-12-16,13.5552
2016-12-19,13.5725
2016-12-20,13.4858
2016-12-21,13.4163
2016-12-22,13.4077
2016-12-23,13.4944
2016-12-27,13.1473
2016-12-28,12.9217
2016-12-29,12.8436
2016-12-30,13.5378
2017-01-03,13.2775
2017-01-04,13.3816
2017-01-05,13.4597
2017-01-06,13.4337
2017-01-09,12.0452
2017-01-10,12.2101
2017-01-11,12.3836
2017-01-12,12.2535
2017-01-13,12.1493
2017-01-17,12.184
2017-01-18,11.9237
2017-01-19,11.9237
2017-01-20,11.9844
2017-01-23,11.889
2017-01-24,11.8022
2017-01-25,11.9844
2017-01-26,12.1667
2017-01-27,12.2535
2017-01-30,11.8109
2017-01-31,11.2208
2017-02-01,11.5939
2017-02-02,11.6026
2017-02-03,11.7328
2017-02-06,11.5679
2017-02-07,11.5853
2017-02-08,11.5853
2017-02-09,11.939
2017-02-10,11.939
2017-02-13,11.7887
2017-02-14,11.7621
2017-02-15,11.8417
2017-02-16,11.7887
2017-02-17,12.2176
2017-02-21,12.1247
2017-02-22,12.0274
2017-02-23,11.9478
2017-02-24,11.8771
2017-02-27,11.9213
2017-02-28,11.5941
2017-03-01,11.8683
2017-03-02,11.8152
2017-03-03,12.1778
2017-03-06,12.3547
2017-03-07,12.4696
2017-03-08,12.337
2017-03-09,12.0186
2017-03-10,12.3016
2017-03-13,12.3989
2017-03-14,12.4696
2017-03-15,12.6465
2017-03-16,12.7615
2017-03-17,12.788
2017-03-20,12.6377
2017-03-21,12.5581
2017-03-22,12.5138
2017-03-23,12.4519
2017-03-24,12.337
2017-03-27,12.3458
2017-03-28,12.4608
2017-03-29,12.7172
2017-03-30,12.7261
2017-03-31,12.6553
2017-04-03,12.6377
2017-04-04,12.7172
2017-04-05,12.4254
2017-04-06,12.7615
2017-04-07,12.9826
2017-04-10,12.6819
2017-04-11,13.0445
2017-04-12,13.1594
2017-04-13,13.1771
2017-04-17,13.0179
2017-04-18,12.8853
2017-04-19,13.3452
2017-04-20,13.3717
2017-04-21,13.5751
2017-04-24,13.752
2017-04-25,13.8581
2017-04-26,13.6193
2017-04-27,13.871
2017-04-28,14.0238
2017-05-01,14.6981
2017-05-02,15.0846
2017-05-03,15.2734
2017-05-04,15.1925
2017-05-05,15.2734
2017-05-08,14.9947
2017-05-09,14.8239
2017-05-10,14.6172
2017-05-11,14.6531
2017-05-12,14.77
2017-05-15,14.77
2017-05-16,14.5812
2017-05-17,14.3385
2017-05-18,14.2396
2017-05-19,14.2845
2017-05-22,14.3834
2017-05-23,14.77
2017-05-24,14.4823
2017-05-25,14.4643
2017-05-26,14.5003
2017-05-30,14.5183
2017-05-31,14.5992
2017-06-01,14.77
2017-06-02,15.3004
2017-06-05,15.3273
2017-06-06,15.0307
2017-06-07,15.0666
2017-06-08,14.9947
2017-06-09,15.17
2017-06-12,15.9027
2017-06-13,16.0376
2017-06-14,16.1724
2017-06-15,16.2623
2017-06-16,16.1544
2017-06-19,16.514
2017-06-20,16.3612
2017-06-21,16.1364
2017-06-22,16.2713
2017-06-23,16.2443
2017-06-26,16.6398
2017-06-27,16.0016
2017-06-28,16.0465
2017-06-29,15.8308
2017-06-30,15.624
2017-07-03,16.1724
2017-07-05,15.8218
2017-07-06,15.6779
2017-07-07,15.7229
2017-07-10,15.8487
2017-07-11,15.9566
2017-07-12,16.1634
2017-07-13,15.9566
2017-07-14,15.9746
2017-07-17,16.0106
2017-07-18,15.8937
2017-07-19,15.8487
2017-07-20,15.8038
2017-07-21,15.6779
2017-07-24,14.8329
2017-07-25,15.3273
2017-07-26,15.6779
2017-07-27,15.2675
2017-07-28,15.3587
2017-07-31,15.1946
2017-08-01,15.1307
2017-08-02,14.6109
2017-08-03,14.9574
2017-08-04,14.7294
2017-08-07,14.7659
2017-08-08,14.5379
2017-08-09,14.0089
2017-08-10,13.5894
2017-08-11,13.7718
2017-08-14,13.8903
2017-08-15,13.8721
2017-08-16,13.9268
2017-08-17,13.5073
2017-08-18,14.0272
2017-08-21,13.5255
2017-08-22,13.4708
2017-08-23,13.2702
2017-08-24,13.1334
2017-08-25,13.1516
2017-08-28,13.863
2017-08-29,14.0728
2017-08-30,14.1275
2017-08-31,14.7477
2017-09-01,14.6838
2017-09-05,14.3281
2017-09-06,14.4832
2017-09-07,14.7203
2017-09-08,14.6382
2017-09-11,15.003
2017-09-12,14.8936
2017-09-13,15.0578
2017-09-14,15.0942
2017-09-15,15.4408
2017-09-18,15.5776
2017-09-19,15.6232
2017-09-20,15.2493
2017-09-21,15.3405
2017-09-22,15.4043
2017-09-25,15.2766
2017-09-26,15.076
2017-09-27,15.2858
2017-09-28,15.2219
2017-09-29,15.0942
2017-10-02,15.4864
2017-10-03,15.5685
2017-10-04,15.4408
2017-10-05,15.6871
2017-10-06,15.6597
2017-10-09,15.5959
2017-10-10,15.8603
2017-10-11,15.6871
2017-10-12,15.6779
2017-10-13,15.6962
2017-10-16,15.9424
2017-10-17,15.7327
2017-10-18,15.906
2017-10-19,16.0336
2017-10-20,16.0063
2017-10-23,15.8695
2017-10-24,15.9972
2017-10-25,16.0245
2017-10-26,16.3893
2017-10-27,16.4076
2017-10-30,16.4349
2017-10-31,15.3952
2017-11-01,14.7935
2017-11-02,14.1454
2017-11-03,14.2473
2017-11-06,14.3121
2017-11-07,14.525
2017-11-08,14.488
2017-11-09,14.6083
2017-11-10,14.7379
2017-11-13,15.0712
2017-11-14,15.0064
2017-11-15,14.3861
2017-11-16,14.7101
2017-11-17,14.812
2017-11-20,14.6916
2017-11-21,14.812
2017-11-22,14.3676
2017-11-24,14.9971
2017-11-27,14.4602
2017-11-28,14.6176
2017-11-29,14.3769
2017-11-30,14.5065
2017-12-01,14.2843
2017-12-04,14.4417
2017-12-05,14.3954
2017-12-06,14.2565
2017-12-07,14.8953
2017-12-08,14.6916
2017-12-11,14.5898
2017-12-12,14.6731
2017-12-13,14.812
2017-12-14,14.3491
2017-12-15,14.9046
2017-12-18,14.9323
2017-12-19,14.5713
2017-12-20,14.6176
2017-12-21,15.3767
2017-12-22,14.4047
2017-12-26,14.3676
2017-12-27,14.7935
2017-12-28,14.7194
2017-12-29,14.7564
2018-01-02,14.8953
2018-01-03,14.4972
2018-01-04,14.5528
2018-01-05,14.3399
2018-01-08,14.3121
2018-01-09,14.164
2018-01-10,14.562
2018-01-11,14.6731
2018-01-12,15.0619
2018-01-16,15.0527
2018-01-17,15.1638
2018-01-18,15.1267
2018-01-19,15.3026
2018-01-22,15.7377
2018-01-23,15.6452
2018-01-24,15.0527
2018-01-25,15.0619
2018-01-26,15.3674
2018-01-29,14.9694
2018-01-30,14.9971
2018-01-31,14.7009
2018-02-01,14.8953
2018-02-02,14.9508
2018-02-05,14.9971
2018-02-06,14.8583
2018-02-07,15.3304
2018-02-08,15.2749
2018-02-09,15.7449
2018-02-12,15.6509
2018-02-13,15.6509
2018-02-14,15.6415
2018-02-15,15.7919
2018-02-16,15.9235
2018-02-20,15.8389
2018-02-21,15.9517
2018-02-22,16.0363
2018-02-23,16.2619
2018-02-26,16.0927
2018-02-27,16.0551
2018-02-28,15.4629
2018-03-01,15.7637
2018-03-02,15.6509
2018-03-05,15.8953
2018-03-06,15.6603
2018-03-07,15.6697
2018-03-08,16.0551
2018-03-09,16.0739
2018-03-12,16.1679
2018-03-13,16.2995
2018-03-14,16.1867
2018-03-15,16.3277
2018-03-16,16.5063
2018-03-19,16.9198
2018-03-20,16.8164
2018-03-21,16.7788
2018-03-22,16.5345
2018-03-23,16.3371
2018-03-26,17.0044
2018-03-27,17.2958
2018-03-28,17.2958
2018-03-29,17.8504
2018-04-02,17.3428
2018-04-03,17.2958
2018-04-04,17.5026
2018-04-05,18.2452
2018-04-06,18.076
2018-04-09,17.8316
2018-04-10,17.9538
2018-04-11,18.3768
2018-04-12,18.5554
2018-04-13,18.029
2018-04-16,19.0912
2018-04-17,19.0442
2018-04-18,18.3204
2018-04-19,18.3862
2018-04-20,18.2734
2018-04-23,18.2264
2018-04-24,18.452
2018-04-25,17.7282
2018-04-26,17.8504
2018-04-27,17.6248
2018-04-30,17.9256
2018-05-01,19.0724
2018-05-02,19.721
2018-05-03,19.9654
2018-05-04,19.9654
2018-05-07,19.5706
2018-05-08,19.9842
2018-05-09,20.8114
2018-05-10,20.6328
2018-05-11,20.6798
2018-05-14,19.4766
2018-05-15,19.345
2018-05-16,19.5048
2018-05-17,19.674
2018-05-18,19.9315
2018-05-21,19.3402
2018-05-22,19.3593
2018-05-23,20.0269
2018-05-24,20.7517
2018-05-25,17.8239
2018-05-29,17.719
2018-05-30,17.7858
2018-05-31,17.6141
2018-06-01,17.8334
2018-06-04,18.2626
2018-06-05,18.5201
2018-06-06,18.7966
2018-06-07,18.3294
2018-06-08,18.6059
2018-06-11,19.3212
2018-06-12,19.1781
2018-06-13,19.1114
2018-06-14,19.7598
2018-06-15,19.6931
2018-06-18,19.7598
2018-06-19,20.0555
2018-06-20,20.3511
2018-06-21,20.3225
2018-06-22,20.7898
2018-06-25,21.4001
2018-06-26,21.9151
2018-06-27,21.9247
2018-06-28,22.3157
2018-06-29,22.1726
2018-07-02,22.6113
2018-07-03,22.3919
2018-07-05,22.2203
2018-07-06,22.287
2018-07-09,21.9342
2018-07-10,21.9533
2018-07-11,21.9151
2018-07-12,21.9342
2018-07-13,22.1726
2018-07-16,21.7148
2018-07-17,21.8197
2018-07-18,21.896
2018-07-19,22.2108
2018-07-20,22.8211
2018-07-23,23.4696
2018-07-24,24.5568
2018-07-25,25.129
2018-07-26,25.3388
2018-07-27,23.3647
2018-07-30,25.2625
2018-07-31,25.0813
2018-08-01,24.9954
2018-08-02,25.2625
2018-08-03,25.3493
2018-08-06,26.3332
2018-08-07,26.1499
2018-08-08,26.8444
2018-08-09,27.5485
2018-08-10,27.5968
2018-08-13,26.7672
2018-08-14,27.6836
2018-08-15,27.3556
2018-08-16,27.4231
2018-08-17,28.0405
2018-08-20,27.7125
2018-08-21,28.0308
2018-08-22,27.5196
2018-08-23,27.5485
2018-08-24,26.7093
2018-08-27,26.6611
2018-08-28,26.1209
2018-08-29,25.7544
2018-08-30,25.0599
2018-08-31,23.4973
2018-09-04,26.1595
2018-09-05,25.793
2018-09-06,26.1209
2018-09-07,25.4168
2018-09-10,24.5969
2018-09-11,25.3107
2018-09-12,26.227
2018-09-13,25.4843
2018-09-14,25.629
2018-09-17,25.2239
2018-09-18,25.002
2018-09-19,24.6065
2018-09-20,24.9634
2018-09-21,24.7995
2018-09-24,25.0213
2018-09-25,25.6579
2018-09-26,24.8284
2018-09-27,26.4682
2018-09-28,26.2367
2018-10-01,25.2625
2018-10-02,24.4811
2018-10-03,24.3847
2018-10-04,23.6227
2018-10-05,23.7288
2018-10-08,24.0953
2018-10-09,24.6162
2018-10-10,23.6902
2018-10-11,22.8124
2018-10-12,22.4941
2018-10-15,22.0986
2018-10-16,23.179
2018-10-17,23.7481
2018-10-18,22.9282
2018-10-19,22.2047
2018-10-22,23.0825
2018-10-23,22.8703
2018-10-24,21.6453
2018-10-25,22.7642
2018-10-26,22.6967
2018-10-29,22.7256
2018-10-30,23.9506
2018-10-31,24.9249
2018-11-01,25.0695
2018-11-02,25.4599
2018-11-05,24.7378
2018-11-06,24.5133
2018-11-07,25.3721
2018-11-08,25.4306
2018-11-09,25.0305
2018-11-12,25.3623
2018-11-13,24.7085
2018-11-14,24.484
2018-11-15,24.4645
2018-11-16,24.5036
2018-11-19,23.8205
2018-11-20,23.4204
2018-11-21,23.3228
2018-11-23,23.1764
2018-11-26,23.0691
2018-11-27,23.3618
2018-11-28,24.1425
2018-11-29,24.3962
2018-11-30,24.1815
2018-12-03,24.8744
2018-12-04,23.7619
2018-12-06,23.6448
2018-12-07,24.5036
2018-12-10,23.596
2018-12-11,22.9032
2018-12-12,23.1471
2018-12-13,21.6541
2018-12-14,21.3418
2018-12-17,20.3074
2018-12-18,21.1759
2018-12-19,21.1564
2018-12-20,20.1903
2018-12-21,19.0876
2018-12-24,18.5021
2018-12-26,20.0049
2018-12-27,20.0147
2018-12-28,19.7414
2018-12-31,20.1513
2019-01-02,20.1513
2019-01-03,20.2196
2019-01-04,20.5904
2019-01-07,20.0049
2019-01-08,19.8878
2019-01-09,20.7563
2019-01-10,21.2345
2019-01-11,21.8492
2019-01-14,21.4784
2019-01-15,22.1322
2019-01-16,21.9761
2019-01-17,21.7029
2019-01-18,21.8395
2019-01-22,22.0737
2019-01-23,22.2396
2019-01-24,22.0737
2019-01-25,22.8056
2019-01-28,23.3325
2019-01-29,22.6494
2019-01-30,23.8888
2019-01-31,25.1476
2019-02-01,25.6355
2019-02-04,25.3721
2019-02-05,25.7917
2019-02-06,25.8014
2019-02-07,25.8795
2019-02-08,25.86
2019-02-11,26.3284
2019-02-12,25.9478
2019-02-13,26.3479
2019-02-14,26.3479
2019-02-15,27.3841
2019-02-19,26.8413
2019-02-20,24.2855
2019-02-21,24.542
2019-02-22,24.4039
2019-02-25,25.2229
2019-02-26,24.9565
2019-02-27,25.3611
2019-02-28,24.621
2019-03-01,25.3907
2019-03-04,27.5617
2019-03-05,25.9532
2019-03-06,25.1933
2019-03-07,25.2624
2019-03-08,25.292
2019-03-11,26.4861
2019-03-12,25.0157
2019-03-13,23.2
2019-03-14,23.3283
2019-03-15,23.8513
2019-03-18,23.6342
2019-03-19,22.7954
2019-03-20,22.5783
2019-03-21,21.9763
2019-03-22,20.5652
2019-03-25,21.4138
2019-03-26,20.9994
2019-03-27,21.1178
2019-03-28,21.2165
2019-03-29,21.552
2019-04-01,21.3941
2019-04-02,21.3152
2019-04-03,21.848
2019-04-04,21.5816
2019-04-05,22.1342
2019-04-08,21.5323
2019-04-09,21.1375
2019-04-10,21.7888
2019-04-11,21.5915
2019-04-12,21.7691
2019-04-15,21.7592
2019-04-16,22.2625
2019-04-17,22.1638
2019-04-18,22.6868
2019-04-22,21.9171
2019-04-23,22.5783
2019-04-24,22.2921
2019-04-25,22.0947
2019-04-26,23.052
2019-04-29,23.1506
2019-04-30,23.0618
2019-05-01,22.746
2019-05-02,22.45
2019-05-03,22.53
2019-05-06,22.89
2019-05-07,22.27
2019-05-08,22
2019-05-09,21.32
2019-05-10,21.41
2019-05-13,19.66
2019-05-14,20.42
2019-05-15,20.49
2019-05-16,20.23
2019-05-17,20.15
2019-05-20,20.23
2019-05-21,20.56
2019-05-22,20.21
2019-05-23,20.17
2019-05-24,20.49
2019-05-28,19.83
2019-05-29,19
2019-05-30,17.85
2019-05-31,17.02
2019-06-03,17.11
2019-06-04,17.4
2019-06-05,16.66
2019-06-06,16.27
2019-06-07,16.86
2019-06-10,17.17
2019-06-11,17.19
2019-06-12,17.58
2019-06-13,17.95
2019-06-14,17.75
2019-06-17,17.805
2019-06-18,17.15
2019-06-19,17.4
2019-06-20,18.095
2019-06-21,18.23
2019-06-24,18.525
2019-06-25,18.285
2019-06-26,18.05
2019-06-27,18.3
2019-06-28,19.04
2019-07-01,18.3
2019-07-02,18.28
2019-07-03,18.57
2019-07-04,18.57
2019-07-05,18.715
2019-07-08,18.94
2019-07-09,18.98
2019-07-10,19.28
2019-07-11,18.62
2019-07-12,19.175
2019-07-15,18.8
2019-07-16,18.78
2019-07-17,18.525
2019-07-18,18.375
2019-07-19,18.45
2019-07-22,18.08
2019-07-23,17.95
2019-07-24,18.52
2019-07-25,18.08
2019-07-26,18.255
2019-07-29,18.1
2019-07-30,17.235
2019-07-31,16.98
2019-08-01,16.73
2019-08-02,16.865
2019-08-05,16.515
2019-08-06,16.2
2019-08-07,16.945
2019-08-08,18.645
2019-08-09,18.82
2019-08-12,18.97
2019-08-13,19.28
2019-08-14,18.895
2019-08-15,18.505
2019-08-16,18.52
2019-08-19,18.97
2019-08-20,18.31
2019-08-21,18.745
2019-08-22,18.235
2019-08-23,17.79
2019-08-26,18.02
2019-08-27,17.83
2019-08-28,18.38
2019-08-29,18.58
2019-08-30,18.81
2019-09-02,18.81
2019-09-03,18.825
2019-09-04,18.82
2019-09-05,18.78
2019-09-06,18.73
2019-09-09,18.955
2019-09-10,19.035
2019-09-11,19.4
2019-09-12,19.5
2019-09-13,19.75
2019-09-16,19.69
2019-09-17,19.755
2019-09-18,19.78
2019-09-19,19.785
2019-09-20,19.64
2019-09-23,19.89
2019-09-24,19.435
2019-09-25,19.85
2019-09-26,19.38
2019-09-27,19.34
2019-09-30,19.09
2019-10-01,18.885
2019-10-02,18.675
2019-10-03,18.555
2019-10-04,18.89
2019-10-07,19.62
2019-10-08,19.38
2019-10-09,19.37
2019-10-10,18.93
2019-10-11,19.4
2019-10-14,19.27
2019-10-15,19.16
2019-10-16,19.27
2019-10-17,19.39
2019-10-18,18.85
2019-10-21,19.44
2019-10-22,19.665
2019-10-23,19.67
2019-10-24,19.1
2019-10-25,19.09
2019-10-28,19.39
2019-10-29,19.1
2019-10-30,19.49
2019-10-31,19.33
2019-11-01,19.43
2019-11-04,19.65
2019-11-05,20.735
2019-11-06,20.27
2019-11-07,21.22
2019-11-08,21
2019-11-11,20.77
2019-11-12,20.11
2019-11-13,19.56
2019-11-14,19
2019-11-15,21.39
2019-11-18,20.65
2019-11-19,20.76
2019-11-20,21
2019-11-21,20.79
2019-11-22,20.89
2019-11-25,21.47
