date,close
2014-06-13,16.6349
2014-06-16,16.8205
2014-06-17,16.8694
2014-06-18,16.9084
2014-06-19,16.7131
2014-06-20,16.8987
2014-06-23,16.9084
2014-06-24,16.8401
2014-06-25,16.8303
2014-06-26,16.8303
2014-06-27,16.9866
2014-06-30,17.1233
2014-07-01,17.4359
2014-07-02,17.5043
2014-07-03,17.6313
2014-07-07,17.5336
2014-07-08,17.6313
2014-07-09,17.6313
2014-07-10,17.5824
2014-07-11,17.5824
2014-07-14,17.6996
2014-07-15,17.6313
2014-07-16,17.6801
2014-07-17,17.5629
2014-07-18,17.6215
2014-07-21,17.6313
2014-07-22,17.8462
2014-07-23,17.8169
2014-07-24,17.8169
2014-07-25,17.5629
2014-07-28,17.2992
2014-07-29,17.2308
2014-07-30,17.221
2014-07-31,17.1917
2014-08-01,17.1038
2014-08-04,17.0843
2014-08-05,16.8108
2014-08-06,16.6545
2014-08-07,16.4689
2014-08-08,16.6154
2014-08-11,16.8401
2014-08-12,16.8596
2014-08-13,17.0647
2014-08-14,17.2796
2014-08-15,17.2015
2014-08-18,17.3675
2014-08-19,17.4652
2014-08-20,17.3871
2014-08-21,17.5336
2014-08-22,17.3871
2014-08-25,17.2015
2014-08-26,17.2112
2014-08-27,17.094
2014-08-28,16.9573
2014-08-29,16.9963
2014-09-02,17.1233
2014-09-03,17.0843
2014-09-04,17.0256
2014-09-05,16.9377
2014-09-08,16.7814
2014-09-09,16.6056
2014-09-10,16.6545
2014-09-11,16.6056
2014-09-12,16.7814
2014-09-15,16.7033
2014-09-16,16.6056
2014-09-17,16.6642
2014-09-18,16.8889
2014-09-19,16.8987
2014-09-22,16.8694
2014-09-23,16.6642
2014-09-24,16.5666
2014-09-25,16.3419
2014-09-26,16.3321
2014-09-29,16.0195
2014-09-30,15.9414
2014-10-01,15.7656
2014-10-02,15.6874
2014-10-03,15.9316
2014-10-06,15.9805
2014-10-07,15.8828
2014-10-08,16
2014-10-09,15.9121
2014-10-10,15.7363
2014-10-13,15.7363
2014-10-14,15.8144
2014-10-15,15.7656
2014-10-16,15.4432
2014-10-17,15.453
2014-10-20,15.5702
2014-10-21,16.127
2014-10-22,16.2247
2014-10-23,16.3712
2014-10-24,16.5861
2014-10-27,16.4298
2014-10-28,16.5763
2014-10-29,16.801
2014-10-30,17.4945
2014-10-31,17.1429
2014-11-03,16.9768
2014-11-04,17.0256
2014-11-05,17.0843
2014-11-06,17.5043
2014-11-07,17.348
2014-11-10,17.5141
2014-11-11,17.6117
2014-11-12,17.4945
2014-11-13,17.3968
2014-11-14,17.4652
2014-11-17,17.5238
2014-11-18,17.4945
2014-11-19,17.3089
2014-11-20,17.3187
2014-11-21,17.4359
2014-11-24,17.4359
2014-11-25,17.3382
2014-11-26,17.5824
2014-11-28,17.602
2014-12-01,17.7876
2014-12-02,17.6703
2014-12-03,17.8462
2014-12-04,18.1685
2014-12-05,18.3248
2014-12-08,18.0904
2014-12-09,18.0806
2014-12-10,17.7583
2014-12-11,18.188
2014-12-12,17.5629
2014-12-15,17.4261
2014-12-16,17.5922
2014-12-17,18.1099
2014-12-18,18.5983
2014-12-19,18.4615
2014-12-22,18.6276
2014-12-23,18.7351
2014-12-24,18.7351
2014-12-26,18.6081
2014-12-29,18.8523
2014-12-30,18.7644
2014-12-31,18.4909
2015-01-02,18.4615
2015-01-05,18.4322
2015-01-06,18.6471
2015-01-07,18.7546
2015-01-08,19.2039
2015-01-09,19.243
2015-01-12,19.4872
2015-01-13,19.5653
2015-01-14,19.5751
2015-01-15,19.7216
2015-01-16,19.8779
2015-01-20,20.0928
2015-01-21,20.0244
2015-01-22,20.1416
2015-01-23,20.0244
2015-01-26,19.8486
2015-01-27,19.7509
2015-01-28,19.7314
2015-01-29,19.9072
2015-01-30,19.6044
2015-02-02,19.7607
2015-02-03,20.0244
2015-02-04,20.0244
2015-02-05,21.011
2015-02-06,21.0696
2015-02-09,20.5421
2015-02-10,20.757
2015-02-11,20.9231
2015-02-12,21.0696
2015-02-13,20.9817
2015-02-17,21.1771
2015-02-18,21.4994
2015-02-19,21.265
2015-02-20,21.3822
2015-02-23,21.4799
2015-02-24,21.5385
2015-02-25,21.6459
2015-02-26,21.6752
2015-02-27,21.7045
2015-03-02,22.1441
2015-03-03,22.0659
2015-03-04,21.7631
2015-03-05,21.8315
2015-03-06,21.6166
2015-03-09,22.2418
2015-03-10,21.8706
2015-03-11,21.7436
2015-03-12,21.8901
2015-03-13,22.1148
2015-03-16,23.16
2015-03-17,23.0525
2015-03-18,23.16
2015-03-19,23.1209
2015-03-20,23.1404
2015-03-23,23.2088
2015-03-24,22.9744
2015-03-25,22.4469
2015-03-26,22.2906
2015-03-27,22.4957
2015-03-30,22.8767
2015-03-31,22.7106
2015-04-01,22.4469
2015-04-02,22.6227
2015-04-06,22.4078
2015-04-07,22.1929
2015-04-08,22.3492
2015-04-09,22.0464
2015-04-10,22.2222
2015-04-13,22.1636
2015-04-14,22.0171
2015-04-15,21.9585
2015-04-16,22.0073
2015-04-17,21.6459
2015-04-20,21.7338
2015-04-21,21.812
2015-04-22,22.0464
2015-04-23,21.9585
2015-04-24,21.7729
2015-04-27,21.4994
2015-04-28,21.685
2015-04-29,21.6459
2015-04-30,21.3529
2015-05-01,21.6557
2015-05-04,22.105
2015-05-05,21.685
2015-05-06,21.431
2015-05-07,22.0464
2015-05-08,22.1441
2015-05-11,22.2125
2015-05-12,22.232
2015-05-13,22.4371
2015-05-14,22.613
2015-05-15,22.6716
2015-05-18,22.7692
2015-05-19,22.7497
2015-05-20,22.7009
2015-05-21,22.4664
2015-05-22,22.3297
2015-05-26,22.0366
2015-05-27,22.1441
2015-05-28,22.0464
2015-05-29,21.9683
2015-06-01,22.2613
2015-06-02,22.2906
2015-06-03,22.3688
2015-06-04,22.2808
2015-06-05,21.9683
2015-06-08,21.5775
2015-06-09,21.3724
2015-06-10,21.6459
2015-06-11,21.5287
2015-06-12,21.4799
2015-06-15,21.1673
2015-06-16,21.3333
2015-06-17,21.1184
2015-06-18,21.0989
2015-06-19,21.2943
2015-06-22,21.4506
2015-06-23,21.3236
2015-06-24,21.1478
2015-06-25,21.0403
2015-06-26,21.2747
2015-06-29,20.9329
2015-06-30,20.8352
2015-07-01,21.1184
2015-07-02,20.9622
2015-07-06,21.1282
2015-07-07,21.2454
2015-07-08,20.9719
2015-07-09,20.7277
2015-07-10,21.0891
2015-07-13,21.2064
2015-07-14,21.2845
2015-07-15,21.4994
2015-07-16,21.4799
2015-07-17,21.4994
2015-07-20,21.4994
2015-07-21,21.431
2015-07-22,21.5189
2015-07-23,21.4017
2015-07-24,21.2357
2015-07-27,21.011
2015-07-28,20.8547
2015-07-29,21.265
2015-07-30,21.5189
2015-07-31,21.6948
2015-08-03,21.7534
2015-08-04,21.7338
2015-08-05,23.0916
2015-08-06,22.1539
2015-08-07,22.3101
2015-08-10,22.2222
2015-08-11,22.3395
2015-08-12,22.232
2015-08-13,22.2125
2015-08-14,22.0953
2015-08-17,22.2711
2015-08-18,22.1734
2015-08-19,22.2222
2015-08-20,21.8706
2015-08-21,21.5385
2015-08-24,20.9622
2015-08-25,21.3724
2015-08-26,22.2515
2015-08-27,22.525
2015-08-28,22.8865
2015-08-31,22.4664
2015-09-01,21.9292
2015-09-02,22.1734
2015-09-03,22.0855
2015-09-04,21.812
2015-09-08,22.3688
2015-09-09,22.2906
2015-09-10,22.3981
2015-09-11,22.4567
2015-09-14,22.3101
2015-09-15,22.4664
2015-09-16,22.7302
2015-09-17,22.9158
2015-09-18,22.5837
2015-09-21,22.9255
2015-09-22,22.7204
2015-09-23,22.6618
2015-09-24,22.4762
2015-09-25,22.4957
2015-09-28,22.0562
2015-09-29,21.978
2015-09-30,23.0623
2015-10-01,23.16
2015-10-02,22.9646
2015-10-05,23.1111
2015-10-06,22.8767
2015-10-07,23.4921
2015-10-08,23.5605
2015-10-09,23.8633
2015-10-12,23.746
2015-10-13,23.7558
2015-10-14,23.3846
2015-10-15,23.3846
2015-10-16,23.6874
2015-10-19,23.4432
2015-10-20,23.453
2015-10-21,23.0427
2015-10-22,23.2283
2015-10-23,23.7167
2015-10-26,23.7851
2015-10-27,23.5409
2015-10-28,24.2735
2015-10-29,24.3224
2015-10-30,24.2051
2015-11-02,24.2149
2015-11-03,24.127
2015-11-04,24.2638
2015-11-05,24.3517
2015-11-06,24.381
2015-11-09,24.3907
2015-11-10,24.6935
2015-11-11,25.2503
2015-11-12,25.0452
2015-11-13,24.3712
2015-11-16,24.674
2015-11-17,24.6252
2015-11-18,24.6349
2015-11-19,24.4884
2015-11-20,24.7228
2015-11-23,24.674
2015-11-24,24.6838
2015-11-25,24.6447
2015-11-27,24.6935
2015-11-30,24.6154
2015-12-01,24.8401
2015-12-02,24.9964
2015-12-03,24.3614
2015-12-04,25.1526
2015-12-07,25.0159
2015-12-08,24.8108
2015-12-09,24.674
2015-12-10,24.5861
2015-12-11,24.0684
2015-12-14,24.3224
2015-12-15,24.0293
2015-12-16,24.2735
2015-12-17,23.873
2015-12-18,23.6093
2015-12-21,24.0293
2015-12-22,23.9805
2015-12-23,24.127
2015-12-24,24.1856
2015-12-28,24.3126
2015-12-29,24.7815
2015-12-30,24.6349
2015-12-31,24.4005
2016-01-04,23.6386
2016-01-05,23.746
2016-01-06,23.5116
2016-01-07,23.0916
2016-01-08,22.8865
2016-01-11,23.1697
2016-01-12,23.4628
2016-01-13,22.7595
2016-01-14,22.8669
2016-01-15,22.8767
2016-01-19,23.1404
2016-01-20,23.2869
2016-01-21,23.2186
2016-01-22,23.5116
2016-01-25,23.1893
2016-01-26,23.6288
2016-01-27,23.1795
2016-01-28,23.0134
2016-01-29,23.3651
2016-02-01,23.9316
2016-02-02,23.4335
2016-02-03,23.4432
2016-02-04,23.4628
2016-02-05,24.7131
2016-02-08,24.4298
2016-02-09,24.4591
2016-02-10,24.4591
2016-02-11,24.1368
2016-02-12,24.2344
2016-02-16,24.6838
2016-02-17,25.1429
2016-02-18,25.7778
2016-02-19,25.6899
2016-02-22,25.7094
2016-02-23,25.4261
2016-02-24,25.4652
2016-02-25,25.8559
2016-02-26,25.9145
2016-02-29,25.8169
2016-03-01,25.9634
2016-03-02,26.0513
2016-03-03,26.2467
2016-03-04,26.4518
2016-03-07,26.1587
2016-03-08,26.149
2016-03-09,26.0415
2016-03-10,25.8266
2016-03-11,25.9048
2016-03-14,25.7387
2016-03-15,25.348
2016-03-16,25.4652
2016-03-17,26.0904
2016-03-18,25.7094
2016-03-21,25.7583
2016-03-22,25.6899
2016-03-23,25.7387
2016-03-24,25.7387
2016-03-28,25.9829
2016-03-29,26.4909
2016-03-30,26.4323
2016-03-31,26.5592
2016-04-01,27.0086
2016-04-04,26.9109
2016-04-05,26.6178
2016-04-06,26.9597
2016-04-07,26.5983
2016-04-08,26.6374
2016-04-11,26.5592
2016-04-12,26.6569
2016-04-13,26.9597
2016-04-14,26.9011
2016-04-15,27.3895
2016-04-18,27.6239
2016-04-19,27.7314
2016-04-20,27.4677
2016-04-21,27.5751
2016-04-22,27.4579
2016-04-25,27.5263
2016-04-26,27.536
2016-04-27,27.7216
2016-04-28,27.6142
2016-04-29,27.243
2016-05-02,27.4481
2016-05-03,27.1355
2016-05-04,27.0769
2016-05-05,26.3834
2016-05-06,26.2955
2016-05-09,26.5299
2016-05-10,26.95
2016-05-11,26.8132
2016-05-12,26.6178
2016-05-13,26.2955
2016-05-16,26.4518
2016-05-17,26.0415
2016-05-18,26.1783
2016-05-19,26.2857
2016-05-20,26.6081
2016-05-23,26.5592
2016-05-24,27.0476
2016-05-25,27.0379
2016-05-26,27.0672
2016-05-27,27.2625
2016-05-31,27.536
2016-06-01,27.4481
2016-06-02,27.5751
2016-06-03,27.5849
2016-06-06,27.6239
2016-06-07,27.663
2016-06-08,27.536
2016-06-09,27.5458
2016-06-10,27.3016
2016-06-13,26.9109
2016-06-14,26.8718
2016-06-15,26.569
2016-06-16,26.5495
2016-06-17,26.2955
2016-06-20,26.4811
2016-06-21,26.442
2016-06-22,26.5299
2016-06-23,26.569
2016-06-24,25.6117
2016-06-27,24.8205
2016-06-28,25.2308
2016-06-29,25.6606
2016-06-30,26.2174
2016-07-01,26.2174
2016-07-05,26.1783
2016-07-06,26.2467
2016-07-07,26.1099
2016-07-08,26.3736
2016-07-11,26.3346
2016-07-12,26.3736
2016-07-13,26.5299
2016-07-14,26.5202
2016-07-15,26.0806
2016-07-18,25.3285
2016-07-19,25.5336
2016-07-20,25.8169
2016-07-21,25.7778
2016-07-22,25.7583
2016-07-25,25.6703
2016-07-26,26.0415
2016-07-27,26.2174
2016-07-28,26.2955
2016-07-29,26.149
2016-08-01,25.7876
2016-08-02,25.4066
2016-08-03,25.4457
2016-08-04,23.7265
2016-08-05,23.8242
2016-08-08,23.453
2016-08-09,23.453
2016-08-10,23.5702
2016-08-11,23.6874
2016-08-12,23.5214
2016-08-15,23.2381
2016-08-16,23.2576
2016-08-17,23.0721
2016-08-18,23.1307
2016-08-19,23.0623
2016-08-22,23.2967
2016-08-23,23.4335
2016-08-24,23.3651
2016-08-25,23.4432
2016-08-26,23.3749
2016-08-29,23.3358
2016-08-30,23.2479
2016-08-31,23.1111
2016-09-01,23.3163
2016-09-02,23.5702
2016-09-06,23.6581
2016-09-07,23.6679
2016-09-08,23.2674
2016-09-09,22.5837
2016-09-12,22.8376
2016-09-13,22.652
2016-09-14,22.6423
2016-09-15,22.5934
2016-09-16,22.1734
2016-09-19,22.525
2016-09-20,22.8572
2016-09-21,22.9841
2016-09-22,23.1404
2016-09-23,22.9353
2016-09-26,22.7985
2016-09-27,22.8572
2016-09-28,23.0818
2016-09-29,23.2576
2016-09-30,23.3944
2016-10-03,23.2967
2016-10-04,23.0916
2016-10-05,23.3553
2016-10-06,23.3065
2016-10-07,23.2479
2016-10-10,23.4335
2016-10-11,23.2381
2016-10-12,23.326
2016-10-13,23.0916
2016-10-14,23.1111
2016-10-17,22.9744
2016-10-18,23.1014
2016-10-19,23.1014
2016-10-20,22.9939
2016-10-21,22.8962
2016-10-24,23.1893
2016-10-25,23.2186
2016-10-26,23.2576
2016-10-27,22.652
2016-10-28,22.5543
2016-10-31,22.4567
2016-11-01,22.3981
2016-11-02,22.232
2016-11-03,23.0232
2016-11-04,22.9353
2016-11-07,23.1014
2016-11-08,22.8767
2016-11-09,22.6423
2016-11-10,22.7497
2016-11-11,22.7106
2016-11-14,23.0134
2016-11-15,23.0623
2016-11-16,23.0427
2016-11-17,23.7754
2016-11-18,23.7265
2016-11-21,23.6191
2016-11-22,23.9121
2016-11-23,23.707
2016-11-25,23.7949
2016-11-28,23.6874
2016-11-29,23.6484
2016-11-30,23.3749
2016-12-01,23.1893
2016-12-02,23.3553
2016-12-05,23.4335
2016-12-06,23.3456
2016-12-07,23.5702
2016-12-08,23.9414
2016-12-09,23.453
2016-12-12,23.5898
2016-12-13,23.8437
2016-12-14,23.4725
2016-12-15,23.5605
2016-12-16,23.4628
2016-12-19,23.453
2016-12-20,23.5018
2016-12-21,23.4432
2016-12-22,23.5018
2016-12-23,23.6288
2016-12-27,23.6386
2016-12-28,23.5507
2016-12-29,23.6972
2016-12-30,23.7754
2017-01-03,23.8633
2017-01-04,24
2017-01-05,24.0586
2017-01-06,24.0782
2017-01-09,24.0879
2017-01-10,23.9902
2017-01-11,24.0684
2017-01-12,24.2149
2017-01-13,24.1172
2017-01-17,23.9902
2017-01-18,24.0293
2017-01-19,23.6484
2017-01-20,23.5116
2017-01-23,23.2381
2017-01-24,23.58
2017-01-25,23.9707
2017-01-26,23.8633
2017-01-27,23.9023
2017-01-30,24.0782
2017-01-31,24.1075
2017-02-01,24.0586
2017-02-02,23.9316
2017-02-03,24.4396
2017-02-06,24.4689
2017-02-07,24.4786
2017-02-08,24.2344
2017-02-09,24.6154
2017-02-10,23.8926
2017-02-13,23.2869
2017-02-14,23.2186
2017-02-15,23.3553
2017-02-16,23.4139
2017-02-17,23.4139
2017-02-21,23.5018
2017-02-22,23.6972
2017-02-23,24
2017-02-24,24.2638
2017-02-27,24.1465
2017-02-28,23.6777
2017-03-01,23.7851
2017-03-02,23.7363
2017-03-03,23.707
2017-03-06,23.4921
2017-03-07,23.4139
2017-03-08,23.6294
2017-03-09,23.4629
2017-03-10,23.4727
2017-03-13,23.3258
2017-03-14,23.2964
2017-03-15,23.4923
2017-03-16,23.6392
2017-03-17,23.9427
2017-03-20,23.7077
2017-03-21,23.6587
2017-03-22,23.7273
2017-03-23,23.8056
2017-03-24,23.7958
2017-03-27,23.7371
2017-03-28,23.7469
2017-03-29,23.8154
2017-03-30,24.2267
2017-03-31,24.2463
2017-04-03,23.5021
2017-04-04,23.267
2017-04-05,23.0614
2017-04-06,22.8851
2017-04-07,23.3356
2017-04-10,23.6979
2017-04-11,23.835
2017-04-12,23.5216
2017-04-13,23.3356
2017-04-17,23.1985
2017-04-18,23.2475
2017-04-19,23.6
2017-04-20,23.786
2017-04-21,23.7175
2017-04-24,23.7469
2017-04-25,23.8448
2017-04-26,24.0896
2017-04-27,24.0602
2017-04-28,23.9133
2017-05-01,24.0015
2017-05-02,24.0407
2017-05-03,24.0994
2017-05-04,24.5499
2017-05-05,24.5107
2017-05-08,25.0101
2017-05-09,25.0003
2017-05-10,24.9905
2017-05-11,25.0395
2017-05-12,25.0297
2017-05-15,25.4704
2017-05-16,25.5781
2017-05-17,25.7152
2017-05-18,25.8327
2017-05-19,25.96
2017-05-22,26.244
2017-05-23,26.2636
2017-05-24,26.479
2017-05-25,26.5084
2017-05-26,26.5671
2017-05-30,26.6944
2017-05-31,26.7532
2017-06-01,27.1155
2017-06-02,27.0176
2017-06-05,26.949
2017-06-06,26.6944
2017-06-07,26.8805
2017-06-08,26.7333
2017-06-09,26.5861
2017-06-12,26.6253
2017-06-13,26.9394
2017-06-14,26.8314
2017-06-15,26.9884
2017-06-16,26.5468
2017-06-19,26.7431
2017-06-20,26.7431
2017-06-21,26.7824
2017-06-22,26.959
2017-06-23,27.2044
2017-06-26,27.489
2017-06-27,27.3221
2017-06-28,27.6362
2017-06-29,27.3712
2017-06-30,27.3123
2017-07-03,27.3614
2017-07-05,27.2534
2017-07-06,26.9884
2017-07-07,27.067
2017-07-10,26.8805
2017-07-11,27.0964
2017-07-12,27.2731
2017-07-13,27.2534
2017-07-14,27.381
2017-07-17,27.489
2017-07-18,27.5184
2017-07-19,27.7147
2017-07-20,27.9698
2017-07-21,28.0778
2017-07-24,28.1269
2017-07-25,28.2054
2017-07-26,28.3918
2017-07-27,28.3526
2017-07-28,28.3133
2017-07-31,28.4605
2017-08-01,28.5979
2017-08-02,28.333
2017-08-03,29.4321
2017-08-04,28.8138
2017-08-07,28.9218
2017-08-08,29.1573
2017-08-09,28.9512
2017-08-10,28.8531
2017-08-11,28.7746
2017-08-14,28.8825
2017-08-15,28.0189
2017-08-16,28.1759
2017-08-17,28.0091
2017-08-18,27.96
2017-08-21,27.8913
2017-08-22,28.068
2017-08-23,27.8128
2017-08-24,27.8128
2017-08-25,27.8619
2017-08-28,27.7834
2017-08-29,27.8521
2017-08-30,27.7343
2017-08-31,27.9208
2017-09-01,27.9306
2017-09-05,27.646
2017-09-06,27.5282
2017-09-07,27.6462
2017-09-08,27.5085
2017-09-11,27.7249
2017-09-12,27.8724
2017-09-13,27.7741
2017-09-14,27.5971
2017-09-15,27.6167
2017-09-18,27.6954
2017-09-19,27.6266
2017-09-20,27.7938
2017-09-21,27.7151
2017-09-22,27.7446
2017-09-25,28.0495
2017-09-26,28.197
2017-09-27,28.2757
2017-09-28,28.1577
2017-09-29,28.2757
2017-10-02,28.4429
2017-10-03,28.4625
2017-10-04,28.7478
2017-10-05,28.7773
2017-10-06,28.6592
2017-10-09,28.7674
2017-10-10,28.8264
2017-10-11,28.7871
2017-10-12,28.9248
2017-10-13,29.0526
2017-10-16,29.1313
2017-10-17,29.0526
2017-10-18,29.2297
2017-10-19,29.2493
2017-10-20,29.2002
2017-10-23,29.0821
2017-10-24,29.0526
2017-10-25,29.2198
2017-10-26,29.8689
2017-10-27,29.9181
2017-10-30,29.7018
2017-10-31,29.9476
2017-11-01,29.7214
2017-11-02,29.7706
2017-11-03,29.7411
2017-11-06,29.9575
2017-11-07,29.7018
2017-11-08,30.6853
2017-11-09,30.6262
2017-11-10,30.6656
2017-11-13,30.5869
2017-11-14,30.5476
2017-11-15,30.4394
2017-11-16,30.7738
2017-11-17,30.7541
2017-11-20,30.7541
2017-11-21,30.9213
2017-11-22,31.0393
2017-11-24,31.3147
2017-11-27,31.354
2017-11-28,31.8064
2017-11-29,31.4819
2017-11-30,31.7081
2017-12-01,31.4721
2017-12-04,31.7179
2017-12-05,31.6294
2017-12-06,31.4229
2017-12-07,31.8564
2017-12-08,32.0732
2017-12-11,31.6495
2017-12-12,31.7086
2017-12-13,31.5707
2017-12-14,31.5805
2017-12-15,31.748
2017-12-18,32.1619
2017-12-19,32.1816
2017-12-20,32.0634
2017-12-21,32.0042
2017-12-22,31.8269
2017-12-26,31.7973
2017-12-27,31.7973
2017-12-28,31.6889
2017-12-29,31.2751
2018-01-02,31.9156
2018-01-03,32.0042
2018-01-04,32.4378
2018-01-05,32.7334
2018-01-08,33.0881
2018-01-09,33.0684
2018-01-10,32.8713
2018-01-11,32.8122
2018-01-12,32.6349
2018-01-16,32.6349
2018-01-17,32.8319
2018-01-18,33.4429
2018-01-19,33.8961
2018-01-22,33.9848
2018-01-23,33.8764
2018-01-24,33.6695
2018-01-25,33.8468
2018-01-26,34.2508
2018-01-29,33.8271
2018-01-30,33.5315
2018-01-31,33.4429
2018-02-01,33.6793
2018-02-02,32.8319
2018-02-05,31.7678
2018-02-06,31.6791
2018-02-07,31.7875
2018-02-08,30.9893
2018-02-09,31.482
2018-02-12,31.8269
2018-02-13,29.8759
2018-02-14,30.3784
2018-02-15,30.9893
2018-02-16,31.1273
2018-02-20,30.8021
2018-02-21,30.9992
2018-02-22,31.0879
2018-02-23,31.5214
2018-02-26,31.1667
2018-02-27,30.8612
2018-02-28,30.9105
2018-03-01,30.8415
2018-03-02,31.216
2018-03-05,31.078
2018-03-06,31.1864
2018-03-07,30.9992
2018-03-08,31.3498
2018-03-09,31.8832
2018-03-12,31.8931
2018-03-13,31.8733
2018-03-14,31.4881
2018-03-15,31.5869
2018-03-16,32.1992
2018-03-19,32.1103
2018-03-20,32.0906
2018-03-21,31.8338
2018-03-22,31.1226
2018-03-23,30.6288
2018-03-26,31.4288
2018-03-27,31.0634
2018-03-28,31.2017
2018-03-29,31.5967
2018-04-02,31.1128
2018-04-03,31.4288
2018-04-04,31.3399
2018-04-05,31.814
2018-04-06,30.9547
2018-04-09,30.9844
2018-04-10,31.3399
2018-04-11,31.2708
2018-04-12,31.5078
2018-04-13,31.419
2018-04-16,31.7647
2018-04-17,31.9029
2018-04-18,32.219
2018-04-19,31.9721
2018-04-20,31.7054
2018-04-23,31.6758
2018-04-24,31.2708
2018-04-25,31.014
2018-04-26,31.5078
2018-04-27,31.3696
2018-04-30,31.498
2018-05-01,31.419
2018-05-02,31.2807
2018-05-03,31.7054
2018-05-04,29.2756
2018-05-07,29.483
2018-05-08,29.9176
2018-05-09,30.1251
2018-05-10,30.6189
2018-05-11,30.7868
2018-05-14,30.3226
2018-05-15,30.2436
2018-05-16,30.214
2018-05-17,29.9868
2018-05-18,30.1843
2018-05-21,30.2238
2018-05-22,30.2041
2018-05-23,30.1349
2018-05-24,30.0658
2018-05-25,29.7794
2018-05-29,29.7794
2018-05-30,30.046
2018-05-31,29.6608
2018-06-01,29.9868
2018-06-04,30.1053
2018-06-05,30.3325
2018-06-06,30.6782
2018-06-07,30.3465
2018-06-08,30.3564
2018-06-11,30.2376
2018-06-12,30.4059
2018-06-13,30.4455
2018-06-14,30.5841
2018-06-15,30.6336
2018-06-18,30.5346
2018-06-19,30.2574
2018-06-20,30.0792
2018-06-21,29.9208
2018-06-22,29.9901
2018-06-25,29.5148
2018-06-26,29.2772
2018-06-27,28.6336
2018-06-28,28.6831
2018-06-29,28.6435
2018-07-02,28.8713
2018-07-03,28.7326
2018-07-05,28.9604
2018-07-06,29.2376
2018-07-09,29.4257
2018-07-10,29.4257
2018-07-11,29.5643
2018-07-12,29.5742
2018-07-13,29.6336
2018-07-16,29.6138
2018-07-17,29.8019
2018-07-18,29.9208
2018-07-19,30.1485
2018-07-20,30.2277
2018-07-23,30.4257
2018-07-24,30.3069
2018-07-25,30.5445
2018-07-26,30.4752
2018-07-27,30.2574
2018-07-30,29.8911
2018-07-31,30.0792
2018-08-01,30.4455
2018-08-02,30.495
2018-08-03,30.5643
2018-08-06,30.9703
2018-08-07,30.9208
2018-08-08,29.8515
2018-08-09,30.1386
2018-08-10,30.0594
2018-08-13,29.9307
2018-08-14,29.5841
2018-08-15,29.9802
2018-08-16,29.9109
2018-08-17,30.2178
2018-08-20,30.4158
2018-08-21,30.2673
2018-08-22,30.3663
2018-08-23,29.9703
2018-08-24,30.2079
2018-08-27,30.2475
2018-08-28,29.9802
2018-08-29,30.2475
2018-08-30,30.0099
2018-08-31,30.3366
2018-09-04,30.3168
2018-09-05,30.0792
2018-09-06,30.1386
2018-09-07,29.955
2018-09-10,29.9649
2018-09-11,29.9649
2018-09-12,30.4612
2018-09-13,30.5009
2018-09-14,30.3619
2018-09-17,30.0741
2018-09-18,30.0741
2018-09-19,29.9649
2018-09-20,30.4115
2018-09-21,30.61
2018-09-24,30.481
2018-09-25,30.4016
2018-09-26,30.4016
2018-09-27,30.3818
2018-09-28,30.3818
2018-10-01,30.1038
2018-10-02,30.0443
2018-10-03,30.2825
2018-10-04,29.7862
2018-10-05,29.6473
2018-10-08,29.4686
2018-10-09,29.2999
2018-10-10,28.1485
2018-10-11,27.8706
2018-10-12,27.8607
2018-10-15,27.8706
2018-10-16,28.6647
2018-10-17,28.8334
2018-10-18,28.6349
2018-10-19,28.5456
2018-10-22,28.4165
2018-10-23,27.9302
2018-10-24,27.1163
2018-10-25,26.9972
2018-10-26,26.5307
2018-10-29,26.491
2018-10-30,26.5208
2018-10-31,27.2056
2018-11-01,27.2354
2018-11-02,27.1461
2018-11-05,27.1361
2018-11-06,27.1957
2018-11-07,29.1907
2018-11-08,28.8036
2018-11-09,29.8954
2018-11-12,29.6473
2018-11-13,29.6274
2018-11-14,28.8929
2018-11-15,29.1312
2018-11-16,29.6076
2018-11-19,29.1709
2018-11-20,28.8433
2018-11-21,29.0617
2018-11-23,29.0319
2018-11-26,29.3594
2018-11-27,29.0617
2018-11-28,29.7962
2018-11-29,30.0046
2018-11-30,30.1535
2018-12-03,30.0244
2018-12-04,28.8731
2018-12-06,28.4364
2018-12-07,28.2821
2018-12-10,28.0931
2018-12-11,28.0134
2018-12-12,28.2722
2018-12-13,28.0931
2018-12-14,27.2671
2018-12-17,27.0979
2018-12-18,27.0282
2018-12-19,27.1676
2018-12-20,26.879
2018-12-21,26.0729
2018-12-24,25.7545
2018-12-26,26.1625
2018-12-27,26.6003
2018-12-28,26.6003
2018-12-31,26.8591
2019-01-02,26.66
2019-01-03,26.3018
2019-01-04,26.9785
2019-01-07,27.1875
2019-01-08,27.6552
2019-01-09,27.685
2019-01-10,27.5656
2019-01-11,27.8542
2019-01-14,27.6651
2019-01-15,28.1727
2019-01-16,28.4115
2019-01-17,28.6901
2019-01-18,29.0783
2019-01-22,28.8295
2019-01-23,28.7897
2019-01-24,28.9091
2019-01-25,29.2275
2019-01-28,29.0982
2019-01-29,29.0982
2019-01-30,29.4763
2019-01-31,29.6853
2019-02-01,29.9739
2019-02-04,30.4814
2019-02-05,30.5212
2019-02-06,30.9491
2019-02-07,30.571
2019-02-08,32.5812
2019-02-11,32.4319
2019-02-12,32.4618
2019-02-13,32.2826
2019-02-14,32.5215
2019-02-15,32.7802
2019-02-19,32.8598
2019-02-20,33.0588
2019-02-21,33.0389
2019-02-22,33.1683
2019-02-25,33.2877
2019-02-26,33.1683
2019-02-27,33.0091
2019-02-28,33.0588
2019-03-01,33.3773
2019-03-04,33.3076
2019-03-05,33.2678
2019-03-06,33.2081
2019-03-07,33.1732
2019-03-08,33.3528
2019-03-11,33.6321
2019-03-12,33.6321
2019-03-13,33.7319
2019-03-14,33.8317
2019-03-15,34.0312
2019-03-18,34.0911
2019-03-19,34.0113
2019-03-20,34.0212
2019-03-21,34.5999
2019-03-22,34.0412
2019-03-25,34.1809
2019-03-26,34.6198
2019-03-27,34.4702
2019-03-28,34.9491
2019-03-29,35.0987
2019-04-01,35.3282
2019-04-02,35.3881
2019-04-03,35.6076
2019-04-04,35.398
2019-04-05,35.4379
2019-04-08,35.5078
2019-04-09,35.4878
2019-04-10,35.6375
2019-04-11,35.6774
2019-04-12,35.867
2019-04-15,35.7373
2019-04-16,35.9168
2019-04-17,35.8071
2019-04-18,35.8969
2019-04-22,35.9867
2019-04-23,36.3658
2019-04-24,36.2161
2019-04-25,36.0864
2019-04-26,36.1264
2019-04-29,35.9567
2019-04-30,36.2161
2019-05-01,35.6275
2019-05-02,35.8769
2019-05-03,36.2461
2019-05-06,36.1663
2019-05-07,35.9168
2019-05-08,35.9567
2019-05-09,35.9867
2019-05-10,36.0964
2019-05-13,35.0189
2019-05-14,35.8769
2019-05-15,36.1463
2019-05-16,36.5653
2019-05-17,36.2361
2019-05-20,36.2161
2019-05-21,36.3259
2019-05-22,36.1663
2019-05-23,35.9168
2019-05-24,35.9967
2019-05-28,35.9967
2019-05-29,35.6874
2019-05-30,35.9667
2019-05-31,36.0665
2019-06-03,35.8969
2019-06-04,36.1762
2019-06-05,36.3458
2019-06-06,36.705
2019-06-07,36.8946
2019-06-10,36.715
2019-06-11,36.8
2019-06-12,36.99
2019-06-13,36.83
2019-06-14,36.99
2019-06-17,37.27
2019-06-18,37.615
2019-06-19,37.82
2019-06-20,38.06
2019-06-21,37.77
2019-06-24,37.75
2019-06-25,37.825
2019-06-26,37.435
2019-06-27,37.625
2019-06-28,37.9
2019-07-01,38.62
2019-07-02,38.425
2019-07-03,38.73
2019-07-04,38.73
2019-07-05,38.47
2019-07-08,38.275
2019-07-09,38.34
2019-07-10,38.425
2019-07-11,38.35
2019-07-12,38.525
2019-07-15,38.66
2019-07-16,38.335
2019-07-17,38.215
2019-07-18,38.68
2019-07-19,38.525
2019-07-22,38.725
2019-07-23,39.15
2019-07-24,39.455
2019-07-25,40.4
2019-07-26,40.44
2019-07-29,40.56
2019-07-30,40.365
2019-07-31,39.68
2019-08-01,39.76
2019-08-02,39.23
2019-08-05,37.615
2019-08-06,38.07
2019-08-07,38.76
2019-08-08,41.96
2019-08-09,41.97
2019-08-12,41.345
2019-08-13,40.96
2019-08-14,39.815
2019-08-15,40.26
2019-08-16,40.805
2019-08-19,41.16
2019-08-20,40.935
2019-08-21,40.95
2019-08-22,40.645
2019-08-23,39.63
2019-08-26,39.925
2019-08-27,40.125
2019-08-28,40.285
2019-08-29,40.925
2019-08-30,40.985
2019-09-02,40.98
2019-09-03,40.765
2019-09-04,41.205
2019-09-05,41.6
2019-09-06,41.665
2019-09-09,40.785
2019-09-10,39.46
2019-09-11,39.125
2019-09-12,39.625
2019-09-13,39.29
2019-09-16,39.345
2019-09-17,39.91
2019-09-18,39.67
2019-09-19,39.74
2019-09-20,39.045
2019-09-23,38.945
2019-09-24,38.69
2019-09-25,38.795
2019-09-26,39.005
2019-09-27,38.145
2019-09-30,38.74
2019-10-01,38.675
2019-10-02,38.23
2019-10-03,38.295
2019-10-04,38.49
2019-10-07,38.36
2019-10-08,37.425
2019-10-09,37.65
2019-10-10,37.935
2019-10-11,38.42
2019-10-14,38.13
2019-10-15,38.64
2019-10-16,38.515
2019-10-17,39
2019-10-18,39.125
2019-10-21,39.1
2019-10-22,37.87
2019-10-23,38.045
2019-10-24,38.53
2019-10-25,38.195
2019-10-28,38.435
2019-10-29,38.805
2019-10-30,39.17
2019-10-31,39.175
2019-11-01,39.675
2019-11-04,39.94
2019-11-05,39.615
2019-11-06,40.195
2019-11-07,40.415
2019-11-08,39.36
2019-11-11,39.595
2019-11-12,39.765
2019-11-13,39.66
2019-11-14,40.295
2019-11-15,40.735
2019-11-18,40.445
2019-11-19,41.185
2019-11-20,40.82
2019-11-21,40.385
2019-11-22,39.745
2019-11-25,40.485
