date,close
2014-06-13,80.5504
2014-06-16,80.0859
2014-06-17,80.3591
2014-06-18,80.2134
2014-06-19,80.8327
2014-06-20,81.1515
2014-06-23,81.1424
2014-06-24,81.2881
2014-06-25,81.3154
2014-06-26,80.7234
2014-06-27,81.0786
2014-06-30,81.953
2014-07-01,81.7071
2014-07-02,81.7344
2014-07-03,81.9803
2014-07-07,82.6361
2014-07-08,82.2991
2014-07-09,82.7636
2014-07-10,83.2554
2014-07-11,83.4649
2014-07-14,83.7655
2014-07-15,83.4558
2014-07-16,83.8383
2014-07-17,82.7363
2014-07-18,84.2209
2014-07-21,83.6653
2014-07-22,84.5943
2014-07-23,84.6671
2014-07-24,84.1298
2014-07-25,83.9932
2014-07-28,84.1571
2014-07-29,84.1116
2014-07-30,87.6636
2014-07-31,85.9696
2014-08-01,87.0352
2014-08-04,87.0352
2014-08-05,86.3339
2014-08-06,87.1172
2014-08-07,88.5653
2014-08-08,89.3577
2014-08-11,89.2848
2014-08-12,88.0826
2014-08-13,88.538
2014-08-14,88.8477
2014-08-15,89.4488
2014-08-18,90.8787
2014-08-19,90.223
2014-08-20,89.8586
2014-08-21,90.1046
2014-08-22,89.3759
2014-08-25,90.0772
2014-08-26,89.804
2014-08-27,89.9862
2014-08-28,89.9679
2014-08-29,89.804
2014-09-02,89.9679
2014-09-03,89.3577
2014-09-04,89.804
2014-09-05,90.7421
2014-09-08,90.4962
2014-09-09,89.7676
2014-09-10,88.7748
2014-09-11,89.1027
2014-09-12,87.4451
2014-09-15,86.6527
2014-09-16,86.9532
2014-09-17,87.099
2014-09-18,87.3267
2014-09-19,86.9976
2014-09-22,86.2205
2014-09-23,85.8731
2014-09-24,86.1108
2014-09-25,85.1325
2014-09-26,85.4342
2014-09-29,85.5257
2014-09-30,85.5988
2014-10-01,85.4342
2014-10-02,85.4708
2014-10-03,85.8273
2014-10-06,85.8273
2014-10-07,85.352
2014-10-08,87.153
2014-10-09,86.6227
2014-10-10,86.5862
2014-10-13,85.0594
2014-10-14,85.3428
2014-10-15,84.0903
2014-10-16,84.5292
2014-10-17,85.1783
2014-10-20,86.0193
2014-10-21,87.3998
2014-10-22,86.7964
2014-10-23,87.6467
2014-10-24,87.9209
2014-10-27,87.9026
2014-10-28,88.1312
2014-10-29,86.897
2014-10-30,91.1847
2014-10-31,89.1368
2014-11-03,88.5517
2014-11-04,88.57
2014-11-05,89.274
2014-11-06,91.011
2014-11-07,90.9379
2014-11-10,90.7824
2014-11-11,90.9653
2014-11-12,91.1847
2014-11-13,91.3767
2014-11-14,90.9927
2014-11-17,91.0019
2014-11-18,92.0166
2014-11-19,92.1629
2014-11-20,92.0715
2014-11-21,93.3423
2014-11-24,93.6805
2014-11-25,95.2347
2014-11-26,95.7193
2014-11-28,96.0027
2014-12-01,94.613
2014-12-02,93.2234
2014-12-03,92.9583
2014-12-04,92.8943
2014-12-05,91.9161
2014-12-08,92.1264
2014-12-09,92.1355
2014-12-10,91.5778
2014-12-11,91.3767
2014-12-12,90.4682
2014-12-15,89.4311
2014-12-16,87.8986
2014-12-17,89.1467
2014-12-18,90.4682
2014-12-19,91.34
2014-12-22,92.3954
2014-12-23,92.3678
2014-12-24,92.4596
2014-12-26,92.3587
2014-12-29,92.3495
2014-12-30,92.0833
2014-12-31,90.7159
2015-01-02,91.4685
2015-01-05,90.147
2015-01-06,89.9084
2015-01-07,90.8536
2015-01-08,91.6979
2015-01-09,91.2299
2015-01-12,90.8352
2015-01-13,89.8258
2015-01-14,89.2568
2015-01-15,88.3574
2015-01-16,89.4036
2015-01-20,89.1375
2015-01-21,88.7887
2015-01-22,90.6976
2015-01-23,91.4042
2015-01-26,93.3865
2015-01-27,92.1292
2015-01-28,90.7435
2015-01-29,90.3213
2015-01-30,88.9723
2015-02-02,89.7982
2015-02-03,90.9362
2015-02-04,89.7982
2015-02-05,91.3951
2015-02-06,87.8527
2015-02-09,88.7429
2015-02-10,88.44
2015-02-11,88.0638
2015-02-12,88.0729
2015-02-13,88.4675
2015-02-17,88.3024
2015-02-18,88.284
2015-02-19,87.4214
2015-02-20,88.5868
2015-02-23,89.321
2015-02-24,86.8615
2015-02-25,89.7982
2015-02-26,90.7435
2015-02-27,90.9821
2015-03-02,91.2207
2015-03-03,90.1928
2015-03-04,90.4498
2015-03-05,91.0739
2015-03-06,88.6603
2015-03-09,88.6327
2015-03-10,86.7881
2015-03-11,86.8432
2015-03-12,88.3482
2015-03-13,86.4853
2015-03-16,86.8248
2015-03-17,86.3752
2015-03-18,87.6508
2015-03-19,86.8065
2015-03-20,89.6514
2015-03-23,89.6055
2015-03-24,89.165
2015-03-25,87.6141
2015-03-26,87.3663
2015-03-27,88.1372
2015-03-30,88.2473
2015-03-31,86.4027
2015-04-01,88.5226
2015-04-02,88.8163
2015-04-06,89.9726
2015-04-07,88.8989
2015-04-08,88.9726
2015-04-09,87.8758
2015-04-10,87.6269
2015-04-13,87.3596
2015-04-14,87.1016
2015-04-15,87.7191
2015-04-16,89.1846
2015-04-17,88.5763
2015-04-20,88.3367
2015-04-21,87.544
2015-04-22,88.4104
2015-04-23,88.521
2015-04-24,87.8574
2015-04-27,87.7375
2015-04-28,88.2629
2015-04-29,86.1891
2015-04-30,87.1292
2015-05-01,86.1614
2015-05-04,87.2306
2015-05-05,85.719
2015-05-06,85.59
2015-05-07,86.2997
2015-05-08,87.5163
2015-05-11,86.3181
2015-05-12,86.272
2015-05-13,85.6637
2015-05-14,87.3873
2015-05-15,88.0325
2015-05-18,87.7468
2015-05-19,87.9772
2015-05-20,86.9357
2015-05-21,86.5485
2015-05-22,86.9633
2015-05-26,87.203
2015-05-27,87.7099
2015-05-28,87.1937
2015-05-29,85.5254
2015-06-01,86.8527
2015-06-02,86.779
2015-06-03,85.4241
2015-06-04,87.2583
2015-06-05,85.2766
2015-06-08,85.5623
2015-06-09,84.8618
2015-06-10,85.4425
2015-06-11,86.1061
2015-06-12,85.9033
2015-06-15,85.4403
2015-06-16,86.3664
2015-06-17,87.1628
2015-06-18,89.0705
2015-06-19,88.8761
2015-06-22,88.7094
2015-06-23,89.1354
2015-06-24,88.0518
2015-06-25,87.737
2015-06-26,87.2739
2015-06-29,86.07
2015-06-30,86.3942
2015-07-01,87.0609
2015-07-02,87.8944
2015-07-06,87.9592
2015-07-07,88.5612
2015-07-08,87.4962
2015-07-09,87.4129
2015-07-10,88.3667
2015-07-13,88.626
2015-07-14,88.4223
2015-07-15,88.8575
2015-07-16,90.5893
2015-07-17,89.7836
2015-07-20,89.8855
2015-07-21,89.7836
2015-07-22,89.4039
2015-07-23,90.756
2015-07-24,89.6354
2015-07-27,89.3484
2015-07-28,89.5336
2015-07-29,89.2002
2015-07-30,87.9315
2015-07-31,88.0796
2015-08-03,88.3112
2015-08-04,89.015
2015-08-05,89.4965
2015-08-06,91.0894
2015-08-07,92.284
2015-08-10,93.0619
2015-08-11,93.5343
2015-08-12,92.5804
2015-08-13,92.8397
2015-08-14,93.6083
2015-08-17,93.951
2015-08-18,93.0619
2015-08-19,92.9786
2015-08-20,91.5432
2015-08-21,89.5521
2015-08-24,85.144
2015-08-25,82.8936
2015-08-26,84.7643
2015-08-27,86.9313
2015-08-28,86.5423
2015-08-31,85.3755
2015-09-01,83.3751
2015-09-02,84.4309
2015-09-03,84.292
2015-09-04,82.4398
2015-09-08,83.3937
2015-09-09,82.1434
2015-09-10,81.7915
2015-09-11,82.6621
2015-09-14,82.2638
2015-09-15,82.9306
2015-09-16,83.903
2015-09-17,84.755
2015-09-18,83.8011
2015-09-21,84.1362
2015-09-22,82.8889
2015-09-23,82.5724
2015-09-24,81.9395
2015-09-25,82.6934
2015-09-28,81.1762
2015-09-29,80.99
2015-09-30,81.8929
2015-10-01,82.2653
2015-10-02,83.5312
2015-10-05,86.9938
2015-10-06,86.91
2015-10-07,87.7198
2015-10-08,88.9578
2015-10-09,88.3714
2015-10-12,88.2411
2015-10-13,87.2172
2015-10-14,86.6215
2015-10-15,88.1015
2015-10-16,89.4791
2015-10-19,90.0934
2015-10-20,90.2051
2015-10-21,89.4139
2015-10-22,92.588
2015-10-23,92.3087
2015-10-26,92.6438
2015-10-27,92.4018
2015-10-28,93.8911
2015-10-29,94.9057
2015-10-30,95.157
2015-11-02,96.8604
2015-11-03,96.1344
2015-11-04,95.157
2015-11-05,93.8911
2015-11-06,91.2476
2015-11-09,90.3913
2015-11-10,90.4099
2015-11-11,90.866
2015-11-12,90.6146
2015-11-13,89.7118
2015-11-16,91.2662
2015-11-17,91.5455
2015-11-18,92.7648
2015-11-19,92.7369
2015-11-20,93.5374
2015-11-23,93.0255
2015-11-24,92.3925
2015-11-25,92.2343
2015-11-27,92.7834
2015-11-30,92.5042
2015-12-01,94.1704
2015-12-02,92.5787
2015-12-03,91.1173
2015-12-04,90.8008
2015-12-07,90.9311
2015-12-08,90.1772
2015-12-09,88.9299
2015-12-10,88.4924
2015-12-11,87.1986
2015-12-14,87.994
2015-12-15,89.463
2015-12-16,91.2315
2015-12-17,89.9122
2015-12-18,88.5179
2015-12-21,89.4162
2015-12-22,90.2209
2015-12-23,92.1672
2015-12-24,91.8304
2015-12-28,92.0456
2015-12-29,93.0187
2015-12-30,91.7929
2015-12-31,90.7169
2016-01-04,90.4829
2016-01-05,92.2701
2016-01-06,91.9426
2016-01-07,89.6502
2016-01-08,88.1717
2016-01-11,88.4057
2016-01-12,88.4057
2016-01-13,86.2255
2016-01-14,86.2816
2016-01-15,82.7072
2016-01-19,85.0652
2016-01-20,83.278
2016-01-21,84.2324
2016-01-22,87.2547
2016-01-25,85.2617
2016-01-26,86.5249
2016-01-27,86.5623
2016-01-28,86.5623
2016-01-29,88.2747
2016-02-01,87.1144
2016-02-02,85.4769
2016-02-03,84.6722
2016-02-04,85.2336
2016-02-05,83.1283
2016-02-08,79.9188
2016-02-09,80.0685
2016-02-10,80.3211
2016-02-11,78.2813
2016-02-12,80.1621
2016-02-16,80.8919
2016-02-17,80.6486
2016-02-18,81.8744
2016-02-19,81.706
2016-02-22,83.5026
2016-02-23,82.361
2016-02-24,83.3061
2016-02-25,83.671
2016-02-26,84.2231
2016-02-29,86.2722
2016-03-01,88.6115
2016-03-02,88.5367
2016-03-03,89.1729
2016-03-04,89.7718
2016-03-07,89.4537
2016-03-08,88.5179
2016-03-09,88.5179
2016-03-10,88.6209
2016-03-11,92.1298
2016-03-14,91.7555
2016-03-15,92.083
2016-03-16,93.393
2016-03-17,95.2083
2016-03-18,94.048
2016-03-21,93.8889
2016-03-22,93.5053
2016-03-23,93.1778
2016-03-24,93.8983
2016-03-28,93.7953
2016-03-29,95.3673
2016-03-30,95.7323
2016-03-31,95.7884
2016-04-01,97.7815
2016-04-04,97.9686
2016-04-05,97.3136
2016-04-06,98.9043
2016-04-07,98.2493
2016-04-08,99.3964
2016-04-11,99.6785
2016-04-12,99.829
2016-04-13,99.8854
2016-04-14,98.9169
2016-04-15,99.4622
2016-04-18,99.2366
2016-04-19,99.199
2016-04-20,98.5596
2016-04-21,96.444
2016-04-22,97.9672
2016-04-25,97.9578
2016-04-26,98.5126
2016-04-27,98.2493
2016-04-28,97.9108
2016-04-29,98.616
2016-05-02,99.2084
2016-05-03,97.939
2016-05-04,99.2084
2016-05-05,99.9606
2016-05-06,100.2051
2016-05-09,100.2803
2016-05-10,100.7786
2016-05-11,99.4152
2016-05-12,100.1957
2016-05-13,99.387
2016-05-16,100.1204
2016-05-17,99.0673
2016-05-18,98.3057
2016-05-19,97.5723
2016-05-20,97.798
2016-05-23,97.939
2016-05-24,99.0109
2016-05-25,99.829
2016-05-26,99.0109
2016-05-27,99.7255
2016-05-31,99.4622
2016-06-01,99.1708
2016-06-02,100.1957
2016-06-03,100.5812
2016-06-06,100.7974
2016-06-07,101.4274
2016-06-08,101.1359
2016-06-09,102.5558
2016-06-10,102.2925
2016-06-13,102.4241
2016-06-14,101.1829
2016-06-15,101.3247
2016-06-16,101.7593
2016-06-17,101.0506
2016-06-20,101.5042
2016-06-21,103.413
2016-06-22,103.3752
2016-06-23,105.3312
2016-06-24,102.3074
2016-06-27,102.8933
2016-06-28,104.6981
2016-06-29,106.7769
2016-06-30,107.3533
2016-07-01,107.3439
2016-07-05,107.5612
2016-07-06,106.21
2016-07-07,106.021
2016-07-08,107.4006
2016-07-11,108.3549
2016-07-12,109.7062
2016-07-13,109.6211
2016-07-14,110.5566
2016-07-15,110.3865
2016-07-18,109.8952
2016-07-19,110.9062
2016-07-20,111.2464
2016-07-21,111.0763
2016-07-22,111.3504
2016-07-25,110.4338
2016-07-26,110.5283
2016-07-27,111.133
2016-07-28,110.2259
2016-07-29,109.3944
2016-08-01,110.5944
2016-08-02,110.3109
2016-08-03,109.3566
2016-08-04,110.0086
2016-08-05,110.1598
2016-08-08,109.3566
2016-08-09,109.5361
2016-08-10,109.8385
2016-08-11,109.5078
2016-08-12,110.0842
2016-08-15,109.4133
2016-08-16,107.8352
2016-08-17,108.251
2016-08-18,108.0526
2016-08-19,107.3533
2016-08-22,108.3077
2016-08-23,108.8746
2016-08-24,108.2604
2016-08-25,107.9581
2016-08-26,106.9942
2016-08-29,107.5706
2016-08-30,106.9848
2016-08-31,107.136
2016-09-01,107.5518
2016-09-02,108.7518
2016-09-06,110.6984
2016-09-07,110.396
2016-09-08,109.8479
2016-09-09,104.1217
2016-09-12,105.1422
2016-09-13,102.1562
2016-09-14,102.4019
2016-09-15,103.0728
2016-09-16,102.0523
2016-09-19,103.1862
2016-09-20,102.6665
2016-09-21,104.0366
2016-09-22,106.0966
2016-09-23,106.7675
2016-09-26,106.484
2016-09-27,106.38
2016-09-28,106.9497
2016-09-29,107.7569
2016-09-30,107.6144
2016-10-03,106.5889
2016-10-04,105.0316
2016-10-05,102.0215
2016-10-06,103.0375
2016-10-07,103.0375
2016-10-10,103.9111
2016-10-11,103.4458
2016-10-12,105.9147
2016-10-13,107.0162
2016-10-14,107.6334
2016-10-17,107.6239
2016-10-18,108.3931
2016-10-19,109.5041
2016-10-20,109.0388
2016-10-21,109.8744
2016-10-24,110.8619
2016-10-25,110.8619
2016-10-26,109.8364
2016-10-27,109.58
2016-10-28,110.2732
2016-10-31,111.2798
2016-11-01,109.3426
2016-11-02,107.2156
2016-11-03,107.5575
2016-11-04,107.2821
2016-11-07,109.3806
2016-11-08,110.0833
2016-11-09,103.7117
2016-11-10,100.3787
2016-11-11,100.3787
2016-11-14,97.3971
2016-11-15,98.2707
2016-11-16,100.1129
2016-11-17,100.2173
2016-11-18,99.79
2016-11-21,100.5686
2016-11-22,102.5342
2016-11-23,101.3948
2016-11-25,101.8885
2016-11-28,100.7586
2016-11-29,100.7016
2016-11-30,97.1122
2016-12-01,95.8873
2016-12-02,97.3971
2016-12-05,96.8938
2016-12-06,95.7638
2016-12-07,97.0457
2016-12-08,97.2262
2016-12-09,97.7199
2016-12-12,98.6505
2016-12-13,100.7776
2016-12-14,101.1289
2016-12-15,100.7111
2016-12-16,100.4642
2016-12-19,101.5562
2016-12-20,101.5847
2016-12-21,101.2238
2016-12-22,101.2238
2016-12-23,101.2334
2016-12-27,101.4816
2016-12-28,101.052
2016-12-29,101.5771
2016-12-30,100.8992
2017-01-03,101.348
2017-01-04,101.5294
2017-01-05,101.1761
2017-01-06,100.5078
2017-01-09,100.2691
2017-01-10,98.8179
2017-01-11,99.1329
2017-01-12,99.4862
2017-01-13,98.7701
2017-01-17,100.4123
2017-01-18,100.8897
2017-01-19,99.7153
2017-01-20,99.4862
2017-01-23,100.04
2017-01-24,99.8395
2017-01-25,99.2189
2017-01-26,99.5817
2017-01-27,99.1234
2017-01-30,98.35
2017-01-31,98.8179
2017-02-01,98.6078
2017-02-02,99.4003
2017-02-03,100.4887
2017-02-06,98.9515
2017-02-07,98.7892
2017-02-08,99.5817
2017-02-09,100.9947
2017-02-10,100.7178
2017-02-13,102.6846
2017-02-14,101.9495
2017-02-15,102.2645
2017-02-16,102.8374
2017-02-17,103.2193
2017-02-21,106.1504
2017-02-22,105.9977
2017-02-23,107.1243
2017-02-24,107.7831
2017-02-27,108.2127
2017-02-28,109.5971
2017-03-01,108.6901
2017-03-02,109.6162
2017-03-03,110.4373
2017-03-06,109.5207
2017-03-07,109.5112
2017-03-08,108.1172
2017-03-09,107.8881
2017-03-10,108.4419
2017-03-13,109.0911
2017-03-14,108.862
2017-03-15,110.065
2017-03-16,109.8835
2017-03-17,110.7619
2017-03-20,110.7333
2017-03-21,111.4589
2017-03-22,112.9579
2017-03-23,113.5689
2017-03-24,113.9222
2017-03-27,114.581
2017-03-28,114.9438
2017-03-29,115.5644
2017-03-30,115.4403
2017-03-31,116.0418
2017-04-03,115.6694
2017-04-04,115.278
2017-04-05,115.1825
2017-04-06,116.4332
2017-04-07,116.5955
2017-04-10,117.536
2017-04-11,117.8047
2017-04-12,117.4304
2017-04-13,117.6511
2017-04-17,119.2345
2017-04-18,119.8199
2017-04-19,119.6376
2017-04-20,119.2825
2017-04-21,119.4073
2017-04-24,118.8507
2017-04-25,118.937
2017-04-26,117.8526
2017-04-27,120.6932
2017-04-28,120.8563
2017-05-01,122.3629
2017-05-02,122.7468
2017-05-03,121.672
2017-05-04,122.2478
2017-05-05,123.4953
2017-05-08,123.668
2017-05-09,122.9195
2017-05-10,121.9695
2017-05-11,121.1826
2017-05-12,121.029
2017-05-15,122.766
2017-05-16,123.1882
2017-05-17,125.4625
2017-05-18,122.814
2017-05-19,123.1402
2017-05-22,123.5337
2017-05-23,123.5337
2017-05-24,124.0807
2017-05-25,125.76
2017-05-26,125.8176
2017-05-30,126.7868
2017-05-31,125.8944
2017-06-01,126.5085
2017-06-02,127.1419
2017-06-05,126.2974
2017-06-06,126.3838
2017-06-07,126.4989
2017-06-08,125.6833
2017-06-09,125.0211
2017-06-12,123.9655
2017-06-13,124.9347
2017-06-14,125.2322
2017-06-15,126.2062
2017-06-16,127.2477
2017-06-19,127.6142
2017-06-20,126.5245
2017-06-21,125.9555
2017-06-22,126.2062
2017-06-23,127.1802
2017-06-26,127.7395
2017-06-27,130.9123
2017-06-28,129.7358
2017-06-29,128.0867
2017-06-30,127.6045
2017-07-03,126.727
2017-07-05,127.537
2017-07-06,126.8523
2017-07-07,128.3953
2017-07-10,126.5341
2017-07-11,126.2641
2017-07-12,129.1089
2017-07-13,129.3597
2017-07-14,131.192
2017-07-17,130.5748
2017-07-18,131.327
2017-07-19,130.5941
2017-07-20,131.3848
2017-07-21,132.0213
2017-07-24,132.1853
2017-07-25,131.7513
2017-07-26,132.9568
2017-07-27,130.054
2017-07-28,133.41
2017-07-31,131.4716
2017-08-01,133.0532
2017-08-02,133.0532
2017-08-03,132.2624
2017-08-04,132.6674
2017-08-07,133.1496
2017-08-08,131.7609
2017-08-09,132.9375
2017-08-10,131.9538
2017-08-11,131.8092
2017-08-14,134.9819
2017-08-15,134.7119
2017-08-16,136.062
2017-08-17,134.6733
2017-08-18,135.0108
2017-08-21,136.2452
2017-08-22,137.0264
2017-08-23,137.7496
2017-08-24,138.6754
2017-08-25,139.0997
2017-08-28,140.5849
2017-08-29,140.6909
2017-08-30,142.2629
2017-08-31,142.774
2017-09-01,140.5752
2017-09-05,141.7035
2017-09-06,140.8645
2017-09-07,141.7517
2017-09-08,139.823
2017-09-11,140.9706
2017-09-12,139.6687
2017-09-13,138.579
2017-09-14,137.4779
2017-09-15,139.8423
2017-09-18,139.6109
2017-09-19,135.9559
2017-09-20,135.3966
2017-09-21,134.4322
2017-09-22,132.87
2017-09-25,132.4939
2017-09-26,131.5584
2017-09-27,129.9383
2017-09-28,131.8959
2017-09-29,132.4579
2017-10-02,131.6633
2017-10-03,132.4386
2017-10-04,134.5512
2017-10-05,134.9486
2017-10-06,134.8129
2017-10-09,133.679
2017-10-10,132.8553
2017-10-11,133.6693
2017-10-12,135.7045
2017-10-13,135.6463
2017-10-16,135.278
2017-10-17,134.8323
2017-10-18,133.2332
2017-10-19,134.1151
2017-10-20,134.7741
2017-10-23,134.464
2017-10-24,133.7662
2017-10-25,133.1266
2017-10-26,134.1733
2017-10-27,134.7353
2017-10-30,138.4567
2017-10-31,139.232
2017-11-01,136.4604
2017-11-02,138.04
2017-11-03,137.7105
2017-11-06,145.5215
2017-11-07,146.0061
2017-11-08,148.0025
2017-11-09,147.1303
2017-11-10,145.8898
2017-11-13,145.4052
2017-11-14,144.8722
2017-11-15,144.3295
2017-11-16,143.8159
2017-11-17,141.3641
2017-11-20,141.7032
2017-11-21,142.0618
2017-11-22,140.8214
2017-11-24,142.7499
2017-11-27,143.6512
2017-11-28,144.0485
2017-11-29,141.7808
2017-11-30,139.484
2017-12-01,139.1739
2017-12-04,134.6772
2017-12-05,136.4119
2017-12-06,137.4198
2017-12-07,139.6584
2017-12-08,138.0691
2017-12-11,139.6003
2017-12-12,139.077
2017-12-13,139.2902
2017-12-14,139.2029
2017-12-15,138.3501
2017-12-18,138.4277
2017-12-19,137.4779
2017-12-20,135.8595
2017-12-21,135.2974
2017-12-22,136.315
2017-12-26,136.5573
2017-12-27,137.8721
2017-12-28,139.187
2017-12-29,138.9532
2018-01-02,137.4533
2018-01-03,137.989
2018-01-04,135.9729
2018-01-05,136.8495
2018-01-08,138.3104
2018-01-09,137.3754
2018-01-10,134.025
2018-01-11,131.4538
2018-01-12,129.5351
2018-01-16,132.0966
2018-01-17,133.0803
2018-01-18,131.6681
2018-01-19,134.0348
2018-01-22,135.6126
2018-01-23,137.5215
2018-01-24,138.0669
2018-01-25,139.2357
2018-01-26,141.3491
2018-01-29,140.57
2018-01-30,141.3686
2018-01-31,143.8522
2018-02-01,143.2289
2018-02-02,141.4368
2018-02-05,138.3396
2018-02-06,136.5184
2018-02-07,136.3528
2018-02-08,130.0903
2018-02-09,132.5057
2018-02-12,132.681
2018-02-13,132.7589
2018-02-14,131.9505
2018-02-15,132.6713
2018-02-16,136.3723
2018-02-20,135.6126
2018-02-21,133.8595
2018-02-22,135.3594
2018-02-23,138.1741
2018-02-26,139.0214
2018-02-27,137.0345
2018-02-28,135.7002
2018-03-01,131.8434
2018-03-02,130.5091
2018-03-05,133.2459
2018-03-06,135.262
2018-03-07,136.3528
2018-03-08,139.0214
2018-03-09,139.8395
2018-03-12,141.3004
2018-03-13,142.44
2018-03-14,142.6445
2018-03-15,142.8295
2018-03-16,142.7321
2018-03-19,141.3394
2018-03-20,142.4984
2018-03-21,138.6221
2018-03-22,139.2844
2018-03-23,138.5636
2018-03-26,141.4271
2018-03-27,140.6966
2018-03-28,140.5408
2018-03-29,141.5537
2018-04-02,140.083
2018-04-03,137.7358
2018-04-04,139.3233
2018-04-05,140.3265
2018-04-06,138.4565
2018-04-09,139.4597
2018-04-10,134.5252
2018-04-11,136.9924
2018-04-12,135.4847
2018-04-13,135.9938
2018-04-16,135.6217
2018-04-17,138.0694
2018-04-18,136.8847
2018-04-19,134.5447
2018-04-20,133.7615
2018-04-23,135.3084
2018-04-24,134.0944
2018-04-25,132.8901
2018-04-26,133.9769
2018-04-27,132.4104
2018-04-30,133.5069
2018-05-01,132.2733
2018-05-02,133.6146
2018-05-03,134.7014
2018-05-04,135.9448
2018-05-07,135.2497
2018-05-08,134.1433
2018-05-09,135.0637
2018-05-10,136.9631
2018-05-11,135.9546
2018-05-14,135.3965
2018-05-15,133.8398
2018-05-16,133.6146
2018-05-17,133.9867
2018-05-18,134.1825
2018-05-21,134.5056
2018-05-22,134.2804
2018-05-23,133.9671
2018-05-24,132.6649
2018-05-25,133.4776
2018-05-29,133.1251
2018-05-30,134.9462
2018-05-31,135.4749
2018-06-01,135.6217
2018-06-04,137.1295
2018-06-05,136.0036
2018-06-06,136.1308
2018-06-07,135.2888
2018-06-08,135.6805
2018-06-11,136.7183
2018-06-12,138.1869
2018-06-13,133.6048
2018-06-14,135.4553
2018-06-15,135.6609
2018-06-18,136.0941
2018-06-19,136.9309
2018-06-20,138.3684
2018-06-21,139.4908
2018-06-22,140.6131
2018-06-25,139.9535
2018-06-26,140.9577
2018-06-27,141.135
2018-06-28,142.0309
2018-06-29,141.9423
2018-07-02,142.4346
2018-07-03,140.8199
2018-07-05,143.4191
2018-07-06,143.5569
2018-07-09,139.983
2018-07-10,141.322
2018-07-11,141.194
2018-07-12,141.5386
2018-07-13,141.0168
2018-07-16,139.5695
2018-07-17,139.9732
2018-07-18,139.1954
2018-07-19,139.4809
2018-07-20,138.2108
2018-07-23,138.6637
2018-07-24,139.3825
2018-07-25,140.7313
2018-07-26,142.277
2018-07-27,142.149
2018-07-30,140.5147
2018-07-31,145.9494
2018-08-01,147.8496
2018-08-02,145.9199
2018-08-03,148.6569
2018-08-06,148.5781
2018-08-07,147.7117
2018-08-08,147.0127
2018-08-09,148.2434
2018-08-10,146.8749
2018-08-13,146.7075
2018-08-14,146.806
2018-08-15,147.2293
2018-08-16,147.4065
2018-08-17,148.8341
2018-08-20,148.46
2018-08-21,146.9733
2018-08-22,145.8214
2018-08-23,145.1027
2018-08-24,145.7722
2018-08-27,146.0774
2018-08-28,147.7807
2018-08-29,148.1252
2018-08-30,146.6386
2018-08-31,146.8158
2018-09-04,145.8608
2018-09-05,145.3193
2018-09-06,145.8017
2018-09-07,144.2855
2018-09-10,145.0535
2018-09-11,144.7286
2018-09-12,145.0338
2018-09-13,146.422
2018-09-14,144.9156
2018-09-17,145.467
2018-09-18,145.1322
2018-09-19,145.2996
2018-09-20,146.4318
2018-09-21,146.1955
2018-09-24,144.1181
2018-09-25,143.4486
2018-09-26,141.7257
2018-09-27,141.9534
2018-09-28,143.8442
2018-10-01,142.587
2018-10-02,142.686
2018-10-03,142.4682
2018-10-04,142.9929
2018-10-05,143.2998
2018-10-08,144.3293
2018-10-09,146.1707
2018-10-10,144.0422
2018-10-11,139.2705
2018-10-12,140.6268
2018-10-15,141.3
2018-10-16,144.2303
2018-10-17,145.2104
2018-10-18,145.3193
2018-10-19,148.6457
2018-10-22,147.7547
2018-10-23,149.3386
2018-10-24,150.4474
2018-10-25,151.972
2018-10-26,148.1111
2018-10-29,151.2889
2018-10-30,159.3374
2018-10-31,154.2489
2018-11-01,151.4869
2018-11-02,150.5365
2018-11-05,154.14
2018-11-06,154.5954
2018-11-07,155.3775
2018-11-08,157.7634
2018-11-09,158.5356
2018-11-12,159.4166
2018-11-13,159.6938
2018-11-14,161.7728
2018-11-15,160.5056
2018-11-16,162.3371
2018-11-19,164.5645
2018-11-20,159.0306
2018-11-21,158.7039
2018-11-23,158.7831
2018-11-26,159.971
2018-11-27,160.4561
2018-11-28,160.3769
2018-11-29,161.0897
2018-11-30,162.842
2018-12-03,161.4461
2018-12-04,161.8421
2018-12-06,165.9505
2018-12-07,164.7625
2018-12-10,164.5249
2018-12-11,164.9704
2018-12-12,163.0004
2018-12-13,165.1288
2018-12-14,164.9308
2018-12-17,159.3275
2018-12-18,160.6838
2018-12-19,160.9115
2018-12-20,159.9215
2018-12-21,156.417
2018-12-24,152.0413
2018-12-26,156.8093
2018-12-27,157.8744
2018-12-28,158.1034
2018-12-31,157.4663
2019-01-02,156.0229
2019-01-03,156.9586
2019-01-04,157.5857
2019-01-07,158.5612
2019-01-08,160.353
2019-01-09,158.9495
2019-01-10,161.1195
2019-01-11,160.6616
2019-01-14,160.6616
2019-01-15,162.304
2019-01-16,163.0307
2019-01-17,163.628
2019-01-18,163.9166
2019-01-22,163.9266
2019-01-23,165.0315
2019-01-24,164.8922
2019-01-25,166.6441
2019-01-28,167.2812
2019-01-29,168.6648
2019-01-30,169.6901
2019-01-31,172.0493
2019-02-01,169.6503
2019-02-04,170.1579
2019-02-05,171.6411
2019-02-06,169.491
2019-02-07,171.2231
2019-02-08,171.6411
2019-02-11,172.1986
2019-02-12,171.8004
2019-02-13,172.9053
2019-02-14,174.9858
2019-02-15,177.0065
2019-02-19,176.7875
2019-02-20,175.8816
2019-02-21,175.7025
2019-02-22,175.8219
2019-02-25,173.4329
2019-02-26,173.2239
2019-02-27,172.4076
2019-02-28,175.3441
2019-03-01,177.106
2019-03-04,178.8679
2019-03-05,180.2317
2019-03-06,180.819
2019-03-07,180.9185
2019-03-08,180.7791
2019-03-11,184.3129
2019-03-12,184.9002
2019-03-13,186.3734
2019-03-14,187.11
2019-03-15,188.1055
2019-03-18,188.0258
2019-03-19,189.0412
2019-03-20,190.6637
2019-03-21,193.8192
2019-03-22,192.7641
2019-03-25,194.7947
2019-03-26,194.1576
2019-03-27,193.202
2019-03-28,194.0382
2019-03-29,196.1585
2019-04-01,191.6293
2019-04-02,194.2273
2019-04-03,193.4011
2019-04-04,192.1668
2019-04-05,194.8644
2019-04-08,195.3223
2019-04-09,195.82
2019-04-10,196.62
2019-04-11,196.65
2019-04-12,197.96
2019-04-15,196.09
2019-04-16,192.2
2019-04-17,191.17
2019-04-18,192.91
2019-04-22,192.32
2019-04-23,193.4
2019-04-24,193.23
2019-04-25,192.29
2019-04-26,193.21
2019-04-29,192.44
2019-04-30,195.3
2019-05-01,192.91
2019-05-02,192.8
2019-05-03,192.95
2019-05-06,192.18
2019-05-07,189.85
2019-05-08,191.64
2019-05-09,192.52
2019-05-10,195.66
2019-05-13,196.88
2019-05-14,198.07
2019-05-15,200.47
2019-05-16,202.02
2019-05-17,202.43
2019-05-20,198.25
2019-05-21,198.17
2019-05-22,200.67
2019-05-23,202.92
2019-05-24,203
2019-05-28,202.55
2019-05-29,201.13
2019-05-30,204.69
2019-05-31,208.77
2019-06-03,209.29
2019-06-04,208.01
2019-06-05,212.77
2019-06-06,212.7
2019-06-07,212.46
2019-06-10,209.85
2019-06-11,208.97
2019-06-12,211.5
2019-06-13,209.22
2019-06-14,211.81
2019-06-17,213.745
2019-06-18,214.09
2019-06-19,216.02
2019-06-20,217.57
2019-06-21,215.21
2019-06-24,214.79
2019-06-25,212.14
2019-06-26,206.44
2019-06-27,205.81
2019-06-28,203.83
2019-07-01,201.66
2019-07-02,206.105
2019-07-03,210.12
2019-07-04,210.12
2019-07-05,209.11
2019-07-08,208.95
2019-07-09,211.03
2019-07-10,211.3
2019-07-11,209.06
2019-07-12,208.95
2019-07-15,210.505
2019-07-16,209.39
2019-07-17,208.67
2019-07-18,208.51
2019-07-19,205.89
2019-07-22,206.47
2019-07-23,206.51
2019-07-24,205.07
2019-07-25,205.505
2019-07-26,204.67
2019-07-29,205.78
2019-07-30,208.745
2019-07-31,212.38
2019-08-01,211.47
2019-08-02,215.33
2019-08-05,214.31
2019-08-06,216.82
2019-08-07,217.54
2019-08-08,220.745
2019-08-09,222.27
2019-08-12,222.13
2019-08-13,221.085
2019-08-14,219.065
2019-08-15,224.465
2019-08-16,223.21
2019-08-19,225.33
2019-08-20,225.55
2019-08-21,227.37
2019-08-22,228.54
2019-08-23,225.82
2019-08-26,229.81
2019-08-27,229.65
2019-08-28,230.09
2019-08-29,230.33
2019-08-30,230.265
2019-09-02,230.13
2019-09-03,237.72
2019-09-04,240.76
2019-09-05,235.64
2019-09-06,232.15
2019-09-09,224.325
2019-09-10,216.1
2019-09-11,212.625
2019-09-12,218.89
2019-09-13,215.08
2019-09-16,216.79
2019-09-17,221.16
2019-09-18,221.735
2019-09-19,226.75
2019-09-20,225.8
2019-09-23,225.56
2019-09-24,225.47
2019-09-25,222.48
2019-09-26,223.065
2019-09-27,219.09
2019-09-30,221.06
2019-10-01,220.86
2019-10-02,219.78
2019-10-03,223.595
2019-10-04,225.88
2019-10-07,225.59
2019-10-08,226.42
2019-10-09,226.68
2019-10-10,226.55
2019-10-11,224.695
2019-10-14,225.73
2019-10-15,223.785
2019-10-16,221.9
2019-10-17,225.915
2019-10-18,229.32
2019-10-21,229.14
2019-10-22,226.795
2019-10-23,226.08
2019-10-24,223.48
2019-10-25,216.6
2019-10-28,210.52
2019-10-29,216.5
2019-10-30,217.33
2019-10-31,218.21
2019-11-01,215.05
2019-11-04,211.06
2019-11-05,206.445
2019-11-06,208.08
2019-11-07,205.555
2019-11-08,206.01
2019-11-11,207.38
2019-11-12,206.595
2019-11-13,210.445
2019-11-14,211.82
2019-11-15,213.28
2019-11-18,214.14
2019-11-19,215.42
2019-11-20,218.15
2019-11-21,213.6
2019-11-22,209.93
2019-11-25,209.46
