date,close
2014-06-13,15.7203
2014-06-16,15.7741
2014-06-17,15.8638
2014-06-18,15.9984
2014-06-19,15.9446
2014-06-20,15.9536
2014-06-23,15.9356
2014-06-24,15.8638
2014-06-25,16.0792
2014-06-26,16.0343
2014-06-27,16.3753
2014-06-30,16.5996
2014-07-01,16.8598
2014-07-02,17.1021
2014-07-03,17.2187
2014-07-07,17.129
2014-07-08,17.129
2014-07-09,17.0931
2014-07-10,16.5906
2014-07-11,16.4201
2014-07-14,16.5099
2014-07-15,16.3484
2014-07-16,16.1869
2014-07-17,16.0164
2014-07-18,16.6175
2014-07-21,16.3843
2014-07-22,16.5906
2014-07-23,16.5099
2014-07-24,16.3394
2014-07-25,16.2317
2014-07-28,16.124
2014-07-29,16.8957
2014-07-30,17.1397
2014-07-31,16.8686
2014-08-01,16.7782
2014-08-04,17.0312
2014-08-05,17.1125
2014-08-06,17.239
2014-08-07,17.0945
2014-08-08,17.2932
2014-08-11,17.6095
2014-08-12,17.4559
2014-08-13,17.7269
2014-08-14,17.736
2014-08-15,17.998
2014-08-18,18.1787
2014-08-19,18.4678
2014-08-20,18.3865
2014-08-21,18.6124
2014-08-22,18.6485
2014-08-25,18.8744
2014-08-26,19.2358
2014-08-27,19.4165
2014-08-28,19.3894
2014-08-29,19.5701
2014-09-02,20.1574
2014-09-03,20.6001
2014-09-04,21.1061
2014-09-05,21.3952
2014-09-08,21.2055
2014-09-09,20.5007
2014-09-10,20.8983
2014-09-11,21.088
2014-09-12,20.9344
2014-09-15,21.0067
2014-09-16,21.2055
2014-09-17,20.4104
2014-09-18,19.8773
2014-09-19,18.7931
2014-09-22,18.7569
2014-09-23,18.7118
2014-09-24,18.5943
2014-09-25,18.4046
2014-09-26,18.7118
2014-09-29,18.7479
2014-09-30,18.5582
2014-10-01,18.2781
2014-10-02,18.3233
2014-10-03,18.4497
2014-10-06,18.9376
2014-10-07,18.269
2014-10-08,18.6847
2014-10-09,18.0341
2014-10-10,18.0612
2014-10-13,18.4588
2014-10-14,18.4136
2014-10-15,18.7389
2014-10-16,18.9467
2014-10-17,18.9467
2014-10-20,18.775
2014-10-21,19.3262
2014-10-22,19.1726
2014-10-23,19.4617
2014-10-24,19.5701
2014-10-27,19.4075
2014-10-28,18.9467
2014-10-29,18.4859
2014-10-30,18.5311
2014-10-31,18.8112
2014-11-03,18.26
2014-11-04,18.5762
2014-11-05,18.7308
2014-11-06,18.849
2014-11-07,18.6581
2014-11-10,18.7854
2014-11-11,18.7581
2014-11-12,18.9399
2014-11-13,18.5399
2014-11-14,18.4035
2014-11-17,18.2034
2014-11-18,18.2216
2014-11-19,18.1853
2014-11-20,18.2762
2014-11-21,18.1943
2014-11-24,18.5217
2014-11-25,18.5853
2014-11-26,18.7126
2014-11-28,18.2034
2014-12-01,17.9579
2014-12-02,18.2944
2014-12-03,18.7763
2014-12-04,18.6308
2014-12-05,18.9399
2014-12-08,18.7126
2014-12-09,19.3218
2014-12-10,19.0218
2014-12-11,19.1127
2014-12-12,18.9672
2014-12-15,19.1945
2014-12-16,19.5219
2014-12-17,19.9947
2014-12-18,20.1129
2014-12-19,20.1765
2014-12-22,20.5948
2014-12-23,20.9676
2014-12-24,20.8403
2014-12-26,20.9858
2014-12-29,21.0585
2014-12-30,20.9585
2014-12-31,20.9585
2015-01-02,20.9221
2015-01-05,20.6221
2015-01-06,20.4493
2015-01-07,20.9767
2015-01-08,20.8039
2015-01-09,20.613
2015-01-12,20.7221
2015-01-13,21.0585
2015-01-14,21.0585
2015-01-15,20.7403
2015-01-16,20.6403
2015-01-20,20.6675
2015-01-21,20.4493
2015-01-22,20.813
2015-01-23,20.7403
2015-01-26,21.0403
2015-01-27,20.5948
2015-01-28,20.4402
2015-01-29,20.8676
2015-01-30,20.1493
2015-02-02,20.5493
2015-02-03,21.0858
2015-02-04,21.0767
2015-02-05,21.3876
2015-02-06,21.2413
2015-02-09,21.0584
2015-02-10,20.9669
2015-02-11,20.9304
2015-02-12,21.2778
2015-02-13,21.3053
2015-02-17,21.415
2015-02-18,21.607
2015-02-19,21.5521
2015-02-20,21.223
2015-02-23,21.543
2015-02-24,22.5031
2015-02-25,22.0459
2015-02-26,22.1648
2015-02-27,21.8905
2015-03-02,22.6586
2015-03-03,21.7716
2015-03-04,21.5887
2015-03-05,21.351
2015-03-06,21.1772
2015-03-09,21.6162
2015-03-10,21.3418
2015-03-11,21.1772
2015-03-12,22.3842
2015-03-13,22.43
2015-03-16,22.1008
2015-03-17,22.1008
2015-03-18,22.2745
2015-03-19,22.2562
2015-03-20,22.2379
2015-03-23,22.3202
2015-03-24,22.558
2015-03-25,22.1282
2015-03-26,21.9636
2015-03-27,22.0002
2015-03-30,22.3294
2015-03-31,22.4757
2015-04-01,22.7866
2015-04-02,22.9603
2015-04-06,22.6128
2015-04-07,22.6677
2015-04-08,22.7043
2015-04-09,22.5488
2015-04-10,22.6311
2015-04-13,22.7134
2015-04-14,22.558
2015-04-15,22.5031
2015-04-16,22.2379
2015-04-17,22.2562
2015-04-20,22.1831
2015-04-21,22.1008
2015-04-22,22.2196
2015-04-23,21.543
2015-04-24,21.3235
2015-04-27,21.1498
2015-04-28,23.0243
2015-04-29,22.1511
2015-04-30,22.1144
2015-05-01,22.1603
2015-05-04,21.857
2015-05-05,21.8111
2015-05-06,21.6088
2015-05-07,21.8202
2015-05-08,22.0133
2015-05-11,22.4728
2015-05-12,22.5188
2015-05-13,22.7302
2015-05-14,23.4195
2015-05-15,23.4747
2015-05-18,23.3552
2015-05-19,23.5115
2015-05-20,24.3111
2015-05-21,23.7412
2015-05-22,23.4012
2015-05-26,23.3184
2015-05-27,23.3552
2015-05-28,23.3736
2015-05-29,23.107
2015-06-01,23.3368
2015-06-02,23.5758
2015-06-03,23.9986
2015-06-04,23.3092
2015-06-05,23.1898
2015-06-08,23.1989
2015-06-09,23.1714
2015-06-10,23.6034
2015-06-11,23.392
2015-06-12,23.4655
2015-06-15,22.8773
2015-06-16,23.4931
2015-06-17,23.2909
2015-06-18,23.7045
2015-06-19,23.8791
2015-06-22,23.5482
2015-06-23,24.0721
2015-06-24,24.0354
2015-06-25,24.3295
2015-06-26,24.4398
2015-06-29,23.7229
2015-06-30,23.971
2015-07-01,24.1365
2015-07-02,23.7872
2015-07-06,23.9067
2015-07-07,23.2817
2015-07-08,23.3552
2015-07-09,23.4287
2015-07-10,23.778
2015-07-13,23.8515
2015-07-14,24.0537
2015-07-15,23.8607
2015-07-16,24.0078
2015-07-17,23.8791
2015-07-20,23.2173
2015-07-21,22.7118
2015-07-22,22.7761
2015-07-23,22.2155
2015-07-24,22.1144
2015-07-27,21.7467
2015-07-28,20.6897
2015-07-29,20.4232
2015-07-30,20.0923
2015-07-31,20.1015
2015-08-03,19.118
2015-08-04,18.7044
2015-08-05,18.4916
2015-08-06,18.4084
2015-08-07,18.4176
2015-08-10,18.6026
2015-08-11,18.3806
2015-08-12,18.6211
2015-08-13,18.7691
2015-08-14,18.6396
2015-08-17,18.7876
2015-08-18,18.5656
2015-08-19,18.5286
2015-08-20,18.7136
2015-08-21,18.6581
2015-08-24,18.5009
2015-08-25,18.5101
2015-08-26,18.3621
2015-08-27,18.1864
2015-08-28,18.1494
2015-08-31,18.0291
2015-09-01,18.0384
2015-09-02,18.4639
2015-09-03,18.5194
2015-09-04,18.6766
2015-09-08,18.8154
2015-09-09,18.6304
2015-09-10,18.2234
2015-09-11,18.3621
2015-09-14,18.2049
2015-09-15,18.2326
2015-09-16,18.9171
2015-09-17,18.5749
2015-09-18,17.7238
2015-09-21,18.0291
2015-09-22,18.0198
2015-09-23,18.1031
2015-09-24,18.3344
2015-09-25,18.2974
2015-09-28,17.9828
2015-09-29,17.7886
2015-09-30,17.9921
2015-10-01,18.0291
2015-10-02,17.9736
2015-10-05,19.4814
2015-10-06,19.0374
2015-10-07,19.4722
2015-10-08,20.0549
2015-10-09,20.0919
2015-10-12,20.0364
2015-10-13,19.5092
2015-10-14,19.2594
2015-10-15,19.6942
2015-10-16,19.2317
2015-10-19,19.4074
2015-10-20,19.9254
2015-10-21,19.1484
2015-10-22,20.1474
2015-10-23,20.61
2015-10-26,20.2862
2015-10-27,24.4582
2015-10-28,25.6515
2015-10-29,25.6792
2015-10-30,24.5692
2015-11-02,25.3369
2015-11-03,25.9567
2015-11-04,25.7151
2015-11-05,25.8359
2015-11-06,26.7838
2015-11-09,26.7188
2015-11-10,26.756
2015-11-11,27.3507
2015-11-12,26.756
2015-11-13,26.0589
2015-11-16,26.0404
2015-11-17,25.7244
2015-11-18,25.8824
2015-11-19,25.8359
2015-11-20,25.901
2015-11-23,26.0032
2015-11-24,26.1426
2015-11-25,25.9288
2015-11-27,25.9288
2015-11-30,26.821
2015-12-01,27.5738
2015-12-02,27.4251
2015-12-03,27.4994
2015-12-04,27.4901
2015-12-07,27.6388
2015-12-08,27.6667
2015-12-09,27.1184
2015-12-10,26.1798
2015-12-11,25.6965
2015-12-14,25.3619
2015-12-15,25.1854
2015-12-16,25.6407
2015-12-17,25.1017
2015-12-18,25.3434
2015-12-21,26.1426
2015-12-22,26.0404
2015-12-23,26.1798
2015-12-24,26.1519
2015-12-28,26.0032
2015-12-29,26.3656
2015-12-30,26.0311
2015-12-31,25.2969
2016-01-04,23.6333
2016-01-05,23.4847
2016-01-06,24.3675
2016-01-07,23.875
2016-01-08,23.94
2016-01-11,24.6463
2016-01-12,24.7114
2016-01-13,24.8043
2016-01-14,25.0088
2016-01-15,24.9159
2016-01-19,24.2188
2016-01-20,24.8043
2016-01-21,24.6185
2016-01-22,24.3211
2016-01-25,24.1352
2016-01-26,24.7672
2016-01-27,23.9772
2016-01-28,24.2467
2016-01-29,24.4976
2016-02-01,24.256
2016-02-02,23.4847
2016-02-03,22.6532
2016-02-04,22.3263
2016-02-05,20.7569
2016-02-08,21.4202
2016-02-09,21.6724
2016-02-10,21.252
2016-02-11,20.9811
2016-02-12,20.8877
2016-02-16,20.9811
2016-02-17,20.813
2016-02-18,20.9624
2016-02-19,21.5416
2016-02-22,21.3267
2016-02-23,21.0839
2016-02-24,21.2427
2016-02-25,21.6724
2016-02-26,21.607
2016-02-29,21.9433
2016-03-01,22.8121
2016-03-02,23.2044
2016-03-03,22.4384
2016-03-04,22.8401
2016-03-07,22.6719
2016-03-08,22.1301
2016-03-09,22.1675
2016-03-10,20.9718
2016-03-11,21.196
2016-03-14,20.897
2016-03-15,20.8503
2016-03-16,21.252
2016-03-17,21.9713
2016-03-18,22.0741
2016-03-21,22.0647
2016-03-22,21.8125
2016-03-23,21.579
2016-03-24,21.8592
2016-03-28,21.6257
2016-03-29,21.4295
2016-03-30,21.635
2016-03-31,22.1395
2016-04-01,22.5131
2016-04-04,21.8966
2016-04-05,21.5883
2016-04-06,22.1301
2016-04-07,22.1395
2016-04-08,22.5972
2016-04-11,22.2983
2016-04-12,22.1114
2016-04-13,22.373
2016-04-14,22.7467
2016-04-15,23.0643
2016-04-18,22.7
2016-04-19,22.5131
2016-04-20,22.9802
2016-04-21,22.7
2016-04-22,22.6532
2016-04-25,22.345
2016-04-26,19.2156
2016-04-27,18.6457
2016-04-28,19.01
2016-04-29,18.4309
2016-05-02,17.7396
2016-05-03,17.2165
2016-05-04,17.4234
2016-05-05,17.4046
2016-05-06,17.5175
2016-05-09,17.8092
2016-05-10,17.7245
2016-05-11,17.7057
2016-05-12,17.4234
2016-05-13,17.4046
2016-05-16,17.828
2016-05-17,17.414
2016-05-18,17.0189
2016-05-19,16.7179
2016-05-20,17.1882
2016-05-23,17.0377
2016-05-24,17.1977
2016-05-25,17.0471
2016-05-26,17.1977
2016-05-27,17.7433
2016-05-31,17.367
2016-06-01,17.5363
2016-06-02,17.5175
2016-06-03,17.2635
2016-06-06,17.5363
2016-06-07,17.7245
2016-06-08,18.0256
2016-06-09,17.8656
2016-06-10,17.4893
2016-06-13,17.1412
2016-06-14,17.113
2016-06-15,17.0471
2016-06-16,16.5015
2016-06-17,16.3886
2016-06-20,16.8119
2016-06-21,16.7367
2016-06-22,16.4921
2016-06-23,16.652
2016-06-24,15.9558
2016-06-27,15.4007
2016-06-28,15.3913
2016-06-29,15.523
2016-06-30,15.8805
2016-07-01,16.0405
2016-07-05,15.9276
2016-07-06,15.7488
2016-07-07,15.7394
2016-07-08,16.4168
2016-07-11,16.6708
2016-07-12,16.9813
2016-07-13,17.0659
2016-07-14,16.7837
2016-07-15,16.8213
2016-07-18,16.7273
2016-07-19,16.5861
2016-07-20,16.605
2016-07-21,16.6238
2016-07-22,16.6238
2016-07-25,16.398
2016-07-26,19.8977
2016-07-27,19.4179
2016-07-28,18.9663
2016-07-29,18.3078
2016-08-01,18.1196
2016-08-02,17.9032
2016-08-03,17.9506
2016-08-04,17.638
2016-08-05,18.0169
2016-08-08,17.9506
2016-08-09,17.7422
2016-08-10,17.7138
2016-08-11,17.8654
2016-08-12,17.7801
2016-08-15,18.1779
2016-08-16,18.159
2016-08-17,18.2916
2016-08-18,17.8938
2016-08-19,17.8369
2016-08-22,18.2064
2016-08-23,17.9032
2016-08-24,17.8085
2016-08-25,18.0738
2016-08-26,18.2537
2016-08-29,17.8654
2016-08-30,18.1495
2016-08-31,17.7043
2016-09-01,17.979
2016-09-02,17.8559
2016-09-06,17.8275
2016-09-07,17.818
2016-09-08,18.0832
2016-09-09,17.5243
2016-09-12,17.9601
2016-09-13,17.3822
2016-09-14,17.3349
2016-09-15,17.5433
2016-09-16,17.638
2016-09-19,17.4864
2016-09-20,16.8328
2016-09-21,17.4107
2016-09-22,17.5149
2016-09-23,17.2307
2016-09-26,17.0223
2016-09-27,17.0697
2016-09-28,17.3444
2016-09-29,16.9465
2016-09-30,17.5717
2016-10-03,18.0643
2016-10-04,17.9317
2016-10-05,18.6042
2016-10-06,18.8789
2016-10-07,18.7084
2016-10-10,18.9168
2016-10-11,18.519
2016-10-12,18.5853
2016-10-13,18.9358
2016-10-14,19.1915
2016-10-17,18.9926
2016-10-18,19.2294
2016-10-19,19.182
2016-10-20,18.9452
2016-10-21,19.3715
2016-10-24,19.2768
2016-10-25,16.7665
2016-10-26,17.1454
2016-10-27,16.6718
2016-10-28,16.6244
2016-10-31,17.5243
2016-11-01,17.1454
2016-11-02,17.2218
2016-11-03,17.3172
2016-11-04,17.2695
2016-11-07,17.2695
2016-11-08,17.7942
2016-11-09,18.7006
2016-11-10,19.607
2016-11-11,20.7043
2016-11-14,19.8456
2016-11-15,19.8456
2016-11-16,20.1318
2016-11-17,20.1318
2016-11-18,20.0364
2016-11-21,20.1318
2016-11-22,20.0841
2016-11-23,20.0364
2016-11-25,20.2749
2016-11-28,20.2749
2016-11-29,20.0841
2016-11-30,20.2272
2016-12-01,20.3226
2016-12-02,20.3226
2016-12-05,20.752
2016-12-06,21.4199
2016-12-07,21.6107
2016-12-08,22.7556
2016-12-09,22.8987
2016-12-12,22.8033
2016-12-13,22.8987
2016-12-14,22.6125
2016-12-15,23.1373
2016-12-16,23.3281
2016-12-19,23.0896
2016-12-20,23.185
2016-12-21,22.8033
2016-12-22,22.8033
2016-12-23,22.851
2016-12-27,22.7556
2016-12-28,23.185
2016-12-29,23.3758
2016-12-30,23.0419
2017-01-03,23.0896
2017-01-04,23.662
2017-01-05,22.7556
2017-01-06,22.1831
2017-01-09,21.6584
2017-01-10,22.1354
2017-01-11,22.8033
2017-01-12,22.2309
2017-01-13,22.1354
2017-01-17,21.7061
2017-01-18,21.6584
2017-01-19,21.3244
2017-01-20,21.4199
2017-01-23,21.0382
2017-01-24,21.8492
2017-01-25,22.04
2017-01-26,21.6584
2017-01-27,21.3722
2017-01-30,20.8951
2017-01-31,21.3244
2017-02-01,21.4012
2017-02-02,21.0174
2017-02-03,21.4492
2017-02-06,20.9694
2017-02-07,20.6335
2017-02-08,20.3456
2017-02-09,20.9694
2017-02-10,21.1133
2017-02-13,21.2093
2017-02-14,21.1133
2017-02-15,21.2573
2017-02-16,21.0174
2017-02-17,20.9214
2017-02-21,21.1133
2017-02-22,20.9694
2017-02-23,20.3936
2017-02-24,20.6335
2017-02-27,20.5855
2017-02-28,23.4646
2017-03-01,23.5126
2017-03-02,23.7045
2017-03-03,23.7045
2017-03-06,23.3686
2017-03-07,23.4646
2017-03-08,23.4166
2017-03-09,23.3206
2017-03-10,23.2247
2017-03-13,23.5605
2017-03-14,23.3686
2017-03-15,24.2803
2017-03-16,25.192
2017-03-17,25.0001
2017-03-20,24.8082
2017-03-21,24.5202
2017-03-22,24.4243
2017-03-23,24.8082
2017-03-24,24.4723
2017-03-27,24.8082
2017-03-28,24.5682
2017-03-29,24.1844
2017-03-30,24.6162
2017-03-31,25.288
2017-04-03,24.6162
2017-04-04,24.8082
2017-04-05,24.4723
2017-04-06,24.1364
2017-04-07,24.0404
2017-04-10,24.7122
2017-04-11,24.6162
2017-04-12,24.6642
2017-04-13,24.3283
2017-04-17,24.6642
2017-04-18,24.5682
2017-04-19,25.144
2017-04-20,25.5759
2017-04-21,25.0961
2017-04-24,25.6719
2017-04-25,21.1133
2017-04-26,20.5855
2017-04-27,20.8734
2017-04-28,20.6335
2017-05-01,20.9214
2017-05-02,20.7294
2017-05-03,21.0481
2017-05-04,20.9032
2017-05-05,20.9032
2017-05-08,20.8067
2017-05-09,20.9998
2017-05-10,20.9032
2017-05-11,20.8067
2017-05-12,20.6136
2017-05-15,21.7239
2017-05-16,21.0963
2017-05-17,20.6619
2017-05-18,20.8067
2017-05-19,21.0481
2017-05-22,21.2412
2017-05-23,21.4343
2017-05-24,21.6274
2017-05-25,21.5308
2017-05-26,21.4826
2017-05-30,20.7101
2017-05-31,20.8067
2017-06-01,21.2653
2017-06-02,21.6515
2017-06-05,20.9032
2017-06-06,20.7584
2017-06-07,20.8308
2017-06-08,21.4826
2017-06-09,21.3377
2017-06-12,21.1446
2017-06-13,21.386
2017-06-14,21.0481
2017-06-15,20.9515
2017-06-16,20.9998
2017-06-19,21.4343
2017-06-20,21.4826
2017-06-21,21.4826
2017-06-22,21.4826
2017-06-23,21.5308
2017-06-26,21.3377
2017-06-27,21.0963
2017-06-28,21.7239
2017-06-29,21.2895
2017-06-30,20.9998
2017-07-03,20.9998
2017-07-05,20.9515
2017-07-06,20.6136
2017-07-07,21.6757
2017-07-10,21.1929
2017-07-11,21.0963
2017-07-12,21.0481
2017-07-13,21.3136
2017-07-14,21.4343
2017-07-17,21.6757
2017-07-18,21.5308
2017-07-19,21.6274
2017-07-20,21.6274
2017-07-21,21.4826
2017-07-24,21.4343
2017-07-25,19.2136
2017-07-26,18.1998
2017-07-27,17.8136
2017-07-28,17.8136
2017-07-31,17.4757
2017-08-01,17.9584
2017-08-02,18.2307
2017-08-03,18.4251
2017-08-04,17.939
2017-08-07,17.5501
2017-08-08,18.1821
2017-08-09,18.5224
2017-08-10,18.0362
2017-08-11,17.7932
2017-08-14,18.1335
2017-08-15,17.8418
2017-08-16,17.6473
2017-08-17,17.5501
2017-08-18,17.7932
2017-08-21,17.7445
2017-08-22,17.6473
2017-08-23,17.5744
2017-08-24,17.6716
2017-08-25,17.6959
2017-08-28,17.6473
2017-08-29,17.5987
2017-08-30,17.5501
2017-08-31,17.7445
2017-09-01,17.7932
2017-09-05,17.4528
2017-09-06,17.5501
2017-09-07,17.5015
2017-09-08,17.6473
2017-09-11,18.1335
2017-09-12,17.9876
2017-09-13,18.3765
2017-09-14,18.2307
2017-09-15,18.571
2017-09-18,18.2307
2017-09-19,18.3279
2017-09-20,18.6682
2017-09-21,18.4738
2017-09-22,18.9599
2017-09-25,19.2516
2017-09-26,19.6891
2017-09-27,20.0295
2017-09-28,20.1753
2017-09-29,20.5642
2017-10-02,21.1476
2017-10-03,21.0504
2017-10-04,20.8559
2017-10-05,21.099
2017-10-06,21.1476
2017-10-09,20.8073
2017-10-10,20.9045
2017-10-11,20.467
2017-10-12,20.3698
2017-10-13,20.467
2017-10-16,20.467
2017-10-17,20.2239
2017-10-18,20.5642
2017-10-19,20.1753
2017-10-20,20.467
2017-10-23,20.1753
2017-10-24,20.7101
2017-10-25,20.8073
2017-10-26,20.8559
2017-10-27,24.0645
2017-10-30,23.7242
2017-10-31,24.1617
2017-11-01,24.1617
2017-11-02,24.0444
2017-11-03,24.2399
2017-11-06,23.8978
2017-11-07,23.2136
2017-11-08,23.0182
2017-11-09,23.3602
2017-11-10,23.3602
2017-11-13,23.3602
2017-11-14,23.3602
2017-11-15,23.4091
2017-11-16,23.7512
2017-11-17,23.458
2017-11-20,23.8978
2017-11-21,24.1422
2017-11-22,24.0444
2017-11-24,23.849
2017-11-27,24.0444
2017-11-28,23.9956
2017-11-29,24.0933
2017-11-30,24.4354
2017-12-01,23.8978
2017-12-04,23.9467
2017-12-05,23.7512
2017-12-06,23.5069
2017-12-07,23.6046
2017-12-08,23.2625
2017-12-11,22.6272
2017-12-12,22.9693
2017-12-13,23.3114
2017-12-14,23.1159
2017-12-15,24.1911
2017-12-18,24.2399
2017-12-19,24.2888
2017-12-20,24.3377
2017-12-21,24.4843
2017-12-22,24.5331
2017-12-26,24.7775
2017-12-27,24.0933
2017-12-28,23.8001
2017-12-29,23.9956
2018-01-02,24.3865
2018-01-03,23.5557
2018-01-04,23.5557
2018-01-05,23.7023
2018-01-08,24.0933
2018-01-09,25.6083
2018-01-10,25.2173
2018-01-11,25.2173
2018-01-12,25.2662
2018-01-16,25.706
2018-01-17,25.6572
2018-01-18,25.6083
2018-01-19,25.9993
2018-01-22,26.1459
2018-01-23,26.097
2018-01-24,25.8527
2018-01-25,26.097
2018-01-26,26.1459
2018-01-29,26.1948
2018-01-30,26.3414
2018-01-31,25.8038
2018-02-01,26.4717
2018-02-02,25.5386
2018-02-05,24.1143
2018-02-06,24.3599
2018-02-07,24.6054
2018-02-08,24.0161
2018-02-09,24.3108
2018-02-12,24.7528
2018-02-13,24.7528
2018-02-14,24.7528
2018-02-15,24.9983
2018-02-16,24.8019
2018-02-20,24.6054
2018-02-21,25.1948
2018-02-22,24.851
2018-02-23,25.0474
2018-02-26,24.9983
2018-02-27,25.3421
2018-02-28,25.9315
2018-03-01,26.3735
2018-03-02,27.1102
2018-03-05,27.1102
2018-03-06,28.2398
2018-03-07,29.1729
2018-03-08,29.1238
2018-03-09,29.9096
2018-03-12,29.8605
2018-03-13,30.2043
2018-03-14,29.9587
2018-03-15,30.3025
2018-03-16,31.1865
2018-03-19,31.1865
2018-03-20,31.8741
2018-03-21,31.8741
2018-03-22,31.383
2018-03-23,30.8427
2018-03-26,31.2356
2018-03-27,30.7445
2018-03-28,29.7623
2018-03-29,30.6954
2018-04-02,29.8605
2018-04-03,30.7445
2018-04-04,30.5481
2018-04-05,30.5972
2018-04-06,29.7623
2018-04-09,29.8114
2018-04-10,30.3516
2018-04-11,30.6463
2018-04-12,30.8919
2018-04-13,31.0883
2018-04-16,31.1865
2018-04-17,31.9232
2018-04-18,31.6777
2018-04-19,31.825
2018-04-20,31.4812
2018-04-23,31.825
2018-04-24,37.2765
2018-04-25,37.1292
2018-04-26,36.9818
2018-04-27,37.2274
2018-04-30,36.9818
2018-05-01,36.8345
2018-05-02,37.1292
2018-05-03,36.7645
2018-05-04,37.1094
2018-05-07,37.1094
2018-05-08,37.0109
2018-05-09,37.4544
2018-05-10,38.1444
2018-05-11,38.0458
2018-05-14,37.4051
2018-05-15,37.553
2018-05-16,37.9965
2018-05-17,38.0458
2018-05-18,38.3908
2018-05-21,38.3415
2018-05-22,38.2922
2018-05-23,38.5879
2018-05-24,38.2922
2018-05-25,37.6023
2018-05-29,37.6515
2018-05-30,37.8487
2018-05-31,37.2573
2018-06-01,37.8487
2018-06-04,38.0951
2018-06-05,38.3415
2018-06-06,38.0458
2018-06-07,37.6515
2018-06-08,37.7008
2018-06-11,37.208
2018-06-12,37.0109
2018-06-13,37.1587
2018-06-14,38.1444
2018-06-15,37.7994
2018-06-18,36.8137
2018-06-19,35.7788
2018-06-20,36.3702
2018-06-21,36.5673
2018-06-22,36.1238
2018-06-25,35.286
2018-06-26,35.7295
2018-06-27,34.596
2018-06-28,35.0396
2018-06-29,34.4975
2018-07-02,34.9903
2018-07-03,35.5817
2018-07-05,35.8281
2018-07-06,35.2367
2018-07-09,35.4338
2018-07-10,34.596
2018-07-11,34.8917
2018-07-12,34.8917
2018-07-13,34.6453
2018-07-16,34.596
2018-07-17,34.8917
2018-07-18,35.7788
2018-07-19,34.8425
2018-07-20,34.3004
2018-07-23,34.6946
2018-07-24,34.0047
2018-07-25,34.3496
2018-07-26,34.941
2018-07-27,34.1032
2018-07-30,33.709
2018-07-31,40.3128
2018-08-01,41.0027
2018-08-02,41.1999
2018-08-03,41.3477
2018-08-06,43.4668
2018-08-07,42.974
2018-08-08,43.1711
2018-08-09,43.2997
2018-08-10,41.9156
2018-08-13,41.4214
2018-08-14,41.7674
2018-08-15,41.3225
2018-08-16,40.8776
2018-08-17,41.1248
2018-08-20,41.3719
2018-08-21,43.0031
2018-08-22,43.9917
2018-08-23,43.7445
2018-08-24,43.5468
2018-08-27,43.9917
2018-08-28,43.5468
2018-08-29,43.3985
2018-08-30,43.6951
2018-08-31,43.6951
2018-09-04,43.6951
2018-09-05,43.6457
2018-09-06,42.6076
2018-09-07,40.7788
2018-09-10,40.0868
2018-09-11,38.6039
2018-09-12,38.0108
2018-09-13,37.6153
2018-09-14,36.7256
2018-09-17,36.0336
2018-09-18,35.045
2018-09-19,34.2542
2018-09-20,34.6002
2018-09-21,35.045
2018-09-24,34.6002
2018-09-25,34.1553
2018-09-26,33.9576
2018-09-27,33.4139
2018-09-28,33.4633
2018-10-01,31.8717
2018-10-02,30.982
2018-10-03,31.0611
2018-10-04,31.5652
2018-10-05,30.8436
2018-10-08,30.6558
2018-10-09,30.7645
2018-10-10,30.4086
2018-10-11,29.42
2018-10-12,29.0543
2018-10-15,29.7067
2018-10-16,30.5174
2018-10-17,30.2504
2018-10-18,28.8862
2018-10-19,28.2436
2018-10-22,28.7972
2018-10-23,28.5303
2018-10-24,28.4908
2018-10-25,29.9242
2018-10-26,28.6588
2018-10-29,29.0246
2018-10-30,35.9545
2018-10-31,34.1158
2018-11-01,34.531
2018-11-02,34.5112
2018-11-05,33.7302
2018-11-06,35.6876
2018-11-07,36.1918
2018-11-08,35.6461
2018-11-09,34.7433
2018-11-12,35.0509
2018-11-13,35.041
2018-11-14,34.8921
2018-11-15,35.537
2018-11-16,35.4676
2018-11-19,36.0827
2018-11-20,34.8425
2018-11-21,34.8723
2018-11-23,35.2791
2018-11-26,35.1104
2018-11-27,34.1084
2018-11-28,35.6164
2018-11-29,34.7731
2018-11-30,36.3704
2018-12-03,35.289
2018-12-04,32.4913
2018-12-06,32.2432
2018-12-07,31.7373
2018-12-10,32.4317
2018-12-11,33.1064
2018-12-12,33.7711
2018-12-13,33.5528
2018-12-14,33.2651
2018-12-17,31.8762
2018-12-18,32.3226
2018-12-19,30.9833
2018-12-20,31.0726
2018-12-21,30.0805
2018-12-24,29.7729
2018-12-26,30.3086
2018-12-27,30.9436
2018-12-28,30.8146
2018-12-31,30.9436
2019-01-02,31.3206
2019-01-03,30.7352
2019-01-04,31.5984
2019-01-07,31.4892
2019-01-08,33.1857
2019-01-09,33.146
2019-01-10,32.7294
2019-01-11,33.1758
2019-01-14,32.8087
2019-01-15,32.6698
2019-01-16,32.3524
2019-01-17,33.2155
2019-01-18,32.9873
2019-01-22,32.8683
2019-01-23,32.2234
2019-01-24,32.6798
2019-01-25,32.273
2019-01-28,31.9158
2019-01-29,31.9654
2019-01-30,32.2333
2019-01-31,32.7889
2019-02-01,32.2333
2019-02-04,32.5607
2019-02-05,32.2432
2019-02-06,32.2333
2019-02-07,32.0845
2019-02-08,31.6381
2019-02-11,32.3524
2019-02-12,32.5706
2019-02-13,33.2353
2019-02-14,32.9575
2019-02-15,33.4139
2019-02-19,33.7611
2019-02-20,33.9298
2019-02-21,33.1361
2019-02-22,33.5429
2019-02-25,33.5925
2019-02-26,42.7893
2019-02-27,43.2456
2019-02-28,42.7694
2019-03-01,42.9281
2019-03-04,42.065
2019-03-05,42.69
2019-03-06,41.817
2019-03-07,41.7772
2019-03-08,40.5924
2019-03-11,41.6179
2019-03-12,40.4729
2019-03-13,40.9807
2019-03-14,40.5127
2019-03-15,40.5725
2019-03-18,41.0304
2019-03-19,40.2339
2019-03-20,40.1941
2019-03-21,40.3932
2019-03-22,38.5712
2019-03-25,38.9794
2019-03-26,39.3478
2019-03-27,38.2825
2019-03-28,39.0491
2019-03-29,38.163
2019-04-01,39.5171
2019-04-02,39.3379
2019-04-03,40.4729
2019-04-04,41.0404
2019-04-05,41.5382
2019-04-08,41.0703
2019-04-09,41.2097
2019-04-10,41.7871
2019-04-11,41.8369
2019-04-12,41.3192
2019-04-15,40.7716
2019-04-16,40.3932
2019-04-17,39.8257
2019-04-18,39.6863
2019-04-22,39.1387
2019-04-23,39.9552
2019-04-24,39.3279
2019-04-25,38.0336
2019-04-26,38.9296
2019-04-29,39.7461
2019-04-30,35.6241
2019-05-01,34.1207
2019-05-02,34.5986
2019-05-03,35.2856
2019-05-06,35.6241
2019-05-07,34.4692
2019-05-08,34.28
2019-05-09,35.04
2019-05-10,34.95
2019-05-13,34.44
2019-05-14,33.87
2019-05-15,33.18
2019-05-16,33.47
2019-05-17,32.37
2019-05-20,32.62
2019-05-21,33.03
2019-05-22,32.94
2019-05-23,31.72
2019-05-24,31.54
2019-05-28,30.72
2019-05-29,30.91
2019-05-30,31.14
2019-05-31,30.36
2019-06-03,30.95
2019-06-04,31.52
2019-06-05,31.67
2019-06-06,31.92
2019-06-07,32.2
2019-06-10,31.6
2019-06-11,32.45
2019-06-12,32.61
2019-06-13,33
2019-06-14,33.325
2019-06-17,33.01
2019-06-18,33.99
2019-06-19,33.34
2019-06-20,33.83
2019-06-21,31.11
2019-06-24,29.34
2019-06-25,30.095
2019-06-26,29.36
2019-06-27,29.205
2019-06-28,30.02
2019-07-01,29.87
2019-07-02,28.87
2019-07-03,29.52
2019-07-04,29.52
2019-07-05,29.175
2019-07-08,28.92
2019-07-09,29.09
2019-07-10,29.36
2019-07-11,29.24
2019-07-12,29.73
2019-07-15,29.925
2019-07-16,30.1
2019-07-17,30.06
2019-07-18,30.005
2019-07-19,30.02
2019-07-22,29.14
2019-07-23,30.24
2019-07-24,31.28
2019-07-25,30.075
2019-07-26,30.685
2019-07-29,30.515
2019-07-30,29.64
2019-07-31,29.75
2019-08-01,29.165
2019-08-02,29.465
2019-08-05,28.245
2019-08-06,28.185
2019-08-07,28.14
2019-08-08,28.04
2019-08-09,27.395
2019-08-12,27.5
2019-08-13,27.55
2019-08-14,26.75
2019-08-15,26.78
2019-08-16,27.5
2019-08-19,27.54
2019-08-20,27.005
2019-08-21,27.235
2019-08-22,26.665
2019-08-23,25.45
2019-08-26,25.52
2019-08-27,25.575
2019-08-28,26.405
2019-08-29,26.31
2019-08-30,26.57
2019-09-02,26.49
2019-09-03,25.76
2019-09-04,26.125
2019-09-05,27.035
2019-09-06,26.29
2019-09-09,26.705
2019-09-10,26.895
2019-09-11,27.205
2019-09-12,27.37
2019-09-13,27.705
2019-09-16,28.185
2019-09-17,28.565
2019-09-18,28.4
2019-09-19,28.035
2019-09-20,27.51
2019-09-23,27.815
2019-09-24,27.24
2019-09-25,28.065
2019-09-26,27.765
2019-09-27,27.345
2019-09-30,27.31
2019-10-01,25.76
2019-10-02,25.755
2019-10-03,25.465
2019-10-04,25.555
2019-10-07,26.035
2019-10-08,25.48
2019-10-09,25.29
2019-10-10,25.26
2019-10-11,25.795
2019-10-14,26.09
2019-10-15,26.47
2019-10-16,26.78
2019-10-17,27.065
2019-10-18,26.945
2019-10-21,27.315
2019-10-22,27.39
2019-10-23,28.02
2019-10-24,27.755
2019-10-25,27.69
2019-10-28,27.84
2019-10-29,28.01
2019-10-30,28.735
2019-10-31,28.42
2019-11-01,28.84
2019-11-04,29.51
2019-11-05,30.51
2019-11-06,29.92
2019-11-07,29.98
2019-11-08,30.475
2019-11-11,29.7
2019-11-12,30.24
2019-11-13,29.59
2019-11-14,29.195
2019-11-15,29.36
2019-11-18,30.17
2019-11-19,30.24
2019-11-20,30.29
2019-11-21,29.88
2019-11-22,29.595
2019-11-25,30.895
