date,close
2014-06-13,41.7217
2014-06-16,42.151
2014-06-17,42.3936
2014-06-18,43.0842
2014-06-19,43.3921
2014-06-20,43.5694
2014-06-23,43.84
2014-06-24,43.6161
2014-06-25,43.9333
2014-06-26,44.064
2014-06-27,43.7408
2014-06-30,44.1342
2014-07-01,44.3966
2014-07-02,44.9493
2014-07-03,45.2491
2014-07-07,45.0992
2014-07-08,45.0711
2014-07-09,45.6144
2014-07-10,45.755
2014-07-11,45.933
2014-07-14,46.2421
2014-07-15,45.8861
2014-07-16,45.8393
2014-07-17,45.4364
2014-07-18,45.9611
2014-07-21,45.9142
2014-07-22,46.1672
2014-07-23,46.2609
2014-07-24,46.467
2014-07-25,45.6051
2014-07-28,45.4927
2014-07-29,45.221
2014-07-30,44.8088
2014-07-31,43.9281
2014-08-01,44.1436
2014-08-04,44.8556
2014-08-05,44.3966
2014-08-06,44.0312
2014-08-07,43.6003
2014-08-08,44.7338
2014-08-11,45.5301
2014-08-12,46.1672
2014-08-13,46.5794
2014-08-14,47.0572
2014-08-15,47.0853
2014-08-18,47.7598
2014-08-19,48.0971
2014-08-20,48.2469
2014-08-21,48.7341
2014-08-22,49.2025
2014-08-25,49.4367
2014-08-26,49.8115
2014-08-27,50.055
2014-08-28,50.486
2014-08-29,50.7389
2014-09-02,51.0762
2014-09-03,50.6452
2014-09-04,49.7365
2014-09-05,49.8115
2014-09-08,49.8302
2014-09-09,49.6335
2014-09-10,49.3243
2014-09-11,49.3337
2014-09-12,48.6685
2014-09-15,48.5186
2014-09-16,48.6685
2014-09-17,48.9777
2014-09-18,49.2681
2014-09-19,49.5117
2014-09-22,48.884
2014-09-23,48.6592
2014-09-24,49.3056
2014-09-25,48.9121
2014-09-26,49.2025
2014-09-29,48.706
2014-09-30,48.7154
2014-10-01,48.1372
2014-10-02,48.0996
2014-10-03,48.9081
2014-10-06,48.3252
2014-10-07,46.9149
2014-10-08,47.9961
2014-10-09,47.0748
2014-10-10,46.7457
2014-10-13,45.9466
2014-10-14,46.6423
2014-10-15,45.6175
2014-10-16,45.9183
2014-10-17,48.0808
2014-10-20,48.6731
2014-10-21,50.0457
2014-10-22,49.9141
2014-10-23,50.2432
2014-10-24,50.309
2014-10-27,51.0329
2014-10-28,50.7697
2014-10-29,50.5534
2014-10-30,50.9295
2014-10-31,50.2996
2014-11-03,50.6004
2014-11-04,49.6038
2014-11-05,49.5568
2014-11-06,49.6885
2014-11-07,49.5568
2014-11-10,49.5192
2014-11-11,50.0645
2014-11-12,49.9329
2014-11-13,49.9705
2014-11-14,49.7637
2014-11-17,49.7355
2014-11-18,50.0927
2014-11-19,49.9705
2014-11-20,49.9047
2014-11-21,50.2526
2014-11-24,50.4594
2014-11-25,51.2304
2014-11-26,51.3432
2014-11-28,52.0953
2014-12-01,51.9261
2014-12-02,51.503
2014-12-03,52.3492
2014-12-04,52.6876
2014-12-05,53.4492
2014-12-08,53.8535
2014-12-09,53.1671
2014-12-10,52.5466
2014-12-11,52.697
2014-12-12,51.691
2014-12-15,51.7287
2014-12-16,51.4278
2014-12-17,51.9731
2014-12-18,53.9099
2014-12-19,53.609
2014-12-22,53.703
2014-12-23,53.4586
2014-12-24,53.515
2014-12-26,53.5996
2014-12-29,53.75
2014-12-30,53.6416
2014-12-31,52.8491
2015-01-02,52.3397
2015-01-05,51.3302
2015-01-06,50.4812
2015-01-07,51.6227
2015-01-08,53.3019
2015-01-09,53.4434
2015-01-12,54.0378
2015-01-13,54.9906
2015-01-14,54.8302
2015-01-15,55.0755
2015-01-16,56.1793
2015-01-20,54.8208
2015-01-21,54.3774
2015-01-22,55.9812
2015-01-23,55.2548
2015-01-26,55.717
2015-01-27,55.3019
2015-01-28,54.8114
2015-01-29,54.9906
2015-01-30,54.1982
2015-02-02,54.2359
2015-02-03,56.1604
2015-02-04,56.4246
2015-02-05,56.8963
2015-02-06,55.8208
2015-02-09,55.1887
2015-02-10,56.8208
2015-02-11,56.868
2015-02-12,57.1793
2015-02-13,58.2548
2015-02-17,58.8114
2015-02-18,58.7736
2015-02-19,58.9529
2015-02-20,60.9812
2015-02-23,60.6133
2015-02-24,60.0378
2015-02-25,60.2925
2015-02-26,59.9529
2015-02-27,59.8774
2015-03-02,60.1699
2015-03-03,59.0755
2015-03-04,59.6604
2015-03-05,59.6133
2015-03-06,58.9057
2015-03-09,59.6793
2015-03-10,58.7925
2015-03-11,59.0567
2015-03-12,59.2548
2015-03-13,59.1793
2015-03-16,60.3114
2015-03-17,60.2453
2015-03-18,60.5472
2015-03-19,61.0472
2015-03-20,61.1793
2015-03-23,60.9434
2015-03-24,60.4906
2015-03-25,58.9151
2015-03-26,58.6416
2015-03-27,59.7359
2015-03-30,60.7925
2015-03-31,60.6269
2015-04-01,60.6364
2015-04-02,59.6333
2015-04-06,59.5103
2015-04-07,59.5292
2015-04-08,59.5292
2015-04-09,59.1318
2015-04-10,58.829
2015-04-13,58.583
2015-04-14,58.2802
2015-04-15,58.9047
2015-04-16,58.0815
2015-04-17,57.9584
2015-04-20,58.4505
2015-04-21,58.4032
2015-04-22,58.9426
2015-04-23,58.9236
2015-04-24,59.3116
2015-04-27,57.7408
2015-04-28,58.0341
2015-04-29,57.6746
2015-04-30,56.6526
2015-05-01,57.4191
2015-05-04,57.0595
2015-05-05,56.416
2015-05-06,53.7949
2015-05-07,54.9683
2015-05-08,55.7726
2015-05-11,55.3562
2015-05-12,55.1859
2015-05-13,54.3627
2015-05-14,54.533
2015-05-15,54.4857
2015-05-18,54.2586
2015-05-19,54.3343
2015-05-20,54.2775
2015-05-21,53.9463
2015-05-22,53.8328
2015-05-26,53.3312
2015-05-27,53.5867
2015-05-28,53.4826
2015-05-29,53.53
2015-06-01,53.5016
2015-06-02,53.5394
2015-06-03,53.6908
2015-06-04,53.4732
2015-06-05,53.3691
2015-06-08,53.1136
2015-06-09,53
2015-06-10,53.4164
2015-06-11,53.7287
2015-06-12,53.3028
2015-06-15,53.142
2015-06-16,53.3028
2015-06-17,53.7192
2015-06-18,54.0693
2015-06-19,53.4542
2015-06-22,53.4069
2015-06-23,51.3252
2015-06-24,51.5712
2015-06-25,52.0916
2015-06-26,52.3944
2015-06-29,52.0858
2015-06-30,51.5161
2015-07-01,52.6081
2015-07-02,52.3422
2015-07-06,51.6585
2015-07-07,51.6775
2015-07-08,51.573
2015-07-09,51.3072
2015-07-10,52.3137
2015-07-13,52.7411
2015-07-14,52.6746
2015-07-15,52.4277
2015-07-16,52.0858
2015-07-17,52.5986
2015-07-20,52.7885
2015-07-21,52.4087
2015-07-22,52.6176
2015-07-23,51.0603
2015-07-24,50.8608
2015-07-27,50.0157
2015-07-28,49.5029
2015-07-29,48.2399
2015-07-30,48.6008
2015-07-31,48.107
2015-08-03,47.974
2015-08-04,47.4423
2015-08-05,46.4452
2015-08-06,46.3407
2015-08-07,47.1099
2015-08-10,47.5942
2015-08-11,47.5277
2015-08-12,47.1859
2015-08-13,47.3283
2015-08-14,47.5942
2015-08-17,47.6512
2015-08-18,47.3378
2015-08-19,47.2428
2015-08-20,46.5781
2015-08-21,46.0273
2015-08-24,44.9923
2015-08-25,45.4386
2015-08-26,46.977
2015-08-27,47.5942
2015-08-28,48.4773
2015-08-31,48.4298
2015-09-01,46.977
2015-09-02,47.7936
2015-09-03,48.0975
2015-09-04,47.7746
2015-09-08,48.8097
2015-09-09,48.2304
2015-09-10,48.4963
2015-09-11,48.9806
2015-09-14,48.5723
2015-09-15,48.164
2015-09-16,48.8952
2015-09-17,48.9426
2015-09-18,47.4328
2015-09-21,47.8126
2015-09-22,46.6541
2015-09-23,45.9894
2015-09-24,45.2677
2015-09-25,45.6475
2015-09-28,44.2706
2015-09-29,44.2896
2015-09-30,45.4387
2015-10-01,45.658
2015-10-02,46.459
2015-10-05,47.5366
2015-10-06,46.9263
2015-10-07,47.5842
2015-10-08,48.6809
2015-10-09,48.1945
2015-10-12,48.3471
2015-10-13,47.7368
2015-10-14,47.2123
2015-10-15,48.2422
2015-10-16,48.0992
2015-10-19,47.7845
2015-10-20,48.2708
2015-10-21,47.4317
2015-10-22,48.4806
2015-10-23,47.5461
2015-10-26,48.2994
2015-10-27,48.8907
2015-10-28,50.178
2015-10-29,50.6548
2015-10-30,49.8824
2015-11-02,50.9886
2015-11-03,51.9708
2015-11-04,51.3318
2015-11-05,51.7038
2015-11-06,51.4272
2015-11-09,50.7502
2015-11-10,51.0553
2015-11-11,50.9599
2015-11-12,50.3497
2015-11-13,47.9085
2015-11-16,48.4615
2015-11-17,48.4711
2015-11-18,49.1863
2015-11-19,49.0432
2015-11-20,49.2816
2015-11-23,49.6917
2015-11-24,49.0432
2015-11-25,49.3865
2015-11-27,49.5868
2015-11-30,48.7095
2015-12-01,49.1386
2015-12-02,49.377
2015-12-03,48.1945
2015-12-04,48.9288
2015-12-07,47.8798
2015-12-08,47.9085
2015-12-09,47.7082
2015-12-10,48.4139
2015-12-11,47.0311
2015-12-14,47.0407
2015-12-15,47.7177
2015-12-16,48.0992
2015-12-17,47.775
2015-12-18,48.1278
2015-12-21,48.1373
2015-12-22,48.3566
2015-12-23,49.0337
2015-12-24,48.8048
2015-12-28,48.7858
2015-12-29,49.0432
2015-12-30,48.4449
2015-12-31,48.2629
2016-01-04,47.296
2016-01-05,47.6885
2016-01-06,44.4716
2016-01-07,42.9302
2016-01-08,43.5812
2016-01-11,43.3897
2016-01-12,43.2844
2016-01-13,41.0632
2016-01-14,40.6037
2016-01-15,40.192
2016-01-19,40.0675
2016-01-20,41.0537
2016-01-21,41.5802
2016-01-22,42.3653
2016-01-25,41.4749
2016-01-26,41.877
2016-01-27,41.5898
2016-01-28,41.1494
2016-01-29,41.8579
2016-02-01,41.7621
2016-02-02,40.3356
2016-02-03,40.5845
2016-02-04,41.8579
2016-02-05,41.2547
2016-02-08,41.3983
2016-02-09,41.4558
2016-02-10,41.6185
2016-02-11,41.2547
2016-02-12,43.0068
2016-02-16,43.5429
2016-02-17,45.7067
2016-02-18,47.4779
2016-02-19,50.2161
2016-02-22,50.1778
2016-02-23,49.9193
2016-02-24,48.1959
2016-02-25,48.6459
2016-02-26,49.2969
2016-02-29,49.6225
2016-03-01,49.9767
2016-03-02,50.1203
2016-03-03,50.6948
2016-03-04,50.1299
2016-03-07,50.398
2016-03-08,48.9236
2016-03-09,49.2012
2016-03-10,48.4449
2016-03-11,49.8905
2016-03-14,50.0916
2016-03-15,49.3352
2016-03-16,49.2969
2016-03-17,49.4118
2016-03-18,49.9671
2016-03-21,50.8958
2016-03-22,50.0533
2016-03-23,49.3065
2016-03-24,49.2874
2016-03-28,49.8235
2016-03-29,50.8575
2016-03-30,51.5469
2016-03-31,51.9457
2016-04-01,50.5329
2016-04-04,50.8405
2016-04-05,49.6392
2016-04-06,50.0716
2016-04-07,49.6584
2016-04-08,50.2062
2016-04-11,50.7252
2016-04-12,50.6867
2016-04-13,51.4075
2016-04-14,51.1576
2016-04-15,51.1192
2016-04-18,50.802
2016-04-19,50.8597
2016-04-20,50.5618
2016-04-21,50.4945
2016-04-22,49.4469
2016-04-25,49.543
2016-04-26,49.3893
2016-04-27,49.6103
2016-04-28,49.4662
2016-04-29,48.6877
2016-05-02,49.0913
2016-05-03,48.976
2016-05-04,48.2648
2016-05-05,46.3907
2016-05-06,46.2081
2016-05-09,45.8141
2016-05-10,46.6406
2016-05-11,45.5546
2016-05-12,45.1702
2016-05-13,44.6128
2016-05-16,44.7281
2016-05-17,44.1322
2016-05-18,43.8151
2016-05-19,43.1712
2016-05-20,43.4979
2016-05-23,43.6421
2016-05-24,43.9208
2016-05-25,43.8247
2016-05-26,43.5844
2016-05-27,43.9304
2016-05-31,43.6133
2016-06-01,43.8824
2016-06-02,44.7665
2016-06-03,44.4398
2016-06-06,44.6993
2016-06-07,44.7762
2016-06-08,44.7762
2016-06-09,44.6032
2016-06-10,43.9785
2016-06-13,43.9496
2016-06-14,43.6613
2016-06-15,44.0938
2016-06-16,44.1322
2016-06-17,44.5071
2016-06-20,45.0837
2016-06-21,45.3432
2016-06-22,45.0356
2016-06-23,45.6699
2016-06-24,43.6036
2016-06-27,42.5273
2016-06-28,43.2385
2016-06-29,45.1356
2016-06-30,45.9756
2016-07-01,46.5838
2016-07-05,45.879
2016-07-06,46.1976
2016-07-07,46.188
2016-07-08,46.0721
2016-07-11,46.3907
2016-07-12,46.7576
2016-07-13,46.3907
2016-07-14,46.2845
2016-07-15,46.0721
2016-07-18,46.2942
2016-07-19,46.159
2016-07-20,46.0335
2016-07-21,45.8887
2016-07-22,46.7479
2016-07-25,46.8541
2016-07-26,46.8638
2016-07-27,46.3617
2016-07-28,46.5162
2016-07-29,46.6224
2016-08-01,46.4583
2016-08-02,47.5975
2016-08-03,47.4817
2016-08-04,47.6555
2016-08-05,48.0803
2016-08-08,47.8582
2016-08-09,47.3272
2016-08-10,47.3658
2016-08-11,47.1341
2016-08-12,47.1148
2016-08-15,47.2403
2016-08-16,47.8196
2016-08-17,47.6265
2016-08-18,47.8679
2016-08-19,47.8968
2016-08-22,47.781
2016-08-23,47.7231
2016-08-24,47.472
2016-08-25,47.6748
2016-08-26,47.4045
2016-08-29,47.4624
2016-08-30,47.3465
2016-08-31,46.8155
2016-09-01,46.7769
2016-09-02,46.4293
2016-09-06,46.5452
2016-09-07,46.8831
2016-09-08,46.4776
2016-09-09,45.1742
2016-09-12,45.8694
2016-09-13,45.2804
2016-09-14,45.1066
2016-09-15,45.1839
2016-09-16,44.8363
2016-09-19,44.6818
2016-09-20,44.6818
2016-09-21,44.9908
2016-09-22,45.068
2016-09-23,44.9715
2016-09-26,44.006
2016-09-27,43.5329
2016-09-28,43.166
2016-09-29,43.4425
2016-09-30,43.7237
2016-10-03,43.4716
2016-10-04,43.2388
2016-10-05,43.5686
2016-10-06,43.4813
2016-10-07,43.0739
2016-10-10,43.4425
2016-10-11,42.8411
2016-10-12,43.0157
2016-10-13,42.7344
2016-10-14,43.1321
2016-10-17,43.9856
2016-10-18,44.4706
2016-10-19,44.0341
2016-10-20,43.6947
2016-10-21,43.9856
2016-10-24,43.7431
2016-10-25,43.5007
2016-10-26,43.1127
2016-10-27,44.1311
2016-10-28,45.8285
2016-10-31,46.9924
2016-11-01,46.2649
2016-11-02,46.6044
2016-11-03,46.7984
2016-11-04,46.5559
2016-11-07,47.6713
2016-11-08,47.7683
2016-11-09,48.3987
2016-11-10,48.0108
2016-11-11,48.1078
2016-11-14,48.6897
2016-11-15,48.4472
2016-11-16,48.9128
2016-11-17,48.5927
2016-11-18,48.5927
2016-11-21,49.5626
2016-11-22,49.9991
2016-11-23,50.775
2016-11-25,51.26
2016-11-28,50.4841
2016-11-29,50.5325
2016-11-30,49.9021
2016-12-01,50.4356
2016-12-02,50.3386
2016-12-05,51.163
2016-12-06,51.8904
2016-12-07,52.6179
2016-12-08,52.7149
2016-12-09,52.9573
2016-12-12,53.8303
2016-12-13,53.7333
2016-12-14,52.9573
2016-12-15,53.6363
2016-12-16,54.0727
2016-12-19,54.5092
2016-12-20,54.7032
2016-12-21,54.9942
2016-12-22,54.3637
2016-12-23,54.7032
2016-12-27,54.6062
2016-12-28,54.4122
2016-12-29,54.6062
2016-12-30,54.5721
2017-01-03,53.8419
2017-01-04,54.5234
2017-01-05,53.4038
2017-01-06,53.063
2017-01-09,52.6735
2017-01-10,53.063
2017-01-11,52.7222
2017-01-12,52.9656
2017-01-13,52.9656
2017-01-17,52.0894
2017-01-18,52.8683
2017-01-19,53.0143
2017-01-20,53.7445
2017-01-23,53.7445
2017-01-24,54.0853
2017-01-25,54.28
2017-01-26,54.6208
2017-01-27,54.5721
2017-01-30,54.0366
2017-01-31,54.0366
2017-02-01,54.134
2017-02-02,54.0853
2017-02-03,54.5721
2017-02-06,54.1827
2017-02-07,54.4261
2017-02-08,54.7182
2017-02-09,55.166
2017-02-10,55.4971
2017-02-13,55.5944
2017-02-14,55.5944
2017-02-15,56.3247
2017-02-16,60.9007
2017-02-17,60.6573
2017-02-21,59.7324
2017-02-22,59.6837
2017-02-23,59.0119
2017-02-24,58.9048
2017-02-27,59.2942
2017-02-28,59.0021
2017-03-01,59.7811
2017-03-02,60.0245
2017-03-03,60.2679
2017-03-06,60.6086
2017-03-07,60.2289
2017-03-08,59.9758
2017-03-09,60.1218
2017-03-10,60.6086
2017-03-13,60.6573
2017-03-14,60.706
2017-03-15,61.5823
2017-03-16,61.2415
2017-03-17,61.5336
2017-03-20,61.2415
2017-03-21,59.8784
2017-03-22,60.706
2017-03-23,60.9494
2017-03-24,60.9007
2017-03-27,60.706
2017-03-28,61.1928
2017-03-29,61.631
2017-03-30,61.6945
2017-03-31,61.1572
2017-04-03,61.0595
2017-04-04,60.8641
2017-04-05,61.3037
2017-04-06,61.3526
2017-04-07,60.8641
2017-04-10,60.8641
2017-04-11,61.1572
2017-04-12,61.3037
2017-04-13,61.0106
2017-04-17,61.1572
2017-04-18,60.9129
2017-04-19,61.4014
2017-04-20,61.7922
2017-04-21,61.4991
2017-04-24,61.9387
2017-04-25,62.0364
2017-04-26,62.3784
2017-04-27,63.3065
2017-04-28,61.2549
2017-05-01,62.8668
2017-05-02,63.6484
2017-05-03,63.4042
2017-05-04,64.5765
2017-05-05,60.8641
2017-05-08,60.1802
2017-05-09,61.3037
2017-05-10,61.3037
2017-05-11,61.0106
2017-05-12,60.4538
2017-05-15,61.0595
2017-05-16,61.1572
2017-05-17,61.0106
2017-05-18,61.5479
2017-05-19,62.8278
2017-05-22,63.3553
2017-05-23,63.453
2017-05-24,63.3553
2017-05-25,63.6484
2017-05-26,64.088
2017-05-30,63.3065
2017-05-31,63.453
2017-06-01,63.9903
2017-06-02,64.5765
2017-06-05,63.5995
2017-06-06,63.453
2017-06-07,63.2088
2017-06-08,63.5507
2017-06-09,62.6714
2017-06-12,63.5019
2017-06-13,64.4788
2017-06-14,65.0747
2017-06-15,65.2604
2017-06-16,64.9673
2017-06-19,65.8465
2017-06-20,64.3811
2017-06-21,64.3811
2017-06-22,63.8438
2017-06-23,65.1627
2017-06-26,64.723
2017-06-27,63.6484
2017-06-28,64.0392
2017-06-29,63.0247
2017-06-30,62.9757
2017-07-03,62.8777
2017-07-05,63.0737
2017-07-06,62.6326
2017-07-07,62.0935
2017-07-10,61.4074
2017-07-11,61.4074
2017-07-12,61.8485
2017-07-13,62.6326
2017-07-14,62.9267
2017-07-17,63.3188
2017-07-18,63.9559
2017-07-19,63.6128
2017-07-20,63.2207
2017-07-21,62.9169
2017-07-24,62.8777
2017-07-25,63.0737
2017-07-26,62.7307
2017-07-27,63.2697
2017-07-28,63.2697
2017-07-31,63.3678
2017-08-01,63.9069
2017-08-02,61.3094
2017-08-03,60.8683
2017-08-04,61.4074
2017-08-07,61.7309
2017-08-08,59.7411
2017-08-09,59.3001
2017-08-10,58.859
2017-08-11,59.9862
2017-08-14,60.3292
2017-08-15,60.2214
2017-08-16,60.5253
2017-08-17,59.3981
2017-08-18,59.2021
2017-08-21,59.5451
2017-08-22,60.2802
2017-08-23,59.3001
2017-08-24,59.6431
2017-08-25,59.3981
2017-08-28,59.4471
2017-08-29,58.957
2017-08-30,59.8882
2017-08-31,60.8193
2017-09-01,60.7703
2017-09-05,59.2021
2017-09-06,59.7902
2017-09-07,59.006
2017-09-08,59.8882
2017-09-11,59.8882
2017-09-12,60.4861
2017-09-13,60.7703
2017-09-14,60.7703
2017-09-15,60.2312
2017-09-18,60.3783
2017-09-19,60.3292
2017-09-20,60.9664
2017-09-21,61.4074
2017-09-22,61.9955
2017-09-25,61.9955
2017-09-26,61.9955
2017-09-27,62.1916
2017-09-28,62.7797
2017-09-29,62.8436
2017-10-02,62.6961
2017-10-03,62.7944
2017-10-04,62.942
2017-10-05,63.8762
2017-10-06,64.368
2017-10-09,65.499
2017-10-10,65.6465
2017-10-11,66.089
2017-10-12,66.2366
2017-10-13,66.2366
2017-10-16,66.4824
2017-10-17,67.1709
2017-10-18,67.0725
2017-10-19,67.3184
2017-10-20,66.8267
2017-10-23,66.1382
2017-10-24,66.4824
2017-10-25,66.6545
2017-10-26,68.5969
2017-10-27,68.7444
2017-10-30,68.8428
2017-10-31,68.5969
2017-11-01,68.5969
2017-11-02,68.6461
2017-11-03,68.6461
2017-11-06,72.5799
2017-11-07,72.5799
2017-11-08,72.2357
2017-11-09,71.8423
2017-11-10,72.875
2017-11-13,72.875
2017-11-14,73.1208
2017-11-15,72.8258
2017-11-16,74.3502
2017-11-17,74.6452
2017-11-20,74.8911
2017-11-21,75.9237
2017-11-22,75.8746
2017-11-24,76.0712
2017-11-27,75.8254
2017-11-28,77.0055
2017-11-29,76.9072
2017-11-30,77.2022
2017-12-01,76.563
2017-12-04,77.3989
2017-12-05,76.9072
2017-12-06,76.5138
2017-12-07,76.7597
2017-12-08,77.1531
2017-12-11,76.2188
2017-12-12,75.727
2017-12-13,74.6452
2017-12-14,74.4977
2017-12-15,74.9403
2017-12-18,76.4155
2017-12-19,76.3663
2017-12-20,76.2188
2017-12-21,75.9237
2017-12-22,76.1696
2017-12-26,76.6122
2017-12-27,76.563
2017-12-28,76.858
2017-12-29,76.5276
2018-01-02,75.9359
2018-01-03,76.5276
2018-01-04,76.1825
2018-01-05,75.6894
2018-01-08,78.8452
2018-01-09,78.1548
2018-01-10,78.1548
2018-01-11,78.6479
2018-01-12,79.4369
2018-01-16,78.8452
2018-01-17,80.2751
2018-01-18,79.8807
2018-01-19,81.0148
2018-01-22,79.782
2018-01-23,80.4231
2018-01-24,79.3383
2018-01-25,80.4231
2018-01-26,81.1134
2018-01-29,80.8175
2018-01-30,81.0148
2018-01-31,81.0148
2018-02-01,80.4724
2018-02-02,78.5
2018-02-05,76.0346
2018-02-06,77.5631
2018-02-07,78.1055
2018-02-08,75.3442
2018-02-09,76.6756
2018-02-12,77.1687
2018-02-13,77.4645
2018-02-14,79.2396
2018-02-15,79.4862
2018-02-16,79.3876
2018-02-20,77.1194
2018-02-21,79.0424
2018-02-22,79.1903
2018-02-23,80.4231
2018-02-26,80.3737
2018-02-27,78.3028
2018-02-28,78.0562
2018-03-01,77.6124
2018-03-02,78.3028
2018-03-05,78.4014
2018-03-06,79.4369
2018-03-07,80.571
2018-03-08,80.9655
2018-03-09,82.5433
2018-03-12,83.2337
2018-03-13,82.494
2018-03-14,83.1351
2018-03-15,83.4309
2018-03-16,82.8392
2018-03-19,81.9023
2018-03-20,82.494
2018-03-21,82.4447
2018-03-22,80.4231
2018-03-23,78.8452
2018-03-26,80.1765
2018-03-27,79.1903
2018-03-28,78.9438
2018-03-29,79.2553
2018-04-02,78.5137
2018-04-03,79.2058
2018-04-04,79.6014
2018-04-05,80.2441
2018-04-06,79.0081
2018-04-09,78.2664
2018-04-10,78.217
2018-04-11,79.7497
2018-04-12,80.6397
2018-04-13,78.7114
2018-04-16,80.4419
2018-04-17,81.2824
2018-04-18,81.1835
2018-04-19,80.5902
2018-04-20,79.9475
2018-04-23,79.6014
2018-04-24,79.9475
2018-04-25,80.2441
2018-04-26,79.9969
2018-04-27,79.7003
2018-04-30,79.1564
2018-05-01,79.0081
2018-05-02,78.3653
2018-05-03,79.2553
2018-05-04,80.2441
2018-05-07,80.4913
2018-05-08,80.9363
2018-05-09,82.4196
2018-05-10,82.2712
2018-05-11,80.6397
2018-05-14,78.9586
2018-05-15,78.4642
2018-05-16,79.5025
2018-05-17,78.5137
2018-05-18,79.0575
2018-05-21,79.3542
2018-05-22,78.9586
2018-05-23,78.8103
2018-05-24,78.8598
2018-05-25,78.662
2018-05-29,78.4148
2018-05-30,80.0464
2018-05-31,79.4531
2018-06-01,80.5902
2018-06-04,80.8374
2018-06-05,81.3318
2018-06-06,81.3813
2018-06-07,81.5791
2018-06-08,80.4913
2018-06-11,80.6891
2018-06-12,80.6397
2018-06-13,79.8486
2018-06-14,80.8374
2018-06-15,80.2936
2018-06-18,79.4036
2018-06-19,78.0687
2018-06-20,77.7226
2018-06-21,76.091
2018-06-22,76.536
2018-06-25,74.7561
2018-06-26,75.7944
2018-06-27,75.1022
2018-06-28,74.2617
2018-06-29,74.9707
2018-07-02,74.3757
2018-07-03,74.574
2018-07-05,75.1195
2018-07-06,75.5161
2018-07-09,76.0616
2018-07-10,76.0616
2018-07-11,75.9624
2018-07-12,76.6566
2018-07-13,76.7062
2018-07-16,76.5574
2018-07-17,76.5078
2018-07-18,78.2928
2018-07-19,78.4912
2018-07-20,78.392
2018-07-23,78.1937
2018-07-24,76.8549
2018-07-25,77.0037
2018-07-26,77.2516
2018-07-27,76.2103
2018-07-30,74.8716
2018-07-31,76.9541
2018-08-01,77.3507
2018-08-02,78.6895
2018-08-03,78.2432
2018-08-06,78.5903
2018-08-07,77.4499
2018-08-08,76.4582
2018-08-09,76.7557
2018-08-10,76.0616
2018-08-13,75.3178
2018-08-14,76.3591
2018-08-15,75.9128
2018-08-16,76.4582
2018-08-17,76.1111
2018-08-20,75.9624
2018-08-21,76.7557
2018-08-22,76.6566
2018-08-23,75.0699
2018-08-24,75.6153
2018-08-27,76.3095
2018-08-28,76.9541
2018-08-29,77.5491
2018-08-30,77.1028
2018-08-31,77.4003
2018-09-04,77.4995
2018-09-05,77.2516
2018-09-06,77.1524
2018-09-07,77.797
2018-09-10,78.1441
2018-09-11,77.8466
2018-09-12,78.2928
2018-09-13,80.0778
2018-09-14,80.8712
2018-09-17,80.4745
2018-09-18,81.1191
2018-09-19,81.6645
2018-09-20,82.3587
2018-09-21,82.5075
2018-09-24,82.0612
2018-09-25,82.1108
2018-09-26,82.5075
2018-09-27,83.5983
2018-09-28,82.6066
2018-10-01,81.0904
2018-10-02,80.981
2018-10-03,80.633
2018-10-04,79.0423
2018-10-05,78.565
2018-10-08,77.9685
2018-10-09,77.0538
2018-10-10,75.0056
2018-10-11,74.2699
2018-10-12,74.7273
2018-10-15,74.5682
2018-10-16,76.318
2018-10-17,75.9899
2018-10-18,74.6676
2018-10-19,72.9774
2018-10-22,73.3453
2018-10-23,72.53
2018-10-24,68.7618
2018-10-25,70.452
2018-10-26,69.9251
2018-10-29,70.0543
2018-10-30,71.1182
2018-10-31,72.9774
2018-11-01,75.5624
2018-11-02,75.5624
2018-11-05,76.2286
2018-11-06,75.1647
2018-11-07,76.7257
2018-11-08,77.193
2018-11-09,77.6503
2018-11-12,76.9941
2018-11-13,77.1134
2018-11-14,77.3222
2018-11-15,77.5807
2018-11-16,78.4557
2018-11-19,76.8549
2018-11-20,75.9303
2018-11-21,76.4771
2018-11-23,77.0041
2018-11-26,77.4316
2018-11-27,76.7058
2018-11-28,78.3463
2018-11-29,78.4258
2018-11-30,77.4216
2018-12-03,78.923
2018-12-04,75.5226
2018-12-06,75.7116
2018-12-07,74.4389
2018-12-10,73.0172
2018-12-11,72.0229
2018-12-12,72.9078
2018-12-13,72.4902
2018-12-14,71.7346
2018-12-17,71.3568
2018-12-18,70.5415
2018-12-19,69.8555
2018-12-20,68.553
2018-12-21,67.5687
2018-12-24,66.475
2018-12-26,69.3882
2018-12-27,70.4719
2018-12-28,71.2474
2018-12-31,71.382
2019-01-02,71.1626
2019-01-03,69.9061
2019-01-04,72.3294
2019-01-07,72.7283
2019-01-08,73.9848
2019-01-09,73.8053
2019-01-10,74.0546
2019-01-11,74.5333
2019-01-14,73.925
2019-01-15,74.7926
2019-01-16,74.4635
2019-01-17,74.4934
2019-01-18,75.2114
2019-01-22,74.3238
2019-01-23,74.5632
2019-01-24,75.2513
2019-01-25,75.7
2019-01-28,76.4679
2019-01-29,77.3654
2019-01-30,78.4424
2019-01-31,78.941
2019-02-01,78.4723
2019-02-04,79.4397
2019-02-05,79.7687
2019-02-06,80.2574
2019-02-07,79.6192
2019-02-08,79.1704
2019-02-11,79.0507
2019-02-12,80.1278
2019-02-13,81.3743
2019-02-14,81.7632
2019-02-15,80.3771
2019-02-19,78.8313
2019-02-20,80.2474
2019-02-21,80.4668
2019-02-22,80.9255
2019-02-25,79.7787
2019-02-26,79.0109
2019-02-27,79.6591
2019-02-28,79.6192
2019-03-01,80.1477
2019-03-04,79.9682
2019-03-05,80.9355
2019-03-06,80.5466
2019-03-07,78.4923
2019-03-08,78.6818
2019-03-11,77.9438
2019-03-12,77.7045
2019-03-13,78.1433
2019-03-14,77.6147
2019-03-15,77.6247
2019-03-18,77.8939
2019-03-19,77.6945
2019-03-20,76.9466
2019-03-21,77.5549
2019-03-22,77.166
2019-03-25,76.3782
2019-03-26,76.787
2019-03-27,76.4081
2019-03-28,77.4651
2019-03-29,77.525
2019-04-01,78.52
2019-04-02,79.07
2019-04-03,79.89
2019-04-04,80.29
2019-04-05,81.77
2019-04-08,81.71
2019-04-09,80.24
2019-04-10,80.4
2019-04-11,80.66
2019-04-12,81.37
2019-04-15,80.47
2019-04-16,81.52
2019-04-17,81.45
2019-04-18,82.18
2019-04-22,81.8
2019-04-23,82.51
2019-04-24,83.38
2019-04-25,82.62
2019-04-26,82.96
2019-04-29,83.17
2019-04-30,83.04
2019-05-01,83.87
2019-05-02,84.28
2019-05-03,86.71
2019-05-06,86.95
2019-05-07,85.27
2019-05-08,85.84
2019-05-09,84.5
2019-05-10,83.29
2019-05-13,81.73
2019-05-14,82.88
2019-05-15,84.17
2019-05-16,84.57
2019-05-17,84.07
2019-05-20,82.76
2019-05-21,84.18
2019-05-22,84.36
2019-05-23,83.21
2019-05-24,83.3
2019-05-28,82.7
2019-05-29,82.65
2019-05-30,82.83
2019-05-31,82.29
2019-06-03,81.87
2019-06-04,82.88
2019-06-05,83.02
2019-06-06,83.68
2019-06-07,85.54
2019-06-10,85.75
2019-06-11,85.97
2019-06-12,84.7
2019-06-13,84.72
2019-06-14,85.65
2019-06-17,85.14
2019-06-18,85.865
2019-06-19,85.85
2019-06-20,86.35
2019-06-21,85.195
2019-06-24,85.445
2019-06-25,84.54
2019-06-26,85.29
2019-06-27,86.025
2019-06-28,87.03
2019-07-01,87.1
2019-07-02,88.375
2019-07-03,89.21
2019-07-04,89.21
2019-07-05,88.86
2019-07-08,88.185
2019-07-09,88.585
2019-07-10,88.43
2019-07-11,88.68
2019-07-12,89
2019-07-15,89.19
2019-07-16,89.645
2019-07-17,88.82
2019-07-18,88.18
2019-07-19,87.11
2019-07-22,86.86
2019-07-23,88.58
2019-07-24,88.04
2019-07-25,87.82
2019-07-26,88
2019-07-29,87.72
2019-07-30,87.27
2019-07-31,85.84
2019-08-01,85.44
2019-08-02,84.54
2019-08-05,81.495
2019-08-06,85.835
2019-08-07,86.115
2019-08-08,88.46
2019-08-09,89.715
2019-08-12,89.8
2019-08-13,90.55
2019-08-14,87.8
2019-08-15,87.655
2019-08-16,88.29
2019-08-19,88.92
2019-08-20,88.17
2019-08-21,87.875
2019-08-22,88.98
2019-08-23,87.465
2019-08-26,89.08
2019-08-27,89.92
2019-08-28,90.73
2019-08-29,91.06
2019-08-30,91.06
2019-09-02,91.07
2019-09-03,91.66
2019-09-04,92.36
2019-09-05,92.65
2019-09-06,93.085
2019-09-09,92.56
2019-09-10,93.27
2019-09-11,94.2
2019-09-12,93.29
2019-09-13,94.47
2019-09-16,92.9
2019-09-17,93.195
2019-09-18,93.19
2019-09-19,92.11
2019-09-20,90.85
2019-09-23,90.07
2019-09-24,88.99
2019-09-25,89.255
2019-09-26,88.425
2019-09-27,87.88
2019-09-30,88.99
2019-10-01,88.69
2019-10-02,87.61
2019-10-03,87.345
2019-10-04,87.76
2019-10-07,87.73
2019-10-08,87.405
2019-10-09,88.66
2019-10-10,87.77
2019-10-11,88.71
2019-10-14,87.89
2019-10-15,88.18
2019-10-16,88.25
2019-10-17,87.515
2019-10-18,86.64
2019-10-21,86.945
2019-10-22,85.335
2019-10-23,86.365
2019-10-24,86.53
2019-10-25,87.475
2019-10-28,87.57
2019-10-29,87.18
2019-10-30,87.58
2019-10-31,88.55
2019-11-01,88.78
2019-11-04,89.28
2019-11-05,89.865
2019-11-06,90.465
2019-11-07,91.54
2019-11-08,90.705
2019-11-11,89.36
2019-11-12,89.96
2019-11-13,90.55
2019-11-14,91.2
2019-11-15,92.375
2019-11-18,92.6
2019-11-19,93.76
2019-11-20,92.27
2019-11-21,91.96
2019-11-22,93.34
2019-11-25,95.1
