date,close
2014-06-13,39.5789
2014-06-16,39.5691
2014-06-17,39.6862
2014-06-18,39.9008
2014-06-19,39.8813
2014-06-20,39.5984
2014-06-23,39.6569
2014-06-24,39.5106
2014-06-25,39.1886
2014-06-26,39.1106
2014-06-27,39.6959
2014-06-30,39.813
2014-07-01,39.9593
2014-07-02,39.8227
2014-07-03,40.0374
2014-07-07,38.9545
2014-07-08,38.6033
2014-07-09,38.974
2014-07-10,38.4472
2014-07-11,38.4082
2014-07-14,39.1398
2014-07-15,38.5935
2014-07-16,38.9057
2014-07-17,39.0716
2014-07-18,39.7057
2014-07-21,39.452
2014-07-22,39.6959
2014-07-23,39.7545
2014-07-24,39.774
2014-07-25,39.8227
2014-07-28,39.8032
2014-07-29,38.9545
2014-07-30,38.9252
2014-07-31,38.574
2014-08-01,38.1838
2014-08-04,38.5935
2014-08-05,38.4082
2014-08-06,38.5252
2014-08-07,38.2423
2014-08-08,38.4244
2014-08-11,38.63
2014-08-12,38.023
2014-08-13,38.1307
2014-08-14,37.7293
2014-08-15,37.3965
2014-08-18,37.4356
2014-08-19,37.2203
2014-08-20,37.2398
2014-08-21,37.7097
2014-08-22,38.0915
2014-08-25,37.5727
2014-08-26,37.9545
2014-08-27,38.4342
2014-08-28,38.1992
2014-08-29,38.581
2014-09-02,38.7475
2014-09-03,38.7475
2014-09-04,38.5517
2014-09-05,38.1797
2014-09-08,39.2076
2014-09-09,38.6789
2014-09-10,38.9628
2014-09-11,39.2957
2014-09-12,39.5404
2014-09-15,39.7852
2014-09-16,40.5977
2014-09-17,40.2648
2014-09-18,40.304
2014-09-19,39.9907
2014-09-22,39.325
2014-09-23,39.3153
2014-09-24,39.7068
2014-09-25,39.3446
2014-09-26,39.4131
2014-09-29,39.9124
2014-09-30,39.932
2014-10-01,40.353
2014-10-02,39.9809
2014-10-03,40.3138
2014-10-06,40.2453
2014-10-07,39.5502
2014-10-08,39.5796
2014-10-09,38.8062
2014-10-10,38.5125
2014-10-13,38.1699
2014-10-14,38.3363
2014-10-15,38.3852
2014-10-16,38.0524
2014-10-17,38.5614
2014-10-20,38.7475
2014-10-21,39.5698
2014-10-22,38.9335
2014-10-23,39.0216
2014-10-24,39.3642
2014-10-27,39.374
2014-10-28,39.5306
2014-10-29,39.4229
2014-10-30,39.5306
2014-10-31,39.8243
2014-11-03,40.167
2014-11-04,40.2355
2014-11-05,43.8577
2014-11-06,44.4744
2014-11-07,44.2101
2014-11-10,44.5233
2014-11-11,45.0128
2014-11-12,45.4044
2014-11-13,45.5526
2014-11-14,45.5723
2014-11-17,45.7097
2014-11-18,45.317
2014-11-19,45.0225
2014-11-20,45.7784
2014-11-21,45.8766
2014-11-24,46.3282
2014-11-25,46.4558
2014-11-26,46.5147
2014-11-28,46.3675
2014-12-01,46.7209
2014-12-02,47.2412
2014-12-03,47.467
2014-12-04,47.6437
2014-12-05,47.9775
2014-12-08,47.7321
2014-12-09,48.9396
2014-12-10,49.0673
2014-12-11,47.8695
2014-12-12,48.4978
2014-12-15,48.6451
2014-12-16,48.3506
2014-12-17,48.6157
2014-12-18,49.3127
2014-12-19,49.1752
2014-12-22,49.941
2014-12-23,50.2846
2014-12-24,49.8134
2014-12-26,49.9116
2014-12-29,49.6367
2014-12-30,49.8821
2014-12-31,49.725
2015-01-02,49.2636
2015-01-05,48.6255
2015-01-06,47.2412
2015-01-07,48.0953
2015-01-08,49.3618
2015-01-09,49.1458
2015-01-12,48.331
2015-01-13,49.1163
2015-01-14,49.8526
2015-01-15,48.7727
2015-01-16,48.5175
2015-01-20,49.3814
2015-01-21,49.5581
2015-01-22,49.7643
2015-01-23,49.401
2015-01-26,49.1851
2015-01-27,48.6844
2015-01-28,48.6549
2015-01-29,48.5666
2015-01-30,48.0561
2015-02-02,48.2328
2015-02-03,48.6058
2015-02-04,49.8428
2015-02-05,52.0125
2015-02-06,52.8175
2015-02-09,53.4065
2015-02-10,54.4864
2015-02-11,53.0727
2015-02-12,53.436
2015-02-13,53.4271
2015-02-17,54.0963
2015-02-18,55.7693
2015-02-19,56.9404
2015-02-20,57.9442
2015-02-23,57.1569
2015-02-24,57.275
2015-02-25,57.6391
2015-02-26,57.4325
2015-02-27,57.4423
2015-03-02,58.269
2015-03-03,57.8753
2015-03-04,57.9245
2015-03-05,57.7769
2015-03-06,58.1312
2015-03-09,59.4794
2015-03-10,58.5248
2015-03-11,58.8102
2015-03-12,59.4204
2015-03-13,58.948
2015-03-16,58.5543
2015-03-17,59.0562
2015-03-18,59.7746
2015-03-19,59.7845
2015-03-20,58.8496
2015-03-23,58.8496
2015-03-24,58.387
2015-03-25,58.5445
2015-03-26,57.708
2015-03-27,57.8655
2015-03-30,59.7254
2015-03-31,59.9616
2015-04-01,59.5384
2015-04-02,58.5248
2015-04-06,58.5347
2015-04-07,58.4658
2015-04-08,58.5543
2015-04-09,58.5445
2015-04-10,58.0426
2015-04-13,57.8458
2015-04-14,57.9147
2015-04-15,57.9442
2015-04-16,58.0623
2015-04-17,57.5702
2015-04-20,57.8359
2015-04-21,58.2296
2015-04-22,59.5778
2015-04-23,59.4892
2015-04-24,58.8594
2015-04-27,59.3613
2015-04-28,60.3848
2015-04-29,59.5286
2015-04-30,58.8988
2015-05-01,59.44
2015-05-04,59.7353
2015-05-05,58.6035
2015-05-06,58.5445
2015-05-07,61.2606
2015-05-08,61.8905
2015-05-11,63.3371
2015-05-12,63.7799
2015-05-13,64.705
2015-05-14,65.512
2015-05-15,65.1675
2015-05-18,65.7207
2015-05-19,65.5728
2015-05-20,65.632
2015-05-21,64.8825
2015-05-22,64.1479
2015-05-26,61.3919
2015-05-27,62.0427
2015-05-28,62.1906
2015-05-29,61.8258
2015-06-01,62.161
2015-06-02,62.4174
2015-06-03,64.7248
2015-06-04,64.2416
2015-06-05,65.1093
2015-06-08,66.1841
2015-06-09,66.1151
2015-06-10,67.328
2015-06-11,66.4701
2015-06-12,66.6476
2015-06-15,65.9968
2015-06-16,66.1546
2015-06-17,65.6813
2015-06-18,65.6911
2015-06-19,65.0896
2015-06-22,65.8785
2015-06-23,65.8686
2015-06-24,64.4388
2015-06-25,64.2712
2015-06-26,63.719
2015-06-29,62.3287
2015-06-30,62.7034
2015-07-01,64.0247
2015-07-02,64.0543
2015-07-06,63.1175
2015-07-07,63.0386
2015-07-08,62.3977
2015-07-09,63.009
2015-07-10,63.581
2015-07-13,63.157
2015-07-14,63.5514
2015-07-15,63.1471
2015-07-16,63.6401
2015-07-17,63.5711
2015-07-20,63.4232
2015-07-21,63.2753
2015-07-22,62.9696
2015-07-23,62.8907
2015-07-24,62.161
2015-07-27,61.1651
2015-07-28,63.1274
2015-07-29,62.161
2015-07-30,61.954
2015-07-31,63.6598
2015-08-03,64.4881
2015-08-04,64.2712
2015-08-05,65.9081
2015-08-06,65.3559
2015-08-07,65.7323
2015-08-10,66.0879
2015-08-11,65.5248
2015-08-12,65.4754
2015-08-13,65.8706
2015-08-14,66.3448
2015-08-17,66.5424
2015-08-18,65.5742
2015-08-19,64.8233
2015-08-20,63.7661
2015-08-21,62.4916
2015-08-24,58.5692
2015-08-25,58.8557
2015-08-26,59.6758
2015-08-27,62.2149
2015-08-28,62.0075
2015-08-31,60.8219
2015-09-01,59.6362
2015-09-02,60.0216
2015-09-03,59.0928
2015-09-04,58.7866
2015-09-08,59.8042
2015-09-09,59.3201
2015-09-10,59.3102
2015-09-11,59.7746
2015-09-14,59.3497
2015-09-15,59.7647
2015-09-16,59.4386
2015-09-17,59.8536
2015-09-18,59.2312
2015-09-21,57.3045
2015-09-22,56.5043
2015-09-23,57.1465
2015-09-24,55.7632
2015-09-25,55.5755
2015-09-28,53.4809
2015-09-29,52.5819
2015-09-30,55.6546
2015-10-01,55.536
2015-10-02,56.1486
2015-10-05,56.8501
2015-10-06,56.6129
2015-10-07,57.0081
2015-10-08,56.3165
2015-10-09,56.8698
2015-10-12,56.5932
2015-10-13,54.4492
2015-10-14,54.5875
2015-10-15,55.4471
2015-10-16,57.0575
2015-10-19,56.6525
2015-10-20,56.8698
2015-10-21,56.7117
2015-10-22,56.9785
2015-10-23,57.0773
2015-10-26,57.2551
2015-10-27,56.0992
2015-10-28,56.5537
2015-10-29,60.7626
2015-10-30,61.0787
2015-11-02,62.294
2015-11-03,62.4027
2015-11-04,62.2248
2015-11-05,61.7901
2015-11-06,61.7416
2015-11-09,61.0386
2015-11-10,60.7317
2015-11-11,60.6129
2015-11-12,60.8406
2015-11-13,60.1575
2015-11-16,61.3258
2015-11-17,61.8901
2015-11-18,63.2861
2015-11-19,63.3752
2015-11-20,63.9099
2015-11-23,62.9
2015-11-24,63.3356
2015-11-25,62.9594
2015-11-27,62.3753
2015-11-30,60.8604
2015-12-01,61.9297
2015-12-02,61.9099
2015-12-03,59.5634
2015-12-04,60.7317
2015-12-07,58.7912
2015-12-08,58.4644
2015-12-09,58.1674
2015-12-10,58.5238
2015-12-11,56.3655
2015-12-14,56.5635
2015-12-15,57.5536
2015-12-16,58.0882
2015-12-17,58.4149
2015-12-18,57.3159
2015-12-21,56.9199
2015-12-22,56.5833
2015-12-23,57.0783
2015-12-24,57.1575
2015-12-28,58.108
2015-12-29,58.3258
2015-12-30,57.91
2015-12-31,56.7516
2016-01-04,56.0783
2016-01-05,57.0783
2016-01-06,56.6031
2016-01-07,55.5536
2016-01-08,54.9892
2016-01-11,55.8605
2016-01-12,57.6724
2016-01-13,55.1279
2016-01-14,56.207
2016-01-15,56.0387
2016-01-19,56.7912
2016-01-20,56.5932
2016-01-21,56.4843
2016-01-22,57.1476
2016-01-25,56.712
2016-01-26,57.712
2016-01-27,56.91
2016-01-28,57.9991
2016-01-29,59.9298
2016-02-01,61.7317
2016-02-02,61.7416
2016-02-03,59.8406
2016-02-04,59.4347
2016-02-05,57.0684
2016-02-08,55.5536
2016-02-09,54.2467
2016-02-10,54.019
2016-02-11,55.7615
2016-02-12,56.4942
2016-02-16,58.6426
2016-02-17,59.2169
2016-02-18,58.5238
2016-02-19,59.0684
2016-02-22,60.0716
2016-02-23,59.7342
2016-02-24,59.7342
2016-02-25,60.3792
2016-02-26,60.7463
2016-02-29,59.4564
2016-03-01,61.9172
2016-03-02,61.1631
2016-03-03,60.6669
2016-03-04,61.5997
2016-03-07,60.2899
2016-03-08,59.3671
2016-03-09,59.8434
2016-03-10,59.1686
2016-03-11,60.022
2016-03-14,60.6074
2016-03-15,61.4607
2016-03-16,62.5225
2016-03-17,64.0406
2016-03-18,64.4276
2016-03-21,63.3262
2016-03-22,63.5544
2016-03-23,64.3383
2016-03-24,64.4375
2016-03-28,64.3482
2016-03-29,64.5169
2016-03-30,65.4695
2016-03-31,64.2887
2016-04-01,63.9315
2016-04-04,63.5445
2016-04-05,62.2347
2016-04-06,62.5125
2016-04-07,61.689
2016-04-08,61.173
2016-04-11,61.4211
2016-04-12,61.4905
2016-04-13,62.7606
2016-04-14,63.0682
2016-04-15,63.6437
2016-04-18,64.4177
2016-04-19,64.1498
2016-04-20,64.4177
2016-04-21,64.1299
2016-04-22,63.356
2016-04-25,63.9216
2016-04-26,64.2788
2016-04-27,63.6437
2016-04-28,63.6437
2016-04-29,63.356
2016-05-02,63.7926
2016-05-03,63.2071
2016-05-04,62.6316
2016-05-05,63.4949
2016-05-06,63.8719
2016-05-09,63.5048
2016-05-10,63.7231
2016-05-11,63.4254
2016-05-12,63.3758
2016-05-13,63.3659
2016-05-16,64.4375
2016-05-17,63.3163
2016-05-18,66.045
2016-05-19,63.3516
2016-05-20,63.8488
2016-05-23,63.3218
2016-05-24,64.8877
2016-05-25,64.0476
2016-05-26,64.8131
2016-05-27,64.6441
2016-05-31,63.6201
2016-06-01,64.4751
2016-06-02,64.5149
2016-06-03,64.4751
2016-06-06,64.4552
2016-06-07,64.0377
2016-06-08,63.6698
2016-06-09,63.0434
2016-06-10,61.2538
2016-06-13,60.6673
2016-06-14,60.538
2016-06-15,60.4585
2016-06-16,59.7625
2016-06-17,60.5579
2016-06-20,62.2481
2016-06-21,62.6656
2016-06-22,62.3674
2016-06-23,63.2323
2016-06-24,59.9912
2016-06-27,59.5338
2016-06-28,60.1304
2016-06-29,62.3574
2016-06-30,63.4809
2016-07-01,64.9623
2016-07-05,63.8488
2016-07-06,63.63
2016-07-07,62.8446
2016-07-08,63.8786
2016-07-11,64.6342
2016-07-12,64.2763
2016-07-13,63.9184
2016-07-14,63.7792
2016-07-15,63.9283
2016-07-18,63.6897
2016-07-19,63.3218
2016-07-20,64.0277
2016-07-21,63.2224
2016-07-22,63.7692
2016-07-25,64.2166
2016-07-26,64.6242
2016-07-27,64.147
2016-07-28,68.2531
2016-07-29,68.2531
2016-08-01,68.114
2016-08-02,67.597
2016-08-03,67.756
2016-08-04,66.9308
2016-08-05,67.597
2016-08-08,67.1496
2016-08-09,66.9905
2016-08-10,67.2192
2016-08-11,67.7282
2016-08-12,67.6585
2016-08-15,67.6685
2016-08-16,67.1006
2016-08-17,66.8516
2016-08-18,67.3198
2016-08-19,67.2301
2016-08-22,67.5091
2016-08-23,67.8876
2016-08-24,67.7681
2016-08-25,67.8278
2016-08-26,67.9374
2016-08-29,67.2102
2016-08-30,67.8079
2016-08-31,68.1665
2016-09-01,68.0769
2016-09-02,67.9972
2016-09-06,67.4692
2016-09-07,68.3259
2016-09-08,68.1068
2016-09-09,67.0508
2016-09-12,66.493
2016-09-13,64.9589
2016-09-14,64.3612
2016-09-15,66.2141
2016-09-16,65.7758
2016-09-19,65.7857
2016-09-20,65.8455
2016-09-21,66.7022
2016-09-22,66.6623
2016-09-23,67.4593
2016-09-26,66.5627
2016-09-27,66.9512
2016-09-28,66.8317
2016-09-29,66.3236
2016-09-30,66.6823
2016-10-03,66.7221
2016-10-04,66.9911
2016-10-05,66.6424
2016-10-06,66.1941
2016-10-07,66.3137
2016-10-10,66.7221
2016-10-11,66.4033
2016-10-12,66.4183
2016-10-13,66.3037
2016-10-14,66.8317
2016-10-17,66.503
2016-10-18,67.2501
2016-10-19,66.6922
2016-10-20,66.6823
2016-10-21,66.5528
2016-10-24,66.6125
2016-10-25,66.5627
2016-10-26,66.3834
2016-10-27,66.503
2016-10-28,66.1742
2016-10-31,66.2141
2016-11-01,65.6961
2016-11-02,64.3413
2016-11-03,64.2417
2016-11-04,64.69
2016-11-07,66.7719
2016-11-08,67.9474
2016-11-09,68.6148
2016-11-10,67.519
2016-11-11,67.5091
2016-11-14,65.2378
2016-11-15,65.1382
2016-11-16,64.8992
2016-11-17,66.3934
2016-11-18,66.554
2016-11-21,66.3345
2016-11-22,66.3744
2016-11-23,66.3045
2016-11-25,65.8055
2016-11-28,66.025
2016-11-29,65.5959
2016-11-30,65.6657
2016-12-01,63.7993
2016-12-02,64.7574
2016-12-05,65.4162
2016-12-06,65.9652
2016-12-07,66.8934
2016-12-08,66.8934
2016-12-09,66.6938
2016-12-12,67.0331
2016-12-13,67.103
2016-12-14,66.3345
2016-12-15,67.5222
2016-12-16,67.6719
2016-12-19,67.8815
2016-12-20,67.7817
2016-12-21,67.7318
2016-12-22,67.1829
2016-12-23,67.612
2016-12-27,68.3307
2016-12-28,67.8815
2016-12-29,68.4704
2016-12-30,68.6301
2017-01-03,68.4804
2017-01-04,68.5303
2017-01-05,68.3307
2017-01-06,69.0194
2017-01-09,68.9994
2017-01-10,69.1292
2017-01-11,67.7518
2017-01-12,69.4286
2017-01-13,68.9395
2017-01-17,68.0612
2017-01-18,68.7499
2017-01-19,69.3488
2017-01-20,70.0075
2017-01-23,69.239
2017-01-24,68.7898
2017-01-25,69.5084
2017-01-26,69.5184
2017-01-27,69.6382
2017-01-30,69.4985
2017-01-31,70.0474
2017-02-01,69.5983
2017-02-02,69.7979
2017-02-03,70.3169
2017-02-06,67.622
2017-02-07,68.0512
2017-02-08,67.1928
2017-02-09,68.0712
2017-02-10,68.71
2017-02-13,68.69
2017-02-14,69.239
2017-02-15,68.8397
2017-02-16,70.1772
2017-02-17,68.9096
2017-02-21,69.8478
2017-02-22,69.219
2017-02-23,69.38
2017-02-24,69.34
2017-02-27,69.3
2017-02-28,68.25
2017-03-01,69.33
2017-03-02,69.28
2017-03-03,69.12
2017-03-06,69.12
2017-03-07,69.03
2017-03-08,68.52
2017-03-09,68.16
2017-03-10,68.3
2017-03-13,67.43
2017-03-14,66.83
2017-03-15,66.67
2017-03-16,67.15
2017-03-17,67.13
2017-03-20,67.21
2017-03-21,66.74
2017-03-22,66.71
2017-03-23,66.83
2017-03-24,67.13
2017-03-27,67.62
2017-03-28,67.03
2017-03-29,66.97
2017-03-30,67.84
2017-03-31,67.98
2017-04-03,67.74
2017-04-04,68.29
2017-04-05,68.2
2017-04-06,67.87
2017-04-07,67.83
2017-04-10,67.85
2017-04-11,67.52
2017-04-12,67.43
2017-04-13,66.61
2017-04-17,67.32
2017-04-18,67.45
2017-04-19,67.53
2017-04-20,68.31
2017-04-21,67.79
2017-04-24,68.27
2017-04-25,67.91
2017-04-26,68.54
2017-04-27,67.94
2017-04-28,67.45
2017-05-01,67.61
2017-05-02,67.67
2017-05-03,67.49
2017-05-04,72.54
2017-05-05,71.77
2017-05-08,72.48
2017-05-09,73.09
2017-05-10,74.86
2017-05-11,74.92
2017-05-12,74.61
2017-05-15,75.37
2017-05-16,76.05
2017-05-17,74.65
2017-05-18,74.24
2017-05-19,74.33
2017-05-22,75.22
2017-05-23,75.32
2017-05-24,77.13
2017-05-25,78.11
2017-05-26,78.19
2017-05-30,77.37
2017-05-31,77.91
2017-06-01,79.72
2017-06-02,80.41
2017-06-05,80.7
2017-06-06,80.86
2017-06-07,80.18
2017-06-08,80.55
2017-06-09,78.32
2017-06-12,77.76
2017-06-13,79.18
2017-06-14,79.76
2017-06-15,78.04
2017-06-16,78.04
2017-06-19,79.07
2017-06-20,78.74
2017-06-21,79.15
2017-06-22,78.94
2017-06-23,79.64
2017-06-26,79.78
2017-06-27,79.8
2017-06-28,80.22
2017-06-29,78.81
2017-06-30,78.72
2017-07-03,78.44
2017-07-05,78.01
2017-07-06,77.05
2017-07-07,77.23
2017-07-10,77.59
2017-07-11,77.46
2017-07-12,79.16
2017-07-13,78.24
2017-07-14,78.65
2017-07-17,78.55
2017-07-18,78.71
2017-07-19,78.49
2017-07-20,77.79
2017-07-21,77.74
2017-07-24,75.79
2017-07-25,75.59
2017-07-26,76.14
2017-07-27,75.4
2017-07-28,75
2017-07-31,74.66
2017-08-01,75.14
2017-08-02,74.16
2017-08-03,75.91
2017-08-04,76.58
2017-08-07,76.52
2017-08-08,75.59
2017-08-09,75.63
2017-08-10,74.65
2017-08-11,74.35
2017-08-14,76.42
2017-08-15,75.57
2017-08-16,75.91
2017-08-17,75.17
2017-08-18,74.67
2017-08-21,75.57
2017-08-22,76.95
2017-08-23,76.28
2017-08-24,77.02
2017-08-25,76.94
2017-08-28,77.26
2017-08-29,77.2
2017-08-30,77.53
2017-08-31,78.22
2017-09-01,78.57
2017-09-05,77.41
2017-09-06,78.38
2017-09-07,79.41
2017-09-08,78.71
2017-09-11,79.51
2017-09-12,79.76
2017-09-13,79.86
2017-09-14,79.63
2017-09-15,79.78
2017-09-18,81.14
2017-09-19,81.89
2017-09-20,81.83
2017-09-21,82.62
2017-09-22,81.84
2017-09-25,80.08
2017-09-26,79.75
2017-09-27,80
2017-09-28,80.11
2017-09-29,81.31
2017-10-02,80.62
2017-10-03,80.94
2017-10-04,80.87
2017-10-05,81.33
2017-10-06,81.51
2017-10-09,81.3
2017-10-10,81.13
2017-10-11,81.03
2017-10-12,81.56
2017-10-13,81.96
2017-10-16,82.2
2017-10-17,81.83
2017-10-18,81.01
2017-10-19,81.43
2017-10-20,82.14
2017-10-23,81.47
2017-10-24,81.3
2017-10-25,81.53
2017-10-26,81.76
2017-10-27,82.52
2017-10-30,82.05
2017-10-31,83.31
2017-11-01,82.05
2017-11-02,83.86
2017-11-03,85.52
2017-11-06,84.53
2017-11-07,84.48
2017-11-08,85.44
2017-11-09,84.03
2017-11-10,84.13
2017-11-13,84.25
2017-11-14,83.82
2017-11-15,83.68
2017-11-16,84.38
2017-11-17,84.29
2017-11-20,85.42
2017-11-21,85.87
2017-11-22,85.12
2017-11-24,86.24
2017-11-27,87.39
2017-11-28,88.37
2017-11-29,87.66
2017-11-30,87.51
2017-12-01,87.3
2017-12-04,88
2017-12-05,89.01
2017-12-06,88.55
2017-12-07,88
2017-12-08,87.83
2017-12-11,87.68
2017-12-12,87.71
2017-12-13,88.94
2017-12-14,88.19
2017-12-15,88.87
2017-12-18,89.11
2017-12-19,89.37
2017-12-20,89.75
2017-12-21,89.32
2017-12-22,89.32
2017-12-26,89.48
2017-12-27,89.58
2017-12-28,90.73
2017-12-29,91.91
2018-01-02,92.19
2018-01-03,92.1
2018-01-04,92.68
2018-01-05,92.79
2018-01-08,93.99
2018-01-09,93.33
2018-01-10,93.66
2018-01-11,93.97
2018-01-12,94.09
2018-01-16,91.96
2018-01-17,92.63
2018-01-18,93.83
2018-01-19,93.6
2018-01-22,91.6
2018-01-23,92.37
2018-01-24,91.9
2018-01-25,92.2
2018-01-26,92.28
2018-01-29,91.38
2018-01-30,90.93
2018-01-31,91.1
2018-02-01,90.99
2018-02-02,88.96
2018-02-05,86.83
2018-02-06,88.27
2018-02-07,87.23
2018-02-08,85.61
2018-02-09,86.61
2018-02-12,87.94
2018-02-13,88.31
2018-02-14,88.11
2018-02-15,89.53
2018-02-16,90.61
2018-02-20,93.91
2018-02-21,95.16
2018-02-22,95.32
2018-02-23,96.96
2018-02-26,97.44
2018-02-27,97.17
2018-02-28,96.59
2018-03-01,95.45
2018-03-02,96.68
2018-03-05,95.77
2018-03-06,95.98
2018-03-07,96.33
2018-03-08,97.28
2018-03-09,97.89
2018-03-12,96.61
2018-03-13,95.72
2018-03-14,96.3
2018-03-15,97.05
2018-03-16,97.02
2018-03-19,96.72
2018-03-20,97.21
2018-03-21,97.45
2018-03-22,95.59
2018-03-23,94.11
2018-03-26,94.14
2018-03-27,91.79
2018-03-28,91.72
2018-03-29,93.93
2018-04-02,92.4
2018-04-03,92.69
2018-04-04,91.5
2018-04-05,92.63
2018-04-06,91.34
2018-04-09,90.82
2018-04-10,93.65
2018-04-11,92.58
2018-04-12,94.02
2018-04-13,94
2018-04-16,94.95
2018-04-17,96.68
2018-04-18,97.24
2018-04-19,97.73
2018-04-20,97.04
2018-04-23,97.36
2018-04-24,95.28
2018-04-25,93.97
2018-04-26,96.47
2018-04-27,95.3
2018-04-30,95.17
2018-05-01,96.84
2018-05-02,97.44
2018-05-03,96.54
2018-05-04,97.06
2018-05-07,95.75
2018-05-08,96.54
2018-05-09,98.12
2018-05-10,99.26
2018-05-11,100.13
2018-05-14,101.33
2018-05-15,102.27
2018-05-16,103.56
2018-05-17,103.75
2018-05-18,103.77
2018-05-21,105.45
2018-05-22,106
2018-05-23,105.87
2018-05-24,107.11
2018-05-25,108.16
2018-05-29,106.98
2018-05-30,106.04
2018-05-31,105.75
2018-06-01,106.94
2018-06-04,108.07
2018-06-05,108.53
2018-06-06,108.63
2018-06-07,107.09
2018-06-08,106.41
2018-06-11,106.74
2018-06-12,107.7
2018-06-13,108.26
2018-06-14,108.92
2018-06-15,109.32
2018-06-18,110.495
2018-06-19,110.95
2018-06-20,110.2
2018-06-21,108.39
2018-06-22,107.51
2018-06-25,104.44
2018-06-26,104.95
2018-06-27,103.67
2018-06-28,104.2
2018-06-29,103.77
2018-07-02,105.02
2018-07-03,105.65
2018-07-05,105
2018-07-06,104.98
2018-07-09,104.71
2018-07-10,105.79
2018-07-11,105.45
2018-07-12,106.68
2018-07-13,107.25
2018-07-16,109.2
2018-07-17,109.27
2018-07-18,109.96
2018-07-19,108.66
2018-07-20,109.08
2018-07-23,109.81
2018-07-24,110.8
2018-07-25,114.48
2018-07-26,115.33
2018-07-27,114.5
2018-07-30,109.19
2018-07-31,109.4
2018-08-01,110.36
2018-08-02,111.2
2018-08-03,111.59
2018-08-06,109.78
2018-08-07,110.23
2018-08-08,110.04
2018-08-09,108.72
2018-08-10,110.56
2018-08-13,111.8
2018-08-14,110.75
2018-08-15,110
2018-08-16,109.54
2018-08-17,110.39
2018-08-20,113.18
2018-08-21,113.24
2018-08-22,113.69
2018-08-23,114.3
2018-08-24,114.86
2018-08-27,114.15
2018-08-28,114.2
2018-08-29,115.61
2018-08-30,115.17
2018-08-31,115.59
2018-09-04,116.7
2018-09-05,115.3
2018-09-06,116.42
2018-09-07,115.96
2018-09-10,115.15
2018-09-11,115.21
2018-09-12,116
2018-09-13,117
2018-09-14,117.36
2018-09-17,116.27
2018-09-18,115.71
2018-09-19,113.19
2018-09-20,113.31
2018-09-21,113.08
2018-09-24,113.33
2018-09-25,114.4
2018-09-26,115.1
2018-09-27,114.02
2018-09-28,114.47
2018-10-01,113.31
2018-10-02,112.15
2018-10-03,114.64
2018-10-04,111.78
2018-10-05,111.34
2018-10-08,108.21
2018-10-09,107.92
2018-10-10,104.57
2018-10-11,105.05
2018-10-12,107.39
2018-10-15,105
2018-10-16,107.24
2018-10-17,106.36
2018-10-18,105.38
2018-10-19,107.21
2018-10-22,108.72
2018-10-23,106.89
2018-10-24,104.58
2018-10-25,104.86
2018-10-26,103.23
2018-10-29,101.69
2018-10-30,103.72
2018-10-31,105.94
2018-11-01,106.11
2018-11-02,105.3
2018-11-05,105.45
2018-11-06,105.99
2018-11-07,107.26
2018-11-08,113.15
2018-11-09,113.52
2018-11-12,112.94
2018-11-13,111.38
2018-11-14,110.36
2018-11-15,112.44
2018-11-16,114.45
2018-11-19,111.06
2018-11-20,110.5
2018-11-21,110.58
2018-11-23,110.5
2018-11-26,111.82
2018-11-27,112.56
2018-11-28,115.04
2018-11-29,115.06
2018-11-30,116.14
2018-12-03,116.5
2018-12-04,115.5
2018-12-06,113.97
2018-12-07,112.52
2018-12-10,112.2
2018-12-11,112.01
2018-12-12,112.99
2018-12-13,112.72
2018-12-14,111.68
2018-12-17,109.35
2018-12-18,109.4
2018-12-19,108.85
2018-12-20,106.76
2018-12-21,105
2018-12-24,103.06
2018-12-26,106.77
2018-12-27,107.71
2018-12-28,107.3
2018-12-31,108.21
2019-01-02,106.85
2019-01-03,104.96
2019-01-04,107.73
2019-01-07,107.31
2019-01-08,107.75
2019-01-09,106.42
2019-01-10,107.24
2019-01-11,107.62
2019-01-14,103.76
2019-01-15,105.33
2019-01-16,104.36
2019-01-17,105.55
2019-01-18,106.11
2019-01-22,105.21
2019-01-23,106.28
2019-01-24,106.78
2019-01-25,107.62
2019-01-28,107.46
2019-01-29,107.87
2019-01-30,108.65
2019-01-31,109.95
2019-02-01,110.38
2019-02-04,111.36
2019-02-05,112.31
2019-02-06,111.48
2019-02-07,111.75
2019-02-08,112.66
2019-02-11,111.95
2019-02-12,113.07
2019-02-13,111.66
2019-02-14,116.26
2019-02-15,114.46
2019-02-19,113.93
2019-02-20,114.38
2019-02-21,114.94
2019-02-22,116.1
2019-02-25,118.01
2019-02-26,117.14
2019-02-27,117.2
2019-02-28,117.69
2019-03-01,118.07
2019-03-04,116.41
2019-03-05,116
2019-03-06,114.76
2019-03-07,113.7
2019-03-08,114.49
2019-03-11,115.29
2019-03-12,115.16
2019-03-13,116
2019-03-14,117.66
2019-03-15,118.99
2019-03-18,120.38
2019-03-19,120
2019-03-20,119.76
2019-03-21,118.89
2019-03-22,117
2019-03-25,116.23
2019-03-26,117.58
2019-03-27,117.67
2019-03-28,118.86
2019-03-29,122.51
2019-04-01,124.42
2019-04-02,124.45
2019-04-03,125.39
2019-04-04,123.16
2019-04-05,123.17
2019-04-08,123.62
2019-04-09,123.46
2019-04-10,124.95
2019-04-11,125.47
2019-04-12,125.67
2019-04-15,126.57
2019-04-16,128.81
2019-04-17,130.83
2019-04-18,133.7
2019-04-22,137.4
2019-04-23,138.17
2019-04-24,138.06
2019-04-25,137.86
2019-04-26,138.25
2019-04-29,138.77
2019-04-30,137.86
2019-05-01,135.65
2019-05-02,134.06
2019-05-03,134.76
2019-05-06,133.77
2019-05-07,133.35
2019-05-08,134.63
2019-05-09,133.58
2019-05-10,134.21
2019-05-13,130.47
2019-05-14,132.07
2019-05-15,133.19
2019-05-16,143.9
2019-05-17,144.24
2019-05-20,141.06
2019-05-21,139.89
2019-05-22,141.59
2019-05-23,139.78
2019-05-24,139.36
2019-05-28,138.4
2019-05-29,137.47
2019-05-30,138.42
2019-05-31,139.85
2019-06-03,136.54
2019-06-04,136.72
2019-06-05,137.61
2019-06-06,138.15
2019-06-07,139.27
2019-06-10,137.76
2019-06-11,137.5
2019-06-12,139.46
2019-06-13,138.93
2019-06-14,138.41
2019-06-17,137.34
2019-06-18,137.31
2019-06-19,138.44
2019-06-20,139.19
2019-06-21,139.12
2019-06-24,139.85
2019-06-25,138.27
2019-06-26,136.18
2019-06-27,136.9
2019-06-28,137.11
2019-07-01,140.195
2019-07-02,141.87
2019-07-03,142.165
2019-07-04,142.165
2019-07-05,143.12
2019-07-08,144
2019-07-09,144.785
2019-07-10,145.155
2019-07-11,145.65
2019-07-12,147.475
2019-07-15,149
2019-07-16,146.065
2019-07-17,148.205
2019-07-18,147
2019-07-19,148.455
2019-07-22,147.24
2019-07-23,147.69
2019-07-24,150.26
2019-07-25,149.13
2019-07-26,150.59
2019-07-29,150.21
2019-07-30,151.955
2019-07-31,152.64
2019-08-01,152.815
2019-08-02,151.55
2019-08-05,148.22
2019-08-06,150.415
2019-08-07,151.46
2019-08-08,153.555
2019-08-09,153.68
2019-08-12,150.515
2019-08-13,151.995
2019-08-14,149.61
2019-08-15,151.385
2019-08-16,151.505
2019-08-19,151.32
2019-08-20,151.735
2019-08-21,153.995
2019-08-22,154.05
2019-08-23,152.355
2019-08-26,152.83
2019-08-27,151.62
2019-08-28,151.35
2019-08-29,153.505
2019-08-30,153.19
2019-09-02,153.3
2019-09-03,151.99
2019-09-04,152.96
2019-09-05,152.91
2019-09-06,153.05
2019-09-09,154.42
2019-09-10,149.37
2019-09-11,150.16
2019-09-12,149.5
2019-09-13,147.03
2019-09-16,147.86
2019-09-17,149.07
2019-09-18,150.64
2019-09-19,150.95
2019-09-20,149.82
2019-09-23,148.765
2019-09-24,149.27
2019-09-25,145.14
2019-09-26,144.6
2019-09-27,142.045
2019-09-30,143.88
2019-10-01,142.495
2019-10-02,141.945
2019-10-03,144.88
2019-10-04,146.865
2019-10-07,151.04
2019-10-08,150.095
2019-10-09,150.79
2019-10-10,151.955
2019-10-11,153.895
2019-10-14,153.9
2019-10-15,152.7
2019-10-16,149.87
2019-10-17,149.99
2019-10-18,149.41
2019-10-21,147.74
2019-10-22,146.515
2019-10-23,146.225
2019-10-24,148.78
2019-10-25,151.44
2019-10-28,154.87
2019-10-29,156.2
2019-10-30,158.92
2019-10-31,157.735
2019-11-01,157.105
2019-11-04,158.495
2019-11-05,158.535
2019-11-06,158.49
2019-11-07,158.365
2019-11-08,158.49
2019-11-11,158.95
2019-11-12,158.33
2019-11-13,158.68
2019-11-14,157.25
2019-11-15,156.7
2019-11-18,151.93
2019-11-19,149.11
2019-11-20,146.97
2019-11-21,147.66
2019-11-22,148.39
2019-11-25,153.76
