date,close
2014-06-13,51.08
2014-06-16,51.19
2014-06-17,51.43
2014-06-18,51.09
2014-06-19,50.88
2014-06-20,52.1
2014-06-23,51.7
2014-06-24,49.89
2014-06-25,50.36
2014-06-26,49.04
2014-06-27,50.19
2014-06-30,50.91
2014-07-01,49.98
2014-07-02,49.92
2014-07-03,49.89
2014-07-07,48.65
2014-07-08,47.74
2014-07-09,48.32
2014-07-10,48.02
2014-07-11,49.19
2014-07-14,49.25
2014-07-15,48.5
2014-07-16,47.56
2014-07-17,46.68
2014-07-18,47.21
2014-07-21,46.8
2014-07-22,46.84
2014-07-23,47.33
2014-07-24,47.79
2014-07-25,47.45
2014-07-28,46.76
2014-07-29,46.07
2014-07-30,45.72
2014-07-31,44.92
2014-08-01,44.95
2014-08-04,45.71
2014-08-05,45.15
2014-08-06,45.28
2014-08-07,44.51
2014-08-08,37.43
2014-08-11,37.46
2014-08-12,37.03
2014-08-13,37.24
2014-08-14,38.04
2014-08-15,37.88
2014-08-18,37.42
2014-08-19,37.15
2014-08-20,36.15
2014-08-21,36.05
2014-08-22,36.52
2014-08-25,36.01
2014-08-26,36.32
2014-08-27,36.56
2014-08-28,37.39
2014-08-29,36.97
2014-09-02,36.22
2014-09-03,35.7
2014-09-04,35.47
2014-09-05,35.29
2014-09-08,36.25
2014-09-09,36.73
2014-09-10,36.77
2014-09-11,37.69
2014-09-12,37.16
2014-09-15,36.4
2014-09-16,36.06
2014-09-17,35.84
2014-09-18,35.25
2014-09-19,34.45
2014-09-22,33.99
2014-09-23,33.34
2014-09-24,33.81
2014-09-25,33.48
2014-09-26,34.63
2014-09-29,33.98
2014-09-30,33.18
2014-10-01,32.91
2014-10-02,33.66
2014-10-03,34.3
2014-10-06,34.25
2014-10-07,33.91
2014-10-08,34.55
2014-10-09,33.79
2014-10-10,32.59
2014-10-13,31.94
2014-10-14,31.97
2014-10-15,31.67
2014-10-16,31.68
2014-10-17,32.02
2014-10-20,34.87
2014-10-21,36.34
2014-10-22,35.87
2014-10-23,36.22
2014-10-24,35.81
2014-10-27,35.68
2014-10-28,36.74
2014-10-29,36.29
2014-10-30,37.14
2014-10-31,37.5
2014-11-03,37.92
2014-11-04,38.19
2014-11-05,37.28
2014-11-06,37.67
2014-11-07,37.28
2014-11-10,37.37
2014-11-11,36.91
2014-11-12,37.14
2014-11-13,36.22
2014-11-14,36.19
2014-11-17,36.33
2014-11-18,36.08
2014-11-19,35.54
2014-11-20,35.88
2014-11-21,36.78
2014-11-24,37.1
2014-11-25,38.54
2014-11-26,40.37
2014-11-28,40
2014-12-01,40
2014-12-02,40.97
2014-12-03,41.6
2014-12-04,41.02
2014-12-05,41.49
2014-12-08,40.83
2014-12-09,40.96
2014-12-10,41.24
2014-12-11,42.2
2014-12-12,41.39
2014-12-15,40.25
2014-12-16,40.52
2014-12-17,41.86
2014-12-18,41.72
2014-12-19,41.61
2014-12-22,42.24
2014-12-23,42.02
2014-12-24,42.51
2014-12-26,42.47
2014-12-29,42.31
2014-12-30,42.61
2014-12-31,41.89
2015-01-02,42.74
2015-01-05,41.11
2015-01-06,40.06
2015-01-07,41
2015-01-08,41.44
2015-01-09,41.33
2015-01-12,41.56
2015-01-13,41.46
2015-01-14,41.2
2015-01-15,39.67
2015-01-16,39.78
2015-01-20,39.41
2015-01-21,39.68
2015-01-22,42.29
2015-01-23,41.44
2015-01-26,48.83
2015-01-27,48.72
2015-01-28,48.5
2015-01-29,48.24
2015-01-30,47.25
2015-02-02,46.98
2015-02-03,46.63
2015-02-04,47.61
2015-02-05,47.34
2015-02-06,47.69
2015-02-09,49.45
2015-02-10,49.31
2015-02-11,48.85
2015-02-12,48.87
2015-02-13,48.62
2015-02-17,48.83
2015-02-18,49.11
2015-02-19,49.74
2015-02-20,49.42
2015-02-23,49.45
2015-02-24,49.58
2015-02-25,49.59
2015-02-26,49.48
2015-02-27,49.48
2015-03-02,50.77
2015-03-03,50.64
2015-03-04,49.94
2015-03-05,50.11
2015-03-06,48.92
2015-03-09,49.44
2015-03-10,48.28
2015-03-11,48.57
2015-03-12,48.5
2015-03-13,47.85
2015-03-16,46.98
2015-03-17,47.79
2015-03-18,47.85
2015-03-19,47.14
2015-03-20,48.54
2015-03-23,48.51
2015-03-24,48.41
2015-03-25,48.18
2015-03-26,47.37
2015-03-27,47.65
2015-03-30,48
2015-03-31,46.84
2015-04-01,46.95
2015-04-02,47.7
2015-04-06,48.63
2015-04-07,48.44
2015-04-08,48.29
2015-04-09,47.69
2015-04-10,47.7
2015-04-13,47.62
2015-04-14,48.25
2015-04-15,48.55
2015-04-16,48.3
2015-04-17,47.72
2015-04-20,47.67
2015-04-21,47.91
2015-04-22,48.31
2015-04-23,48.18
2015-04-24,47.6
2015-04-27,47.68
2015-04-28,48.43
2015-04-29,47.69
2015-04-30,46.94
2015-05-01,46.6
2015-05-04,47.7
2015-05-05,46.1
2015-05-06,45.22
2015-05-07,45.26
2015-05-08,49.89
2015-05-11,51.29
2015-05-12,48.91
2015-05-13,44.91
2015-05-14,44.63
2015-05-15,43.79
2015-05-18,44.41
2015-05-19,43.33
2015-05-20,42.83
2015-05-21,42.45
2015-05-22,42.75
2015-05-26,44
2015-05-27,43.49
2015-05-28,42.63
2015-05-29,43.26
2015-06-01,43.52
2015-06-02,43.67
2015-06-03,44.36
2015-06-04,43.76
2015-06-05,44.58
2015-06-08,44.68
2015-06-09,44.29
2015-06-10,44.82
2015-06-11,45.68
2015-06-12,46.46
2015-06-15,46.77
2015-06-16,48.46
2015-06-17,48.44
2015-06-18,49.61
2015-06-19,52.03
2015-06-22,52.25
2015-06-23,53.39
2015-06-24,52.51
2015-06-25,52.9
2015-06-26,52.65
2015-06-29,51.94
2015-06-30,53.93
2015-07-01,52.75
2015-07-02,52.55
2015-07-06,52.41
2015-07-07,51.63
2015-07-08,52.1
2015-07-09,51.58
2015-07-10,52.1
2015-07-13,52.97
2015-07-14,53.82
2015-07-15,53.61
2015-07-16,53.76
2015-07-17,53.96
2015-07-20,53.79
2015-07-21,53.35
2015-07-22,54
2015-07-23,53.6
2015-07-24,53.01
2015-07-27,52.87
2015-07-28,53.46
2015-07-29,52.84
2015-07-30,54.11
2015-07-31,53.74
2015-08-03,53.49
2015-08-04,53.88
2015-08-05,53.09
2015-08-06,51.66
2015-08-07,58.09
2015-08-10,63.59
2015-08-11,62.62
2015-08-12,61.68
2015-08-13,62.37
2015-08-14,66.28
2015-08-17,65.94
2015-08-18,65.91
2015-08-19,65.45
2015-08-20,64.99
2015-08-21,63.74
2015-08-24,61.34
2015-08-25,61.83
2015-08-26,62.85
2015-08-27,63.71
2015-08-28,66.06
2015-08-31,65.28
2015-09-01,64.66
2015-09-02,65.56
2015-09-03,65.53
2015-09-04,65.4
2015-09-08,66.59
2015-09-09,64.54
2015-09-10,64.14
2015-09-11,66.05
2015-09-14,65.27
2015-09-15,68.05
2015-09-16,68.8
2015-09-17,69.73
2015-09-18,67.82
2015-09-21,68.61
2015-09-22,67.32
2015-09-23,67.89
2015-09-24,68.25
2015-09-25,67.49
2015-09-28,61.37
2015-09-29,55.22
2015-09-30,59.1
2015-10-01,58.91
2015-10-02,60.24
2015-10-05,61.02
2015-10-06,60.65
2015-10-07,60.26
2015-10-08,60.92
2015-10-09,60.49
2015-10-12,61.12
2015-10-13,59.47
2015-10-14,60.49
2015-10-15,61.11
2015-10-16,61.51
2015-10-19,61.44
2015-10-20,61.46
2015-10-21,60.97
2015-10-22,61.72
2015-10-23,60.87
2015-10-26,63.71
2015-10-27,63.46
2015-10-28,66.07
2015-10-29,65.77
2015-10-30,64.27
2015-11-02,66.41
2015-11-03,64.7
2015-11-04,64.28
2015-11-05,65.12
2015-11-06,63.03
2015-11-09,61.98
2015-11-10,62.13
2015-11-11,62.6
2015-11-12,59.91
2015-11-13,59.72
2015-11-16,60.5
2015-11-17,60.28
2015-11-18,64.54
2015-11-19,64.14
2015-11-20,63.38
2015-11-23,61.99
2015-11-24,66.11
2015-11-25,69.1
2015-11-27,70.99
2015-11-30,69.52
2015-12-01,70
2015-12-02,69.15
2015-12-03,66.36
2015-12-04,67.58
2015-12-07,66.32
2015-12-08,66.29
2015-12-09,66.26
2015-12-10,65.54
2015-12-11,63.27
2015-12-14,62.67
2015-12-15,61.99
2015-12-16,63.68
2015-12-17,62.02
2015-12-18,61.16
2015-12-21,61.44
2015-12-22,61.67
2015-12-23,63.49
2015-12-24,63.79
2015-12-28,61.11
2015-12-29,62.67
2015-12-30,62.01
2015-12-31,61.7
2016-01-04,60.51
2016-01-05,60.84
2016-01-06,60.9
2016-01-07,60.46
2016-01-08,57.58
2016-01-11,57.35
2016-01-12,58.53
2016-01-13,56.01
2016-01-14,56.97
2016-01-15,56.42
2016-01-19,54.77
2016-01-20,53.88
2016-01-21,54.88
2016-01-22,57.39
2016-01-25,55.29
2016-01-26,55.25
2016-01-27,53.86
2016-01-28,55.28
2016-01-29,58.5
2016-02-01,60.31
2016-02-02,57.19
2016-02-03,56.82
2016-02-04,57.43
2016-02-05,63.83
2016-02-08,64.32
2016-02-09,62.68
2016-02-10,66.64
2016-02-11,65.61
2016-02-12,65.75
2016-02-16,68.13
2016-02-17,67.69
2016-02-18,67.7
2016-02-19,67.83
2016-02-22,66.88
2016-02-23,68.44
2016-02-24,69.53
2016-02-25,69.61
2016-02-26,70.11
2016-02-29,69.46
2016-03-01,69.89
2016-03-02,71.49
2016-03-03,72.2
2016-03-04,71.75
2016-03-07,71.58
2016-03-08,70.58
2016-03-09,70.2
2016-03-10,70.33
2016-03-11,69.88
2016-03-14,71.17
2016-03-15,69.63
2016-03-16,70.79
2016-03-17,70.84
2016-03-18,69.69
2016-03-21,69.88
2016-03-22,68.76
2016-03-23,67.54
2016-03-24,67.71
2016-03-28,68.5
2016-03-29,70.24
2016-03-30,69.45
2016-03-31,68.77
2016-04-01,70.49
2016-04-04,70.49
2016-04-05,68.69
2016-04-06,70.01
2016-04-07,69
2016-04-08,69.81
2016-04-11,69.3
2016-04-12,69.2
2016-04-13,68.9
2016-04-14,68.46
2016-04-15,71.06
2016-04-18,72.06
2016-04-19,72.56
2016-04-20,71.65
2016-04-21,70.27
2016-04-22,70.85
2016-04-25,70.46
2016-04-26,71.38
2016-04-27,71.77
2016-04-28,71.05
2016-04-29,71.84
2016-05-02,72.19
2016-05-03,71.08
2016-05-04,70.52
2016-05-05,70.87
2016-05-06,74.5
2016-05-09,75.25
2016-05-10,76.92
2016-05-11,76.33
2016-05-12,75.83
2016-05-13,74.81
2016-05-16,75.05
2016-05-17,73.46
2016-05-18,72.32
2016-05-19,73.31
2016-05-20,73.63
2016-05-23,74.09
2016-05-24,74.72
2016-05-25,75.69
2016-05-26,76.76
2016-05-27,76.7
2016-05-31,76.01
2016-06-01,76.07
2016-06-02,76.17
2016-06-03,75.96
2016-06-06,76.59
2016-06-07,76.54
2016-06-08,76.27
2016-06-09,76.69
2016-06-10,75.95
2016-06-13,74.82
2016-06-14,74.26
2016-06-15,74.43
2016-06-16,74.34
2016-06-17,73.91
2016-06-20,74.43
2016-06-21,77.14
2016-06-22,76.66
2016-06-23,79.54
2016-06-24,76.9
2016-06-27,78.58
2016-06-28,80.32
2016-06-29,81.56
2016-06-30,82.69
2016-07-01,83.51
2016-07-05,83.98
2016-07-06,84.57
2016-07-07,84.87
2016-07-08,87.35
2016-07-11,87.09
2016-07-12,86.39
2016-07-13,86.98
2016-07-14,86.73
2016-07-15,87.43
2016-07-18,87.85
2016-07-19,87.83
2016-07-20,87.75
2016-07-21,86.61
2016-07-22,87.35
2016-07-25,86.1
2016-07-26,86.21
2016-07-27,85.13
2016-07-28,85.88
2016-07-29,86.67
2016-08-01,86.61
2016-08-02,85.17
2016-08-03,85.51
2016-08-04,85.72
2016-08-05,84.27
2016-08-08,82.44
2016-08-09,83.52
2016-08-10,83.66
2016-08-11,82.8
2016-08-12,82.4
2016-08-15,82.87
2016-08-16,82.46
2016-08-17,83.05
2016-08-18,84.73
2016-08-19,84.89
2016-08-22,85.45
2016-08-23,85.68
2016-08-24,85.8
2016-08-25,85.14
2016-08-26,84.95
2016-08-29,86.48
2016-08-30,84.88
2016-08-31,84.78
2016-09-01,85.04
2016-09-02,86.1
2016-09-06,85.28
2016-09-07,85.13
2016-09-08,84.82
2016-09-09,81.6
2016-09-12,82.05
2016-09-13,81.06
2016-09-14,81.16
2016-09-15,80.23
2016-09-16,80.75
2016-09-19,79.5
2016-09-20,78.42
2016-09-21,77.97
2016-09-22,79.24
2016-09-23,78.34
2016-09-26,77.27
2016-09-27,78.76
2016-09-28,78.98
2016-09-29,76.98
2016-09-30,77.17
2016-10-03,77.38
2016-10-04,77.53
2016-10-05,80.1
2016-10-06,79.85
2016-10-07,79.96
2016-10-10,81.68
2016-10-11,78.86
2016-10-12,79.67
2016-10-13,79.08
2016-10-14,79.3
2016-10-17,79.68
2016-10-18,81.36
2016-10-19,80.44
2016-10-20,79.92
2016-10-21,79.69
2016-10-24,79.6
2016-10-25,79.04
2016-10-26,77.97
2016-10-27,76.04
2016-10-28,76.73
2016-10-31,76.23
2016-11-01,76.21
2016-11-02,76.42
2016-11-03,73.85
2016-11-04,74.08
2016-11-07,74.67
2016-11-08,74.8
2016-11-09,74.97
2016-11-10,71.01
2016-11-11,72.14
2016-11-14,71.32
2016-11-15,70.68
2016-11-16,72.83
2016-11-17,74.75
2016-11-18,72.34
2016-11-21,73.93
2016-11-22,74.64
2016-11-23,74.22
2016-11-25,75.57
2016-11-28,76.78
2016-11-29,77.89
2016-11-30,76.33
2016-12-01,75.07
2016-12-02,75.63
2016-12-05,77.8
2016-12-06,76.5
2016-12-07,77.69
2016-12-08,78.65
2016-12-09,78.75
2016-12-12,78.65
2016-12-13,77.43
2016-12-14,76.73
2016-12-15,77.42
2016-12-16,77.71
2016-12-19,78.23
2016-12-20,78.14
2016-12-21,78.9
2016-12-22,78.83
2016-12-23,80.11
2016-12-27,80.28
2016-12-28,80.19
2016-12-29,80.58
2016-12-30,80.39
2017-01-03,81.95
2017-01-04,82.98
2017-01-05,83.51
2017-01-06,83.31
2017-01-09,83.64
2017-01-10,82.9
2017-01-11,82.1
2017-01-12,83.68
2017-01-13,83.72
2017-01-17,83.8
2017-01-18,84.92
2017-01-19,84.83
2017-01-20,84.99
2017-01-23,84
2017-01-24,83.85
2017-01-25,83.23
2017-01-26,82.64
2017-01-27,82.81
2017-01-30,83.44
2017-01-31,83.68
2017-02-01,83.73
2017-02-02,83.96
2017-02-03,85.37
2017-02-06,84.31
2017-02-07,84.73
2017-02-08,85.14
2017-02-09,86.78
2017-02-10,85.5
2017-02-13,85
2017-02-14,84.51
2017-02-15,84.82
2017-02-16,83.74
2017-02-17,83.35
2017-02-21,83.75
2017-02-22,82.84
2017-02-23,83.04
2017-02-24,82.59
2017-02-27,82.21
2017-02-28,81.87
2017-03-01,84.4
2017-03-02,83.93
2017-03-03,84.86
2017-03-06,83.66
2017-03-07,82.91
2017-03-08,83.54
2017-03-09,84.03
2017-03-10,84.08
2017-03-13,83.6
2017-03-14,83.08
2017-03-15,84.66
2017-03-16,84.58
2017-03-17,85.45
2017-03-20,85.72
2017-03-21,85.45
2017-03-22,85.1
2017-03-23,84.45
2017-03-24,84.46
2017-03-27,83.23
2017-03-28,87.54
2017-03-29,87.76
2017-03-30,87.27
2017-03-31,87.52
2017-04-03,87.41
2017-04-04,86.9
2017-04-05,87.02
2017-04-06,87.06
2017-04-07,87.54
2017-04-10,88.41
2017-04-11,88.31
2017-04-12,88.26
2017-04-13,87.1
2017-04-17,87.86
2017-04-18,84.51
2017-04-19,85.76
2017-04-20,85.4
2017-04-21,84.93
2017-04-24,84.06
2017-04-25,84.48
2017-04-26,84.84
2017-04-27,84.15
2017-04-28,84.19
2017-05-01,83.16
2017-05-02,82.66
2017-05-03,82.18
2017-05-04,81.57
2017-05-05,81.22
2017-05-08,82.64
2017-05-09,78.12
2017-05-10,80.48
2017-05-11,80.75
2017-05-12,80.77
2017-05-15,81.45
2017-05-16,81.13
2017-05-17,81.61
2017-05-18,81.05
2017-05-19,81.71
2017-05-22,82.65
2017-05-23,82.12
2017-05-24,81.88
2017-05-25,81.79
2017-05-26,81.42
2017-05-30,79.96
2017-05-31,80.34
2017-06-01,81.71
2017-06-02,80.79
2017-06-05,80.79
2017-06-06,82.01
2017-06-07,82.78
2017-06-08,83.92
2017-06-09,83.67
2017-06-12,83.97
2017-06-13,84.65
2017-06-14,84.17
2017-06-15,82.88
2017-06-16,79.21
2017-06-19,77.77
2017-06-20,76.71
2017-06-21,76.49
2017-06-22,76.24
2017-06-23,77.6
2017-06-26,77.95
2017-06-27,76.35
2017-06-28,77.01
2017-06-29,76.71
2017-06-30,77.65
2017-07-03,77.37
2017-07-05,76.66
2017-07-06,77.09
2017-07-07,77.39
2017-07-10,76.73
2017-07-11,77.42
2017-07-12,78.76
2017-07-13,79.98
2017-07-14,80.26
2017-07-17,81.61
2017-07-18,81.48
2017-07-19,81.8
2017-07-20,81.94
2017-07-21,82.08
2017-07-24,82.12
2017-07-25,83.4
2017-07-26,83.4
2017-07-27,83.47
2017-07-28,83.67
2017-07-31,83.2
2017-08-01,83.06
2017-08-02,83.75
2017-08-03,83.72
2017-08-04,86.13
2017-08-07,86.37
2017-08-08,85.25
2017-08-09,85.24
2017-08-10,84.58
2017-08-11,84.46
2017-08-14,85.98
2017-08-15,86.02
2017-08-16,86.2
2017-08-17,85.29
2017-08-18,85.37
2017-08-21,85.47
2017-08-22,85.24
2017-08-23,85.01
2017-08-24,83.16
2017-08-25,82.85
2017-08-28,82.1
2017-08-29,82.4
2017-08-30,83.4
2017-08-31,85.13
2017-09-01,86.15
2017-09-05,85.77
2017-09-06,85.25
2017-09-07,83.89
2017-09-08,83.78
2017-09-11,84.93
2017-09-12,85.55
2017-09-13,84.65
2017-09-14,84.55
2017-09-15,84.8
2017-09-18,85.84
2017-09-19,86.36
2017-09-20,87.36
2017-09-21,86.97
2017-09-22,86.15
2017-09-25,85.65
2017-09-26,86.39
2017-09-27,86.74
2017-09-28,87.04
2017-09-29,88.27
2017-10-02,88.35
2017-10-03,86.91
2017-10-04,87.18
2017-10-05,87.05
2017-10-06,86.88
2017-10-09,86.45
2017-10-10,86.5
2017-10-11,86.89
2017-10-12,87.12
2017-10-13,86.89
2017-10-16,87.03
2017-10-17,86.3
2017-10-18,85.45
2017-10-19,84.61
2017-10-20,83.84
2017-10-23,83.72
2017-10-24,83.74
2017-10-25,83.47
2017-10-26,82.52
2017-10-27,82.66
2017-10-30,81.57
2017-10-31,82.93
2017-11-01,83.09
2017-11-02,79.62
2017-11-03,78.88
2017-11-06,78.26
2017-11-07,78.91
2017-11-08,79.88
2017-11-09,79.44
2017-11-10,79.41
2017-11-13,80.15
2017-11-14,79.94
2017-11-15,79.31
2017-11-16,82.26
2017-11-17,80.95
2017-11-20,81.38
2017-11-21,79.78
2017-11-22,79.66
2017-11-24,79.41
2017-11-27,79.49
2017-11-28,79.02
2017-11-29,79.54
2017-11-30,79.45
2017-12-01,79.52
2017-12-04,79.02
2017-12-05,78.54
2017-12-06,78.08
2017-12-07,77.55
2017-12-08,77.26
2017-12-11,78.71
2017-12-12,78.38
2017-12-13,78.21
2017-12-14,77.6
2017-12-15,78.07
2017-12-18,79.28
2017-12-19,77.85
2017-12-20,77.4
2017-12-21,77.68
2017-12-22,78.71
2017-12-26,78.68
2017-12-27,77.56
2017-12-28,78.48
2017-12-29,79.23
2018-01-02,79.44
2018-01-03,79
2018-01-04,79.98
2018-01-05,80.02
2018-01-08,79.78
2018-01-09,79.99
2018-01-10,79
2018-01-11,82.04
2018-01-12,80.6
2018-01-16,80.09
2018-01-17,80.04
2018-01-18,79.4
2018-01-19,79.38
2018-01-22,79.62
2018-01-23,79.42
2018-01-24,79.74
2018-01-25,78.94
2018-01-26,78.14
2018-01-29,77.44
2018-01-30,75.58
2018-01-31,75.67
2018-02-01,77.67
2018-02-02,74.35
2018-02-05,73.47
2018-02-06,73.9
2018-02-07,73.67
2018-02-08,72.94
2018-02-09,71.64
2018-02-12,72.82
2018-02-13,72.36
2018-02-14,74.75
2018-02-15,76.51
2018-02-16,78.5
2018-02-20,79.02
2018-02-21,77.93
2018-02-22,76.76
2018-02-23,78.11
2018-02-26,78.95
2018-02-27,77.42
2018-02-28,75.78
2018-03-01,76.2
2018-03-02,77.64
2018-03-05,78.94
2018-03-06,80.8
2018-03-07,80.52
2018-03-08,80.77
2018-03-09,80.84
2018-03-12,81.1
2018-03-13,80.57
2018-03-14,79.81
2018-03-15,76.05
2018-03-16,76.81
2018-03-19,75.21
2018-03-20,74.79
2018-03-21,71.63
2018-03-22,71.81
2018-03-23,72.63
2018-03-26,74.83
2018-03-27,73.45
2018-03-28,74.35
2018-03-29,75.76
2018-04-02,75.42
2018-04-03,76.78
2018-04-04,78.44
2018-04-05,78.38
2018-04-06,77.94
2018-04-09,78.55
2018-04-10,79.13
2018-04-11,79.81
2018-04-12,78.96
2018-04-13,79.22
2018-04-16,80.01
2018-04-17,80.3
2018-04-18,80.45
2018-04-19,77.95
2018-04-20,76.81
2018-04-23,77.19
2018-04-24,77.69
2018-04-25,79.39
2018-04-26,79.74
2018-04-27,80.39
2018-04-30,79.57
2018-05-01,78.68
2018-05-02,76.12
2018-05-03,77.33
2018-05-04,78.73
2018-05-07,77.96
2018-05-08,76.94
2018-05-09,76.39
2018-05-10,76.81
2018-05-11,76.9
2018-05-14,75.67
2018-05-15,76.01
2018-05-16,76.95
2018-05-17,76.73
2018-05-18,75.5
2018-05-21,75.55
2018-05-22,75.91
2018-05-23,76.88
2018-05-24,76.52
2018-05-25,77.97
2018-05-29,77.53
2018-05-30,78.54
2018-05-31,76.87
2018-06-01,77.69
2018-06-04,79.47
2018-06-05,79.7
2018-06-06,78.76
2018-06-07,80.04
2018-06-08,82
2018-06-11,84.29
2018-06-12,85.05
2018-06-13,84.53
2018-06-14,84.95
2018-06-15,84.48
2018-06-18,83.61
2018-06-19,85.57
2018-06-20,86.46
2018-06-21,85.72
2018-06-22,86.29
2018-06-25,87.61
2018-06-26,87.51
2018-06-27,85.78
2018-06-28,86.42
2018-06-29,86.02
2018-07-02,84.85
2018-07-03,85.42
2018-07-05,87.27
2018-07-06,87.42
2018-07-09,86.48
2018-07-10,86.71
2018-07-11,86.87
2018-07-12,87.29
2018-07-13,87.75
2018-07-16,87.27
2018-07-17,87.82
2018-07-18,87.78
2018-07-19,88.94
2018-07-20,88.68
2018-07-23,88.02
2018-07-24,87.52
2018-07-25,88.43
2018-07-26,88.37
2018-07-27,88.66
2018-07-30,87.09
2018-07-31,86.56
2018-08-01,85.17
2018-08-02,86.68
2018-08-03,93.58
2018-08-06,95.01
2018-08-07,95.99
2018-08-08,96.1
2018-08-09,93.99
2018-08-10,93.22
2018-08-13,93.21
2018-08-14,93.49
2018-08-15,94.78
2018-08-16,97.81
2018-08-17,98.34
2018-08-20,99.1
2018-08-21,97.89
2018-08-22,97.29
2018-08-23,97.39
2018-08-24,97.87
2018-08-27,97.98
2018-08-28,96.73
2018-08-29,97.4
2018-08-30,96.99
2018-08-31,97.26
2018-09-04,97.23
2018-09-05,97.2
2018-09-06,98.1
2018-09-07,97.97
2018-09-10,97.79
2018-09-11,98.6
2018-09-12,100.13
2018-09-13,100.47
2018-09-14,100.65
2018-09-17,100.15
2018-09-18,98.84
2018-09-19,98.5
2018-09-20,99.37
2018-09-21,100.47
2018-09-24,100.19
2018-09-25,99.07
2018-09-26,98.57
2018-09-27,97.62
2018-09-28,98.04
2018-10-01,98.02
2018-10-02,97.92
2018-10-03,94.77
2018-10-04,94.82
2018-10-05,96.23
2018-10-08,96.08
2018-10-09,95.09
2018-10-10,92.82
2018-10-11,91.27
2018-10-12,92.79
2018-10-15,93.77
2018-10-16,95.72
2018-10-17,95.95
2018-10-18,94.96
2018-10-19,95.78
2018-10-22,94.26
2018-10-23,92.99
2018-10-24,90.61
2018-10-25,90.12
2018-10-26,85.55
2018-10-29,85.7
2018-10-30,87.46
2018-10-31,88.42
2018-11-01,91.43
2018-11-02,89.19
2018-11-05,90.62
2018-11-06,91.7
2018-11-07,91.24
2018-11-08,91.43
2018-11-09,92.62
2018-11-12,91.97
2018-11-13,92.08
2018-11-14,91.65
2018-11-15,90.94
2018-11-16,96.05
2018-11-19,91.75
2018-11-20,91.78
2018-11-21,93.18
2018-11-23,91.6
2018-11-26,92.61
2018-11-27,93.2
2018-11-28,94.7
2018-11-29,94.82
2018-11-30,96.75
2018-12-03,95.01
2018-12-04,93.34
2018-12-06,92.57
2018-12-07,91.41
2018-12-10,92.07
2018-12-11,91.58
2018-12-12,92.46
2018-12-13,92.63
2018-12-14,91.69
2018-12-17,89.76
2018-12-18,90.1
2018-12-19,90.02
2018-12-20,89.73
2018-12-21,86.88
2018-12-24,84.38
2018-12-26,88.33
2018-12-27,87.86
2018-12-28,87.88
2018-12-31,89.13
2019-01-02,89.93
2019-01-03,90.96
2019-01-04,92.98
2019-01-07,94.11
2019-01-08,94.28
2019-01-09,95.7
2019-01-10,98.27
2019-01-11,98.96
2019-01-14,99.35
2019-01-15,99.86
2019-01-16,99.55
2019-01-17,101.08
2019-01-18,102.06
2019-01-22,100.7
2019-01-23,99.48
2019-01-24,92.02
2019-01-25,92.27
2019-01-28,92.67
2019-01-29,92.5
2019-01-30,92.16
2019-01-31,92.82
2019-02-01,97
2019-02-04,96.57
2019-02-05,96.38
2019-02-06,97.1
2019-02-07,96.63
2019-02-08,98.05
2019-02-11,100.77
2019-02-12,102.7
2019-02-13,103.55
2019-02-14,102.6
2019-02-15,102.9
2019-02-19,103.2
2019-02-20,102.72
2019-02-21,102.56
2019-02-22,101.2
2019-02-25,100.12
2019-02-26,100.03
2019-02-27,99.55
2019-02-28,101.88
2019-03-01,102.7
2019-03-04,100.59
2019-03-05,100.69
2019-03-06,100.18
2019-03-07,99.77
2019-03-08,99.68
2019-03-11,101.1
2019-03-12,101.15
2019-03-13,102.01
2019-03-14,102.36
2019-03-15,102.93
2019-03-18,103.48
2019-03-19,103.85
2019-03-20,104.6
2019-03-21,108.44
2019-03-22,108.26
2019-03-25,109.8
2019-03-26,109.71
2019-03-27,109.14
2019-03-28,109.47
2019-03-29,109.4
2019-04-01,109.26
2019-04-02,108.32
2019-04-03,107.08
2019-04-04,107.13
2019-04-05,108.41
2019-04-08,109.24
2019-04-09,107.9
2019-04-10,108.29
2019-04-11,109.6
2019-04-12,110.24
2019-04-15,111.37
2019-04-16,111.37
2019-04-17,109.36
2019-04-18,110.74
2019-04-22,111.28
2019-04-23,112.38
2019-04-24,111.83
2019-04-25,110.68
2019-04-26,111.87
2019-04-29,111.61
2019-04-30,112.78
2019-05-01,111.85
2019-05-02,109.75
2019-05-03,103.16
2019-05-06,106.8
2019-05-07,105.6
2019-05-08,106.91
2019-05-09,108.4
2019-05-10,108.22
2019-05-13,105.52
2019-05-14,106.37
2019-05-15,107.29
2019-05-16,109.95
2019-05-17,109.2
2019-05-20,106.87
2019-05-21,107.6
2019-05-22,107.61
2019-05-23,107.59
2019-05-24,107.65
2019-05-28,106.7
2019-05-29,104.99
2019-05-30,106.61
2019-05-31,105.1
2019-06-03,105.1
2019-06-04,105.5
2019-06-05,106.46
2019-06-06,106.08
2019-06-07,106.79
2019-06-10,105.4
2019-06-11,105.64
2019-06-12,105.8
2019-06-13,104.71
2019-06-14,103.34
2019-06-17,104.49
2019-06-18,104.73
2019-06-19,105.1
2019-06-20,104.15
2019-06-21,104.615
2019-06-24,102.64
2019-06-25,103.7
2019-06-26,102.54
2019-06-27,102.67
2019-06-28,103.62
2019-07-01,104.965
2019-07-02,105.22
2019-07-03,108.33
2019-07-04,108.33
2019-07-05,108.29
2019-07-08,107.665
2019-07-09,107.5
2019-07-10,108.09
2019-07-11,108.05
2019-07-12,108.12
2019-07-15,107.57
2019-07-16,106.76
2019-07-17,107.58
2019-07-18,108.055
2019-07-19,111.04
2019-07-22,110.695
2019-07-23,110.38
2019-07-24,111.47
2019-07-25,110.845
2019-07-26,112.45
2019-07-29,110.95
2019-07-30,110.165
2019-07-31,107.395
2019-08-01,106.47
2019-08-02,102.61
2019-08-05,99.81
2019-08-06,98.54
2019-08-07,98.73
2019-08-08,99.31
2019-08-09,97.83
2019-08-12,96.43
2019-08-13,97.07
2019-08-14,95.14
2019-08-15,95.81
2019-08-16,97.6
2019-08-19,97.3
2019-08-20,96.035
2019-08-21,95.685
2019-08-22,96.75
2019-08-23,96.7
2019-08-26,97.9
2019-08-27,96.66
2019-08-28,97.03
2019-08-29,98.36
2019-08-30,99.81
2019-09-02,99.75
2019-09-03,101.82
2019-09-04,104.5
2019-09-05,105.81
2019-09-06,105.455
2019-09-09,105.125
2019-09-10,105.8
2019-09-11,106.88
2019-09-12,105.96
2019-09-13,106.38
2019-09-16,108.72
2019-09-17,106.35
2019-09-18,106.17
2019-09-19,105.29
2019-09-20,105.73
2019-09-23,105.13
2019-09-24,105.7
2019-09-25,105.715
2019-09-26,106.32
2019-09-27,104.965
2019-09-30,105.79
2019-10-01,105.085
2019-10-02,103.13
2019-10-03,102.11
2019-10-04,102.8
2019-10-07,102.65
2019-10-08,100.335
2019-10-09,99.185
2019-10-10,99.2
2019-10-11,101.27
2019-10-14,100.84
2019-10-15,101.11
2019-10-16,97.935
2019-10-17,101.575
2019-10-18,100.85
2019-10-21,101.81
2019-10-22,101.13
2019-10-23,100.63
2019-10-24,99.8
2019-10-25,101.59
2019-10-28,103.41
2019-10-29,104.26
2019-10-30,103.6
2019-10-31,102.865
2019-11-01,103.855
2019-11-04,104.325
2019-11-05,104.735
2019-11-06,106.32
2019-11-07,105.715
2019-11-08,106.75
2019-11-11,106.59
2019-11-12,105.67
2019-11-13,106.49
2019-11-14,106.29
2019-11-15,106.26
2019-11-18,106.165
2019-11-19,105.825
2019-11-20,104.77
2019-11-21,101.65
2019-11-22,99.995
2019-11-25,105.31
