date,close
2014-06-13,42.2176
2014-06-16,42.1517
2014-06-17,42.8107
2014-06-18,42.4718
2014-06-19,42.2929
2014-06-20,41.9728
2014-06-23,42.2364
2014-06-24,41.841
2014-06-25,41.9822
2014-06-26,41.8598
2014-06-27,42.5565
2014-06-30,43.1685
2014-07-01,43.8276
2014-07-02,43.7993
2014-07-03,44.5714
2014-07-07,44.3266
2014-07-08,43.7522
2014-07-09,43.611
2014-07-10,43.2438
2014-07-11,43.3945
2014-07-14,43.6581
2014-07-15,43.6769
2014-07-16,43.9123
2014-07-17,44.1853
2014-07-18,44.1853
2014-07-21,43.9594
2014-07-22,44.1948
2014-07-23,44.0818
2014-07-24,44.3548
2014-07-25,44.0629
2014-07-28,43.997
2014-07-29,43.6863
2014-07-30,43.837
2014-07-31,42.6036
2014-08-01,41.7656
2014-08-04,41.9445
2014-08-05,41.4173
2014-08-06,41.5679
2014-08-07,41.3325
2014-08-08,41.4267
2014-08-11,41.9634
2014-08-12,41.9916
2014-08-13,42.2929
2014-08-14,42.4812
2014-08-15,42.5283
2014-08-18,43.0084
2014-08-19,42.9614
2014-08-20,43.1779
2014-08-21,43.4792
2014-08-22,43.5074
2014-08-25,43.5734
2014-08-26,44.0065
2014-08-27,43.4415
2014-08-28,43.1873
2014-08-29,43.4415
2014-09-02,43.8558
2014-09-03,43.7146
2014-09-04,43.7146
2014-09-05,43.6393
2014-09-08,43.5828
2014-09-09,43.498
2014-09-10,43.9217
2014-09-11,44.0535
2014-09-12,43.9688
2014-09-15,43.6863
2014-09-16,43.8182
2014-09-17,43.5828
2014-09-18,46.1154
2014-09-19,45.56
2014-09-22,44.8444
2014-09-23,44.2418
2014-09-24,44.5619
2014-09-25,44.0347
2014-09-26,44.223
2014-09-29,44.2418
2014-09-30,44.2701
2014-10-01,43.837
2014-10-02,44.8162
2014-10-03,44.7408
2014-10-06,44.2418
2014-10-07,42.9708
2014-10-08,42.9802
2014-10-09,41.9916
2014-10-10,41.1503
2014-10-13,40.4224
2014-10-14,40.2333
2014-10-15,39.893
2014-10-16,39.9402
2014-10-17,41.0368
2014-10-20,41.2732
2014-10-21,42.3414
2014-10-22,42.6155
2014-10-23,43.1355
2014-10-24,43.4852
2014-10-27,43.9106
2014-10-28,44.2131
2014-10-29,44.3171
2014-10-30,45.4043
2014-10-31,44.1092
2014-11-03,43.9579
2014-11-04,44.3266
2014-11-05,44.5535
2014-11-06,44.941
2014-11-07,44.8654
2014-11-10,45.4515
2014-11-11,45.5744
2014-11-12,45.4043
2014-11-13,45.1301
2014-11-14,45.2814
2014-11-17,44.6291
2014-11-18,44.44
2014-11-19,45.754
2014-11-20,45.3854
2014-11-21,45.8486
2014-11-24,46.2456
2014-11-25,45.8486
2014-11-26,45.8864
2014-11-28,45.7162
2014-12-01,45.0639
2014-12-02,45.2908
2014-12-03,45.3192
2014-12-04,45.3003
2014-12-05,45.0923
2014-12-08,45.4515
2014-12-09,45.3286
2014-12-10,44.3455
2014-12-11,44.5913
2014-12-12,43.627
2014-12-15,43.5892
2014-12-16,43.5609
2014-12-17,44.3644
2014-12-18,44.9694
2014-12-19,45.2719
2014-12-22,45.5082
2014-12-23,45.5272
2014-12-24,45.7729
2014-12-26,45.7068
2014-12-29,45.4704
2014-12-30,45.5272
2014-12-31,44.8465
2015-01-02,45.0828
2015-01-05,44.6574
2015-01-06,45.9526
2015-01-07,47.0019
2015-01-08,48.4199
2015-01-09,49.1289
2015-01-12,49.1005
2015-01-13,51.0952
2015-01-14,50.7643
2015-01-15,50.008
2015-01-16,51.1046
2015-01-20,50.7643
2015-01-21,50.6414
2015-01-22,51.3977
2015-01-23,51.2559
2015-01-26,51.5678
2015-01-27,51.3126
2015-01-28,50.9439
2015-01-29,51.5206
2015-01-30,50.8777
2015-02-02,51.3882
2015-02-03,51.8325
2015-02-04,52.1161
2015-02-05,52.4659
2015-02-06,52.9669
2015-02-09,53.7988
2015-02-10,53.865
2015-02-11,53.4868
2015-02-12,54.0729
2015-02-13,54.0729
2015-02-17,54.2147
2015-02-18,54.357
2015-02-19,54.8122
2015-02-20,55.0303
2015-02-23,54.632
2015-02-24,54.67
2015-02-25,54.2717
2015-02-26,53.8544
2015-02-27,53.2096
2015-03-02,54.5941
2015-03-03,54.357
2015-03-04,53.8449
2015-03-05,52.5363
2015-03-06,52.5837
2015-03-09,52.7828
2015-03-10,51.8914
2015-03-11,52.944
2015-03-12,54.2243
2015-03-13,53.807
2015-03-16,54.907
2015-03-17,55.3907
2015-03-18,55.6657
2015-03-19,55.5898
2015-03-20,56.6045
2015-03-23,57.0692
2015-03-24,56.6899
2015-03-25,56.2536
2015-03-26,56.7278
2015-03-27,56.5002
2015-03-30,57.7709
2015-03-31,58.1408
2015-04-01,57.8847
2015-04-02,58.3304
2015-04-06,58.9089
2015-04-07,58.1123
2015-04-08,58.6339
2015-04-09,57.6097
2015-04-10,57.4675
2015-04-13,57.2019
2015-04-14,57.9132
2015-04-15,57.8468
2015-04-16,58.0365
2015-04-17,57.7425
2015-04-20,57.7899
2015-04-21,57.7235
2015-04-22,58.4158
2015-04-23,59.0322
2015-04-24,59.4968
2015-04-27,59.7055
2015-04-28,59.677
2015-04-29,59.3641
2015-04-30,58.027
2015-05-01,59.127
2015-05-04,59.1934
2015-05-05,58.833
2015-05-06,58.283
2015-05-07,58.4158
2015-05-08,58.8899
2015-05-11,58.6339
2015-05-12,58.1882
2015-05-13,58.8064
2015-05-14,59.5007
2015-05-15,59.4246
2015-05-18,60.4328
2015-05-19,60.4899
2015-05-20,60.0428
2015-05-21,59.9287
2015-05-22,60.3187
2015-05-26,60.1094
2015-05-27,59.6244
2015-05-28,59.5863
2015-05-29,59.0157
2015-06-01,59.1108
2015-06-02,59.1393
2015-06-03,59.4246
2015-06-04,58.9681
2015-06-05,58.7779
2015-06-08,58.3784
2015-06-09,58.426
2015-06-10,58.7018
2015-06-11,58.9681
2015-06-12,58.8635
2015-06-15,58.2263
2015-06-16,58.6828
2015-06-17,58.7589
2015-06-18,58.9301
2015-06-19,58.8445
2015-06-22,58.9681
2015-06-23,60.138
2015-06-24,60.0143
2015-06-25,60.2236
2015-06-26,60.6325
2015-06-29,58.7684
2015-06-30,58.5401
2015-07-01,59.1678
2015-07-02,58.9871
2015-07-06,59.0727
2015-07-07,59.8336
2015-07-08,58.6733
2015-07-09,59.1869
2015-07-10,60.6706
2015-07-13,61.0035
2015-07-14,61.3554
2015-07-15,61.6407
2015-07-16,63.0008
2015-07-17,62.7915
2015-07-20,63.1149
2015-07-21,63.0578
2015-07-22,63.2385
2015-07-23,63.2956
2015-07-24,63.619
2015-07-27,62.5157
2015-07-28,62.7725
2015-07-29,63.638
2015-07-30,64.6462
2015-07-31,64.8269
2015-08-03,64.2372
2015-08-04,63.6856
2015-08-05,64.2943
2015-08-06,63.2576
2015-08-07,62.9817
2015-08-10,63.5239
2015-08-11,62.3445
2015-08-12,60.8227
2015-08-13,60.5078
2015-08-14,61.1568
2015-08-17,61.5099
2015-08-18,61.4813
2015-08-19,61.3476
2015-08-20,59.8779
2015-08-21,58.5513
2015-08-24,55.5259
2015-08-25,55.1442
2015-08-26,57.3965
2015-08-27,58.8376
2015-08-28,59.3244
2015-08-31,57.7592
2015-09-01,55.8886
2015-09-02,57.1579
2015-09-03,56.9479
2015-09-04,55.984
2015-09-08,58.1409
2015-09-09,57.3488
2015-09-10,58.0837
2015-09-11,58.2364
2015-09-14,57.1197
2015-09-15,57.9596
2015-09-16,57.8832
2015-09-17,57.9405
2015-09-18,57.3774
2015-09-21,58.9999
2015-09-22,58.1886
2015-09-23,58.6086
2015-09-24,57.7115
2015-09-25,58.5227
2015-09-28,56.2512
2015-09-29,55.5832
2015-09-30,56.7475
2015-10-01,55.3064
2015-10-02,55.8981
2015-10-05,56.528
2015-10-06,55.9363
2015-10-07,56.6139
2015-10-08,57.1961
2015-10-09,57.2629
2015-10-12,57.7305
2015-10-13,57.4061
2015-10-14,56.4898
2015-10-15,57.1197
2015-10-16,57.4347
2015-10-19,58.0169
2015-10-20,58.1218
2015-10-21,57.7019
2015-10-22,58.2936
2015-10-23,58.9808
2015-10-26,59.9065
2015-10-27,58.7136
2015-10-28,60.1738
2015-10-29,62.5311
2015-10-30,63.9436
2015-11-02,67.8088
2015-11-03,67.0071
2015-11-04,66.2913
2015-11-05,65.4897
2015-11-06,64.6975
2015-11-09,63.4568
2015-11-10,64.3952
2015-11-11,64.4335
2015-11-12,63.9356
2015-11-13,63.3994
2015-11-16,65.1421
2015-11-17,66.2529
2015-11-18,66.454
2015-11-19,66.4731
2015-11-20,66.3965
2015-11-23,66.5689
2015-11-24,67.1051
2015-11-25,66.9902
2015-11-27,67.6126
2015-11-30,67.1434
2015-12-01,67.5647
2015-12-02,67.402
2015-12-03,66.6838
2015-12-04,68.8191
2015-12-07,67.6701
2015-12-08,67.4881
2015-12-09,66.4731
2015-12-10,66.9806
2015-12-11,65.8794
2015-12-14,66.6646
2015-12-15,67.3445
2015-12-16,68.4457
2015-12-17,67.8807
2015-12-18,68.484
2015-12-21,68.9149
2015-12-22,68.5031
2015-12-23,69.116
2015-12-24,69.2788
2015-12-28,69.3075
2015-12-29,69.7575
2015-12-30,69.5086
2015-12-31,69.0681
2016-01-04,67.6126
2016-01-05,68.1201
2016-01-06,67.5935
2016-01-07,66.5402
2016-01-08,65.5922
2016-01-11,65.2379
2016-01-12,66.2625
2016-01-13,64.8836
2016-01-14,65.1134
2016-01-15,64.5868
2016-01-19,63.7633
2016-01-20,62.6621
2016-01-21,62.7961
2016-01-22,64.1463
2016-01-25,63.4952
2016-01-26,63.2749
2016-01-27,63.3994
2016-01-28,63.725
2016-01-29,65.9177
2016-02-01,64.8644
2016-02-02,63.9548
2016-02-03,63.5047
2016-02-04,64.0505
2016-02-05,62.5184
2016-02-08,60.4789
2016-02-09,62.3174
2016-02-10,63.2175
2016-02-11,62.4897
2016-02-12,64.4048
2016-02-16,65.6688
2016-02-17,67.3019
2016-02-18,67.859
2016-02-19,68.7332
2016-02-22,69.9628
2016-02-23,69.886
2016-02-24,68.6371
2016-02-25,69.7034
2016-02-26,69.6074
2016-02-29,67.7438
2016-03-01,68.6948
2016-03-02,68.0608
2016-03-03,67.3307
2016-03-04,66.7639
2016-03-07,67.2058
2016-03-08,65.9954
2016-03-09,66.7255
2016-03-10,66.2356
2016-03-11,66.8792
2016-03-14,66.9656
2016-03-15,66.5814
2016-03-16,67.0233
2016-03-17,67.4652
2016-03-18,68.4642
2016-03-21,68.5699
2016-03-22,68.8101
2016-03-23,68.7812
2016-03-24,67.9551
2016-03-28,68.5603
2016-03-29,69.8091
2016-03-30,70.2702
2016-03-31,71.1636
2016-04-01,71.6727
2016-04-04,71.2789
2016-04-05,70.885
2016-04-06,71.9609
2016-04-07,70.8178
2016-04-08,70.5488
2016-04-11,70.2606
2016-04-12,70.8562
2016-04-13,71.154
2016-04-14,71.423
2016-04-15,71.7016
2016-04-18,72.6238
2016-04-19,72.9408
2016-04-20,72.5853
2016-04-21,72.2011
2016-04-22,72.422
2016-04-25,72.374
2016-04-26,72.9792
2016-04-27,73.3538
2016-04-28,72.326
2016-04-29,72.9504
2016-05-02,73.008
2016-05-03,71.9417
2016-05-04,71.8072
2016-05-05,71.8553
2016-05-06,72.4124
2016-05-09,73.4019
2016-05-10,74.324
2016-05-11,73.7846
2016-05-12,72.9175
2016-05-13,72.3588
2016-05-16,72.2432
2016-05-17,71.7807
2016-05-18,72.2335
2016-05-19,72.5322
2016-05-20,73.2065
2016-05-23,73.5148
2016-05-24,76.0485
2016-05-25,75.7017
2016-05-26,75.5764
2016-05-27,76.4146
2016-05-31,76.8673
2016-06-01,75.8269
2016-06-02,75.7691
2016-06-03,74.2855
2016-06-06,74.5264
2016-06-07,75.0273
2016-06-08,75.1911
2016-06-09,75.2104
2016-06-10,73.9098
2016-06-13,73.0331
2016-06-14,71.7904
2016-06-15,71.5784
2016-06-16,71.5303
2016-06-17,70.9715
2016-06-20,71.8193
2016-06-21,72.1276
2016-06-22,72.089
2016-06-23,73.852
2016-06-24,71.0293
2016-06-27,69.2278
2016-06-28,71.1064
2016-06-29,72.1661
2016-06-30,74.2951
2016-07-01,74.1121
2016-07-05,73.9676
2016-07-06,74.7768
2016-07-07,75.5764
2016-07-08,76.5398
2016-07-11,76.4724
2016-07-12,78.0523
2016-07-13,78.5147
2016-07-14,78.717
2016-07-15,78.5051
2016-07-18,78.1968
2016-07-19,78.9675
2016-07-20,79.5359
2016-07-21,79.4492
2016-07-22,79.8923
2016-07-25,79.9309
2016-07-26,80.4993
2016-07-27,80.4415
2016-07-28,81.742
2016-07-29,82.8884
2016-08-01,82.8499
2016-08-02,81.6553
2016-08-03,81.8672
2016-08-04,82.2526
2016-08-05,83.6398
2016-08-08,82.9558
2016-08-09,83.0618
2016-08-10,82.9365
2016-08-11,83.2458
2016-08-12,83.4005
2016-08-15,84.57
2016-08-16,83.7484
2016-08-17,84.0867
2016-08-18,84.251
2016-08-19,84.396
2016-08-22,84.454
2016-08-23,84.7149
2016-08-24,85.1595
2016-08-25,85.6911
2016-08-26,85.9327
2016-08-29,86.7736
2016-08-30,86.9572
2016-08-31,87.1022
2016-09-01,86.2807
2016-09-02,86.5513
2016-09-06,85.6331
2016-09-07,86.0777
2016-09-08,84.3283
2016-09-09,81.8927
2016-09-12,83.0815
2016-09-13,82.028
2016-09-14,81.8637
2016-09-15,82.9849
2016-09-16,82.5016
2016-09-19,82.3856
2016-09-20,82.7916
2016-09-21,83.8354
2016-09-22,83.8644
2016-09-23,83.5068
2016-09-26,82.6176
2016-09-27,82.4533
2016-09-28,82.057
2016-09-29,80.7232
2016-09-30,81.1292
2016-10-03,80.7136
2016-10-04,80.24
2016-10-05,80.4236
2016-10-06,80.3366
2016-10-07,79.892
2016-10-10,80.1916
2016-10-11,77.4178
2016-10-12,79.1768
2016-10-13,79.2155
2016-10-14,80.1337
2016-10-17,80.1433
2016-10-18,80.2206
2016-10-19,80.153
2016-10-20,79.6697
2016-10-21,80.124
2016-10-24,80.4333
2016-10-25,80.4043
2016-10-26,80.153
2016-10-27,76.9345
2016-10-28,76.3063
2016-10-31,77.5047
2016-11-01,76.5286
2016-11-02,76.1806
2016-11-03,76.4319
2016-11-04,76.7122
2016-11-07,78.1523
2016-11-08,78.3649
2016-11-09,79.3251
2016-11-10,78.7238
2016-11-11,77.589
2016-11-14,75.2226
2016-11-15,75.1741
2016-11-16,75.5814
2016-11-17,77.1041
2016-11-18,77.2884
2016-11-21,77.9867
2016-11-22,77.5987
2016-11-23,77.7733
2016-11-25,78.3455
2016-11-28,77.8606
2016-11-29,78.2
2016-11-30,76.4252
2016-12-01,74.8152
2016-12-02,76.9392
2016-12-05,78.3164
2016-12-06,77.0944
2016-12-07,78.3261
2016-12-08,78.2679
2016-12-09,79.005
2016-12-12,78.0546
2016-12-13,78.5977
2016-12-14,77.4435
2016-12-15,78.1127
2016-12-16,77.492
2016-12-19,77.8315
2016-12-20,78.3067
2016-12-21,77.2593
2016-12-22,76.1245
2016-12-23,76.2215
2016-12-27,76.4737
2016-12-28,75.9984
2016-12-29,76.2021
2016-12-30,76.4058
2017-01-03,76.3379
2017-01-04,78.2776
2017-01-05,79.1796
2017-01-06,80.8866
2017-01-09,80.1883
2017-01-10,79.0632
2017-01-11,79.0632
2017-01-12,78.8013
2017-01-13,79.9167
2017-01-17,78.6559
2017-01-18,79.81
2017-01-19,78.7141
2017-01-20,79.2863
2017-01-23,79.6548
2017-01-24,79.7324
2017-01-25,80.227
2017-01-26,80.9932
2017-01-27,80.2658
2017-01-30,81.0902
2017-01-31,80.2561
2017-02-01,81.226
2017-02-02,86.2305
2017-02-03,88.8879
2017-02-06,90.2651
2017-02-07,89.8578
2017-02-08,89.819
2017-02-09,87.6077
2017-02-10,88.4709
2017-02-13,89.9936
2017-02-14,91.1186
2017-02-15,92.0038
2017-02-16,91.6341
2017-02-17,91.7022
2017-02-21,91.9454
2017-02-22,92.3637
2017-02-23,92.4026
2017-02-24,92.9376
2017-02-27,92.9279
2017-02-28,92.0135
2017-03-01,93.2684
2017-03-02,92.3637
2017-03-03,92.8404
2017-03-06,92.1692
2017-03-07,92.8501
2017-03-08,91.8871
2017-03-09,91.8676
2017-03-10,92.2859
2017-03-13,92.7042
2017-03-14,93.7061
2017-03-15,96.605
2017-03-16,95.0096
2017-03-17,94.6789
2017-03-20,94.7664
2017-03-21,92.9474
2017-03-22,93.4921
2017-03-23,94.4746
2017-03-24,94.7859
2017-03-27,93.9882
2017-03-28,93.9785
2017-03-29,93.7742
2017-03-30,94.0758
2017-03-31,94.5427
2017-04-03,94.1244
2017-04-04,93.959
2017-04-05,95.1847
2017-04-06,95.1264
2017-04-07,95.2625
2017-04-10,94.6011
2017-04-11,94.8443
2017-04-12,94.6594
2017-04-13,93.638
2017-04-17,95.3209
2017-04-18,95.0388
2017-04-19,95.4765
2017-04-20,96.0407
2017-04-21,95.3598
2017-04-24,95.9727
2017-04-25,96.7411
2017-04-26,96.9065
2017-04-27,97.6653
2017-04-28,97.5874
2017-05-01,97.889
2017-05-02,99.1633
2017-05-03,98.6478
2017-05-04,94.9318
2017-05-05,96.8287
2017-05-08,95.5349
2017-05-09,94.9902
2017-05-10,95.5933
2017-05-11,95.603
2017-05-12,95.1069
2017-05-15,96.1088
2017-05-16,95.4765
2017-05-17,94.6474
2017-05-18,94.8815
2017-05-19,96.4619
2017-05-22,96.9301
2017-05-23,96.4911
2017-05-24,97.5642
2017-05-25,98.4617
2017-05-26,98.052
2017-05-30,97.6228
2017-05-31,99.2422
2017-06-01,101.4762
2017-06-02,101.9054
2017-06-05,102.0322
2017-06-06,101.6225
2017-06-07,101.3884
2017-06-08,101.0664
2017-06-09,101.4762
2017-06-12,101.2811
2017-06-13,103.3102
2017-06-14,102.8127
2017-06-15,103.1053
2017-06-16,103.037
2017-06-19,103.5736
2017-06-20,101.0469
2017-06-21,99.3397
2017-06-22,100.803
2017-06-23,102.1591
2017-06-26,101.6713
2017-06-27,100.1787
2017-06-28,102.4322
2017-06-29,101.5249
2017-06-30,100.4714
2017-07-03,100.2762
2017-07-05,100.5592
2017-07-06,99.7787
2017-07-07,100.0324
2017-07-10,100.4714
2017-07-11,102.6761
2017-07-12,102.8224
2017-07-13,103.5053
2017-07-14,104.8223
2017-07-17,104.3638
2017-07-18,104.3638
2017-07-19,104.9589
2017-07-20,104.7735
2017-07-21,105.5052
2017-07-24,106.3149
2017-07-25,107.5636
2017-07-26,107.6514
2017-07-27,107.1246
2017-07-28,107.6709
2017-07-31,106.2856
2017-08-01,107.7879
2017-08-02,105.9929
2017-08-03,108.9781
2017-08-04,108.4513
2017-08-07,108.4806
2017-08-08,107.6904
2017-08-09,106.9978
2017-08-10,104.6369
2017-08-11,104.5101
2017-08-14,107.5831
2017-08-15,106.5978
2017-08-16,109.8284
2017-08-17,108.0173
2017-08-18,108.7809
2017-08-21,107.9977
2017-08-22,110.5919
2017-08-23,109.8577
2017-08-24,109.6619
2017-08-25,111.8548
2017-08-28,111.5905
2017-08-29,110.6996
2017-08-30,110.6115
2017-08-31,112.1974
2017-09-01,113.0197
2017-09-05,110.7486
2017-09-06,109.7305
2017-09-07,111.6198
2017-09-08,112.4715
2017-09-11,113.333
2017-09-12,115.2615
2017-09-13,111.8841
2017-09-14,111.0716
2017-09-15,110.915
2017-09-18,110.7681
2017-09-19,111.4143
2017-09-20,111.8841
2017-09-21,112.8729
2017-09-22,114.9483
2017-09-25,113.5679
2017-09-26,112.7652
2017-09-27,113.3232
2017-09-28,114.5077
2017-09-29,114.4392
2017-10-02,114.5175
2017-10-03,116.0153
2017-10-04,117.611
2017-10-05,118.5508
2017-10-06,118.727
2017-10-09,118.9815
2017-10-10,119.3535
2017-10-11,119.3144
2017-10-12,120.1465
2017-10-13,119.52
2017-10-16,120.8807
2017-10-17,119.8724
2017-10-18,120.0094
2017-10-19,119.4318
2017-10-20,119.4318
2017-10-23,119.1382
2017-10-24,117.9145
2017-10-25,116.0055
2017-10-26,117.7187
2017-10-27,117.4739
2017-10-30,115.1734
2017-10-31,114.8895
2017-11-01,115.1147
2017-11-02,122.7799
2017-11-03,123.3868
2017-11-06,125.0119
2017-11-07,123.3281
2017-11-08,124.4245
2017-11-09,125.1881
2017-11-10,122.3883
2017-11-13,122.819
2017-11-14,122.4862
2017-11-15,121.6149
2017-11-16,123.1173
2017-11-17,124.2957
2017-11-20,124.8946
2017-11-21,125.1991
2017-11-22,125.1991
2017-11-24,126.5738
2017-11-27,126.4265
2017-11-28,127.0157
2017-11-29,125.4249
2017-11-30,126.3774
2017-12-01,126.6229
2017-12-04,125.2678
2017-12-05,126.0435
2017-12-06,125.69
2017-12-07,125.8962
2017-12-08,125.4053
2017-12-11,126.0239
2017-12-12,125.69
2017-12-13,124.9928
2017-12-14,125.2482
2017-12-15,125.6213
2017-12-18,124.983
2017-12-19,124.6786
2017-12-20,125.8471
2017-12-21,126.2988
2017-12-22,126.0141
2017-12-26,123.3333
2017-12-27,123.2057
2017-12-28,124.0993
2017-12-29,124.2564
2018-01-02,125.3758
2018-01-03,127.2808
2018-01-04,129.284
2018-01-05,130.6293
2018-01-08,130.806
2018-01-09,131.6799
2018-01-10,131.3363
2018-01-11,132.328
2018-01-12,133.4376
2018-01-16,131.9058
2018-01-17,133.3493
2018-01-18,134.3509
2018-01-19,135.7551
2018-01-22,136.7566
2018-01-23,137.5717
2018-01-24,135.5783
2018-01-25,135.3721
2018-01-26,138.0332
2018-01-29,135.5587
2018-01-30,135.8041
2018-01-31,136.7174
2018-02-01,143.6794
2018-02-02,139.9578
2018-02-05,133.2314
2018-02-06,136.3835
2018-02-07,137.2378
2018-02-08,131.3952
2018-02-09,134.017
2018-02-12,135.048
2018-02-13,138.0528
2018-02-14,143.0215
2018-02-15,145.9357
2018-02-16,142.7557
2018-02-20,142.1453
2018-02-21,140.5799
2018-02-22,140.6587
2018-02-23,142.7458
2018-02-26,142.1847
2018-02-27,140.6291
2018-02-28,139.3296
2018-03-01,140.4421
2018-03-02,141.1017
2018-03-05,143.6713
2018-03-06,146.6839
2018-03-07,146.0046
2018-03-08,148.2493
2018-03-09,150.75
2018-03-12,151.6656
2018-03-13,149.2929
2018-03-14,152.0397
2018-03-15,152.5517
2018-03-16,152.5812
2018-03-19,152.975
2018-03-20,155.6332
2018-03-21,155.8105
2018-03-22,153.7134
2018-03-23,151.6853
2018-03-26,156.2141
2018-03-27,151.6558
2018-03-28,148.2198
2018-03-29,147.1565
2018-04-02,143.6811
2018-04-03,143.4547
2018-04-04,144.4294
2018-04-05,144.2423
2018-04-06,141.8204
2018-04-09,144.3605
2018-04-10,146.743
2018-04-11,145.9554
2018-04-12,146.9891
2018-04-13,145.3253
2018-04-16,146.871
2018-04-17,147.7964
2018-04-18,148.1016
2018-04-19,147.6783
2018-04-20,147.2746
2018-04-23,147.6783
2018-04-24,145.4041
2018-04-25,146.9005
2018-04-26,147.2845
2018-04-27,147.8752
2018-04-30,147.5109
2018-05-01,148.3281
2018-05-02,148.1115
2018-05-03,146.8907
2018-05-04,149.7753
2018-05-07,152.5221
2018-05-08,152.9061
2018-05-09,154.2057
2018-05-10,157.3758
2018-05-11,158.4785
2018-05-14,158.0552
2018-05-15,156.2535
2018-05-16,155.8695
2018-05-17,154.705
2018-05-18,154.1523
2018-05-21,155.9188
2018-05-22,154.478
2018-05-23,156.284
2018-05-24,157.0439
2018-05-25,157.2511
2018-05-29,156.7972
2018-05-30,159.8664
2018-05-31,160.4388
2018-06-01,161.2579
2018-06-04,161.3369
2018-06-05,161.5638
2018-06-06,163.281
2018-06-07,163.0541
2018-06-08,164.11
2018-06-11,164.3074
2018-06-12,167.5148
2018-06-13,169.9425
2018-06-14,170.0906
2018-06-15,170.4853
2018-06-18,169.3307
2018-06-19,169.5083
2018-06-20,169.459
2018-06-21,168.5214
2018-06-22,168.3931
2018-06-25,166.3503
2018-06-26,164.1495
2018-06-27,161.4059
2018-06-28,162.4521
2018-06-29,163.2613
2018-07-02,164.9489
2018-07-03,163.5574
2018-07-05,162.7481
2018-07-06,164.4258
2018-07-09,166.4292
2018-07-10,166.518
2018-07-11,167.0608
2018-07-12,167.0411
2018-07-13,167.3569
2018-07-16,168.3438
2018-07-17,168.5017
2018-07-18,169.2813
2018-07-19,168.4523
2018-07-20,168.7385
2018-07-23,171.0183
2018-07-24,170.3176
2018-07-25,173.9395
2018-07-26,171.492
2018-07-27,169.3208
2018-07-30,165.3042
2018-07-31,164.0113
2018-08-01,160.8632
2018-08-02,168.0576
2018-08-03,164.6331
2018-08-06,167.9392
2018-08-07,170.5939
2018-08-08,170.4261
2018-08-09,170.8998
2018-08-10,170.8604
2018-08-13,170.3373
2018-08-14,173.1401
2018-08-15,171.3341
2018-08-16,172.2154
2018-08-17,171.5816
2018-08-20,172.4629
2018-08-21,171.8391
2018-08-22,171.443
2018-08-23,171.3935
2018-08-24,172.3144
2018-08-27,173.2254
2018-08-28,175.4236
2018-08-29,176.3247
2018-08-30,175.9088
2018-08-31,178.4932
2018-09-04,180.4439
2018-09-05,176.7703
2018-09-06,177.4832
2018-09-07,177.4238
2018-09-10,176.3643
2018-09-11,175.7207
2018-09-12,174.7998
2018-09-13,178.7705
2018-09-14,180.3944
2018-09-17,176.196
2018-09-18,176.4732
2018-09-19,172.8194
2018-09-20,174.5918
2018-09-21,174.5621
2018-09-24,176.295
2018-09-25,177.1466
2018-09-26,177.0178
2018-09-27,176.8792
2018-09-28,175.6712
2018-10-01,178.0377
2018-10-02,175.2256
2018-10-03,175.5424
2018-10-04,170.8291
2018-10-05,168.8982
2018-10-08,166.1752
2018-10-09,165.3236
2018-10-10,155.3028
2018-10-11,150.1042
2018-10-12,152.5302
2018-10-15,149.7478
2018-10-16,154.7186
2018-10-17,155.7385
2018-10-18,152.2431
2018-10-19,152.352
2018-10-22,154.8671
2018-10-23,153.4808
2018-10-24,147.2327
2018-10-25,147.8763
2018-10-26,141.3608
2018-10-29,141.5984
2018-10-30,143.0936
2018-10-31,148.9061
2018-11-01,145.8464
2018-11-02,142.6975
2018-11-05,143.658
2018-11-06,146.3217
2018-11-07,150.3617
2018-11-08,150.5201
2018-11-09,148.3219
2018-11-12,146.5989
2018-11-13,146.2623
2018-11-14,146.7178
2018-11-15,150.7636
2018-11-16,152.384
2018-11-19,144.6699
2018-11-20,143.4968
2018-11-21,145.4751
2018-11-23,148.9445
2018-11-26,151.4993
2018-11-27,151.3004
2018-11-28,157.6726
2018-11-29,156.1118
2018-11-30,156.1615
2018-12-03,160.6449
2018-12-04,153.4079
2018-12-06,151.4197
2018-12-07,148.8649
2018-12-10,149.2725
2018-12-11,151.1016
2018-12-12,152.9805
2018-12-13,151.9168
2018-12-14,149.5608
2018-12-17,143.3577
2018-12-18,143.3974
2018-12-19,142.2841
2018-12-20,140.1169
2018-12-21,136.4786
2018-12-24,134.2916
2018-12-26,140.6935
2018-12-27,144.4114
2018-12-28,144.5406
2018-12-31,146.5586
2019-01-02,146.0715
2019-01-03,140.5046
2019-01-04,145.7335
2019-01-07,146.4095
2019-01-08,149.4514
2019-01-09,150.9127
2019-01-10,153.0302
2019-01-11,153.9149
2019-01-14,152.8015
2019-01-15,156.1317
2019-01-16,159.3029
2019-01-17,159.78
2019-01-18,164.9891
2019-01-22,161.301
2019-01-23,161.8179
2019-01-24,160.7841
2019-01-25,162.8617
2019-01-28,161.4799
2019-01-29,159.8993
2019-01-30,161.808
2019-01-31,169.2636
2019-02-01,171.8284
2019-02-04,171.5401
2019-02-05,173.4587
2019-02-06,170.9337
2019-02-07,171.4308
2019-02-08,171.2717
2019-02-11,170.7349
2019-02-12,173.5879
2019-02-13,173.8365
2019-02-14,173.1008
2019-02-15,174.1347
2019-02-19,173.7669
2019-02-20,175.0691
2019-02-21,173.7625
2019-02-22,176.6948
2019-02-25,177.6922
2019-02-26,177.8617
2019-02-27,180.2654
2019-02-28,184.2349
2019-03-01,189.7105
2019-03-04,186.6685
2019-03-05,187.1772
2019-03-06,185.9704
2019-03-07,181.5819
2019-03-08,181.9609
2019-03-11,183.1777
2019-03-12,184.5341
2019-03-13,185.1026
2019-03-14,186.3194
2019-03-15,189.0822
2019-03-18,190.4685
2019-03-19,191.2664
2019-03-20,191.4659
2019-03-21,195.1562
2019-03-22,191.3562
2019-03-25,191.0769
2019-03-26,193.9294
2019-03-27,192.8522
2019-03-28,196.1236
2019-03-29,198.3178
2019-04-01,201.3499
2019-04-02,204.352
2019-04-03,205.7982
2019-04-04,205.7383
2019-04-05,206.4464
2019-04-08,210.4459
2019-04-09,211.3336
2019-04-10,214.0464
2019-04-11,215.732
2019-04-12,217.4176
2019-04-15,218.4149
2019-04-16,218.764
2019-04-17,218.4249
2019-04-18,220.7687
2019-04-22,221.9456
2019-04-23,225.4364
2019-04-24,224.1798
2019-04-25,222.6937
2019-04-26,225.4265
2019-04-29,223.1924
2019-04-30,224.7882
2019-05-01,222.1351
2019-05-02,220.7089
2019-05-03,226.3341
2019-05-06,229.027
2019-05-07,221.3472
2019-05-08,223.2422
2019-05-09,221.2973
2019-05-10,223.691
2019-05-13,214.7845
2019-05-14,219.8611
2019-05-15,220.3199
2019-05-16,226.07
2019-05-17,224.81
2019-05-20,222.67
2019-05-21,224.91
2019-05-22,225.12
2019-05-23,217.67
2019-05-24,218.86
2019-05-28,221.36
2019-05-29,220.54
2019-05-30,222.78
2019-05-31,220.01
2019-06-03,216.26
2019-06-04,224.83
2019-06-05,234.5
2019-06-06,237.58
2019-06-07,240.3
2019-06-10,243.99
2019-06-11,236.35
2019-06-12,234.85
2019-06-13,234.27
2019-06-14,236.39
2019-06-17,233.22
2019-06-18,234.11
2019-06-19,236.28
2019-06-20,236.83
2019-06-21,233.92
2019-06-24,235.665
2019-06-25,231.13
2019-06-26,231.62
2019-06-27,233.525
2019-06-28,237.76
2019-07-01,240.36
2019-07-02,244.2
2019-07-03,245.72
2019-07-04,245.72
2019-07-05,242.1
2019-07-08,235.115
2019-07-09,237.27
2019-07-10,238.01
2019-07-11,239.555
2019-07-12,244.49
2019-07-15,244.71
2019-07-16,241.66
2019-07-17,241.95
2019-07-18,245.615
2019-07-19,241.225
2019-07-22,240.39
2019-07-23,234.95
2019-07-24,232.25
2019-07-25,231.56
2019-07-26,237.34
2019-07-29,232.35
2019-07-30,227.565
2019-07-31,227.195
2019-08-01,225.58
2019-08-02,219.935
2019-08-05,209.53
2019-08-06,214.37
2019-08-07,217.66
2019-08-08,224.92
2019-08-09,224.48
2019-08-12,220.16
2019-08-13,226.29
2019-08-14,219.45
2019-08-15,222.725
2019-08-16,226.485
2019-08-19,230.795
2019-08-20,231.555
2019-08-21,235.06
2019-08-22,236.21
2019-08-23,232.2
2019-08-26,231.15
2019-08-27,230.91
2019-08-28,231.425
2019-08-29,235.275
2019-08-30,234.86
2019-09-02,234.57
2019-09-03,233.245
2019-09-04,230
2019-09-05,235.565
2019-09-06,241.59
2019-09-09,237.55
2019-09-10,228.3
2019-09-11,226.35
2019-09-12,232.205
2019-09-13,229.71
2019-09-16,230
2019-09-17,240.34
2019-09-18,233.735
2019-09-19,235.565
2019-09-20,226.03
2019-09-23,225.85
2019-09-24,225.66
2019-09-25,227.585
2019-09-26,223.42
2019-09-27,215.7
2019-09-30,217.7
2019-10-01,216.485
2019-10-02,213.08
2019-10-03,218.17
2019-10-04,221.105
2019-10-07,221.21
2019-10-08,215.06
2019-10-09,219.595
2019-10-10,222.71
2019-10-11,225.23
2019-10-14,225.14
2019-10-15,228.22
2019-10-16,225.84
2019-10-17,229.025
2019-10-18,224.74
2019-10-21,226.21
2019-10-22,216.25
2019-10-23,218.04
2019-10-24,222.55
2019-10-25,222.19
2019-10-28,225.1
2019-10-29,227.795
2019-10-30,228.285
2019-10-31,234.73
2019-11-01,245.565
2019-11-04,245.535
2019-11-05,237.385
2019-11-06,241.055
2019-11-07,246.695
2019-11-08,244.06
2019-11-11,244.625
2019-11-12,246.305
2019-11-13,249.5
2019-11-14,248.71
2019-11-15,249.895
2019-11-18,252.37
2019-11-19,256.51
2019-11-20,256.05
2019-11-21,255.64
2019-11-22,258.12
2019-11-25,264.27
