date,close
2014-06-13,21.926
2014-06-16,21.8256
2014-06-17,22.1017
2014-06-18,22.1603
2014-06-19,21.9427
2014-06-20,22.1352
2014-06-23,21.9846
2014-06-24,22.1268
2014-06-25,22.1519
2014-06-26,22.018
2014-06-27,21.9929
2014-06-30,22.018
2014-07-01,22.3026
2014-07-02,22.0683
2014-07-03,22.5369
2014-07-07,22.2524
2014-07-08,22.0766
2014-07-09,22.0934
2014-07-10,21.7318
2014-07-11,21.6582
2014-07-14,21.6331
2014-07-15,21.7586
2014-07-16,21.3904
2014-07-17,20.8297
2014-07-18,21.064
2014-07-21,20.905
2014-07-22,20.746
2014-07-23,20.746
2014-07-24,21.7419
2014-07-25,21.8841
2014-07-28,21.4992
2014-07-29,21.4071
2014-07-30,21.6331
2014-07-31,21.3318
2014-08-01,21.0222
2014-08-04,21.2507
2014-08-05,21.2591
2014-08-06,21.5045
2014-08-07,21.5384
2014-08-08,21.6146
2014-08-11,21.6653
2014-08-12,21.403
2014-08-13,21.5469
2014-08-14,21.4707
2014-08-15,21.2253
2014-08-18,21.7161
2014-08-19,21.7161
2014-08-20,21.6061
2014-08-21,22.0039
2014-08-22,22.1224
2014-08-25,22.1901
2014-08-26,22.2662
2014-08-27,22.1901
2014-08-28,21.8515
2014-08-29,22.0123
2014-09-02,22.3255
2014-09-03,22.5201
2014-09-04,22.2916
2014-09-05,22.1562
2014-09-08,22.1816
2014-09-09,22.0885
2014-09-10,22.3932
2014-09-11,22.4101
2014-09-12,22.5455
2014-09-15,22.2493
2014-09-16,21.8854
2014-09-17,21.9023
2014-09-18,22.3085
2014-09-19,22.4863
2014-09-22,22.1308
2014-09-23,21.6823
2014-09-24,21.6738
2014-09-25,21.3014
2014-09-26,21.4453
2014-09-29,21.3014
2014-09-30,20.9968
2014-10-01,20.9545
2014-10-02,21.0391
2014-10-03,21.4622
2014-10-06,21.221
2014-10-07,20.8275
2014-10-08,21.4453
2014-10-09,20.9206
2014-10-10,20.7598
2014-10-13,20.9291
2014-10-14,21.276
2014-10-15,20.6836
2014-10-16,21.0729
2014-10-17,21.0391
2014-10-20,21.0814
2014-10-21,21.6484
2014-10-22,21.1491
2014-10-23,21.6823
2014-10-24,21.7669
2014-10-27,21.6653
2014-10-28,22.5878
2014-10-29,23.1613
2014-10-30,23.3496
2014-10-31,23.7775
2014-11-03,23.6919
2014-11-04,24.0172
2014-11-05,24.0942
2014-11-06,24.2654
2014-11-07,24.1541
2014-11-10,24.3082
2014-11-11,24.2996
2014-11-12,24.5222
2014-11-13,24.2654
2014-11-14,24.2825
2014-11-17,23.8888
2014-11-18,23.846
2014-11-19,23.4951
2014-11-20,23.8203
2014-11-21,23.769
2014-11-24,23.9402
2014-11-25,23.9402
2014-11-26,23.9658
2014-11-28,23.5122
2014-12-01,22.8446
2014-12-02,23.2897
2014-12-03,23.4865
2014-12-04,23.4523
2014-12-05,23.6663
2014-12-08,23.8032
2014-12-09,23.9658
2014-12-10,23.1955
2014-12-11,23.3752
2014-12-12,23.2554
2014-12-15,23.0243
2014-12-16,23.0158
2014-12-17,23.769
2014-12-18,23.7946
2014-12-19,23.4951
2014-12-22,23.7519
2014-12-23,23.7519
2014-12-24,23.6748
2014-12-26,23.7519
2014-12-29,23.7519
2014-12-30,23.9059
2014-12-31,23.632
2015-01-02,23.4523
2015-01-05,23.0757
2015-01-06,22.2968
2015-01-07,22.3396
2015-01-08,22.9986
2015-01-09,22.2112
2015-01-12,21.9459
2015-01-13,21.7832
2015-01-14,21.458
2015-01-15,21.3724
2015-01-16,21.9202
2015-01-20,21.7918
2015-01-21,21.749
2015-01-22,22.8446
2015-01-23,22.4936
2015-01-26,22.7162
2015-01-27,22.4081
2015-01-28,21.6548
2015-01-29,21.9887
2015-01-30,21.7661
2015-02-02,22.2968
2015-02-03,22.8531
2015-02-04,22.9815
2015-02-05,23.4437
2015-02-06,23.8888
2015-02-09,23.6286
2015-02-10,23.741
2015-02-11,23.5074
2015-02-12,23.9054
2015-02-13,24.0958
2015-02-17,24.4072
2015-02-18,24.0785
2015-02-19,24.2428
2015-02-20,24.3813
2015-02-23,24.3121
2015-02-24,24.338
2015-02-25,24.2775
2015-02-26,24.5024
2015-02-27,24.3813
2015-03-02,24.5111
2015-03-03,24.2775
2015-03-04,24.0525
2015-03-05,24.1909
2015-03-06,24.4332
2015-03-09,24.6062
2015-03-10,24.165
2015-03-11,24.4418
2015-03-12,25.108
2015-03-13,24.961
2015-03-16,25.0388
2015-03-17,25.1167
2015-03-18,25.0994
2015-03-19,24.9956
2015-03-20,25.2811
2015-03-23,25.134
2015-03-24,25.0994
2015-03-25,24.5284
2015-03-26,24.71
2015-03-27,24.6495
2015-03-30,25.0994
2015-03-31,25.0648
2015-04-01,24.961
2015-04-02,25.16
2015-04-06,24.8831
2015-04-07,24.8917
2015-04-08,24.909
2015-04-09,24.8398
2015-04-10,25.0994
2015-04-13,25.333
2015-04-14,25.1773
2015-04-15,25.3157
2015-04-16,25.3849
2015-04-17,24.8052
2015-04-20,25.1773
2015-04-21,25.2465
2015-04-22,25.4195
2015-04-23,26.0857
2015-04-24,25.8175
2015-04-27,25.6099
2015-04-28,26.1117
2015-04-29,26.0857
2015-04-30,25.6964
2015-05-01,25.4368
2015-05-04,25.6373
2015-05-05,25.4184
2015-05-06,25.6285
2015-05-07,25.576
2015-05-08,25.7773
2015-05-11,26.1274
2015-05-12,26.2062
2015-05-13,26.4338
2015-05-14,26.7051
2015-05-15,26.1799
2015-05-18,26.6176
2015-05-19,26.6964
2015-05-20,26.8189
2015-05-21,26.6964
2015-05-22,26.425
2015-05-26,26.39
2015-05-27,26.6789
2015-05-28,26.6613
2015-05-29,26.4425
2015-06-01,26.32
2015-06-02,26.6088
2015-06-03,27.0115
2015-06-04,26.7489
2015-06-05,27.3703
2015-06-08,27.4579
2015-06-09,27.843
2015-06-10,28.3156
2015-06-11,28.3069
2015-06-12,28.5082
2015-06-15,28.3769
2015-06-16,28.7358
2015-06-17,28.2106
2015-06-18,28.4032
2015-06-19,28.3156
2015-06-22,28.8671
2015-06-23,28.9634
2015-06-24,28.9021
2015-06-25,29.0947
2015-06-26,29.1384
2015-06-29,28.4382
2015-06-30,28.482
2015-07-01,28.762
2015-07-02,28.2106
2015-07-06,28.3156
2015-07-07,27.8605
2015-07-08,27.5804
2015-07-09,27.9043
2015-07-10,28.2369
2015-07-13,28.5345
2015-07-14,28.7095
2015-07-15,29.0071
2015-07-16,28.8496
2015-07-17,28.6132
2015-07-20,28.8233
2015-07-21,28.6483
2015-07-22,28.9021
2015-07-23,28.657
2015-07-24,28.622
2015-07-27,28.1231
2015-07-28,28.2456
2015-07-29,28.2981
2015-07-30,28.587
2015-07-31,28.7008
2015-08-03,28.7442
2015-08-04,28.93
2015-08-05,29.2307
2015-08-06,28.8946
2015-08-07,28.93
2015-08-10,29.5402
2015-08-11,29.0007
2015-08-12,28.1516
2015-08-13,28.3728
2015-08-14,29.2395
2015-08-17,29.5933
2015-08-18,29.5314
2015-08-19,29.1953
2015-08-20,27.9128
2015-08-21,27.5679
2015-08-24,25.8786
2015-08-25,25.4187
2015-08-26,26.2501
2015-08-27,26.5773
2015-08-28,26.5773
2015-08-31,26.8073
2015-09-01,25.6752
2015-09-02,25.9671
2015-09-03,26.144
2015-09-04,26.0025
2015-09-08,26.8427
2015-09-09,26.6746
2015-09-10,26.9753
2015-09-11,27.0815
2015-09-14,27.1965
2015-09-15,27.6917
2015-09-16,27.7183
2015-09-17,27.0107
2015-09-18,26.5066
2015-09-21,26.9665
2015-09-22,26.8338
2015-09-23,27.0992
2015-09-24,27.4087
2015-09-25,27.7183
2015-09-28,27.2849
2015-09-29,27.1876
2015-09-30,27.6033
2015-10-01,27.7448
2015-10-02,27.0284
2015-10-05,27.7802
2015-10-06,27.736
2015-10-07,28.6116
2015-10-08,29.0626
2015-10-09,28.8061
2015-10-12,29.0449
2015-10-13,28.6558
2015-10-14,27.6475
2015-10-15,28.3374
2015-10-16,28.4524
2015-10-19,28.5496
2015-10-20,29.0096
2015-10-21,28.3551
2015-10-22,28.9034
2015-10-23,29.5402
2015-10-26,29.3987
2015-10-27,28.9034
2015-10-28,30.2478
2015-10-29,29.8851
2015-10-30,29.4695
2015-11-02,30.0709
2015-11-03,30.0974
2015-11-04,30.0886
2015-11-05,30.5308
2015-11-06,31.5756
2015-11-09,31.513
2015-11-10,31.7633
2015-11-11,31.799
2015-11-12,30.6997
2015-11-13,30.092
2015-11-16,30.5031
2015-11-17,30.521
2015-11-18,30.941
2015-11-19,30.941
2015-11-20,31.0215
2015-11-23,31.2717
2015-11-24,31.379
2015-11-25,31.4594
2015-11-27,31.6292
2015-11-30,31.7633
2015-12-01,31.7811
2015-12-02,31.3432
2015-12-03,30.4674
2015-12-04,30.8427
2015-12-07,29.9847
2015-12-08,29.5021
2015-12-09,28.9748
2015-12-10,29.1446
2015-12-11,28.2062
2015-12-14,28.3403
2015-12-15,29.1357
2015-12-16,29.663
2015-12-17,29.3502
2015-12-18,28.948
2015-12-21,29.1536
2015-12-22,29.2519
2015-12-23,29.6898
2015-12-24,29.8596
2015-12-28,29.7792
2015-12-29,29.9401
2015-12-30,29.4396
2015-12-31,29.0553
2016-01-04,28.4028
2016-01-05,28.4297
2016-01-06,28.242
2016-01-07,27.3214
2016-01-08,26.5349
2016-01-11,26.6601
2016-01-12,26.7226
2016-01-13,25.8646
2016-01-14,26.526
2016-01-15,26.2221
2016-01-19,26.2668
2016-01-20,26.0255
2016-01-21,25.534
2016-01-22,25.9272
2016-01-25,25.1228
2016-01-26,25.9898
2016-01-27,25.7842
2016-01-28,26.4366
2016-01-29,26.4813
2016-02-01,26.6332
2016-02-02,25.9629
2016-02-03,25.9093
2016-02-04,25.6144
2016-02-05,25.1586
2016-02-08,25.094
2016-02-09,25.2299
2016-02-10,25.0487
2016-02-11,24.6229
2016-02-12,25.6376
2016-02-16,26.2808
2016-02-17,25.8912
2016-02-18,25.4473
2016-02-19,25.6285
2016-02-22,25.9456
2016-02-23,25.6557
2016-02-24,25.7735
2016-02-25,26.1177
2016-02-26,26.8877
2016-02-29,26.1177
2016-03-01,26.7971
2016-03-02,26.7247
2016-03-03,26.9059
2016-03-04,26.8606
2016-03-07,27.1867
2016-03-08,26.616
2016-03-09,26.5163
2016-03-10,26.7971
2016-03-11,27.3769
2016-03-14,27.4947
2016-03-15,27.0508
2016-03-16,26.8877
2016-03-17,27.3045
2016-03-18,27.7212
2016-03-21,27.5944
2016-03-22,27.4403
2016-03-23,26.9421
2016-03-24,26.7065
2016-03-28,26.6341
2016-03-29,27.0689
2016-03-30,27.2501
2016-03-31,27.1052
2016-04-01,27.3498
2016-04-04,27.2501
2016-04-05,26.4529
2016-04-06,26.7156
2016-04-07,25.9637
2016-04-08,26.1268
2016-04-11,26.3079
2016-04-12,26.8515
2016-04-13,27.9386
2016-04-14,27.8118
2016-04-15,27.6759
2016-04-18,27.8571
2016-04-19,28.2104
2016-04-20,28.4097
2016-04-21,28.3825
2016-04-22,28.6905
2016-04-25,28.3463
2016-04-26,28.7358
2016-04-27,28.6996
2016-04-28,27.1686
2016-04-29,26.7156
2016-05-02,27.087
2016-05-03,26.2355
2016-05-04,25.8731
2016-05-05,25.6829
2016-05-06,25.8278
2016-05-09,25.7808
2016-05-10,26.0745
2016-05-11,25.9001
2016-05-12,25.9093
2016-05-13,25.7074
2016-05-16,26.0378
2016-05-17,25.7992
2016-05-18,26.9097
2016-05-19,26.5793
2016-05-20,27.0153
2016-05-23,26.8087
2016-05-24,27.4971
2016-05-25,27.9285
2016-05-26,27.4787
2016-05-27,28.0386
2016-05-31,27.9652
2016-06-01,27.8459
2016-06-02,27.7633
2016-06-03,27.1392
2016-06-06,27.5246
2016-06-07,27.5613
2016-06-08,27.6898
2016-06-09,27.2218
2016-06-10,26.7445
2016-06-13,26.3407
2016-06-14,25.8726
2016-06-15,25.7533
2016-06-16,25.5697
2016-06-17,25.4412
2016-06-20,25.9185
2016-06-21,26.1204
2016-06-22,26.1479
2016-06-23,27.2676
2016-06-24,25.3495
2016-06-27,24.1196
2016-06-28,24.7345
2016-06-29,25.1934
2016-06-30,25.7533
2016-07-01,25.1659
2016-07-05,24.5602
2016-07-06,24.5785
2016-07-07,24.9548
2016-07-08,25.5881
2016-07-11,26.1112
2016-07-12,26.8363
2016-07-13,26.9739
2016-07-14,27.3502
2016-07-15,27.5705
2016-07-18,27.543
2016-07-19,27.5154
2016-07-20,27.5797
2016-07-21,27.0198
2016-07-22,27.3686
2016-07-25,27.1575
2016-07-26,27.3227
2016-07-27,27.3227
2016-07-28,27.8183
2016-07-29,27.8275
2016-08-01,27.7082
2016-08-02,27.6164
2016-08-03,28.0294
2016-08-04,28.0753
2016-08-05,29.2317
2016-08-08,29.4071
2016-08-09,29.4071
2016-08-10,29.0076
2016-08-11,29.1377
2016-08-12,29.2213
2016-08-15,29.6952
2016-08-16,29.4071
2016-08-17,29.8159
2016-08-18,29.7416
2016-08-19,29.8717
2016-08-22,29.9739
2016-08-23,30.0482
2016-08-24,30.1411
2016-08-25,30.2712
2016-08-26,30.3734
2016-08-29,30.6986
2016-08-30,30.9123
2016-08-31,30.6986
2016-09-01,30.2341
2016-09-02,30.55
2016-09-06,30.3455
2016-09-07,30.5871
2016-09-08,30.5778
2016-09-09,30.1969
2016-09-12,30.2526
2016-09-13,29.7137
2016-09-14,29.5558
2016-09-15,30.2248
2016-09-16,30.169
2016-09-19,30.3177
2016-09-20,30.3734
2016-09-21,30.759
2016-09-22,30.8101
2016-09-23,30.6986
2016-09-26,30.0668
2016-09-27,30.3455
2016-09-28,30.5592
2016-09-29,30.0111
2016-09-30,30.4013
2016-10-03,30.0204
2016-10-04,30.2619
2016-10-05,30.7637
2016-10-06,30.6615
2016-10-07,30.5964
2016-10-10,30.6707
2016-10-11,30.5685
2016-10-12,30.5221
2016-10-13,29.6394
2016-10-14,29.8438
2016-10-17,29.5929
2016-10-18,29.7695
2016-10-19,30.0854
2016-10-20,29.9646
2016-10-21,29.7044
2016-10-24,29.8903
2016-10-25,29.7974
2016-10-26,29.7137
2016-10-27,30.4013
2016-10-28,30.4663
2016-10-31,30.68
2016-11-01,30.3084
2016-11-02,29.6859
2016-11-03,29.8159
2016-11-04,30.0575
2016-11-07,31.2131
2016-11-08,31.2131
2016-11-09,33.1881
2016-11-10,34.6457
2016-11-11,35.605
2016-11-14,36.0094
2016-11-15,36.489
2016-11-16,35.9529
2016-11-17,36.3667
2016-11-18,36.8087
2016-11-21,36.5642
2016-11-22,37.279
2016-11-23,37.6081
2016-11-25,37.5893
2016-11-28,36.9968
2016-11-29,37.1285
2016-11-30,37.4482
2016-12-01,38.6144
2016-12-02,38.8495
2016-12-05,39.6771
2016-12-06,40.1755
2016-12-07,40.8996
2016-12-08,41.9153
2016-12-09,41.9717
2016-12-12,40.6739
2016-12-13,41.0125
2016-12-14,40.8432
2016-12-15,40.9937
2016-12-16,41.0219
2016-12-19,40.8714
2016-12-20,42.1034
2016-12-21,42.1974
2016-12-22,42.2821
2016-12-23,42.2257
2016-12-27,42.442
2016-12-28,42.094
2016-12-29,42
2016-12-30,42.0188
2017-01-03,41.8777
2017-01-04,42.3667
2017-01-05,41.4733
2017-01-06,41.6896
2017-01-09,40.7304
2017-01-10,39.5454
2017-01-11,40.0344
2017-01-12,39.0846
2017-01-13,39.6489
2017-01-17,38.3605
2017-01-18,38.652
2017-01-19,38.2852
2017-01-20,38.699
2017-01-23,38.3981
2017-01-24,39.1128
2017-01-25,39.1598
2017-01-26,38.9717
2017-01-27,38.4357
2017-01-30,37.8056
2017-01-31,37.3918
2017-02-01,36.9216
2017-02-02,36.5924
2017-02-03,37.4953
2017-02-06,37.221
2017-02-07,37.0792
2017-02-08,36.3794
2017-02-09,37.0697
2017-02-10,37.117
2017-02-13,37.6938
2017-02-14,38.2518
2017-02-15,38.6206
2017-02-16,38.857
2017-02-17,38.7435
2017-02-21,38.9232
2017-02-22,39.0083
2017-02-23,38.9989
2017-02-24,38.5922
2017-02-27,38.649
2017-02-28,37.7222
2017-03-01,38.7152
2017-03-02,37.6938
2017-03-03,37.9019
2017-03-06,37.4669
2017-03-07,37.0413
2017-03-08,36.7671
2017-03-09,36.7387
2017-03-10,36.8428
2017-03-13,37.3061
2017-03-14,37.1643
2017-03-15,37.0319
2017-03-16,37.7222
2017-03-17,38.1099
2017-03-20,37.2683
2017-03-21,35.3581
2017-03-22,34.8285
2017-03-23,35.377
2017-03-24,35.6701
2017-03-27,35.8214
2017-03-28,36.2375
2017-03-29,36.0768
2017-03-30,37.2021
2017-03-31,36.8711
2017-04-03,36.2186
2017-04-04,36.1146
2017-04-05,35.3581
2017-04-06,35.8309
2017-04-07,35.6701
2017-04-10,35.4054
2017-04-11,36.0295
2017-04-12,35.585
2017-04-13,35.0082
2017-04-17,35.6985
2017-04-18,35.6796
2017-04-19,36.2186
2017-04-20,36.9941
2017-04-21,36.9657
2017-04-24,37.9586
2017-04-25,38.0721
2017-04-26,38.4598
2017-04-27,38.0343
2017-04-28,37.3629
2017-05-01,37.656
2017-05-02,37.4669
2017-05-03,37.6844
2017-05-04,38.0768
2017-05-05,37.987
2017-05-08,38.4624
2017-05-09,38.1201
2017-05-10,38.025
2017-05-11,37.3404
2017-05-12,37.1122
2017-05-15,37.3024
2017-05-16,37.5021
2017-05-17,35.6954
2017-05-18,35.8571
2017-05-19,35.819
2017-05-22,36.2659
2017-05-23,36.9601
2017-05-24,36.5512
2017-05-25,36.5892
2017-05-26,36.2184
2017-05-30,35.3151
2017-05-31,34.9062
2017-06-01,35.6764
2017-06-02,35.762
2017-06-05,35.6574
2017-06-06,35.743
2017-06-07,36.342
2017-06-08,37.6637
2017-06-09,38.9854
2017-06-12,38.7477
2017-06-13,38.7572
2017-06-14,38.7572
2017-06-15,38.8428
2017-06-16,38.2723
2017-06-19,38.1391
2017-06-20,37.7113
2017-06-21,37.3119
2017-06-22,36.9696
2017-06-23,36.8079
2017-06-26,36.8079
2017-06-27,36.9506
2017-06-28,37.4165
2017-06-29,38.3008
2017-06-30,37.8919
2017-07-03,38.7002
2017-07-05,38.3008
2017-07-06,37.6732
2017-07-07,38.0821
2017-07-10,37.7683
2017-07-11,37.7873
2017-07-12,37.7588
2017-07-13,37.93
2017-07-14,37.464
2017-07-17,37.4165
2017-07-18,37.2644
2017-07-19,37.3737
2017-07-20,37.3594
2017-07-21,37.2453
2017-07-24,37.3689
2017-07-25,38.2152
2017-07-26,37.6447
2017-07-27,37.445
2017-07-28,36.5132
2017-07-31,37.8824
2017-08-01,37.8539
2017-08-02,37.4735
2017-08-03,36.9696
2017-08-04,37.3785
2017-08-07,37.2829
2017-08-08,37.2542
2017-08-09,36.6804
2017-08-10,35.7338
2017-08-11,35.5904
2017-08-14,36.5466
2017-08-15,36.1163
2017-08-16,36.1832
2017-08-17,34.9975
2017-08-18,35.0549
2017-08-21,34.9497
2017-08-22,35.3226
2017-08-23,35.3609
2017-08-24,35.3513
2017-08-25,35.4947
2017-08-28,35.3609
2017-08-29,35.5999
2017-08-30,35.5234
2017-08-31,35.5425
2017-09-01,36.0589
2017-09-05,34.9784
2017-09-06,35.1601
2017-09-07,34.2899
2017-09-08,34.768
2017-09-11,35.3417
2017-09-12,36.1163
2017-09-13,36.5179
2017-09-14,36.2215
2017-09-15,36.231
2017-09-18,36.7761
2017-09-19,36.9099
2017-09-20,37.694
2017-09-21,37.9522
2017-09-22,38.2678
2017-09-25,38.4303
2017-09-26,38.7459
2017-09-27,40.2567
2017-09-28,40.62
2017-09-29,40.2662
2017-10-02,40.7061
2017-10-03,40.3427
2017-10-04,39.6447
2017-10-05,40.0272
2017-10-06,40.1515
2017-10-09,40.0081
2017-10-10,40.2949
2017-10-11,40.2471
2017-10-12,39.9411
2017-10-13,39.6925
2017-10-16,39.8933
2017-10-17,39.7116
2017-10-18,39.9316
2017-10-19,40.0176
2017-10-20,40.62
2017-10-23,40.0846
2017-10-24,40.4671
2017-10-25,40.2854
2017-10-26,41.4137
2017-10-27,42.1596
2017-10-30,41.3331
2017-10-31,41.8136
2017-11-01,42.4383
2017-11-02,43.1014
2017-11-03,42.4959
2017-11-06,42.4383
2017-11-07,41.4869
2017-11-08,41.6791
2017-11-09,40.891
2017-11-10,40.6219
2017-11-13,41.1313
2017-11-14,41.2754
2017-11-15,41.2082
2017-11-16,41.6022
2017-11-17,41.977
2017-11-20,42.2845
2017-11-21,42.7938
2017-11-22,42.2364
2017-11-24,41.9818
2017-11-27,41.8713
2017-11-28,43.3512
2017-11-29,45.1099
2017-11-30,44.3026
2017-12-01,44.5044
2017-12-04,45.4078
2017-12-05,44.0239
2017-12-06,43.7837
2017-12-07,43.947
2017-12-08,43.2455
2017-12-11,42.8227
2017-12-12,42.8515
2017-12-13,42.3325
2017-12-14,41.6983
2017-12-15,42.7746
2017-12-18,43.5242
2017-12-19,43.2071
2017-12-20,42.8515
2017-12-21,43.38
2017-12-22,43.0149
2017-12-26,42.8995
2017-12-27,42.2461
2017-12-28,42.3229
2017-12-29,41.7463
2018-01-02,41.7463
2018-01-03,41.9001
2018-01-04,41.8809
2018-01-05,42.4863
2018-01-08,42.2076
2018-01-09,42.813
2018-01-10,43.0437
2018-01-11,43.8125
2018-01-12,44.2257
2018-01-16,43.8029
2018-01-17,44.1489
2018-01-18,43.332
2018-01-19,43.8509
2018-01-22,43.9086
2018-01-23,43.9855
2018-01-24,43.4761
2018-01-25,42.3902
2018-01-26,41.9674
2018-01-29,41.1601
2018-01-30,40.9391
2018-01-31,41.4004
2018-02-01,41.9001
2018-02-02,41.7175
2018-02-05,39.7859
2018-02-06,40.1337
2018-02-07,40.723
2018-02-08,39.4284
2018-02-09,40.1144
2018-02-12,40.2496
2018-02-13,40.1916
2018-02-14,40.9742
2018-02-15,40.8293
2018-02-16,41.351
2018-02-20,40.9066
2018-02-21,41.1771
2018-02-22,40.6167
2018-02-23,41.2351
2018-02-26,41.2254
2018-02-27,40.9259
2018-02-28,40.3656
2018-03-01,40.8196
2018-03-02,41.4283
2018-03-05,41.9017
2018-03-06,42.3268
2018-03-07,42.8196
2018-03-08,42.2012
2018-03-09,42.7036
2018-03-12,42.636
2018-03-13,42.4524
2018-03-14,41.8727
2018-03-15,42.2206
2018-03-16,42.6457
2018-03-19,42.7326
2018-03-20,42.6843
2018-03-21,42.7423
2018-03-22,41.6409
2018-03-23,39.8245
2018-03-26,41.0902
2018-03-27,40.2206
2018-03-28,40.5878
2018-03-29,40.5298
2018-04-02,39.9694
2018-04-03,40.5878
2018-04-04,41.1771
2018-04-05,41.5442
2018-04-06,40.5298
2018-04-09,40.2979
2018-04-10,41.8341
2018-04-11,41.8244
2018-04-12,42.3172
2018-04-13,41.7665
2018-04-16,42.1722
2018-04-17,41.8921
2018-04-18,41.7665
2018-04-19,42.2882
2018-04-20,42.4234
2018-04-23,42.8485
2018-04-24,43.1867
2018-04-25,43.264
2018-04-26,41.0612
2018-04-27,39.9598
2018-04-30,38.8487
2018-05-01,39.7472
2018-05-02,39.7762
2018-05-03,39.1675
2018-05-04,39.5926
2018-05-07,39.7955
2018-05-08,40.4372
2018-05-09,40.6608
2018-05-10,40.4761
2018-05-11,40.6706
2018-05-14,40.6317
2018-05-15,41.2345
2018-05-16,41.7109
2018-05-17,42.0707
2018-05-18,41.497
2018-05-21,41.8568
2018-05-22,42.2457
2018-05-23,42.0707
2018-05-24,41.7887
2018-05-25,41.8859
2018-05-29,40.9136
2018-05-30,41.6331
2018-05-31,41.3414
2018-06-01,41.8276
2018-06-04,42.4012
2018-06-05,42.3332
2018-06-06,43.1499
2018-06-07,43.0721
2018-06-08,43.1304
2018-06-11,42.6151
2018-06-12,41.9637
2018-06-13,41.8956
2018-06-14,41.9054
2018-06-15,41.4387
2018-06-18,41.6817
2018-06-19,42.1582
2018-06-20,42.4498
2018-06-21,42.1971
2018-06-22,41.954
2018-06-25,41.3414
2018-06-26,41.2248
2018-06-27,40.165
2018-06-28,40.233
2018-06-29,39.7663
2018-07-02,40.4178
2018-07-03,40.3497
2018-07-05,40.5053
2018-07-06,40.8067
2018-07-09,41.4678
2018-07-10,40.9039
2018-07-11,40.7192
2018-07-12,39.9025
2018-07-13,39.358
2018-07-16,39.8441
2018-07-17,39.9997
2018-07-18,40.5345
2018-07-19,40.7872
2018-07-20,41.0498
2018-07-23,41.5165
2018-07-24,41.1762
2018-07-25,40.3983
2018-07-26,40.865
2018-07-27,40.165
2018-07-30,39.6691
2018-07-31,39.7955
2018-08-01,40.3789
2018-08-02,40.8261
2018-08-03,40.1455
2018-08-06,40.4469
2018-08-07,40.7992
2018-08-08,41.0927
2018-08-09,40.9753
2018-08-10,41.0633
2018-08-13,40.9459
2018-08-14,41.7091
2018-08-15,40.8187
2018-08-16,41.5232
2018-08-17,41.5427
2018-08-20,41.6504
2018-08-21,42.394
2018-08-22,42.1396
2018-08-23,41.621
2018-08-24,41.4351
2018-08-27,41.1612
2018-08-28,40.9068
2018-08-29,40.897
2018-08-30,40.9264
2018-08-31,41.3373
2018-09-04,41.2297
2018-09-05,41.3079
2018-09-06,40.8285
2018-09-07,40.9851
2018-09-10,40.7796
2018-09-11,40.6622
2018-09-12,40.1436
2018-09-13,39.6447
2018-09-14,40.0165
2018-09-17,39.7034
2018-09-18,39.6544
2018-09-19,39.948
2018-09-20,39.9969
2018-09-21,39.586
2018-09-24,38.9304
2018-09-25,38.6076
2018-09-26,37.8738
2018-09-27,37.5313
2018-09-28,37.9325
2018-10-01,37.3259
2018-10-02,37.3454
2018-10-03,38.3238
2018-10-04,38.1771
2018-10-05,37.7955
2018-10-08,38.1477
2018-10-09,37.8346
2018-10-10,37.3063
2018-10-11,36.8073
2018-10-12,35.9561
2018-10-15,36.4551
2018-10-16,36.4159
2018-10-17,36.3572
2018-10-18,35.8778
2018-10-19,35.1734
2018-10-22,34.1461
2018-10-23,34.1559
2018-10-24,32.4632
2018-10-25,34.4885
2018-10-26,35.4767
2018-10-29,36.0833
2018-10-30,36.7095
2018-10-31,36.2888
2018-11-01,36.6214
2018-11-02,36.6899
2018-11-05,36.9443
2018-11-06,36.8064
2018-11-07,36.7177
2018-11-08,37.2694
2018-11-09,37.1807
2018-11-12,37.5354
2018-11-13,37.6832
2018-11-14,36.9837
2018-11-15,38.0576
2018-11-16,38.3925
2018-11-19,38.294
2018-11-20,37.9689
2018-11-21,37.9787
2018-11-23,38.3827
2018-11-26,39.0033
2018-11-27,38.7176
2018-11-28,39.7225
2018-11-29,39.0329
2018-11-30,40.0772
2018-12-03,40.2841
2018-12-04,37.6733
2018-12-06,37.9492
2018-12-07,37.8901
2018-12-10,37.2497
2018-12-11,36.9443
2018-12-12,37.6339
2018-12-13,36.9739
2018-12-14,36.3729
2018-12-17,35.7424
2018-12-18,35.3483
2018-12-19,33.8311
2018-12-20,33.4272
2018-12-21,33.9789
2018-12-24,33.5947
2018-12-26,34.8853
2018-12-27,34.9345
2018-12-28,35.6045
2018-12-31,35.7522
2019-01-02,36.2547
2019-01-03,36.1562
2019-01-04,36.8261
2019-01-07,37.033
2019-01-08,37.23
2019-01-09,37.1118
2019-01-10,36.6684
2019-01-11,36.698
2019-01-14,36.5798
2019-01-15,36.9246
2019-01-16,37.4467
2019-01-17,37.4861
2019-01-18,37.7226
2019-01-22,37.299
2019-01-23,37.9295
2019-01-24,35.8507
2019-01-25,35.7818
2019-01-28,35.6439
2019-01-29,36.2547
2019-01-30,35.9493
2019-01-31,36.2054
2019-02-01,36.5404
2019-02-04,36.7079
2019-02-05,36.5093
2019-02-06,36.3902
2019-02-07,36.5887
2019-02-08,36.0825
2019-02-11,36.4001
2019-02-12,36.5391
2019-02-13,36.6086
2019-02-14,36.2413
2019-02-15,37.0156
2019-02-19,37.2737
2019-02-20,38.167
2019-02-21,38.0777
2019-02-22,38.038
2019-02-25,37.6906
2019-02-26,37.3233
2019-02-27,37.7204
2019-02-28,37.6012
2019-03-01,37.6112
2019-03-04,37.502
2019-03-05,37.3928
2019-03-06,36.3803
2019-03-07,35.1593
2019-03-08,35.2189
2019-03-11,35.4869
2019-03-12,35.2685
2019-03-13,35.2983
2019-03-14,35.2388
2019-03-15,34.9013
2019-03-18,34.802
2019-03-19,33.7994
2019-03-20,32.5586
2019-03-21,32.0623
2019-03-22,30.7123
2019-03-25,30.8414
2019-03-26,31.4866
2019-03-27,31.7744
2019-03-28,32.37
2019-03-29,32.4494
2019-04-01,33.6009
2019-04-02,33.6108
2019-04-03,33.7895
2019-04-04,34.395
2019-04-05,34.7325
2019-04-08,34.5241
2019-04-09,33.5116
2019-04-10,33.9483
2019-04-11,34.1568
2019-04-12,35.0502
2019-04-15,34.3156
2019-04-16,35.1097
2019-04-17,35.1097
2019-04-18,34.5737
2019-04-22,34.0873
2019-04-23,34.4546
2019-04-24,34.6432
2019-04-25,35.7847
2019-04-26,36.4399
2019-04-29,37.363
2019-04-30,37.2637
2019-05-01,36.3803
2019-05-02,36.8667
2019-05-03,37.7601
2019-05-06,37.77
2019-05-07,37.45
2019-05-08,37.1
2019-05-09,37.2
2019-05-10,37.76
2019-05-13,35.79
2019-05-14,36.31
2019-05-15,35.69
2019-05-16,36.09
2019-05-17,35.44
2019-05-20,35.91
2019-05-21,35.94
2019-05-22,35.7
2019-05-23,34.86
2019-05-24,35.28
2019-05-28,34.3
2019-05-29,34.94
2019-05-30,34.12
2019-05-31,33.35
2019-06-03,33.79
2019-06-04,35
2019-06-05,34.59
2019-06-06,34.38
2019-06-07,34.32
2019-06-10,35.01
2019-06-11,35.25
2019-06-12,34.98
2019-06-13,35.12
2019-06-14,35.36
2019-06-17,34.855
2019-06-18,35.555
2019-06-19,35.48
2019-06-20,35.7
2019-06-21,35.4
2019-06-24,35.25
2019-06-25,35.06
2019-06-26,34.89
2019-06-27,35.43
2019-06-28,35.845
2019-07-01,36.49
2019-07-02,35.76
2019-07-03,36.155
2019-07-04,36.155
2019-07-05,36.65
2019-07-08,36.1
2019-07-09,36.28
2019-07-10,35.76
2019-07-11,36.085
2019-07-12,36.56
2019-07-15,35.305
2019-07-16,35.66
2019-07-17,35.29
2019-07-18,35.395
2019-07-19,35.695
2019-07-22,35.085
2019-07-23,35.52
2019-07-24,36.845
2019-07-25,37.09
2019-07-26,37.41
2019-07-29,37.02
2019-07-30,37.555
2019-07-31,37.745
2019-08-01,36.26
2019-08-02,35.625
2019-08-05,34.485
2019-08-06,34.31
2019-08-07,34.08
2019-08-08,34.905
2019-08-09,35
2019-08-12,34.525
2019-08-13,34.65
2019-08-14,33.805
2019-08-15,33.69
2019-08-16,34.495
2019-08-19,34.95
2019-08-20,34.46
2019-08-21,34.9
2019-08-22,34.94
2019-08-23,33.77
2019-08-26,34.09
2019-08-27,33.195
2019-08-28,33.545
2019-08-29,34.125
2019-08-30,34.535
2019-09-02,34.49
2019-09-03,34.02
2019-09-04,34.205
2019-09-05,34.88
2019-09-06,34.59
2019-09-09,35.52
2019-09-10,36.405
2019-09-11,36.9
2019-09-12,37.325
2019-09-13,37.565
2019-09-16,37.475
2019-09-17,37.165
2019-09-18,37.025
2019-09-19,36.78
2019-09-20,37.11
2019-09-23,37
2019-09-24,36.635
2019-09-25,37.51
2019-09-26,36.85
2019-09-27,37.09
2019-09-30,36.905
2019-10-01,36.08
2019-10-02,35.62
2019-10-03,35.555
2019-10-04,36.04
2019-10-07,36.115
2019-10-08,35.225
2019-10-09,35.43
2019-10-10,35.445
2019-10-11,36.155
2019-10-14,36.175
2019-10-15,36.53
2019-10-16,36.78
2019-10-17,36.995
2019-10-18,37.39
2019-10-21,37.98
2019-10-22,38.065
2019-10-23,37.955
2019-10-24,37.865
2019-10-25,38.55
2019-10-28,39.365
2019-10-29,40.02
2019-10-30,40.195
2019-10-31,39.235
2019-11-01,39.97
2019-11-04,40.445
2019-11-05,40.3
2019-11-06,40.185
2019-11-07,40.49
2019-11-08,40.685
2019-11-11,40.55
2019-11-12,40.61
2019-11-13,40.015
2019-11-14,39.875
2019-11-15,39.62
2019-11-18,39.785
2019-11-19,39.9
2019-11-20,39.43
2019-11-21,39.27
2019-11-22,39.25
2019-11-25,39.555
