date,close
2014-06-13,37.0376
2014-06-16,37.0635
2014-06-17,37.0203
2014-06-18,37.3402
2014-06-19,37.5217
2014-06-20,37.4439
2014-06-23,36.8992
2014-06-24,37.1381
2014-06-25,37.1731
2014-06-26,37.1556
2014-06-27,37.2256
2014-06-30,37.2694
2014-07-01,37.6019
2014-07-02,37.6457
2014-07-03,37.7069
2014-07-07,37.4182
2014-07-08,37.0419
2014-07-09,37.1819
2014-07-10,36.7444
2014-07-11,36.7881
2014-07-14,37.0506
2014-07-15,36.9369
2014-07-16,37.2081
2014-07-17,37.0244
2014-07-18,37.0244
2014-07-21,36.8756
2014-07-22,37.0681
2014-07-23,37.1469
2014-07-24,37.2081
2014-07-25,37.0769
2014-07-28,37.0944
2014-07-29,37.0594
2014-07-30,37.0244
2014-07-31,36.3856
2014-08-01,36.1843
2014-08-04,36.3068
2014-08-05,35.8605
2014-08-06,35.7818
2014-08-07,35.4843
2014-08-08,35.7118
2014-08-11,35.7993
2014-08-12,35.7993
2014-08-13,36.0443
2014-08-14,36.2106
2014-08-15,36.1931
2014-08-18,36.3943
2014-08-19,36.4818
2014-08-20,36.3593
2014-08-21,36.4993
2014-08-22,36.3418
2014-08-25,36.7531
2014-08-26,36.5781
2014-08-27,36.6831
2014-08-28,36.5081
2014-08-29,36.4818
2014-09-02,36.5168
2014-09-03,36.7531
2014-09-04,36.5956
2014-09-05,36.5868
2014-09-08,36.2193
2014-09-09,36.0793
2014-09-10,36.2893
2014-09-11,36.088
2014-09-12,36.018
2014-09-15,35.9655
2014-09-16,36.1143
2014-09-17,35.8518
2014-09-18,36.0968
2014-09-19,35.9655
2014-09-22,35.843
2014-09-23,35.5192
2014-09-24,35.7145
2014-09-25,35.2131
2014-09-26,35.3451
2014-09-29,35.0372
2014-09-30,34.9668
2014-10-01,34.5358
2014-10-02,34.1575
2014-10-03,34.2015
2014-10-06,34.395
2014-10-07,33.8408
2014-10-08,34.3599
2014-10-09,33.4362
2014-10-10,32.9348
2014-10-13,32.9172
2014-10-14,32.97
2014-10-15,32.7852
2014-10-16,33.0491
2014-10-17,33.0491
2014-10-20,33.3306
2014-10-21,33.6913
2014-10-22,33.4538
2014-10-23,33.8057
2014-10-24,33.9464
2014-10-27,33.8408
2014-10-28,34.2543
2014-10-29,34.052
2014-10-30,34.4654
2014-10-31,34.8437
2014-11-03,34.5974
2014-11-04,34.3774
2014-11-05,34.3862
2014-11-06,34.2455
2014-11-07,34.2543
2014-11-10,34.4126
2014-11-11,34.615
2014-11-12,34.3247
2014-11-13,34.4654
2014-11-14,34.5182
2014-11-17,34.3686
2014-11-18,34.7381
2014-11-19,34.6237
2014-11-20,34.4478
2014-11-21,34.7381
2014-11-24,34.9052
2014-11-25,34.9844
2014-11-26,35.1252
2014-11-28,34.8437
2014-12-01,34.7865
2014-12-02,34.8833
2014-12-03,34.8349
2014-12-04,34.7821
2014-12-05,34.8525
2014-12-08,34.5446
2014-12-09,34.3511
2014-12-10,33.9024
2014-12-11,33.8672
2014-12-12,33.2427
2014-12-15,32.7325
2014-12-16,32.9788
2014-12-17,33.313
2014-12-18,33.9112
2014-12-19,33.9816
2014-12-22,34.1586
2014-12-23,33.9993
2014-12-24,34.1498
2014-12-26,34.256
2014-12-29,34.0347
2014-12-30,33.7338
2014-12-31,33.5302
2015-01-02,33.362
2015-01-05,32.6184
2015-01-06,32.2555
2015-01-07,32.6007
2015-01-08,33.0964
2015-01-09,32.9371
2015-01-12,32.9017
2015-01-13,33.061
2015-01-14,32.9725
2015-01-15,33.1584
2015-01-16,33.5213
2015-01-20,33.6718
2015-01-21,33.9196
2015-01-22,34.0436
2015-01-23,33.84
2015-01-26,34.2914
2015-01-27,34.318
2015-01-28,33.8665
2015-01-29,34.3268
2015-01-30,33.7692
2015-02-02,34.2117
2015-02-03,34.6986
2015-02-04,34.4507
2015-02-05,34.8137
2015-02-06,34.3976
2015-02-09,34.2383
2015-02-10,34.5304
2015-02-11,34.3445
2015-02-12,34.8756
2015-02-13,35.1235
2015-02-17,35.2031
2015-02-18,35.4421
2015-02-19,35.4598
2015-02-20,35.8139
2015-02-23,35.6723
2015-02-24,35.8847
2015-02-25,35.9201
2015-02-26,35.8227
2015-02-27,35.8493
2015-03-02,35.9024
2015-03-03,35.6988
2015-03-04,35.5395
2015-03-05,35.6546
2015-03-06,35.1766
2015-03-09,35.1943
2015-03-10,34.4596
2015-03-11,34.5481
2015-03-12,34.973
2015-03-13,34.7605
2015-03-16,35.15
2015-03-17,35.1146
2015-03-18,35.8405
2015-03-19,35.4067
2015-03-20,36.168
2015-03-23,36.3361
2015-03-24,36.3007
2015-03-25,36.106
2015-03-26,35.8126
2015-03-27,35.8927
2015-03-30,35.9193
2015-03-31,35.4126
2015-04-01,35.6615
2015-04-02,35.9282
2015-04-06,36.275
2015-04-07,36.275
2015-04-08,36.4439
2015-04-09,36.4972
2015-04-10,36.5684
2015-04-13,36.3728
2015-04-14,36.6484
2015-04-15,36.8173
2015-04-16,36.9062
2015-04-17,36.4617
2015-04-20,36.5239
2015-04-21,36.8351
2015-04-22,36.9151
2015-04-23,37.0752
2015-04-24,37.2796
2015-04-27,37.4219
2015-04-28,37.4841
2015-04-29,37.1552
2015-04-30,36.7818
2015-05-01,37.0929
2015-05-04,37.1285
2015-05-05,36.5684
2015-05-06,36.6484
2015-05-07,36.5239
2015-05-08,37.3152
2015-05-11,36.9862
2015-05-12,36.9862
2015-05-13,37.253
2015-05-14,37.6975
2015-05-15,37.742
2015-05-18,37.6175
2015-05-19,37.4752
2015-05-20,37.5464
2015-05-21,37.7509
2015-05-22,37.5197
2015-05-26,36.8884
2015-05-27,37.1996
2015-05-28,37.1196
2015-05-29,36.764
2015-06-01,36.6751
2015-06-02,36.7995
2015-06-03,37.0129
2015-06-04,36.5862
2015-06-05,36.1861
2015-06-08,36.1505
2015-06-09,35.946
2015-06-10,36.6928
2015-06-11,36.7995
2015-06-12,36.5061
2015-06-15,36.275
2015-06-16,36.2661
2015-06-17,36.1683
2015-06-18,36.515
2015-06-19,36.435
2015-06-22,37.0663
2015-06-23,37.1996
2015-06-24,36.8973
2015-06-25,36.8884
2015-06-26,36.8551
2015-06-29,35.7478
2015-06-30,35.6938
2015-07-01,35.9279
2015-07-02,36.0179
2015-07-06,35.2797
2015-07-07,35.2707
2015-07-08,34.4155
2015-07-09,34.9737
2015-07-10,36.0359
2015-07-13,36.189
2015-07-14,36.441
2015-07-15,36.297
2015-07-16,36.6031
2015-07-17,36.549
2015-07-20,36.6301
2015-07-21,36.531
2015-07-22,36.225
2015-07-23,36.1079
2015-07-24,35.7208
2015-07-27,35.4958
2015-07-28,35.9369
2015-07-29,36.0629
2015-07-30,36.0449
2015-07-31,36.216
2015-08-03,36.1079
2015-08-04,36.1439
2015-08-05,36.333
2015-08-06,36.171
2015-08-07,36.1349
2015-08-10,36.5761
2015-08-11,35.9999
2015-08-12,35.7659
2015-08-13,35.7568
2015-08-14,35.8199
2015-08-17,35.7478
2015-08-18,35.4688
2015-08-19,35.1807
2015-08-20,34.3165
2015-08-21,33.4523
2015-08-24,32.327
2015-08-25,32.6511
2015-08-26,33.4973
2015-08-27,33.9384
2015-08-28,33.8484
2015-08-31,33.5963
2015-09-01,32.498
2015-09-02,33.0022
2015-09-03,33.0472
2015-09-04,32.309
2015-09-08,33.2452
2015-09-09,33.1192
2015-09-10,33.3353
2015-09-11,33.3263
2015-09-14,33.0832
2015-09-15,33.3263
2015-09-16,33.8034
2015-09-17,33.8214
2015-09-18,33.0112
2015-09-21,33.0112
2015-09-22,32.237
2015-09-23,32.0839
2015-09-24,31.9759
2015-09-25,32.2707
2015-09-28,31.6468
2015-09-29,31.5835
2015-09-30,32.2255
2015-10-01,32.3159
2015-10-02,32.8494
2015-10-05,33.5094
2015-10-06,33.5456
2015-10-07,33.9434
2015-10-08,34.2237
2015-10-09,34.2961
2015-10-12,34.2328
2015-10-13,33.8259
2015-10-14,33.8802
2015-10-15,34.504
2015-10-16,34.486
2015-10-19,34.3413
2015-10-20,34.2237
2015-10-21,34.1966
2015-10-22,34.6035
2015-10-23,34.92
2015-10-26,34.7934
2015-10-27,34.486
2015-10-28,34.6758
2015-10-29,34.4227
2015-10-30,34.3955
2015-11-02,34.7301
2015-11-03,34.7301
2015-11-04,34.504
2015-11-05,34.4588
2015-11-06,34.2961
2015-11-09,33.9344
2015-11-10,33.9254
2015-11-11,34.0881
2015-11-12,33.6812
2015-11-13,33.419
2015-11-16,33.8169
2015-11-17,33.8621
2015-11-18,34.1876
2015-11-19,34.3684
2015-11-20,34.2961
2015-11-23,34.0881
2015-11-24,34.1333
2015-11-25,34.1876
2015-11-27,34.1785
2015-11-30,34.1333
2015-12-01,34.504
2015-12-02,34.1424
2015-12-03,33.9796
2015-12-04,34.2237
2015-12-07,33.9434
2015-12-08,33.4281
2015-12-09,33.3557
2015-12-10,33.3467
2015-12-11,32.7499
2015-12-14,32.8222
2015-12-15,32.9488
2015-12-16,33.6179
2015-12-17,33.2291
2015-12-18,32.8765
2015-12-21,33.0866
2015-12-22,33.3323
2015-12-23,33.8781
2015-12-24,33.7871
2015-12-28,33.6871
2015-12-29,34.0418
2015-12-30,33.8326
2015-12-31,33.405
2016-01-04,32.9047
2016-01-05,32.8683
2016-01-06,32.2679
2016-01-07,31.6584
2016-01-08,31.2672
2016-01-11,31.4036
2016-01-12,31.531
2016-01-13,31.058
2016-01-14,31.4218
2016-01-15,30.3302
2016-01-19,30.594
2016-01-20,29.8935
2016-01-21,30.1209
2016-01-22,30.9943
2016-01-25,30.5485
2016-01-26,31.1034
2016-01-27,30.9033
2016-01-28,31.0216
2016-01-29,31.5583
2016-02-01,31.4946
2016-02-02,30.785
2016-02-03,31.058
2016-02-04,31.1216
2016-02-05,30.6577
2016-02-08,30.1027
2016-02-09,29.7752
2016-02-10,29.7116
2016-02-11,29.3204
2016-02-12,29.7843
2016-02-16,30.3575
2016-02-17,30.9033
2016-02-18,30.7577
2016-02-19,30.7032
2016-02-22,31.0761
2016-02-23,30.5576
2016-02-24,30.4666
2016-02-25,30.8305
2016-02-26,30.7214
2016-02-29,30.5849
2016-03-01,31.3764
2016-03-02,31.5947
2016-03-03,31.9313
2016-03-04,32.1769
2016-03-07,32.1496
2016-03-08,31.7948
2016-03-09,31.9313
2016-03-10,31.904
2016-03-11,32.7318
2016-03-14,32.6563
2016-03-15,32.3274
2016-03-16,32.6655
2016-03-17,32.967
2016-03-18,32.9122
2016-03-21,32.8482
2016-03-22,32.8117
2016-03-23,32.4553
2016-03-24,32.2451
2016-03-28,32.4462
2016-03-29,32.8299
2016-03-30,33.0766
2016-03-31,32.7842
2016-04-01,32.4188
2016-04-04,32.3457
2016-04-05,31.7426
2016-04-06,32.2543
2016-04-07,31.7974
2016-04-08,32.4005
2016-04-11,32.4279
2016-04-12,32.9213
2016-04-13,33.4421
2016-04-14,33.4787
2016-04-15,33.3873
2016-04-18,33.6888
2016-04-19,34.2736
2016-04-20,34.2827
2016-04-21,34.0817
2016-04-22,34.0543
2016-04-25,33.9081
2016-04-26,34.036
2016-04-27,34.0909
2016-04-28,33.6523
2016-04-29,33.5426
2016-05-02,33.8259
2016-05-03,33.2594
2016-05-04,32.8573
2016-05-05,32.8299
2016-05-06,32.903
2016-05-09,32.7934
2016-05-10,33.2776
2016-05-11,33.0401
2016-05-12,33.0127
2016-05-13,32.6472
2016-05-16,33.0492
2016-05-17,32.8573
2016-05-18,32.8299
2016-05-19,32.6106
2016-05-20,32.9122
2016-05-23,32.8025
2016-05-24,33.2045
2016-05-25,33.5335
2016-05-26,33.6066
2016-05-27,33.5609
2016-05-31,33.4421
2016-06-01,33.4238
2016-06-02,33.433
2016-06-03,33.698
2016-06-06,33.9264
2016-06-07,34.1822
2016-06-08,34.2919
2016-06-09,33.8624
2016-06-10,32.9487
2016-06-13,32.4662
2016-06-14,32.0123
2016-06-15,32.2253
2016-06-16,32.2346
2016-06-17,32.5403
2016-06-20,33.2998
2016-06-21,33.5592
2016-06-22,33.5036
2016-06-23,34.3836
2016-06-24,31.5677
2016-06-27,30.9563
2016-06-28,31.7807
2016-06-29,32.355
2016-06-30,32.7533
2016-07-01,32.8274
2016-07-05,32.179
2016-07-06,32.1883
2016-07-07,32.0493
2016-07-08,32.4939
2016-07-11,32.9386
2016-07-12,33.4017
2016-07-13,33.3739
2016-07-14,33.6611
2016-07-15,33.4943
2016-07-18,33.5684
2016-07-19,33.2998
2016-07-20,33.5406
2016-07-21,33.4573
2016-07-22,33.4758
2016-07-25,33.4202
2016-07-26,33.5777
2016-07-27,33.7259
2016-07-28,33.7259
2016-07-29,34.1149
2016-08-01,33.9204
2016-08-02,33.7537
2016-08-03,33.624
2016-08-04,33.8185
2016-08-05,33.9389
2016-08-08,34.0501
2016-08-09,34.328
2016-08-10,34.4484
2016-08-11,34.7078
2016-08-12,34.6151
2016-08-15,34.7633
2016-08-16,34.68
2016-08-17,34.68
2016-08-18,34.856
2016-08-19,34.5966
2016-08-22,34.6244
2016-08-23,34.7726
2016-08-24,34.6707
2016-08-25,34.5596
2016-08-26,34.3187
2016-08-29,34.4484
2016-08-30,34.3743
2016-08-31,34.2539
2016-09-01,34.541
2016-09-02,34.893
2016-09-06,35.2265
2016-09-07,35.2265
2016-09-08,35.1524
2016-09-09,34.4113
2016-09-12,34.68
2016-09-13,33.9494
2016-09-14,33.9308
2016-09-15,34.2286
2016-09-16,33.8098
2016-09-19,34.0332
2016-09-20,34.1821
2016-09-21,34.8335
2016-09-22,35.1779
2016-09-23,34.8428
2016-09-26,34.5357
2016-09-27,34.7032
2016-09-28,35.0103
2016-09-29,34.5822
2016-09-30,34.8149
2016-10-03,34.7498
2016-10-04,34.6474
2016-10-05,34.8335
2016-10-06,34.6474
2016-10-07,34.424
2016-10-10,34.5636
2016-10-11,34.0611
2016-10-12,34.0146
2016-10-13,33.9215
2016-10-14,33.9494
2016-10-17,33.8936
2016-10-18,34.2565
2016-10-19,34.3775
2016-10-20,34.3775
2016-10-21,34.3031
2016-10-24,34.2565
2016-10-25,34.2286
2016-10-26,34.0611
2016-10-27,34.0239
2016-10-28,34.0053
2016-10-31,33.9773
2016-11-01,33.8843
2016-11-02,33.633
2016-11-03,33.6144
2016-11-04,33.3352
2016-11-07,33.7912
2016-11-08,33.875
2016-11-09,33.8191
2016-11-10,33.7075
2016-11-11,33.4376
2016-11-14,33.2887
2016-11-15,33.4934
2016-11-16,33.1863
2016-11-17,33.4097
2016-11-18,33.1119
2016-11-21,33.4003
2016-11-22,33.5027
2016-11-23,33.3817
2016-11-25,33.4469
2016-11-28,33.3259
2016-11-29,33.512
2016-11-30,33.4655
2016-12-01,33.3817
2016-12-02,33.4748
2016-12-05,33.7354
2016-12-06,33.968
2016-12-07,34.4147
2016-12-08,34.4427
2016-12-09,34.545
2016-12-12,34.4333
2016-12-13,34.7963
2016-12-14,34.2286
2016-12-15,34.1728
2016-12-16,34.1821
2016-12-19,34.1542
2016-12-20,34.2286
2016-12-21,34.2286
2016-12-22,34.1348
2016-12-23,34.2099
2016-12-27,34.1629
2016-12-28,34.0973
2016-12-29,34.2192
2016-12-30,34.2849
2017-01-03,34.5007
2017-01-04,34.923
2017-01-05,35.2326
2017-01-06,35.0918
2017-01-09,35.0074
2017-01-10,35.0449
2017-01-11,35.2889
2017-01-12,35.317
2017-01-13,35.4484
2017-01-17,35.3546
2017-01-18,35.1951
2017-01-19,35.1294
2017-01-20,35.2983
2017-01-23,35.3733
2017-01-24,35.5235
2017-01-25,35.8706
2017-01-26,35.758
2017-01-27,35.6736
2017-01-30,35.4202
2017-01-31,35.5422
2017-02-01,35.6642
2017-02-02,35.7205
2017-02-03,35.8706
2017-02-06,35.6079
2017-02-07,35.5798
2017-02-08,35.636
2017-02-09,35.7674
2017-02-10,35.8988
2017-02-13,36.0301
2017-02-14,36.0114
2017-02-15,36.1427
2017-02-16,36.2178
2017-02-17,36.0958
2017-02-21,36.2553
2017-02-22,36.2272
2017-02-23,36.2928
2017-02-24,35.9832
2017-02-27,36.002
2017-02-28,35.9175
2017-03-01,36.2647
2017-03-02,36.0395
2017-03-03,36.2178
2017-03-06,36.0958
2017-03-07,36.002
2017-03-08,35.8143
2017-03-09,35.9645
2017-03-10,36.2459
2017-03-13,36.4148
2017-03-14,36.1427
2017-03-15,36.7057
2017-03-16,36.8558
2017-03-17,36.9121
2017-03-20,36.8933
2017-03-21,36.6775
2017-03-22,36.7245
2017-03-23,36.8277
2017-03-24,36.9219
2017-03-27,37.0066
2017-03-28,37.1762
2017-03-29,37.2139
2017-03-30,37.0726
2017-03-31,37.0161
2017-04-03,36.9784
2017-04-04,36.9595
2017-04-05,36.7618
2017-04-06,36.79
2017-04-07,36.7429
2017-04-10,36.7429
2017-04-11,36.8936
2017-04-12,36.8654
2017-04-13,36.6299
2017-04-17,36.9313
2017-04-18,36.7147
2017-04-19,36.5451
2017-04-20,36.8748
2017-04-21,36.8936
2017-04-24,37.7036
2017-04-25,37.9485
2017-04-26,37.8072
2017-04-27,37.8638
2017-04-28,37.8355
2017-05-01,37.9391
2017-05-02,38.1652
2017-05-03,38.0427
2017-05-04,38.3159
2017-05-05,38.702
2017-05-08,38.5231
2017-05-09,38.4571
2017-05-10,38.5137
2017-05-11,38.4383
2017-05-12,38.6078
2017-05-15,38.8339
2017-05-16,39.0317
2017-05-17,38.5607
2017-05-18,38.6361
2017-05-19,39.0788
2017-05-22,39.1824
2017-05-23,39.1447
2017-05-24,39.2295
2017-05-25,39.2201
2017-05-26,39.1165
2017-05-30,39.0505
2017-05-31,39.1259
2017-06-01,39.3896
2017-06-02,39.7664
2017-06-05,39.5968
2017-06-06,39.5026
2017-06-07,39.4744
2017-06-08,39.4179
2017-06-09,39.2766
2017-06-12,39.1541
2017-06-13,39.4932
2017-06-14,39.4461
2017-06-15,39.0223
2017-06-16,39.3708
2017-06-19,39.5121
2017-06-20,39.1434
2017-06-21,39.1072
2017-06-22,39.1835
2017-06-23,39.2692
2017-06-26,39.3454
2017-06-27,39.3359
2017-06-28,39.6884
2017-06-29,39.2883
2017-06-30,39.3645
2017-07-03,39.2883
2017-07-05,39.3073
2017-07-06,39.0691
2017-07-07,39.1358
2017-07-10,39.2025
2017-07-11,39.3264
2017-07-12,39.6789
2017-07-13,39.7932
2017-07-14,40.079
2017-07-17,40.0123
2017-07-18,40.098
2017-07-19,40.2886
2017-07-20,40.4219
2017-07-21,40.3171
2017-07-24,40.2409
2017-07-25,40.2695
2017-07-26,40.5267
2017-07-27,40.3743
2017-07-28,40.4124
2017-07-31,40.4982
2017-08-01,40.7077
2017-08-02,40.7077
2017-08-03,40.6506
2017-08-04,40.7077
2017-08-07,40.7363
2017-08-08,40.5267
2017-08-09,40.4219
2017-08-10,39.8408
2017-08-11,39.8313
2017-08-14,40.1076
2017-08-15,40.0694
2017-08-16,40.3171
2017-08-17,39.8599
2017-08-18,39.9742
2017-08-21,39.9837
2017-08-22,40.1838
2017-08-23,40.2028
2017-08-24,40.1552
2017-08-25,40.3934
2017-08-28,40.3934
2017-08-29,40.2219
2017-08-30,40.1647
2017-08-31,40.5077
2017-09-01,40.5839
2017-09-05,40.2886
2017-09-06,40.5839
2017-09-07,40.9173
2017-09-08,40.9078
2017-09-11,41.2127
2017-09-12,41.2984
2017-09-13,41.1079
2017-09-14,41.2222
2017-09-15,41.2412
2017-09-18,41.3079
2017-09-19,41.508
2017-09-20,41.4018
2017-09-21,41.3348
2017-09-22,41.4305
2017-09-25,41.2487
2017-09-26,41.0957
2017-09-27,41.1531
2017-09-28,41.287
2017-09-29,41.5261
2017-10-02,41.4783
2017-10-03,41.6409
2017-10-04,41.5644
2017-10-05,41.5261
2017-10-06,41.4783
2017-10-09,41.4974
2017-10-10,41.8801
2017-10-11,42.0236
2017-10-12,42.0236
2017-10-13,42.234
2017-10-16,42.1958
2017-10-17,42.1001
2017-10-18,42.1766
2017-10-19,42.1001
2017-10-20,42.0427
2017-10-23,41.9375
2017-10-24,42.0331
2017-10-25,41.861
2017-10-26,41.8131
2017-10-27,41.9757
2017-10-30,42.0714
2017-10-31,42.2627
2017-11-01,42.3584
2017-11-02,42.4445
2017-11-03,42.4062
2017-11-06,42.4827
2017-11-07,42.3393
2017-11-08,42.521
2017-11-09,42.234
2017-11-10,42.1288
2017-11-13,41.9662
2017-11-14,41.9279
2017-11-15,41.727
2017-11-16,42.1288
2017-11-17,41.9662
2017-11-20,42.0427
2017-11-21,42.368
2017-11-22,42.5114
2017-11-24,42.7793
2017-11-27,42.5114
2017-11-28,42.7219
2017-11-29,42.5401
2017-11-30,42.6262
2017-12-01,42.5019
2017-12-04,42.3297
2017-12-05,42.2723
2017-12-06,42.081
2017-12-07,42.2053
2017-12-08,42.4445
2017-12-11,42.5306
2017-12-12,42.5593
2017-12-13,42.741
2017-12-14,42.5401
2017-12-15,42.5114
2017-12-18,42.9897
2017-12-19,42.8558
2017-12-20,42.8271
2017-12-21,42.9638
2017-12-22,43.07
2017-12-26,43.0797
2017-12-27,43.186
2017-12-28,43.3212
2017-12-29,43.3308
2018-01-02,43.7075
2018-01-03,43.978
2018-01-04,44.374
2018-01-05,44.5865
2018-01-08,44.5672
2018-01-09,44.6058
2018-01-10,44.4899
2018-01-11,44.7797
2018-01-12,45.2047
2018-01-16,45.1564
2018-01-17,45.3979
2018-01-18,45.2916
2018-01-19,45.4945
2018-01-22,45.736
2018-01-23,45.8809
2018-01-24,46.0257
2018-01-25,45.8615
2018-01-26,46.2479
2018-01-29,45.8229
2018-01-30,45.4752
2018-01-31,45.3882
2018-02-01,45.5041
2018-02-02,44.5189
2018-02-05,42.703
2018-02-06,43.5337
2018-02-07,42.9445
2018-02-08,41.882
2018-02-09,42.1717
2018-02-12,42.732
2018-02-13,42.5678
2018-02-14,43.4081
2018-02-15,43.6882
2018-02-16,43.8428
2018-02-20,43.3985
2018-02-21,43.2343
2018-02-22,43.4178
2018-02-23,43.8524
2018-02-26,44.2002
2018-02-27,43.524
2018-02-28,43.07
2018-03-01,42.5098
2018-03-02,42.6354
2018-03-05,42.8092
2018-03-06,43.1666
2018-03-07,43.1183
2018-03-08,43.2439
2018-03-09,43.5627
2018-03-12,43.6303
2018-03-13,43.3598
2018-03-14,43.4274
2018-03-15,43.4178
2018-03-16,43.3598
2018-03-19,43.0024
2018-03-20,43.0411
2018-03-21,43.1473
2018-03-22,42.3553
2018-03-23,41.8337
2018-03-26,42.5817
2018-03-27,42.2326
2018-03-28,42.4362
2018-03-29,42.9016
2018-04-02,42.2617
2018-04-03,42.5914
2018-04-04,42.6883
2018-04-05,43.0083
2018-04-06,42.6592
2018-04-09,43.0277
2018-04-10,43.5027
2018-04-11,43.2991
2018-04-12,43.4639
2018-04-13,43.5027
2018-04-16,43.5803
2018-04-17,43.8033
2018-04-18,44.065
2018-04-19,43.8614
2018-04-20,43.6482
2018-04-23,43.5997
2018-04-24,43.4058
2018-04-25,43.3088
2018-04-26,43.6288
2018-04-27,43.6772
2018-04-30,43.4446
2018-05-01,43.4058
2018-05-02,43.3476
2018-05-03,43.4349
2018-05-04,43.5997
2018-05-07,43.59
2018-05-08,43.59
2018-05-09,43.7257
2018-05-10,44.036
2018-05-11,44.1232
2018-05-14,44.2008
2018-05-15,43.8324
2018-05-16,43.9681
2018-05-17,44.0263
2018-05-18,43.8711
2018-05-21,44.1523
2018-05-22,44.1232
2018-05-23,43.7063
2018-05-24,43.5609
2018-05-25,43.3185
2018-05-29,42.4459
2018-05-30,43.0567
2018-05-31,42.8241
2018-06-01,43.144
2018-06-04,43.3379
2018-06-05,43.2894
2018-06-06,43.6578
2018-06-07,43.4058
2018-06-08,43.4833
2018-06-11,43.7645
2018-06-12,43.493
2018-06-13,43.5124
2018-06-14,43.4058
2018-06-15,43.1052
2018-06-18,42.8047
2018-06-19,42.3393
2018-06-20,42.4265
2018-06-21,42.1357
2018-06-22,42.5875
2018-06-25,41.9886
2018-06-26,42.0377
2018-06-27,41.6548
2018-06-28,41.8021
2018-06-29,42.1163
2018-07-02,41.6647
2018-07-03,41.753
2018-07-05,42.0181
2018-07-06,42.3028
2018-07-09,42.6857
2018-07-10,42.7347
2018-07-11,41.9886
2018-07-12,42.3421
2018-07-13,42.4599
2018-07-16,42.4697
2018-07-17,42.5188
2018-07-18,42.5384
2018-07-19,42.3617
2018-07-20,42.6169
2018-07-23,42.5482
2018-07-24,42.8133
2018-07-25,43.1373
2018-07-26,42.9605
2018-07-27,43.0685
2018-07-30,43.0391
2018-07-31,43.0784
2018-08-01,42.9311
2018-08-02,42.6071
2018-08-03,42.666
2018-08-06,42.4599
2018-08-07,42.7249
2018-08-08,42.7151
2018-08-09,42.6366
2018-08-10,41.8316
2018-08-13,41.6254
2018-08-14,41.6843
2018-08-15,41.0462
2018-08-16,41.3309
2018-08-17,41.6058
2018-08-20,41.7825
2018-08-21,42.0574
2018-08-22,42.2635
2018-08-23,41.9494
2018-08-24,42.2635
2018-08-27,42.8427
2018-08-28,42.7446
2018-08-29,42.9802
2018-08-30,42.5973
2018-08-31,42.3322
2018-09-04,41.9101
2018-09-05,41.5959
2018-09-06,41.4487
2018-09-07,41.1149
2018-09-10,41.3407
2018-09-11,41.3996
2018-09-12,41.5763
2018-09-13,41.8414
2018-09-14,41.9297
2018-09-17,41.969
2018-09-18,42.401
2018-09-19,42.5482
2018-09-20,43.0096
2018-09-21,43.0194
2018-09-24,42.8329
2018-09-25,43.0391
2018-09-26,43.0572
2018-09-27,42.939
2018-09-28,42.6335
2018-10-01,42.7419
2018-10-02,42.466
2018-10-03,42.3971
2018-10-04,41.8552
2018-10-05,41.6482
2018-10-08,41.4216
2018-10-09,41.2738
2018-10-10,40.3378
2018-10-11,39.7762
2018-10-12,39.9732
2018-10-15,39.9043
2018-10-16,40.594
2018-10-17,40.3477
2018-10-18,39.7072
2018-10-19,39.9141
2018-10-22,39.7269
2018-10-23,39.323
2018-10-24,38.2391
2018-10-25,38.6628
2018-10-26,38.3377
2018-10-29,38.18
2018-10-30,38.653
2018-10-31,38.9683
2018-11-01,39.4806
2018-11-02,39.589
2018-11-05,39.5693
2018-11-06,39.7762
2018-11-07,40.2688
2018-11-08,39.8649
2018-11-09,39.5791
2018-11-12,38.8993
2018-11-13,39.0471
2018-11-14,39.0865
2018-11-15,39.2146
2018-11-16,39.254
2018-11-19,38.9288
2018-11-20,38.2096
2018-11-21,38.7712
2018-11-23,38.515
2018-11-26,39.0372
2018-11-27,38.919
2018-11-28,39.4905
2018-11-29,39.3033
2018-11-30,39.1653
2018-12-03,39.6875
2018-12-04,38.6825
2018-12-06,38.318
2018-12-07,37.914
2018-12-10,37.5888
2018-12-11,37.6283
2018-12-12,38.2194
2018-12-13,38.1505
2018-12-14,37.6283
2018-12-17,37.3031
2018-12-18,37.3425
2018-12-19,36.9386
2018-12-20,36.8006
2018-12-21,36.0814
2018-12-24,35.6867
2018-12-26,36.5929
2018-12-27,36.6227
2018-12-28,36.8617
2018-12-31,36.9414
2019-01-02,36.8916
2019-01-03,36.5929
2019-01-04,37.718
2019-01-07,37.8375
2019-01-08,38.1064
2019-01-09,38.5743
2019-01-10,38.7337
2019-01-11,38.4947
2019-01-14,38.2955
2019-01-15,38.5345
2019-01-16,38.654
2019-01-17,38.7835
2019-01-18,39.2017
2019-01-22,38.5943
2019-01-23,38.7934
2019-01-24,38.8432
2019-01-25,39.3311
2019-01-28,39.1419
2019-01-29,39.2514
2019-01-30,39.6896
2019-01-31,39.6995
2019-02-01,39.6796
2019-02-04,39.819
2019-02-05,40.1376
2019-02-06,39.8787
2019-02-07,39.3709
2019-02-08,39.2315
2019-02-11,39.1519
2019-02-12,39.6696
2019-02-13,39.6796
2019-02-14,39.6796
2019-02-15,40.2173
2019-02-19,40.4164
2019-02-20,40.5758
2019-02-21,40.4762
2019-02-22,40.6255
2019-02-25,40.755
2019-02-26,40.9243
2019-02-27,40.7948
2019-02-28,40.6255
2019-03-01,40.8745
2019-03-04,40.7152
2019-03-05,40.745
2019-03-06,40.6255
2019-03-07,40.1078
2019-03-08,40.058
2019-03-11,40.4264
2019-03-12,40.4463
2019-03-13,40.745
2019-03-14,40.7052
2019-03-15,41.1134
2019-03-18,41.2528
2019-03-19,41.3624
2019-03-20,41.3225
2019-03-21,41.3624
2019-03-22,40.5658
2019-03-25,40.5658
2019-03-26,40.8147
2019-03-27,40.755
2019-03-28,40.73
2019-03-29,40.87
2019-04-01,41.4
2019-04-02,41.43
2019-04-03,41.75
2019-04-04,41.67
2019-04-05,41.76
2019-04-08,41.79
2019-04-09,41.54
2019-04-10,41.71
2019-04-11,41.63
2019-04-12,41.94
2019-04-15,41.96
2019-04-16,42.03
2019-04-17,42.1
2019-04-18,42.02
2019-04-22,41.98
2019-04-23,42.08
2019-04-24,41.71
2019-04-25,41.68
2019-04-26,41.84
2019-04-29,42
2019-04-30,42.03
2019-05-01,41.75
2019-05-02,41.67
2019-05-03,42.08
2019-05-06,41.68
2019-05-07,40.98
2019-05-08,41.04
2019-05-09,40.74
2019-05-10,41.01
2019-05-13,40.09
2019-05-14,40.47
2019-05-15,40.65
2019-05-16,40.9
2019-05-17,40.67
2019-05-20,40.49
2019-05-21,40.77
2019-05-22,40.61
2019-05-23,40.2
2019-05-24,40.62
2019-05-28,40.27
2019-05-29,40
2019-05-30,40.15
2019-05-31,39.84
2019-06-03,40
2019-06-04,40.52
2019-06-05,40.5
2019-06-06,40.67
2019-06-07,41.15
2019-06-10,41.26
2019-06-11,41.46
2019-06-12,41.13
2019-06-13,41.115
2019-06-14,40.895
2019-06-17,40.44
2019-06-18,40.96
2019-06-19,41.265
2019-06-20,41.65
2019-06-21,41.58
2019-06-24,41.55
2019-06-25,41.37
2019-06-26,41.39
2019-06-27,41.495
2019-06-28,41.635
2019-07-01,41.905
2019-07-02,42.025
2019-07-03,42.275
2019-07-04,42.275
2019-07-05,41.975
2019-07-08,41.715
2019-07-09,41.485
2019-07-10,41.69
2019-07-11,41.675
2019-07-12,41.715
2019-07-15,41.745
2019-07-16,41.625
2019-07-17,41.55
2019-07-18,41.635
2019-07-19,41.575
2019-07-22,41.62
2019-07-23,41.84
2019-07-24,41.855
2019-07-25,41.45
2019-07-26,41.555
2019-07-29,41.555
2019-07-30,41.09
2019-07-31,40.84
2019-08-01,40.675
2019-08-02,40.39
2019-08-05,39.34
2019-08-06,39.59
2019-08-07,39.795
2019-08-08,40.17
2019-08-09,39.935
2019-08-12,39.53
2019-08-13,39.92
2019-08-14,38.9
2019-08-15,38.98
2019-08-16,39.435
2019-08-19,39.675
2019-08-20,39.535
2019-08-21,39.89
2019-08-22,39.78
2019-08-23,39.22
2019-08-26,39.555
2019-08-27,39.61
2019-08-28,39.58
2019-08-29,39.89
2019-08-30,40.105
2019-09-02,40.095
2019-09-03,39.945
2019-09-04,40.485
2019-09-05,40.8
2019-09-06,40.9
2019-09-09,40.99
2019-09-10,41.075
2019-09-11,41.34
2019-09-12,41.585
2019-09-13,41.775
2019-09-16,41.475
2019-09-17,41.625
2019-09-18,41.54
2019-09-19,41.685
2019-09-20,41.605
2019-09-23,41.515
2019-09-24,41.115
2019-09-25,41.03
2019-09-26,41.105
2019-09-27,40.925
2019-09-30,41.055
2019-10-01,40.705
2019-10-02,39.92
2019-10-03,40.115
2019-10-04,40.495
2019-10-07,40.445
2019-10-08,40.04
2019-10-09,40.395
2019-10-10,40.615
2019-10-11,41.375
2019-10-14,41.17
2019-10-15,41.7
2019-10-16,41.685
2019-10-17,41.75
2019-10-18,41.745
2019-10-21,41.975
2019-10-22,41.91
2019-10-23,42.07
2019-10-24,42.17
2019-10-25,42.195
2019-10-28,42.37
2019-10-29,42.335
2019-10-30,42.48
2019-10-31,42.34
2019-11-01,42.775
2019-11-04,43
2019-11-05,42.985
2019-11-06,42.965
2019-11-07,43.13
2019-11-08,43.045
2019-11-11,43
2019-11-12,43.01
2019-11-13,42.89
2019-11-14,42.835
2019-11-15,43.115
2019-11-18,43.165
2019-11-19,43.09
2019-11-20,42.815
2019-11-21,42.755
2019-11-22,42.825
2019-11-25,43.165
