date,close
2014-06-13,30.9697
2014-06-16,30.9525
2014-06-17,31.0042
2014-06-18,31.3318
2014-06-19,31.4008
2014-06-20,31.0904
2014-06-23,30.8318
2014-06-24,30.1765
2014-06-25,30.6762
2014-06-26,30.5188
2014-06-27,30.4488
2014-06-30,30.3963
2014-07-01,30.8161
2014-07-02,30.9385
2014-07-03,31.0609
2014-07-07,30.2914
2014-07-08,29.6093
2014-07-09,29.8716
2014-07-10,29.312
2014-07-11,29.4519
2014-07-14,29.3645
2014-07-15,28.9972
2014-07-16,29.7317
2014-07-17,28.8048
2014-07-18,29.3645
2014-07-21,28.8748
2014-07-22,29.2071
2014-07-23,29.2945
2014-07-24,29.8367
2014-07-25,29.6793
2014-07-28,29.5219
2014-07-29,29.3994
2014-07-30,29.2945
2014-07-31,28.5774
2014-08-01,28.7349
2014-08-04,28.7349
2014-08-05,27.5281
2014-08-06,27.2133
2014-08-07,26.4612
2014-08-08,26.9859
2014-08-11,26.916
2014-08-12,27.0034
2014-08-13,27.0734
2014-08-14,27.0384
2014-08-15,26.9684
2014-08-18,27.3357
2014-08-19,27.1783
2014-08-20,27.0559
2014-08-21,27.5806
2014-08-22,27.4931
2014-08-25,27.9828
2014-08-26,28.1752
2014-08-27,28.3851
2014-08-28,27.9129
2014-08-29,27.9303
2014-09-02,27.9303
2014-09-03,28.3676
2014-09-04,28.6649
2014-09-05,28.8223
2014-09-08,28.455
2014-09-09,28.4026
2014-09-10,28.4026
2014-09-11,28.3851
2014-09-12,28.2626
2014-09-15,28.0877
2014-09-16,28.1577
2014-09-17,28.3326
2014-09-18,28.2626
2014-09-19,27.8604
2014-09-22,27.668
2014-09-23,27.3007
2014-09-24,27.5806
2014-09-25,27.0559
2014-09-26,27.633
2014-09-29,27.2658
2014-09-30,27.4406
2014-10-01,27.0734
2014-10-02,26.4088
2014-10-03,26.4088
2014-10-06,26.4612
2014-10-07,25.8316
2014-10-08,26.4438
2014-10-09,25.3769
2014-10-10,25.1845
2014-10-13,25.0621
2014-10-14,25.1146
2014-10-15,24.6773
2014-10-16,24.1876
2014-10-17,24.8173
2014-10-20,24.8697
2014-10-21,25.4119
2014-10-22,25.1496
2014-10-23,25.5868
2014-10-24,25.9715
2014-10-27,25.272
2014-10-28,26.0065
2014-10-29,25.4294
2014-10-30,24.6599
2014-10-31,26.059
2014-11-03,25.3944
2014-11-04,25.0621
2014-11-05,25.3419
2014-11-06,25.0971
2014-11-07,24.9747
2014-11-10,25.0796
2014-11-11,25.237
2014-11-12,24.5549
2014-11-13,24.6599
2014-11-14,24.9572
2014-11-17,25.202
2014-11-18,25.5343
2014-11-19,25.5343
2014-11-20,25.202
2014-11-21,25.8666
2014-11-24,26.1464
2014-11-25,26.2164
2014-11-26,26.1989
2014-11-28,26.024
2014-12-01,25.7704
2014-12-02,25.7792
2014-12-03,25.8316
2014-12-04,25.3944
2014-12-05,25.9016
2014-12-08,25.6917
2014-12-09,25.3244
2014-12-10,24.8347
2014-12-11,24.6249
2014-12-12,24.0302
2014-12-15,23.558
2014-12-16,24.0127
2014-12-17,24.2517
2014-12-18,24.5864
2014-12-19,24.4279
2014-12-22,24.4983
2014-12-23,24.604
2014-12-24,24.7449
2014-12-26,24.7625
2014-12-29,24.3398
2014-12-30,24.1461
2014-12-31,23.9523
2015-01-02,24.0052
2015-01-05,22.7899
2015-01-06,22.5434
2015-01-07,22.7723
2015-01-08,23.0717
2015-01-09,22.649
2015-01-12,22.6667
2015-01-13,22.8428
2015-01-14,22.8428
2015-01-15,22.8252
2015-01-16,23.4416
2015-01-20,23.8995
2015-01-21,24.3222
2015-01-22,24.6216
2015-01-23,24.0052
2015-01-26,24.5511
2015-01-27,24.5864
2015-01-28,23.8291
2015-01-29,24.5688
2015-01-30,24.1461
2015-02-02,24.4103
2015-02-03,25.3085
2015-02-04,24.6392
2015-02-05,24.9914
2015-02-06,24.3926
2015-02-09,24.1108
2015-02-10,24.604
2015-02-11,24.4103
2015-02-12,25.3437
2015-02-13,25.4317
2015-02-17,25.6783
2015-02-18,25.9425
2015-02-19,25.8544
2015-02-20,26.5061
2015-02-23,26.2067
2015-02-24,26.3828
2015-02-25,26.1891
2015-02-26,26.0658
2015-02-27,26.2067
2015-03-02,26.2947
2015-03-03,25.9249
2015-03-04,25.7488
2015-03-05,25.8544
2015-03-06,25.2909
2015-03-09,25.6431
2015-03-10,24.9914
2015-03-11,25.238
2015-03-12,25.4317
2015-03-13,25.0795
2015-03-16,25.4141
2015-03-17,25.3085
2015-03-18,25.5198
2015-03-19,25.3085
2015-03-20,26.1186
2015-03-23,26.3476
2015-03-24,26.5589
2015-03-25,26.4885
2015-03-26,26.1715
2015-03-27,26.2419
2015-03-30,26.3828
2015-03-31,26.0658
2015-04-01,26.4004
2015-04-02,26.5941
2015-04-06,26.9288
2015-04-07,26.8231
2015-04-08,26.7703
2015-04-09,26.6998
2015-04-10,26.5765
2015-04-13,26.4004
2015-04-14,26.5941
2015-04-15,26.8583
2015-04-16,26.6294
2015-04-17,26.1538
2015-04-20,26.2067
2015-04-21,26.2595
2015-04-22,26.3123
2015-04-23,26.4885
2015-04-24,26.735
2015-04-27,27.0697
2015-04-28,27.1401
2015-04-29,26.8231
2015-04-30,26.8935
2015-05-01,27.2986
2015-05-04,27.1753
2015-05-05,26.4885
2015-05-06,26.8407
2015-05-07,26.8583
2015-05-08,27.5276
2015-05-11,27.2458
2015-05-12,27.2282
2015-05-13,27.5452
2015-05-14,28.1264
2015-05-15,28.2673
2015-05-18,27.9855
2015-05-19,27.9503
2015-05-20,27.9503
2015-05-21,28.0383
2015-05-22,27.7918
2015-05-26,26.9816
2015-05-27,27.5628
2015-05-28,27.6509
2015-05-29,27.4043
2015-06-01,27.2986
2015-06-02,27.8094
2015-06-03,28.1088
2015-06-04,27.6332
2015-06-05,26.9816
2015-06-08,26.9112
2015-06-09,26.8935
2015-06-10,27.7565
2015-06-11,27.8446
2015-06-12,27.3867
2015-06-15,26.8759
2015-06-16,26.8055
2015-06-17,26.6822
2015-06-18,27.2458
2015-06-19,27.3162
2015-06-22,28.3025
2015-06-23,28.1968
2015-06-24,27.8094
2015-06-25,28.0709
2015-06-26,28.286
2015-06-29,26.6907
2015-06-30,26.6907
2015-07-01,27.0492
2015-07-02,26.852
2015-07-06,25.3821
2015-07-07,25.2029
2015-07-08,25.2208
2015-07-09,25.9916
2015-07-10,27.4256
2015-07-13,27.1746
2015-07-14,27.2643
2015-07-15,27.3539
2015-07-16,27.7303
2015-07-17,27.6407
2015-07-20,27.8916
2015-07-21,27.8199
2015-07-22,27.7482
2015-07-23,27.7303
2015-07-24,27.5152
2015-07-27,26.9595
2015-07-28,27.7124
2015-07-29,27.4794
2015-07-30,27.4435
2015-07-31,27.7482
2015-08-03,27.7482
2015-08-04,27.4794
2015-08-05,27.802
2015-08-06,27.8199
2015-08-07,27.9633
2015-08-10,28.4652
2015-08-11,28.2143
2015-08-12,28.053
2015-08-13,28.0171
2015-08-14,27.9633
2015-08-17,27.9813
2015-08-18,27.6945
2015-08-19,27.5511
2015-08-20,26.6907
2015-08-21,26.2067
2015-08-24,25.3283
2015-08-25,25.7765
2015-08-26,26.601
2015-08-27,26.9058
2015-08-28,26.6369
2015-08-31,26.5293
2015-09-01,25.8482
2015-09-02,26.2246
2015-09-03,26.3142
2015-09-04,25.6689
2015-09-08,26.5652
2015-09-09,26.2246
2015-09-10,26.7086
2015-09-11,26.6727
2015-09-14,26.2604
2015-09-15,26.6548
2015-09-16,26.852
2015-09-17,27.1209
2015-09-18,26.0991
2015-09-21,26.1529
2015-09-22,25.4359
2015-09-23,25.2746
2015-09-24,25.2208
2015-09-25,25.4359
2015-09-28,24.8802
2015-09-29,25.0595
2015-09-30,25.6689
2015-10-01,25.5793
2015-10-02,26.2963
2015-10-05,26.6727
2015-10-06,26.7982
2015-10-07,26.9237
2015-10-08,27.1567
2015-10-09,27.3001
2015-10-12,26.9595
2015-10-13,26.9595
2015-10-14,27.0671
2015-10-15,27.5152
2015-10-16,27.3718
2015-10-19,27.3718
2015-10-20,27.2105
2015-10-21,27.0133
2015-10-22,27.2284
2015-10-23,27.085
2015-10-26,26.9237
2015-10-27,26.619
2015-10-28,26.852
2015-10-29,26.5831
2015-10-30,26.5472
2015-11-02,26.7982
2015-11-03,26.6369
2015-11-04,26.117
2015-11-05,26.0095
2015-11-06,26.1708
2015-11-09,25.7585
2015-11-10,25.9019
2015-11-11,25.7765
2015-11-12,25.167
2015-11-13,25.1312
2015-11-16,25.3642
2015-11-17,25.3104
2015-11-18,25.4
2015-11-19,25.4538
2015-11-20,25.2029
2015-11-23,25.3283
2015-11-24,25.1849
2015-11-25,25.4717
2015-11-27,25.7585
2015-11-30,25.7944
2015-12-01,25.8482
2015-12-02,25.4538
2015-12-03,25.651
2015-12-04,26.0274
2015-12-07,25.6689
2015-12-08,25.1491
2015-12-09,25.2387
2015-12-10,25.0774
2015-12-11,24.6113
2015-12-14,24.5396
2015-12-15,24.8981
2015-12-16,25.2029
2015-12-17,24.8623
2015-12-18,24.5755
2015-12-21,24.8123
2015-12-22,24.9921
2015-12-23,25.3697
2015-12-24,25.3337
2015-12-28,25.2977
2015-12-29,25.4775
2015-12-30,25.1
2015-12-31,24.7044
2016-01-04,24.3448
2016-01-05,24.2729
2016-01-06,23.6256
2016-01-07,23.3739
2016-01-08,23.1941
2016-01-11,23.1401
2016-01-12,23.3739
2016-01-13,23.0503
2016-01-14,23.302
2016-01-15,22.367
2016-01-19,21.9715
2016-01-20,21.1803
2016-01-21,21.7917
2016-01-22,22.1333
2016-01-25,21.5399
2016-01-26,22.0254
2016-01-27,21.6658
2016-01-28,21.3961
2016-01-29,21.7018
2016-02-01,21.6298
2016-02-02,20.8028
2016-02-03,20.8927
2016-02-04,21.1444
2016-02-05,20.587
2016-02-08,19.8498
2016-02-09,19.3823
2016-02-10,19.9397
2016-02-11,19.3464
2016-02-12,19.9038
2016-02-16,20.3892
2016-02-17,20.7308
2016-02-18,20.2454
2016-02-19,20.0656
2016-02-22,20.6409
2016-02-23,20.1375
2016-02-24,20.0296
2016-02-25,20.2993
2016-02-26,20.3533
2016-02-29,20.2813
2016-03-01,21.0005
2016-03-02,21.1803
2016-03-03,21.6119
2016-03-04,21.486
2016-03-07,21.2882
2016-03-08,21.2343
2016-03-09,21.3601
2016-03-10,21.6838
2016-03-11,22.7446
2016-03-14,22.5109
2016-03-15,22.3131
2016-03-16,22.5288
2016-03-17,22.5288
2016-03-18,22.403
2016-03-21,22.5109
2016-03-22,22.4389
2016-03-23,21.9355
2016-03-24,21.7557
2016-03-28,21.8816
2016-03-29,22.0074
2016-03-30,22.2412
2016-03-31,21.9355
2016-04-01,21.6478
2016-04-04,21.3601
2016-04-05,20.6949
2016-04-06,21.0365
2016-04-07,20.2813
2016-04-08,21.1444
2016-04-11,21.4141
2016-04-12,21.2343
2016-04-13,21.7737
2016-04-14,21.8636
2016-04-15,21.8816
2016-04-18,22.2232
2016-04-19,22.385
2016-04-20,22.5288
2016-04-21,22.5288
2016-04-22,22.4929
2016-04-25,22.2052
2016-04-26,22.6367
2016-04-27,22.7086
2016-04-28,22.7626
2016-04-29,22.8525
2016-05-02,22.7266
2016-05-03,22.1153
2016-05-04,22.0254
2016-05-05,21.8276
2016-05-06,21.8276
2016-05-09,21.5579
2016-05-10,21.8636
2016-05-11,21.6298
2016-05-12,21.6119
2016-05-13,21.3242
2016-05-16,21.5399
2016-05-17,21.1264
2016-05-18,21.1803
2016-05-19,21.1444
2016-05-20,21.2882
2016-05-23,21.1803
2016-05-24,21.7197
2016-05-25,22.0973
2016-05-26,22.1333
2016-05-27,22.0254
2016-05-31,21.8456
2016-06-01,21.7197
2016-06-02,21.6658
2016-06-03,21.6658
2016-06-06,21.8096
2016-06-07,22.1153
2016-06-08,22.2591
2016-06-09,21.8995
2016-06-10,20.9466
2016-06-13,20.3892
2016-06-14,20.0296
2016-06-15,20.2094
2016-06-16,20.2813
2016-06-17,20.9646
2016-06-20,21.468
2016-06-21,21.5578
2016-06-22,21.4284
2016-06-23,22.5007
2016-06-24,19.1358
2016-06-27,18.5996
2016-06-28,19.2282
2016-06-29,19.5425
2016-06-30,20.0602
2016-07-01,20.0048
2016-07-05,19.2097
2016-07-06,19.0433
2016-07-07,18.6921
2016-07-08,19.5056
2016-07-11,19.672
2016-07-12,20.356
2016-07-13,20.2451
2016-07-14,20.4855
2016-07-15,20.4485
2016-07-18,20.393
2016-07-19,20.2266
2016-07-20,20.3006
2016-07-21,20.2636
2016-07-22,20.2451
2016-07-25,20.0972
2016-07-26,20.1896
2016-07-27,20.393
2016-07-28,20.2821
2016-07-29,20.6888
2016-08-01,20.2266
2016-08-02,19.8938
2016-08-03,19.8753
2016-08-04,19.9123
2016-08-05,20.2266
2016-08-08,20.356
2016-08-09,20.504
2016-08-10,20.6704
2016-08-11,20.7813
2016-08-12,20.8552
2016-08-15,20.9477
2016-08-16,20.7998
2016-08-17,20.7073
2016-08-18,20.8737
2016-08-19,20.4485
2016-08-22,20.504
2016-08-23,20.8367
2016-08-24,20.8552
2016-08-25,20.7628
2016-08-26,20.6888
2016-08-29,20.6704
2016-08-30,20.7443
2016-08-31,20.8737
2016-09-01,21.0216
2016-09-02,21.2065
2016-09-06,21.262
2016-09-07,21.4099
2016-09-08,21.6503
2016-09-09,21.0956
2016-09-12,21.1695
2016-09-13,20.5594
2016-09-14,20.504
2016-09-15,20.6334
2016-09-16,19.9678
2016-09-19,20.1896
2016-09-20,20.0048
2016-09-21,20.43
2016-09-22,20.6334
2016-09-23,20.3745
2016-09-26,20.1342
2016-09-27,20.0417
2016-09-28,20.3006
2016-09-29,19.9863
2016-09-30,20.3745
2016-10-03,20.2266
2016-10-04,20.0602
2016-10-05,20.4115
2016-10-06,20.3745
2016-10-07,20.3191
2016-10-10,20.467
2016-10-11,20.1342
2016-10-12,20.0787
2016-10-13,19.9308
2016-10-14,20.0972
2016-10-17,20.2266
2016-10-18,20.5964
2016-10-19,20.6888
2016-10-20,20.7443
2016-10-21,20.7258
2016-10-24,20.8552
2016-10-25,20.7998
2016-10-26,20.8367
2016-10-27,20.9662
2016-10-28,20.9292
2016-10-31,20.8552
2016-11-01,20.6519
2016-11-02,20.3191
2016-11-03,20.2451
2016-11-04,20.0048
2016-11-07,20.5687
2016-11-08,20.6334
2016-11-09,20.467
2016-11-10,20.4947
2016-11-11,20.4208
2016-11-14,20.051
2016-11-15,20.1157
2016-11-16,19.8014
2016-11-17,19.7829
2016-11-18,19.2929
2016-11-21,19.4963
2016-11-22,19.7367
2016-11-23,19.6627
2016-11-25,19.6812
2016-11-28,19.2745
2016-11-29,19.7644
2016-11-30,20.1064
2016-12-01,20.3191
2016-12-02,20.4577
2016-12-05,20.6241
2016-12-06,21.4931
2016-12-07,21.9923
2016-12-08,21.9276
2016-12-09,21.715
2016-12-12,21.8074
2016-12-13,22.3158
2016-12-14,21.8629
2016-12-15,22.0662
2016-12-16,22.094
2016-12-19,21.9923
2016-12-20,22.2326
2016-12-21,22.355
2016-12-22,22.243
2016-12-23,22.5322
2016-12-27,22.6162
2016-12-28,22.2803
2016-12-29,22.4856
2016-12-30,22.5882
2017-01-03,22.8495
2017-01-04,23.0081
2017-01-05,23.232
2017-01-06,23.1853
2017-01-09,22.8028
2017-01-10,22.8121
2017-01-11,22.9428
2017-01-12,22.8028
2017-01-13,22.9054
2017-01-17,22.8961
2017-01-18,22.8401
2017-01-19,22.9054
2017-01-20,23.0361
2017-01-23,23.0081
2017-01-24,23.2133
2017-01-25,23.1853
2017-01-26,22.8028
2017-01-27,22.7375
2017-01-30,22.159
2017-01-31,22.1497
2017-02-01,22.1404
2017-02-02,22.3829
2017-02-03,22.6722
2017-02-06,22.0657
2017-02-07,21.9258
2017-02-08,22.0564
2017-02-09,22.2057
2017-02-10,22.0844
2017-02-13,22.2243
2017-02-14,22.3363
2017-02-15,22.2337
2017-02-16,22.355
2017-02-17,22.1777
2017-02-21,22.1404
2017-02-22,21.9071
2017-02-23,21.8791
2017-02-24,21.6459
2017-02-27,22.0844
2017-02-28,22.0657
2017-03-01,22.4203
2017-03-02,22.3923
2017-03-03,22.8868
2017-03-06,22.6908
2017-03-07,22.5882
2017-03-08,22.4296
2017-03-09,22.8215
2017-03-10,23.0267
2017-03-13,23.12
2017-03-14,22.7935
2017-03-15,23.2693
2017-03-16,23.8105
2017-03-17,23.6985
2017-03-20,23.5388
2017-03-21,23.5399
2017-03-22,23.6985
2017-03-23,23.8105
2017-03-24,23.8944
2017-03-27,24.025
2017-03-28,24.1743
2017-03-29,24.0344
2017-03-30,23.9224
2017-03-31,24.0157
2017-04-03,23.8011
2017-04-04,23.8011
2017-04-05,23.6239
2017-04-06,23.7545
2017-04-07,23.6798
2017-04-10,23.4652
2017-04-11,23.5399
2017-04-12,23.4186
2017-04-13,23.092
2017-04-17,23.2506
2017-04-18,23.0081
2017-04-19,23.2227
2017-04-20,23.3813
2017-04-21,23.3066
2017-04-24,24.7621
2017-04-25,25.0234
2017-04-26,24.8741
2017-04-27,24.7061
2017-04-28,24.6782
2017-05-01,24.7901
2017-05-02,24.9207
2017-05-03,24.8741
2017-05-04,25.5738
2017-05-05,26.199
2017-05-08,25.8537
2017-05-09,25.7231
2017-05-10,25.7978
2017-05-11,25.8164
2017-05-12,26.031
2017-05-15,26.2363
2017-05-16,26.6002
2017-05-17,26.0217
2017-05-18,26.1803
2017-05-19,26.6095
2017-05-22,26.7681
2017-05-23,26.7588
2017-05-24,26.7028
2017-05-25,26.5722
2017-05-26,26.4415
2017-05-30,25.9564
2017-05-31,26.003
2017-06-01,26.3482
2017-06-02,26.4509
2017-06-05,26.087
2017-06-06,26.1523
2017-06-07,26.1337
2017-06-08,26.4509
2017-06-09,26.3389
2017-06-12,26.2176
2017-06-13,26.4322
2017-06-14,26.3576
2017-06-15,26.0777
2017-06-16,26.3296
2017-06-19,26.3016
2017-06-20,25.9669
2017-06-21,26.2423
2017-06-22,26.1094
2017-06-23,26.1379
2017-06-26,26.3088
2017-06-27,26.2518
2017-06-28,26.8217
2017-06-29,26.4038
2017-06-30,26.4038
2017-07-03,26.6412
2017-07-05,26.4893
2017-07-06,26.6887
2017-07-07,26.7362
2017-07-10,26.8787
2017-07-11,27.0876
2017-07-12,27.2681
2017-07-13,27.3536
2017-07-14,27.534
2017-07-17,27.4676
2017-07-18,27.553
2017-07-19,27.667
2017-07-20,27.8
2017-07-21,27.6385
2017-07-24,27.781
2017-07-25,27.876
2017-07-26,28.0849
2017-07-27,28.0754
2017-07-28,28.0754
2017-07-31,28.2654
2017-08-01,28.3888
2017-08-02,28.5028
2017-08-03,28.7213
2017-08-04,28.7687
2017-08-07,28.8257
2017-08-08,28.5883
2017-08-09,28.6168
2017-08-10,28.2369
2017-08-11,28.0564
2017-08-14,28.3888
2017-08-15,28.4553
2017-08-16,28.5883
2017-08-17,28.1989
2017-08-18,28.4268
2017-08-21,28.5123
2017-08-22,28.4268
2017-08-23,28.4933
2017-08-24,28.5503
2017-08-25,28.8162
2017-08-28,28.9302
2017-08-29,28.7213
2017-08-30,28.5503
2017-08-31,28.7687
2017-09-01,28.9017
2017-09-05,28.7023
2017-09-06,29.0537
2017-09-07,29.1392
2017-09-08,29.1107
2017-09-11,29.4526
2017-09-12,29.5571
2017-09-13,29.3291
2017-09-14,29.4336
2017-09-15,29.5096
2017-09-18,29.69
2017-09-19,29.9085
2017-09-20,29.804
2017-09-21,29.8515
2017-09-22,29.9275
2017-09-25,29.5571
2017-09-26,29.4621
2017-09-27,29.5381
2017-09-28,29.5381
2017-09-29,29.785
2017-10-02,29.709
2017-10-03,29.7185
2017-10-04,29.2436
2017-10-05,29.3196
2017-10-06,29.2246
2017-10-09,29.1961
2017-10-10,29.5001
2017-10-11,29.728
2017-10-12,29.4336
2017-10-13,29.4241
2017-10-16,29.3671
2017-10-17,29.1582
2017-10-18,29.2911
2017-10-19,29.2056
2017-10-20,29.2151
2017-10-23,29.0632
2017-10-24,29.5001
2017-10-25,29.3956
2017-10-26,29.3956
2017-10-27,29.0727
2017-10-30,29.2911
2017-10-31,29.4051
2017-11-01,29.5666
2017-11-02,29.8515
2017-11-03,29.652
2017-11-06,29.652
2017-11-07,29.5286
2017-11-08,29.3956
2017-11-09,29.2721
2017-11-10,29.2341
2017-11-13,29.0442
2017-11-14,29.0917
2017-11-15,28.9112
2017-11-16,28.9682
2017-11-17,28.8257
2017-11-20,28.7877
2017-11-21,29.0442
2017-11-22,29.2341
2017-11-24,29.5856
2017-11-27,29.2626
2017-11-28,29.3291
2017-11-29,29.2816
2017-11-30,29.4526
2017-12-01,29.3101
2017-12-04,29.2911
2017-12-05,29.3196
2017-12-06,29.2246
2017-12-07,29.3956
2017-12-08,29.7755
2017-12-11,29.766
2017-12-12,29.614
2017-12-13,29.3386
2017-12-14,28.9587
2017-12-15,28.8447
2017-12-18,29.2911
2017-12-19,29.4325
2017-12-20,29.3269
2017-12-21,29.4325
2017-12-22,29.5094
2017-12-26,29.567
2017-12-27,29.4517
2017-12-28,29.4613
2017-12-29,29.2309
2018-01-02,29.4133
2018-01-03,29.4229
2018-01-04,30.2776
2018-01-05,30.5849
2018-01-08,30.5273
2018-01-09,30.6713
2018-01-10,30.8153
2018-01-11,31.2667
2018-01-12,31.766
2018-01-16,31.8428
2018-01-17,32.0829
2018-01-18,32.1501
2018-01-19,32.3614
2018-01-22,32.6687
2018-01-23,32.6399
2018-01-24,32.5726
2018-01-25,32.7263
2018-01-26,33.072
2018-01-29,32.7455
2018-01-30,32.3038
2018-01-31,32.4382
2018-02-01,32.8127
2018-02-02,31.8812
2018-02-05,30.4504
2018-02-06,31.574
2018-02-07,31.1514
2018-02-08,30.2392
2018-02-09,30.4408
2018-02-12,30.6809
2018-02-13,30.4696
2018-02-14,31.2955
2018-02-15,31.3819
2018-02-16,31.5163
2018-02-20,30.9786
2018-02-21,30.7193
2018-02-22,30.6521
2018-02-23,31.1514
2018-02-26,31.2379
2018-02-27,30.6905
2018-02-28,30.4504
2018-03-01,30.3352
2018-03-02,30.2584
2018-03-05,30.172
2018-03-06,30.7961
2018-03-07,31.0842
2018-03-08,31.1802
2018-03-09,31.2667
2018-03-12,31.2667
2018-03-13,31.1514
2018-03-14,30.9786
2018-03-15,31.1514
2018-03-16,31.2667
2018-03-19,31.1322
2018-03-20,31.0362
2018-03-21,31.1418
2018-03-22,30.3736
2018-03-23,30.3544
2018-03-26,30.7481
2018-03-27,30.2392
2018-03-28,30.6809
2018-03-29,30.873
2018-04-02,30.412
2018-04-03,30.9018
2018-04-04,31.0266
2018-04-05,31.3531
2018-04-06,31.2763
2018-04-09,31.6316
2018-04-10,31.9965
2018-04-11,31.718
2018-04-12,32.0157
2018-04-13,32.1117
2018-04-16,32.2654
2018-04-17,32.6111
2018-04-18,32.7935
2018-04-19,32.7743
2018-04-20,32.6399
2018-04-23,32.7839
2018-04-24,32.6591
2018-04-25,32.4478
2018-04-26,32.5823
2018-04-27,32.3806
2018-04-30,32.2366
2018-05-01,32.0925
2018-05-02,32.3518
2018-05-03,32.4382
2018-05-04,32.6399
2018-05-07,32.6591
2018-05-08,32.1981
2018-05-09,32.1885
2018-05-10,32.0829
2018-05-11,32.2077
2018-05-14,32.2462
2018-05-15,32.0733
2018-05-16,31.3339
2018-05-17,31.113
2018-05-18,30.7097
2018-05-21,30.6809
2018-05-22,30.8537
2018-05-23,30.3928
2018-05-24,30.1623
2018-05-25,29.3941
2018-05-29,27.6848
2018-05-30,28.8852
2018-05-31,29.0868
2018-06-01,29.1541
2018-06-04,29.106
2018-06-05,28.8084
2018-06-06,29.1252
2018-06-07,28.6643
2018-06-08,28.4146
2018-06-11,29.4806
2018-06-12,29.2789
2018-06-13,29.4613
2018-06-14,29.3845
2018-06-15,29.1445
2018-06-18,28.9908
2018-06-19,29.0445
2018-06-20,28.9952
2018-06-21,28.3929
2018-06-22,28.7483
2018-06-25,28.3831
2018-06-26,28.2942
2018-06-27,28.0375
2018-06-28,28.1856
2018-06-29,28.5213
2018-07-02,28.2843
2018-07-03,28.6003
2018-07-05,29.0346
2018-07-06,29.1334
2018-07-09,29.3012
2018-07-10,29.3111
2018-07-11,28.6496
2018-07-12,28.8076
2018-07-13,28.926
2018-07-16,28.9162
2018-07-17,29.0346
2018-07-18,28.8767
2018-07-19,28.7089
2018-07-20,28.8866
2018-07-23,28.6792
2018-07-24,28.8471
2018-07-25,29.0248
2018-07-26,28.8767
2018-07-27,28.9952
2018-07-30,29.1432
2018-07-31,29.4888
2018-08-01,28.8866
2018-08-02,28.4226
2018-08-03,28.4917
2018-08-06,28.4028
2018-08-07,28.8273
2018-08-08,28.778
2018-08-09,28.3831
2018-08-10,27.4057
2018-08-13,27.2379
2018-08-14,27.1194
2018-08-15,26.3494
2018-08-16,26.5863
2018-08-17,26.5369
2018-08-20,26.7837
2018-08-21,27.3267
2018-08-22,27.3168
2018-08-23,27.07
2018-08-24,27.4254
2018-08-27,27.6821
2018-08-28,27.4254
2018-08-29,27.6426
2018-08-30,27.149
2018-08-31,26.7541
2018-09-04,27.149
2018-09-05,27.2576
2018-09-06,27.1391
2018-09-07,26.7936
2018-09-10,27.6229
2018-09-11,27.5637
2018-09-12,27.6821
2018-09-13,27.7019
2018-09-14,27.5143
2018-09-17,27.9191
2018-09-18,28.1264
2018-09-19,28.2054
2018-09-20,28.6595
2018-09-21,28.699
2018-09-24,28.5015
2018-09-25,28.9359
2018-09-26,28.8866
2018-09-27,28.3337
2018-09-28,27.307
2018-10-01,27.1391
2018-10-02,27.0108
2018-10-03,27.1885
2018-10-04,26.9812
2018-10-05,26.7344
2018-10-08,26.1914
2018-10-09,26.3691
2018-10-10,25.8755
2018-10-11,25.5102
2018-10-12,25.5102
2018-10-15,25.4806
2018-10-16,26.1618
2018-10-17,25.6484
2018-10-18,24.829
2018-10-19,25.1844
2018-10-22,24.987
2018-10-23,25.0166
2018-10-24,24.0985
2018-10-25,24.6019
2018-10-26,24.6118
2018-10-29,24.7204
2018-10-30,24.9574
2018-10-31,24.7303
2018-11-01,25.214
2018-11-02,25.4312
2018-11-05,25.293
2018-11-06,25.4806
2018-11-07,25.8656
2018-11-08,25.3424
2018-11-09,25.1252
2018-11-12,24.6217
2018-11-13,24.75
2018-11-14,24.8586
2018-11-15,24.8981
2018-11-16,24.908
2018-11-19,24.7895
2018-11-20,24.1873
2018-11-21,24.5032
2018-11-23,24.4045
2018-11-26,25.1054
2018-11-27,24.8389
2018-11-28,25.2733
2018-11-29,25.1449
2018-11-30,25.0659
2018-12-03,25.6583
2018-12-04,24.8191
2018-12-06,24.7994
2018-12-07,24.4341
2018-12-10,24.3848
2018-12-11,24.3551
2018-12-12,25.0067
2018-12-13,24.9771
2018-12-14,24.5921
2018-12-17,24.3946
2018-12-18,24.68
2018-12-19,24.64
2018-12-20,24.48
2018-12-21,23.85
2018-12-24,23.28
2018-12-26,23.89
2018-12-27,24.24
2018-12-28,24.12
2018-12-31,24.21
2019-01-02,24.15
2019-01-03,24.02
2019-01-04,24.9
2019-01-07,25.21
2019-01-08,25.21
2019-01-09,25.52
2019-01-10,25.73
2019-01-11,25.44
2019-01-14,25.39
2019-01-15,25.27
2019-01-16,25.57
2019-01-17,25.78
2019-01-18,25.83
2019-01-22,25.44
2019-01-23,25.56
2019-01-24,25.56
2019-01-25,25.97
2019-01-28,25.88
2019-01-29,25.97
2019-01-30,26.29
2019-01-31,26.17
2019-02-01,25.96
2019-02-04,26.14
2019-02-05,26.27
2019-02-06,26.34
2019-02-07,25.71
2019-02-08,25.59
2019-02-11,25.62
2019-02-12,26
2019-02-13,26.05
2019-02-14,25.96
2019-02-15,26.47
2019-02-19,26.57
2019-02-20,26.66
2019-02-21,26.5
2019-02-22,26.6
2019-02-25,26.77
2019-02-26,26.91
2019-02-27,26.9
2019-02-28,27.15
2019-03-01,27.32
2019-03-04,27.11
2019-03-05,27.1
2019-03-06,27.34
2019-03-07,26.82
2019-03-08,26.8
2019-03-11,26.98
2019-03-12,26.96
2019-03-13,27.22
2019-03-14,27.32
2019-03-15,27.54
2019-03-18,27.89
2019-03-19,28.04
2019-03-20,28.21
2019-03-21,28.25
2019-03-22,27.54
2019-03-25,27.62
2019-03-26,27.65
2019-03-27,27.77
2019-03-28,27.59
2019-03-29,27.79
2019-04-01,28.06
2019-04-02,28.01
2019-04-03,28.28
2019-04-04,28.18
2019-04-05,28.26
2019-04-08,28.37
2019-04-09,28.19
2019-04-10,28.12
2019-04-11,28.16
2019-04-12,28.43
2019-04-15,28.45
2019-04-16,28.39
2019-04-17,28.58
2019-04-18,28.36
2019-04-22,28.43
2019-04-23,28.34
2019-04-24,27.92
2019-04-25,27.99
2019-04-26,27.93
2019-04-29,28.1
2019-04-30,28.29
2019-05-01,28.06
2019-05-02,27.85
2019-05-03,28.14
2019-05-06,27.78
2019-05-07,27.34
2019-05-08,27.44
2019-05-09,27.29
2019-05-10,27.35
2019-05-13,26.78
2019-05-14,26.98
2019-05-15,27
2019-05-16,27.22
2019-05-17,27.1
2019-05-20,27.02
2019-05-21,27.19
2019-05-22,26.98
2019-05-23,26.54
2019-05-24,26.97
2019-05-28,26.56
2019-05-29,26.34
2019-05-30,26.17
2019-05-31,25.94
2019-06-03,26.18
2019-06-04,26.85
2019-06-05,26.65
2019-06-06,26.86
2019-06-07,27.18
2019-06-10,27.28
2019-06-11,27.47
2019-06-12,27.14
2019-06-13,27.38
2019-06-14,27.27
2019-06-17,26.37
2019-06-18,26.92
2019-06-19,27.185
2019-06-20,27.445
2019-06-21,27.725
2019-06-24,27.75
2019-06-25,27.4
2019-06-26,27.33
2019-06-27,27.4
2019-06-28,27.52
2019-07-01,27.375
2019-07-02,27.625
2019-07-03,28.265
2019-07-04,28.265
2019-07-05,28.225
2019-07-08,28.09
2019-07-09,28.01
2019-07-10,28.425
2019-07-11,28.515
2019-07-12,28.55
2019-07-15,28.515
2019-07-16,28.365
2019-07-17,28.225
2019-07-18,28.44
2019-07-19,27.615
2019-07-22,27.815
2019-07-23,28.035
2019-07-24,28.125
2019-07-25,27.815
2019-07-26,27.765
2019-07-29,27.665
2019-07-30,27.085
2019-07-31,27.035
2019-08-01,26.925
2019-08-02,26.815
2019-08-05,26.475
2019-08-06,26.55
2019-08-07,26.46
2019-08-08,26.315
2019-08-09,25.955
2019-08-12,25.875
2019-08-13,26.215
2019-08-14,25.3
2019-08-15,25.305
2019-08-16,25.665
2019-08-19,26.035
2019-08-20,25.87
2019-08-21,26.29
2019-08-22,26.29
2019-08-23,25.805
2019-08-26,26.235
2019-08-27,26.565
2019-08-28,26.52
2019-08-29,27.01
2019-08-30,26.905
2019-09-02,26.915
2019-09-03,27.03
2019-09-04,27.445
2019-09-05,27.64
2019-09-06,27.605
2019-09-09,27.66
2019-09-10,27.65
2019-09-11,27.48
2019-09-12,27.955
2019-09-13,28
2019-09-16,27.57
2019-09-17,27.54
2019-09-18,27.725
2019-09-19,27.815
2019-09-20,27.68
2019-09-23,27.565
2019-09-24,27.435
2019-09-25,27.35
2019-09-26,27.5
2019-09-27,27.395
2019-09-30,27.585
2019-10-01,27.295
2019-10-02,26.675
2019-10-03,26.77
2019-10-04,26.91
2019-10-07,27.065
2019-10-08,26.76
2019-10-09,27.02
2019-10-10,27.335
2019-10-11,27.88
2019-10-14,27.785
2019-10-15,28.11
2019-10-16,28.23
2019-10-17,28.31
2019-10-18,28.395
2019-10-21,28.535
2019-10-22,28.375
2019-10-23,28.385
2019-10-24,28.465
2019-10-25,28.555
2019-10-28,28.665
2019-10-29,28.705
2019-10-30,28.775
2019-10-31,28.805
2019-11-01,29.185
2019-11-04,29.51
2019-11-05,29.345
2019-11-06,29.31
2019-11-07,29.325
2019-11-08,29.495
2019-11-11,29.425
2019-11-12,29.65
2019-11-13,29.35
2019-11-14,29.31
2019-11-15,29.45
2019-11-18,29.35
2019-11-19,29.265
2019-11-20,29.165
2019-11-21,29.225
2019-11-22,29.125
2019-11-25,29.26
