date,close
2014-06-13,108.0012
2014-06-16,108.0556
2014-06-17,107.9649
2014-06-18,108.4544
2014-06-19,108.8171
2014-06-20,108.3729
2014-06-23,107.6386
2014-06-24,105.7803
2014-06-25,106.2607
2014-06-26,106.0431
2014-06-27,106.5145
2014-06-30,105.6533
2014-07-01,106.1273
2014-07-02,105.2615
2014-07-03,105.7354
2014-07-07,105.4893
2014-07-08,104.6236
2014-07-09,105.3709
2014-07-10,105.2888
2014-07-11,106.4918
2014-07-14,106.3369
2014-07-15,107.0933
2014-07-16,107.0933
2014-07-17,105.8083
2014-07-18,107.2118
2014-07-21,107.8589
2014-07-22,108.0411
2014-07-23,110.0279
2014-07-24,110.7114
2014-07-25,110.4015
2014-07-28,109.8
2014-07-29,108.6153
2014-07-30,108.6426
2014-07-31,106.4189
2014-08-01,106.8381
2014-08-04,106.8381
2014-08-05,106.0362
2014-08-06,104.578
2014-08-07,104.2499
2014-08-08,106.7744
2014-08-11,107.3758
2014-08-12,106.829
2014-08-13,108.5606
2014-08-14,108.5606
2014-08-15,108.7611
2014-08-18,110.438
2014-08-19,111.0122
2014-08-20,112.5341
2014-08-21,112.7164
2014-08-22,112.8713
2014-08-25,113.3908
2014-08-26,113.8556
2014-08-27,112.9989
2014-08-28,112.4521
2014-08-29,112.3245
2014-09-02,111.7868
2014-09-03,113.8556
2014-09-04,113.646
2014-09-05,114.3295
2014-09-08,114.6211
2014-09-09,115.0677
2014-09-10,116.1249
2014-09-11,115.3958
2014-09-12,115.1953
2014-09-15,115.6054
2014-09-16,116.4256
2014-09-17,116.8722
2014-09-18,117.82
2014-09-19,117.9749
2014-09-22,116.6717
2014-09-23,114.8034
2014-09-24,115.7239
2014-09-25,113.9285
2014-09-26,116.38
2014-09-29,116.1886
2014-09-30,115.8241
2014-10-01,113.2723
2014-10-02,111.003
2014-10-03,112.5888
2014-10-06,112.1969
2014-10-07,109.9914
2014-10-08,112.8129
2014-10-09,111.3014
2014-10-10,111.0449
2014-10-13,108.3425
2014-10-14,108.654
2014-10-15,108.0769
2014-10-16,107.9578
2014-10-17,110.7243
2014-10-20,111.1182
2014-10-21,113.4908
2014-10-22,115.7076
2014-10-23,119.3994
2014-10-24,121.3781
2014-10-27,121.9185
2014-10-28,125.1339
2014-10-29,124.9965
2014-10-30,126.682
2014-10-31,128.0287
2014-11-03,127.992
2014-11-04,128.9722
2014-11-05,130.0348
2014-11-06,129.6776
2014-11-07,128.3768
2014-11-10,128.9997
2014-11-11,129.4394
2014-11-12,129.4394
2014-11-13,130.731
2014-11-14,130.6852
2014-11-17,130.1264
2014-11-18,131.8486
2014-11-19,131.3356
2014-11-20,131.6837
2014-11-21,132.4532
2014-11-24,132.7189
2014-11-25,132.4624
2014-11-26,132.3983
2014-11-28,133.1586
2014-12-01,131.6929
2014-12-02,132.1143
2014-12-03,132.9479
2014-12-04,132.7189
2014-12-05,132.9662
2014-12-08,132.7922
2014-12-09,132.8471
2014-12-10,129.2928
2014-12-11,130.4471
2014-12-12,125.8759
2014-12-15,124.227
2014-12-16,124.9507
2014-12-17,125.711
2014-12-18,128.0836
2014-12-19,128.0928
2014-12-22,129.531
2014-12-23,129.4486
2014-12-24,129.6592
2014-12-26,129.5218
2014-12-29,128.8623
2014-12-30,127.9096
2014-12-31,126.0683
2015-01-02,126.8286
2015-01-05,124.1812
2015-01-06,124.3278
2015-01-07,123.8514
2015-01-08,126.8378
2015-01-09,127.305
2015-01-12,126.3248
2015-01-13,126.224
2015-01-14,126.3897
2015-01-15,126.721
2015-01-16,127.9725
2015-01-20,127.0707
2015-01-21,127.8068
2015-01-22,129.9417
2015-01-23,130.0429
2015-01-26,128.8835
2015-01-27,126.2517
2015-01-28,125.5155
2015-01-29,123.7487
2015-01-30,122.5801
2015-02-02,125.2579
2015-02-03,127.862
2015-02-04,127.4755
2015-02-05,127.6228
2015-02-06,128.1749
2015-02-09,126.0124
2015-02-10,127.1351
2015-02-11,126.2609
2015-02-12,127.1259
2015-02-13,126.629
2015-02-17,127.0338
2015-02-18,127.5952
2015-02-19,128.3773
2015-02-20,130.8895
2015-02-23,129.9877
2015-02-24,130.3742
2015-02-25,128.9571
2015-02-26,128.3037
2015-02-27,127.7056
2015-03-02,128.6442
2015-03-03,126.1505
2015-03-04,125.3775
2015-03-05,125.5431
2015-03-06,123.8591
2015-03-09,125.0738
2015-03-10,122.1016
2015-03-11,121.7427
2015-03-12,123.0034
2015-03-13,121.6415
2015-03-16,124.1996
2015-03-17,123.4267
2015-03-18,125.2579
2015-03-19,124.4849
2015-03-20,124.6045
2015-03-23,125.037
2015-03-24,124.4113
2015-03-25,123.0862
2015-03-26,123.7947
2015-03-27,124.264
2015-03-30,126.5369
2015-03-31,124.899
2015-04-01,123.2886
2015-04-02,123.0586
2015-04-06,124.6965
2015-04-07,124.2272
2015-04-08,125.0874
2015-04-09,125.5869
2015-04-10,125.7071
2015-04-13,124.6527
2015-04-14,123.1081
2015-04-15,122.6456
2015-04-16,123.1543
2015-04-17,121.4154
2015-04-20,123.2745
2015-04-21,123.1451
2015-04-22,123.6723
2015-04-23,122.8306
2015-04-24,124.033
2015-04-27,123.5335
2015-04-28,123.4595
2015-04-29,128.1304
2015-04-30,127.0113
2015-05-01,129.6196
2015-05-04,130.045
2015-05-05,127.6217
2015-05-06,127.298
2015-05-07,127.9177
2015-05-08,131.0254
2015-05-11,129.6935
2015-05-12,128.9629
2015-05-13,128.5836
2015-05-14,130.3595
2015-05-15,129.5918
2015-05-18,129.749
2015-05-19,129.5363
2015-05-20,129.4438
2015-05-21,130.2948
2015-05-22,129.1571
2015-05-26,127.631
2015-05-27,130.008
2015-05-28,129.8693
2015-05-29,129.6381
2015-06-01,129.7213
2015-06-02,130.045
2015-06-03,130.119
2015-06-04,128.5466
2015-06-05,128.7686
2015-06-08,127.9547
2015-06-09,128.2692
2015-06-10,130.9145
2015-06-11,131.5712
2015-06-12,131.3862
2015-06-15,131.3584
2015-06-16,132.4776
2015-06-17,133.6522
2015-06-18,135.0304
2015-06-19,134.198
2015-06-22,134.4569
2015-06-23,134.4569
2015-06-24,134.5957
2015-06-25,133.31
2015-06-26,134.7992
2015-06-29,131.1919
2015-06-30,131.6939
2015-07-01,133.0695
2015-07-02,133.0509
2015-07-06,133.2275
2015-07-07,133.5156
2015-07-08,132.2237
2015-07-09,133.7294
2015-07-10,135.7928
2015-07-13,135.9136
2015-07-14,136.6014
2015-07-15,136.8616
2015-07-16,137.977
2015-07-17,138.1629
2015-07-20,138.4975
2015-07-21,135.9694
2015-07-22,134.9748
2015-07-23,134.5845
2015-07-24,132.5583
2015-07-27,132.3631
2015-07-28,134.1105
2015-07-29,139.3804
2015-07-30,139.6779
2015-07-31,138.5904
2015-08-03,138.3488
2015-08-04,138.3023
2015-08-05,139.2503
2015-08-06,138.9157
2015-08-07,139.1574
2015-08-10,141.2393
2015-08-11,139.9753
2015-08-12,139.7801
2015-08-13,139.9195
2015-08-14,140.914
2015-08-17,142.0666
2015-08-18,142.4662
2015-08-19,141.9736
2015-08-20,138.4231
2015-08-21,134.9284
2015-08-24,130.876
2015-08-25,129.0449
2015-08-26,133.8874
2015-08-27,134.9284
2015-08-28,134.3335
2015-08-31,132.0099
2015-09-01,129.0914
2015-09-02,132.4003
2015-09-03,133.2925
2015-09-04,131.2199
2015-09-08,134.2034
2015-09-09,132.4189
2015-09-10,130.783
2015-09-11,131.8705
2015-09-14,130.7273
2015-09-15,131.7868
2015-09-16,131.8333
2015-09-17,131.5731
2015-09-18,129.4167
2015-09-21,129.8629
2015-09-22,128.2177
2015-09-23,126.9351
2015-09-24,128.7382
2015-09-25,128.2828
2015-09-28,125.5781
2015-09-29,126.0242
2015-09-30,128.2177
2015-10-01,128.4315
2015-10-02,129.3145
2015-10-05,133.9524
2015-10-06,130.7365
2015-10-07,131.1008
2015-10-08,132.5485
2015-10-09,133.3051
2015-10-12,134.2111
2015-10-13,132.3617
2015-10-14,130.2975
2015-10-15,131.9694
2015-10-16,132.3524
2015-10-19,131.9321
2015-10-20,131.9321
2015-10-21,133.6507
2015-10-22,137.5362
2015-10-23,138.4983
2015-10-26,138.3769
2015-10-27,138.6104
2015-10-28,140.8334
2015-10-29,140.0768
2015-10-30,138.7785
2015-11-02,138.9093
2015-11-03,137.4615
2015-11-04,137.5643
2015-11-05,137.3681
2015-11-06,136.294
2015-11-09,134.7715
2015-11-10,134.4446
2015-11-11,133.8562
2015-11-12,132.4925
2015-11-13,131.3249
2015-11-16,133.8281
2015-11-17,133.4452
2015-11-18,134.2298
2015-11-19,135.6215
2015-11-20,135.9017
2015-11-23,135.0517
2015-11-24,135.9297
2015-11-25,135.6028
2015-11-27,135.9577
2015-11-30,136.7984
2015-12-01,137.8632
2015-12-02,135.7616
2015-12-03,132.5952
2015-12-04,134.3512
2015-12-07,133.6507
2015-12-08,132.6326
2015-12-09,130.9233
2015-12-10,130.7645
2015-12-11,128.747
2015-12-14,130.0079
2015-12-15,128.9338
2015-12-16,130.4283
2015-12-17,129.0459
2015-12-18,127.6915
2015-12-21,128.9805
2015-12-22,130.7085
2015-12-23,130.6618
2015-12-24,130.6151
2015-12-28,130.3816
2015-12-29,131.0821
2015-12-30,130.0733
2015-12-31,128.2987
2016-01-04,127.0938
2016-01-05,127.6262
2016-01-06,126.3372
2016-01-07,122.1714
2016-01-08,121.6017
2016-01-11,122.6291
2016-01-12,123.7499
2016-01-13,121.1679
2016-01-14,121.1585
2016-01-15,118.2948
2016-01-19,119.5999
2016-01-20,116.5953
2016-01-21,116.7268
2016-01-22,118.6516
2016-01-25,116.9897
2016-01-26,119.5999
2016-01-27,121.121
2016-01-28,120.7923
2016-01-29,125.5996
2016-02-01,125.4588
2016-02-02,125.3743
2016-02-03,125.6184
2016-02-04,127.0831
2016-02-05,126.0034
2016-02-08,124.1818
2016-02-09,124.0598
2016-02-10,124.9424
2016-02-11,120.7266
2016-02-12,122.2289
2016-02-16,123.4777
2016-02-17,126.7827
2016-02-18,126.8014
2016-02-19,126.9986
2016-02-22,128.2755
2016-02-23,127.6089
2016-02-24,126.8953
2016-02-25,128.8577
2016-02-26,128.7356
2016-02-29,127.9469
2016-03-01,129.7966
2016-03-02,127.3272
2016-03-03,127.4493
2016-03-04,127.0174
2016-03-07,124.2476
2016-03-08,123.3744
2016-03-09,123.8532
2016-03-10,125.4118
2016-03-11,127.2427
2016-03-14,126.0127
2016-03-15,125.1489
2016-03-16,125.8062
2016-03-17,125.9282
2016-03-18,127.177
2016-03-21,126.5479
2016-03-22,126.9798
2016-03-23,126.116
2016-03-24,121.1961
2016-03-28,122.8298
2016-03-29,123.8063
2016-03-30,123.6842
2016-03-31,123.3462
2016-04-01,124.257
2016-04-04,123.6467
2016-04-05,122.8486
2016-04-06,124.3975
2016-04-07,124.0858
2016-04-08,125.5213
2016-04-11,124.5674
2016-04-12,126.1257
2016-04-13,126.8529
2016-04-14,126.1446
2016-04-15,127.3157
2016-04-18,128.7134
2016-04-19,129.0912
2016-04-20,129.11
2016-04-21,130.0639
2016-04-22,130.2339
2016-04-25,129.1856
2016-04-26,130.9989
2016-04-27,135.6265
2016-04-28,133.3127
2016-04-29,132.7082
2016-05-02,133.9454
2016-05-03,134.4271
2016-05-04,133.5677
2016-05-05,134.2948
2016-05-06,135.4659
2016-05-09,135.022
2016-05-10,137.6097
2016-05-11,136.9014
2016-05-12,137.232
2016-05-13,136.3442
2016-05-16,137.2886
2016-05-17,136.9392
2016-05-18,136.2875
2016-05-19,135.6076
2016-05-20,136.5803
2016-05-23,134.3421
2016-05-24,135.0126
2016-05-25,135.022
2016-05-26,134.8898
2016-05-27,135.1731
2016-05-31,133.9832
2016-06-01,133.6054
2016-06-02,132.3399
2016-06-03,132.4344
2016-06-06,132.5382
2016-06-07,133.2182
2016-06-08,133.6243
2016-06-09,134.0871
2016-06-10,133.6621
2016-06-13,131.3766
2016-06-14,131.6788
2016-06-15,132.321
2016-06-16,131.9905
2016-06-17,131.2633
2016-06-20,133.086
2016-06-21,131.6599
2016-06-22,131.0744
2016-06-23,132.0094
2016-06-24,128.5717
2016-06-27,125.663
2016-06-28,126.494
2016-06-29,128.821
2016-06-30,132.2498
2016-07-01,134.2444
2016-07-05,131.4615
2016-07-06,132.8672
2016-07-07,131.7274
2016-07-08,133.4275
2016-07-11,134.1019
2016-07-12,134.4343
2016-07-13,134.6148
2016-07-14,135.4031
2016-07-15,134.9567
2016-07-18,133.9214
2016-07-19,136.1155
2016-07-20,137.2837
2016-07-21,135.6881
2016-07-22,136.5524
2016-07-25,136.5049
2016-07-26,137.2552
2016-07-27,139.2688
2016-07-28,139.7152
2016-07-29,139.5157
2016-08-01,141.6053
2016-08-02,140.779
2016-08-03,140.3895
2016-08-04,139.9716
2016-08-05,141.4153
2016-08-08,140.6745
2016-08-09,141.1114
2016-08-10,143.8658
2016-08-11,143.7043
2016-08-12,143.8658
2016-08-15,145.6989
2016-08-16,144.7491
2016-08-17,145.2905
2016-08-18,144.7776
2016-08-19,144.7301
2016-08-22,144.5782
2016-08-23,144.5117
2016-08-24,144.6446
2016-08-25,145.0151
2016-08-26,143.9703
2016-08-29,145.148
2016-08-30,144.9011
2016-08-31,144.5782
2016-09-01,145.167
2016-09-02,146.0883
2016-09-06,146.8672
2016-09-07,145.4235
2016-09-08,144.7491
2016-09-09,142.3841
2016-09-12,144.1887
2016-09-13,143.0395
2016-09-14,142.3081
2016-09-15,144.5212
2016-09-16,143.182
2016-09-19,144.5307
2016-09-20,144.2362
2016-09-21,145.414
2016-09-22,147.0856
2016-09-23,146.0883
2016-09-26,146.1453
2016-09-27,147.4845
2016-09-28,148.1779
2016-09-29,147.798
2016-09-30,147.3706
2016-10-03,146.9432
2016-10-04,145.8414
2016-10-05,146.7292
2016-10-06,147.1301
2016-10-07,146.0037
2016-10-10,145.9369
2016-10-11,142.7965
2016-10-12,143.1783
2016-10-13,144.1424
2016-10-14,144.4574
2016-10-17,143.6365
2016-10-18,144.9728
2016-10-19,144.5338
2016-10-20,143.856
2016-10-21,143.3502
2016-10-24,144.5528
2016-10-25,145.6505
2016-10-26,144.2665
2016-10-27,143.3024
2016-10-28,144.6101
2016-10-31,143.8847
2016-11-01,143.1592
2016-11-02,142.8633
2016-11-03,143.207
2016-11-04,142.997
2016-11-07,145.4596
2016-11-08,146.7864
2016-11-09,154.7185
2016-11-10,158.9375
2016-11-11,160.8847
2016-11-14,162.4501
2016-11-15,160.3788
2016-11-16,158.298
2016-11-17,158.0975
2016-11-18,159.0425
2016-11-21,160.7702
2016-11-22,162.4406
2016-11-23,162.7938
2016-11-25,164.2542
2016-11-28,164.8174
2016-11-29,167.1655
2016-11-30,167.3755
2016-12-01,168.3777
2016-12-02,170.5445
2016-12-05,170.4013
2016-12-06,169.9909
2016-12-07,170.3154
2016-12-08,165.7719
2016-12-09,167.4137
2016-12-12,165.8387
2016-12-13,166.3828
2016-12-14,165.8387
2016-12-15,166.2014
2016-12-16,166.4782
2016-12-19,166.6882
2016-12-20,167.2896
2016-12-21,166.1823
2016-12-22,166.5928
2016-12-23,167.28
2016-12-27,166.6405
2016-12-28,165.1801
2016-12-29,165.3328
2016-12-30,164.8078
2017-01-03,167.4709
2017-01-04,167.5568
2017-01-05,168.1295
2017-01-06,169.3895
2017-01-09,168.0627
2017-01-10,168.3395
2017-01-11,169.0173
2017-01-12,168.4923
2017-01-13,169.8
2017-01-17,167.9673
2017-01-18,168.7151
2017-01-19,170.4598
2017-01-20,170.9104
2017-01-23,169.9038
2017-01-24,169.923
2017-01-25,168.0727
2017-01-26,169.9709
2017-01-27,177.4868
2017-01-30,174.9272
2017-01-31,173.5946
2017-02-01,173.5467
2017-02-02,172.9044
2017-02-03,175.5503
2017-02-06,175.4736
2017-02-07,175.6366
2017-02-08,175.5695
2017-02-09,175.0422
2017-02-10,176.7774
2017-02-13,178.8865
2017-02-14,179.4904
2017-02-15,180.219
2017-02-16,180.938
2017-02-17,181.2448
2017-02-21,181.7529
2017-02-22,182.0405
2017-02-23,180.5162
2017-02-24,181.7912
2017-02-27,182.5294
2017-02-28,181.9638
2017-03-01,184.4563
2017-03-02,183.1525
2017-03-03,181.8104
2017-03-06,183.0471
2017-03-07,183.5551
2017-03-08,182.5102
2017-03-09,182.4719
2017-03-10,182.9512
2017-03-13,183.6414
2017-03-14,181.9062
2017-03-15,183.7373
2017-03-16,182.769
2017-03-17,185.2807
2017-03-20,184.0441
2017-03-21,180.8901
2017-03-22,181.7625
2017-03-23,181.7241
2017-03-24,179.7684
2017-03-27,177.8223
2017-03-28,180.6504
2017-03-29,180.5066
2017-03-30,180.9763
2017-03-31,179.4617
2017-04-03,179.9793
2017-04-04,179.9602
2017-04-05,178.9683
2017-04-06,179.4017
2017-04-07,181.0773
2017-04-10,180.7113
2017-04-11,181.4047
2017-04-12,179.4402
2017-04-13,179.8158
2017-04-17,181.8958
2017-04-18,180.4417
2017-04-19,180.798
2017-04-20,181.1639
2017-04-21,181.9439
2017-04-24,184.804
2017-04-25,186.0847
2017-04-26,187.6351
2017-04-27,187.8084
2017-04-28,186.6143
2017-05-01,185.998
2017-05-02,186.884
2017-05-03,186.9899
2017-05-04,187.3462
2017-05-05,188.7136
2017-05-08,189.0603
2017-05-09,189.3107
2017-05-10,187.1921
2017-05-11,187.7603
2017-05-12,188.3477
2017-05-15,187.9529
2017-05-16,188.0588
2017-05-17,184.9003
2017-05-18,185.5069
2017-05-19,188.6173
2017-05-22,190.4277
2017-05-23,191.9396
2017-05-24,192.5751
2017-05-25,193.644
2017-05-26,194.7515
2017-05-30,194.53
2017-05-31,195.7241
2017-06-01,195.0211
2017-06-02,196.1574
2017-06-05,194.01
2017-06-06,191.0922
2017-06-07,191.5062
2017-06-08,192.2477
2017-06-09,192.084
2017-06-12,191.0536
2017-06-13,193.124
2017-06-14,193.827
2017-06-15,194.5492
2017-06-16,195.1655
2017-06-19,196.947
2017-06-20,196.3115
2017-06-21,196.3404
2017-06-22,193.8077
2017-06-23,193.8655
2017-06-26,192.787
2017-06-27,191.4774
2017-06-28,193.3937
2017-06-29,189.667
2017-06-30,190.7648
2017-07-03,192.267
2017-07-05,194.1237
2017-07-06,192.4604
2017-07-07,194.6265
2017-07-10,194.4428
2017-07-11,193.321
2017-07-12,194.4815
2017-07-13,193.5531
2017-07-14,194.5202
2017-07-17,193.5435
2017-07-18,194.7813
2017-07-19,195.6709
2017-07-20,195.729
2017-07-21,197.8081
2017-07-24,198.1756
2017-07-25,196.8507
2017-07-26,188.2441
2017-07-27,187.4511
2017-07-28,191.416
2017-07-31,189.859
2017-08-01,190.0524
2017-08-02,191.5127
2017-08-03,192.7602
2017-08-04,193.4758
2017-08-07,194.5105
2017-08-08,192.2476
2017-08-09,194.3751
2017-08-10,191.7448
2017-08-11,191.3676
2017-08-14,193.6982
2017-08-15,192.9149
2017-08-16,193.998
2017-08-17,191.4643
2017-08-18,192.1799
2017-08-21,194.3268
2017-08-22,194.5975
2017-08-23,193.1663
2017-08-24,192.8955
2017-08-25,192.4894
2017-08-28,191.3483
2017-08-29,194.3268
2017-08-30,194.5879
2017-08-31,194.7136
2017-09-01,193.4081
2017-09-05,192.1799
2017-09-06,190.2555
2017-09-07,190.5456
2017-09-08,191.3483
2017-09-11,193.7272
2017-09-12,192.441
2017-09-13,190.3619
2017-09-14,194.0149
2017-09-15,191.7351
2017-09-18,195.5162
2017-09-19,196.4252
2017-09-20,197.5373
2017-09-21,198.9395
2017-09-22,198.6398
2017-09-25,198.1176
2017-09-26,198.5624
2017-09-27,199.9839
2017-09-28,198.2723
2017-09-29,198.8042
2017-10-02,201.8407
2017-10-03,203.591
2017-10-04,204.3356
2017-10-05,207.2385
2017-10-06,206.4133
2017-10-09,207.3162
2017-10-10,206.3647
2017-10-11,206.6366
2017-10-12,207.5007
2017-10-13,207.1317
2017-10-16,207.2288
2017-10-17,205.3841
2017-10-18,204.2676
2017-10-19,205.4812
2017-10-20,207.6366
2017-10-23,206.3259
2017-10-24,205.9084
2017-10-25,201.2966
2017-10-26,197.9762
2017-10-27,199.0247
2017-10-30,200.1704
2017-10-31,197.0732
2017-11-01,195.7528
2017-11-02,197.8888
2017-11-03,198.1218
2017-11-06,196.481
2017-11-07,197.8305
2017-11-08,196.7237
2017-11-09,193.0828
2017-11-10,193.9566
2017-11-13,194.3062
2017-11-14,194.3935
2017-11-15,193.1993
2017-11-16,193.4226
2017-11-17,192.0148
2017-11-20,192.9566
2017-11-21,194.277
2017-11-22,194.2188
2017-11-24,194.1799
2017-11-27,195.2188
2017-11-28,198.248
2017-11-29,198.2286
2017-11-30,201.1316
2017-12-01,196.7431
2017-12-04,195.8208
2017-12-05,194.0926
2017-12-06,194.3838
2017-12-07,194.345
2017-12-08,195.2188
2017-12-11,193.8304
2017-12-12,190.4711
2017-12-13,190.908
2017-12-14,190.5099
2017-12-15,193.0537
2017-12-18,192.675
2017-12-19,194.0149
2017-12-20,195.4421
2017-12-21,196.5878
2017-12-22,196.7431
2017-12-26,196.0926
2017-12-27,196.8208
2017-12-28,197.9276
2017-12-29,197.5295
2018-01-02,194.6557
2018-01-03,195.8693
2018-01-04,199.2383
2018-01-05,198.7432
2018-01-08,198.7432
2018-01-09,199.8888
2018-01-10,198.7917
2018-01-11,199.5296
2018-01-12,204.4618
2018-01-16,200.3257
2018-01-17,202.452
2018-01-18,202.5689
2018-01-19,203.8362
2018-01-22,202.9588
2018-01-23,202.257
2018-01-24,213.7502
2018-01-25,220.8274
2018-01-26,220.5447
2018-01-29,219.8233
2018-01-30,218.634
2018-01-31,216.8793
2018-02-01,219.5406
2018-02-02,216.1385
2018-02-05,205.9028
2018-02-06,207.1116
2018-02-07,209.5389
2018-02-08,200.863
2018-02-09,206.7607
2018-02-12,204.2553
2018-02-13,206.478
2018-02-14,212.7558
2018-02-15,219.7258
2018-02-16,218.5463
2018-02-20,216.2457
2018-02-21,215.1929
2018-02-22,214.5983
2018-02-23,215.4366
2018-02-26,221.0711
2018-02-27,218.2539
2018-02-28,216.8501
2018-03-01,213.6332
2018-03-02,217.7177
2018-03-05,218.985
2018-03-06,219.1507
2018-03-07,220.5837
2018-03-08,220.9444
2018-03-09,224.1613
2018-03-12,218.985
2018-03-13,217.7274
2018-03-14,216.1092
2018-03-15,216.9963
2018-03-16,217.1328
2018-03-19,218.2636
2018-03-20,219.7063
2018-03-21,218.1174
2018-03-22,212.8728
2018-03-23,213.3017
2018-03-26,217.8444
2018-03-27,215.5048
2018-03-28,211.8103
2018-03-29,215.3391
2018-04-02,213.37
2018-04-03,214.7737
2018-04-04,213.0385
2018-04-05,215.6511
2018-04-06,210.309
2018-04-09,209.5487
2018-04-10,209.0515
2018-04-11,210.8744
2018-04-12,213.645
2018-04-13,213.8311
2018-04-16,213.8213
2018-04-17,216.7682
2018-04-18,220.7626
2018-04-19,220.2633
2018-04-20,218.4325
2018-04-23,221.2228
2018-04-24,217.3654
2018-04-25,210.0324
2018-04-26,207.3107
2018-04-27,199.4392
2018-04-30,197.0896
2018-05-01,193.1636
2018-05-02,191.5776
2018-05-03,190.9119
2018-05-04,190.9804
2018-05-07,192.3315
2018-05-08,195.435
2018-05-09,196.835
2018-05-10,197.442
2018-05-11,199.6448
2018-05-14,198.8127
2018-05-15,197.4224
2018-05-16,196.2965
2018-05-17,197.5301
2018-05-18,198.2742
2018-05-21,201.4561
2018-05-22,200.0854
2018-05-23,201.2505
2018-05-24,204.354
2018-05-25,203.7568
2018-05-29,197.5791
2018-05-30,199.7623
2018-05-31,197.4812
2018-06-01,199.2043
2018-06-04,198.3525
2018-06-05,196.884
2018-06-06,197.2854
2018-06-07,198.5973
2018-06-08,198.3329
2018-06-11,197.4714
2018-06-12,194.3385
2018-06-13,195.6308
2018-06-14,191.7147
2018-06-15,191.6951
2018-06-18,191.8615
2018-06-19,186.6922
2018-06-20,187.3873
2018-06-21,184.4796
2018-06-22,185.4097
2018-06-25,185.1355
2018-06-26,184.8418
2018-06-27,181.9928
2018-06-28,183.5103
2018-06-29,182.5019
2018-07-02,183.4418
2018-07-03,185.7132
2018-07-05,185.6542
2018-07-06,185.7919
2018-07-09,188.4484
2018-07-10,189.688
2018-07-11,188.4188
2018-07-12,190.5145
2018-07-13,189.629
2018-07-16,188.409
2018-07-17,189.2158
2018-07-18,192.2756
2018-07-19,191.213
2018-07-20,192.128
2018-07-23,190.1111
2018-07-24,193.5743
2018-07-25,200.1661
2018-07-26,197.2441
2018-07-27,195.4436
2018-07-30,193.0922
2018-07-31,196.5357
2018-08-01,192.8462
2018-08-02,191.7935
2018-08-03,190.9572
2018-08-06,190.3964
2018-08-07,193.1118
2018-08-08,191.9804
2018-08-09,189.4617
2018-08-10,188.714
2018-08-13,188.7435
2018-08-14,190.5046
2018-08-15,189.2059
2018-08-16,189.3338
2018-08-17,190.5538
2018-08-20,191.7738
2018-08-21,191.8132
2018-08-22,189.3732
2018-08-23,188.4975
2018-08-24,189.4814
2018-08-27,192.1378
2018-08-28,192.4625
2018-08-29,191.5672
2018-08-30,189.4027
2018-08-31,190.2783
2018-09-04,189.5011
2018-09-05,190.849
2018-09-06,192.0886
2018-09-07,191.5672
2018-09-10,192.5314
2018-09-11,192.8954
2018-09-12,193.0331
2018-09-13,195.3649
2018-09-14,197.2736
2018-09-17,199.1626
2018-09-18,201.3074
2018-09-19,200.7171
2018-09-20,199.5856
2018-09-21,201.3566
2018-09-24,199.5561
2018-09-25,200.1956
2018-09-26,198.6018
2018-09-27,198.8182
2018-09-28,201.4156
2018-10-01,202.183
2018-10-02,201.6714
2018-10-03,202.3995
2018-10-04,203.5065
2018-10-05,203.9117
2018-10-08,204.7419
2018-10-09,201.7769
2018-10-10,195.5109
2018-10-11,190.6879
2018-10-12,189.6106
2018-10-15,190.3815
2018-10-16,192.4372
2018-10-17,191.5774
2018-10-18,188.9879
2018-10-19,188.0391
2018-10-22,187.9205
2018-10-23,185.5584
2018-10-24,171.2178
2018-10-25,168.6086
2018-10-26,167.8773
2018-10-29,165.0902
2018-10-30,169.8836
2018-10-31,170.5655
2018-11-01,176.3176
2018-11-02,174.9142
2018-11-05,175.8926
2018-11-06,180.0732
2018-11-07,182.8702
2018-11-08,182.4057
2018-11-09,182.3464
2018-11-12,178.8971
2018-11-13,177.978
2018-11-14,177.7408
2018-11-15,180.2116
2018-11-16,180.9232
2018-11-19,177.2861
2018-11-20,173.8665
2018-11-21,174.6868
2018-11-23,176.1792
2018-11-26,177.5925
2018-11-27,176.5548
2018-11-28,179.9052
2018-11-29,180.0436
2018-11-30,182.7318
2018-12-03,179.4506
2018-12-04,171.1585
2018-12-06,169.0237
2018-12-07,165.4262
2018-12-10,170.19
2018-12-11,170.2591
2018-12-12,169.2214
2018-12-13,169.0138
2018-12-14,166.9977
2018-12-17,161.5421
2018-12-18,160.9096
2018-12-19,157.1341
2018-12-20,152.8053
2018-12-21,148.7334
2018-12-24,146.48
2018-12-26,150.3938
2018-12-27,153.3093
2018-12-28,153.507
2018-12-31,155.3749
2019-01-02,155.4243
2019-01-03,151.5797
2019-01-04,155.9284
2019-01-07,156.7981
2019-01-08,156.808
2019-01-09,159.0219
2019-01-10,160.534
2019-01-11,161.8979
2019-01-14,162.6095
2019-01-15,161.2357
2019-01-16,161.6903
2019-01-17,164.722
2019-01-18,167.5648
2019-01-22,166.213
2019-01-23,167.7934
2019-01-24,169.7913
2019-01-25,170.1889
2019-01-28,171.1531
2019-01-29,174.9401
2019-01-30,169.8808
2019-01-31,170.1392
2019-02-01,168.0121
2019-02-04,173.5585
2019-02-05,171.1829
2019-02-06,171.7196
2019-02-07,172.5446
2019-02-08,171.0835
2019-02-11,169.9007
2019-02-12,171.7196
2019-02-13,172.4353
2019-02-14,171.0636
2019-02-15,174.1847
2019-02-19,173.7275
2019-02-20,173.3995
2019-02-21,170.5964
2019-02-22,171.501
2019-02-25,172.0974
2019-02-26,168.9763
2019-02-27,168.3202
2019-02-28,169.1949
2019-03-01,168.2606
2019-03-04,165.7458
2019-03-05,167.0181
2019-03-06,165.4675
2019-03-07,165.3383
2019-03-08,165.1395
2019-03-11,168.4892
2019-03-12,167.7537
2019-03-13,170.6859
2019-03-14,168.5687
2019-03-15,168.7675
2019-03-18,170.6362
2019-03-19,169.6919
2019-03-20,167.4754
2019-03-21,168.8073
2019-03-22,164.8513
2019-03-25,165.6166
2019-03-26,165.8949
2019-03-27,165.557
2019-03-28,166.7497
2019-03-29,168.2606
2019-04-01,171.2723
2019-04-02,168.9166
2019-04-03,166.7398
2019-04-04,168.1513
2019-04-05,170.0895
2019-04-08,171.2624
2019-04-09,168.1513
2019-04-10,168.3501
2019-04-11,171.43
2019-04-12,174.93
2019-04-15,172
2019-04-16,173.74
2019-04-17,174.53
2019-04-18,176.85
2019-04-22,177.03
2019-04-23,182.37
2019-04-24,180.73
2019-04-25,176.88
2019-04-26,178.07
2019-04-29,179.21
2019-04-30,178.72
2019-05-01,176.39
2019-05-02,174.57
2019-05-03,176.69
2019-05-06,175.36
2019-05-07,170.48
2019-05-08,168.29
2019-05-09,172.05
2019-05-10,173.08
2019-05-13,167.99
2019-05-14,168.49
2019-05-15,167.72
2019-05-16,169.85
2019-05-17,166.37
2019-05-20,169.29
2019-05-21,171.45
2019-05-22,169.28
2019-05-23,163.58
2019-05-24,164.03
2019-05-28,163.66
2019-05-29,162.31
2019-05-30,162.23
2019-05-31,160.82
2019-06-03,163.15
2019-06-04,167.78
2019-06-05,171.94
2019-06-06,171.98
2019-06-07,173.97
2019-06-10,173.39
2019-06-11,169.73
2019-06-12,170.04
2019-06-13,171.34
2019-06-14,171.41
2019-06-17,172.065
2019-06-18,173.3
2019-06-19,173.67
2019-06-20,177.7
2019-06-21,177.43
2019-06-24,177.985
2019-06-25,177.56
2019-06-26,179.595
2019-06-27,178.03
2019-06-28,180.99
2019-07-01,182.52
2019-07-02,183.36
2019-07-03,182.63
2019-07-04,182.63
2019-07-05,182.235
2019-07-08,181.12
2019-07-09,180.13
2019-07-10,182.31
2019-07-11,183.14
2019-07-12,185.785
2019-07-15,186.24
2019-07-16,187.03
2019-07-17,183.55
2019-07-18,182.95
2019-07-19,184.09
2019-07-22,184.57
2019-07-23,185.61
2019-07-24,187.74
2019-07-25,187.45
2019-07-26,189.73
2019-07-29,189.94
2019-07-30,188.7
2019-07-31,186.09
2019-08-01,183.64
2019-08-02,182.02
2019-08-05,177.16
2019-08-06,180.58
2019-08-07,181.04
2019-08-08,184.11
2019-08-09,184.015
2019-08-12,181.145
2019-08-13,182.91
2019-08-14,180.66
2019-08-15,182.47
2019-08-16,184.765
2019-08-19,187.87
2019-08-20,187.17
2019-08-21,188.655
2019-08-22,187.83
2019-08-23,182.62
2019-08-26,184.28
2019-08-27,183.49
2019-08-28,185.5
2019-08-29,189.26
2019-08-30,191.38
2019-09-02,191.11
2019-09-03,188.985
2019-09-04,190.61
2019-09-05,192.435
2019-09-06,192.55
2019-09-09,188
2019-09-10,187.615
2019-09-11,188.48
2019-09-12,189.475
2019-09-13,189.74
2019-09-16,190.97
2019-09-17,191.23
2019-09-18,190.25
2019-09-19,187.855
2019-09-20,187.98
2019-09-23,187
2019-09-24,184.52
2019-09-25,186.26
2019-09-26,186.01
2019-09-27,182.895
2019-09-30,182.81
2019-10-01,178.86
2019-10-02,174.495
2019-10-03,174.85
2019-10-04,176.755
2019-10-07,177.05
2019-10-08,176.595
2019-10-09,176.945
2019-10-10,176.825
2019-10-11,180.01
2019-10-14,179.04
2019-10-15,179.05
2019-10-16,178.12
2019-10-17,176.77
2019-10-18,174.545
2019-10-21,175.54
2019-10-22,179.885
2019-10-23,173.59
2019-10-24,174.93
2019-10-25,173.725
2019-10-28,174.865
2019-10-29,176.23
2019-10-30,178.47
2019-10-31,176.66
2019-11-01,179.3
2019-11-04,177.67
2019-11-05,179.41
2019-11-06,181.1
2019-11-07,182.94
2019-11-08,185.07
2019-11-11,184.07
2019-11-12,185.285
2019-11-13,184.795
2019-11-14,185.065
2019-11-15,187.02
2019-11-18,186.455
2019-11-19,184.895
2019-11-20,184.3
2019-11-21,183.13
2019-11-22,182.79
2019-11-25,182.8
