date,close
2014-06-13,142.6
2014-06-16,143.9
2014-06-17,145.9
2014-06-18,146.5
2014-06-19,148.1
2014-06-20,151.3
2014-06-23,148.1
2014-06-24,145.8
2014-06-25,145.6
2014-06-26,147.6
2014-06-27,148.5
2014-06-30,152.1
2014-07-01,154.3
2014-07-02,153.6
2014-07-03,154.6
2014-07-07,147.6
2014-07-08,143.5
2014-07-09,141.4
2014-07-10,143.1
2014-07-11,144.8
2014-07-14,144.2
2014-07-15,142.7
2014-07-16,145
2014-07-17,141.4
2014-07-18,142.2
2014-07-21,141.6
2014-07-22,146.1
2014-07-23,145
2014-07-24,142.6
2014-07-25,139.6
2014-07-28,138.7
2014-07-29,142.2
2014-07-30,140
2014-07-31,141.5
2014-08-01,138.5
2014-08-04,140.5
2014-08-05,139.5
2014-08-06,138.5
2014-08-07,136.8
2014-08-08,139.7
2014-08-11,139.8
2014-08-12,138.6
2014-08-13,142.2
2014-08-14,141.5
2014-08-15,139.1
2014-08-18,137.5
2014-08-19,135.6
2014-08-20,136.5
2014-08-21,133.7
2014-08-22,132.9
2014-08-25,138.4
2014-08-26,141.6
2014-08-27,140.4
2014-08-28,138.1
2014-08-29,138.1
2014-09-02,139
2014-09-03,137.75
2014-09-04,135.3
2014-09-05,135
2014-09-08,137.4
2014-09-09,136.9
2014-09-10,138.9
2014-09-11,140.9
2014-09-12,140.5
2014-09-15,139.9
2014-09-16,138.5
2014-09-17,140.5
2014-09-18,144.6
2014-09-19,140.4
2014-09-22,137.9
2014-09-23,135.5
2014-09-24,136
2014-09-25,132.5
2014-09-26,132.7
2014-09-29,108.6
2014-09-30,106
2014-10-01,106.6
2014-10-02,116
2014-10-03,112.2
2014-10-06,110.1
2014-10-07,110.2
2014-10-08,110.9
2014-10-09,110.1
2014-10-10,108.8
2014-10-13,111.5
2014-10-14,110.5
2014-10-15,110.55
2014-10-16,113.4
2014-10-17,113.2
2014-10-20,114.8
2014-10-21,115.2
2014-10-22,112.2
2014-10-23,113.3
2014-10-24,114.1
2014-10-27,111.4
2014-10-28,113.9
2014-10-29,113.5
2014-10-30,112.45
2014-10-31,114
2014-11-03,111.4
2014-11-04,112.3
2014-11-05,112.9
2014-11-06,112.3
2014-11-07,112.55
2014-11-10,116.3
2014-11-11,116.9
2014-11-12,118.6
2014-11-13,116.9
2014-11-14,114.8
2014-11-17,114.4
2014-11-18,119.3
2014-11-19,121.9
2014-11-20,123.1
2014-11-21,126
2014-11-24,130.1
2014-11-25,130.1
2014-11-26,129.5
2014-11-28,128.3
2014-12-01,128
2014-12-02,130.4
2014-12-03,130.9
2014-12-04,131.8
2014-12-05,135
2014-12-08,134
2014-12-09,140
2014-12-10,137.25
2014-12-11,137.1
2014-12-12,139.3
2014-12-15,137.5
2014-12-16,139.3
2014-12-17,142.45
2014-12-18,146.1
2014-12-19,151.1
2014-12-22,154.8
2014-12-23,154.1
2014-12-24,153.5
2014-12-26,153.8
2014-12-29,157.9
2014-12-30,154.5
2014-12-31,152.9
2015-01-02,149.7
2015-01-05,150.6
2015-01-06,148.4
2015-01-07,151.6
2015-01-08,150.1
2015-01-09,151
2015-01-12,151
2015-01-13,144.6
2015-01-14,143.5
2015-01-15,139.3
2015-01-16,141
2015-01-20,144.3
2015-01-21,142.7
2015-01-22,145.4
2015-01-23,144.7
2015-01-26,145.7
2015-01-27,145
2015-01-28,142.3
2015-01-29,143.7
2015-01-30,139.3
2015-02-02,142.3
2015-02-03,142.1
2015-02-04,141.3
2015-02-05,143.3
2015-02-06,142.7
2015-02-09,141.6
2015-02-10,143.8
2015-02-11,142.7
2015-02-12,143
2015-02-13,145.1
2015-02-17,144.7
2015-02-18,147.5
2015-02-19,148.9
2015-02-20,148.2
2015-02-23,146.2
2015-02-24,145.2
2015-02-25,146.2
2015-02-26,156.8
2015-02-27,157.7
2015-03-02,160
2015-03-03,159.3
2015-03-04,160.4
2015-03-05,159.6
2015-03-06,155.5
2015-03-09,155.3
2015-03-10,152.6
2015-03-11,153.5
2015-03-12,156.4
2015-03-13,160
2015-03-16,164
2015-03-17,163.5
2015-03-18,162.3
2015-03-19,164.2
2015-03-20,164.9
2015-03-23,166.5
2015-03-24,167.6
2015-03-25,165
2015-03-26,163.5
2015-03-27,165.2
2015-03-30,168.3
2015-03-31,170.7
2015-04-01,171
2015-04-02,173.6
2015-04-06,177.5
2015-04-07,177.3
2015-04-08,179.2
2015-04-09,174.9
2015-04-10,174.1
2015-04-13,176
2015-04-14,175.7
2015-04-15,175.5
2015-04-16,174.1
2015-04-17,173.6
2015-04-20,171
2015-04-21,169.2
2015-04-22,170.7
2015-04-23,171
2015-04-24,170.8
2015-04-27,169.5
2015-04-28,170.4
2015-04-29,165.1
2015-04-30,155.6
2015-05-01,153.7
2015-05-04,152.7
2015-05-05,150.4
2015-05-06,150.8
2015-05-07,153
2015-05-08,153
2015-05-11,153.2
2015-05-12,154.1
2015-05-13,154.9
2015-05-14,159.2
2015-05-15,161.3
2015-05-18,164.2
2015-05-19,166.1
2015-05-20,166.3
2015-05-21,166.3
2015-05-22,164.5
2015-05-26,161.7
2015-05-27,165.4
2015-05-28,165.9
2015-05-29,166.9
2015-06-01,169
2015-06-02,169.4
2015-06-03,168.5
2015-06-04,166.4
2015-06-05,166.5
2015-06-08,167
2015-06-09,164.4
2015-06-10,164.3
2015-06-11,165
2015-06-12,163.7
2015-06-15,163.7
2015-06-16,163.6
2015-06-17,163.5
2015-06-18,164.7
2015-06-19,163.7
2015-06-22,164.1
2015-06-23,163.1
2015-06-24,160.7
2015-06-25,160.2
2015-06-26,158
2015-06-29,153.7
2015-06-30,153.4
2015-07-01,148.3
2015-07-02,147.5
2015-07-06,149.3
2015-07-07,150.4
2015-07-08,148.5
2015-07-09,149.1
2015-07-10,151
2015-07-13,153.5
2015-07-14,154.4
2015-07-15,148
2015-07-16,146.8
2015-07-17,147.2
2015-07-20,143.2
2015-07-21,143.4
2015-07-22,149.6
2015-07-23,148.2
2015-07-24,145.9
2015-07-27,143.6
2015-07-28,142
2015-07-29,140.6
2015-07-30,141.1
2015-07-31,142.6
2015-08-03,140.6
2015-08-04,120.1
2015-08-05,120.5
2015-08-06,123.6
2015-08-07,129.7
2015-08-10,133
2015-08-11,133.2
2015-08-12,135.5
2015-08-13,135.4
2015-08-14,133.5
2015-08-17,130.5
2015-08-18,131.4
2015-08-19,131.2
2015-08-20,130.6
2015-08-21,131.5
2015-08-24,123.9
2015-08-25,123.5
2015-08-26,126.2
2015-08-27,129.6
2015-08-28,130.4
2015-08-31,129.8
2015-09-01,126.5
2015-09-02,125.8
2015-09-03,127.4
2015-09-04,129.1
2015-09-08,132.5
2015-09-09,130.6
2015-09-10,133.1
2015-09-11,133.4
2015-09-14,133
2015-09-15,134.4
2015-09-16,137.5
2015-09-17,140.1
2015-09-18,136.7
2015-09-21,137.6
2015-09-22,136.7
2015-09-23,132.8
2015-09-24,127
2015-09-25,117.1
2015-09-28,117.1
2015-09-29,118.8
2015-09-30,122.6
2015-10-01,120.8
2015-10-02,127.2
2015-10-05,128.6
2015-10-06,126
2015-10-07,130.1
2015-10-08,129.1
2015-10-09,132.2
2015-10-12,133
2015-10-13,131.4
2015-10-14,131
2015-10-15,135.6
2015-10-16,139
2015-10-19,139.8
2015-10-20,137.9
2015-10-21,137.8
2015-10-22,134.7
2015-10-23,138.1
2015-10-26,137.3
2015-10-27,87.7
2015-10-28,90.8
2015-10-29,87.8
2015-10-30,85.4
2015-11-02,90.2
2015-11-03,92.8
2015-11-04,95.6
2015-11-05,96
2015-11-06,97.3
2015-11-09,99
2015-11-10,96.9
2015-11-11,97.1
2015-11-12,93.1
2015-11-13,90.4
2015-11-16,89.4
2015-11-17,95
2015-11-18,100.1
2015-11-19,100.5
2015-11-20,96.5
2015-11-23,94.8
2015-11-24,99.9
2015-11-25,102.4
2015-11-27,103.5
2015-11-30,101.8
2015-12-01,101.5
2015-12-02,102.8
2015-12-03,102.7
2015-12-04,104
2015-12-07,102.9
2015-12-08,100.8
2015-12-09,100.3
2015-12-10,100.5
2015-12-11,95.1
2015-12-14,94.5
2015-12-15,94.2
2015-12-16,96
2015-12-17,95.2
2015-12-18,96.2
2015-12-21,96
2015-12-22,99.9
2015-12-23,100.9
2015-12-24,101.4
2015-12-28,101.9
2015-12-29,101.1
2015-12-30,100.1
2015-12-31,99
2016-01-04,98.3
2016-01-05,99.7
2016-01-06,97.1
2016-01-07,95.2
2016-01-08,93.8
2016-01-11,95
2016-01-12,96.7
2016-01-13,90.1
2016-01-14,90.9
2016-01-15,87.2
2016-01-19,83.7
2016-01-20,81.9
2016-01-21,80.4
2016-01-22,77.5
2016-01-25,76.6
2016-01-26,77.6
2016-01-27,78.4
2016-01-28,72.3
2016-01-29,71.3
2016-02-01,72.8
2016-02-02,73
2016-02-03,74.2
2016-02-04,75.3
2016-02-05,72.5
2016-02-08,66.6
2016-02-09,68.9
2016-02-10,70.9
2016-02-11,67.9
2016-02-12,69.2
2016-02-16,71.1
2016-02-17,71.7
2016-02-18,71.4
2016-02-19,73.75
2016-02-22,75.3
2016-02-23,75
2016-02-24,80.2
2016-02-25,81.1
2016-02-26,85.9
2016-02-29,86.2
2016-03-01,87.1
2016-03-02,88.8
2016-03-03,88.4
2016-03-04,92
2016-03-07,94
2016-03-08,93.1
2016-03-09,88.3
2016-03-10,86.3
2016-03-11,89
2016-03-14,89
2016-03-15,86.1
2016-03-16,84.5
2016-03-17,83.9
2016-03-18,85.3
2016-03-21,84.5
2016-03-22,87.2
2016-03-23,82.4
2016-03-24,80.7
2016-03-28,79.5
2016-03-29,84.5
2016-03-30,83
2016-03-31,83.6
2016-04-01,85.1
2016-04-04,86.5
2016-04-05,87.4
2016-04-06,89
2016-04-07,87.65
2016-04-08,90.2
2016-04-11,89.3
2016-04-12,89.9
2016-04-13,95.8
2016-04-14,98.9
2016-04-15,102.6
2016-04-18,106.4
2016-04-19,106.3
2016-04-20,107.1
2016-04-21,110.6
2016-04-22,113.9
2016-04-25,114.3
2016-04-26,112.4
2016-04-27,115.6
2016-04-28,114.8
2016-04-29,112.1
2016-05-02,115
2016-05-03,111.5
2016-05-04,110.4
2016-05-05,112.1
2016-05-06,113
2016-05-09,114.8
2016-05-10,117.3
2016-05-11,114.1
2016-05-12,111.1
2016-05-13,113.4
2016-05-16,115.4
2016-05-17,117.5
2016-05-18,119.9
2016-05-19,120
2016-05-20,122.5
2016-05-23,118.7
2016-05-24,120.3
2016-05-25,123.2
2016-05-26,127.3
2016-05-27,129.7
2016-05-31,126.7
2016-06-01,126.9
2016-06-02,130.6
2016-06-03,127.6
2016-06-06,129.7
2016-06-07,128.6
2016-06-08,129
2016-06-09,127.1
2016-06-10,126.8
2016-06-13,128.8
2016-06-14,127.2
2016-06-15,127
2016-06-16,126.4
2016-06-17,124.5
2016-06-20,124.6
2016-06-21,123.9
2016-06-22,124.1
2016-06-23,128
2016-06-24,123.8
2016-06-27,116.3
2016-06-28,119.1
2016-06-29,123.5
2016-06-30,124.6
2016-07-01,125.6
2016-07-05,128.3
2016-07-06,131.5
2016-07-07,137
2016-07-08,142.4
2016-07-11,140.8
2016-07-12,138.5
2016-07-13,139.2
2016-07-14,139.9
2016-07-15,138.8
2016-07-18,137.5
2016-07-19,135.7
2016-07-20,138.7
2016-07-21,137.8
2016-07-22,140
2016-07-25,138.1
2016-07-26,141
2016-07-27,142
2016-07-28,142.7
2016-07-29,141.1
2016-08-01,138.8
2016-08-02,137.5
2016-08-03,119.85
2016-08-04,122.4
2016-08-05,123.4
2016-08-08,121.9
2016-08-09,122.1
2016-08-10,119.3
2016-08-11,117.5
2016-08-12,116
2016-08-15,117.6
2016-08-16,116.4
2016-08-17,116
2016-08-18,118.5
2016-08-19,116.8
2016-08-22,119.5
2016-08-23,119.4
2016-08-24,115.5
2016-08-25,115.5
2016-08-26,116.3
2016-08-29,120.5
2016-08-30,121.4
2016-08-31,121.6
2016-09-01,122.2
2016-09-02,122.2
2016-09-06,123.6
2016-09-07,126
2016-09-08,127.7
2016-09-09,122.9
2016-09-12,126.5
2016-09-13,124.8
2016-09-14,123.5
2016-09-15,126.8
2016-09-16,128.8
2016-09-19,127.9
2016-09-20,128.9
2016-09-21,130.4
2016-09-22,132
2016-09-23,127.4
2016-09-26,127.3
2016-09-27,129.2
2016-09-28,129.3
2016-09-29,123.9
2016-09-30,128
2016-10-03,128
2016-10-04,127.8
2016-10-05,131
2016-10-06,131.2
2016-10-07,128.7
2016-10-10,132.1
2016-10-11,124.7
2016-10-12,123.4
2016-10-13,122.5
2016-10-14,119.8
2016-10-17,121.5
2016-10-18,124.8
2016-10-19,124.1
2016-10-20,125.3
2016-10-21,124.7
2016-10-24,124.9
2016-10-25,119.2
2016-10-26,113.4
2016-10-27,115.2
2016-10-28,106.4
2016-10-31,104.6
2016-11-01,99
2016-11-02,91.5
2016-11-03,85.4
2016-11-04,86.6
2016-11-07,89.2
2016-11-08,93.9
2016-11-09,95.8
2016-11-10,98.8
2016-11-11,102.2
2016-11-14,98.9
2016-11-15,98.4
2016-11-16,78.2
2016-11-17,78.1
2016-11-18,76.9
2016-11-21,75.7
2016-11-22,75.3
2016-11-23,78.5
2016-11-25,75.9
2016-11-28,74.5
2016-11-29,72.9
2016-11-30,73.5
2016-12-01,69.1
2016-12-02,70.5
2016-12-05,70
2016-12-06,68.8
2016-12-07,66.3
2016-12-08,67.5
2016-12-09,68.7
2016-12-12,68.9
2016-12-13,64.9
2016-12-14,66.9
2016-12-15,67
2016-12-16,70
2016-12-19,71.4
2016-12-20,72.25
2016-12-21,70.7
2016-12-22,70.75
2016-12-23,71.9
2016-12-27,52.7
2016-12-28,53.3
2016-12-29,59.2
2016-12-30,57.2
2017-01-03,55.1
2017-01-04,57.8
2017-01-05,61.9
2017-01-06,57.05
2017-01-09,60.2
2017-01-10,60.5
2017-01-11,59.9
2017-01-12,64.5
2017-01-13,64.9
2017-01-17,63.5
2017-01-18,64
2017-01-19,61.9
2017-01-20,61
2017-01-23,61.4
2017-01-24,61.8
2017-01-25,68.65
2017-01-26,66.8
2017-01-27,67.5
2017-01-30,65.4
2017-01-31,68.6
2017-02-01,70.1
2017-02-02,68.5
2017-02-03,69.2
2017-02-06,70.2
2017-02-07,70.4
2017-02-08,69.9
2017-02-09,69
2017-02-10,69
2017-02-13,67.6
2017-02-14,67.7
2017-02-15,67.4
2017-02-16,68.85
2017-02-17,67.6
2017-02-21,64.9
2017-02-22,65.3
2017-02-23,62.75
2017-02-24,64.5
2017-02-27,66.9
2017-02-28,66.1
2017-03-01,68.9
2017-03-02,70.4
2017-03-03,68.3
2017-03-06,65.4
2017-03-07,64.3
2017-03-08,64.6
2017-03-09,65.2
2017-03-10,66.15
2017-03-13,66.6
2017-03-14,64.4
2017-03-15,64.8
2017-03-16,68.4
2017-03-17,70.6
2017-03-20,71.2
2017-03-21,66.7
2017-03-22,65.1
2017-03-23,66.4
2017-03-24,69.3
2017-03-27,70.1
2017-03-28,70.8
2017-03-29,70.65
2017-03-30,71.2
2017-03-31,72.4
2017-04-03,71.8
2017-04-04,66.6
2017-04-05,67.2
2017-04-06,67.7
2017-04-07,66.5
2017-04-10,65
2017-04-11,65.2
2017-04-12,63.6
2017-04-13,63.1
2017-04-17,64.8
2017-04-18,64.6
2017-04-19,65.5
2017-04-20,68
2017-04-21,69.3
2017-04-24,69.6
2017-04-25,72
2017-04-26,73.9
2017-04-27,74.7
2017-04-28,74.9
2017-05-01,75.9
2017-05-02,74.2
2017-05-03,73.8
2017-05-04,73.4
2017-05-05,74.7
2017-05-08,69.7
2017-05-09,72.05
2017-05-10,73.3
2017-05-11,71
2017-05-12,69.9
2017-05-15,68.9
2017-05-16,68
2017-05-17,67.3
2017-05-18,42.6
2017-05-19,44.4
2017-05-22,45.6
2017-05-23,48
2017-05-24,49.4
2017-05-25,47.8
2017-05-26,47.3
2017-05-30,46.1
2017-05-31,48.2
2017-06-01,50.1
2017-06-02,49.5
2017-06-05,46.7
2017-06-06,47.7
2017-06-07,47.2
2017-06-08,49.5
2017-06-09,48.7
2017-06-12,50.1
2017-06-13,49.2
2017-06-14,47.4
2017-06-15,46.7
2017-06-16,46.4
2017-06-19,48.3
2017-06-20,46.2
2017-06-21,46.8
2017-06-22,47.4
2017-06-23,47.4
2017-06-26,50.3
2017-06-27,51
2017-06-28,49.8
2017-06-29,49.8
2017-06-30,48.6
2017-07-03,50.4
2017-07-05,49.3
2017-07-06,47.9
2017-07-07,48.1
2017-07-10,48.4
2017-07-11,48.9
2017-07-12,49.2
2017-07-13,49.6
2017-07-14,48.8
2017-07-17,49.7
2017-07-18,50.5
2017-07-19,51
2017-07-20,51.1
2017-07-21,50.2
2017-07-24,50.3
2017-07-25,53.1
2017-07-26,51.6
2017-07-27,49.9
2017-07-28,50.7
2017-07-31,48.9
2017-08-01,47.1
2017-08-02,48.6
2017-08-03,43.5
2017-08-04,41.75
2017-08-07,41.6
2017-08-08,43.1
2017-08-09,42.9
2017-08-10,41.7
2017-08-11,42.8
2017-08-14,42.8
2017-08-15,43.05
2017-08-16,43.7
2017-08-17,42.6
2017-08-18,42.6
2017-08-21,42.05
2017-08-22,42
2017-08-23,42.3
2017-08-24,42.8
2017-08-25,42.2
2017-08-28,43.3
2017-08-29,42.8
2017-08-30,41.7
2017-08-31,42.3
2017-09-01,43.1
2017-09-05,45.1
2017-09-06,45.6
2017-09-07,46
2017-09-08,45.7
2017-09-11,45.4
2017-09-12,43.7
2017-09-13,44.5
2017-09-14,44.5
2017-09-15,45
2017-09-18,44.9
2017-09-19,44.4
2017-09-20,42.9
2017-09-21,42.2
2017-09-22,41.5
2017-09-25,42.8
2017-09-26,42.9
2017-09-27,44
2017-09-28,44.6
2017-09-29,44.6
2017-10-02,48.5
2017-10-03,58.5
2017-10-04,56.5
2017-10-05,57
2017-10-06,57.3
2017-10-09,54.9
2017-10-10,52.6
2017-10-11,50.9
2017-10-12,51.6
2017-10-13,51
2017-10-16,50.6
2017-10-17,50
2017-10-18,51.2
2017-10-19,50.2
2017-10-20,51
2017-10-23,50.9
2017-10-24,50
2017-10-25,49.7
2017-10-26,50.1
2017-10-27,52.1
2017-10-30,53
2017-10-31,53
2017-11-01,55.7
2017-11-02,56.6
2017-11-03,59.2
2017-11-06,62.5
2017-11-07,57.6
2017-11-08,48.35
2017-11-09,49.9
2017-11-10,50.6
2017-11-13,48.6
2017-11-14,49.9
2017-11-15,51.3
2017-11-16,52.8
2017-11-17,52.6
2017-11-20,52.8
2017-11-21,52
2017-11-22,52.2
2017-11-24,52.9
2017-11-27,51.9
2017-11-28,54.8
2017-11-29,55.6
2017-11-30,54.9
2017-12-01,54.5
2017-12-04,51.1
2017-12-05,51.9
2017-12-06,53
2017-12-07,53.9
2017-12-08,56.7
2017-12-11,57.7
2017-12-12,56.9
2017-12-13,53.1
2017-12-14,52
2017-12-15,52.5
2017-12-18,51.5
2017-12-19,50.4
2017-12-20,50.9
2017-12-21,50.4
2017-12-22,50.3
2017-12-26,50.4
2017-12-27,50.9
2017-12-28,51.6
2017-12-29,53.5
2018-01-02,51.7
2018-01-03,52.1
2018-01-04,51.2
2018-01-05,51.2
2018-01-08,46.05
2018-01-09,48.05
2018-01-10,45.9
2018-01-11,46.2
2018-01-12,45.9
2018-01-16,42.5
2018-01-17,42.4
2018-01-18,42.7
2018-01-19,43.6
2018-01-22,43.3
2018-01-23,43.3
2018-01-24,43.4
2018-01-25,43.5
2018-01-26,43.35
2018-01-29,43.4
2018-01-30,43.1
2018-01-31,41.4
2018-02-01,42
2018-02-02,41.7
2018-02-05,41.4
2018-02-06,40.8
2018-02-07,41.5
2018-02-08,40.9
2018-02-09,41.3
2018-02-12,42.1
2018-02-13,40.4
2018-02-14,37.9
2018-02-15,42.1
2018-02-16,43.2
2018-02-20,43.3
2018-02-21,43.8
2018-02-22,40.45
2018-02-23,40.55
2018-02-26,43
2018-02-27,40.6
2018-02-28,40.2
2018-03-01,40.9
2018-03-02,41.5
2018-03-05,41.4
2018-03-06,41.3
2018-03-07,41.4
2018-03-08,42
2018-03-09,42.5
2018-03-12,44.9
2018-03-13,42.6
2018-03-14,40.7
2018-03-15,40.6
2018-03-16,42.4
2018-03-19,41.6
2018-03-20,42.1
2018-03-21,43.2
2018-03-22,42.4
2018-03-23,40.6
2018-03-26,41.7
2018-03-27,41.3
2018-03-28,40.8
2018-03-29,42.3
2018-04-02,41.1
2018-04-03,40.7
2018-04-04,41.9
2018-04-05,43.5
2018-04-06,42.2
2018-04-09,41.4
2018-04-10,42.3
2018-04-11,42.3
2018-04-12,41.8
2018-04-13,41.1
2018-04-16,40.7
2018-04-17,42.1
2018-04-18,43.1
2018-04-19,45.7
2018-04-20,46
2018-04-23,41.35
2018-04-24,41.8
2018-04-25,42.3
2018-04-26,42.6
2018-04-27,42.9
2018-04-30,43.1
2018-05-01,43.7
2018-05-02,43.6
2018-05-03,43.4
2018-05-04,43.4
2018-05-07,46.3
2018-05-08,44.8
2018-05-09,45.5
2018-05-10,47.3
2018-05-11,47
2018-05-14,48
2018-05-15,48.7
2018-05-16,50.7
2018-05-17,49.5
2018-05-18,49.6
2018-05-21,51.8
2018-05-22,53.5
2018-05-23,53.4
2018-05-24,54.4
2018-05-25,56.5
2018-05-29,55.9
2018-05-30,56.4
2018-05-31,56.1
2018-06-01,55.2
2018-06-04,56.2
2018-06-05,58.6
2018-06-06,60.4
2018-06-07,59.4
2018-06-08,60.9
2018-06-11,61.4
2018-06-12,63.8
2018-06-13,64
2018-06-14,66.3
2018-06-15,65.9
2018-06-18,63.4
2018-06-19,62.8
2018-06-20,64
2018-06-21,57.5
2018-06-22,58.6
2018-06-25,56.7
2018-06-26,58.5
2018-06-27,58.3
2018-06-28,58.2
2018-06-29,56.6
2018-07-02,56.5
2018-07-03,56
2018-07-05,57
2018-07-06,57.8
2018-07-09,57.1
2018-07-10,55.8
2018-07-11,55.9
2018-07-12,55.9
2018-07-13,55
2018-07-16,55.1
2018-07-17,53.9
2018-07-18,53.4
2018-07-19,53.4
2018-07-20,53
2018-07-23,52.3
2018-07-24,51.5
2018-07-25,51
2018-07-26,51.5
2018-07-27,49.2
2018-07-30,49.1
2018-07-31,50.9
2018-08-01,52.2
2018-08-02,51.4
2018-08-03,49.8
2018-08-06,48.8
2018-08-07,47.3
2018-08-08,47.1
2018-08-09,47.4
2018-08-10,29.9
2018-08-13,27.4
2018-08-14,24.3
2018-08-15,24.1
2018-08-16,26
2018-08-17,25.4
2018-08-20,25.4
2018-08-21,25.1
2018-08-22,25.3
2018-08-23,23.6
2018-08-24,24.3
2018-08-27,24.7
2018-08-28,24.7
2018-08-29,24
2018-08-30,22.9
2018-08-31,23
2018-09-04,22.9
2018-09-05,23.7
2018-09-06,23.6
2018-09-07,22
2018-09-10,19.8
2018-09-11,19.7
2018-09-12,19.5
2018-09-13,19
2018-09-14,19.6
2018-09-17,18.2
2018-09-18,17.2
2018-09-19,17.5
2018-09-20,17.7
2018-09-21,17.9
2018-09-24,18.3
2018-09-25,19.7
2018-09-26,18.4
2018-09-27,18.9
2018-09-28,19.1
2018-10-01,17.6
2018-10-02,17.2
2018-10-03,17.3
2018-10-04,17
2018-10-05,15.5
2018-10-08,15.1
2018-10-09,16
2018-10-10,17.7
2018-10-11,16.8
2018-10-12,16.5
2018-10-15,17.1
2018-10-16,17.6
2018-10-17,17.4
2018-10-18,16.8
2018-10-19,15.8
2018-10-22,15
2018-10-23,13.7
2018-10-24,13.9
2018-10-25,11.85
2018-10-26,12.3
2018-10-29,12
2018-10-30,12.2
2018-10-31,12.2
2018-11-01,12.6
2018-11-02,13.1
2018-11-05,13.7
2018-11-06,13.7
2018-11-07,13.3
2018-11-08,12.6
2018-11-09,11.1
2018-11-12,10.2
2018-11-13,10.1
2018-11-14,9.3
2018-11-15,10
2018-11-16,10.2
2018-11-19,9.438
2018-11-20,8.5
2018-11-21,8.8
2018-11-23,8.622
2018-11-26,8.688
2018-11-27,8.365
2018-11-28,8.731
2018-11-29,9.086
2018-11-30,8.512
2018-12-03,8.057
2018-12-04,6.826
2018-12-06,6.702
2018-12-07,7.097
2018-12-10,6.543
2018-12-11,6.574
2018-12-12,6.51
2018-12-13,6.834
2018-12-14,7.001
2018-12-17,6.502
2018-12-18,6.415
2018-12-19,6.05
2018-12-20,6.276
2018-12-21,6.223
2018-12-24,6.4
2018-12-26,6.9
2018-12-27,6.9
2018-12-28,7.445
2018-12-31,7.16
2019-01-02,7.4
2019-01-03,7.149
2019-01-04,6.038
2019-01-07,6.352
2019-01-08,6.8
2019-01-09,6.4
2019-01-10,6.4
2019-01-11,6.674
2019-01-14,6.542
2019-01-15,7.805
2019-01-16,7.6
2019-01-17,8.682
2019-01-18,8.299
2019-01-22,7.5
2019-01-23,7.301
2019-01-24,7.217
2019-01-25,7.531
2019-01-28,7.968
2019-01-29,7.703
2019-01-30,7.539
2019-01-31,7.575
2019-02-01,7.512
2019-02-04,7.42
2019-02-05,7.245
2019-02-06,6.172
2019-02-07,5.75
2019-02-08,5.6
2019-02-11,5.901
2019-02-12,5.971
2019-02-13,5.803
2019-02-14,5.371
2019-02-15,5.41
2019-02-19,5.458
2019-02-20,5.442
2019-02-21,5.247
2019-02-22,5.459
2019-02-25,5.6
2019-02-26,5.286
2019-02-27,5.501
2019-02-28,5.211
2019-03-01,5.933
2019-03-04,6.076
2019-03-05,6.6
2019-03-06,5.82
2019-03-07,5.81
2019-03-08,5.88
2019-03-11,6.05
2019-03-12,6.52
2019-03-13,6.76
2019-03-14,6.99
2019-03-15,7.08
2019-03-18,7.09
2019-03-19,7.13
2019-03-20,7.29
2019-03-21,7.17
2019-03-22,6.71
2019-03-25,6.62
2019-03-26,6.7
2019-03-27,6.62
2019-03-28,6.63
2019-03-29,6.61
2019-04-01,6.95
2019-04-02,7.03
2019-04-03,7.05
2019-04-04,7
2019-04-05,6.99
2019-04-08,6.89
2019-04-09,6.35
2019-04-10,6.48
2019-04-11,6.13
2019-04-12,6.35
2019-04-15,6.08
2019-04-16,6.05
2019-04-17,5.89
2019-04-18,5.79
2019-04-22,6.05
2019-04-23,6.05
2019-04-24,5.88
2019-04-25,5.8
2019-04-26,6.01
2019-04-29,6.3
2019-04-30,6.42
2019-05-01,6.4
2019-05-02,6.32
2019-05-03,6.5
2019-05-06,6.47
2019-05-07,6.42
2019-05-08,6.4
2019-05-09,6.7
2019-05-10,6.7
2019-05-13,6.62
2019-05-14,6.73
2019-05-15,6.7
2019-05-16,6.84
2019-05-17,6.95
2019-05-20,6.85
2019-05-21,6.84
2019-05-22,6.81
2019-05-23,6.64
2019-05-24,6.66
2019-05-28,6.65
2019-05-29,6.9
2019-05-30,7.12
2019-05-31,7.04
2019-06-03,6.79
2019-06-04,6.81
2019-06-05,6.8
2019-06-06,6.92
2019-06-07,7.15
2019-06-10,7.7
2019-06-11,7.5
2019-06-12,7.48
2019-06-13,7.41
2019-06-14,7.58
2019-06-17,7.7
2019-06-18,7.74
2019-06-19,7.95
2019-06-20,7.895
2019-06-21,7.81
2019-06-24,7.83
2019-06-25,7.845
2019-06-26,7.675
2019-06-27,7.21
2019-06-28,7.205
2019-07-01,7.32
2019-07-02,7.365
2019-07-03,7.51
2019-07-04,7.51
2019-07-05,7.45
2019-07-08,7.19
2019-07-09,7.05
2019-07-10,7.105
2019-07-11,6.56
2019-07-12,6.75
2019-07-15,6.44
2019-07-16,6.47
2019-07-17,6.795
2019-07-18,6.77
2019-07-19,6.715
2019-07-22,6.685
2019-07-23,6.725
2019-07-24,6.785
2019-07-25,6.56
2019-07-26,6.66
2019-07-29,6.66
2019-07-30,6.92
2019-07-31,6.87
2019-08-01,6.72
2019-08-02,6.84
2019-08-05,6.665
2019-08-06,6.455
2019-08-07,6.4
2019-08-08,6.18
2019-08-09,6.19
2019-08-12,6.475
2019-08-13,6.78
2019-08-14,6.4
2019-08-15,6.125
2019-08-16,6.095
2019-08-19,6.055
2019-08-20,5.745
2019-08-21,5.57
2019-08-22,5.28
2019-08-23,5.54
2019-08-26,5.38
2019-08-27,5.41
2019-08-28,5.3
2019-08-29,5.26
2019-08-30,5.37
2019-09-02,5.36
2019-09-03,5.19
2019-09-04,5.045
2019-09-05,4.93
2019-09-06,4.93
2019-09-09,4.73
2019-09-10,4.715
2019-09-11,4.765
2019-09-12,4.625
2019-09-13,4.455
2019-09-16,4.445
2019-09-17,4.355
2019-09-18,4.255
2019-09-19,3.92
2019-09-20,4.02
2019-09-23,4.095
2019-09-24,3.98
2019-09-25,3.88
2019-09-26,3.905
2019-09-27,3.865
2019-09-30,3.995
2019-10-01,3.76
2019-10-02,3.275
2019-10-03,3.555
2019-10-04,3.47
2019-10-07,3.495
2019-10-08,3.31
2019-10-09,3.41
2019-10-10,3.615
2019-10-11,3.7
2019-10-14,3.48
2019-10-15,3.495
2019-10-16,3.44
2019-10-17,3.65
2019-10-18,3.71
2019-10-21,3.845
2019-10-22,3.655
2019-10-23,3.685
2019-10-24,3.48
2019-10-25,3.58
2019-10-28,3.07
2019-10-29,2.955
2019-10-30,2.285
2019-10-31,2.375
2019-11-01,2.63
2019-11-04,2.73
2019-11-05,2.745
2019-11-06,2.695
2019-11-07,2.87
2019-11-08,3
2019-11-11,3
2019-11-12,3.055
2019-11-13,3.01
2019-11-14,2.85
2019-11-15,2.86
2019-11-18,2.85
2019-11-19,2.995
2019-11-20,3.095
2019-11-21,3.11
2019-11-22,2.995
2019-11-25,3.035
