date,close
2014-06-13,39.211
2014-06-16,39.5568
2014-06-17,39.4012
2014-06-18,40.4558
2014-06-19,40.4472
2014-06-20,40.1532
2014-06-23,39.9976
2014-06-24,40.2224
2014-06-25,40.3002
2014-06-26,40.4299
2014-06-27,40.5077
2014-06-30,40.8621
2014-07-01,40.3521
2014-07-02,39.8853
2014-07-03,39.4876
2014-07-07,39.5308
2014-07-08,39.7383
2014-07-09,39.6
2014-07-10,39.7988
2014-07-11,39.5308
2014-07-14,39.0468
2014-07-15,39.2456
2014-07-16,39.3061
2014-07-17,38.943
2014-07-18,39.3666
2014-07-21,39.2888
2014-07-22,39.3752
2014-07-23,39.211
2014-07-24,39.3234
2014-07-25,39.1937
2014-07-28,39.8507
2014-07-29,39.479
2014-07-30,38.8393
2014-07-31,37.9489
2014-08-01,37.8538
2014-08-04,37.3352
2014-08-05,36.8597
2014-08-06,36.3411
2014-08-07,36.7041
2014-08-08,37.5859
2014-08-11,37.413
2014-08-12,37.4043
2014-08-13,37.5599
2014-08-14,38.0613
2014-08-15,38.1823
2014-08-18,38.191
2014-08-19,38.675
2014-08-20,38.9776
2014-08-21,39.0554
2014-08-22,39.0381
2014-08-25,39.2024
2014-08-26,38.8566
2014-08-27,39.1937
2014-08-28,39.4012
2014-08-29,39.6692
2014-09-02,39.2802
2014-09-03,39.5568
2014-09-04,39.6432
2014-09-05,40.257
2014-09-08,40.0582
2014-09-09,39.6173
2014-09-10,39.3061
2014-09-11,39.2283
2014-09-12,38.5281
2014-09-15,38.5713
2014-09-16,39.3839
2014-09-17,39.4358
2014-09-18,39.1246
2014-09-19,39.2888
2014-09-22,38.822
2014-09-23,38.6318
2014-09-24,38.4849
2014-09-25,38.2688
2014-09-26,38.3811
2014-09-29,38.3033
2014-09-30,38.2947
2014-10-01,38.8047
2014-10-02,38.943
2014-10-03,39.3752
2014-10-06,39.3752
2014-10-07,39.6
2014-10-08,40.3434
2014-10-09,39.8507
2014-10-10,40.1619
2014-10-13,40.4299
2014-10-14,41.1128
2014-10-15,41.1128
2014-10-16,40.5768
2014-10-17,40.7843
2014-10-20,41.5536
2014-10-21,41.3289
2014-10-22,41.5536
2014-10-23,41.8475
2014-10-24,42.0031
2014-10-27,41.8821
2014-10-28,42.1674
2014-10-29,41.7957
2014-10-30,42.6601
2014-10-31,42.6601
2014-11-03,42.8589
2014-11-04,42.7984
2014-11-05,43.9395
2014-11-06,42.7898
2014-11-07,43.8271
2014-11-10,43.853
2014-11-11,43.6888
2014-11-12,42.7811
2014-11-13,42.591
2014-11-14,42.1847
2014-11-17,42.7379
2014-11-18,43.0318
2014-11-19,43.1701
2014-11-20,43.1874
2014-11-21,43.5332
2014-11-24,43.2306
2014-11-25,42.7984
2014-11-26,42.9108
2014-11-28,43.7752
2014-12-01,43.8185
2014-12-02,44.2593
2014-12-03,44.2766
2014-12-04,44.5705
2014-12-05,44.3717
2014-12-08,44.9077
2014-12-09,45.1583
2014-12-10,44.6483
2014-12-11,44.6743
2014-12-12,44.2075
2014-12-15,43.853
2014-12-16,44.0605
2014-12-17,44.8126
2014-12-18,45.7029
2014-12-19,45.556
2014-12-22,45.8672
2014-12-23,46.4637
2014-12-24,47.5615
2014-12-26,48.1234
2014-12-29,48.5383
2014-12-30,47.2589
2014-12-31,46.2648
2015-01-02,46.455
2015-01-05,46.0401
2015-01-06,46.066
2015-01-07,46.7403
2015-01-08,46.8181
2015-01-09,46.2303
2015-01-12,46.1006
2015-01-13,46.4031
2015-01-14,46.8094
2015-01-15,47.622
2015-01-16,48.0196
2015-01-20,47.8554
2015-01-21,48.2012
2015-01-22,48.0283
2015-01-23,48.2703
2015-01-26,48.2358
2015-01-27,48.2444
2015-01-28,48.1147
2015-01-29,48.7544
2015-01-30,48.0456
2015-02-02,48.5383
2015-02-03,48.4432
2015-02-04,48.0715
2015-02-05,48.6507
2015-02-06,46.4291
2015-02-09,45.945
2015-02-10,47.2676
2015-02-11,46.0833
2015-02-12,45.2102
2015-02-13,44.1037
2015-02-17,44.2853
2015-02-18,45.4177
2015-02-19,45.3831
2015-02-20,45.4177
2015-02-23,45.556
2015-02-24,46.1092
2015-02-25,45.4782
2015-02-26,45.171
2015-02-27,45.0926
2015-03-02,43.7856
2015-03-03,44.0906
2015-03-04,43.498
2015-03-05,44.047
2015-03-06,42.4873
2015-03-23,44.8486
2015-03-24,44.2736
2015-03-25,43.6723
2015-03-26,43.4893
2015-03-27,43.6723
2015-03-30,44.1254
2015-03-31,44.0209
2015-04-01,44.2038
2015-04-02,44.1254
2015-04-06,44.4827
2015-04-07,43.8379
2015-04-08,43.8989
2015-04-09,43.5329
2015-04-10,44.0034
2015-04-13,43.2889
2015-04-14,43.7682
2015-04-15,43.7769
2015-04-16,43.8727
2015-04-17,43.6113
2015-04-20,44.0034
2015-04-21,43.2279
2015-04-22,43.0972
2015-04-23,43.2366
2015-04-24,43.8204
2015-04-27,43.4109
2015-04-28,43.9076
2015-04-29,43.5765
2015-04-30,42.4873
2015-05-01,42.6005
2015-05-04,43.0101
2015-05-05,42.0167
2015-05-06,41.6333
2015-05-07,41.7553
2015-05-08,42.2259
2015-05-11,42.2694
2015-05-12,42.4437
2015-05-13,41.7728
2015-05-14,42.2956
2015-05-15,42.8445
2015-05-18,43.0798
2015-05-19,42.9752
2015-05-20,43.1059
2015-05-21,43.0711
2015-05-22,42.9491
2015-05-26,42.6964
2015-05-27,42.8612
2015-05-28,43.283
2015-05-29,43.283
2015-06-01,43.2303
2015-06-02,42.6151
2015-06-03,41.9032
2015-06-04,41.6923
2015-06-05,41.0332
2015-06-08,40.7168
2015-06-09,40.7168
2015-06-10,40.585
2015-06-11,41.0068
2015-06-12,40.5147
2015-06-15,40.4443
2015-06-16,41.0244
2015-06-17,41.2617
2015-06-18,41.5605
2015-06-19,41.0771
2015-06-22,40.9189
2015-06-23,40.2949
2015-06-24,40.0489
2015-06-25,39.9961
2015-06-26,40.418
2015-06-29,39.9874
2015-06-30,39.9083
2015-07-01,40.0489
2015-07-02,40.875
2015-07-06,40.6992
2015-07-07,41.4418
2015-07-08,41.4199
2015-07-09,41.0683
2015-07-10,41.2089
2015-07-13,41.3408
2015-07-14,41.5693
2015-07-15,41.9384
2015-07-16,42.4481
2015-07-17,42.1142
2015-07-20,41.8153
2015-07-21,41.7626
2015-07-22,42.0351
2015-07-23,41.6132
2015-07-24,41.4902
2015-07-27,42.0702
2015-07-28,42.2899
2015-07-29,42.4393
2015-07-30,42.8612
2015-07-31,43.6961
2015-08-03,43.8103
2015-08-04,43.1512
2015-08-05,43.2742
2015-08-06,43.5291
2015-08-07,43.7664
2015-08-10,43.9597
2015-08-11,44.3025
2015-08-12,44.7419
2015-08-13,44.6364
2015-08-14,44.9792
2015-08-17,45.3571
2015-08-18,45.234
2015-08-19,45.4186
2015-08-20,45.3659
2015-08-21,44.8561
2015-08-24,42.993
2015-08-25,41.5253
2015-08-26,42.2548
2015-08-27,42.703
2015-08-28,42.4393
2015-08-31,41.5165
2015-09-01,40.4883
2015-09-02,40.5586
2015-09-03,40.831
2015-09-04,40.1983
2015-09-08,40.8486
2015-09-09,40.3125
2015-09-10,40.3547
2015-09-11,40.8779
2015-09-14,41.0198
2015-09-15,41.419
2015-09-16,41.4278
2015-09-17,41.9777
2015-09-18,41.8802
2015-09-21,42.1374
2015-09-22,42.1019
2015-09-23,42.3236
2015-09-24,42.7227
2015-09-25,43.3613
2015-09-28,43.5387
2015-09-29,43.7249
2015-09-30,44.8957
2015-10-01,44.2748
2015-10-02,44.7981
2015-10-05,45.3214
2015-10-06,44.9134
2015-10-07,44.7183
2015-10-08,45.2948
2015-10-09,44.9045
2015-10-12,45.3923
2015-10-13,45.1883
2015-10-14,45.4544
2015-10-15,45.9688
2015-10-16,46.3325
2015-10-19,46.1019
2015-10-20,46.297
2015-10-21,46.1728
2015-10-22,46.7404
2015-10-23,45.8713
2015-10-26,46.164
2015-10-27,46.0575
2015-10-28,45.2061
2015-10-29,45.0198
2015-10-30,45.1795
2015-11-02,45.1972
2015-11-03,45.6318
2015-11-04,45.756
2015-11-05,45.6761
2015-11-06,43.4766
2015-11-09,43.7693
2015-11-10,44.6739
2015-11-11,45.2948
2015-11-12,44.5498
2015-11-13,44.1684
2015-11-16,45.2061
2015-11-17,44.0354
2015-11-18,44.8779
2015-11-19,45.2682
2015-11-20,45.6229
2015-11-23,45.348
2015-11-24,44.9223
2015-11-25,44.6651
2015-11-27,44.8158
2015-11-30,45.1883
2015-12-01,45.0287
2015-12-02,44.1063
2015-12-03,43.7427
2015-12-04,44.9045
2015-12-07,45.3923
2015-12-08,45.3303
2015-12-09,45.0908
2015-12-10,43.6935
2015-12-11,43.7382
2015-12-14,43.9886
2015-12-15,44.4626
2015-12-16,45.7414
2015-12-17,46.2511
2015-12-18,45.1154
2015-12-21,44.7756
2015-12-22,45.33
2015-12-23,46.1795
2015-12-24,46.269
2015-12-28,46.3584
2015-12-29,46.4121
2015-12-30,46.3673
2015-12-31,45.6698
2016-01-04,45.4999
2016-01-05,45.9202
2016-01-06,46.0186
2016-01-07,45.7324
2016-01-08,45.4463
2016-01-11,45.634
2016-01-12,45.7145
2016-01-13,45.8755
2016-01-14,46.3763
2016-01-15,45.956
2016-01-19,47.0291
2016-01-20,45.7414
2016-01-21,45.2316
2016-01-22,46.1259
2016-01-25,46.1795
2016-01-26,46.6356
2016-01-27,46.7876
2016-01-28,47.4762
2016-01-29,48.1111
2016-02-01,48.7997
2016-02-02,49.2558
2016-02-03,49.8281
2016-02-04,49.1217
2016-02-05,48.8802
2016-02-08,48.3705
2016-02-09,48.907
2016-02-10,49.1306
2016-02-11,48.2006
2016-02-12,47.8518
2016-02-16,48.1648
2016-02-17,47.8786
2016-02-18,48.7014
2016-02-19,48.8892
2016-02-22,49.4883
2016-02-23,49.9354
2016-02-24,50.2842
2016-02-25,50.6687
2016-02-26,48.9786
2016-02-29,48.956
2016-03-01,48.8929
2016-03-02,48.9921
2016-03-03,49.2536
2016-03-04,50.074
2016-03-07,50.5879
2016-03-08,51.1108
2016-03-09,51.2731
2016-03-10,50.9395
2016-03-11,50.9846
2016-03-14,51.1559
2016-03-15,51.1649
2016-03-16,51.7419
2016-03-17,52.1477
2016-03-18,51.5616
2016-03-21,51.7059
2016-03-22,51.8231
2016-03-23,52.2288
2016-03-24,52.1386
2016-03-28,52.0845
2016-03-29,52.7697
2016-03-30,52.6435
2016-03-31,52.5984
2016-04-01,53.0132
2016-04-04,52.8238
2016-04-05,51.4624
2016-04-06,51.2911
2016-04-07,51.21
2016-04-08,51.4354
2016-04-11,51.0567
2016-04-12,51.0928
2016-04-13,50.5518
2016-04-14,50.5789
2016-04-15,51.1379
2016-04-18,51.4985
2016-04-19,51.4264
2016-04-20,50.1642
2016-04-21,49.6052
2016-04-22,49.9478
2016-04-25,50.0379
2016-04-26,49.9117
2016-04-27,50.5338
2016-04-28,50.5428
2016-04-29,50.8854
2016-05-02,51.4534
2016-05-03,51.3633
2016-05-04,51.8501
2016-05-05,51.751
2016-05-06,51.5346
2016-05-09,51.9132
2016-05-10,51.8772
2016-05-11,51.7149
2016-05-12,51.9583
2016-05-13,51.7419
2016-05-16,51.7329
2016-05-17,50.3265
2016-05-18,49.3978
2016-05-19,49.8486
2016-05-20,49.506
2016-05-23,48.8298
2016-05-24,49.2896
2016-05-25,48.956
2016-05-26,49.8151
2016-05-27,50.006
2016-05-31,50.215
2016-06-01,50.4696
2016-06-02,50.315
2016-06-03,51.0514
2016-06-06,50.7423
2016-06-07,50.6332
2016-06-08,51.2059
2016-06-09,51.7059
2016-06-10,51.5241
2016-06-13,51.7422
2016-06-14,52.0786
2016-06-15,51.3786
2016-06-16,51.615
2016-06-17,51.7149
2016-06-20,51.6513
2016-06-21,51.8422
2016-06-22,51.5331
2016-06-23,51.2877
2016-06-24,52.0149
2016-06-27,53.2603
2016-06-28,53.024
2016-06-29,53.2512
2016-06-30,54.4511
2016-07-01,54.2784
2016-07-05,54.7693
2016-07-06,54.7602
2016-07-07,53.9512
2016-07-08,54.1512
2016-07-11,53.933
2016-07-12,52.6149
2016-07-13,53.0058
2016-07-14,52.4967
2016-07-15,52.6058
2016-07-18,52.8422
2016-07-19,52.8058
2016-07-20,52.6331
2016-07-21,52.7331
2016-07-22,53.5239
2016-07-25,53.5148
2016-07-26,53.0058
2016-07-27,52.4604
2016-07-28,52.6967
2016-07-29,53.1694
2016-08-01,53.6603
2016-08-02,53.1694
2016-08-03,52.3422
2016-08-04,52.3785
2016-08-05,51.5786
2016-08-08,51.6059
2016-08-09,51.6695
2016-08-10,51.7604
2016-08-11,51.9513
2016-08-12,52.0422
2016-08-15,51.2423
2016-08-16,50.4241
2016-08-17,50.6968
2016-08-18,51.3877
2016-08-19,50.4878
2016-08-22,50.5696
2016-08-23,50.2514
2016-08-24,50.3059
2016-08-25,50.2423
2016-08-26,49.1969
2016-08-29,49.4242
2016-08-30,48.8515
2016-08-31,49.0606
2016-09-01,48.7151
2016-09-02,49.4242
2016-09-06,49.9605
2016-09-07,49.8787
2016-09-08,50.006
2016-09-09,48.4061
2016-09-12,49.3696
2016-09-13,48.7333
2016-09-14,48.8151
2016-09-15,49.2872
2016-09-16,49.663
2016-09-19,50.0388
2016-09-20,49.8922
2016-09-21,50.8271
2016-09-22,51.1663
2016-09-23,51.5421
2016-09-26,51.6429
2016-09-27,50.7905
2016-09-28,50.6347
2016-09-29,50.1305
2016-09-30,49.663
2016-10-03,49.0764
2016-10-04,48.2239
2016-10-05,48.1781
2016-10-06,48.3247
2016-10-07,48.0681
2016-10-10,48.3614
2016-10-11,47.6464
2016-10-12,48.1964
2016-10-13,48.8564
2016-10-14,48.7464
2016-10-17,49.2689
2016-10-18,49.6172
2016-10-19,49.4705
2016-10-20,49.608
2016-10-21,49.498
2016-10-24,49.6172
2016-10-25,49.773
2016-10-26,49.7822
2016-10-27,49.4155
2016-10-28,49.6814
2016-10-31,50.4697
2016-11-01,49.5714
2016-11-02,48.9847
2016-11-03,48.9297
2016-11-04,48.7464
2016-11-07,49.7639
2016-11-08,50.4422
2016-11-09,48.7922
2016-11-10,47.9764
2016-11-11,47.6189
2016-11-14,47.3806
2016-11-15,48.0589
2016-11-16,47.6373
2016-11-17,47.8481
2016-11-18,47.4998
2016-11-21,47.8481
2016-11-22,48.0773
2016-11-23,47.4264
2016-11-25,48.2056
2016-11-28,49.3514
2016-11-29,49.2689
2016-11-30,47.3165
2016-12-01,46.8398
2016-12-02,47.3715
2016-12-05,47.6006
2016-12-06,47.6739
2016-12-07,48.5539
2016-12-08,48.8564
2016-12-09,49.278
2016-12-12,49.7639
2016-12-13,50.0022
2016-12-14,49.0457
2016-12-15,49.6094
2016-12-16,50.4319
2016-12-19,50.894
2016-12-20,51.0696
2016-12-21,50.7831
2016-12-22,51.236
2016-12-23,51.2544
2016-12-27,51.1805
2016-12-28,50.5706
2016-12-29,51.3561
2016-12-30,51.0419
2017-01-03,50.9033
2017-01-04,51.0789
2017-01-05,51.0881
2017-01-06,51.0696
2017-01-09,50.4319
2017-01-10,50.1639
2017-01-11,50.8848
2017-01-12,51.1158
2017-01-13,50.968
2017-01-17,51.4947
2017-01-18,51.3099
2017-01-19,50.894
2017-01-20,50.8293
2017-01-23,50.589
2017-01-24,50.4135
2017-01-25,50.1824
2017-01-26,50.395
2017-01-27,50.1362
2017-01-30,50.3026
2017-01-31,51.1251
2017-02-01,50.5521
2017-02-02,51.1528
2017-02-03,51.4947
2017-02-06,51.4578
2017-02-07,51.5502
2017-02-08,52.2063
2017-02-09,51.7997
2017-02-10,52.1416
2017-02-13,52.2063
2017-02-14,51.7073
2017-02-15,51.5317
2017-02-16,52.0215
2017-02-17,51.8921
2017-02-21,52.5298
2017-02-22,53.2322
2017-02-23,53.7127
2017-02-24,54.5537
2017-02-27,54.2672
2017-02-28,54.6539
2017-03-01,54.216
2017-03-02,54.5887
2017-03-03,54.2998
2017-03-06,54.3651
2017-03-07,54.5607
2017-03-08,53.5917
2017-03-09,53.4613
2017-03-10,53.7688
2017-03-13,54.0762
2017-03-14,54.3464
2017-03-15,55.0918
2017-03-16,54.5421
2017-03-17,54.9054
2017-03-20,54.4862
2017-03-21,55.3806
2017-03-22,55.6322
2017-03-23,55.5949
2017-03-24,55.9117
2017-03-27,55.4831
2017-03-28,55.4272
2017-03-29,55.0359
2017-03-30,54.6166
2017-03-31,54.7657
2017-04-03,54.8682
2017-04-04,54.8402
2017-04-05,55.3527
2017-04-06,55.4738
2017-04-07,55.3433
2017-04-10,55.2315
2017-04-11,55.1663
2017-04-12,55.7906
2017-04-13,55.5483
2017-04-17,56.1726
2017-04-18,56.0328
2017-04-19,55.567
2017-04-20,55.3806
2017-04-21,55.716
2017-04-24,55.9303
2017-04-25,55.9024
2017-04-26,55.6601
2017-04-27,55.6881
2017-04-28,55.3433
2017-05-01,55.1011
2017-05-02,55.1756
2017-05-03,55.0732
2017-05-04,55.4272
2017-05-05,55.4831
2017-05-08,55.6788
2017-05-09,55.2968
2017-05-10,55.185
2017-05-11,55.4179
2017-05-12,55.7906
2017-05-15,56.0421
2017-05-16,55.5576
2017-05-17,56.0794
2017-05-18,56.126
2017-05-19,56.0049
2017-05-22,56.5918
2017-05-23,56.9645
2017-05-24,57.2161
2017-05-25,57.6167
2017-05-26,57.6496
2017-05-30,57.7247
2017-05-31,58.2786
2017-06-01,58.5415
2017-06-02,58.5603
2017-06-05,58.4852
2017-06-06,58.3631
2017-06-07,58.7575
2017-06-08,58.3162
2017-06-09,58.4946
2017-06-12,58.4476
2017-06-13,58.3631
2017-06-14,58.6354
2017-06-15,58.795
2017-06-16,59.3772
2017-06-19,58.9547
2017-06-20,59.011
2017-06-21,58.8889
2017-06-22,58.4007
2017-06-23,58.4476
2017-06-26,58.8326
2017-06-27,58.2035
2017-06-28,57.49
2017-06-29,56.9923
2017-06-30,57.0017
2017-07-03,56.72
2017-07-05,56.4008
2017-07-06,56.3257
2017-07-07,56.4008
2017-07-10,56.2506
2017-07-11,56.1661
2017-07-12,56.3539
2017-07-13,56.2412
2017-07-14,56.5416
2017-07-17,56.6355
2017-07-18,56.7482
2017-07-19,56.9642
2017-07-20,57.4712
2017-07-21,57.781
2017-07-24,57.0299
2017-07-25,56.7858
2017-07-26,57.2177
2017-07-27,57.0017
2017-07-28,56.8327
2017-07-31,57.0768
2017-08-01,57.8186
2017-08-02,57.3303
2017-08-03,58.1002
2017-08-04,57.8186
2017-08-07,58.2599
2017-08-08,58.504
2017-08-09,57.9594
2017-08-10,58.4195
2017-08-11,58.0815
2017-08-14,58.3725
2017-08-15,58.7481
2017-08-16,58.9641
2017-08-17,58.6448
2017-08-18,59.2082
2017-08-21,59.1237
2017-08-22,59.0673
2017-08-23,59.2833
2017-08-24,59.1237
2017-08-25,59.2269
2017-08-28,59.4053
2017-08-29,59.4241
2017-08-30,59.3772
2017-08-31,59.1518
2017-09-01,58.7481
2017-09-05,59.1049
2017-09-06,58.7857
2017-09-07,59.3396
2017-09-08,59.6119
2017-09-11,60.194
2017-09-12,58.8138
2017-09-13,58.5603
2017-09-14,59.6517
2017-09-15,59.0204
2017-09-18,58.3628
2017-09-19,58.4385
2017-09-20,58.1642
2017-09-21,58.1263
2017-09-22,57.4357
2017-09-25,58.1547
2017-09-26,58.0317
2017-09-27,57.1708
2017-09-28,57.3032
2017-09-29,57.1803
2017-10-02,57.1235
2017-10-03,56.9627
2017-10-04,57.5114
2017-10-05,57.36
2017-10-06,57.1235
2017-10-09,57.0667
2017-10-10,57.3884
2017-10-11,57.9939
2017-10-12,58.3439
2017-10-13,58.325
2017-10-16,57.8993
2017-10-17,58.4101
2017-10-18,58.1263
2017-10-19,58.7129
2017-10-20,58.7791
2017-10-23,59.0062
2017-10-24,59.0535
2017-10-25,58.9778
2017-10-26,58.8832
2017-10-27,59.4035
2017-10-30,59.1197
2017-10-31,59.2616
2017-11-01,59.2994
2017-11-02,59.8198
2017-11-03,60.1131
2017-11-06,60.2644
2017-11-07,61.0402
2017-11-08,61.1443
2017-11-09,61.1916
2017-11-10,60.6145
2017-11-13,61.2673
2017-11-14,62.2606
2017-11-15,61.4943
2017-11-16,61.3903
2017-11-17,60.7469
2017-11-20,60.3969
2017-11-21,60.482
2017-11-22,60.3685
2017-11-24,60.8605
2017-11-27,60.9456
2017-11-28,61.0781
2017-11-29,61.1254
2017-11-30,61.3524
2017-12-01,61.9011
2017-12-04,61.9484
2017-12-05,61.3808
2017-12-06,61.5984
2017-12-07,61.4092
2017-12-08,61.7025
2017-12-11,62.1566
2017-12-12,60.7469
2017-12-13,61.57
2017-12-14,61.2862
2017-12-15,61.5864
2017-12-18,60.9098
2017-12-19,59.6517
2017-12-20,59.2991
2017-12-21,59.0704
2017-12-22,59.4421
2017-12-26,59.0513
2017-12-27,59.5945
2017-12-28,59.9948
2017-12-29,60.214
2018-01-02,60.1854
2018-01-03,59.6517
2018-01-04,58.813
2018-01-05,58.9179
2018-01-08,59.3277
2018-01-09,58.8798
2018-01-10,58.4413
2018-01-11,58.632
2018-01-12,58.4699
2018-01-16,58.0887
2018-01-17,58.7559
2018-01-18,57.9553
2018-01-19,57.9362
2018-01-22,57.9076
2018-01-23,58.2507
2018-01-24,58.2603
2018-01-25,61.5388
2018-01-26,61.0622
2018-01-29,59.5088
2018-01-30,59.6231
2018-01-31,60.1283
2018-02-01,57.3358
2018-02-02,56.5638
2018-02-05,55.5917
2018-02-06,54.8388
2018-02-07,54.2193
2018-02-08,53.4759
2018-02-09,54.3432
2018-02-12,54.8293
2018-02-13,54.915
2018-02-14,54.8769
2018-02-15,55.8204
2018-02-16,56.3446
2018-02-20,55.4392
2018-02-21,54.6672
2018-02-22,54.7816
2018-02-23,56.6782
2018-02-26,56.0587
2018-02-27,54.6958
2018-02-28,54.3241
2018-03-01,53.8953
2018-03-02,54.4195
2018-03-05,55.5012
2018-03-06,54.5012
2018-03-07,54.1262
2018-03-08,54.6839
2018-03-09,55.0397
2018-03-12,54.8666
2018-03-13,54.5012
2018-03-14,54.9916
2018-03-15,55.3666
2018-03-16,56.0204
2018-03-19,55.8089
2018-03-20,55.4531
2018-03-21,55.2512
2018-03-22,55.2993
2018-03-23,54.6069
2018-03-26,55.3185
2018-03-27,56.3378
2018-03-28,56.2224
2018-03-29,56.6551
2018-04-02,56.4147
2018-04-03,57.0205
2018-04-04,57.2416
2018-04-05,57.7032
2018-04-06,57.357
2018-04-09,57.4147
2018-04-10,57.0301
2018-04-11,57.1262
2018-04-12,56.3858
2018-04-13,56.7608
2018-04-16,57.3859
2018-04-17,57.9243
2018-04-18,57.5974
2018-04-19,57.5589
2018-04-20,56.9435
2018-04-23,56.9339
2018-04-24,57.1551
2018-04-25,57.0878
2018-04-26,57.7128
2018-04-27,58.2897
2018-04-30,57.9339
2018-05-01,57.4532
2018-05-02,57.3955
2018-05-03,56.607
2018-05-04,56.7705
2018-05-07,56.4724
2018-05-08,55.1166
2018-05-09,54.8089
2018-05-10,55.7224
2018-05-11,55.8089
2018-05-14,55.3185
2018-05-15,55.1839
2018-05-16,55.232
2018-05-17,54.905
2018-05-18,55.1166
2018-05-21,55.2608
2018-05-22,55.5589
2018-05-23,54.8459
2018-05-24,54.9332
2018-05-25,54.5743
2018-05-29,55.1078
2018-05-30,55.4279
2018-05-31,55.3697
2018-06-01,54.1281
2018-06-04,53.8371
2018-06-05,53.3424
2018-06-06,52.0328
2018-06-07,51.994
2018-06-08,51.9552
2018-06-11,51.2859
2018-06-12,52.0716
2018-06-13,51.8291
2018-06-14,52.3723
2018-06-15,52.9931
2018-06-18,53.4394
2018-06-19,54.0893
2018-06-20,54.1378
2018-06-21,54.0311
2018-06-22,54.3512
2018-06-25,55.6122
2018-06-26,55.8257
2018-06-27,56.2525
2018-06-28,56.5338
2018-06-29,56.8539
2018-07-02,57.2516
2018-07-03,57.7366
2018-07-05,57.9306
2018-07-06,58.503
2018-07-09,56.7084
2018-07-10,56.9606
2018-07-11,57.4747
2018-07-12,57.368
2018-07-13,57.368
2018-07-16,57.271
2018-07-17,57.1061
2018-07-18,56.7666
2018-07-19,57.3874
2018-07-20,56.9897
2018-07-23,56.7084
2018-07-24,57.0576
2018-07-25,57.562
2018-07-26,58.5515
2018-07-27,58.2798
2018-07-30,57.9694
2018-07-31,58.9007
2018-08-01,57.95
2018-08-02,58.2022
2018-08-03,59.1044
2018-08-06,59.2596
2018-08-07,59.1626
2018-08-08,59.1238
2018-08-09,59.3081
2018-08-10,59.5118
2018-08-13,59.8998
2018-08-14,59.9483
2018-08-15,60.4721
2018-08-16,61.1027
2018-08-17,61.3452
2018-08-20,61.2288
2018-08-21,60.928
2018-08-22,60.4915
2018-08-23,60.5594
2018-08-24,60.8795
2018-08-27,60.346
2018-08-28,59.9871
2018-08-29,60.3169
2018-08-30,60.7631
2018-08-31,60.5594
2018-09-04,60.5497
2018-09-05,61.481
2018-09-06,61.6071
2018-09-07,60.928
2018-09-10,61.4034
2018-09-11,61.3743
2018-09-12,61.3161
2018-09-13,61.7041
2018-09-14,61.6265
2018-09-17,61.8593
2018-09-18,61.7332
2018-09-19,60.1714
2018-09-20,60.411
2018-09-21,60.7924
2018-09-24,60.1274
2018-09-25,59.345
2018-09-26,58.8756
2018-09-27,59.2276
2018-09-28,60.0883
2018-10-01,60.1665
2018-10-02,60.7924
2018-10-03,59.746
2018-10-04,60.1861
2018-10-05,61.0272
2018-10-08,61.4477
2018-10-09,61.966
2018-10-10,61.6531
2018-10-11,60.323
2018-10-12,60.1665
2018-10-15,60.0198
2018-10-16,60.5968
2018-10-17,61.1152
2018-10-18,60.812
2018-10-19,61.9367
2018-10-22,61.8096
2018-10-23,61.9074
2018-10-24,63.4428
2018-10-25,62.2692
2018-10-26,61.389
2018-10-29,62.5235
2018-10-30,62.6213
2018-10-31,61.8682
2018-11-01,61.3108
2018-11-02,60.8218
2018-11-05,61.5357
2018-11-06,62.0736
2018-11-07,62.9636
2018-11-08,63.1201
2018-11-09,63.7069
2018-11-12,64.0394
2018-11-13,64.323
2018-11-14,63.9905
2018-11-15,64.7436
2018-11-16,65.5651
2018-11-19,65.8976
2018-11-20,66.1519
2018-11-21,64.9587
2018-11-23,65.3499
2018-11-26,65.3304
2018-11-27,65.9661
2018-11-28,65.9465
2018-11-29,65.5944
2018-11-30,66.8365
2018-12-03,67.2277
2018-12-04,67.4331
2018-12-06,67.6189
2018-12-07,67.9318
2018-12-10,68.1079
2018-12-11,68.6262
2018-12-12,67.922
2018-12-13,68.6849
2018-12-14,68.235
2018-12-17,66.25
2018-12-18,66.0628
2018-12-19,66.2894
2018-12-20,66.1712
2018-12-21,65.4816
2018-12-24,62.4375
2018-12-26,63.2847
2018-12-27,63.8167
2018-12-28,63.7083
2018-12-31,64.0728
2019-01-02,62.5459
2019-01-03,62.5065
2019-01-04,63.137
2019-01-07,62.9793
2019-01-08,64.1319
2019-01-09,63.7871
2019-01-10,65.0678
2019-01-11,65.0087
2019-01-14,64.6048
2019-01-15,65.4225
2019-01-16,65.6687
2019-01-17,66.2795
2019-01-18,66.6637
2019-01-22,66.4864
2019-01-23,67.2844
2019-01-24,67.442
2019-01-25,66.2795
2019-01-28,66.1121
2019-01-29,66.3485
2019-01-30,66.5751
2019-01-31,68.3778
2019-02-01,68.1119
2019-02-04,67.9936
2019-02-05,68.2793
2019-02-06,67.9936
2019-02-07,68.9788
2019-02-08,69.0083
2019-02-11,69.1068
2019-02-12,69.2349
2019-02-13,69.0182
2019-02-14,69.0576
2019-02-15,69.1561
2019-02-19,69.3531
2019-02-20,69.2251
2019-02-21,69.4812
2019-02-22,69.2546
2019-02-25,68.3384
2019-02-26,68.6241
2019-02-27,68.6241
2019-02-28,68.7719
2019-03-01,68.7029
2019-03-04,68.4696
2019-03-05,68.0924
2019-03-06,68.5689
2019-03-07,68.8866
2019-03-08,69.1745
2019-03-11,69.7701
2019-03-12,69.9985
2019-03-13,70.0878
2019-03-14,70.4055
2019-03-15,71.2096
2019-03-18,70.743
2019-03-19,69.6907
2019-03-20,69.7106
2019-03-21,70.3459
2019-03-22,71.1699
2019-03-25,71.2493
2019-03-26,71.428
2019-03-27,70.7132
2019-03-28,69.8297
2019-03-29,70.4353
2019-04-01,70.1672
2019-04-02,70.2169
2019-04-03,69.9985
2019-04-04,69.8495
2019-04-05,70.5643
2019-04-08,70.1077
2019-04-09,70.2665
2019-04-10,69.7999
2019-04-11,70.0878
2019-04-12,70.1672
2019-04-15,70.2665
2019-04-16,69.6411
2019-04-17,69.7006
2019-04-18,69.4524
2019-04-22,69.4822
2019-04-23,69.8892
2019-04-24,70.3459
2019-04-25,70.3261
2019-04-26,70.5048
2019-04-29,70.0679
2019-04-30,71.1401
2019-05-01,70.614
2019-05-02,71.0011
2019-05-03,71.5571
2019-05-06,71.3486
2019-05-07,70.9912
2019-05-08,69.8892
2019-05-09,69.9389
2019-05-10,71.2394
2019-05-13,72.4605
2019-05-14,72.0634
2019-05-15,72.0733
2019-05-16,72.5994
2019-05-17,72.9965
2019-05-20,73.0958
2019-05-21,73.205
2019-05-22,73.74
2019-05-23,74.84
2019-05-24,74.88
2019-05-28,74.13
2019-05-29,72.89
2019-05-30,73.17
2019-05-31,73.84
2019-06-03,74.83
2019-06-04,74.39
2019-06-05,76.32
2019-06-06,76.85
2019-06-07,76.3
2019-06-10,76.02
2019-06-11,75.48
2019-06-12,76.51
2019-06-13,76.43
2019-06-14,77.505
2019-06-17,76.67
2019-06-18,76.115
2019-06-19,77.295
2019-06-20,77.27
2019-06-21,77.42
2019-06-24,77.27
2019-06-25,77.11
2019-06-26,75.54
2019-06-27,75.39
2019-06-28,75.49
2019-07-01,75.405
2019-07-02,76.77
2019-07-03,77.15
2019-07-04,77.15
2019-07-05,76.985
2019-07-08,77.055
2019-07-09,76.86
2019-07-10,77.61
2019-07-11,77.82
2019-07-12,77.375
2019-07-15,77.8
2019-07-16,77.11
2019-07-17,77.395
2019-07-18,78.3
2019-07-19,76.855
2019-07-22,76.83
2019-07-23,76.765
2019-07-24,76.39
2019-07-25,76.115
2019-07-26,76.2
2019-07-29,76.8
2019-07-30,76.445
2019-07-31,75.74
2019-08-01,76.475
2019-08-02,76.605
2019-08-05,76.61
2019-08-06,77.47
2019-08-07,78.04
2019-08-08,78.34
2019-08-09,78.52
2019-08-12,77.905
2019-08-13,77.885
2019-08-14,77.19
2019-08-15,78.86
2019-08-16,78.635
2019-08-19,78.985
2019-08-20,79.05
2019-08-21,79.5
2019-08-22,79.83
2019-08-23,78.93
2019-08-26,79.87
2019-08-27,80.585
2019-08-28,80.31
2019-08-29,80.355
2019-08-30,80.21
2019-09-02,80.12
2019-09-03,81.34
2019-09-04,82.5
2019-09-05,81.93
2019-09-06,82.25
2019-09-09,81.95
2019-09-10,81.75
2019-09-11,81.94
2019-09-12,82.91
2019-09-13,82.39
2019-09-16,82.41
2019-09-17,83.02
2019-09-18,83.33
2019-09-19,83.24
2019-09-20,83.31
2019-09-23,83.55
2019-09-24,84.67
2019-09-25,84.59
2019-09-26,85.18
2019-09-27,85.255
2019-09-30,85.58
2019-10-01,85.35
2019-10-02,84.415
2019-10-03,84.52
2019-10-04,85.67
2019-10-07,85.47
2019-10-08,84.93
2019-10-09,86.16
2019-10-10,85.43
2019-10-11,85.645
2019-10-14,84.765
2019-10-15,83.86
2019-10-16,84.56
2019-10-17,85.13
2019-10-18,85.57
2019-10-21,86.1
2019-10-22,85.83
2019-10-23,86.03
2019-10-24,86.235
2019-10-25,85.38
2019-10-28,83.83
2019-10-29,82.935
2019-10-30,83.105
2019-10-31,83.72
2019-11-01,82.795
2019-11-04,81.42
2019-11-05,81.135
2019-11-06,81.34
2019-11-07,79.38
2019-11-08,79.36
2019-11-11,79.245
2019-11-12,79.26
2019-11-13,80.825
2019-11-14,80.84
2019-11-15,81.385
2019-11-18,82.075
2019-11-19,82.29
2019-11-20,82.51
2019-11-21,82.16
2019-11-22,82.295
2019-11-25,82.1
