date,close
2014-06-13,14.28
2014-06-16,14.86
2014-06-17,14.67
2014-06-18,14.72
2014-06-19,14.72
2014-06-20,14.78
2014-06-23,15.93
2014-06-24,15.79
2014-06-25,15.81
2014-06-26,15.9
2014-06-27,16.21
2014-06-30,16.18
2014-07-01,16.07
2014-07-02,15.91
2014-07-03,15.91
2014-07-07,14.99
2014-07-08,14.1
2014-07-09,14.46
2014-07-10,14.42
2014-07-11,14.27
2014-07-14,13.98
2014-07-15,13.16
2014-07-16,13.17
2014-07-17,12.87
2014-07-18,13.32
2014-07-21,13.13
2014-07-22,13.32
2014-07-23,14.06
2014-07-24,13.92
2014-07-25,14.18
2014-07-28,14
2014-07-29,14.11
2014-07-30,14.74
2014-07-31,14.7
2014-08-01,14.06
2014-08-04,14.14
2014-08-05,13.99
2014-08-06,13.6
2014-08-07,12.82
2014-08-08,12.06
2014-08-11,12.65
2014-08-12,12.87
2014-08-13,13.22
2014-08-14,13.59
2014-08-15,13.66
2014-08-18,13.25
2014-08-19,12.84
2014-08-20,12.31
2014-08-21,12.3
2014-08-22,12.51
2014-08-25,12.84
2014-08-26,12.95
2014-08-27,12.89
2014-08-28,12.36
2014-08-29,12.94
2014-09-02,13.26
2014-09-03,12.81
2014-09-04,12.58
2014-09-05,12.61
2014-09-08,13.2
2014-09-09,12.6
2014-09-10,13.02
2014-09-11,12.53
2014-09-12,12.44
2014-09-15,11.88
2014-09-16,12.02
2014-09-17,12.39
2014-09-18,12.4
2014-09-19,12
2014-09-22,11.54
2014-09-23,11.35
2014-09-24,11.19
2014-09-25,10.79
2014-09-26,10.66
2014-09-29,10.57
2014-09-30,10.38
2014-10-01,10.16
2014-10-02,10.27
2014-10-03,10.29
2014-10-06,9.585
2014-10-07,9.38
2014-10-08,9.85
2014-10-09,9.35
2014-10-10,8.92
2014-10-13,8.81
2014-10-14,9.2
2014-10-15,9.46
2014-10-16,10.225
2014-10-17,10.08
2014-10-20,10.56
2014-10-21,10.19
2014-10-22,10.03
2014-10-23,10.33
2014-10-24,11.11
2014-10-27,11.04
2014-10-28,12.03
2014-10-29,11.97
2014-10-30,12.12
2014-10-31,12.01
2014-11-03,12.28
2014-11-04,12.17
2014-11-05,11.75
2014-11-06,12.46
2014-11-07,11.79
2014-11-10,12.16
2014-11-11,12.55
2014-11-12,12.82
2014-11-13,12.17
2014-11-14,11.81
2014-11-17,11.56
2014-11-18,11.74
2014-11-19,11.71
2014-11-20,11.99
2014-11-21,12.58
2014-11-24,12.99
2014-11-25,12.69
2014-11-26,12.89
2014-11-28,13.03
2014-12-01,12.65
2014-12-02,12.8
2014-12-03,12.65
2014-12-04,12.27
2014-12-05,12.3
2014-12-08,11.99
2014-12-09,12.72
2014-12-10,12.65
2014-12-11,12.89
2014-12-12,12.72
2014-12-15,12.45
2014-12-16,12.44
2014-12-17,12.81
2014-12-18,12.73
2014-12-19,12.25
2014-12-22,11.91
2014-12-23,13.58
2014-12-24,14.69
2014-12-26,15.01
2014-12-29,14.83
2014-12-30,14.51
2014-12-31,14.32
2015-01-02,14.58
2015-01-05,14.38
2015-01-06,13.6
2015-01-07,13.95
2015-01-08,13.95
2015-01-09,12.42
2015-01-12,12.13
2015-01-13,12.09
2015-01-14,11.99
2015-01-15,11.78
2015-01-16,11.83
2015-01-20,12.05
2015-01-21,11.66
2015-01-22,11.91
2015-01-23,12.23
2015-01-26,12.2
2015-01-27,11.93
2015-01-28,11.47
2015-01-29,11.27
2015-01-30,11.13
2015-02-02,10.93
2015-02-03,11.06
2015-02-04,11.03
2015-02-05,11.57
2015-02-06,11.63
2015-02-09,12.01
2015-02-10,12.24
2015-02-11,12.13
2015-02-12,12.37
2015-02-13,12.37
2015-02-17,13.13
2015-02-18,13.1
2015-02-19,11.31
2015-02-20,11.43
2015-02-23,10.53
2015-02-24,10.6
2015-02-25,10.84
2015-02-26,11.04
2015-02-27,10.76
2015-03-02,10.89
2015-03-03,10.89
2015-03-04,11.06
2015-03-05,10.71
2015-03-06,10.47
2015-03-09,10.65
2015-03-10,10.48
2015-03-11,10.61
2015-03-12,10.34
2015-03-13,10.37
2015-03-16,10.08
2015-03-17,9.78
2015-03-18,9.72
2015-03-19,9.78
2015-03-20,9.57
2015-03-23,9.63
2015-03-24,9.56
2015-03-25,8.99
2015-03-26,9.15
2015-03-27,9.26
2015-03-30,9.34
2015-03-31,9.3
2015-04-01,9.26
2015-04-02,9.28
2015-04-06,9.35
2015-04-07,9.33
2015-04-08,9.45
2015-04-09,9.45
2015-04-10,9.52
2015-04-13,9.57
2015-04-14,9.84
2015-04-15,10.04
2015-04-16,10.09
2015-04-17,9.9
2015-04-20,10.05
2015-04-21,10.24
2015-04-22,9.99
2015-04-23,10.09
2015-04-24,9.97
2015-04-27,9.5
2015-04-28,9.5
2015-04-29,9.4
2015-04-30,9.15
2015-05-01,9.46
2015-05-04,9.51
2015-05-05,9.09
2015-05-06,9.31
2015-05-07,9.74
2015-05-08,9.96
2015-05-11,9.88
2015-05-12,9.89
2015-05-13,9.73
2015-05-14,9.92
2015-05-15,10.01
2015-05-18,10.16
2015-05-19,10.11
2015-05-20,10.51
2015-05-21,10.26
2015-05-22,10.27
2015-05-26,10.24
2015-05-27,10.15
2015-05-28,10.1
2015-05-29,10.09
2015-06-01,10.2
2015-06-02,11.43
2015-06-03,11.76
2015-06-04,12.44
2015-06-05,12.81
2015-06-08,13
2015-06-09,12.94
2015-06-10,12.93
2015-06-11,12.9
2015-06-12,12.91
2015-06-15,12.99
2015-06-16,13.14
2015-06-17,12.96
2015-06-18,13.03
2015-06-19,12.86
2015-06-22,12.98
2015-06-23,12.905
2015-06-24,13.42
2015-06-25,12.82
2015-06-26,12.57
2015-06-29,12.4
2015-06-30,12.69
2015-07-01,12.55
2015-07-02,12.63
2015-07-06,12.56
2015-07-07,12.32
2015-07-08,11.65
2015-07-09,12.08
2015-07-10,12.41
2015-07-13,12.4
2015-07-14,12.44
2015-07-15,12.13
2015-07-16,12.3
2015-07-17,12.12
2015-07-20,12.28
2015-07-21,12.09
2015-07-22,11.91
2015-07-23,11.78
2015-07-24,11.05
2015-07-27,11.03
2015-07-28,11.14
2015-07-29,11.14
2015-07-30,12.07
2015-07-31,12.24
2015-08-03,12.7
2015-08-04,12.55
2015-08-05,12.41
2015-08-06,12.2
2015-08-07,11.87
2015-08-10,12.21
2015-08-11,11.9
2015-08-12,12.15
2015-08-13,12.01
2015-08-14,12.03
2015-08-17,12.3
2015-08-18,11.98
2015-08-19,11.79
2015-08-20,11.51
2015-08-21,11.46
2015-08-24,10.88
2015-08-25,11.07
2015-08-26,11.62
2015-08-27,11.99
2015-08-28,11.93
2015-08-31,11.79
2015-09-01,11.6
2015-09-02,12.18
2015-09-03,11.93
2015-09-04,12.11
2015-09-08,12.68
2015-09-09,12.37
2015-09-10,12.99
2015-09-11,13.33
2015-09-14,13.26
2015-09-15,13.76
2015-09-16,13.66
2015-09-17,14.4
2015-09-18,14.09
2015-09-21,13.19
2015-09-22,13.03
2015-09-23,13.32
2015-09-24,13.39
2015-09-25,12.5
2015-09-28,11.88
2015-09-29,11.22
2015-09-30,11.28
2015-10-01,11.06
2015-10-02,11.62
2015-10-05,12.1
2015-10-06,11.82
2015-10-07,11.4
2015-10-08,11.02
2015-10-09,10.98
2015-10-12,10.8
2015-10-13,10.1
2015-10-14,10.11
2015-10-15,10.59
2015-10-16,10.3
2015-10-19,10.64
2015-10-20,10.43
2015-10-21,10.64
2015-10-22,10.87
2015-10-23,10.79
2015-10-26,10.99
2015-10-27,11.01
2015-10-28,11.53
2015-10-29,11.09
2015-10-30,10.74
2015-11-02,11.05
2015-11-03,10.66
2015-11-04,10.005
2015-11-05,9.83
2015-11-06,9.77
2015-11-09,10.04
2015-11-10,9.71
2015-11-11,9.72
2015-11-12,9.44
2015-11-13,9.57
2015-11-16,9.31
2015-11-17,9.32
2015-11-18,9.67
2015-11-19,9.44
2015-11-20,9.62
2015-11-23,9.69
2015-11-24,9.84
2015-11-25,9.82
2015-11-27,9.92
2015-11-30,9.86
2015-12-01,9.67
2015-12-02,9.73
2015-12-03,8.98
2015-12-04,8.96
2015-12-07,8.39
2015-12-08,8.185
2015-12-09,8.83
2015-12-10,8.62
2015-12-11,8.61
2015-12-14,8.58
2015-12-15,8.74
2015-12-16,9.41
2015-12-17,9.38
2015-12-18,9.36
2015-12-21,9.64
2015-12-22,9.47
2015-12-23,9.585
2015-12-24,9.6
2015-12-28,9.3
2015-12-29,9.72
2015-12-30,9.67
2015-12-31,9.31
2016-01-04,8.99
2016-01-05,9.05
2016-01-06,8.7
2016-01-07,8.38
2016-01-08,8.21
2016-01-11,8.57
2016-01-12,9.1
2016-01-13,8.7
2016-01-14,9.05
2016-01-15,8.83
2016-01-19,8.59
2016-01-20,8.79
2016-01-21,8.6
2016-01-22,9.14
2016-01-25,9.08
2016-01-26,9.12
2016-01-27,8.74
2016-01-28,8.445
2016-01-29,8.53
2016-02-01,8.75
2016-02-02,8.91
2016-02-03,8.83
2016-02-04,8.81
2016-02-05,8.64
2016-02-08,8.02
2016-02-09,7.99
2016-02-10,7.84
2016-02-11,7.94
2016-02-12,7.94
2016-02-16,8.19
2016-02-17,8.22
2016-02-18,7.76
2016-02-19,7.86
2016-02-22,8.03
2016-02-23,7.69
2016-02-24,7.67
2016-02-25,7.74
2016-02-26,8
2016-02-29,7.85
2016-03-01,8.13
2016-03-02,8.36
2016-03-03,8.13
2016-03-04,7.92
2016-03-07,8.22
2016-03-08,7.64
2016-03-09,7.78
2016-03-10,7.59
2016-03-11,7.7
2016-03-14,7.8
2016-03-15,7.49
2016-03-16,7.23
2016-03-17,7.36
2016-03-18,7.73
2016-03-21,7.82
2016-03-22,7.79
2016-03-23,7.33
2016-03-24,7.67
2016-03-28,7.47
2016-03-29,7.78
2016-03-30,8.05
2016-03-31,8.36
2016-04-01,8.39
2016-04-04,8.39
2016-04-05,8.25
2016-04-06,8.59
2016-04-07,8.63
2016-04-08,8.59
2016-04-11,8.45
2016-04-12,8.5
2016-04-13,8.82
2016-04-14,8.79
2016-04-15,8.97
2016-04-18,8.98
2016-04-19,8.96
2016-04-20,9.065
2016-04-21,9.445
2016-04-22,9.44
2016-04-25,9.5
2016-04-26,9.27
2016-04-27,9.08
2016-04-28,9.165
2016-04-29,8.9
2016-05-02,8.89
2016-05-03,8.41
2016-05-04,8.32
2016-05-05,8.735
2016-05-06,8.61
2016-05-09,8.73
2016-05-10,9.09
2016-05-11,8.79
2016-05-12,8.23
2016-05-13,8.6
2016-05-16,8.775
2016-05-17,8.92
2016-05-18,9.17
2016-05-19,9.4
2016-05-20,9.595
2016-05-23,9.56
2016-05-24,9.76
2016-05-25,9.72
2016-05-26,9.49
2016-05-27,10.61
2016-05-31,10.4
2016-06-01,10.39
2016-06-02,10.98
2016-06-03,10.87
2016-06-06,11.28
2016-06-07,11.18
2016-06-08,11.2
2016-06-09,10.985
2016-06-10,10.81
2016-06-13,10.785
2016-06-14,10.82
2016-06-15,10.6
2016-06-16,10.93
2016-06-17,10.86
2016-06-20,11.11
2016-06-21,11.02
2016-06-22,11.22
2016-06-23,11.35
2016-06-24,11.16
2016-06-27,10.7
2016-06-28,11.18
2016-06-29,11.11
2016-06-30,11.19
2016-07-01,11.43
2016-07-05,11.49
2016-07-06,11.65
2016-07-07,11.45
2016-07-08,11.47
2016-07-11,11.52
2016-07-12,11.5
2016-07-13,11.28
2016-07-14,10.99
2016-07-15,11.27
2016-07-18,11.56
2016-07-19,11.06
2016-07-20,11.16
2016-07-21,11.39
2016-07-22,11.21
2016-07-25,11.16
2016-07-26,11.2
2016-07-27,11.29
2016-07-28,11.5
2016-07-29,11.4
2016-08-01,12.15
2016-08-02,11.93
2016-08-03,11.96
2016-08-04,12.01
2016-08-05,12.39
2016-08-08,12.13
2016-08-09,12.43
2016-08-10,12.26
2016-08-11,12.96
2016-08-12,12.8
2016-08-15,12.68
2016-08-16,12.55
2016-08-17,12.36
2016-08-18,12.39
2016-08-19,12.19
2016-08-22,12.49
2016-08-23,12.25
2016-08-24,11.75
2016-08-25,14.17
2016-08-26,15.33
2016-08-29,15.26
2016-08-30,15.72
2016-08-31,15.38
2016-09-01,15.29
2016-09-02,15.55
2016-09-06,16.075
2016-09-07,16.27
2016-09-08,16.08
2016-09-09,15.84
2016-09-12,16.1
2016-09-13,15.72
2016-09-14,15.92
2016-09-15,15.73
2016-09-16,15.55
2016-09-19,15.2
2016-09-20,15.29
2016-09-21,15.56
2016-09-22,16.62
2016-09-23,16.81
2016-09-26,17.05
2016-09-27,16.83
2016-09-28,16.7
2016-09-29,16.26
2016-09-30,16.64
2016-10-03,16.36
2016-10-04,16.23
2016-10-05,16.25
2016-10-06,16.83
2016-10-07,16.83
2016-10-10,17.63
2016-10-11,17.41
2016-10-12,17.14
2016-10-13,17.32
2016-10-14,16.14
2016-10-17,15.97
2016-10-18,16.09
2016-10-19,15.61
2016-10-20,15.94
2016-10-21,15.83
2016-10-24,15.85
2016-10-25,15.45
2016-10-26,15.15
2016-10-27,14.95
2016-10-28,14.9
2016-10-31,14.85
2016-11-01,14.9
2016-11-02,14.35
2016-11-03,13.65
2016-11-04,14.25
2016-11-07,14.55
2016-11-08,15.15
2016-11-09,16.35
2016-11-10,16.55
2016-11-11,16.55
2016-11-14,16.95
2016-11-15,17.075
2016-11-16,16.5
2016-11-17,17.05
2016-11-18,17
2016-11-21,17.2
2016-11-22,16.75
2016-11-23,17.35
2016-11-25,17.3
2016-11-28,17.1
2016-11-29,16.8
2016-11-30,16.45
2016-12-01,15.5
2016-12-02,15.6
2016-12-05,15.6
2016-12-06,16
2016-12-07,15.4
2016-12-08,15.9
2016-12-09,15.95
2016-12-12,16.05
2016-12-13,16.1
2016-12-14,16
2016-12-15,15.9
2016-12-16,15.95
2016-12-19,16.45
2016-12-20,16.45
2016-12-21,15.9
2016-12-22,15.35
2016-12-23,16.1
2016-12-27,15.85
2016-12-28,16.05
2016-12-29,16.1
2016-12-30,15.95
2017-01-03,15.6
2017-01-04,15.95
2017-01-05,15.8
2017-01-06,15.35
2017-01-09,14.7
2017-01-10,14.8
2017-01-11,14
2017-01-12,14.05
2017-01-13,14.25
2017-01-17,13.45
2017-01-18,13.85
2017-01-19,13.6
2017-01-20,13.25
2017-01-23,13.05
2017-01-24,13.2
2017-01-25,13.7
2017-01-26,13.6
2017-01-27,13.8
2017-01-30,13.3
2017-01-31,14.15
2017-02-01,13.85
2017-02-02,13.55
2017-02-03,13.65
2017-02-06,13.75
2017-02-07,13.65
2017-02-08,14.3
2017-02-09,14.15
2017-02-10,14.3
2017-02-13,14.5
2017-02-14,14.6
2017-02-15,14.5
2017-02-16,14.5
2017-02-17,15
2017-02-21,14.5
2017-02-22,13.85
2017-02-23,13.6
2017-02-24,13.8
2017-02-27,14.3
2017-02-28,14.25
2017-03-01,14.5
2017-03-02,14.15
2017-03-03,14.25
2017-03-06,14.45
2017-03-07,14.2
2017-03-08,14.95
2017-03-09,14.9
2017-03-10,14.95
2017-03-13,14.9
2017-03-14,14.8
2017-03-15,15.05
2017-03-16,14.55
2017-03-17,14.35
2017-03-20,14.15
2017-03-21,13.9
2017-03-22,13.95
2017-03-23,14.1
2017-03-24,14.45
2017-03-27,14.4
2017-03-28,14.25
2017-03-29,14.2
2017-03-30,14.15
2017-03-31,14
2017-04-03,13.85
2017-04-04,13.825
2017-04-05,13.45
2017-04-06,13.55
2017-04-07,13.75
2017-04-10,13.55
2017-04-11,13.6
2017-04-12,13.75
2017-04-13,13.95
2017-04-17,13.85
2017-04-18,14.4
2017-04-19,14.05
2017-04-20,14.45
2017-04-21,14.45
2017-04-24,14.75
2017-04-25,14.9
2017-04-26,15.25
2017-04-27,15.2
2017-04-28,15.25
2017-05-01,15
2017-05-02,14.85
2017-05-03,14.95
2017-05-04,14.65
2017-05-05,14.5
2017-05-08,14.05
2017-05-09,14.3
2017-05-10,14.3
2017-05-11,14.15
2017-05-12,14.5
2017-05-15,14.45
2017-05-16,14.75
2017-05-17,14.1
2017-05-18,14.6
2017-05-19,14.25
2017-05-22,14.2
2017-05-23,14.15
2017-05-24,13.8
2017-05-25,14.05
2017-05-26,14.05
2017-05-30,13.8
2017-05-31,13.75
2017-06-01,13.8
2017-06-02,13.8
2017-06-05,13.75
2017-06-06,13.8
2017-06-07,13.7
2017-06-08,13.8
2017-06-09,13.65
2017-06-12,13.8
2017-06-13,13.9
2017-06-14,13.85
2017-06-15,13.75
2017-06-16,13.75
2017-06-19,14.05
2017-06-20,15.2
2017-06-21,15.8
2017-06-22,16.1
2017-06-23,15.9
2017-06-26,15.85
2017-06-27,15.75
2017-06-28,16.15
2017-06-29,16.55
2017-06-30,16.3
2017-07-03,16.75
2017-07-05,16.95
2017-07-06,16.6
2017-07-07,16.8
2017-07-10,16.55
2017-07-11,16.55
2017-07-12,16.7
2017-07-13,16.8
2017-07-14,16.6
2017-07-17,16.4
2017-07-18,16.35
2017-07-19,16.2
2017-07-20,16.3
2017-07-21,16.4
2017-07-24,16.5
2017-07-25,16.05
2017-07-26,16
2017-07-27,15.8
2017-07-28,15.75
2017-07-31,15.55
2017-08-01,15.5
2017-08-02,15.45
2017-08-03,16.6
2017-08-04,16
2017-08-07,16.05
2017-08-08,15.5
2017-08-09,15.4
2017-08-10,15.4
2017-08-11,15.65
2017-08-14,16.1
2017-08-15,16.25
2017-08-16,16.3
2017-08-17,16.05
2017-08-18,15.9
2017-08-21,15.75
2017-08-22,15.95
2017-08-23,15.85
2017-08-24,16.15
2017-08-25,16.3
2017-08-28,16.5
2017-08-29,16.8
2017-08-30,16.85
2017-08-31,17.2
2017-09-01,17.25
2017-09-05,17.3
2017-09-06,17.1
2017-09-07,17.45
2017-09-08,17.35
2017-09-11,17.25
2017-09-12,17.25
2017-09-13,17
2017-09-14,17.65
2017-09-15,18.4
2017-09-18,18.2
2017-09-19,18.35
2017-09-20,18.4
2017-09-21,18.85
2017-09-22,18.6
2017-09-25,18.65
2017-09-26,17.95
2017-09-27,18.2
2017-09-28,18.05
2017-09-29,17.9
2017-10-02,18.1
2017-10-03,18
2017-10-04,18
2017-10-05,17.2
2017-10-06,17.35
2017-10-09,16.6
2017-10-10,16.8
2017-10-11,16.25
2017-10-12,16.35
2017-10-13,16.25
2017-10-16,16.15
2017-10-17,16.1
2017-10-18,15.95
2017-10-19,16
2017-10-20,16
2017-10-23,15.7
2017-10-24,15.65
2017-10-25,15.6
2017-10-26,14.1
2017-10-27,14.7
2017-10-30,15.9
2017-10-31,15.7
2017-11-01,15.4
2017-11-02,15.55
2017-11-03,16.1
2017-11-06,15.75
2017-11-07,14.95
2017-11-08,13.1
2017-11-09,13.25
2017-11-10,13.15
2017-11-13,12.95
2017-11-14,12.95
2017-11-15,12.85
2017-11-16,13.25
2017-11-17,12.95
2017-11-20,13.05
2017-11-21,13.15
2017-11-22,13
2017-11-24,12.9
2017-11-27,13.25
2017-11-28,13.1
2017-11-29,13.3
2017-11-30,14.05
2017-12-01,13.875
2017-12-04,13.7
2017-12-05,14.05
2017-12-06,13.8
2017-12-07,13.9
2017-12-08,14.15
2017-12-11,13.85
2017-12-12,13.6
2017-12-13,14.35
2017-12-14,14.05
2017-12-15,14.35
2017-12-18,14.45
2017-12-19,14.45
2017-12-20,14.7
2017-12-21,14.95
2017-12-22,15.2
2017-12-26,15.3
2017-12-27,15.25
2017-12-28,15.35
2017-12-29,15.2
2018-01-02,15.6
2018-01-03,15.6
2018-01-04,15.55
2018-01-05,15.25
2018-01-08,14.25
2018-01-09,14.2
2018-01-10,14.05
2018-01-11,14.35
2018-01-12,14.5
2018-01-16,14.2
2018-01-17,14.45
2018-01-18,14.25
2018-01-19,14.5
2018-01-22,15.1
2018-01-23,15.5
2018-01-24,15.7
2018-01-25,17.15
2018-01-26,17.25
2018-01-29,16.45
2018-01-30,16.2
2018-01-31,15.85
2018-02-01,16.5
2018-02-02,16.15
2018-02-05,15.5
2018-02-06,15.65
2018-02-07,15.75
2018-02-08,15.3
2018-02-09,15.625
2018-02-12,15.6
2018-02-13,15.85
2018-02-14,15.85
2018-02-15,16.9
2018-02-16,17.1
2018-02-20,17.3
2018-02-21,17.4
2018-02-22,17.65
2018-02-23,18.7
2018-02-26,19.2
2018-02-27,19.15
2018-02-28,18.85
2018-03-01,18.7
2018-03-02,19
2018-03-05,19.3
2018-03-06,19.3
2018-03-07,19.5
2018-03-08,19.45
2018-03-09,19.9
2018-03-12,19.95
2018-03-13,20.2
2018-03-14,19.7
2018-03-15,17.525
2018-03-16,16.6
2018-03-19,17.05
2018-03-20,16.9
2018-03-21,16.95
2018-03-22,16.95
2018-03-23,16.85
2018-03-26,17.1
2018-03-27,16.65
2018-03-28,16.6
2018-03-29,16.85
2018-04-02,16.25
2018-04-03,16.45
2018-04-04,16.95
2018-04-05,16.5
2018-04-06,16.3
2018-04-09,15.4
2018-04-10,15.15
2018-04-11,15.1
2018-04-12,14.95
2018-04-13,15.1
2018-04-16,15.05
2018-04-17,15.25
2018-04-18,15.25
2018-04-19,14.75
2018-04-20,14.85
2018-04-23,14.95
2018-04-24,14.6
2018-04-25,14.55
2018-04-26,14.65
2018-04-27,14.3
2018-04-30,13.95
2018-05-01,14.15
2018-05-02,13.95
2018-05-03,15.65
2018-05-04,15.25
2018-05-07,15.7
2018-05-08,16.1
2018-05-09,16.35
2018-05-10,16.05
2018-05-11,16.65
2018-05-14,16.8
2018-05-15,16.8
2018-05-16,17.15
2018-05-17,16.9
2018-05-18,17
2018-05-21,16.55
2018-05-22,16.6
2018-05-23,16.9
2018-05-24,17.2
2018-05-25,17.25
2018-05-29,17.25
2018-05-30,17.3
2018-05-31,17.6
2018-06-01,17.7
2018-06-04,17.45
2018-06-05,17.85
2018-06-06,18.1
2018-06-07,18
2018-06-08,18.05
2018-06-11,18.1
2018-06-12,17.95
2018-06-13,18.3
2018-06-14,18.3
2018-06-15,18.75
2018-06-18,19
2018-06-19,19.05
2018-06-20,19
2018-06-21,18.95
2018-06-22,19.1
2018-06-25,19.15
2018-06-26,19.05
2018-06-27,18.7
2018-06-28,19.15
2018-06-29,19.05
2018-07-02,19.2
2018-07-03,19.125
2018-07-05,19.8
2018-07-06,20
2018-07-09,19.9
2018-07-10,19.45
2018-07-11,19.65
2018-07-12,19.9
2018-07-13,19.8
2018-07-16,19.75
2018-07-17,20.35
2018-07-18,20.7
2018-07-19,20.95
2018-07-20,20.8
2018-07-23,20.925
2018-07-24,20.45
2018-07-25,20.45
2018-07-26,20.7
2018-07-27,20.25
2018-07-30,19.95
2018-07-31,20.85
2018-08-01,20.65
2018-08-02,21.7
2018-08-03,20.9
2018-08-06,21.35
2018-08-07,22.275
2018-08-08,21.95
2018-08-09,21.55
2018-08-10,21.65
2018-08-13,21.45
2018-08-14,21.6
2018-08-15,21.8
2018-08-16,22.05
2018-08-17,21.85
2018-08-20,21.1
2018-08-21,21.2
2018-08-22,21.25
2018-08-23,20.6
2018-08-24,21.3
2018-08-27,20.6
2018-08-28,20
2018-08-29,20.35
2018-08-30,19.75
2018-08-31,19.325
2018-09-04,19.6
2018-09-05,18.9
2018-09-06,18.85
2018-09-07,18.45
2018-09-10,18.25
2018-09-11,18.25
2018-09-12,18.45
2018-09-13,18.5
2018-09-14,19.9
2018-09-17,19.1
2018-09-18,19.45
2018-09-19,19.65
2018-09-20,20.05
2018-09-21,20.1
2018-09-24,20.45
2018-09-25,20.65
2018-09-26,22.45
2018-09-27,23
2018-09-28,22.95
2018-10-01,22.7
2018-10-02,22.3
2018-10-03,22.84
2018-10-04,22.33
2018-10-05,22.46
2018-10-08,23
2018-10-09,22.81
2018-10-10,21.86
2018-10-11,21.45
2018-10-12,21.45
2018-10-15,21.34
2018-10-16,22.42
2018-10-17,22.73
2018-10-18,22.67
2018-10-19,22
2018-10-22,21.86
2018-10-23,21.63
2018-10-24,20
2018-10-25,20.29
2018-10-26,20.51
2018-10-29,20.07
2018-10-30,19.47
2018-10-31,18.97
2018-11-01,20.28
2018-11-02,20.46
2018-11-05,20.21
2018-11-06,20.11
2018-11-07,20.45
2018-11-08,23.46
2018-11-09,23.81
2018-11-12,22.62
2018-11-13,22.57
2018-11-14,22.35
2018-11-15,23.83
2018-11-16,23.88
2018-11-19,23.6
2018-11-20,23.73
2018-11-21,24.07
2018-11-23,24.45
2018-11-26,23.97
2018-11-27,23.32
2018-11-28,24.05
2018-11-29,24.63
2018-11-30,25.04
2018-12-03,31.47
2018-12-04,28.94
2018-12-06,29.42
2018-12-07,27.6
2018-12-10,28.67
2018-12-11,27.16
2018-12-12,26.58
2018-12-13,26.15
2018-12-14,26.24
2018-12-17,25.77
2018-12-18,25.08
2018-12-19,24.63
2018-12-20,24.4
2018-12-21,24
2018-12-24,23.78
2018-12-26,25.95
2018-12-27,25.62
2018-12-28,25.66
2018-12-31,26.13
2019-01-02,27.02
2019-01-03,26.01
2019-01-04,27.75
2019-01-07,28.7
2019-01-08,29.01
2019-01-09,28.4
2019-01-10,28.89
2019-01-11,28.84
2019-01-14,28.06
2019-01-15,29.29
2019-01-16,30.17
2019-01-17,30.82
2019-01-18,31.05
2019-01-22,30.03
2019-01-23,28.8
2019-01-24,28.87
2019-01-25,29.8
2019-01-28,28.9
2019-01-29,28.53
2019-01-30,28.2
2019-01-31,27.13
2019-02-01,26.2
2019-02-04,25.3
2019-02-05,25.06
2019-02-06,20.06
2019-02-07,18.99
2019-02-08,18.95
2019-02-11,18
2019-02-12,18.41
2019-02-13,18.42
2019-02-14,20.12
2019-02-15,21.11
2019-02-19,20.14
2019-02-20,20.36
2019-02-21,20.03
2019-02-22,20.8
2019-02-25,20.64
2019-02-26,20.16
2019-02-27,20.62
2019-02-28,20.24
2019-03-01,20.22
2019-03-04,19.84
2019-03-05,19.75
2019-03-06,19.15
2019-03-07,18.75
2019-03-08,18.58
2019-03-11,18.98
2019-03-12,18.87
2019-03-13,19.06
2019-03-14,18.64
2019-03-15,18.29
2019-03-18,18.22
2019-03-19,18.35
2019-03-20,17.9
2019-03-21,18.44
2019-03-22,17.59
2019-03-25,17.76
2019-03-26,18.16
2019-03-27,18.35
2019-03-28,18.78
2019-03-29,18.4
2019-04-01,18.36
2019-04-02,18.17
2019-04-03,18.3
2019-04-04,18.6
2019-04-05,18.85
2019-04-08,18.42
2019-04-09,17.93
2019-04-10,17.9
2019-04-11,17.55
2019-04-12,17.67
2019-04-15,17.41
2019-04-16,17.42
2019-04-17,16.64
2019-04-18,16.65
2019-04-22,16.79
2019-04-23,17.31
2019-04-24,16.82
2019-04-25,16.62
2019-04-26,17.16
2019-04-29,17.19
2019-04-30,16.29
2019-05-01,16
2019-05-02,15.79
2019-05-03,15.89
2019-05-06,16.5
2019-05-07,16.07
2019-05-08,16.12
2019-05-09,16.35
2019-05-10,16.28
2019-05-13,15.73
2019-05-14,15.9
2019-05-15,15.99
2019-05-16,16.19
2019-05-17,15.29
2019-05-20,14.91
2019-05-21,16.39
2019-05-22,15.8
2019-05-23,15.58
2019-05-24,16.28
2019-05-28,15.84
2019-05-29,15.22
2019-05-30,14.88
2019-05-31,14.68
2019-06-03,15.13
2019-06-04,15.26
2019-06-05,14.79
2019-06-06,13.83
2019-06-07,14.05
2019-06-10,13.64
2019-06-11,13.37
2019-06-12,14.47
2019-06-13,14.865
2019-06-14,14.625
2019-06-17,14.83
2019-06-18,14.61
2019-06-19,14.675
2019-06-20,14.21
2019-06-21,13.935
2019-06-24,13.895
2019-06-25,14.135
2019-06-26,13.785
2019-06-27,14.415
2019-06-28,14.125
2019-07-01,13.93
2019-07-02,13.695
2019-07-03,14.065
2019-07-04,14.065
2019-07-05,13.93
2019-07-08,13.445
2019-07-09,13.58
2019-07-10,13.935
2019-07-11,13.42
2019-07-12,13.735
2019-07-15,13.535
2019-07-16,13.455
2019-07-17,13.275
2019-07-18,13.355
2019-07-19,13.02
2019-07-22,12.38
2019-07-23,12.685
2019-07-24,13.15
2019-07-25,12.265
2019-07-26,12.465
2019-07-29,12.55
2019-07-30,12.615
2019-07-31,12.525
2019-08-01,15.785
2019-08-02,15.31
2019-08-05,15.365
2019-08-06,15.51
2019-08-07,15.365
2019-08-08,14.91
2019-08-09,14.725
2019-08-12,15.09
2019-08-13,15.025
2019-08-14,14.855
2019-08-15,14.945
2019-08-16,15.2
2019-08-19,15.335
2019-08-20,15.175
2019-08-21,15.055
2019-08-22,14.625
2019-08-23,14.47
2019-08-26,14.82
2019-08-27,14.115
2019-08-28,14.355
2019-08-29,14.08
2019-08-30,14.135
2019-09-02,14.095
2019-09-03,14.035
2019-09-04,14.005
2019-09-05,13.935
2019-09-06,13.59
2019-09-09,13.345
2019-09-10,14.175
2019-09-11,14.275
2019-09-12,13.665
2019-09-13,13.615
2019-09-16,13.665
2019-09-17,13.635
2019-09-18,13.165
2019-09-19,13.495
2019-09-20,13.205
2019-09-23,13.485
2019-09-24,13.295
2019-09-25,14.025
2019-09-26,13.405
2019-09-27,13.595
2019-09-30,13.255
2019-10-01,12.95
2019-10-02,13.145
2019-10-03,13.36
2019-10-04,13.175
2019-10-07,13.305
2019-10-08,13.01
2019-10-09,12.375
2019-10-10,12.565
2019-10-11,12.71
2019-10-14,12.955
2019-10-15,13.415
2019-10-16,13.365
2019-10-17,13.67
2019-10-18,13.615
2019-10-21,13.63
2019-10-22,13.735
2019-10-23,13.66
2019-10-24,13.735
2019-10-25,14.065
2019-10-28,14.185
2019-10-29,14.035
2019-10-30,13.725
2019-10-31,13.485
2019-11-01,13.875
2019-11-04,13.705
2019-11-05,13.515
2019-11-06,13.16
2019-11-07,14.455
2019-11-08,14.745
2019-11-11,14.895
2019-11-12,14.94
2019-11-13,14.95
2019-11-14,15.49
2019-11-15,15.445
2019-11-18,15.575
2019-11-19,15.48
2019-11-20,15.54
2019-11-21,15.655
2019-11-22,16.235
2019-11-25,16.575
