date,close
2014-06-13,61.2642
2014-06-16,61.4039
2014-06-17,61.646
2014-06-18,62.1116
2014-06-19,61.7577
2014-06-20,61.732
2014-06-23,61.8067
2014-06-24,61.6572
2014-06-25,62.1804
2014-06-26,62.2271
2014-06-27,62.3766
2014-06-30,62.3485
2014-07-01,63.0118
2014-07-02,63.1052
2014-07-03,63.591
2014-07-07,63.1987
2014-07-08,62.5821
2014-07-09,63.3388
2014-07-10,62.7502
2014-07-11,62.9558
2014-07-14,63.1333
2014-07-15,62.9184
2014-07-16,63.0772
2014-07-17,62.4793
2014-07-18,63.0584
2014-07-21,62.7689
2014-07-22,63.0305
2014-07-23,62.9838
2014-07-24,63.1239
2014-07-25,62.4233
2014-07-28,62.5447
2014-07-29,62.3672
2014-07-30,62.7129
2014-07-31,61.5545
2014-08-01,61.3303
2014-08-04,61.9281
2014-08-05,61.4984
2014-08-06,61.3676
2014-08-07,61.05
2014-08-08,61.9935
2014-08-11,62.2738
2014-08-12,62.115
2014-08-13,62.3392
2014-08-14,62.825
2014-08-15,64.245
2014-08-18,63.2827
2014-08-19,63.7592
2014-08-20,64.0581
2014-08-21,64.0021
2014-08-22,64.1235
2014-08-25,64.3104
2014-08-26,64.3197
2014-08-27,64.3851
2014-08-28,64.301
2014-08-29,64.2917
2014-09-02,64.4131
2014-09-03,64.245
2014-09-04,64.4879
2014-09-05,64.7027
2014-09-08,64.4318
2014-09-09,63.7872
2014-09-10,64.0114
2014-09-11,64.0394
2014-09-12,63.8526
2014-09-15,63.591
2014-09-16,63.918
2014-09-17,63.89
2014-09-18,64.1702
2014-09-19,64.197
2014-09-22,63.2972
2014-09-23,62.7536
2014-09-24,63.4659
2014-09-25,62.538
2014-09-26,63.1847
2014-09-29,62.8567
2014-09-30,62.5099
2014-10-01,61.6756
2014-10-02,61.9568
2014-10-03,62.7536
2014-10-06,62.4161
2014-10-07,61.4882
2014-10-08,62.4536
2014-10-09,61.0383
2014-10-10,60.504
2014-10-13,59.2761
2014-10-14,59.7073
2014-10-15,59.2105
2014-10-16,59.9322
2014-10-17,59.9322
2014-10-20,60.7664
2014-10-21,61.9475
2014-10-22,61.4132
2014-10-23,62.2474
2014-10-24,62.1912
2014-10-27,62.313
2014-10-28,62.9879
2014-10-29,62.8004
2014-10-30,64.6844
2014-10-31,63.8315
2014-11-03,63.8315
2014-11-04,63.0629
2014-11-05,63.316
2014-11-06,63.8502
2014-11-07,63.744
2014-11-10,63.7096
2014-11-11,63.9814
2014-11-12,64.2814
2014-11-13,64.6844
2014-11-14,64.9375
2014-11-17,64.8625
2014-11-18,64.9844
2014-11-19,65.2562
2014-11-20,65.5374
2014-11-21,65.6967
2014-11-24,66.306
2014-11-25,66.5122
2014-11-26,66.5028
2014-11-28,67.3089
2014-12-01,66.5684
2014-12-02,66.8215
2014-12-03,66.934
2014-12-04,66.8965
2014-12-05,67.0465
2014-12-08,66.5028
2014-12-09,66.381
2014-12-10,65.4999
2014-12-11,66.0342
2014-12-12,65.6124
2014-12-15,65.2159
2014-12-16,64.2158
2014-12-17,65.4437
2014-12-18,66.5216
2014-12-19,66.7033
2014-12-22,67.3528
2014-12-23,67.7293
2014-12-24,67.6163
2014-12-26,67.9834
2014-12-29,68.501
2014-12-30,68.181
2014-12-31,67.9081
2015-01-02,67.4187
2015-01-05,66.1292
2015-01-06,65.4704
2015-01-07,66.5057
2015-01-08,67.5034
2015-01-09,66.7222
2015-01-12,66.3645
2015-01-13,66.3645
2015-01-14,65.5645
2015-01-15,64.7174
2015-01-16,65.5739
2015-01-20,65.1974
2015-01-21,65.6209
2015-01-22,66.8539
2015-01-23,66.7598
2015-01-26,67.1081
2015-01-27,66.5716
2015-01-28,65.7057
2015-01-29,66.5998
2015-01-30,65.8751
2015-02-02,66.468
2015-02-03,67.8798
2015-02-04,68.3316
2015-02-05,68.7552
2015-02-06,68.6516
2015-02-09,68.3881
2015-02-10,69.2258
2015-02-11,69.2446
2015-02-12,70.0634
2015-02-13,70.487
2015-02-17,70.327
2015-02-18,70.2893
2015-02-19,70.5058
2015-02-20,71.0047
2015-02-23,70.9388
2015-02-24,71.2776
2015-02-25,71.8235
2015-02-26,71.5976
2015-02-27,71.5035
2015-03-02,72.36
2015-03-03,72.1623
2015-03-04,71.7859
2015-03-05,71.8329
2015-03-06,70.9764
2015-03-09,71.3811
2015-03-10,70.2705
2015-03-11,69.8846
2015-03-12,71.3058
2015-03-13,70.7411
2015-03-16,71.5694
2015-03-17,71.1741
2015-03-18,71.8047
2015-03-19,71.7011
2015-03-20,72.4994
2015-03-23,72.3766
2015-03-24,71.9989
2015-03-25,70.8279
2015-03-26,70.384
2015-03-27,70.7429
2015-03-30,71.47
2015-03-31,71.1584
2015-04-01,70.8468
2015-04-02,71.4795
2015-04-06,71.8195
2015-04-07,71.4228
2015-04-08,72.0933
2015-04-09,72.1594
2015-04-10,72.405
2015-04-13,72.0083
2015-04-14,71.9706
2015-04-15,71.9706
2015-04-16,72.1122
2015-04-17,71.0451
2015-04-20,71.8289
2015-04-21,71.9044
2015-04-22,71.9706
2015-04-23,72.3294
2015-04-24,73.3116
2015-04-27,72.6694
2015-04-28,72.4144
2015-04-29,71.9233
2015-04-30,71.1206
2015-05-01,72.1028
2015-05-04,72.2539
2015-05-05,71.4984
2015-05-06,71.2056
2015-05-07,71.5739
2015-05-08,72.3389
2015-05-11,72.0178
2015-05-12,71.8856
2015-05-13,71.4323
2015-05-14,71.7533
2015-05-15,72.3294
2015-05-18,72.6033
2015-05-19,72.5844
2015-05-20,72.4994
2015-05-21,72.7827
2015-05-22,72.6599
2015-05-26,72.1405
2015-05-27,72.6788
2015-05-28,72.5561
2015-05-29,72.0555
2015-06-01,72.2633
2015-06-02,72.4239
2015-06-03,72.9905
2015-06-04,72.4711
2015-06-05,72.2633
2015-06-08,71.7533
2015-06-09,71.6778
2015-06-10,72.4144
2015-06-11,72.6599
2015-06-12,72.3294
2015-06-15,71.9894
2015-06-16,72.4239
2015-06-17,72.7544
2015-06-18,73.6326
2015-06-19,73.374
2015-06-22,73.7814
2015-06-23,74.0751
2015-06-24,73.5635
2015-06-25,73.5067
2015-06-26,73.8003
2015-06-29,72.133
2015-06-30,72.4551
2015-07-01,73.2793
2015-07-02,73.1372
2015-07-06,72.9951
2015-07-07,73.6298
2015-07-08,72.2277
2015-07-09,72.5309
2015-07-10,73.5824
2015-07-13,74.6435
2015-07-14,74.7382
2015-07-15,74.6625
2015-07-16,75.1172
2015-07-17,74.9846
2015-07-20,75.0225
2015-07-21,74.7856
2015-07-22,75.1456
2015-07-23,74.7003
2015-07-24,74.7003
2015-07-27,74.1414
2015-07-28,74.7193
2015-07-29,75.4867
2015-07-30,75.7614
2015-07-31,75.9982
2015-08-03,75.7425
2015-08-04,76.0646
2015-08-05,75.2404
2015-08-06,74.2172
2015-08-07,74.1603
2015-08-10,74.7572
2015-08-11,74.0846
2015-08-12,73.7624
2015-08-13,74.1888
2015-08-14,74.2361
2015-08-17,74.9467
2015-08-18,75.013
2015-08-19,74.8803
2015-08-20,72.7772
2015-08-21,70.4466
2015-08-24,67.6329
2015-08-25,67.3582
2015-08-26,69.9161
2015-08-27,71.5551
2015-08-28,71.5835
2015-08-31,71.034
2015-09-01,69.234
2015-09-02,70.693
2015-09-03,70.7214
2015-09-04,69.9635
2015-09-08,71.5835
2015-09-09,70.8161
2015-09-10,71.0151
2015-09-11,71.5456
2015-09-14,71.1666
2015-09-15,71.9151
2015-09-16,72.7298
2015-09-17,72.9193
2015-09-18,71.7581
2015-09-21,72.3858
2015-09-22,71.4253
2015-09-23,71.2351
2015-09-24,71.0449
2015-09-25,71.0354
2015-09-28,68.9909
2015-09-29,68.7627
2015-09-30,70.617
2015-10-01,71.14
2015-10-02,72.1575
2015-10-05,73.2226
2015-10-06,72.6805
2015-10-07,72.9278
2015-10-08,73.8217
2015-10-09,73.9073
2015-10-12,74.2591
2015-10-13,73.8597
2015-10-14,73.1085
2015-10-15,74.0594
2015-10-16,74.4493
2015-10-19,74.8011
2015-10-20,74.7061
2015-10-21,74.3732
2015-10-22,75.3527
2015-10-23,75.7236
2015-10-26,76.2561
2015-10-27,75.8947
2015-10-28,76.6174
2015-10-29,76.8362
2015-10-30,76.9978
2015-11-02,77.3497
2015-11-03,77.6445
2015-11-04,77.1405
2015-11-05,77.4162
2015-11-06,77.4258
2015-11-09,76.3607
2015-11-10,77.0834
2015-11-11,76.627
2015-11-12,75.9138
2015-11-13,73.9168
2015-11-16,74.8107
2015-11-17,74.9533
2015-11-18,76.2371
2015-11-19,76.3322
2015-11-20,77.2451
2015-11-23,77.5304
2015-11-24,77.3687
2015-11-25,77.7586
2015-11-27,77.4733
2015-11-30,76.8171
2015-12-01,77.6064
2015-12-02,76.9313
2015-12-03,75.7711
2015-12-04,77.2356
2015-12-07,76.9122
2015-12-08,76.684
2015-12-09,75.7045
2015-12-10,75.9613
2015-12-11,74.2306
2015-12-14,74.611
2015-12-15,75.0199
2015-12-16,76.2751
2015-12-17,75.0199
2015-12-18,73.8408
2015-12-21,74.2132
2015-12-22,74.7575
2015-12-23,75.1394
2015-12-24,74.9389
2015-12-28,75.1299
2015-12-29,75.9988
2015-12-30,75.3877
2015-12-31,74.6341
2016-01-04,73.3538
2016-01-05,73.2583
2016-01-06,72.5421
2016-01-07,71.0525
2016-01-08,70.2886
2016-01-11,70.8424
2016-01-12,71.6254
2016-01-13,69.2096
2016-01-14,69.7061
2016-01-15,68.2738
2016-01-19,68.5316
2016-01-20,67.9301
2016-01-21,68.799
2016-01-22,70.0022
2016-01-25,69.2001
2016-01-26,70.2122
2016-01-27,69.1141
2016-01-28,70.0022
2016-01-29,70.7661
2016-02-01,71.1958
2016-02-02,69.8112
2016-02-03,69.6298
2016-02-04,69.2287
2016-02-05,66.9943
2016-02-08,65.6957
2016-02-09,65.5906
2016-02-10,65.476
2016-02-11,65.4378
2016-02-12,66.641
2016-02-16,68.2547
2016-02-17,69.7252
2016-02-18,69.2669
2016-02-19,69.4579
2016-02-22,70.8043
2016-02-23,70.4128
2016-02-24,70.8234
2016-02-25,71.53
2016-02-26,71.4536
2016-02-29,71.0812
2016-03-01,72.9623
2016-03-02,72.8954
2016-03-03,73.3251
2016-03-04,73.2583
2016-03-07,72.9432
2016-03-08,72.3703
2016-03-09,72.5135
2016-03-10,72.6949
2016-03-11,73.8121
2016-03-14,74.089
2016-03-15,74.0699
2016-03-16,74.6715
2016-03-17,74.768
2016-03-18,74.8735
2016-03-21,74.9118
2016-03-22,74.7872
2016-03-23,74.2598
2016-03-24,74.3557
2016-03-28,74.6913
2016-03-29,75.4487
2016-03-30,75.9281
2016-03-31,75.8419
2016-04-01,76.1583
2016-04-04,75.5638
2016-04-05,74.9214
2016-04-06,75.6309
2016-04-07,74.7776
2016-04-08,74.6625
2016-04-11,74.3845
2016-04-12,74.9502
2016-04-13,76.0049
2016-04-14,76.0049
2016-04-15,76.2158
2016-04-18,76.9349
2016-04-19,76.513
2016-04-20,76.6089
2016-04-21,76.3404
2016-04-22,76.187
2016-04-25,76.2733
2016-04-26,76.4555
2016-04-27,76.3788
2016-04-28,75.5542
2016-04-29,75.9377
2016-05-02,77.002
2016-05-03,76.2925
2016-05-04,75.9473
2016-05-05,75.4583
2016-05-06,76.0144
2016-05-09,76.2254
2016-05-10,77.2034
2016-05-11,75.6501
2016-05-12,75.7939
2016-05-13,74.8926
2016-05-16,75.3624
2016-05-17,74.5091
2016-05-18,74.0776
2016-05-19,74.0105
2016-05-20,74.4995
2016-05-23,74.2406
2016-05-24,75.1323
2016-05-25,75.5446
2016-05-26,75.698
2016-05-27,76.0528
2016-05-31,75.9761
2016-06-01,75.9281
2016-06-02,76.35
2016-06-03,75.8514
2016-06-06,76.0432
2016-06-07,76.1391
2016-06-08,76.2254
2016-06-09,76.0528
2016-06-10,75.257
2016-06-13,74.8447
2016-06-14,74.6529
2016-06-15,74.8639
2016-06-16,75.1004
2016-06-17,74.9849
2016-06-20,75.6584
2016-06-21,75.4852
2016-06-22,75.3794
2016-06-23,76.1203
2016-06-24,73.2722
2016-06-27,71.9443
2016-06-28,73.378
2016-06-29,74.5615
2016-06-30,75.11
2016-07-01,75.8894
2016-07-05,75.2736
2016-07-06,75.9182
2016-07-07,76.2454
2016-07-08,77.5732
2016-07-11,78.0255
2016-07-12,78.3334
2016-07-13,77.9485
2016-07-14,78.266
2016-07-15,77.9196
2016-07-18,78.2179
2016-07-19,78.0736
2016-07-20,78.4007
2016-07-21,78.189
2016-07-22,78.5162
2016-07-25,78.6413
2016-07-26,78.5451
2016-07-27,78.3045
2016-07-28,78.4488
2016-07-29,78.5354
2016-08-01,78.6605
2016-08-02,77.4866
2016-08-03,77.7079
2016-08-04,77.6695
2016-08-05,78.4873
2016-08-08,78.2275
2016-08-09,77.9966
2016-08-10,78.1602
2016-08-11,78.9396
2016-08-12,78.9011
2016-08-15,79.055
2016-08-16,78.6028
2016-08-17,78.42
2016-08-18,78.3719
2016-08-19,78.42
2016-08-22,78.343
2016-08-23,78.7375
2016-08-24,78.3622
2016-08-25,78.1024
2016-08-26,77.8811
2016-08-29,78.1506
2016-08-30,77.7176
2016-08-31,77.5155
2016-09-01,77.6695
2016-09-02,77.8234
2016-09-06,77.9677
2016-09-07,78.0062
2016-09-08,77.3327
2016-09-09,75.466
2016-09-12,76.5244
2016-09-13,75.4371
2016-09-14,75.4468
2016-09-15,75.9952
2016-09-16,75.831
2016-09-19,75.773
2016-09-20,75.831
2016-09-21,76.565
2016-09-22,77.1253
2016-09-23,76.9514
2016-09-26,76.1014
2016-09-27,76.8741
2016-09-28,77.0866
2016-09-29,76.6906
2016-09-30,77.3088
2016-10-03,77.2605
2016-10-04,76.99
2016-10-05,77.3088
2016-10-06,77.3667
2016-10-07,77.019
2016-10-10,77.1446
2016-10-11,76.2077
2016-10-12,76.565
2016-10-13,76.2849
2016-10-14,76.198
2016-10-17,75.5702
2016-10-18,76.0724
2016-10-19,76.4105
2016-10-20,76.2656
2016-10-21,76.8741
2016-10-24,77.4247
2016-10-25,76.5168
2016-10-26,76.1884
2016-10-27,75.5509
2016-10-28,75.377
2016-10-31,75.435
2016-11-01,74.9037
2016-11-02,74.4498
2016-11-03,74.2566
2016-11-04,74.1117
2016-11-07,75.8213
2016-11-08,76.1304
2016-11-09,76.2849
2016-11-10,76.565
2016-11-11,76.9997
2016-11-14,77.0093
2016-11-15,77.3088
2016-11-16,77.7338
2016-11-17,78.6707
2016-11-18,78.4292
2016-11-21,78.9411
2016-11-22,79.878
2016-11-23,79.9553
2016-11-25,80.1484
2016-11-28,79.511
2016-11-29,79.7235
2016-11-30,79.057
2016-12-01,79.0956
2016-12-02,78.661
2016-12-05,79.5206
2016-12-06,79.7041
2016-12-07,81.2495
2016-12-08,81.2495
2016-12-09,81.4331
2016-12-12,80.757
2016-12-13,81.4814
2016-12-14,80.9308
2016-12-15,80.7376
2016-12-16,80.3413
2016-12-19,80.5551
2016-12-20,81.1963
2016-12-21,81.1575
2016-12-22,80.283
2016-12-23,80.1081
2016-12-27,80.419
2016-12-28,79.8652
2016-12-29,79.7584
2016-12-30,79.088
2017-01-03,79.5543
2017-01-04,80.6134
2017-01-05,80.5551
2017-01-06,80.9534
2017-01-09,80.8854
2017-01-10,81.1769
2017-01-11,81.3518
2017-01-12,81.274
2017-01-13,81.5752
2017-01-17,81.7113
2017-01-18,81.5655
2017-01-19,81.3129
2017-01-20,81.5461
2017-01-23,81.6044
2017-01-24,82.2748
2017-01-25,82.78
2017-01-26,82.9063
2017-01-27,82.644
2017-01-30,82.5468
2017-01-31,82.4205
2017-02-01,82.2651
2017-02-02,82.1971
2017-02-03,82.0902
2017-02-06,81.8473
2017-02-07,81.7696
2017-02-08,82.2748
2017-02-09,82.7897
2017-02-10,83.295
2017-02-13,83.3921
2017-02-14,83.8682
2017-02-15,84.3054
2017-02-16,83.8779
2017-02-17,84.15
2017-02-21,84.6358
2017-02-22,84.6358
2017-02-23,84.0625
2017-02-24,84.4512
2017-02-27,84.5483
2017-02-28,83.9168
2017-03-01,84.8592
2017-03-02,84.6552
2017-03-03,84.5289
2017-03-06,84.2568
2017-03-07,83.9848
2017-03-08,84.3346
2017-03-09,84.2568
2017-03-10,84.3832
2017-03-13,84.6066
2017-03-14,84.5872
2017-03-15,85.0341
2017-03-16,85.0244
2017-03-17,85.1321
2017-03-20,84.9314
2017-03-21,83.8555
2017-03-22,83.953
2017-03-23,84.1479
2017-03-24,84.3525
2017-03-27,84.3233
2017-03-28,84.9664
2017-03-29,85.4732
2017-03-30,85.6973
2017-03-31,85.7071
2017-04-03,85.366
2017-04-04,85.2296
2017-04-05,85.0249
2017-04-06,85.288
2017-04-07,85.0347
2017-04-10,85.3465
2017-04-11,85.2783
2017-04-12,84.9372
2017-04-13,84.3428
2017-04-17,85.2101
2017-04-18,85.2198
2017-04-19,85.2978
2017-04-20,86.1943
2017-04-21,85.9994
2017-04-24,86.5549
2017-04-25,87.237
2017-04-26,87.6463
2017-04-27,88.1141
2017-04-28,87.7633
2017-05-01,87.8802
2017-05-02,87.9776
2017-05-03,87.4612
2017-05-04,87.3247
2017-05-05,87.8704
2017-05-08,88.0361
2017-05-09,88.5429
2017-05-10,88.2408
2017-05-11,87.7145
2017-05-12,87.5878
2017-05-15,87.6073
2017-05-16,87.3052
2017-05-17,85.8922
2017-05-18,86.3892
2017-05-19,86.9739
2017-05-22,87.4124
2017-05-23,87.0811
2017-05-24,87.3929
2017-05-25,88.1628
2017-05-26,88.4259
2017-05-30,88.4941
2017-05-31,88.728
2017-06-01,89.5661
2017-06-02,89.8877
2017-06-05,89.644
2017-06-06,88.8742
2017-06-07,89.0301
2017-06-08,88.4551
2017-06-09,88.0653
2017-06-12,88.0166
2017-06-13,88.5623
2017-06-14,88.5136
2017-06-15,88.1433
2017-06-16,88.1185
2017-06-19,88.7929
2017-06-20,87.6786
2017-06-21,87.8155
2017-06-22,87.6102
2017-06-23,87.5027
2017-06-26,87.8155
2017-06-27,87.1215
2017-06-28,88.0012
2017-06-29,87.1508
2017-06-30,87.6102
2017-07-03,87.5222
2017-07-05,87.3072
2017-07-06,86.4177
2017-07-07,87.1899
2017-07-10,87.3756
2017-07-11,87.1997
2017-07-12,87.8643
2017-07-13,87.8741
2017-07-14,88.1576
2017-07-17,88.3726
2017-07-18,88.7734
2017-07-19,89.2035
2017-07-20,89.0178
2017-07-21,89.0764
2017-07-24,88.7734
2017-07-25,89.399
2017-07-26,89.3599
2017-07-27,90.0148
2017-07-28,89.3305
2017-07-31,89.3012
2017-08-01,88.9787
2017-08-02,89.2132
2017-08-03,88.9689
2017-08-04,88.9787
2017-08-07,89.1839
2017-08-08,89.2328
2017-08-09,88.7147
2017-08-10,87.3854
2017-08-11,87.835
2017-08-14,88.4606
2017-08-15,87.6493
2017-08-16,88.0989
2017-08-17,86.6914
2017-08-18,86.2613
2017-08-21,86.4177
2017-08-22,87.3463
2017-08-23,86.6034
2017-08-24,86.4177
2017-08-25,86.6327
2017-08-28,86.6816
2017-08-29,86.6034
2017-08-30,87.229
2017-08-31,87.6395
2017-09-01,88.0403
2017-09-05,87.6786
2017-09-06,88.226
2017-09-07,87.4636
2017-09-08,87.1606
2017-09-11,87.62
2017-09-12,88.011
2017-09-13,88.6463
2017-09-14,88.1674
2017-09-15,87.9201
2017-09-18,87.616
2017-09-19,87.5376
2017-09-20,87.8318
2017-09-21,87.6847
2017-09-22,87.8318
2017-09-25,87.6455
2017-09-26,87.6553
2017-09-27,88.1359
2017-09-28,88.028
2017-09-29,88.3615
2017-10-02,88.5283
2017-10-03,88.901
2017-10-04,89.3621
2017-10-05,89.8623
2017-10-06,89.9702
2017-10-09,89.6858
2017-10-10,89.5975
2017-10-11,89.6465
2017-10-12,89.0482
2017-10-13,89.4798
2017-10-16,89.5975
2017-10-17,89.6465
2017-10-18,89.4013
2017-10-19,89.4013
2017-10-20,89.6171
2017-10-23,89.0089
2017-10-24,89.2247
2017-10-25,88.8814
2017-10-26,89.1953
2017-10-27,90.6373
2017-10-30,90.2253
2017-10-31,90.2351
2017-11-01,90.2645
2017-11-02,89.5877
2017-11-03,89.9506
2017-11-06,90.6078
2017-11-07,90.0683
2017-11-08,90.1664
2017-11-09,90.3038
2017-11-10,90.6078
2017-11-13,90.9119
2017-11-14,90.9904
2017-11-15,90.598
2017-11-16,91.3534
2017-11-17,91.7555
2017-11-20,91.9321
2017-11-21,92.501
2017-11-22,92.5893
2017-11-24,92.8247
2017-11-27,92.8934
2017-11-28,93.9234
2017-11-29,94.3255
2017-11-30,94.8062
2017-12-01,94.767
2017-12-04,95.8656
2017-12-05,95.3163
2017-12-06,94.6983
2017-12-07,94.9435
2017-12-08,95.3948
2017-12-11,95.6007
2017-12-12,95.64
2017-12-13,95.7185
2017-12-14,96.0127
2017-12-15,96.428
2017-12-18,97.2942
2017-12-19,97.1662
2017-12-20,96.9792
2017-12-21,97.6091
2017-12-22,97.4221
2017-12-26,97.6386
2017-12-27,97.4418
2017-12-28,97.7075
2017-12-29,97.1367
2018-01-02,98.6131
2018-01-03,99.0658
2018-01-04,99.3906
2018-01-05,100.178
2018-01-08,100.2961
2018-01-09,100.493
2018-01-10,100.4241
2018-01-11,102.058
2018-01-12,103.3769
2018-01-16,102.6387
2018-01-17,103.1308
2018-01-18,103.0422
2018-01-19,103.9379
2018-01-22,105.0895
2018-01-23,105.9753
2018-01-24,106.4281
2018-01-25,106.2411
2018-01-26,107.2844
2018-01-29,106.9891
2018-01-30,106.4576
2018-01-31,106.1131
2018-02-01,104.932
2018-02-02,103.9281
2018-02-05,100.4241
2018-02-06,102.993
2018-02-07,102.6781
2018-02-08,98.5835
2018-02-09,99.243
2018-02-12,100.5914
2018-02-13,101.1131
2018-02-14,102.7273
2018-02-15,103.6426
2018-02-16,103.1407
2018-02-20,102.8257
2018-02-21,102.6781
2018-02-22,102.806
2018-02-23,104.243
2018-02-26,105.119
2018-02-27,102.8946
2018-02-28,102.432
2018-03-01,101.3296
2018-03-02,101.428
2018-03-05,102.6387
2018-03-06,103.3474
2018-03-07,102.6485
2018-03-08,102.9733
2018-03-09,104.5678
2018-03-12,104.9123
2018-03-13,104.1741
2018-03-14,104.0462
2018-03-15,103.9379
2018-03-16,103.8292
2018-03-19,102.536
2018-03-20,103.148
2018-03-21,103.069
2018-03-22,100.8776
2018-03-23,98.8934
2018-03-26,101.8154
2018-03-27,99.8213
2018-03-28,98.6071
2018-03-29,99.9891
2018-04-02,97.1659
2018-04-03,98.3998
2018-04-04,100.2063
2018-04-05,101.5488
2018-04-06,99.387
2018-04-09,99.15
2018-04-10,100.3544
2018-04-11,100.0483
2018-04-12,100.4827
2018-04-13,99.92
2018-04-16,100.6703
2018-04-17,102.5459
2018-04-18,103.0296
2018-04-19,102.7038
2018-04-20,101.6574
2018-04-23,101.8746
2018-04-24,100.2655
2018-04-25,100.6801
2018-04-26,102.3089
2018-04-27,102.7729
2018-04-30,102.3682
2018-05-01,102.5064
2018-05-02,101.8055
2018-05-03,101.3514
2018-05-04,102.6841
2018-05-07,103.0296
2018-05-08,102.5952
2018-05-09,102.9506
2018-05-10,103.3257
2018-05-11,103.5429
2018-05-14,103.7403
2018-05-15,103.1381
2018-05-16,103.997
2018-05-17,103.6515
2018-05-18,103.5231
2018-05-21,104.0957
2018-05-22,103.6317
2018-05-23,104.382
2018-05-24,104.609
2018-05-25,104.767
2018-05-29,103.9575
2018-05-30,104.9052
2018-05-31,104.4017
2018-06-01,105.1717
2018-06-04,106.3464
2018-06-05,106.9683
2018-06-06,107.9653
2018-06-07,108.2812
2018-06-08,108.5083
2018-06-11,108.9426
2018-06-12,109.4658
2018-06-13,109.6336
2018-06-14,110.7787
2018-06-15,110.9605
2018-06-18,110.7725
2018-06-19,110.6339
2018-06-20,111.1585
2018-06-21,110.3667
2018-06-22,110.1786
2018-06-25,107.7835
2018-06-26,108.5555
2018-06-27,107.15
2018-06-28,107.9913
2018-06-29,108.1793
2018-07-02,108.3278
2018-07-03,107.7835
2018-07-05,108.3179
2018-07-06,109.1691
2018-07-09,110.4756
2018-07-10,110.7131
2018-07-11,110.4558
2018-07-12,111.1882
2018-07-13,111.4356
2018-07-16,111.7127
2018-07-17,111.8216
2018-07-18,111.7523
2018-07-19,111.495
2018-07-20,111.0001
2018-07-23,110.8814
2018-07-24,110.5547
2018-07-25,111.3663
2018-07-26,110.7824
2018-07-27,110.4954
2018-07-30,109.6145
2018-07-31,110.1292
2018-08-01,109.5848
2018-08-02,110.337
2018-08-03,110.7131
2018-08-06,111.4554
2018-08-07,111.9701
2018-08-08,112.0889
2018-08-09,112.5045
2018-08-10,111.5643
2018-08-13,111.0001
2018-08-14,112.079
2018-08-15,110.7131
2018-08-16,111.2575
2018-08-17,111.3564
2018-08-20,112.1482
2018-08-21,113.039
2018-08-22,113.1578
2018-08-23,113.0489
2018-08-24,113.712
2018-08-27,114.4444
2018-08-28,114.6721
2018-08-29,115.9588
2018-08-30,115.2956
2018-08-31,115.7509
2018-09-04,115.9687
2018-09-05,114.7216
2018-09-06,114.4049
2018-09-07,114.395
2018-09-10,114.8206
2018-09-11,115.741
2018-09-12,115.9588
2018-09-13,116.1567
2018-09-14,115.7212
2018-09-17,114.2861
2018-09-18,115.741
2018-09-19,115.7905
2018-09-20,116.5823
2018-09-21,116.0673
2018-09-24,115.3129
2018-09-25,115.7993
2018-09-26,116.0673
2018-09-27,116.4644
2018-09-28,116.3651
2018-10-01,116.0078
2018-10-02,114.4393
2018-10-03,114.0521
2018-10-04,112.2653
2018-10-05,111.4215
2018-10-08,111.7094
2018-10-09,111.3818
2018-10-10,107.6293
2018-10-11,105.7333
2018-10-12,107.6889
2018-10-15,107.4407
2018-10-16,109.5949
2018-10-17,108.6915
2018-10-18,106.6068
2018-10-19,105.5645
2018-10-22,105.9914
2018-10-23,106.0112
2018-10-24,102.8445
2018-10-25,105.9516
2018-10-26,102.6559
2018-10-29,101.7525
2018-10-30,103.2813
2018-10-31,104.6115
2018-11-01,106.7458
2018-11-02,107.1826
2018-11-05,107.3315
2018-11-06,107.808
2018-11-07,110.7266
2018-11-08,110.7564
2018-11-09,109.2177
2018-11-12,107.0238
2018-11-13,106.9741
2018-11-14,106.17
2018-11-15,106.0112
2018-11-16,105.5943
2018-11-19,103.0132
2018-11-20,100.6804
2018-11-21,101.7326
2018-11-23,101.276
2018-11-26,103.5493
2018-11-27,103.857
2018-11-28,106.9245
2018-11-29,106.4281
2018-11-30,107.2025
2018-12-03,109.2077
2018-12-04,105.2766
2018-12-06,105.7829
2018-12-07,102.6162
2018-12-10,102.6956
2018-12-11,102.7353
2018-12-12,103.8173
2018-12-13,103.3011
2018-12-14,101.5837
2018-12-17,99.0027
2018-12-18,99.777
2018-12-19,97.8015
2018-12-20,95.6076
2018-12-21,93.4408
2018-12-24,91.6669
2018-12-26,97.0983
2018-12-27,97.6166
2018-12-28,97.6265
2018-12-31,98.673
2019-01-02,99.4204
2019-01-03,97.2678
2019-01-04,100.4868
2019-01-07,102.759
2019-01-08,103.8951
2019-01-09,104.4233
2019-01-10,104.1244
2019-01-11,104.224
2019-01-14,103.5862
2019-01-15,104.523
2019-01-16,104.2838
2019-01-17,104.9914
2019-01-18,106.4464
2019-01-22,104.8519
2019-01-23,105.0611
2019-01-24,105.4997
2019-01-25,106.6657
2019-01-28,106.0478
2019-01-29,105.3601
2019-01-30,107.433
2019-01-31,108.4097
2019-02-01,106.8251
2019-02-04,107.5227
2019-02-05,108.5293
2019-02-06,108.0808
2019-02-07,107.1939
2019-02-08,106.7653
2019-02-11,106.9547
2019-02-12,108.5991
2019-02-13,109.3365
2019-02-14,108.9379
2019-02-15,109.6854
2019-02-19,110.1338
2019-02-20,110.3531
2019-02-21,110.1338
2019-02-22,110.7318
2019-02-25,110.363
2019-02-26,110.5125
2019-02-27,110.4328
2019-02-28,109.8348
2019-03-01,110.7218
2019-03-04,110.373
2019-03-05,110.6521
2019-03-06,110.1338
2019-03-07,108.7984
2019-03-08,108.041
2019-03-11,109.5259
2019-03-12,109.8348
2019-03-13,110.2235
2019-03-14,109.8946
2019-03-15,110.6
2019-03-18,111.67
2019-03-19,112.23
2019-03-20,112.39
2019-03-21,113.93
2019-03-22,111.67
2019-03-25,112.33
2019-03-26,112.81
2019-03-27,112.58
2019-03-28,113.26
2019-03-29,113.85
2019-04-01,115.1
2019-04-02,115.08
2019-04-03,115.89
2019-04-04,116.83
2019-04-05,117.52
2019-04-08,117.94
2019-04-09,116.88
2019-04-10,117.44
2019-04-11,117.59
2019-04-12,118.32
2019-04-15,118.56
2019-04-16,119.08
2019-04-17,119.31
2019-04-18,119.27
2019-04-22,118.82
2019-04-23,120.24
2019-04-24,120.35
2019-04-25,119.72
2019-04-26,120.67
2019-04-29,120.25
2019-04-30,120.07
2019-05-01,118.61
2019-05-02,118.7
2019-05-03,120.1
2019-05-06,119.37
2019-05-07,117.56
2019-05-08,117.6
2019-05-09,117.12
2019-05-10,117.29
2019-05-13,113.8
2019-05-14,114.95
2019-05-15,115.73
2019-05-16,116.8
2019-05-17,115.91
2019-05-20,115.09
2019-05-21,115.89
2019-05-22,114.7
2019-05-23,113.28
2019-05-24,113.43
2019-05-28,112.68
2019-05-29,111.68
2019-05-30,112.41
2019-05-31,110.94
2019-06-03,110.01
2019-06-04,112.99
2019-06-05,113.55
2019-06-06,114.13
2019-06-07,115.78
2019-06-10,116.76
2019-06-11,117.21
2019-06-12,117.18
2019-06-13,118.075
2019-06-14,118.665
2019-06-17,118.605
2019-06-18,119.365
2019-06-19,119.58
2019-06-20,120.345
2019-06-21,119.79
2019-06-24,118.9
2019-06-25,117.83
2019-06-26,118.25
2019-06-27,118.935
2019-06-28,119.115
2019-07-01,120.105
2019-07-02,120.23
2019-07-03,121.56
2019-07-04,121.56
2019-07-05,121.64
2019-07-08,121.9
2019-07-09,121.945
2019-07-10,122.4
2019-07-11,122.535
2019-07-12,124.05
2019-07-15,124.46
2019-07-16,124.35
2019-07-17,123.27
2019-07-18,122.985
2019-07-19,122.215
2019-07-22,122.205
2019-07-23,122.915
2019-07-24,123.625
2019-07-25,123.01
2019-07-26,123.555
2019-07-29,122.985
2019-07-30,121.985
2019-07-31,120.895
2019-08-01,119.07
2019-08-02,118.095
2019-08-05,115.175
2019-08-06,116.635
2019-08-07,117.155
2019-08-08,119.27
2019-08-09,118.325
2019-08-12,116.665
2019-08-13,118.435
2019-08-14,114.955
2019-08-15,114.755
2019-08-16,115.98
2019-08-19,117.475
2019-08-20,117.42
2019-08-21,119.585
2019-08-22,119.755
2019-08-23,116.07
2019-08-26,117.36
2019-08-27,117.135
2019-08-28,118.55
2019-08-29,120.26
2019-08-30,119.715
2019-09-02,119.66
2019-09-03,119.155
2019-09-04,120.195
2019-09-05,122.525
2019-09-06,122.765
2019-09-09,123.34
2019-09-10,122.67
2019-09-11,122.915
2019-09-12,123.72
2019-09-13,123.42
2019-09-16,121.845
2019-09-17,122.565
2019-09-18,122.51
2019-09-19,122.195
2019-09-20,120.55
2019-09-23,120.825
2019-09-24,119.52
2019-09-25,120.65
2019-09-26,119.995
2019-09-27,119.595
2019-09-30,120.695
2019-10-01,119.685
2019-10-02,117.535
2019-10-03,117.99
2019-10-04,119.25
2019-10-07,118.94
2019-10-08,117.48
2019-10-09,118.525
2019-10-10,119.24
2019-10-11,120.71
2019-10-14,120.515
2019-10-15,121.84
2019-10-16,122.075
2019-10-17,122.375
2019-10-18,122.29
2019-10-21,122.625
2019-10-22,121.89
2019-10-23,121.235
2019-10-24,121.255
2019-10-25,121.075
2019-10-28,121.445
2019-10-29,120.755
2019-10-30,121.415
2019-10-31,120.735
2019-11-01,121.505
2019-11-04,121.61
2019-11-05,121.875
2019-11-06,121.975
2019-11-07,121.225
2019-11-08,121.285
2019-11-11,121.04
2019-11-12,120.97
2019-11-13,120.655
2019-11-14,121.125
2019-11-15,121.29
2019-11-18,121.735
2019-11-19,120.485
2019-11-20,120.11
2019-11-21,119.56
2019-11-22,120.32
2019-11-25,121.345
