date,close
2014-06-13,30.3868
2014-06-16,30.7969
2014-06-17,30.6128
2014-06-18,31.0061
2014-06-19,31.3743
2014-06-20,31.3157
2014-06-23,31.4329
2014-06-24,31.6589
2014-06-25,31.8095
2014-06-26,32.1024
2014-06-27,32.3618
2014-06-30,32.7049
2014-07-01,32.7049
2014-07-02,32.0606
2014-07-03,31.8513
2014-07-07,31.7928
2014-07-08,31.696
2014-07-09,31.536
2014-07-10,31.7128
2014-07-11,31.5023
2014-07-14,31.4097
2014-07-15,31.5444
2014-07-16,31.4602
2014-07-17,31.275
2014-07-18,31.7633
2014-07-21,31.6875
2014-07-22,31.696
2014-07-23,31.5781
2014-07-24,31.5023
2014-07-25,31.1235
2014-07-28,31.5781
2014-07-29,31.4602
2014-07-30,31.0225
2014-07-31,30.2648
2014-08-01,30.3658
2014-08-04,30.3658
2014-08-05,30.0122
2014-08-06,29.5745
2014-08-07,29.4566
2014-08-08,29.7176
2014-08-11,29.8691
2014-08-12,29.9112
2014-08-13,30.1469
2014-08-14,30.1469
2014-08-15,30.3742
2014-08-18,30.2311
2014-08-19,30.6941
2014-08-20,30.913
2014-08-21,30.9383
2014-08-22,30.913
2014-08-25,31.0477
2014-08-26,30.7783
2014-08-27,31.1656
2014-08-28,31.3255
2014-08-29,31.5865
2014-09-02,31.174
2014-09-03,31.3845
2014-09-04,31.5528
2014-09-05,31.7296
2014-09-08,31.4181
2014-09-09,31.0898
2014-09-10,30.9299
2014-09-11,31.1403
2014-09-12,30.4921
2014-09-15,30.5594
2014-09-16,30.7026
2014-09-17,30.5258
2014-09-18,30.2648
2014-09-19,30.5258
2014-09-22,30.1217
2014-09-23,29.886
2014-09-24,30.61
2014-09-25,31.0056
2014-09-26,31.1067
2014-09-29,31.2329
2014-09-30,31.2414
2014-10-01,31.0225
2014-10-02,30.972
2014-10-03,31.2582
2014-10-06,31.3171
2014-10-07,31.1235
2014-10-08,31.471
2014-10-09,30.5556
2014-10-10,30.3607
2014-10-13,29.8351
2014-10-14,29.4792
2014-10-15,28.7587
2014-10-16,29.1995
2014-10-17,30.1742
2014-10-20,30.6997
2014-10-21,31.0472
2014-10-22,31.0218
2014-10-23,31.2676
2014-10-24,31.2082
2014-10-27,31.3184
2014-10-28,31.3862
2014-10-29,31.1404
2014-10-30,31.7253
2014-10-31,31.6066
2014-11-03,31.6405
2014-11-04,31.4117
2014-11-05,31.7168
2014-11-06,31.6405
2014-11-07,31.9711
2014-11-10,32.0643
2014-11-11,32.0135
2014-11-12,31.7253
2014-11-13,30.8777
2014-11-14,30.8099
2014-11-17,31.0981
2014-11-18,31.3269
2014-11-19,31.3693
2014-11-20,31.1913
2014-11-21,31.3015
2014-11-24,31.0218
2014-11-25,30.954
2014-11-26,30.6658
2014-11-28,30.2505
2014-12-01,29.7758
2014-12-02,30.1911
2014-12-03,30.1827
2014-12-04,30.0216
2014-12-05,30.1149
2014-12-08,30.1572
2014-12-09,30.3607
2014-12-10,29.5131
2014-12-11,29.53
2014-12-12,29.0893
2014-12-15,28.1569
2014-12-16,28.301
2014-12-17,29.1062
2014-12-18,29.6826
2014-12-19,29.5046
2014-12-22,29.6572
2014-12-23,29.7165
2014-12-24,30.047
2014-12-26,30.4115
2014-12-29,31.0811
2014-12-30,30.3691
2014-12-31,30.0725
2015-01-02,30.1996
2015-01-05,29.8351
2015-01-06,29.4198
2015-01-07,29.8382
2015-01-08,30.2224
2015-01-09,29.3942
2015-01-12,29.0357
2015-01-13,28.9332
2015-01-14,29.0015
2015-01-15,29.3686
2015-01-16,29.9065
2015-01-20,29.9662
2015-01-21,30.2907
2015-01-22,30.4699
2015-01-23,30.4785
2015-01-26,30.6151
2015-01-27,30.9053
2015-01-28,30.6065
2015-01-29,30.709
2015-01-30,30.0345
2015-02-02,30.248
2015-02-03,30.3504
2015-02-04,29.8126
2015-02-05,29.9406
2015-02-06,28.7198
2015-02-09,28.4637
2015-02-10,28.8393
2015-02-11,28.3868
2015-02-12,28.8137
2015-02-13,28.4637
2015-02-17,28.4551
2015-02-18,28.9332
2015-02-19,28.9588
2015-02-20,29.0698
2015-02-23,28.9076
2015-02-24,29.0954
2015-02-25,28.8649
2015-02-26,27.9429
2015-02-27,27.7551
2015-03-02,27.1489
2015-03-03,27.6782
2015-03-04,27.0806
2015-03-05,27.5075
2015-03-06,27.0294
2015-03-09,27.0379
2015-03-10,26.7903
2015-03-11,26.6281
2015-03-12,26.8842
2015-03-13,26.6708
2015-03-16,26.8928
2015-03-17,26.833
2015-03-18,27.5672
2015-03-19,27.1147
2015-03-20,27.7038
2015-03-23,27.5672
2015-03-24,27.2428
2015-03-25,26.8928
2015-03-26,26.7306
2015-03-27,26.9099
2015-03-30,27.1916
2015-03-31,26.9867
2015-04-01,27.1745
2015-04-02,27.3282
2015-04-06,27.6099
2015-04-07,27.2428
2015-04-08,27.2084
2015-04-09,27.2084
2015-04-10,27.5956
2015-04-13,27.4924
2015-04-14,27.7161
2015-04-15,27.9484
2015-04-16,27.7161
2015-04-17,28.1119
2015-04-20,28.2754
2015-04-21,27.8882
2015-04-22,27.8107
2015-04-23,27.9054
2015-04-24,27.9226
2015-04-27,27.587
2015-04-28,27.8968
2015-04-29,28.2324
2015-04-30,28.1205
2015-05-01,27.8538
2015-05-04,28.0517
2015-05-05,27.544
2015-05-06,27.5354
2015-05-07,27.501
2015-05-08,27.501
2015-05-11,27.3805
2015-05-12,26.8814
2015-05-13,26.8556
2015-05-14,27.2945
2015-05-15,27.5268
2015-05-18,27.5698
2015-05-19,27.3719
2015-05-20,27.3891
2015-05-21,27.2945
2015-05-22,27.1912
2015-05-26,26.8728
2015-05-27,27.0621
2015-05-28,27.131
2015-05-29,27.1051
2015-06-01,26.9331
2015-06-02,26.2877
2015-06-03,26.0812
2015-06-04,25.78
2015-06-05,25.8488
2015-06-08,25.6165
2015-06-09,25.083
2015-06-10,25.1691
2015-06-11,25.3412
2015-06-12,25.083
2015-06-15,24.9195
2015-06-16,25.0486
2015-06-17,25.2121
2015-06-18,25.3842
2015-06-19,25.1949
2015-06-22,25.3412
2015-06-23,25.1605
2015-06-24,25.0228
2015-06-25,24.6528
2015-06-26,24.9109
2015-06-29,24.6872
2015-06-30,24.5839
2015-07-01,24.6786
2015-07-02,25.1691
2015-07-06,25.0572
2015-07-07,25.4702
2015-07-08,25.1578
2015-07-09,24.8628
2015-07-10,24.9582
2015-07-13,25.0363
2015-07-14,24.9322
2015-07-15,25.0971
2015-07-16,25.4095
2015-07-17,24.8367
2015-07-20,24.6545
2015-07-21,24.3855
2015-07-22,24.3768
2015-07-23,24.1338
2015-07-24,24.1512
2015-07-27,24.6371
2015-07-28,25.0016
2015-07-29,25.2533
2015-07-30,25.557
2015-07-31,25.826
2015-08-03,25.8
2015-08-04,25.4702
2015-08-05,25.6004
2015-08-06,25.5397
2015-08-07,25.9822
2015-08-10,26.2686
2015-08-11,26.3641
2015-08-12,26.7286
2015-08-13,26.6418
2015-08-14,26.9108
2015-08-17,27.2926
2015-08-18,26.9629
2015-08-19,26.8587
2015-08-20,26.4248
2015-08-21,25.9649
2015-08-24,24.6892
2015-08-25,23.8214
2015-08-26,23.9776
2015-08-27,24.7673
2015-08-28,24.6718
2015-08-31,24.3334
2015-09-01,23.5958
2015-09-02,23.24
2015-09-03,23.6044
2015-09-04,23.1705
2015-09-08,23.6999
2015-09-09,23.3441
2015-09-10,23.1619
2015-09-11,23.3528
2015-09-14,23.3007
2015-09-15,23.4916
2015-09-16,23.8648
2015-09-17,23.9863
2015-09-18,23.6218
2015-09-21,23.7259
2015-09-22,23.2573
2015-09-23,23.2313
2015-09-24,23.4569
2015-09-25,23.4916
2015-09-28,23.1966
2015-09-29,23.0317
2015-09-30,23.7433
2015-10-01,23.4829
2015-10-02,24.0644
2015-10-05,24.316
2015-10-06,24.2727
2015-10-07,24.4611
2015-10-08,24.873
2015-10-09,24.8993
2015-10-12,24.8818
2015-10-13,24.9081
2015-10-14,24.9957
2015-10-15,25.2849
2015-10-16,25.2849
2015-10-19,25.3112
2015-10-20,25.3463
2015-10-21,25.2586
2015-10-22,25.6267
2015-10-23,25.2323
2015-10-26,25.1622
2015-10-27,24.8993
2015-10-28,24.9168
2015-10-29,24.9607
2015-10-30,24.9869
2015-11-02,24.7153
2015-11-03,24.8993
2015-11-04,24.8993
2015-11-05,24.0842
2015-11-06,22.8485
2015-11-09,22.901
2015-11-10,23.1464
2015-11-11,23.3217
2015-11-12,22.8835
2015-11-13,22.5943
2015-11-16,23.2779
2015-11-17,22.6907
2015-11-18,22.8134
2015-11-19,23.0325
2015-11-20,22.8397
2015-11-23,22.7082
2015-11-24,22.5943
2015-11-25,22.6732
2015-11-27,22.7345
2015-11-30,22.8835
2015-12-01,22.7345
2015-12-02,22.0071
2015-12-03,21.5338
2015-12-04,21.6916
2015-12-07,21.7003
2015-12-08,21.5776
2015-12-09,21.6916
2015-12-10,21.3585
2015-12-11,21.8143
2015-12-14,21.6916
2015-12-15,21.823
2015-12-16,22.3314
2015-12-17,22.3664
2015-12-18,22.3226
2015-12-21,22.7521
2015-12-22,23.1114
2015-12-23,23.5145
2015-12-24,23.4006
2015-12-28,23.4707
2015-12-29,23.497
2015-12-30,23.3656
2015-12-31,23.0413
2016-01-04,23.2166
2016-01-05,23.0062
2016-01-06,22.8069
2016-01-07,22.3464
2016-01-08,22.5944
2016-01-11,22.5235
2016-01-12,22.1958
2016-01-13,21.7707
2016-01-14,22.2578
2016-01-15,22.1515
2016-01-19,21.9567
2016-01-20,21.2747
2016-01-21,21.1329
2016-01-22,21.9478
2016-01-25,21.7352
2016-01-26,22.2224
2016-01-27,22.0009
2016-01-28,22.3021
2016-01-29,23.2321
2016-02-01,23.6395
2016-02-02,23.5864
2016-02-03,24.1621
2016-02-04,24.1355
2016-02-05,23.8521
2016-02-08,23.5155
2016-02-09,23.2764
2016-02-10,23.2409
2016-02-11,22.8069
2016-02-12,22.9486
2016-02-16,23.2144
2016-02-17,23.2321
2016-02-18,23.7546
2016-02-19,23.4269
2016-02-22,23.7369
2016-02-23,23.4978
2016-02-24,23.6749
2016-02-25,23.8786
2016-02-26,22.2046
2016-02-29,22.0364
2016-03-01,22.3906
2016-03-02,22.8866
2016-03-03,23.0726
2016-03-04,23.4358
2016-03-07,23.3649
2016-03-08,23.2055
2016-03-09,23.3649
2016-03-10,23.5332
2016-03-11,24.0381
2016-03-14,24.0558
2016-03-15,24.3303
2016-03-16,24.5695
2016-03-17,25.0655
2016-03-18,24.9415
2016-03-21,24.9503
2016-03-22,24.7378
2016-03-23,24.8795
2016-03-24,24.8795
2016-03-28,24.9149
2016-03-29,25.3755
2016-03-30,25.3223
2016-03-31,25.3578
2016-04-01,25.6412
2016-04-04,25.4375
2016-04-05,24.9238
2016-04-06,24.8299
2016-04-07,24.7315
2016-04-08,25.2413
2016-04-11,24.8746
2016-04-12,25.1161
2016-04-13,25.1161
2016-04-14,25.0445
2016-04-15,25.3486
2016-04-18,25.4023
2016-04-19,25.6617
2016-04-20,25.1966
2016-04-21,24.4184
2016-04-22,24.7494
2016-04-25,24.9551
2016-04-26,25.3576
2016-04-27,25.9926
2016-04-28,26.252
2016-04-29,26.4667
2016-05-02,26.6456
2016-05-03,26.2431
2016-05-04,26.7619
2016-05-05,27.0839
2016-05-06,26.7798
2016-05-09,26.9139
2016-05-10,27.2985
2016-05-11,27.54
2016-05-12,27.7189
2016-05-13,27.54
2016-05-16,27.5132
2016-05-17,27.5132
2016-05-18,26.6993
2016-05-19,27.1375
2016-05-20,27.3343
2016-05-23,27.0213
2016-05-24,27.2359
2016-05-25,27.1107
2016-05-26,27.2717
2016-05-27,27.1018
2016-05-31,27.0034
2016-06-01,27.2359
2016-06-02,27.3969
2016-06-03,27.6921
2016-06-06,27.9873
2016-06-07,27.8978
2016-06-08,27.871
2016-06-09,28.1572
2016-06-10,27.6742
2016-06-13,27.7458
2016-06-14,27.549
2016-06-15,27.4416
2016-06-16,27.6653
2016-06-17,27.7458
2016-06-20,27.7189
2016-06-21,27.862
2016-06-22,27.54
2016-06-23,27.9425
2016-06-24,28.1393
2016-06-27,27.7905
2016-06-28,28.2198
2016-06-29,28.6581
2016-06-30,29.2932
2016-07-01,29.1679
2016-07-05,29.1232
2016-07-06,29.1638
2016-07-07,28.6947
2016-07-08,29.1007
2016-07-11,29.2179
2016-07-12,28.9834
2016-07-13,28.9563
2016-07-14,28.9202
2016-07-15,28.9202
2016-07-18,28.9744
2016-07-19,28.8661
2016-07-20,28.8661
2016-07-21,28.83
2016-07-22,29.4705
2016-07-25,29.0556
2016-07-26,28.8751
2016-07-27,28.4873
2016-07-28,28.4782
2016-07-29,29.0195
2016-08-01,28.361
2016-08-02,27.946
2016-08-03,28.0633
2016-08-04,28.1806
2016-08-05,27.7385
2016-08-08,28.0001
2016-08-09,28.0272
2016-08-10,28.0813
2016-08-11,28.4241
2016-08-12,28.2347
2016-08-15,27.7927
2016-08-16,27.1702
2016-08-17,27.4499
2016-08-18,27.919
2016-08-19,28.1445
2016-08-22,28.4963
2016-08-23,28.2257
2016-08-24,28.1986
2016-08-25,28.0903
2016-08-26,27.504
2016-08-29,27.928
2016-08-30,27.8738
2016-08-31,28.0813
2016-09-01,27.7656
2016-09-02,28.2888
2016-09-06,28.7759
2016-09-07,28.9834
2016-09-08,29.2901
2016-09-09,28.1445
2016-09-12,28.4422
2016-09-13,27.6754
2016-09-14,27.8287
2016-09-15,28.0543
2016-09-16,28.361
2016-09-19,28.7308
2016-09-20,28.8751
2016-09-21,29.6058
2016-09-22,29.7411
2016-09-23,29.4795
2016-09-26,29.5968
2016-09-27,29.2991
2016-09-28,29.5156
2016-09-29,28.9653
2016-09-30,28.5233
2016-10-03,28.2708
2016-10-04,27.495
2016-10-05,27.3958
2016-10-06,27.3251
2016-10-07,26.988
2016-10-10,27.6531
2016-10-11,27.234
2016-10-12,27.4071
2016-10-13,27.6531
2016-10-14,27.5985
2016-10-17,27.7443
2016-10-18,27.9538
2016-10-19,28.0085
2016-10-20,28.0814
2016-10-21,27.8354
2016-10-24,27.8991
2016-10-25,27.9629
2016-10-26,27.9811
2016-10-27,27.9174
2016-10-28,27.9629
2016-10-31,28.2818
2016-11-01,27.562
2016-11-02,27.0882
2016-11-03,27.2067
2016-11-04,27.6987
2016-11-07,28.4823
2016-11-08,28.783
2016-11-09,28.4549
2016-11-10,27.6987
2016-11-11,27.7351
2016-11-14,27.7351
2016-11-15,28.4276
2016-11-16,28.2272
2016-11-17,27.9083
2016-11-18,28.1087
2016-11-21,28.5461
2016-11-22,28.5005
2016-11-23,28.4276
2016-11-25,28.9105
2016-11-28,29.2203
2016-11-29,29.3934
2016-11-30,28.8376
2016-12-01,29.0107
2016-12-02,29.4663
2016-12-05,29.5301
2016-12-06,29.193
2016-12-07,29.5301
2016-12-08,29.7943
2016-12-09,30.2317
2016-12-12,30.6781
2016-12-13,30.8786
2016-12-14,30.2954
2016-12-15,30.6052
2016-12-16,30.6963
2016-12-19,30.7692
2016-12-20,30.7692
2016-12-21,30.587
2016-12-22,30.7692
2016-12-23,30.7419
2016-12-27,30.751
2016-12-28,30.2954
2016-12-29,30.6508
2016-12-30,30.4777
2017-01-03,30.5323
2017-01-04,30.8877
2017-01-05,30.7875
2017-01-06,31.0931
2017-01-09,30.468
2017-01-10,30.3944
2017-01-11,30.7714
2017-01-12,30.9828
2017-01-13,31.0288
2017-01-17,31.0564
2017-01-18,30.9828
2017-01-19,30.5415
2017-01-20,30.707
2017-01-23,30.6886
2017-01-24,30.9093
2017-01-25,31.0748
2017-01-26,30.946
2017-01-27,30.7254
2017-01-30,30.5599
2017-01-31,30.8357
2017-02-01,30.5139
2017-02-02,30.8173
2017-02-03,31.1391
2017-02-06,31.1575
2017-02-07,31.1667
2017-02-08,31.1667
2017-02-09,31.3138
2017-02-10,31.5069
2017-02-13,31.7551
2017-02-14,31.5436
2017-02-15,31.4333
2017-02-16,31.8286
2017-02-17,31.8286
2017-02-21,32.132
2017-02-22,32.132
2017-02-23,32.8675
2017-02-24,33.1985
2017-02-27,33.3456
2017-02-28,33.8605
2017-03-01,34.0351
2017-03-02,33.9984
2017-03-03,33.7777
2017-03-06,33.7409
2017-03-07,33.8329
2017-03-08,32.987
2017-03-09,33.1433
2017-03-10,33.2996
2017-03-13,33.4559
2017-03-14,33.3272
2017-03-15,33.934
2017-03-16,33.6674
2017-03-17,33.8237
2017-03-20,33.5479
2017-03-21,32.8308
2017-03-22,32.7572
2017-03-23,32.6837
2017-03-24,32.8124
2017-03-27,32.5549
2017-03-28,32.7388
2017-03-29,32.5457
2017-03-30,32.3343
2017-03-31,32.1596
2017-04-03,32.0861
2017-04-04,32.3435
2017-04-05,32.4354
2017-04-06,32.4656
2017-04-07,32.2801
2017-04-10,32.141
2017-04-11,32.3543
2017-04-12,32.2337
2017-04-13,32.0204
2017-04-17,32.1317
2017-04-18,32.3543
2017-04-19,32.2894
2017-04-20,32.2152
2017-04-21,32.6047
2017-04-24,32.7067
2017-04-25,32.4748
2017-04-26,32.4285
2017-04-27,32.4192
2017-04-28,32.2523
2017-05-01,32.0112
2017-05-02,32.0483
2017-05-03,32.2059
2017-05-04,31.835
2017-05-05,31.7979
2017-05-08,31.5753
2017-05-09,31.1673
2017-05-10,31.464
2017-05-11,31.3528
2017-05-12,31.6588
2017-05-15,31.7515
2017-05-16,31.4177
2017-05-17,31.3528
2017-05-18,31.4548
2017-05-19,31.733
2017-05-22,32.1317
2017-05-23,32.2523
2017-05-24,32.549
2017-05-25,32.7159
2017-05-26,32.5954
2017-05-30,32.7716
2017-05-31,33.0405
2017-06-01,33.3094
2017-06-02,33.1889
2017-06-05,33.124
2017-06-06,33.1981
2017-06-07,32.9941
2017-06-08,32.9849
2017-06-09,32.7994
2017-06-12,32.9478
2017-06-13,32.9478
2017-06-14,33.0498
2017-06-15,33.3743
2017-06-16,33.8194
2017-06-19,33.2074
2017-06-20,32.855
2017-06-21,32.753
2017-06-22,32.9107
2017-06-23,32.8921
2017-06-26,33.1981
2017-06-27,32.8365
2017-06-28,32.549
2017-06-29,32.3635
2017-06-30,32.2615
2017-07-03,32.2986
2017-07-05,32.1224
2017-07-06,32.0219
2017-07-07,32.0125
2017-07-10,32.0032
2017-07-11,31.9377
2017-07-12,32.4054
2017-07-13,32.2183
2017-07-14,32.34
2017-07-17,32.4522
2017-07-18,32.5738
2017-07-19,32.7329
2017-07-20,32.9293
2017-07-21,33.1351
2017-07-24,33.2848
2017-07-25,33.3503
2017-07-26,33.3222
2017-07-27,33.5
2017-07-28,33.4906
2017-07-31,33.5467
2017-08-01,33.5935
2017-08-02,33.4345
2017-08-03,33.6871
2017-08-04,33.5935
2017-08-07,33.8835
2017-08-08,33.9022
2017-08-09,33.7058
2017-08-10,33.3971
2017-08-11,33.1351
2017-08-14,33.1819
2017-08-15,33.2193
2017-08-16,33.3503
2017-08-17,33.1071
2017-08-18,33.2942
2017-08-21,33.4532
2017-08-22,33.79
2017-08-23,33.949
2017-08-24,33.9209
2017-08-25,33.8835
2017-08-28,34.0613
2017-08-29,33.8461
2017-08-30,33.7806
2017-08-31,33.4158
2017-09-01,33.4532
2017-09-05,33.2848
2017-09-06,33.3971
2017-09-07,33.6964
2017-09-08,33.818
2017-09-11,34.2297
2017-09-12,33.8274
2017-09-13,33.6309
2017-09-14,33.9303
2017-09-15,33.9677
2017-09-18,33.8835
2017-09-19,33.9116
2017-09-20,33.7806
2017-09-21,33.5655
2017-09-22,33.528
2017-09-25,33.9303
2017-09-26,33.8461
2017-09-27,33.6964
2017-09-28,33.8461
2017-09-29,33.7058
2017-10-02,33.8367
2017-10-03,33.8274
2017-10-04,33.818
2017-10-05,33.9771
2017-10-06,33.5923
2017-10-09,33.7528
2017-10-10,34.1777
2017-10-11,34.4326
2017-10-12,34.7914
2017-10-13,34.7631
2017-10-16,34.6687
2017-10-17,34.8575
2017-10-18,34.8103
2017-10-19,34.8575
2017-10-20,35.018
2017-10-23,35.1502
2017-10-24,34.933
2017-10-25,34.6875
2017-10-26,34.7631
2017-10-27,35.0085
2017-10-30,34.8386
2017-10-31,34.782
2017-11-01,34.5554
2017-11-02,34.0455
2017-11-03,33.6395
2017-11-06,33.4035
2017-11-07,33.8378
2017-11-08,33.734
2017-11-09,33.5451
2017-11-10,33.0542
2017-11-13,33.158
2017-11-14,33.8473
2017-11-15,33.564
2017-11-16,33.4602
2017-11-17,33.2336
2017-11-20,32.9881
2017-11-21,32.8748
2017-11-22,32.9598
2017-11-24,32.9503
2017-11-27,33.1675
2017-11-28,33.4224
2017-11-29,33.3091
2017-11-30,33.7623
2017-12-01,33.2619
2017-12-04,33.092
2017-12-05,32.3555
2017-12-06,32.2233
2017-12-07,32.7143
2017-12-08,32.5349
2017-12-11,32.6199
2017-12-12,32.1478
2017-12-13,31.9968
2017-12-14,31.959
2017-12-15,32.2422
2017-12-18,31.9212
2017-12-19,31.4775
2017-12-20,31.1282
2017-12-21,30.8355
2017-12-22,31.1659
2017-12-26,30.996
2017-12-27,30.9204
2017-12-28,31.1565
2017-12-29,31.0715
2018-01-02,30.8449
2018-01-03,30.8355
2018-01-04,30.7788
2018-01-05,30.6844
2018-01-08,30.9204
2018-01-09,30.6176
2018-01-10,29.4635
2018-01-11,29.8069
2018-01-12,29.3204
2018-01-16,29.5493
2018-01-17,29.9499
2018-01-18,29.8832
2018-01-19,29.969
2018-01-22,30.1121
2018-01-23,30.3887
2018-01-24,30.6462
2018-01-25,30.8084
2018-01-26,30.6558
2018-01-29,30.2456
2018-01-30,30.2456
2018-01-31,30.713
2018-02-01,30.4555
2018-02-02,29.9022
2018-02-05,29.2727
2018-02-06,28.8817
2018-02-07,28.8817
2018-02-08,28.2331
2018-02-09,28.9866
2018-02-12,29.4444
2018-02-13,29.5303
2018-02-14,29.3586
2018-02-15,29.8927
2018-02-16,30.1025
2018-02-20,29.7687
2018-02-21,29.3967
2018-02-22,30.0167
2018-02-23,31.4284
2018-02-26,30.7893
2018-02-27,30.1216
2018-02-28,29.8927
2018-03-01,30.0835
2018-03-02,29.7496
2018-03-05,30.4459
2018-03-06,29.7592
2018-03-07,29.454
2018-03-08,29.7783
2018-03-09,29.9022
2018-03-12,29.9976
2018-03-13,30.0644
2018-03-14,30.3219
2018-03-15,30.1598
2018-03-16,30.5222
2018-03-19,30.4173
2018-03-20,30.3124
2018-03-21,30.3219
2018-03-22,30.341
2018-03-23,29.9786
2018-03-26,30.341
2018-03-27,30.7702
2018-03-28,30.837
2018-03-29,31.2567
2018-04-02,30.6367
2018-04-03,31.0373
2018-04-04,30.7798
2018-04-05,31.333
2018-04-06,30.8751
2018-04-09,30.9065
2018-04-10,30.6463
2018-04-11,30.6463
2018-04-12,30.415
2018-04-13,30.4632
2018-04-16,31.1281
2018-04-17,31.4365
2018-04-18,31.5618
2018-04-19,31.5714
2018-04-20,31.292
2018-04-23,31.3305
2018-04-24,31.61
2018-04-25,31.61
2018-04-26,31.716
2018-04-27,31.716
2018-04-30,31.6774
2018-05-01,31.6389
2018-05-02,31.8991
2018-05-03,32.5159
2018-05-04,32.9303
2018-05-07,33.0845
2018-05-08,32.593
2018-05-09,32.381
2018-05-10,32.9977
2018-05-11,32.9881
2018-05-14,32.7568
2018-05-15,32.4195
2018-05-16,32.3906
2018-05-17,32.1015
2018-05-18,32.14
2018-05-21,32.4195
2018-05-22,32.4291
2018-05-23,32.8435
2018-05-24,33.1134
2018-05-25,33.1423
2018-05-29,33.2194
2018-05-30,33.8169
2018-05-31,33.7494
2018-06-01,33.1327
2018-06-04,33.2387
2018-06-05,33.0748
2018-06-06,32.3906
2018-06-07,32.5352
2018-06-08,32.5255
2018-06-11,32.034
2018-06-12,32.5737
2018-06-13,32.7664
2018-06-14,33.3061
2018-06-15,32.9785
2018-06-18,33.0459
2018-06-19,33.2387
2018-06-20,33.2483
2018-06-21,33.5374
2018-06-22,33.6916
2018-06-25,34.0096
2018-06-26,33.7687
2018-06-27,33.7976
2018-06-28,33.8458
2018-06-29,33.9325
2018-07-02,33.8073
2018-07-03,33.9133
2018-07-05,34
2018-07-06,34.3373
2018-07-09,33.4059
2018-07-10,33.8242
2018-07-11,34.2619
2018-07-12,34.4273
2018-07-13,34.4565
2018-07-16,34.33
2018-07-17,34.2814
2018-07-18,34.4954
2018-07-19,35.1472
2018-07-20,34.8164
2018-07-23,34.7386
2018-07-24,34.7872
2018-07-25,34.9623
2018-07-26,35.1861
2018-07-27,35.1861
2018-07-30,34.9721
2018-07-31,35.2542
2018-08-01,34.9234
2018-08-02,35.1374
2018-08-03,35.2444
2018-08-06,35.3709
2018-08-07,35.3709
2018-08-08,35.3223
2018-08-09,35.8768
2018-08-10,35.8865
2018-08-13,35.5946
2018-08-14,35.9157
2018-08-15,35.9546
2018-08-16,36.5188
2018-08-17,36.5383
2018-08-20,36.4021
2018-08-21,36.1297
2018-08-22,35.8768
2018-08-23,35.8768
2018-08-24,36.0908
2018-08-27,35.8962
2018-08-28,35.9059
2018-08-29,35.9449
2018-08-30,35.8962
2018-08-31,35.8281
2018-09-04,35.7503
2018-09-05,36.2659
2018-09-06,36.4799
2018-09-07,36.0227
2018-09-10,36.5577
2018-09-11,36.3632
2018-09-12,36.1978
2018-09-13,36.4021
2018-09-14,36.3729
2018-09-17,36.2951
2018-09-18,36.1005
2018-09-19,35.2834
2018-09-20,35.5655
2018-09-21,35.6919
2018-09-24,35.5266
2018-09-25,34.8164
2018-09-26,34.3397
2018-09-27,34.7094
2018-09-28,35.332
2018-10-01,35.3709
2018-10-02,35.7503
2018-10-03,35.2834
2018-10-04,35.6433
2018-10-05,36.0227
2018-10-08,36.5577
2018-10-09,36.8475
2018-10-10,36.6118
2018-10-11,35.6392
2018-10-12,35.7473
2018-10-15,35.8554
2018-10-16,36.4546
2018-10-17,36.6511
2018-10-18,36.5626
2018-10-19,37.1029
2018-10-22,36.6609
2018-10-23,36.4448
2018-10-24,36.985
2018-10-25,36.5332
2018-10-26,35.8947
2018-10-29,36.4251
2018-10-30,36.2581
2018-10-31,35.5115
2018-11-01,35.4231
2018-11-02,35.1284
2018-11-05,35.9339
2018-11-06,36.5528
2018-11-07,36.7886
2018-11-08,37.0342
2018-11-09,37.5548
2018-11-12,37.879
2018-11-13,38.4684
2018-11-14,38.2031
2018-11-15,38.6452
2018-11-16,38.4684
2018-11-19,38.8122
2018-11-20,38.5175
2018-11-21,38.1344
2018-11-23,38.2817
2018-11-26,38.3309
2018-11-27,38.5666
2018-11-28,38.4193
2018-11-29,38.2031
2018-11-30,38.9203
2018-12-03,39.215
2018-12-04,39.3623
2018-12-06,39.6472
2018-12-07,39.7454
2018-12-10,40.0696
2018-12-11,40.5509
2018-12-12,40.5215
2018-12-13,40.8948
2018-12-14,40.8653
2018-12-17,39.4311
2018-12-18,39.4311
2018-12-19,39.1265
2018-12-20,39.323
2018-12-21,39.215
2018-12-24,37.545
2018-12-26,38.1344
2018-12-27,38.5175
2018-12-28,38.3603
2018-12-31,38.4978
2019-01-02,37.5843
2019-01-03,37.9183
2019-01-04,38.5175
2019-01-07,38.3112
2019-01-08,39.2051
2019-01-09,39.1308
2019-01-10,39.7653
2019-01-11,39.3786
2019-01-14,38.9821
2019-01-15,39.6364
2019-01-16,39.6463
2019-01-17,39.8446
2019-01-18,39.9338
2019-01-22,39.9041
2019-01-23,40.4692
2019-01-24,40.7567
2019-01-25,39.9636
2019-01-28,39.8644
2019-01-29,39.7256
2019-01-30,39.9239
2019-01-31,40.5981
2019-02-01,40.3106
2019-02-04,40.4494
2019-02-05,40.3502
2019-02-06,40.1619
2019-02-07,40.8658
2019-02-08,40.9054
2019-02-11,41.0839
2019-02-12,41.1136
2019-02-13,41.3119
2019-02-14,41.2821
2019-02-15,41.5201
2019-02-19,41.5697
2019-02-20,41.5796
2019-02-21,42.2339
2019-02-22,42.4223
2019-02-25,41.877
2019-02-26,41.5597
2019-02-27,41.9365
2019-02-28,42.1546
2019-03-01,42.0654
2019-03-04,41.9761
2019-03-05,41.6886
2019-03-06,41.5994
2019-03-07,41.7481
2019-03-08,42.0059
2019-03-11,42.3727
2019-03-12,42.5412
2019-03-13,42.4223
2019-03-14,42.4619
2019-03-15,42.7395
2019-03-18,42.4817
2019-03-19,41.5994
2019-03-20,41.8968
2019-03-21,42.452
2019-03-22,42.7395
2019-03-25,42.9973
2019-03-26,43.2848
2019-03-27,43.0468
2019-03-28,42.4718
2019-03-29,42.7494
2019-04-01,42.5611
2019-04-02,42.3529
2019-04-03,42.3132
2019-04-04,42.1447
2019-04-05,42.6999
2019-04-08,42.105
2019-04-09,42.07
2019-04-10,41.91
2019-04-11,42.04
2019-04-12,42.16
2019-04-15,42.2
2019-04-16,41.59
2019-04-17,41.47
2019-04-18,41.43
2019-04-22,41.38
2019-04-23,41.53
2019-04-24,42.02
2019-04-25,42.28
2019-04-26,42.24
2019-04-29,41.79
2019-04-30,42.34
2019-05-01,41.68
2019-05-02,41.18
2019-05-03,41.61
2019-05-06,41.72
2019-05-07,41.84
2019-05-08,40.81
2019-05-09,40.65
2019-05-10,41.52
2019-05-13,42.19
2019-05-14,41.77
2019-05-15,41.62
2019-05-16,41.7
2019-05-17,42.26
2019-05-20,42.33
2019-05-21,42.77
2019-05-22,43.12
2019-05-23,43.01
2019-05-24,42.93
2019-05-28,42.34
2019-05-29,41.46
2019-05-30,41.03
2019-05-31,41.56
2019-06-03,42.18
2019-06-04,42.65
2019-06-05,43.5
2019-06-06,43.86
2019-06-07,43.55
2019-06-10,43.35
2019-06-11,42.9
2019-06-12,43.54
2019-06-13,43.175
2019-06-14,43.435
2019-06-17,42.865
2019-06-18,42.85
2019-06-19,43.045
2019-06-20,43.305
2019-06-21,43.335
2019-06-24,43.315
2019-06-25,43.265
2019-06-26,42.18
2019-06-27,42.07
2019-06-28,42.4
2019-07-01,42.57
2019-07-02,43.08
2019-07-03,43.64
2019-07-04,43.64
2019-07-05,43.6
2019-07-08,43.545
2019-07-09,43.13
2019-07-10,43.14
2019-07-11,43.225
2019-07-12,43.235
2019-07-15,43.13
2019-07-16,43.045
2019-07-17,43.165
2019-07-18,43.475
2019-07-19,42.78
2019-07-22,42.66
2019-07-23,42.595
2019-07-24,42.67
2019-07-25,42.32
2019-07-26,42.56
2019-07-29,43.025
2019-07-30,42.945
2019-07-31,42.93
2019-08-01,43.13
2019-08-02,43.04
2019-08-05,42.01
2019-08-06,42.44
2019-08-07,42.37
2019-08-08,42.94
2019-08-09,42.92
2019-08-12,42.705
2019-08-13,42.855
2019-08-14,42.57
2019-08-15,42.55
2019-08-16,43.11
2019-08-19,43.2
2019-08-20,42.74
2019-08-21,42.96
2019-08-22,43.125
2019-08-23,42.13
2019-08-26,42.705
2019-08-27,42.735
2019-08-28,42.53
2019-08-29,42.815
2019-08-30,42.85
2019-09-02,42.915
2019-09-03,43.335
2019-09-04,43.41
2019-09-05,42.925
2019-09-06,43.13
2019-09-09,43.055
2019-09-10,42.955
2019-09-11,43.685
2019-09-12,43.92
2019-09-13,43.93
2019-09-16,44.355
2019-09-17,44.47
2019-09-18,44.67
2019-09-19,44.895
2019-09-20,45.045
2019-09-23,44.925
2019-09-24,45.12
2019-09-25,45.185
2019-09-26,45.405
2019-09-27,45.43
2019-09-30,45.395
2019-10-01,45.265
2019-10-02,44.71
2019-10-03,44.62
2019-10-04,44.905
2019-10-07,44.475
2019-10-08,43.605
2019-10-09,43.61
2019-10-10,43.245
2019-10-11,43.385
2019-10-14,42.775
2019-10-15,42.375
2019-10-16,42.355
2019-10-17,42.59
2019-10-18,42.765
2019-10-21,42.935
2019-10-22,43.245
2019-10-23,43.36
2019-10-24,43.585
2019-10-25,43.08
2019-10-28,42.71
2019-10-29,42.895
2019-10-30,43.075
2019-10-31,43.12
2019-11-01,42.97
2019-11-04,42.965
2019-11-05,42.77
2019-11-06,42.8
2019-11-07,42.915
2019-11-08,42.795
2019-11-11,42.685
2019-11-12,42.955
2019-11-13,43.525
2019-11-14,43.49
2019-11-15,43.315
2019-11-18,43.045
2019-11-19,42.755
2019-11-20,42.675
2019-11-21,42.295
2019-11-22,42.02
2019-11-25,41.995
