date,close
2016-12-29,4.09
2016-12-30,3.76
2017-01-03,4.15
2017-01-04,4.06
2017-01-05,3.96
2017-01-06,3.95
2017-01-09,3.91
2017-01-10,3.92
2017-01-11,4.07
2017-01-12,4.12
2017-01-13,4.14
2017-01-17,4.09
2017-01-18,4.09
2017-01-19,4
2017-01-20,4
2017-01-23,3.99
2017-01-24,4
2017-01-25,4.28
2017-01-26,4.26
2017-01-27,4.18
2017-01-30,4.2
2017-01-31,4.14
2017-02-01,4.15
2017-02-02,4.18
2017-02-03,4.22
2017-02-06,4.33
2017-02-07,4.33
2017-02-08,4.34
2017-02-09,4.31
2017-02-10,4.35
2017-02-13,4.32
2017-02-14,4.3
2017-02-15,4.28
2017-02-16,4.31
2017-02-17,4.31
2017-02-21,4.34
2017-02-22,4.26
2017-02-23,4.32
2017-02-24,4.31
2017-02-27,4.3
2017-02-28,4.19
2017-03-01,4.26
2017-03-02,4.16
2017-03-03,4.26
2017-03-06,4.2
2017-03-07,4.25
2017-03-08,4.21
2017-03-09,4.06
2017-03-10,4.18
2017-03-13,4.12
2017-03-14,4.07
2017-03-15,4.12
2017-03-16,4.21
2017-03-17,4.14
2017-03-20,4.15
2017-03-21,4.04
2017-03-22,4.02
2017-03-23,4.03
2017-03-24,4.06
2017-03-27,3.99
2017-03-28,4.07
2017-03-29,4.13
2017-03-30,4.12
2017-03-31,4.15
2017-04-03,4.12
2017-04-04,4.06
2017-04-05,3.99
2017-04-06,4.05
2017-04-07,3.98
2017-04-10,4.03
2017-04-11,4.04
2017-04-12,4.05
2017-04-13,4.02
2017-04-17,4.1
2017-04-18,4.06
2017-04-19,4.08
2017-04-20,4.17
2017-04-21,4.18
2017-04-24,4.08
2017-04-25,4.12
2017-04-26,4.11
2017-04-27,4.22
2017-04-28,4.08
2017-05-01,4.08
2017-05-02,4.04
2017-05-03,4.02
2017-05-04,4.02
2017-05-05,3.97
2017-05-08,3.9
2017-05-09,3.76
2017-05-10,3.75
2017-05-11,3.73
2017-05-12,3.76
2017-05-15,3.65
2017-05-16,3.6
2017-05-17,3.52
2017-05-18,3.55
2017-05-19,3.47
2017-05-22,3.46
2017-05-23,3.48
2017-05-24,3.5
2017-05-25,3.42
2017-05-26,3.47
2017-05-30,3.32
2017-05-31,3.26
2017-06-01,3.24
2017-06-02,3.18
2017-06-05,3.19
2017-06-06,3.16
2017-06-07,3.18
2017-06-08,3.2
2017-06-09,3.31
2017-06-12,3.12
2017-06-13,3.21
2017-06-14,3.09
2017-06-15,3.06
2017-06-16,2.97
2017-06-19,2.94
2017-06-20,2.92
2017-06-21,3.26
2017-06-22,3.14
2017-06-23,3.2
2017-06-26,3.25
2017-06-27,3.14
2017-06-28,3.01
2017-06-29,3.13
2017-06-30,3.15
2017-07-03,3.15
2017-07-05,3.15
2017-07-06,3
2017-07-07,3.02
2017-07-10,3.09
2017-07-11,3.12
2017-07-12,3.09
2017-07-13,3.06
2017-07-14,3.07
2017-07-17,3.08
2017-07-18,3.05
2017-07-19,3.1
2017-07-20,3.02
2017-07-21,3.02
2017-07-24,3.05
2017-07-25,3.1
2017-07-26,3.11
2017-07-27,3.11
2017-07-28,3.01
2017-07-31,3.06
2017-08-01,3.12
2017-08-02,2.89
2017-08-03,2.84
2017-08-04,2.79
2017-08-07,2.82
2017-08-08,2.79
2017-08-09,2.71
2017-08-10,2.68
2017-08-11,2.63
2017-08-14,2.64
2017-08-15,2.57
2017-08-16,2.52
2017-08-17,2.51
2017-08-18,2.49
2017-08-21,2.48
2017-08-22,2.5
2017-08-23,2.56
2017-08-24,2.62
2017-08-25,2.61
2017-08-28,2.6
2017-08-29,2.57
2017-08-30,2.61
2017-08-31,2.7
2017-09-01,2.72
2017-09-05,2.68
2017-09-06,2.7
2017-09-07,2.76
2017-09-08,2.74
2017-09-11,2.78
2017-09-12,2.77
2017-09-13,2.86
2017-09-14,2.88
2017-09-15,2.91
2017-09-18,2.91
2017-09-19,3.05
2017-09-20,3.08
2017-09-21,3.11
2017-09-22,3.19
2017-09-25,3.23
2017-09-26,3.34
2017-09-27,3.46
2017-09-28,3.49
2017-09-29,3.61
2017-10-02,3.73
2017-10-03,3.77
2017-10-04,3.65
2017-10-05,3.71
2017-10-06,3.71
2017-10-09,3.67
2017-10-10,3.71
2017-10-11,3.69
2017-10-12,3.66
2017-10-13,3.71
2017-10-16,3.69
2017-10-17,3.71
2017-10-18,3.73
2017-10-19,3.7
2017-10-20,3.67
2017-10-23,3.64
2017-10-24,3.64
2017-10-25,3.65
2017-10-26,3.7
2017-10-27,3.72
2017-10-30,3.65
2017-10-31,3.65
2017-11-01,3.61
2017-11-02,3.8
2017-11-03,3.81
2017-11-06,3.99
2017-11-07,3.96
2017-11-08,3.89
2017-11-09,4.05
2017-11-10,4.07
2017-11-13,4.09
2017-11-14,4.11
2017-11-15,4.74
2017-11-16,5
2017-11-17,5.14
2017-11-20,5.75
2017-11-21,6.17
2017-11-22,5.89
2017-11-24,5.94
2017-11-27,6.11
2017-11-28,6.2
2017-11-29,6.25
2017-11-30,6.18
2017-12-01,6.2
2017-12-04,6.14
2017-12-05,6.17
2017-12-06,6.14
2017-12-07,5.9
2017-12-08,5.83
2017-12-11,5.7
2017-12-12,5.45
2017-12-13,5.61
2017-12-14,5.49
2017-12-15,5.81
2017-12-18,5.81
2017-12-19,5.72
2017-12-20,5.61
2017-12-21,5.61
2017-12-22,5.79
2017-12-26,5.6
2017-12-27,5.54
2017-12-28,5.6
2017-12-29,5.53
2018-01-02,5.75
2018-01-03,5.52
2018-01-04,5.34
2018-01-05,5.3
2018-01-08,5.34
2018-01-09,5.27
2018-01-10,5.23
2018-01-11,5.38
2018-01-12,5.61
2018-01-16,5.36
2018-01-17,5.47
2018-01-18,5.3
2018-01-19,5.38
2018-01-22,5.42
2018-01-23,5.38
2018-01-24,5.32
2018-01-25,5.32
2018-01-26,5.27
2018-01-29,5.19
2018-01-30,5.08
2018-01-31,5.18
2018-02-01,5.18
2018-02-02,4.97
2018-02-05,4.71
2018-02-06,4.91
2018-02-07,4.85
2018-02-08,4.88
2018-02-09,5.03
2018-02-12,5.17
2018-02-13,5.03
2018-02-14,5.04
2018-02-15,5.21
2018-02-16,5.17
2018-02-20,5.31
2018-02-21,5.17
2018-02-22,5.29
2018-02-23,5.25
2018-02-26,5.25
2018-02-27,5.14
2018-02-28,5.05
2018-03-01,5.02
2018-03-02,5.26
2018-03-05,5.22
2018-03-06,5.2
2018-03-07,5.19
2018-03-08,4.99
2018-03-09,4.95
2018-03-12,4.88
2018-03-13,4.91
2018-03-14,4.89
2018-03-15,4.83
2018-03-16,4.93
2018-03-19,4.79
2018-03-20,4.68
2018-03-21,4.66
2018-03-22,4.51
2018-03-23,4.56
2018-03-26,4.75
2018-03-27,4.79
2018-03-28,4.67
2018-03-29,4.78
2018-04-02,4.65
2018-04-03,4.76
2018-04-04,4.86
2018-04-05,4.96
2018-04-06,4.91
2018-04-09,4.84
2018-04-10,4.92
2018-04-11,4.99
2018-04-12,4.9
2018-04-13,4.99
2018-04-16,5.12
2018-04-17,5.1
2018-04-18,5.19
2018-04-19,5.15
2018-04-20,5.18
2018-04-23,5.23
2018-04-24,5.23
2018-04-25,5.15
2018-04-26,5.25
2018-04-27,5.31
2018-04-30,5.43
2018-05-01,5.4
2018-05-02,5.5
2018-05-03,5.25
2018-05-04,5.13
2018-05-07,5.15
2018-05-08,5.25
2018-05-09,5.25
2018-05-10,5.21
2018-05-11,5.21
2018-05-14,5.29
2018-05-15,5.41
2018-05-16,5.93
2018-05-17,6.77
2018-05-18,6.75
2018-05-21,6.77
2018-05-22,6.59
2018-05-23,6.46
2018-05-24,6.43
2018-05-25,6.47
2018-05-29,6.54
2018-05-30,6.48
2018-05-31,6.53
2018-06-01,6.58
2018-06-04,6.5
2018-06-05,6.52
2018-06-06,6.53
2018-06-07,6.41
2018-06-08,6.5
2018-06-11,6.48
2018-06-12,6.6
2018-06-13,6.83
2018-06-14,6.98
2018-06-15,7.12
2018-06-18,7.15
2018-06-19,7.26
2018-06-20,7.94
2018-06-21,8
2018-06-22,7.85
2018-06-25,7.9
2018-06-26,7.85
2018-06-27,7.72
2018-06-28,7.68
2018-06-29,7.72
2018-07-02,7.75
2018-07-03,7.8
2018-07-05,7.84
2018-07-06,7.74
2018-07-09,7.71
2018-07-10,7.68
2018-07-11,7.66
2018-07-12,7.42
2018-07-13,7.28
2018-07-16,7.3
2018-07-17,7.3
2018-07-18,7.19
2018-07-19,7.16
2018-07-20,7.06
2018-07-23,6.73
2018-07-24,6.53
2018-07-25,6.54
2018-07-26,6.43
2018-07-27,6.22
2018-07-30,6.04
2018-07-31,6.2
2018-08-01,6.43
2018-08-02,6.5
2018-08-03,5.32
2018-08-06,5.7
2018-08-07,5.77
2018-08-08,5.81
2018-08-09,5.93
2018-08-10,6.02
2018-08-13,5.76
2018-08-14,5.84
2018-08-15,5.65
2018-08-16,5.68
2018-08-17,5.86
2018-08-20,5.84
2018-08-21,5.71
2018-08-22,5.73
2018-08-23,5.7
2018-08-24,5.85
2018-08-27,5.87
2018-08-28,6.09
2018-08-29,6.26
2018-08-30,6.21
2018-08-31,6.2
2018-09-04,6.01
2018-09-05,6
2018-09-06,5.95
2018-09-07,5.88
2018-09-10,5.91
2018-09-11,6.21
2018-09-12,6.19
2018-09-13,6.07
2018-09-14,6.16
2018-09-17,6.06
2018-09-18,6.05
2018-09-19,5.86
2018-09-20,5.89
2018-09-21,5.86
2018-09-24,5.88
2018-09-25,5.87
2018-09-26,5.84
2018-09-27,5.86
2018-09-28,5.96
2018-10-01,5.86
2018-10-02,5.71
2018-10-03,5.35
2018-10-04,5.1
2018-10-05,5.15
2018-10-08,5.37
2018-10-09,5.22
2018-10-10,4.97
2018-10-11,5.02
2018-10-12,5.05
2018-10-15,5.23
2018-10-16,5.5
2018-10-17,5.47
2018-10-18,5.44
2018-10-19,5.34
2018-10-22,5.42
2018-10-23,5.33
2018-10-24,5.24
2018-10-25,5.35
2018-10-26,5.25
2018-10-29,5.29
2018-10-30,5.29
2018-10-31,5.34
2018-11-01,5.46
2018-11-02,5.54
2018-11-05,5.51
2018-11-06,5.72
2018-11-07,5.71
2018-11-08,6.14
2018-11-09,5.84
2018-11-12,5.44
2018-11-13,5.1
2018-11-14,5.08
2018-11-15,5.12
2018-11-16,5.02
2018-11-19,4.82
2018-11-20,4.85
2018-11-21,4.95
2018-11-23,4.9
2018-11-26,4.99
2018-11-27,4.78
2018-11-28,4.84
2018-11-29,4.83
2018-11-30,4.67
2018-12-03,4.72
2018-12-04,4.57
2018-12-06,4.53
2018-12-07,4.49
2018-12-10,4.46
2018-12-11,4.39
2018-12-12,4.45
2018-12-13,4.38
2018-12-14,4.33
2018-12-17,4.17
2018-12-18,4.26
2018-12-19,4
2018-12-20,3.71
2018-12-21,3.6
2018-12-24,3.56
2018-12-26,3.84
2018-12-27,4.05
2018-12-28,3.99
2018-12-31,3.92
2019-01-02,4.1
2019-01-03,4.04
2019-01-04,4.11
2019-01-07,4.19
2019-01-08,4.2
2019-01-09,4.26
2019-01-10,4.33
2019-01-11,4.31
2019-01-14,4.18
2019-01-15,4.33
2019-01-16,4.41
2019-01-17,4.48
2019-01-18,4.5
2019-01-22,4.39
2019-01-23,4.36
2019-01-24,4.43
2019-01-25,4.53
2019-01-28,4.39
2019-01-29,4.13
2019-01-30,4.06
2019-01-31,4.21
2019-02-01,4.39
2019-02-04,4.55
2019-02-05,4.4
2019-02-06,4.44
2019-02-07,4.38
2019-02-08,4.45
2019-02-11,4.59
2019-02-12,4.5
2019-02-13,4.58
2019-02-14,4.51
2019-02-15,4.52
2019-02-19,4.53
2019-02-20,4.6
2019-02-21,4.55
2019-02-22,4.45
2019-02-25,4.57
2019-02-26,4.49
2019-02-27,4.48
2019-02-28,4.41
2019-03-01,4.47
2019-03-04,4.49
2019-03-05,4.65
2019-03-06,4.52
2019-03-07,4.4
2019-03-08,4.39
2019-03-11,4.5
2019-03-12,4.5
2019-03-13,4.57
2019-03-14,4.54
2019-03-15,4.54
2019-03-18,4.83
2019-03-19,5.2
2019-03-20,5.35
2019-03-21,5.29
2019-03-22,5.17
2019-03-25,5.08
2019-03-26,5.1
2019-03-27,4.89
2019-03-28,4.8
2019-03-29,4.49
2019-04-01,4.56
2019-04-02,4.52
2019-04-03,4.7
2019-04-04,4.71
2019-04-05,4.94
2019-04-08,4.81
2019-04-09,4.65
2019-04-10,4.69
2019-04-11,4.66
2019-04-12,4.76
2019-04-15,4.76
2019-04-16,5
2019-04-17,4.9
2019-04-18,4.86
2019-04-22,4.91
2019-04-23,5.36
2019-04-24,5.17
2019-04-25,5.09
2019-04-26,5.17
2019-04-29,5.26
2019-04-30,5.14
2019-05-01,5.24
2019-05-02,5.13
2019-05-03,5.27
2019-05-06,5.23
2019-05-07,5.18
2019-05-08,5.31
2019-05-09,5.36
2019-05-10,5.23
2019-05-13,5.04
2019-05-14,5.02
2019-05-15,5.07
2019-05-16,5
2019-05-17,4.85
2019-05-20,4.9
2019-05-21,5
2019-05-22,4.97
2019-05-23,4.85
2019-05-24,4.87
2019-05-28,4.73
2019-05-29,4.73
2019-05-30,4.63
2019-05-31,4.55
2019-06-03,4.5
2019-06-04,4.65
2019-06-05,4.47
2019-06-06,4.48
2019-06-07,4.6
2019-06-10,4.72
2019-06-11,4.6
2019-06-12,4.68
2019-06-13,4.865
2019-06-14,4.75
2019-06-17,4.775
2019-06-18,4.83
2019-06-19,4.81
2019-06-20,4.88
2019-06-21,4.75
2019-06-24,4.6
2019-06-25,4.51
2019-06-26,4.59
2019-06-27,4.615
2019-06-28,4.68
2019-07-01,4.62
2019-07-02,4.625
2019-07-03,4.73
2019-07-04,4.73
2019-07-05,4.81
2019-07-08,4.81
2019-07-09,4.74
2019-07-10,4.73
2019-07-11,4.75
2019-07-12,4.82
2019-07-15,4.76
2019-07-16,4.95
2019-07-17,4.785
2019-07-18,4.84
2019-07-19,4.755
2019-07-22,4.695
2019-07-23,4.865
2019-07-24,5
2019-07-25,5.05
2019-07-26,5.15
2019-07-29,5.175
2019-07-30,5.125
2019-07-31,5.26
2019-08-01,5.19
2019-08-02,5.06
2019-08-05,4.76
2019-08-06,4.75
2019-08-07,4.65
2019-08-08,4.83
2019-08-09,4.93
2019-08-12,4.95
2019-08-13,5.1
2019-08-14,4.955
2019-08-15,4.955
2019-08-16,5.02
2019-08-19,5.09
2019-08-20,5.11
2019-08-21,5.11
2019-08-22,5.13
2019-08-23,5.1
2019-08-26,5.14
2019-08-27,4.89
2019-08-28,4.8
2019-08-29,4.805
2019-08-30,4.73
2019-09-02,4.71
2019-09-03,4.31
2019-09-04,4.325
2019-09-05,4.37
2019-09-06,4.555
2019-09-09,4.69
2019-09-10,4.795
2019-09-11,4.65
2019-09-12,4.595
2019-09-13,4.405
2019-09-16,4.195
2019-09-17,4.18
2019-09-18,4.075
2019-09-19,4.05
2019-09-20,3.92
2019-09-23,3.97
2019-09-24,3.895
2019-09-25,4
2019-09-26,4.085
2019-09-27,4.205
2019-09-30,4.315
2019-10-01,4.455
2019-10-02,4.415
2019-10-03,4.265
2019-10-04,4.165
2019-10-07,4.185
2019-10-08,4.155
2019-10-09,4.015
2019-10-10,3.985
2019-10-11,3.9
2019-10-14,3.735
2019-10-15,4.15
2019-10-16,4.035
2019-10-17,4.125
2019-10-18,4.275
2019-10-21,4.29
2019-10-22,4.195
2019-10-23,4.24
2019-10-24,4.17
2019-10-25,4.16
2019-10-28,4.135
2019-10-29,4.055
2019-10-30,4.125
2019-10-31,3.965
2019-11-01,4.055
2019-11-04,4.15
2019-11-05,4.175
2019-11-06,4.105
2019-11-07,4.125
2019-11-08,3.985
2019-11-11,4.135
2019-11-12,4.335
2019-11-13,3.995
2019-11-14,4.135
2019-11-15,4.105
2019-11-18,4.135
2019-11-19,4.195
2019-11-20,4.09
2019-11-21,3.935
2019-11-22,3.965
2019-11-25,4.115
