date,close
2014-06-13,29.11
2014-06-16,28.95
2014-06-17,28.8
2014-06-18,28.88
2014-06-19,29.13
2014-06-20,28.79
2014-06-23,28.98
2014-06-24,28.92
2014-06-25,29.12
2014-06-26,29.12
2014-06-27,29.09
2014-06-30,29.36
2014-07-01,29.59
2014-07-02,29.58
2014-07-03,29.85
2014-07-07,29.5975
2014-07-08,28.9
2014-07-09,28.94
2014-07-10,28.59
2014-07-11,28.49
2014-07-14,28.62
2014-07-15,28.62
2014-07-16,28.72
2014-07-17,28.45
2014-07-18,28.95
2014-07-21,28.84
2014-07-22,29.12
2014-07-23,29.32
2014-07-24,29.33
2014-07-25,28.92
2014-07-28,28.71
2014-07-29,28.53
2014-07-30,28.38
2014-07-31,28.05
2014-08-01,27.88
2014-08-04,28.2
2014-08-05,27.31
2014-08-06,27.181
2014-08-07,27.22
2014-08-08,27.73
2014-08-11,27.86
2014-08-12,27.83
2014-08-13,28.16
2014-08-14,28.46
2014-08-15,28.38
2014-08-18,28.84
2014-08-19,28.76
2014-08-20,28.93
2014-08-21,29.26
2014-08-22,29.53
2014-08-25,29.49
2014-08-26,29.49
2014-08-27,29.45
2014-08-28,29.29
2014-08-29,29.52
2014-09-02,29.65
2014-09-03,29.57
2014-09-04,29.75
2014-09-05,30.16
2014-09-08,29.87
2014-09-09,29.57
2014-09-10,29.41
2014-09-11,29.34
2014-09-12,28.92
2014-09-15,28.73
2014-09-16,28.8
2014-09-17,28.93
2014-09-18,28.87
2014-09-19,28.99
2014-09-22,28.38
2014-09-23,27.87
2014-09-24,28.62
2014-09-25,28.27
2014-09-26,28.35
2014-09-29,28.29
2014-09-30,28.52
2014-10-01,27.9
2014-10-02,27.88
2014-10-03,28.13
2014-10-06,29.92
2014-10-07,29.55
2014-10-08,29.43
2014-10-09,28.87
2014-10-10,27.795
2014-10-13,27.23
2014-10-14,27.74
2014-10-15,23.7
2014-10-16,23.79
2014-10-17,24.1
2014-10-20,24.71
2014-10-21,25.41
2014-10-22,24.86
2014-10-23,25.2
2014-10-24,25.31
2014-10-27,25.41
2014-10-28,25.65
2014-10-29,25.66
2014-10-30,25.82
2014-10-31,26.14
2014-11-03,26.25
2014-11-04,25.77
2014-11-05,28.13
2014-11-06,27.87
2014-11-07,27.7
2014-11-10,27.81
2014-11-11,27.76
2014-11-12,27.9
2014-11-13,28.28
2014-11-14,28.4
2014-11-17,28.38
2014-11-18,28.37
2014-11-19,27.95
2014-11-20,28.13
2014-11-21,28.29
2014-11-24,28.3
2014-11-25,28.41
2014-11-26,28.67
2014-11-28,29.15
2014-12-01,29.13
2014-12-02,29.07
2014-12-03,29.05
2014-12-04,28.97
2014-12-05,28.96
2014-12-08,28.71
2014-12-09,28.64
2014-12-10,28.31
2014-12-11,28.45
2014-12-12,28.18
2014-12-15,28.08
2014-12-16,27.55
2014-12-17,28.19
2014-12-18,28.45
2014-12-19,28.52
2014-12-22,29.15
2014-12-23,29.48
2014-12-24,29.36
2014-12-26,29.31
2014-12-29,29.38
2014-12-30,29.57
2014-12-31,29.42
2015-01-02,28.92
2015-01-05,28.11
2015-01-06,27.6
2015-01-07,28.09
2015-01-08,28.7
2015-01-09,28.38
2015-01-12,28.48
2015-01-13,28.76
2015-01-14,28.24
2015-01-15,27.51
2015-01-16,27.93
2015-01-20,27.76
2015-01-21,27.79
2015-01-22,28.56
2015-01-23,28.66
2015-01-26,29.04
2015-01-27,28.4
2015-01-28,27.95
2015-01-29,27.75
2015-01-30,27.36
2015-02-02,27.7
2015-02-03,27.86
2015-02-04,27.7
2015-02-05,27.87
2015-02-06,27.99
2015-02-09,28.22
2015-02-10,28.85
2015-02-11,28.87
2015-02-12,29.05
2015-02-13,29.47
2015-02-17,29.56
2015-02-18,29.37
2015-02-19,29.24
2015-02-20,29.23
2015-02-23,29.18
2015-02-24,29.07
2015-02-25,29.11
2015-02-26,29.4
2015-02-27,29.53
2015-03-02,29.5
2015-03-03,29.62
2015-03-04,29.59
2015-03-05,29.54
2015-03-06,28.98
2015-03-09,29.13
2015-03-10,28.49
2015-03-11,28.16
2015-03-12,28.54
2015-03-13,28.57
2015-03-16,28.76
2015-03-17,28.78
2015-03-18,29.36
2015-03-19,29.23
2015-03-20,29.62
2015-03-23,29.53
2015-03-24,29.54
2015-03-25,28.91
2015-03-26,28.66
2015-03-27,28.95
2015-03-30,29.35
2015-03-31,29.19
2015-04-01,28.82
2015-04-02,29.37
2015-04-06,29.18
2015-04-07,28.76
2015-04-08,29.32
2015-04-09,29.55
2015-04-10,29.4
2015-04-13,29.29
2015-04-14,29.28
2015-04-15,29.3
2015-04-16,29.335
2015-04-17,28.79
2015-04-20,29.02
2015-04-21,29.2
2015-04-22,29.11
2015-04-23,29.31
2015-04-24,29.42
2015-04-27,29.31
2015-04-28,29.31
2015-04-29,28.84
2015-04-30,28.76
2015-05-01,29.14
2015-05-04,28.94
2015-05-05,28.56
2015-05-06,28.61
2015-05-07,29.07
2015-05-08,27.7
2015-05-11,27.37
2015-05-12,27.66
2015-05-13,27.62
2015-05-14,28.37
2015-05-15,28.36
2015-05-18,28.51
2015-05-19,28.56
2015-05-20,28.6
2015-05-21,28.44
2015-05-22,28.52
2015-05-26,27.95
2015-05-27,28.2
2015-05-28,28.32
2015-05-29,27.97
2015-06-01,28.18
2015-06-02,27.94
2015-06-03,28.65
2015-06-04,28.81
2015-06-05,28.81
2015-06-08,28.31
2015-06-09,27.93
2015-06-10,28.37
2015-06-11,28.59
2015-06-12,28.43
2015-06-15,28.17
2015-06-16,28.38
2015-06-17,28.6
2015-06-18,28.95
2015-06-19,28.765
2015-06-22,29.01
2015-06-23,29.01
2015-06-24,28.67
2015-06-25,28.62
2015-06-26,28.78
2015-06-29,27.82
2015-06-30,27.75
2015-07-01,27.83
2015-07-02,27.9
2015-07-06,28.05
2015-07-07,28.12
2015-07-08,27.32
2015-07-09,27.41
2015-07-10,28.07
2015-07-13,28.4
2015-07-14,28.72
2015-07-15,29.04
2015-07-16,29.28
2015-07-17,29.04
2015-07-20,29.02
2015-07-21,28.87
2015-07-22,28.72
2015-07-23,28.84
2015-07-24,28.46
2015-07-27,28.18
2015-07-28,28.33
2015-07-29,28.53
2015-07-30,28.95
2015-07-31,29.05
2015-08-03,28.74
2015-08-04,28.9
2015-08-05,31.02
2015-08-06,29.98
2015-08-07,30.05
2015-08-10,30.42
2015-08-11,30.57
2015-08-12,30.39
2015-08-13,30.32
2015-08-14,30.26
2015-08-17,29.8
2015-08-18,29.79
2015-08-19,29.28
2015-08-20,28.6
2015-08-21,27.55
2015-08-24,26.42
2015-08-25,26.62
2015-08-26,27.21
2015-08-27,27.395
2015-08-28,27.36
2015-08-31,27.04
2015-09-01,26.59
2015-09-02,27.59
2015-09-03,27.58
2015-09-04,27.27
2015-09-08,28.06
2015-09-09,27.77
2015-09-10,27.68
2015-09-11,27.69
2015-09-14,27.52
2015-09-15,27.66
2015-09-16,27.98
2015-09-17,27.64
2015-09-18,27.36
2015-09-21,27.58
2015-09-22,27.29
2015-09-23,27.19
2015-09-24,26.64
2015-09-25,26.73
2015-09-28,26
2015-09-29,26.09
2015-09-30,26.23
2015-10-01,26.4
2015-10-02,26.86
2015-10-05,27.23
2015-10-06,26.7
2015-10-07,26.48
2015-10-08,26.94
2015-10-09,27.32
2015-10-12,27.9
2015-10-13,28.05
2015-10-14,27.28
2015-10-15,27.97
2015-10-16,28.185
2015-10-19,28.25
2015-10-20,28.3
2015-10-21,28.18
2015-10-22,28.15
2015-10-23,27.99
2015-10-26,28.06
2015-10-27,27.94
2015-10-28,28.05
2015-10-29,27.22
2015-10-30,27.37
2015-11-02,27.46
2015-11-03,27.52
2015-11-04,26.66
2015-11-05,26.65
2015-11-06,26.75
2015-11-09,26.41
2015-11-10,27.11
2015-11-11,26.95
2015-11-12,26.35
2015-11-13,25.73
2015-11-16,25.76
2015-11-17,25.54
2015-11-18,26.02
2015-11-19,26.43
2015-11-20,26.31
2015-11-23,26.51
2015-11-24,26.26
2015-11-25,26.5
2015-11-27,26.82
2015-11-30,26.48
2015-12-01,26.76
2015-12-02,26.78
2015-12-03,26.51
2015-12-04,27.1
2015-12-07,26.86
2015-12-08,27.07
2015-12-09,27.12
2015-12-10,27.34
2015-12-11,26.8
2015-12-14,26.69
2015-12-15,26.85
2015-12-16,27.03
2015-12-17,26.4
2015-12-18,26.07
2015-12-21,26.08
2015-12-22,26.885
2015-12-23,27.14
2015-12-24,27.02
2015-12-28,26.89
2015-12-29,27.15
2015-12-30,27.185
2015-12-31,27.32
2016-01-04,26.81
2016-01-05,26.62
2016-01-06,26.12
2016-01-07,25.39
2016-01-08,25.02
2016-01-11,25.5
2016-01-12,25.88
2016-01-13,25.31
2016-01-14,25.61
2016-01-15,24.99
2016-01-19,25.18
2016-01-20,24.8
2016-01-21,24.48
2016-01-22,25.27
2016-01-25,24.71
2016-01-26,25.28
2016-01-27,24.85
2016-01-28,25.17
2016-01-29,26.06
2016-02-01,25.89
2016-02-02,25.42
2016-02-03,25.26
2016-02-04,25.22
2016-02-05,23.99
2016-02-08,23.11
2016-02-09,22.68
2016-02-10,22.75
2016-02-11,23.26
2016-02-12,23.17
2016-02-16,24.24
2016-02-17,24.9
2016-02-18,24.69
2016-02-19,24.45
2016-02-22,25.01
2016-02-23,25.1
2016-02-24,25.95
2016-02-25,26.245
2016-02-26,25.7
2016-02-29,25.38
2016-03-01,26.08
2016-03-02,25.83
2016-03-03,26.45
2016-03-04,26.27
2016-03-07,25.94
2016-03-08,25.39
2016-03-09,25.1
2016-03-10,25.09
2016-03-11,25.35
2016-03-14,25.23
2016-03-15,24.88
2016-03-16,25.12
2016-03-17,24.99
2016-03-18,25.07
2016-03-21,24.81
2016-03-22,24.75
2016-03-23,24.41
2016-03-24,24.74
2016-03-28,24.77
2016-03-29,24.92
2016-03-30,25.21
2016-03-31,25.25
2016-04-01,25.58
2016-04-04,25.26
2016-04-05,25.16
2016-04-06,25.84
2016-04-07,25.6
2016-04-08,25.98
2016-04-11,25.6
2016-04-12,25.67
2016-04-13,26.27
2016-04-14,25.99
2016-04-15,26.04
2016-04-18,26.37
2016-04-19,26.32
2016-04-20,26.75
2016-04-21,26.74
2016-04-22,26.64
2016-04-25,26.55
2016-04-26,26.76
2016-04-27,26.63
2016-04-28,26.48
2016-04-29,26.2
2016-05-02,26.67
2016-05-03,26.26
2016-05-04,26.07
2016-05-05,25.81
2016-05-06,26.03
2016-05-09,26.42
2016-05-10,26.64
2016-05-11,26.24
2016-05-12,26.18
2016-05-13,25.75
2016-05-16,25.98
2016-05-17,25.61
2016-05-18,25.49
2016-05-19,25.38
2016-05-20,26.02
2016-05-23,25.81
2016-05-24,26.13
2016-05-25,26.54
2016-05-26,26.97
2016-05-27,27.08
2016-05-31,26.98
2016-06-01,27.05
2016-06-02,27.01
2016-06-03,26.58
2016-06-06,26.5
2016-06-07,26.36
2016-06-08,26.32
2016-06-09,25.99
2016-06-10,25.38
2016-06-13,25.23
2016-06-14,25.16
2016-06-15,25.15
2016-06-16,25
2016-06-17,24.88
2016-06-20,24.93
2016-06-21,24.89
2016-06-22,24.75
2016-06-23,24.9
2016-06-24,24.21
2016-06-27,23.81
2016-06-28,24.28
2016-06-29,25.01
2016-06-30,25.37
2016-07-01,25.66
2016-07-05,25.09
2016-07-06,25.32
2016-07-07,25.49
2016-07-08,26.07
2016-07-11,26.25
2016-07-12,26.36
2016-07-13,26.35
2016-07-14,26.61
2016-07-15,26.75
2016-07-18,26.53
2016-07-19,26.45
2016-07-20,26.54
2016-07-21,26.54
2016-07-22,26.83
2016-07-25,26.76
2016-07-26,26.89
2016-07-27,26.7
2016-07-28,26.93
2016-07-29,26.81
2016-08-01,26.55
2016-08-02,26.2
2016-08-03,26.74
2016-08-04,26.3
2016-08-05,20.61
2016-08-08,21.39
2016-08-09,21.46
2016-08-10,21.1
2016-08-11,21.43
2016-08-12,22.05
2016-08-15,22.16
2016-08-16,21.93
2016-08-17,21.13
2016-08-18,21.46
2016-08-19,21.37
2016-08-22,21.4
2016-08-23,21.43
2016-08-24,21.35
2016-08-25,21.19
2016-08-26,21.09
2016-08-29,21.17
2016-08-30,20.97
2016-08-31,21.13
2016-09-01,21.27
2016-09-02,21.26
2016-09-06,21.38
2016-09-07,21.46
2016-09-08,19.59
2016-09-09,19.49
2016-09-12,19.54
2016-09-13,19.1
2016-09-14,18.83
2016-09-15,18.97
2016-09-16,18.52
2016-09-19,18.7
2016-09-20,18.7
2016-09-21,18.58
2016-09-22,19.53
2016-09-23,19.95
2016-09-26,19.86
2016-09-27,20.03
2016-09-28,20.04
2016-09-29,19.84
2016-09-30,20.01
2016-10-03,20.1
2016-10-04,20.16
2016-10-05,20.05
2016-10-06,19.69
2016-10-07,19.43
2016-10-10,19.32
2016-10-11,18.82
2016-10-12,18.84
2016-10-13,18.89
2016-10-14,18.81
2016-10-17,18.78
2016-10-18,18.78
2016-10-19,18.77
2016-10-20,18.91
2016-10-21,19.02
2016-10-24,19.02
2016-10-25,18.89
2016-10-26,18.55
2016-10-27,18.25
2016-10-28,18.34
2016-10-31,18.49
2016-11-01,18.42
2016-11-02,18.39
2016-11-03,18.26
2016-11-04,18.12
2016-11-07,18.3
2016-11-08,19.63
2016-11-09,20.25
2016-11-10,19.99
2016-11-11,19.99
2016-11-14,20.58
2016-11-15,21.05
2016-11-16,20.95
2016-11-17,21.18
2016-11-18,21.07
2016-11-21,21.07
2016-11-22,21.56
2016-11-23,22.13
2016-11-25,22.11
2016-11-28,21.71
2016-11-29,21.51
2016-11-30,20.71
2016-12-01,20.48
2016-12-02,20.26
2016-12-05,20.79
2016-12-06,20.65
2016-12-07,20.46
2016-12-08,20.89
2016-12-09,20.81
2016-12-12,20.21
2016-12-13,20.53
2016-12-14,20.59
2016-12-15,20.33
2016-12-16,20.16
2016-12-19,20.02
2016-12-20,20.28
2016-12-21,20.21
2016-12-22,20.02
2016-12-23,19.93
2016-12-27,20.24
2016-12-28,19.85
2016-12-29,19.99
2016-12-30,19.98
2017-01-03,19.98
2017-01-04,20.2
2017-01-05,19.73
2017-01-06,19.65
2017-01-09,19.43
2017-01-10,19.46
2017-01-11,19.32
2017-01-12,19.25
2017-01-13,19.18
2017-01-17,19.3
2017-01-18,19.31
2017-01-19,18.85
2017-01-20,18.79
2017-01-23,18.85
2017-01-24,19.13
2017-01-25,19.34
2017-01-26,19.15
2017-01-27,19.02
2017-01-30,19.17
2017-01-31,19.18
2017-02-01,18.85
2017-02-02,18.72
2017-02-03,18.75
2017-02-06,18.8
2017-02-07,18.63
2017-02-08,18.72
2017-02-09,19.1
2017-02-10,19.32
2017-02-13,19.03
2017-02-14,19.21
2017-02-15,19.62
2017-02-16,19.24
2017-02-17,19.3
2017-02-21,19.71
2017-02-22,20.54
2017-02-23,20.06
2017-02-24,20.01
2017-02-27,19.95
2017-02-28,18.88
2017-03-01,19.01
2017-03-02,19
2017-03-03,18.86
2017-03-06,19.21
2017-03-07,18.81
2017-03-08,19.26
2017-03-09,19.59
2017-03-10,19.8
2017-03-13,19.5
2017-03-14,19.4
2017-03-15,19.84
2017-03-16,20.07
2017-03-17,20
2017-03-20,19.54
2017-03-21,19.11
2017-03-22,19.15
2017-03-23,19.29
2017-03-24,19.44
2017-03-27,19.5
2017-03-28,19.66
2017-03-29,19.72
2017-03-30,19.9
2017-03-31,20.02
2017-04-03,19.97
2017-04-04,20.42
2017-04-05,20.47
2017-04-06,20.65
2017-04-07,20.74
2017-04-10,21.21
2017-04-11,21.39
2017-04-12,21.19
2017-04-13,21.02
2017-04-17,21.17
2017-04-18,21.16
2017-04-19,21.33
2017-04-20,21.31
2017-04-21,21.17
2017-04-24,21.11
2017-04-25,20.95
2017-04-26,21.07
2017-04-27,21.37
2017-04-28,21.18
2017-05-01,21.33
2017-05-02,21.39
2017-05-03,21
2017-05-04,21.05
2017-05-05,21.18
2017-05-08,21.27
2017-05-09,23.7
2017-05-10,24.03
2017-05-11,23.69
2017-05-12,23.67
2017-05-15,23.55
2017-05-16,23.55
2017-05-17,23.29
2017-05-18,23.39
2017-05-19,23.74
2017-05-22,23.96
2017-05-23,23.53
2017-05-24,23.4
2017-05-25,23.72
2017-05-26,23.72
2017-05-30,23.67
2017-05-31,23.46
2017-06-01,24.36
2017-06-02,24.2
2017-06-05,24.02
2017-06-06,23.77
2017-06-07,23.66
2017-06-08,23.79
2017-06-09,23.79
2017-06-12,24.23
2017-06-13,24.35
2017-06-14,24.25
2017-06-15,24.36
2017-06-16,24.58
2017-06-19,24.43
2017-06-20,23.71
2017-06-21,23.8
2017-06-22,24.01
2017-06-23,24.49
2017-06-26,24.64
2017-06-27,24.51
2017-06-28,24.61
2017-06-29,24.34
2017-06-30,24.54
2017-07-03,24.36
2017-07-05,24.46
2017-07-06,24.16
2017-07-07,24.08
2017-07-10,23.78
2017-07-11,23.36
2017-07-12,23.18
2017-07-13,23.02
2017-07-14,23.28
2017-07-17,23.72
2017-07-18,23.73
2017-07-19,24.38
2017-07-20,24.26
2017-07-21,23.82
2017-07-24,24.08
2017-07-25,24.35
2017-07-26,24.2
2017-07-27,24.31
2017-07-28,24.23
2017-07-31,23.94
2017-08-01,24.34
2017-08-02,23.86
2017-08-03,23.58
2017-08-04,24.32
2017-08-07,24.23
2017-08-08,21.89
2017-08-09,22.82
2017-08-10,22.38
2017-08-11,22.6
2017-08-14,22.83
2017-08-15,21.82
2017-08-16,21.8
2017-08-17,21.15
2017-08-18,21.165
2017-08-21,21.12
2017-08-22,21.4
2017-08-23,21.16
2017-08-24,21.72
2017-08-25,21.86
2017-08-28,22.15
2017-08-29,21.99
2017-08-30,22.07
2017-08-31,22.12
2017-09-01,22.72
2017-09-05,22.47
2017-09-06,22.96
2017-09-07,22.45
2017-09-08,22.68
2017-09-11,22.7
2017-09-12,23.19
2017-09-13,23.21
2017-09-14,23.11
2017-09-15,23.12
2017-09-18,22.73
2017-09-19,22.65
2017-09-20,23.19
2017-09-21,23.13
2017-09-22,23.76
2017-09-25,24.12
2017-09-26,24.04
2017-09-27,24.17
2017-09-28,23.37
2017-09-29,23.57
2017-10-02,23.97
2017-10-03,23.58
2017-10-04,23.28
2017-10-05,23.57
2017-10-06,23.08
2017-10-09,22.35
2017-10-10,22.25
2017-10-11,22.36
2017-10-12,22.24
2017-10-13,22.31
2017-10-16,22.52
2017-10-17,22.92
2017-10-18,22.9
2017-10-19,23.09
2017-10-20,23.38
2017-10-23,23.16
2017-10-24,23.16
2017-10-25,22.95
2017-10-26,23.04
2017-10-27,22.7
2017-10-30,22.32
2017-10-31,22.72
2017-11-01,22.6
2017-11-02,22.5
2017-11-03,22.45
2017-11-06,22.24
2017-11-07,21.55
2017-11-08,21.54
2017-11-09,23.27
2017-11-10,23.91
2017-11-13,23.43
2017-11-14,23.73
2017-11-15,23.57
2017-11-16,24.22
2017-11-17,24.86
2017-11-20,25.14
2017-11-21,25.14
2017-11-22,24.94
2017-11-24,24.82
2017-11-27,24.31
2017-11-28,24.34
2017-11-29,24.47
2017-11-30,24.4
2017-12-01,24.72
2017-12-04,24.96
2017-12-05,24.8
2017-12-06,24.75
2017-12-07,24.95
2017-12-08,24.79
2017-12-11,24.52
2017-12-12,24.41
2017-12-13,24.53
2017-12-14,24.1
2017-12-15,24.82
2017-12-18,25.41
2017-12-19,26.23
2017-12-20,26.46
2017-12-21,26.63
2017-12-22,26.18
2017-12-26,25.74
2017-12-27,25.34
2017-12-28,25.41
2017-12-29,24.42
2018-01-02,24.72
2018-01-03,25.48
2018-01-04,25.42
2018-01-05,25.64
2018-01-08,26
2018-01-09,26.21
2018-01-10,26.15
2018-01-11,26.65
2018-01-12,26.85
2018-01-16,26.46
2018-01-17,26.72
2018-01-18,26.77
2018-01-19,26.77
2018-01-22,27.47
2018-01-23,27.64
2018-01-24,27.48
2018-01-25,27.64
2018-01-26,28.08
2018-01-29,28.09
2018-01-30,28.12
2018-01-31,28.09
2018-02-01,28.14
2018-02-02,28.2
2018-02-05,27.18
2018-02-06,27.65
2018-02-07,27.59
2018-02-08,26.37
2018-02-09,26.6
2018-02-12,26.98
2018-02-13,27.45
2018-02-14,27.97
2018-02-15,27.8
2018-02-16,27.95
2018-02-20,27.84
2018-02-21,28.16
2018-02-22,28.23
2018-02-23,28.46
2018-02-26,28.57
2018-02-27,28.3
2018-02-28,28.87
2018-03-01,27.555
2018-03-02,26.69
2018-03-05,27.56
2018-03-06,27.66
2018-03-07,27.23
2018-03-08,27.18
2018-03-09,27.93
2018-03-12,27.39
2018-03-13,27.65
2018-03-14,27.5
2018-03-15,27.15
2018-03-16,27.52
2018-03-19,26.35
2018-03-20,26.97
2018-03-21,26.23
2018-03-22,25.58
2018-03-23,25.1
2018-03-26,25.68
2018-03-27,24.99
2018-03-28,25.03
2018-03-29,25.17
2018-04-02,24.66
2018-04-03,24.83
2018-04-04,25.52
2018-04-05,25.57
2018-04-06,24.94
2018-04-09,25.19
2018-04-10,25.56
2018-04-11,24.98
2018-04-12,24.89
2018-04-13,24.68
2018-04-16,25.19
2018-04-17,25.43
2018-04-18,25.5
2018-04-19,25.41
2018-04-20,25.23
2018-04-23,25.22
2018-04-24,23.64
2018-04-25,23.71
2018-04-26,23.68
2018-04-27,23.31
2018-04-30,23.41
2018-05-01,24.01
2018-05-02,23.58
2018-05-03,23.57
2018-05-04,23.75
2018-05-07,24.04
2018-05-08,24.11
2018-05-09,24.55
2018-05-10,21.89
2018-05-11,22.02
2018-05-14,22.36
2018-05-15,21.9
2018-05-16,22.37
2018-05-17,22.63
2018-05-18,22.6
2018-05-21,22.56
2018-05-22,22
2018-05-23,21.43
2018-05-24,21.13
2018-05-25,21.11
2018-05-29,20.87
2018-05-30,20.61
2018-05-31,20.33
2018-06-01,20.22
2018-06-04,20.5
2018-06-05,20.95
2018-06-06,21.21
2018-06-07,21.4
2018-06-08,21.46
2018-06-11,21.82
2018-06-12,21.79
2018-06-13,21.34
2018-06-14,21.45
2018-06-15,21.55
2018-06-18,21.48
2018-06-19,21.28
2018-06-20,21.34
2018-06-21,21.2
2018-06-22,21.13
2018-06-25,20.96
2018-06-26,20.84
2018-06-27,20.73
2018-06-28,21.19
2018-06-29,21.22
2018-07-02,21.12
2018-07-03,21.5
2018-07-05,21.66
2018-07-06,21.89
2018-07-09,21.92
2018-07-10,21.99
2018-07-11,21.68
2018-07-12,21.89
2018-07-13,21.95
2018-07-16,21.99
2018-07-17,21.95
2018-07-18,22.08
2018-07-19,22
2018-07-20,21.7
2018-07-23,21.39
2018-07-24,21.29
2018-07-25,21.41
2018-07-26,21.59
2018-07-27,21.38
2018-07-30,21.16
2018-07-31,21.29
2018-08-01,21.29
2018-08-02,21.35
2018-08-03,21.73
2018-08-06,21.66
2018-08-07,22.03
2018-08-08,23
2018-08-09,23.16
2018-08-10,22.77
2018-08-13,22.34
2018-08-14,22.41
2018-08-15,22.18
2018-08-16,21.96
2018-08-17,21.84
2018-08-20,21.6
2018-08-21,21.71
2018-08-22,21.4
2018-08-23,20.64
2018-08-24,20.67
2018-08-27,20.82
2018-08-28,20.66
2018-08-29,20.25
2018-08-30,20.15
2018-08-31,20.79
2018-09-04,20.83
2018-09-05,20.73
2018-09-06,20.66
2018-09-07,20.92
2018-09-10,21.1
2018-09-11,21.02
2018-09-12,21.29
2018-09-13,21.49
2018-09-14,22.16
2018-09-17,21.92
2018-09-18,22.1
2018-09-19,22.12
2018-09-20,22.56
2018-09-21,22.63
2018-09-24,22.51
2018-09-25,22.37
2018-09-26,21.9
2018-09-27,22.09
2018-09-28,22.21
2018-10-01,21.59
2018-10-02,21.67
2018-10-03,21.92
2018-10-04,21.57
2018-10-05,21.06
2018-10-08,21.05
2018-10-09,20.85
2018-10-10,20.78
2018-10-11,20.87
2018-10-12,21.12
2018-10-15,21.6
2018-10-16,21.93
2018-10-17,22.26
2018-10-18,22
2018-10-19,22.15
2018-10-22,22.17
2018-10-23,22.4
2018-10-24,21.62
2018-10-25,22.18
2018-10-26,21.37
2018-10-29,21.34
2018-10-30,22.07
2018-10-31,21.94
2018-11-01,22.98
2018-11-02,23.03
2018-11-05,23.48
2018-11-06,23.71
2018-11-07,24.07
2018-11-08,23.67
2018-11-09,24.52
2018-11-12,24.36
2018-11-13,23.88
2018-11-14,23.43
2018-11-15,23.54
2018-11-16,23.32
2018-11-19,22.73
2018-11-20,21.16
2018-11-21,21.3
2018-11-23,21.41
2018-11-26,22.27
2018-11-27,22.22
2018-11-28,22.5
2018-11-29,22.44
2018-11-30,22.22
2018-12-03,22.74
2018-12-04,22.03
2018-12-06,22.24
2018-12-07,21.36
2018-12-10,21.48
2018-12-11,20.91
2018-12-12,21.16
2018-12-13,20.62
2018-12-14,20.07
2018-12-17,19.54
2018-12-18,19.61
2018-12-19,19.5
2018-12-20,18.6
2018-12-21,18.45
2018-12-24,18.56
2018-12-26,19.11
2018-12-27,19.29
2018-12-28,19.37
2018-12-31,19.52
2019-01-02,19.63
2019-01-03,19.42
2019-01-04,19.88
2019-01-07,20.15
2019-01-08,20.59
2019-01-09,20.75
2019-01-10,20.87
2019-01-11,21.04
2019-01-14,20.92
2019-01-15,21.23
2019-01-16,21.36
2019-01-17,21.45
2019-01-18,21.57
2019-01-22,21.16
2019-01-23,20.95
2019-01-24,21.26
2019-01-25,21.61
2019-01-28,21.78
2019-01-29,21.72
2019-01-30,21.77
2019-01-31,21.75
2019-02-01,21.71
2019-02-04,21.59
2019-02-05,21.89
2019-02-06,21.65
2019-02-07,21.51
2019-02-08,21.15
2019-02-11,21.18
2019-02-12,21.61
2019-02-13,21.83
2019-02-14,21.92
2019-02-15,21.86
2019-02-19,21.76
2019-02-20,21.84
2019-02-21,21.56
2019-02-22,21.8
2019-02-25,21.86
2019-02-26,21.93
2019-02-27,21.92
2019-02-28,18.01
2019-03-01,18.77
2019-03-04,18.41
2019-03-05,18.29
2019-03-06,17.9
2019-03-07,17.19
2019-03-08,17.44
2019-03-11,17.5
2019-03-12,17.72
2019-03-13,17.63
2019-03-14,17.38
2019-03-15,17.24
2019-03-18,17.29
2019-03-19,17
2019-03-20,17.05
2019-03-21,17.35
2019-03-22,17.02
2019-03-25,16.64
2019-03-26,16.44
2019-03-27,16.04
2019-03-28,15.91
2019-03-29,15.98
2019-04-01,16.28
2019-04-02,16.33
2019-04-03,16.61
2019-04-04,16.91
2019-04-05,17.04
2019-04-08,17.08
2019-04-09,16.76
2019-04-10,17.09
2019-04-11,17.05
2019-04-12,16.97
2019-04-15,17.28
2019-04-16,16.7
2019-04-17,16.91
2019-04-18,16.78
2019-04-22,16.57
2019-04-23,16.96
2019-04-24,17.12
2019-04-25,17.14
2019-04-26,17.27
2019-04-29,17.13
2019-04-30,17.05
2019-05-01,17.11
2019-05-02,17.2
2019-05-03,17.52
2019-05-06,17.32
2019-05-07,16.97
2019-05-08,16.96
2019-05-09,16.6
2019-05-10,12.1
2019-05-13,12.5
2019-05-14,12.64
2019-05-15,12.75
2019-05-16,13.31
2019-05-17,13.52
2019-05-20,13.5
2019-05-21,13.86
2019-05-22,13.45
2019-05-23,13.06
2019-05-24,13.2
2019-05-28,13.45
2019-05-29,12.92
2019-05-30,12.7
2019-05-31,12.53
2019-06-03,12.47
2019-06-04,12.95
2019-06-05,12.8
2019-06-06,12.78
2019-06-07,12.89
2019-06-10,13.06
2019-06-11,13.3
2019-06-12,13
2019-06-13,13.24
2019-06-14,12.87
2019-06-17,13.035
2019-06-18,12.945
2019-06-19,12.79
2019-06-20,12.6
2019-06-21,12.5
2019-06-24,12.3
2019-06-25,12.28
2019-06-26,12.295
2019-06-27,12.29
2019-06-28,12.36
2019-07-01,12.245
2019-07-02,12.09
2019-07-03,12.595
2019-07-04,12.595
2019-07-05,12.82
2019-07-08,12.765
2019-07-09,13.025
2019-07-10,12.465
2019-07-11,12.275
2019-07-12,12.67
2019-07-15,12.91
2019-07-16,12.88
2019-07-17,12.505
2019-07-18,12.665
2019-07-19,12.935
2019-07-22,13.245
2019-07-23,13.42
2019-07-24,13.675
2019-07-25,13.685
2019-07-26,13.96
2019-07-29,14.25
2019-07-30,14.475
2019-07-31,14.14
2019-08-01,13.545
2019-08-02,13.76
2019-08-05,13.23
2019-08-06,13.31
2019-08-07,13.175
2019-08-08,13.645
2019-08-09,13.505
2019-08-12,12.7
2019-08-13,12.625
2019-08-14,11.555
2019-08-15,11.56
2019-08-16,11.575
2019-08-19,12.135
2019-08-20,11.805
2019-08-21,11.985
2019-08-22,11.905
2019-08-23,11.295
2019-08-26,11.195
2019-08-27,10.645
2019-08-28,10.635
2019-08-29,10.815
2019-08-30,10.715
2019-09-02,10.705
2019-09-03,10.125
2019-09-04,10.605
2019-09-05,11.105
2019-09-06,11.17
2019-09-09,11.835
2019-09-10,12.135
2019-09-11,11.79
2019-09-12,11.585
2019-09-13,11.505
2019-09-16,11.865
2019-09-17,11.13
2019-09-18,11.065
2019-09-19,10.68
2019-09-20,10.585
2019-09-23,10.665
2019-09-24,10.24
2019-09-25,10.51
2019-09-26,10.345
2019-09-27,10.225
2019-09-30,10.315
2019-10-01,10.245
2019-10-02,9.425
2019-10-03,9.525
2019-10-04,9.625
2019-10-07,9.81
2019-10-08,9.545
2019-10-09,9.6
2019-10-10,9.565
2019-10-11,9.98
2019-10-14,9.545
2019-10-15,9.855
2019-10-16,9.715
2019-10-17,9.895
2019-10-18,9.525
2019-10-21,9.8
2019-10-22,9.93
2019-10-23,10.015
2019-10-24,9.755
2019-10-25,9.835
2019-10-28,9.935
2019-10-29,9.825
2019-10-30,9.645
2019-10-31,9.535
2019-11-01,9.24
2019-11-04,9.475
2019-11-05,9.75
2019-11-06,9.395
2019-11-07,9.22
2019-11-08,9.425
2019-11-11,10.475
2019-11-12,10.47
2019-11-13,10.245
2019-11-14,10.055
2019-11-15,10.295
2019-11-18,10.055
2019-11-19,9.885
2019-11-20,9.08
2019-11-21,9.18
2019-11-22,9.275
2019-11-25,9.545
