date,close
2014-06-13,22.0318
2014-06-16,21.4906
2014-06-17,21.8063
2014-06-18,22.1333
2014-06-19,21.7048
2014-06-20,21.9134
2014-06-23,21.9247
2014-06-24,21.6428
2014-06-25,21.7612
2014-06-26,21.7386
2014-06-27,21.9827
2014-06-30,22.1814
2014-07-01,22.5276
2014-07-02,22.5844
2014-07-03,21.8465
2014-07-07,21.2392
2014-07-08,21.3186
2014-07-09,21.1483
2014-07-10,20.9327
2014-07-11,21.2562
2014-07-14,21.2448
2014-07-15,21.2221
2014-07-16,21.1143
2014-07-17,20.8646
2014-07-18,20.7
2014-07-21,20.5808
2014-07-22,20.6091
2014-07-23,20.507
2014-07-24,20.7113
2014-07-25,20.4048
2014-07-28,20.5921
2014-07-29,20.4786
2014-07-30,20.5978
2014-07-31,19.9678
2014-08-01,20.2232
2014-08-04,20.1551
2014-08-05,20.2062
2014-08-06,20.6148
2014-08-07,20.3026
2014-08-08,20.314
2014-08-11,20.1437
2014-08-12,20.1494
2014-08-13,20.1494
2014-08-14,20.0529
2014-08-15,19.7067
2014-08-18,19.6442
2014-08-19,19.5818
2014-08-20,19.5137
2014-08-21,19.3888
2014-08-22,19.3434
2014-08-25,19.5421
2014-08-26,19.9337
2014-08-27,20.0756
2014-08-28,19.7294
2014-08-29,19.7918
2014-09-02,19.9848
2014-09-03,19.7578
2014-09-04,19.8429
2014-09-05,19.8656
2014-09-08,19.7918
2014-09-09,19.6159
2014-09-10,19.928
2014-09-11,19.8826
2014-09-12,19.8656
2014-09-15,19.8713
2014-09-16,19.8656
2014-09-17,19.6783
2014-09-18,20.5581
2014-09-19,20.7964
2014-09-22,20.4332
2014-09-23,19.894
2014-09-24,20.0245
2014-09-25,19.5705
2014-09-26,19.8088
2014-09-29,19.7613
2014-09-30,19.6586
2014-10-01,19.3162
2014-10-02,19.3733
2014-10-03,19.9667
2014-10-06,20.2007
2014-10-07,19.9097
2014-10-08,20.2863
2014-10-09,20.0238
2014-10-10,20.2292
2014-10-13,21.011
2014-10-14,21.5246
2014-10-15,20.9711
2014-10-16,20.9539
2014-10-17,20.175
2014-10-20,20.5859
2014-10-21,20.6287
2014-10-22,20.4232
2014-10-23,20.5174
2014-10-24,20.5431
2014-10-27,20.4575
2014-10-28,21.6472
2014-10-29,21.4161
2014-10-30,22.3491
2014-10-31,22.546
2014-11-03,22.1865
2014-11-04,22.3834
2014-11-05,22.2721
2014-11-06,22.623
2014-11-07,21.9297
2014-11-10,22.8542
2014-11-11,22.6915
2014-11-12,22.6402
2014-11-13,22.3663
2014-11-14,22.1095
2014-11-17,21.9297
2014-11-18,22.1694
2014-11-19,21.9383
2014-11-20,22.3834
2014-11-21,22.332
2014-11-24,22.469
2014-11-25,22.4519
2014-11-26,22.4947
2014-11-28,21.6387
2014-12-01,21.1765
2014-12-02,21.904
2014-12-03,22.1865
2014-12-04,21.1765
2014-12-05,22.1523
2014-12-08,21.75
2014-12-09,23.0425
2014-12-10,22.4005
2014-12-11,22.2978
2014-12-12,21.7328
2014-12-15,21.5788
2014-12-16,22.0667
2014-12-17,23.0853
2014-12-18,23.402
2014-12-19,23.3249
2014-12-22,23.0767
2014-12-23,23.9155
2014-12-24,23.616
2014-12-26,24.5661
2014-12-29,24.6774
2014-12-30,24.0867
2014-12-31,24.2836
2015-01-02,23.4448
2015-01-05,22.9966
2015-01-06,22.6001
2015-01-07,22.8587
2015-01-08,22.4708
2015-01-09,22.014
2015-01-12,21.4537
2015-01-13,21.3675
2015-01-14,20.9279
2015-01-15,20.7297
2015-01-16,20.9021
2015-01-20,20.9107
2015-01-21,20.8762
2015-01-22,20.971
2015-01-23,20.7986
2015-01-26,20.6952
2015-01-27,20.7383
2015-01-28,20.2125
2015-01-29,20.7814
2015-01-30,20.0918
2015-02-02,20.3418
2015-02-03,20.6004
2015-02-04,20.2815
2015-02-05,20.9279
2015-02-06,20.8934
2015-02-09,20.8503
2015-02-10,20.6521
2015-02-11,20.4452
2015-02-12,21.0313
2015-02-13,21.1348
2015-02-17,21.4278
2015-02-18,21.3761
2015-02-19,21.4623
2015-02-20,21.4623
2015-02-23,21.4278
2015-02-24,21.4709
2015-02-25,21.4192
2015-02-26,21.4278
2015-02-27,21.152
2015-03-02,21.4537
2015-03-03,21.4192
2015-03-04,21.4192
2015-03-05,21.4365
2015-03-06,21.4537
2015-03-09,21.583
2015-03-10,21.4795
2015-03-11,21.5485
2015-03-12,22.4018
2015-03-13,22.4018
2015-03-16,22.3671
2015-03-17,22.4279
2015-03-18,22.5147
2015-03-19,22.48
2015-03-20,22.8968
2015-03-23,22.9141
2015-03-24,22.7492
2015-03-25,21.9937
2015-03-26,21.933
2015-03-27,21.8201
2015-03-30,22.3411
2015-03-31,22.1414
2015-04-01,22.0458
2015-04-02,22.0806
2015-04-06,22.5147
2015-04-07,22.2976
2015-04-08,22.5321
2015-04-09,22.15
2015-04-10,22.5408
2015-04-13,22.3932
2015-04-14,22.315
2015-04-15,22.6363
2015-04-16,22.5755
2015-04-17,22.1934
2015-04-20,22.6363
2015-04-21,22.645
2015-04-22,22.8273
2015-04-23,22.6536
2015-04-24,22.5842
2015-04-27,22.7318
2015-04-28,22.6102
2015-04-29,22.3758
2015-04-30,21.7246
2015-05-01,21.0647
2015-05-04,21.2557
2015-05-05,21.5336
2015-05-06,22.0806
2015-05-07,22.4453
2015-05-08,22.7839
2015-05-11,22.6797
2015-05-12,22.5842
2015-05-13,22.506
2015-05-14,22.5842
2015-05-15,22.3845
2015-05-18,22.5408
2015-05-19,22.8186
2015-05-20,22.5842
2015-05-21,22.6536
2015-05-22,22.1848
2015-05-26,21.768
2015-05-27,22.2195
2015-05-28,22.2195
2015-05-29,21.9156
2015-06-01,22.0719
2015-06-02,22.1674
2015-06-03,22.506
2015-06-04,22.2195
2015-06-05,22.7231
2015-06-08,23.0096
2015-06-09,23.1833
2015-06-10,23.8345
2015-06-11,24.2687
2015-06-12,23.2441
2015-06-15,22.9315
2015-06-16,23.9387
2015-06-17,23.4611
2015-06-18,23.9561
2015-06-19,23.7824
2015-06-22,24.0516
2015-06-23,24.5639
2015-06-24,24.4944
2015-06-25,24.5899
2015-06-26,24.3729
2015-06-29,23.892
2015-06-30,24.233
2015-07-01,24.3641
2015-07-02,23.3588
2015-07-06,23.2539
2015-07-07,23.927
2015-07-08,23.4287
2015-07-09,23.2102
2015-07-10,24.0319
2015-07-13,23.9358
2015-07-14,24.2854
2015-07-15,24.4515
2015-07-16,24.3903
2015-07-17,24.198
2015-07-20,23.7172
2015-07-21,23.7434
2015-07-22,23.8483
2015-07-23,23.0091
2015-07-24,22.7731
2015-07-27,23.4375
2015-07-28,23.5511
2015-07-29,23.4462
2015-07-30,23.656
2015-07-31,23.8134
2015-08-03,23.6735
2015-08-04,23.656
2015-08-05,23.9707
2015-08-06,24.2942
2015-08-07,23.7085
2015-08-10,24.0407
2015-08-11,23.9795
2015-08-12,23.7085
2015-08-13,23.2714
2015-08-14,23.3937
2015-08-17,23.5861
2015-08-18,23.2364
2015-08-19,23.0965
2015-08-20,22.6157
2015-08-21,22.5458
2015-08-24,21.5929
2015-08-25,21.6278
2015-08-26,22.5021
2015-08-27,22.3447
2015-08-28,22.0824
2015-08-31,22.3185
2015-09-01,21.6016
2015-09-02,21.8551
2015-09-03,22.4671
2015-09-04,22.5283
2015-09-08,22.8343
2015-09-09,22.7993
2015-09-10,22.7381
2015-09-11,23.2189
2015-09-14,23.4025
2015-09-15,23.6822
2015-09-16,23.6385
2015-09-17,23.7172
2015-09-18,23.1665
2015-09-21,23.2276
2015-09-22,23.2539
2015-09-23,23.2014
2015-09-24,23.7609
2015-09-25,23.1665
2015-09-28,23.3955
2015-09-29,23.5188
2015-09-30,23.8095
2015-10-01,23.3426
2015-10-02,23.6069
2015-10-05,23.6157
2015-10-06,23.4307
2015-10-07,23.8007
2015-10-08,24.0385
2015-10-09,23.8007
2015-10-12,24.5318
2015-10-13,24.4701
2015-10-14,23.5276
2015-10-15,24.5142
2015-10-16,24.0297
2015-10-19,23.8007
2015-10-20,24.0473
2015-10-21,23.4131
2015-10-22,23.8623
2015-10-23,24.3468
2015-10-26,24.0649
2015-10-27,23.8359
2015-10-28,24.9722
2015-10-29,24.7872
2015-10-30,24.4613
2015-11-02,24.5582
2015-11-03,24.4437
2015-11-04,24.7256
2015-11-05,24.7168
2015-11-06,25.6593
2015-11-09,25.5712
2015-11-10,26.0645
2015-11-11,25.7033
2015-11-12,25.5888
2015-11-13,25.8354
2015-11-16,26.0028
2015-11-17,26.3023
2015-11-18,26.9717
2015-11-19,26.9894
2015-11-20,27.2712
2015-11-23,27.4122
2015-11-24,27.6676
2015-11-25,27.5179
2015-11-27,27.9671
2015-11-30,27.6412
2015-12-01,27.6412
2015-12-02,27.465
2015-12-03,26.6722
2015-12-04,26.9101
2015-12-07,26.5401
2015-12-08,26.3023
2015-12-09,26.2847
2015-12-10,26.5489
2015-12-11,25.6328
2015-12-14,26.1966
2015-12-15,27.2448
2015-12-16,27.2624
2015-12-17,27.2536
2015-12-18,26.6546
2015-12-21,26.5577
2015-12-22,27.192
2015-12-23,27.1303
2015-12-24,26.7757
2015-12-28,26.9618
2015-12-29,27.6179
2015-12-30,27.4495
2015-12-31,26.5983
2016-01-04,25.889
2016-01-05,25.7649
2016-01-06,26.1816
2016-01-07,25.8359
2016-01-08,25.3837
2016-01-11,25.6497
2016-01-12,25.2507
2016-01-13,24.1247
2016-01-14,24.834
2016-01-15,24.3818
2016-01-19,24.169
2016-01-20,25.3039
2016-01-21,24.3375
2016-01-22,24.6301
2016-01-25,23.9828
2016-01-26,24.9847
2016-01-27,24.3552
2016-01-28,24.5857
2016-01-29,25.7383
2016-02-01,24.9581
2016-02-02,24.4971
2016-02-03,25.0202
2016-02-04,24.5059
2016-02-05,23.9651
2016-02-08,24.3907
2016-02-09,24.6655
2016-02-10,24.3907
2016-02-11,23.8764
2016-02-12,24.3729
2016-02-16,24.2665
2016-02-17,24.3109
2016-02-18,23.7878
2016-02-19,24.0006
2016-02-22,24.0183
2016-02-23,23.6105
2016-02-24,23.3622
2016-02-25,23.8498
2016-02-26,24.3375
2016-02-29,24.6833
2016-03-01,24.8783
2016-03-02,24.6744
2016-03-03,24.8694
2016-03-04,24.7808
2016-03-07,24.8694
2016-03-08,24.5148
2016-03-09,24.3375
2016-03-10,24.2222
2016-03-11,24.5059
2016-03-14,24.2488
2016-03-15,23.8498
2016-03-16,24.0642
2016-03-17,24.5823
2016-03-18,25.6006
2016-03-21,24.7788
2016-03-22,25.279
2016-03-23,24.7431
2016-03-24,24.5823
2016-03-28,24.9128
2016-03-29,25.1451
2016-03-30,25.02
2016-03-31,25.4577
2016-04-01,25.3862
2016-04-04,24.5823
2016-04-05,24.7431
2016-04-06,24.6448
2016-04-07,24.6716
2016-04-08,25.0289
2016-04-11,24.9843
2016-04-12,25.1629
2016-04-13,26.0294
2016-04-14,25.9669
2016-04-15,26.1276
2016-04-18,26.5564
2016-04-19,26.5743
2016-04-20,26.7529
2016-04-21,26.878
2016-04-22,28.1643
2016-04-25,27.5747
2016-04-26,28.2982
2016-04-27,27.9409
2016-04-28,27.1995
2016-04-29,27.3425
2016-05-02,28.1285
2016-05-03,26.8422
2016-05-04,26.3688
2016-05-05,25.7971
2016-05-06,25.9222
2016-05-09,26.5207
2016-05-10,26.3063
2016-05-11,26.5475
2016-05-12,26.083
2016-05-13,25.6006
2016-05-16,26.5296
2016-05-17,25.3058
2016-05-18,26.3822
2016-05-19,26.0472
2016-05-20,26.3063
2016-05-23,26.8333
2016-05-24,27.4586
2016-05-25,27.6462
2016-05-26,27.1727
2016-05-27,27.4318
2016-05-31,26.878
2016-06-01,27.2799
2016-06-02,27.9141
2016-06-03,27.5926
2016-06-06,27.5568
2016-06-07,27.4764
2016-06-08,27.673
2016-06-09,27.4229
2016-06-10,27.2263
2016-06-13,26.8065
2016-06-14,26.8512
2016-06-15,26.744
2016-06-16,26.8601
2016-06-17,26.9316
2016-06-20,26.869
2016-06-21,26.8065
2016-06-22,26.7797
2016-06-23,27.07
2016-06-24,26.3956
2016-06-27,25.2523
2016-06-28,25.5202
2016-06-29,25.4577
2016-06-30,25.7905
2016-07-01,25.8085
2016-07-05,25.4307
2016-07-06,25.7456
2016-07-07,25.8355
2016-07-08,26.6271
2016-07-11,26.6901
2016-07-12,27.1489
2016-07-13,26.942
2016-07-14,27.2029
2016-07-15,27.2838
2016-07-18,27.2299
2016-07-19,27.3018
2016-07-20,27.2478
2016-07-21,27.1219
2016-07-22,27.3648
2016-07-25,27.2658
2016-07-26,27.2568
2016-07-27,27.3468
2016-07-28,27.3558
2016-07-29,27.3018
2016-08-01,27.3108
2016-08-02,27.1309
2016-08-03,27.3018
2016-08-04,27.1849
2016-08-05,27.4368
2016-08-08,27.3468
2016-08-09,27.3378
2016-08-10,27.3468
2016-08-11,27.7516
2016-08-12,27.7066
2016-08-15,27.7966
2016-08-16,27.7966
2016-08-17,27.7696
2016-08-18,28.1834
2016-08-19,28.3903
2016-08-22,28.3273
2016-08-23,28.5972
2016-08-24,29.1459
2016-08-25,29.4788
2016-08-26,29.6587
2016-08-29,29.4248
2016-08-30,29.4968
2016-08-31,29.5058
2016-09-01,29.4068
2016-09-02,29.4788
2016-09-06,29.2989
2016-09-07,29.4338
2016-09-08,29.4068
2016-09-09,29.1459
2016-09-12,29.4068
2016-09-13,28.8851
2016-09-14,28.6692
2016-09-15,28.93
2016-09-16,28.6152
2016-09-19,28.6872
2016-09-20,28.6062
2016-09-21,28.8941
2016-09-22,29.5867
2016-09-23,29.5687
2016-09-26,29.2359
2016-09-27,29.6047
2016-09-28,30.0005
2016-09-29,29.4608
2016-09-30,29.8206
2016-10-03,29.2774
2016-10-04,29.3861
2016-10-05,30.1103
2016-10-06,29.5943
2016-10-07,29.3046
2016-10-10,29.3499
2016-10-11,29.2412
2016-10-12,29.3951
2016-10-13,28.7161
2016-10-14,28.9425
2016-10-17,28.8791
2016-10-18,29.1054
2016-10-19,29.1054
2016-10-20,29.196
2016-10-21,29.1054
2016-10-24,29.4675
2016-10-25,29.4223
2016-10-26,29.196
2016-10-27,29.6033
2016-10-28,29.0602
2016-10-31,28.9244
2016-11-01,28.9696
2016-11-02,28.8338
2016-11-03,28.9244
2016-11-04,28.9696
2016-11-07,29.6486
2016-11-08,29.7844
2016-11-09,31.9119
2016-11-10,33.3151
2016-11-11,36.5289
2016-11-14,34.8541
2016-11-15,33.8583
2016-11-16,34.3109
2016-11-17,34.7183
2016-11-18,35.1709
2016-11-21,35.1257
2016-11-22,35.3067
2016-11-23,34.9899
2016-11-25,35.2162
2016-11-28,35.1257
2016-11-29,24.249
2016-11-30,24.1077
2016-12-01,24.7669
2016-12-02,24.5786
2016-12-05,25.379
2016-12-06,26.1324
2016-12-07,26.7916
2016-12-08,27.4508
2016-12-09,26.462
2016-12-12,26.5561
2016-12-13,26.5561
2016-12-14,26.6032
2016-12-15,26.6503
2016-12-16,26.5091
2016-12-19,26.6032
2016-12-20,26.8857
2016-12-21,26.8387
2016-12-22,26.9799
2016-12-23,27.1683
2016-12-27,27.1212
2016-12-28,27.2153
2016-12-29,26.9693
2016-12-30,27.0166
2017-01-03,27.2532
2017-01-04,27.2532
2017-01-05,26.6854
2017-01-06,26.5908
2017-01-09,25.6918
2017-01-10,25.8337
2017-01-11,25.8337
2017-01-12,25.6918
2017-01-13,26.0703
2017-01-17,25.6918
2017-01-18,25.9757
2017-01-19,25.8337
2017-01-20,25.8811
2017-01-23,25.9284
2017-01-24,26.4488
2017-01-25,26.6381
2017-01-26,26.7327
2017-01-27,26.4015
2017-01-30,25.7864
2017-01-31,25.6445
2017-02-01,25.7864
2017-02-02,25.7864
2017-02-03,26.4015
2017-02-06,25.7391
2017-02-07,25.5499
2017-02-08,25.266
2017-02-09,25.5972
2017-02-10,25.9284
2017-02-13,26.2596
2017-02-14,26.5908
2017-02-15,26.6854
2017-02-16,26.8747
2017-02-17,26.6854
2017-02-21,26.5908
2017-02-22,26.8747
2017-02-23,26.8273
2017-02-24,26.5908
2017-02-27,26.4961
2017-02-28,26.023
2017-03-01,26.6854
2017-03-02,25.7391
2017-03-03,26.023
2017-03-06,25.9284
2017-03-07,25.6445
2017-03-08,25.3133
2017-03-09,25.124
2017-03-10,25.1713
2017-03-13,25.3606
2017-03-14,25.4079
2017-03-15,26.3497
2017-03-16,26.5875
2017-03-17,26.5399
2017-03-20,25.9216
2017-03-21,25.0179
2017-03-22,24.9228
2017-03-23,25.113
2017-03-24,25.0655
2017-03-27,25.2081
2017-03-28,25.2557
2017-03-29,24.8752
2017-03-30,25.6838
2017-03-31,25.7313
2017-04-03,25.446
2017-04-04,25.4935
2017-04-05,24.7801
2017-04-06,24.9228
2017-04-07,24.8752
2017-04-10,24.6374
2017-04-11,25.2081
2017-04-12,24.9228
2017-04-13,24.5898
2017-04-17,24.9703
2017-04-18,25.0179
2017-04-19,25.0179
2017-04-20,25.6362
2017-04-21,25.6838
2017-04-24,26.4448
2017-04-25,26.5875
2017-04-26,26.9204
2017-04-27,26.5875
2017-04-28,25.874
2017-05-01,26.4448
2017-05-02,26.4923
2017-05-03,26.2545
2017-05-04,26.8728
2017-05-05,26.4923
2017-05-08,26.6826
2017-05-09,26.5875
2017-05-10,26.7301
2017-05-11,26.5399
2017-05-12,26.1118
2017-05-15,26.3021
2017-05-16,26.1594
2017-05-17,25.446
2017-05-18,25.8265
2017-05-19,25.5886
2017-05-22,25.7789
2017-05-23,25.874
2017-05-24,25.874
2017-05-25,25.7313
2017-05-26,25.874
2017-05-30,25.5886
2017-05-31,25.8265
2017-06-01,26.1118
2017-06-02,26.1594
2017-06-05,25.9216
2017-06-06,25.7789
2017-06-07,25.874
2017-06-08,26.8728
2017-06-09,27.9668
2017-06-12,27.9192
2017-06-13,27.2058
2017-06-14,26.7301
2017-06-15,26.7777
2017-06-16,26.3021
2017-06-19,26.6826
2017-06-20,26.207
2017-06-21,25.8265
2017-06-22,25.7789
2017-06-23,25.874
2017-06-26,26.5875
2017-06-27,26.8728
2017-06-28,26.8253
2017-06-29,27.1106
2017-06-30,27.2058
2017-07-03,27.3485
2017-07-05,27.0155
2017-07-06,27.0538
2017-07-07,27.3884
2017-07-10,27.006
2017-07-11,26.8626
2017-07-12,26.7192
2017-07-13,26.289
2017-07-14,26.0022
2017-07-17,26.0978
2017-07-18,26.0022
2017-07-19,26.289
2017-07-20,26.4324
2017-07-21,26.3368
2017-07-24,26.4324
2017-07-25,27.0538
2017-07-26,27.006
2017-07-27,27.1016
2017-07-28,26.5758
2017-07-31,26.7192
2017-08-01,26.6714
2017-08-02,26.528
2017-08-03,26.5758
2017-08-04,26.9104
2017-08-07,26.9582
2017-08-08,27.006
2017-08-09,26.4324
2017-08-10,26.05
2017-08-11,25.8588
2017-08-14,26.4802
2017-08-15,26.5758
2017-08-16,26.2412
2017-08-17,25.811
2017-08-18,25.8588
2017-08-21,26.0022
2017-08-22,25.9544
2017-08-23,25.7154
2017-08-24,25.8588
2017-08-25,25.811
2017-08-28,25.6676
2017-08-29,25.5242
2017-08-30,25.572
2017-08-31,25.572
2017-09-01,25.811
2017-09-05,25.2852
2017-09-06,25.4286
2017-09-07,25.1418
2017-09-08,25.3808
2017-09-11,26.0261
2017-09-12,26.3368
2017-09-13,26.3368
2017-09-14,26.4802
2017-09-15,26.7192
2017-09-18,27.1972
2017-09-19,27.1972
2017-09-20,27.7229
2017-09-21,27.9619
2017-09-22,28.4399
2017-09-25,28.5355
2017-09-26,28.8701
2017-09-27,29.4437
2017-09-28,29.5393
2017-09-29,29.1091
2017-10-02,29.4915
2017-10-03,29.5393
2017-10-04,29.1569
2017-10-05,29.5871
2017-10-06,29.7783
2017-10-09,29.7783
2017-10-10,30.4026
2017-10-11,30.3546
2017-10-12,29.9704
2017-10-13,30.0184
2017-10-16,29.9223
2017-10-17,29.394
2017-10-18,29.7302
2017-10-19,29.4421
2017-10-20,29.6342
2017-10-23,29.5381
2017-10-24,29.6822
2017-10-25,29.6822
2017-10-26,29.4901
2017-10-27,29.8743
2017-10-30,29.5381
2017-10-31,30.3066
2017-11-01,28.7216
2017-11-02,28.9618
2017-11-03,28.4815
2017-11-06,28.4334
2017-11-07,27.4248
2017-11-08,27.1366
2017-11-09,26.9445
2017-11-10,26.9926
2017-11-13,27.4728
2017-11-14,28.0012
2017-11-15,28.0972
2017-11-16,28.0012
2017-11-17,28.0972
2017-11-20,28.2893
2017-11-21,28.2413
2017-11-22,27.665
2017-11-24,27.9531
2017-11-27,28.2413
2017-11-28,29.2499
2017-11-29,29.7783
2017-11-30,28.9618
2017-12-01,28.7216
2017-12-04,29.1058
2017-12-05,28.6736
2017-12-06,28.5775
2017-12-07,28.8657
2017-12-08,28.1933
2017-12-11,27.9531
2017-12-12,28.1453
2017-12-13,28.4334
2017-12-14,27.9051
2017-12-15,28.8177
2017-12-18,29.0098
2017-12-19,28.5295
2017-12-20,28.3854
2017-12-21,28.4815
2017-12-22,28.3854
2017-12-26,28.2893
2017-12-27,27.9531
2017-12-28,27.9532
2017-12-29,27.5186
2018-01-02,27.1324
2018-01-03,26.7462
2018-01-04,26.891
2018-01-05,27.1324
2018-01-08,27.0359
2018-01-09,27.1324
2018-01-10,27.0359
2018-01-11,27.3255
2018-01-12,27.5669
2018-01-16,27.6152
2018-01-17,28.0014
2018-01-18,27.3738
2018-01-19,27.76
2018-01-22,27.7118
2018-01-23,27.8566
2018-01-24,27.4704
2018-01-25,27.2773
2018-01-26,26.891
2018-01-29,26.6014
2018-01-30,27.0359
2018-01-31,27.1324
2018-02-01,27.5186
2018-02-02,27.4221
2018-02-05,26.4082
2018-02-06,26.9876
2018-02-07,27.1807
2018-02-08,26.4565
2018-02-09,26.6979
2018-02-12,26.5531
2018-02-13,26.6014
2018-02-14,27.0841
2018-02-15,27.1324
2018-02-16,27.6152
2018-02-20,27.0841
2018-02-21,27.3738
2018-02-22,27.0841
2018-02-23,27.3255
2018-02-26,27.3738
2018-02-27,27.1807
2018-02-28,26.3117
2018-03-01,26.4565
2018-03-02,26.9876
2018-03-05,27.4221
2018-03-06,27.7118
2018-03-07,28.0014
2018-03-08,27.7118
2018-03-09,28.3877
2018-03-12,28.4359
2018-03-13,28.2428
2018-03-14,27.8566
2018-03-15,28.1478
2018-03-16,28.1478
2018-03-19,28.3419
2018-03-20,28.0507
2018-03-21,28.0507
2018-03-22,27.4198
2018-03-23,26.2551
2018-03-26,27.1286
2018-03-27,26.6433
2018-03-28,26.8374
2018-03-29,26.6433
2018-04-02,26.2065
2018-04-03,26.3521
2018-04-04,26.5463
2018-04-05,26.6919
2018-04-06,26.2065
2018-04-09,26.2065
2018-04-10,26.5463
2018-04-11,26.4492
2018-04-12,26.8374
2018-04-13,26.4977
2018-04-16,26.7404
2018-04-17,26.5948
2018-04-18,26.4977
2018-04-19,26.7404
2018-04-20,27.0316
2018-04-23,27.1772
2018-04-24,27.3713
2018-04-25,27.0801
2018-04-26,26.6919
2018-04-27,26.2065
2018-04-30,25.7212
2018-05-01,24.4594
2018-05-02,24.5322
2018-05-03,24.2168
2018-05-04,24.7992
2018-05-07,24.7506
2018-05-08,24.7992
2018-05-09,24.2168
2018-05-10,24.2653
2018-05-11,24.1197
2018-05-14,23.78
2018-05-15,24.0227
2018-05-16,24.1197
2018-05-17,24.2168
2018-05-18,24.1683
2018-05-21,23.9741
2018-05-22,24.1683
2018-05-23,24.2168
2018-05-24,24.2168
2018-05-25,24.1683
2018-05-29,24.1683
2018-05-30,24.7021
2018-05-31,24.7506
2018-06-01,24.8477
2018-06-04,25.0418
2018-06-05,24.8477
2018-06-06,24.8962
2018-06-07,25.1874
2018-06-08,25.333
2018-06-11,24.7992
2018-06-12,24.7506
2018-06-13,25.0903
2018-06-14,24.8962
2018-06-15,24.6536
2018-06-18,24.8962
2018-06-19,25.6242
2018-06-20,25.8183
2018-06-21,25.5271
2018-06-22,25.6727
2018-06-25,24.8477
2018-06-26,24.7992
2018-06-27,24.508
2018-06-28,24.3138
2018-06-29,24.1197
2018-07-02,24.8477
2018-07-03,24.508
2018-07-05,24.6536
2018-07-06,24.605
2018-07-09,24.8979
2018-07-10,24.605
2018-07-11,24.7027
2018-07-12,24.5562
2018-07-13,24.1657
2018-07-16,24.1168
2018-07-17,24.0192
2018-07-18,24.5074
2018-07-19,24.9956
2018-07-20,24.7027
2018-07-23,24.6538
2018-07-24,24.2633
2018-07-25,23.8239
2018-07-26,23.6775
2018-07-27,23.4822
2018-07-30,22.9452
2018-07-31,21.2853
2018-08-01,21.7735
2018-08-02,21.7491
2018-08-03,21.6759
2018-08-06,21.5782
2018-08-07,21.627
2018-08-08,21.8223
2018-08-09,21.6759
2018-08-10,21.6759
2018-08-13,21.4318
2018-08-14,21.4318
2018-08-15,21.2853
2018-08-16,21.4318
2018-08-17,21.627
2018-08-20,21.4318
2018-08-21,21.5782
2018-08-22,21.4806
2018-08-23,21.3341
2018-08-24,21.3829
2018-08-27,21.2853
2018-08-28,21.1388
2018-08-29,21.4318
2018-08-30,21.09
2018-08-31,21.2853
2018-09-04,21.1388
2018-09-05,21.2365
2018-09-06,21.1877
2018-09-07,21.3829
2018-09-10,21.2365
2018-09-11,21.2365
2018-09-12,21.0412
2018-09-13,20.9924
2018-09-14,21.1877
2018-09-17,21.4318
2018-09-18,21.2365
2018-09-19,21.3341
2018-09-20,21.1877
2018-09-21,22.0176
2018-09-24,21.2365
2018-09-25,20.9924
2018-09-26,20.9924
2018-09-27,21.0412
2018-09-28,21.2365
2018-10-01,20.9045
2018-10-02,21.0803
2018-10-03,21.4025
2018-10-04,20.9924
2018-10-05,21.1096
2018-10-08,21.422
2018-10-09,21.4023
2018-10-10,21.1661
2018-10-11,20.8119
2018-10-12,20.2904
2018-10-15,20.9103
2018-10-16,21.0185
2018-10-17,21.0382
2018-10-18,20.5069
2018-10-19,20.2412
2018-10-22,19.8968
2018-10-23,19.818
2018-10-24,18.9226
2018-10-25,19.0702
2018-10-26,19.326
2018-10-29,19.4048
2018-10-30,19.7492
2018-10-31,19.8869
2018-11-01,20.3297
2018-11-02,20.5954
2018-11-05,20.6545
2018-11-06,20.7037
2018-11-07,20.5659
2018-11-08,20.6545
2018-11-09,20.4085
2018-11-12,20.1624
2018-11-13,20.3297
2018-11-14,20.2215
2018-11-15,20.7332
2018-11-16,20.6643
2018-11-19,20.3888
2018-11-20,20.2805
2018-11-21,20.2904
2018-11-23,20.5462
2018-11-26,20.6151
2018-11-27,20.4872
2018-11-28,20.9595
2018-11-29,20.9595
2018-11-30,21.2744
2018-12-03,21.3531
2018-12-04,19.5622
2018-12-06,19.4638
2018-12-07,19.3556
2018-12-10,19.3064
2018-12-11,19.0407
2018-12-12,20.064
2018-12-13,19.9853
2018-12-14,19.6704
2018-12-17,19.4835
2018-12-18,19.6606
2018-12-19,19.1981
2018-12-20,19.0308
2018-12-21,19.3064
2018-12-24,18.8734
2018-12-26,19.3851
2018-12-27,19.1883
2018-12-28,19.4933
2018-12-31,19.6311
2019-01-02,20.2563
2019-01-03,20.3854
2019-01-04,21.1198
2019-01-07,21.229
2019-01-08,21.2488
2019-01-09,20.9709
2019-01-10,20.7129
2019-01-11,20.5342
2019-01-14,20.4251
2019-01-15,20.7923
2019-01-16,20.8816
2019-01-17,20.7923
2019-01-18,20.822
2019-01-22,20.6235
2019-01-23,20.693
2019-01-24,20.6434
2019-01-25,20.7526
2019-01-28,20.4846
2019-01-29,20.6335
2019-01-30,20.6434
2019-01-31,20.564
2019-02-01,20.8518
2019-02-04,20.9511
2019-02-05,21.1595
2019-02-06,21.0602
2019-02-07,20.9908
2019-02-08,21.4572
2019-02-11,21.8741
2019-02-12,22.1817
2019-02-13,22.152
2019-02-14,21.8046
2019-02-15,22.3901
2019-02-19,22.6283
2019-02-20,22.9956
2019-02-21,22.9062
2019-02-22,22.9757
2019-02-25,23.0849
2019-02-26,23.0353
2019-02-27,23.1246
2019-02-28,23.1841
2019-03-01,23.2139
2019-03-04,22.9757
2019-03-05,22.9062
2019-03-06,22.678
2019-03-07,22.4596
2019-03-08,22.41
2019-03-11,22.93
2019-03-12,23
2019-03-13,23.07
2019-03-14,23
2019-03-15,22.76
2019-03-18,22.95
2019-03-19,22.42
2019-03-20,21.98
2019-03-21,21.78
2019-03-22,20.95
2019-03-25,21.26
2019-03-26,21.87
2019-03-27,21.91
2019-03-28,21.93
2019-03-29,21.93
2019-04-01,22.24
2019-04-02,22.05
2019-04-03,22.11
2019-04-04,22.28
2019-04-05,22.67
2019-04-08,22.57
2019-04-09,22.18
2019-04-10,22.62
2019-04-11,22.7
2019-04-12,22.84
2019-04-15,22.67
2019-04-16,22.86
2019-04-17,22.94
2019-04-18,22.81
2019-04-22,22.64
2019-04-23,23.03
2019-04-24,23.13
2019-04-25,22.78
2019-04-26,23.26
2019-04-29,23.59
2019-04-30,23.27
2019-05-01,22.8
2019-05-02,23.18
2019-05-03,23.5
2019-05-06,23.32
2019-05-07,22.84
2019-05-08,22.7
2019-05-09,22.43
2019-05-10,22.71
2019-05-13,22.31
2019-05-14,22.72
2019-05-15,22.53
2019-05-16,22.65
2019-05-17,22.3
2019-05-20,22.56
2019-05-21,22.72
2019-05-22,22.4
2019-05-23,21.64
2019-05-24,21.77
2019-05-28,21.82
2019-05-29,21.55
2019-05-30,21.41
2019-05-31,21.35
2019-06-03,21.32
2019-06-04,21.79
2019-06-05,21.49
2019-06-06,21.25
2019-06-07,21.45
2019-06-10,21.78
2019-06-11,21.93
2019-06-12,21.5
2019-06-13,21.47
2019-06-14,21.55
2019-06-17,21.34
2019-06-18,21.26
2019-06-19,20.81
2019-06-20,20.39
2019-06-21,20.76
2019-06-24,20.595
2019-06-25,20.315
2019-06-26,20.51
2019-06-27,20.68
2019-06-28,21.07
2019-07-01,21.08
2019-07-02,21.045
2019-07-03,21.24
2019-07-04,21.24
2019-07-05,21.68
2019-07-08,21.51
2019-07-09,21.655
2019-07-10,21.555
2019-07-11,21.62
2019-07-12,21.9
2019-07-15,21.535
2019-07-16,21.53
2019-07-17,21.345
2019-07-18,21.455
2019-07-19,21.365
2019-07-22,21.16
2019-07-23,21.27
2019-07-24,21.88
2019-07-25,21.54
2019-07-26,22.06
2019-07-29,22.04
2019-07-30,21.805
2019-07-31,22.18
2019-08-01,21.81
2019-08-02,21.8
2019-08-05,21.19
2019-08-06,21.41
2019-08-07,21.25
2019-08-08,21.74
2019-08-09,21.88
2019-08-12,21.685
2019-08-13,21.835
2019-08-14,21.2
2019-08-15,21.05
2019-08-16,21.59
2019-08-19,22.31
2019-08-20,21.88
2019-08-21,22.08
2019-08-22,22.14
2019-08-23,21.4
2019-08-26,21.945
2019-08-27,21.32
2019-08-28,21.65
2019-08-29,21.745
2019-08-30,21.785
2019-09-02,21.77
2019-09-03,21.61
2019-09-04,21.58
2019-09-05,22.025
2019-09-06,22.17
2019-09-09,22.85
2019-09-10,22.88
2019-09-11,23.385
2019-09-12,23.75
2019-09-13,24.04
2019-09-16,23.71
2019-09-17,23.54
2019-09-18,23.245
2019-09-19,22.9
2019-09-20,23.245
2019-09-23,23.06
2019-09-24,22.66
2019-09-25,23.03
2019-09-26,22.92
2019-09-27,22.98
2019-09-30,22.895
2019-10-01,22.31
2019-10-02,22.495
2019-10-03,22.385
2019-10-04,22.46
2019-10-07,22.675
2019-10-08,22.14
2019-10-09,22.335
2019-10-10,22.335
2019-10-11,22.905
2019-10-14,22.68
2019-10-15,22.86
2019-10-16,22.675
2019-10-17,22.775
2019-10-18,22.99
2019-10-21,23.315
2019-10-22,23.27
2019-10-23,23.14
2019-10-24,23.055
2019-10-25,23.205
2019-10-28,23.62
2019-10-29,23.8
2019-10-30,23.675
2019-10-31,23.495
2019-11-01,23.595
2019-11-04,23.88
2019-11-05,24
2019-11-06,23.97
2019-11-07,24.24
2019-11-08,24.265
2019-11-11,24.2
2019-11-12,24.11
2019-11-13,24.05
2019-11-14,23.93
2019-11-15,23.97
2019-11-18,23.96
2019-11-19,24.06
2019-11-20,24
2019-11-21,23.88
2019-11-22,23.97
2019-11-25,24.34
