date,close
2014-06-13,7.08
2014-06-16,7.08
2014-06-17,7.11
2014-06-18,7.14
2014-06-19,7.19
2014-06-20,7.27
2014-06-23,7.24
2014-06-24,7.11
2014-06-25,7.14
2014-06-26,7.1
2014-06-27,7.2
2014-06-30,7.12
2014-07-01,7.26
2014-07-02,7.36
2014-07-03,7.42
2014-07-07,7.32
2014-07-08,7.42
2014-07-09,7.495
2014-07-10,7.49
2014-07-11,7.37
2014-07-14,7.66
2014-07-15,7.6
2014-07-16,7.57
2014-07-17,7.61
2014-07-18,7.61
2014-07-21,7.57
2014-07-22,7.55
2014-07-23,7.54
2014-07-24,7.56
2014-07-25,7.53
2014-07-28,7.55
2014-07-29,7.55
2014-07-30,7.68
2014-07-31,7.51
2014-08-01,7.47
2014-08-04,7.43
2014-08-05,7.05
2014-08-06,7.01
2014-08-07,6.77
2014-08-08,6.9
2014-08-11,6.85
2014-08-12,6.89
2014-08-13,6.83
2014-08-14,6.86
2014-08-15,6.69
2014-08-18,6.85
2014-08-19,6.66
2014-08-20,6.56
2014-08-21,6.6
2014-08-22,7.04
2014-08-25,7.58
2014-08-26,7.4
2014-08-27,7.17
2014-08-28,7.24
2014-08-29,7.29
2014-09-02,7.325
2014-09-03,7.08
2014-09-04,7.13
2014-09-05,7.05
2014-09-08,7.22
2014-09-09,7.06
2014-09-10,7.1
2014-09-11,7.18
2014-09-12,6.92
2014-09-15,7.21
2014-09-16,7.31
2014-09-17,7.2
2014-09-18,7.05
2014-09-19,7.35
2014-09-22,7.01
2014-09-23,7
2014-09-24,7.09
2014-09-25,7.12
2014-09-26,7.14
2014-09-29,7.2
2014-09-30,7.11
2014-10-01,6.99
2014-10-02,7.03
2014-10-03,7.16
2014-10-06,7.05
2014-10-07,6.98
2014-10-08,7.05
2014-10-09,7.01
2014-10-10,6.97
2014-10-13,7
2014-10-14,7.12
2014-10-15,7.05
2014-10-16,7.28
2014-10-17,7.26
2014-10-20,7.51
2014-10-21,7.52
2014-10-22,7.36
2014-10-23,7.34
2014-10-24,7.47
2014-10-27,7.47
2014-10-28,7.74
2014-10-29,7.81
2014-10-30,7.7
2014-10-31,7.71
2014-11-03,7.79
2014-11-04,7.86
2014-11-05,7.55
2014-11-06,7.48
2014-11-07,7.52
2014-11-10,7.55
2014-11-11,7.66
2014-11-12,7.78
2014-11-13,7.75
2014-11-14,7.8
2014-11-17,7.67
2014-11-18,7.74
2014-11-19,7.69
2014-11-20,7.71
2014-11-21,7.48
2014-11-24,7.62
2014-11-25,7.68
2014-11-26,7.57
2014-11-28,7.51
2014-12-01,7.58
2014-12-02,7.75
2014-12-03,7.69
2014-12-04,7.53
2014-12-05,7.45
2014-12-08,7.21
2014-12-09,7.32
2014-12-10,7.15
2014-12-11,7.05
2014-12-12,7.12
2014-12-15,7.09
2014-12-16,7.23
2014-12-17,7.49
2014-12-18,7.585
2014-12-19,7.63
2014-12-22,7.6
2014-12-23,7.6
2014-12-24,7.62
2014-12-26,7.71
2014-12-29,7.71
2014-12-30,7.66
2014-12-31,7.63
2015-01-02,7.6
2015-01-05,7.47
2015-01-06,7.2
2015-01-07,7.49
2015-01-08,7.97
2015-01-09,7.99
2015-01-12,8.04
2015-01-13,8.16
2015-01-14,8.32
2015-01-15,8.14
2015-01-16,8.11
2015-01-20,7.83
2015-01-21,7.72
2015-01-22,8.06
2015-01-23,7.98
2015-01-26,8
2015-01-27,8.11
2015-01-28,8
2015-01-29,8.43
2015-01-30,7.96
2015-02-02,8.09
2015-02-03,8.2
2015-02-04,8.17
2015-02-05,8.21
2015-02-06,8.12
2015-02-09,7.94
2015-02-10,8.04
2015-02-11,7.89
2015-02-12,7.9
2015-02-13,7.93
2015-02-17,7.92
2015-02-18,8.15
2015-02-19,8.35
2015-02-20,8.8
2015-02-23,8.59
2015-02-24,8.46
2015-02-25,8.46
2015-02-26,7.82
2015-02-27,7.85
2015-03-02,7.92
2015-03-03,7.89
2015-03-04,7.86
2015-03-05,7.89
2015-03-06,7.68
2015-03-09,7.76
2015-03-10,7.7
2015-03-11,7.73
2015-03-12,7.9
2015-03-13,7.92
2015-03-16,8
2015-03-17,7.73
2015-03-18,7.86
2015-03-19,7.89
2015-03-20,8.05
2015-03-23,8.19
2015-03-24,8.26
2015-03-25,8.25
2015-03-26,8.25
2015-03-27,8.4
2015-03-30,8.37
2015-03-31,8.29
2015-04-01,8.43
2015-04-02,8.27
2015-04-06,8.2
2015-04-07,8.3
2015-04-08,8.34
2015-04-09,8.23
2015-04-10,8.38
2015-04-13,8.17
2015-04-14,8.29
2015-04-15,8.58
2015-04-16,9.14
2015-04-17,9.13
2015-04-20,9.22
2015-04-21,9.03
2015-04-22,8.93
2015-04-23,9.12
2015-04-24,9.22
2015-04-27,9.37
2015-04-28,9.64
2015-04-29,9.27
2015-04-30,9.04
2015-05-01,9.19
2015-05-04,9.34
2015-05-05,9.37
2015-05-06,9.5
2015-05-07,9.84
2015-05-08,9.74
2015-05-11,9.79
2015-05-12,10.06
2015-05-13,9.94
2015-05-14,9.79
2015-05-15,9.97
2015-05-18,9.91
2015-05-19,9.67
2015-05-20,9.59
2015-05-21,9.66
2015-05-22,9.55
2015-05-26,9.98
2015-05-27,9.95
2015-05-28,10.05
2015-05-29,10.02
2015-06-01,10.01
2015-06-02,10.05
2015-06-03,10.07
2015-06-04,10.26
2015-06-05,10.59
2015-06-08,10.57
2015-06-09,10.44
2015-06-10,10.53
2015-06-11,10.38
2015-06-12,10.46
2015-06-15,10.41
2015-06-16,10.5
2015-06-17,10.3
2015-06-18,10.37
2015-06-19,10.53
2015-06-22,10.72
2015-06-23,10.71
2015-06-24,10.58
2015-06-25,10.65
2015-06-26,10.58
2015-06-29,10.34
2015-06-30,10.4
2015-07-01,10.41
2015-07-02,10.52
2015-07-06,10.53
2015-07-07,10.39
2015-07-08,10.19
2015-07-09,10.27
2015-07-10,10.3
2015-07-13,10.89
2015-07-14,10.94
2015-07-15,10.68
2015-07-16,10.91
2015-07-17,10.79
2015-07-20,10.8
2015-07-21,10.76
2015-07-22,10.73
2015-07-23,10.56
2015-07-24,10.33
2015-07-27,10.51
2015-07-28,10.6
2015-07-29,10.8
2015-07-30,10.87
2015-07-31,11.02
2015-08-03,11.05
2015-08-04,12.3
2015-08-05,12.46
2015-08-06,12.33
2015-08-07,12.41
2015-08-10,12.46
2015-08-11,12.37
2015-08-12,12.33
2015-08-13,12.66
2015-08-14,12.93
2015-08-17,12.99
2015-08-18,12.89
2015-08-19,12.82
2015-08-20,12.23
2015-08-21,11.91
2015-08-24,11.36
2015-08-25,11.74
2015-08-26,12.225
2015-08-27,12.57
2015-08-28,12.68
2015-08-31,12.65
2015-09-01,12.73
2015-09-02,12.74
2015-09-03,12.73
2015-09-04,12.67
2015-09-08,12.86
2015-09-09,12.72
2015-09-10,12.65
2015-09-11,12.99
2015-09-14,12.95
2015-09-15,12.96
2015-09-16,12.73
2015-09-17,12.8
2015-09-18,12.99
2015-09-21,13.3
2015-09-22,13.68
2015-09-23,13.31
2015-09-24,13.26
2015-09-25,12.59
2015-09-28,12.09
2015-09-29,11.8
2015-09-30,11.9
2015-10-01,12.06
2015-10-02,11.88
2015-10-05,12.15
2015-10-06,11.85
2015-10-07,11.89
2015-10-08,11.84
2015-10-09,12.12
2015-10-12,12.51
2015-10-13,12.67
2015-10-14,11.93
2015-10-15,12.42
2015-10-16,12.52
2015-10-19,12.48
2015-10-20,12.59
2015-10-21,12.34
2015-10-22,12.37
2015-10-23,12.34
2015-10-26,12.13
2015-10-27,11.9
2015-10-28,12.31
2015-10-29,11.93
2015-10-30,11.76
2015-11-02,12.05
2015-11-03,11.78
2015-11-04,12
2015-11-05,11.97
2015-11-06,12.26
2015-11-09,11.99
2015-11-10,11.84
2015-11-11,11.97
2015-11-12,11.92
2015-11-13,11.7
2015-11-16,11.53
2015-11-17,11.4
2015-11-18,11.52
2015-11-19,11.53
2015-11-20,11.38
2015-11-23,11.9
2015-11-24,11.78
2015-11-25,12.07
2015-11-27,12.19
2015-11-30,12.04
2015-12-01,12.01
2015-12-02,12.16
2015-12-03,11.53
2015-12-04,11.78
2015-12-07,11.57
2015-12-08,11.51
2015-12-09,11.87
2015-12-10,11.61
2015-12-11,11.27
2015-12-14,11
2015-12-15,11.31
2015-12-16,11.56
2015-12-17,11.35
2015-12-18,11.38
2015-12-21,11.82
2015-12-22,12.17
2015-12-23,11.96
2015-12-24,11.9
2015-12-28,11.89
2015-12-29,11.98
2015-12-30,11.86
2015-12-31,11.74
2016-01-04,11.49
2016-01-05,11.51
2016-01-06,11.56
2016-01-07,11.45
2016-01-08,11.15
2016-01-11,11.27
2016-01-12,11.75
2016-01-13,11.53
2016-01-14,12.44
2016-01-15,12.28
2016-01-19,13.11
2016-01-20,13.18
2016-01-21,12.83
2016-01-22,13.05
2016-01-25,13.15
2016-01-26,13.32
2016-01-27,12.79
2016-01-28,13.04
2016-01-29,13.36
2016-02-01,13.97
2016-02-02,13.9
2016-02-03,13.32
2016-02-04,12.94
2016-02-05,12.27
2016-02-08,12.5
2016-02-09,12.64
2016-02-10,12.5
2016-02-11,12.59
2016-02-12,12.66
2016-02-16,12.81
2016-02-17,12.91
2016-02-18,12.46
2016-02-19,12.49
2016-02-22,12.8
2016-02-23,13.24
2016-02-24,12.75
2016-02-25,13.15
2016-02-26,12.83
2016-02-29,13.27
2016-03-01,13.22
2016-03-02,13.42
2016-03-03,14.3
2016-03-04,14.12
2016-03-07,14.15
2016-03-08,14.09
2016-03-09,14.11
2016-03-10,13.875
2016-03-11,13.95
2016-03-14,13.83
2016-03-15,13.41
2016-03-16,13.55
2016-03-17,13.51
2016-03-18,13.39
2016-03-21,13.44
2016-03-22,13.36
2016-03-23,13.29
2016-03-24,13.48
2016-03-28,13.57
2016-03-29,14.14
2016-03-30,14.55
2016-03-31,14.44
2016-04-01,14.55
2016-04-04,14.56
2016-04-05,14.51
2016-04-06,14.62
2016-04-07,14.31
2016-04-08,14.25
2016-04-11,14.33
2016-04-12,14.26
2016-04-13,14.28
2016-04-14,14.07
2016-04-15,14.13
2016-04-18,14.28
2016-04-19,14.36
2016-04-20,14.2
2016-04-21,14.02
2016-04-22,14.06
2016-04-25,14.015
2016-04-26,14.17
2016-04-27,14.09
2016-04-28,14.08
2016-04-29,13.91
2016-05-02,14.04
2016-05-03,14.21
2016-05-04,14.37
2016-05-05,14.03
2016-05-06,13.65
2016-05-09,13.64
2016-05-10,14.3
2016-05-11,13.23
2016-05-12,13.4
2016-05-13,13.4
2016-05-16,13.07
2016-05-17,12.67
2016-05-18,12.63
2016-05-19,12.53
2016-05-20,12.48
2016-05-23,12.09
2016-05-24,12.2
2016-05-25,12.05
2016-05-26,12.1
2016-05-27,12.28
2016-05-31,12.12
2016-06-01,12.32
2016-06-02,12.51
2016-06-03,12.31
2016-06-06,12.48
2016-06-07,12.5
2016-06-08,12.5
2016-06-09,12.49
2016-06-10,12.29
2016-06-13,12.03
2016-06-14,12.08
2016-06-15,11.94
2016-06-16,11.89
2016-06-17,11.94
2016-06-20,12.11
2016-06-21,11.91
2016-06-22,11.86
2016-06-23,11.83
2016-06-24,11.9
2016-06-27,11.8
2016-06-28,11.72
2016-06-29,11.84
2016-06-30,11.9
2016-07-01,12.41
2016-07-05,12.33
2016-07-06,12.08
2016-07-07,12.09
2016-07-08,12.36
2016-07-11,12.54
2016-07-12,12.34
2016-07-13,12.38
2016-07-14,12.35
2016-07-15,12.25
2016-07-18,12.2
2016-07-19,12.24
2016-07-20,12.5
2016-07-21,12.45
2016-07-22,12.8
2016-07-25,12.73
2016-07-26,12.25
2016-07-27,12.28
2016-07-28,12.13
2016-07-29,12.11
2016-08-01,12.13
2016-08-02,11.77
2016-08-03,12.05
2016-08-04,11.87
2016-08-05,12.24
2016-08-08,12.1
2016-08-09,13.73
2016-08-10,13.88
2016-08-11,13.74
2016-08-12,13.7
2016-08-15,13.71
2016-08-16,13.46
2016-08-17,13.28
2016-08-18,13.48
2016-08-19,13.17
2016-08-22,13.12
2016-08-23,13.36
2016-08-24,13.33
2016-08-25,13.47
2016-08-26,13.36
2016-08-29,13.37
2016-08-30,13.4
2016-08-31,13.46
2016-09-01,13.39
2016-09-02,13.79
2016-09-06,13.58
2016-09-07,13.66
2016-09-08,13.39
2016-09-09,13.03
2016-09-12,13.29
2016-09-13,13.06
2016-09-14,13.03
2016-09-15,13.11
2016-09-16,13.07
2016-09-19,12.87
2016-09-20,12.69
2016-09-21,13.18
2016-09-22,13.58
2016-09-23,13.35
2016-09-26,13.25
2016-09-27,13.25
2016-09-28,13.23
2016-09-29,13.05
2016-09-30,13.21
2016-10-03,13.13
2016-10-04,12.93
2016-10-05,12.72
2016-10-06,12.67
2016-10-07,12.63
2016-10-10,12.86
2016-10-11,12.76
2016-10-12,12.99
2016-10-13,12.84
2016-10-14,12.87
2016-10-17,12.76
2016-10-18,12.77
2016-10-19,12.91
2016-10-20,12.83
2016-10-21,12.35
2016-10-24,12.75
2016-10-25,12.46
2016-10-26,12.39
2016-10-27,12.36
2016-10-28,12.52
2016-10-31,12.5
2016-11-01,12.35
2016-11-02,12.6
2016-11-03,12.45
2016-11-04,12.35
2016-11-07,12.5
2016-11-08,11.25
2016-11-09,11.7
2016-11-10,11.85
2016-11-11,12.6
2016-11-14,12.6
2016-11-15,12.4
2016-11-16,12.6
2016-11-17,12.75
2016-11-18,13.35
2016-11-21,13.55
2016-11-22,14.05
2016-11-23,13.65
2016-11-25,13.65
2016-11-28,13.4
2016-11-29,13.6
2016-11-30,13.6
2016-12-01,13.35
2016-12-02,13.45
2016-12-05,13.55
2016-12-06,13.5
2016-12-07,13.6
2016-12-08,13.65
2016-12-09,13.9
2016-12-12,13.75
2016-12-13,13.55
2016-12-14,13.4
2016-12-15,13.5
2016-12-16,13.3
2016-12-19,13.4
2016-12-20,13.65
2016-12-21,14.5
2016-12-22,14.55
2016-12-23,15.15
2016-12-27,15.05
2016-12-28,15.15
2016-12-29,15.2
2016-12-30,15.25
2017-01-03,14.9
2017-01-04,14.9
2017-01-05,14.6
2017-01-06,14.25
2017-01-09,14.3
2017-01-10,15
2017-01-11,15.3
2017-01-12,14.9
2017-01-13,15.05
2017-01-17,14.9
2017-01-18,15.3
2017-01-19,15
2017-01-20,14.9
2017-01-23,14.95
2017-01-24,14.85
2017-01-25,14.85
2017-01-26,14.95
2017-01-27,14.6
2017-01-30,14.55
2017-01-31,14.35
2017-02-01,14.45
2017-02-02,15
2017-02-03,14.9
2017-02-06,15.3
2017-02-07,15.35
2017-02-08,15.55
2017-02-09,15.9
2017-02-10,15.8
2017-02-13,15.75
2017-02-14,15.9
2017-02-15,15.95
2017-02-16,16.45
2017-02-17,16.65
2017-02-21,16.85
2017-02-22,16.1
2017-02-23,16.1
2017-02-24,16.2
2017-02-27,16.2
2017-02-28,15.8
2017-03-01,15.85
2017-03-02,15.25
2017-03-03,14.75
2017-03-06,14.65
2017-03-07,14.55
2017-03-08,14.3
2017-03-09,14.1
2017-03-10,14.05
2017-03-13,14.05
2017-03-14,13.85
2017-03-15,14.2
2017-03-16,14.1
2017-03-17,14.6
2017-03-20,14.55
2017-03-21,14.15
2017-03-22,13.95
2017-03-23,13.95
2017-03-24,13.85
2017-03-27,13.8
2017-03-28,14.25
2017-03-29,14.2
2017-03-30,14
2017-03-31,14.15
2017-04-03,13.9
2017-04-04,13.65
2017-04-05,13.95
2017-04-06,14
2017-04-07,14.05
2017-04-10,14.1
2017-04-11,13.95
2017-04-12,13.7
2017-04-13,13.75
2017-04-17,13.55
2017-04-18,13.5
2017-04-19,13.15
2017-04-20,13.4
2017-04-21,13.6
2017-04-24,13.6
2017-04-25,13.9
2017-04-26,14.25
2017-04-27,14.15
2017-04-28,14
2017-05-01,14.05
2017-05-02,13.95
2017-05-03,13.8
2017-05-04,13.9
2017-05-05,13.9
2017-05-08,13.9
2017-05-09,13.35
2017-05-10,13.35
2017-05-11,13.3
2017-05-12,13.25
2017-05-15,13.35
2017-05-16,13.35
2017-05-17,12.95
2017-05-18,12.55
2017-05-19,12.6
2017-05-22,12.45
2017-05-23,12.25
2017-05-24,12.4
2017-05-25,12.25
2017-05-26,12.25
2017-05-30,11.95
2017-05-31,11.85
2017-06-01,12.85
2017-06-02,13.05
2017-06-05,12.65
2017-06-06,12.35
2017-06-07,12.4
2017-06-08,12.4
2017-06-09,12.45
2017-06-12,12.65
2017-06-13,12.65
2017-06-14,12.55
2017-06-15,12.55
2017-06-16,12.45
2017-06-19,12.9
2017-06-20,12.5
2017-06-21,12.05
2017-06-22,12.25
2017-06-23,12.15
2017-06-26,12.4
2017-06-27,12.2
2017-06-28,12.25
2017-06-29,12.3
2017-06-30,12.25
2017-07-03,12.5
2017-07-05,12.3
2017-07-06,12.15
2017-07-07,12.2
2017-07-10,12
2017-07-11,12.1
2017-07-12,12.25
2017-07-13,12.15
2017-07-14,12.25
2017-07-17,12.25
2017-07-18,12.15
2017-07-19,12.25
2017-07-20,12.4
2017-07-21,12.3
2017-07-24,12.15
2017-07-25,12.25
2017-07-26,12.45
2017-07-27,12.35
2017-07-28,12.25
2017-07-31,12.2
2017-08-01,12.3
2017-08-02,12.55
2017-08-03,12.5
2017-08-04,12.55
2017-08-07,12
2017-08-08,11.6
2017-08-09,11.05
2017-08-10,10.7
2017-08-11,11.2
2017-08-14,11.55
2017-08-15,11.35
2017-08-16,11.4
2017-08-17,11.35
2017-08-18,11.15
2017-08-21,11.25
2017-08-22,11.2
2017-08-23,11.05
2017-08-24,11.05
2017-08-25,11.05
2017-08-28,11.05
2017-08-29,11
2017-08-30,10.7
2017-08-31,10.9
2017-09-01,11
2017-09-05,10.95
2017-09-06,10.8
2017-09-07,10.55
2017-09-08,10.8
2017-09-11,10.95
2017-09-12,11.1
2017-09-13,11.25
2017-09-14,11.35
2017-09-15,11.5
2017-09-18,11.45
2017-09-19,11.45
2017-09-20,11.8
2017-09-21,12.05
2017-09-22,11.65
2017-09-25,11.55
2017-09-26,11.25
2017-09-27,10.95
2017-09-28,11
2017-09-29,10.9
2017-10-02,11.05
2017-10-03,11.25
2017-10-04,11.05
2017-10-05,11.1
2017-10-06,11.2
2017-10-09,11.05
2017-10-10,11.4
2017-10-11,11.3
2017-10-12,11.15
2017-10-13,11.25
2017-10-16,11.1
2017-10-17,11.7
2017-10-18,11.5
2017-10-19,11.65
2017-10-20,11.6
2017-10-23,11.45
2017-10-24,11.45
2017-10-25,11.1
2017-10-26,11.3
2017-10-27,11.4
2017-10-30,11.25
2017-10-31,11.25
2017-11-01,11.05
2017-11-02,11.05
2017-11-03,10.95
2017-11-06,10.9
2017-11-07,10.3
2017-11-08,10
2017-11-09,10.9
2017-11-10,10.9
2017-11-13,11.25
2017-11-14,11.8
2017-11-15,12
2017-11-16,12.4
2017-11-17,12.35
2017-11-20,12.35
2017-11-21,12.35
2017-11-22,12.3
2017-11-24,12.4
2017-11-27,12.35
2017-11-28,12.8
2017-11-29,13.3
2017-11-30,13.25
2017-12-01,12.95
2017-12-04,13.25
2017-12-05,13
2017-12-06,12.65
2017-12-07,12.75
2017-12-08,12.7
2017-12-11,12.45
2017-12-12,12.75
2017-12-13,12.95
2017-12-14,12.7
2017-12-15,12.65
2017-12-18,12.7
2017-12-19,12.7
2017-12-20,12.6
2017-12-21,12.65
2017-12-22,12.4
2017-12-26,12.25
2017-12-27,12.3
2017-12-28,12.15
2017-12-29,12.15
2018-01-02,12.3
2018-01-03,12.35
2018-01-04,12.55
2018-01-05,12.7
2018-01-08,12.45
2018-01-09,12.9
2018-01-10,13.2
2018-01-11,13.25
2018-01-12,13.25
2018-01-16,13.2
2018-01-17,13.15
2018-01-18,13.05
2018-01-19,13.45
2018-01-22,13.35
2018-01-23,13.3
2018-01-24,13.2
2018-01-25,13.2
2018-01-26,13
2018-01-29,12.85
2018-01-30,12.7
2018-01-31,12.45
2018-02-01,12.35
2018-02-02,12.65
2018-02-05,12.4
2018-02-06,12.6
2018-02-07,12.65
2018-02-08,12.45
2018-02-09,12.6
2018-02-12,12.85
2018-02-13,12.85
2018-02-14,12.9
2018-02-15,12.9
2018-02-16,12.9
2018-02-20,12.85
2018-02-21,12.8
2018-02-22,12.85
2018-02-23,12.9
2018-02-26,12.9
2018-02-27,12.8
2018-02-28,12.85
2018-03-01,12.7
2018-03-02,12.55
2018-03-05,12.9
2018-03-06,12.7
2018-03-07,12.7
2018-03-08,12.7
2018-03-09,12.6
2018-03-12,12.5
2018-03-13,12.2
2018-03-14,11.95
2018-03-15,11.95
2018-03-16,12.15
2018-03-19,12.05
2018-03-20,11.9
2018-03-21,11.55
2018-03-22,11.45
2018-03-23,11.1
2018-03-26,11.15
2018-03-27,11.2
2018-03-28,11.25
2018-03-29,11.2
2018-04-02,11
2018-04-03,11.1
2018-04-04,11.35
2018-04-05,11.35
2018-04-06,11.25
2018-04-09,11.35
2018-04-10,11.35
2018-04-11,11
2018-04-12,10.95
2018-04-13,10.9
2018-04-16,10.95
2018-04-17,10.8
2018-04-18,10.9
2018-04-19,10.8
2018-04-20,10.8
2018-04-23,10.65
2018-04-24,10.55
2018-04-25,10.5
2018-04-26,10.55
2018-04-27,10.65
2018-04-30,10.3
2018-05-01,10.55
2018-05-02,10.5
2018-05-03,10.35
2018-05-04,10.85
2018-05-07,11.05
2018-05-08,11.9
2018-05-09,11.75
2018-05-10,12
2018-05-11,12.2
2018-05-14,12
2018-05-15,11.9
2018-05-16,11.75
2018-05-17,11.85
2018-05-18,11.65
2018-05-21,11.8
2018-05-22,11.6
2018-05-23,12
2018-05-24,12.6
2018-05-25,12.55
2018-05-29,12.5
2018-05-30,12.8
2018-05-31,12.8
2018-06-01,12.65
2018-06-04,12.85
2018-06-05,13.05
2018-06-06,13.25
2018-06-07,13.15
2018-06-08,13.1
2018-06-11,12.85
2018-06-12,13.1
2018-06-13,13.05
2018-06-14,13
2018-06-15,13
2018-06-18,13.1
2018-06-19,13.275
2018-06-20,13.25
2018-06-21,13.4
2018-06-22,14.95
2018-06-25,14.85
2018-06-26,15.05
2018-06-27,14.9
2018-06-28,14.95
2018-06-29,14.85
2018-07-02,15
2018-07-03,15
2018-07-05,15
2018-07-06,15
2018-07-09,14.95
2018-07-10,14.95
2018-07-11,14.8
2018-07-12,14.85
2018-07-13,14.8
2018-07-16,15.05
2018-07-17,14.95
2018-07-18,14.95
2018-07-19,15.2
2018-07-20,15.05
2018-07-23,14.95
2018-07-24,14.7
2018-07-25,14.7
2018-07-26,14.75
2018-07-27,14.6
2018-07-30,14.55
2018-07-31,14.5
2018-08-01,14.55
2018-08-02,14.75
2018-08-03,14.55
2018-08-06,14.75
2018-08-07,15.8
2018-08-08,15.525
2018-08-09,15.55
2018-08-10,15.55
2018-08-13,15.55
2018-08-14,16.2
2018-08-15,16
2018-08-16,15.95
2018-08-17,16.1
2018-08-20,16.15
2018-08-21,16.2
2018-08-22,16.25
2018-08-23,16.3
2018-08-24,16.25
2018-08-27,16.2
2018-08-28,16.2
2018-08-29,16.2
2018-08-30,16.2
2018-08-31,15.8
2018-09-04,15.5
2018-09-05,15.85
2018-09-06,15.8
2018-09-07,15.55
2018-09-10,15.55
2018-09-11,15.3
2018-09-12,14.85
2018-09-13,14.8
2018-09-14,14.4
2018-09-17,14.5
2018-09-18,14.65
2018-09-19,14.65
2018-09-20,14.7
2018-09-21,14.15
2018-09-24,14
2018-09-25,13.8
2018-09-26,14.4
2018-09-27,14.35
2018-09-28,14.6
2018-10-01,14.28
2018-10-02,14.2
2018-10-03,14.03
2018-10-04,14.15
2018-10-05,14.23
2018-10-08,14.39
2018-10-09,14.33
2018-10-10,14.25
2018-10-11,14.19
2018-10-12,14.28
2018-10-15,14.41
2018-10-16,14.48
2018-10-17,14.4
2018-10-18,14.3
2018-10-19,13.66
2018-10-22,13.58
2018-10-23,13.67
2018-10-24,13.65
2018-10-25,13.52
2018-10-26,13.36
2018-10-29,13.27
2018-10-30,13.66
2018-10-31,13.16
2018-11-01,13.1
2018-11-02,12.98
2018-11-05,12.99
2018-11-06,11.9
2018-11-07,11.54
2018-11-08,11.46
2018-11-09,11.3
2018-11-12,11.39
2018-11-13,11.03
2018-11-14,11.28
2018-11-15,11.01
2018-11-16,10.87
2018-11-19,11.03
2018-11-20,11.46
2018-11-21,11.74
2018-11-23,11.74
2018-11-26,11.15
2018-11-27,10.96
2018-11-28,11.1
2018-11-29,11.23
2018-11-30,11.02
2018-12-03,11.25
2018-12-04,10.77
2018-12-06,10.81
2018-12-07,10.57
2018-12-10,10.72
2018-12-11,10.21
2018-12-12,10.09
2018-12-13,9.83
2018-12-14,9.64
2018-12-17,9.46
2018-12-18,9.2
2018-12-19,9.18
2018-12-20,9.47
2018-12-21,9.69
2018-12-24,9.37
2018-12-26,9.6
2018-12-27,9.51
2018-12-28,9.38
2018-12-31,9.84
2019-01-02,9.77
2019-01-03,9.48
2019-01-04,9.89
2019-01-07,10.53
2019-01-08,10.02
2019-01-09,9.93
2019-01-10,9.84
2019-01-11,9.74
2019-01-14,9.51
2019-01-15,9.48
2019-01-16,9.2
2019-01-17,8.99
2019-01-18,8.66
2019-01-22,9.01
2019-01-23,9.49
2019-01-24,9.22
2019-01-25,9.28
2019-01-28,9.02
2019-01-29,9.01
2019-01-30,8.86
2019-01-31,8.63
2019-02-01,8.48
2019-02-04,9.09
2019-02-05,9.16
2019-02-06,8.83
2019-02-07,8.93
2019-02-08,9.01
2019-02-11,9.14
2019-02-12,9.11
2019-02-13,9.03
2019-02-14,9.05
2019-02-15,9.29
2019-02-19,9.35
2019-02-20,10.68
2019-02-21,10.96
2019-02-22,11.19
2019-02-25,11.1
2019-02-26,11.13
2019-02-27,10.67
2019-02-28,10.69
2019-03-01,10.79
2019-03-04,10.68
2019-03-05,10.68
2019-03-06,10.5
2019-03-07,10.15
2019-03-08,10.08
2019-03-11,10.11
2019-03-12,10
2019-03-13,10.12
2019-03-14,10.08
2019-03-15,10.15
2019-03-18,10.31
2019-03-19,10.11
2019-03-20,9.96
2019-03-21,10.02
2019-03-22,9.66
2019-03-25,9.69
2019-03-26,9.93
2019-03-27,9.77
2019-03-28,9.99
2019-03-29,9.97
2019-04-01,10.05
2019-04-02,9.98
2019-04-03,9.95
2019-04-04,10.01
2019-04-05,9.91
2019-04-08,9.78
2019-04-09,9.74
2019-04-10,9.94
2019-04-11,10.07
2019-04-12,9.91
2019-04-15,9.87
2019-04-16,9.84
2019-04-17,9.66
2019-04-18,9.8
2019-04-22,9.83
2019-04-23,10.12
2019-04-24,10.04
2019-04-25,10.06
2019-04-26,10.02
2019-04-29,10
2019-04-30,9.81
2019-05-01,9.68
2019-05-02,9.86
2019-05-03,10.31
2019-05-06,10.5
2019-05-07,10.53
2019-05-08,9.01
2019-05-09,8.83
2019-05-10,8.95
2019-05-13,8.62
2019-05-14,8.69
2019-05-15,8.47
2019-05-16,8.31
2019-05-17,8.45
2019-05-20,8.53
2019-05-21,8.79
2019-05-22,8.67
2019-05-23,8.72
2019-05-24,8.84
2019-05-28,8.55
2019-05-29,8.55
2019-05-30,8.44
2019-05-31,8.52
2019-06-03,8.56
2019-06-04,8.83
2019-06-05,8.77
2019-06-06,8.52
2019-06-07,8.47
2019-06-10,8.49
2019-06-11,8.41
2019-06-12,8.32
2019-06-13,8.76
2019-06-14,8.56
2019-06-17,8.46
2019-06-18,8.43
2019-06-19,8.44
2019-06-20,8.465
2019-06-21,8.655
2019-06-24,8.72
2019-06-25,8.78
2019-06-26,8.8
2019-06-27,8.835
2019-06-28,9.02
2019-07-01,9.36
2019-07-02,9.295
2019-07-03,9.445
2019-07-04,9.445
2019-07-05,9.64
2019-07-08,9.265
2019-07-09,9.085
2019-07-10,8.975
2019-07-11,8.655
2019-07-12,8.88
2019-07-15,8.745
2019-07-16,8.58
2019-07-17,8.865
2019-07-18,8.795
2019-07-19,8.885
2019-07-22,8.78
2019-07-23,8.705
2019-07-24,8.86
2019-07-25,8.905
2019-07-26,9.36
2019-07-29,9.445
2019-07-30,9.475
2019-07-31,9.35
2019-08-01,9.395
2019-08-02,8.905
2019-08-05,8.69
2019-08-06,8.69
2019-08-07,8.7
2019-08-08,7.79
2019-08-09,8.245
2019-08-12,7.435
2019-08-13,7.525
2019-08-14,7.135
2019-08-15,7.345
2019-08-16,7.605
2019-08-19,7.45
2019-08-20,7.34
2019-08-21,7.3
2019-08-22,7.07
2019-08-23,6.86
2019-08-26,6.925
2019-08-27,6.8
2019-08-28,7.205
2019-08-29,7.33
2019-08-30,7.32
2019-09-02,7.32
2019-09-03,7.355
2019-09-04,7.495
2019-09-05,7.99
2019-09-06,8.235
2019-09-09,8.665
2019-09-10,8.63
2019-09-11,8.555
2019-09-12,8.41
2019-09-13,8.315
2019-09-16,8.945
2019-09-17,8.825
2019-09-18,8.655
2019-09-19,8.56
2019-09-20,8.5
2019-09-23,8.335
2019-09-24,8.235
2019-09-25,8.27
2019-09-26,8.15
2019-09-27,8.125
2019-09-30,8.275
2019-10-01,8.265
2019-10-02,7.475
2019-10-03,6.805
2019-10-04,6.795
2019-10-07,6.775
2019-10-08,6.845
2019-10-09,6.845
2019-10-10,6.805
2019-10-11,6.845
2019-10-14,6.49
2019-10-15,6.53
2019-10-16,7.01
2019-10-17,7.325
2019-10-18,7.535
2019-10-21,7.575
2019-10-22,7.525
2019-10-23,7.655
2019-10-24,7.695
2019-10-25,7.9
2019-10-28,7.595
2019-10-29,7.375
2019-10-30,7.18
2019-10-31,7.115
2019-11-01,7.355
2019-11-04,7.62
2019-11-05,7.745
2019-11-06,7.535
2019-11-07,6.6
2019-11-08,7.605
2019-11-11,7.635
2019-11-12,7.79
2019-11-13,7.405
2019-11-14,7.49
2019-11-15,7.375
2019-11-18,7.425
2019-11-19,7.395
2019-11-20,7.605
2019-11-21,8.265
2019-11-22,8.085
2019-11-25,8.455
