date,close
2014-06-13,32.133
2014-06-16,32.0833
2014-06-17,32.5107
2014-06-18,32.6896
2014-06-19,33.0374
2014-06-20,33.6437
2014-06-23,33.8326
2014-06-24,32.9182
2014-06-25,33.3157
2014-06-26,33.5046
2014-06-27,34.2202
2014-06-30,34.2898
2014-07-01,33.9916
2014-07-02,33.763
2014-07-03,33.5046
2014-07-07,33.117
2014-07-08,33.1965
2014-07-09,33.4251
2014-07-10,33.3356
2014-07-11,33.1368
2014-07-14,33.6238
2014-07-15,33.435
2014-07-16,34.2401
2014-07-17,33.7729
2014-07-18,34.0512
2014-07-21,33.7729
2014-07-22,33.9419
2014-07-23,34.1109
2014-07-24,34.2997
2014-07-25,34.0512
2014-07-28,33.7829
2014-07-29,33.8723
2014-07-30,33.7332
2014-07-31,32.8486
2014-08-01,32.8486
2014-08-04,32.8486
2014-08-05,32.3616
2014-08-06,32.5306
2014-08-07,33.2859
2014-08-08,33.8823
2014-08-11,34.1407
2014-08-12,33.8723
2014-08-13,33.9021
2014-08-14,33.9121
2014-08-15,34.1607
2014-08-18,34.0811
2014-08-19,34.459
2014-08-20,34.459
2014-08-21,34.5187
2014-08-22,34.1209
2014-08-25,34.5983
2014-08-26,34.8171
2014-08-27,34.8966
2014-08-28,35.0756
2014-08-29,35.374
2014-09-02,35.0557
2014-09-03,34.29
2014-09-04,33.5143
2014-09-05,33.8425
2014-09-08,32.8181
2014-09-09,32.4005
2014-09-10,32.0325
2014-09-11,32.0126
2014-09-12,31.5154
2014-09-15,32.0623
2014-09-16,32.3408
2014-09-17,31.9728
2014-09-18,31.3165
2014-09-19,31.2071
2014-09-22,30.849
2014-09-23,30.7297
2014-09-24,31.217
2014-09-25,30.7695
2014-09-26,31.1673
2014-09-29,31.1275
2014-09-30,30.6104
2014-10-01,29.9441
2014-10-02,29.6358
2014-10-03,30.0833
2014-10-06,29.6855
2014-10-07,28.512
2014-10-08,28.3927
2014-10-09,26.3142
2014-10-10,25.2401
2014-10-13,22.913
2014-10-14,21.839
2014-10-15,21.7196
2014-10-16,23.2014
2014-10-17,23.0523
2014-10-20,24.0368
2014-10-21,24.4644
2014-10-22,23.5396
2014-10-23,24.3948
2014-10-24,24.186
2014-10-27,23.0025
2014-10-28,23.9374
2014-10-29,24.3053
2014-10-30,23.9771
2014-10-31,24.9318
2014-11-03,24.0865
2014-11-04,23.1517
2014-11-05,24.3053
2014-11-06,25.4092
2014-11-07,25.7274
2014-11-10,24.6434
2014-11-11,24.7131
2014-11-12,24.3548
2014-11-13,23.7178
2014-11-14,24.4045
2014-11-17,23.0111
2014-11-18,23.3097
2014-11-19,23.3495
2014-11-20,24.5936
2014-11-21,25.2107
2014-11-24,24.8623
2014-11-25,24.8225
2014-11-26,24.0661
2014-11-28,20.3437
2014-12-01,20.9907
2014-12-02,21.1499
2014-12-03,21.8765
2014-12-04,22.0258
2014-12-05,22.1353
2014-12-08,20.8414
2014-12-09,21.8367
2014-12-10,20.5527
2014-12-11,19.9058
2014-12-12,19.2788
2014-12-15,18.5522
2014-12-16,18.6219
2014-12-17,19.8162
2014-12-18,19.5973
2014-12-19,20.4333
2014-12-22,19.856
2014-12-23,19.6769
2014-12-24,19.3086
2014-12-26,19.4977
2014-12-29,19.9158
2014-12-30,19.6072
2014-12-31,20.1248
2015-01-02,19.8959
2015-01-05,18.7811
2015-01-06,18.5821
2015-01-07,18.7413
2015-01-08,19.7067
2015-01-09,19.8361
2015-01-12,19.3285
2015-01-13,19.1792
2015-01-14,19.5475
2015-01-15,18.9105
2015-01-16,19.7963
2015-01-20,19.2987
2015-01-21,20.075
2015-01-22,19.8162
2015-01-23,20.1546
2015-01-26,20.5627
2015-01-27,20.6921
2015-01-28,19.448
2015-01-29,19.4679
2015-01-30,20.1248
2015-02-02,21.1201
2015-02-03,21.7371
2015-02-04,21.1002
2015-02-05,21.5978
2015-02-06,21.8168
2015-02-09,21.548
2015-02-10,21.8864
2015-02-11,21.2594
2015-02-12,21.5878
2015-02-13,22.4836
2015-02-17,22.8817
2015-02-18,22.603
2015-02-19,22.6827
2015-02-20,22.7723
2015-02-23,22.4735
2015-02-24,22.334
2015-02-25,22.3539
2015-02-26,21.2382
2015-02-27,21.3976
2015-03-02,21.6168
2015-03-03,21.3478
2015-03-04,21.5371
2015-03-05,21.5969
2015-03-06,21.0788
2015-03-09,20.8298
2015-03-10,20.5808
2015-03-11,20.9693
2015-03-12,20.6804
2015-03-13,20.3317
2015-03-16,20.4513
2015-03-17,20.4513
2015-03-18,21.029
2015-03-19,20.3218
2015-03-20,20.7003
2015-03-23,20.2421
2015-03-24,20.5608
2015-03-25,20.9593
2015-03-26,21.5969
2015-03-27,20.9892
2015-03-30,21.1685
2015-03-31,20.77
2015-04-01,20.7999
2015-04-02,21.6168
2015-04-06,22.1946
2015-04-07,22.8321
2015-04-08,22.1049
2015-04-09,22.2942
2015-04-10,22.3241
2015-04-13,22.3141
2015-04-14,22.7624
2015-04-15,23.6689
2015-04-16,23.111
2015-04-17,22.6229
2015-04-20,22.6129
2015-04-21,22.0949
2015-04-22,22.085
2015-04-23,22.1946
2015-04-24,22.085
2015-04-27,22.3539
2015-04-28,22.6827
2015-04-29,23.3601
2015-04-30,22.4137
2015-05-01,22.4037
2015-05-04,22.8719
2015-05-05,21.9754
2015-05-06,21.9754
2015-05-07,21.0788
2015-05-08,21.5072
2015-05-11,20.3815
2015-05-12,20.6306
2015-05-13,20.1325
2015-05-14,19.8735
2015-05-15,19.9731
2015-05-18,20.1325
2015-05-19,19.6045
2015-05-20,19.2061
2015-05-21,19.6348
2015-05-22,19.7844
2015-05-26,18.8869
2015-05-27,19.0565
2015-05-28,18.5878
2015-05-29,18.7773
2015-06-01,18.9966
2015-06-02,19.0166
2015-06-03,18.7174
2015-06-04,18.6576
2015-06-05,18.7573
2015-06-08,18.6975
2015-06-09,18.6476
2015-06-10,19.0764
2015-06-11,18.8171
2015-06-12,18.498
2015-06-15,18.3684
2015-06-16,18.6775
2015-06-17,18.508
2015-06-18,18.498
2015-06-19,18.4083
2015-06-22,18.7374
2015-06-23,19.0565
2015-06-24,18.6975
2015-06-25,18.5978
2015-06-26,18.5579
2015-06-29,18.3385
2015-06-30,18.4582
2015-07-01,17.9496
2015-07-02,18.1789
2015-07-06,17.082
2015-07-07,17.1817
2015-07-08,16.3541
2015-07-09,16.723
2015-07-10,16.1347
2015-07-13,16.1746
2015-07-14,16.4338
2015-07-15,15.9851
2015-07-16,15.5663
2015-07-17,14.9879
2015-07-20,14.6189
2015-07-21,14.609
2015-07-22,14.1203
2015-07-23,13.8012
2015-07-24,13.532
2015-07-27,12.7841
2015-07-28,13.0832
2015-07-29,13.6317
2015-07-30,13.9907
2015-07-31,13.8411
2015-08-03,13.0035
2015-08-04,13.6417
2015-08-05,13.4722
2015-08-06,14.1403
2015-08-07,13.6816
2015-08-10,14.4594
2015-08-11,14.2201
2015-08-12,14.3796
2015-08-13,13.7713
2015-08-14,13.6115
2015-08-17,13.3419
2015-08-18,13.4018
2015-08-19,13.1621
2015-08-20,12.7028
2015-08-21,12.493
2015-08-24,11.4744
2015-08-25,11.2947
2015-08-26,11.5443
2015-08-27,12.9924
2015-08-28,13.6814
2015-08-31,14.021
2015-09-01,13.0323
2015-09-02,12.8625
2015-09-03,13.1522
2015-09-04,13.2221
2015-09-08,13.1022
2015-09-09,13.0423
2015-09-10,12.3832
2015-09-11,12.2733
2015-09-14,11.8539
2015-09-15,12.1335
2015-09-16,13.8212
2015-09-17,13.8212
2015-09-18,13.0024
2015-09-21,12.8625
2015-09-22,12.6329
2015-09-23,12.2034
2015-09-24,12.4831
2015-09-25,12.2134
2015-09-28,11.794
2015-09-29,12.0736
2015-09-30,12.513
2015-10-01,12.6728
2015-10-02,13.9011
2015-10-05,14.8099
2015-10-06,15.7986
2015-10-07,15.8585
2015-10-08,16.238
2015-10-09,16.188
2015-10-12,15.499
2015-10-13,15.4091
2015-10-14,15.7287
2015-10-15,16.0582
2015-10-16,16.0782
2015-10-19,16.1181
2015-10-20,16.2979
2015-10-21,15.7287
2015-10-22,15.3791
2015-10-23,15.489
2015-10-26,14.3006
2015-10-27,13.7713
2015-10-28,14.1308
2015-10-29,15.0396
2015-10-30,15.4391
2015-11-02,16.2779
2015-11-03,16.198
2015-11-04,15.9783
2015-11-05,16.1081
2015-11-06,15.8685
2015-11-09,15.7087
2015-11-10,15.6687
2015-11-11,14.73
2015-11-12,14.74
2015-11-13,15.01
2015-11-16,15.43
2015-11-17,14.75
2015-11-18,15.21
2015-11-19,15.16
2015-11-20,14.7
2015-11-23,14.73
2015-11-24,16.19
2015-11-25,16.38
2015-11-27,15.85
2015-11-30,15.8
2015-12-01,15.47
2015-12-02,14.08
2015-12-03,13.92
2015-12-04,13.54
2015-12-07,12.43
2015-12-08,12.88
2015-12-09,12.94
2015-12-10,13.3
2015-12-11,11.96
2015-12-14,11.98
2015-12-15,12.71
2015-12-16,12.19
2015-12-17,11.69
2015-12-18,11.89
2015-12-21,12.06
2015-12-22,12.48
2015-12-23,13.5
2015-12-24,13.38
2015-12-28,13.09
2015-12-29,13.38
2015-12-30,13.07
2015-12-31,13.4
2016-01-04,13.83
2016-01-05,13.74
2016-01-06,12.5
2016-01-07,11.95
2016-01-08,11.96
2016-01-11,11.55
2016-01-12,11.38
2016-01-13,10.87
2016-01-14,11.19
2016-01-15,10.58
2016-01-19,9.44
2016-01-20,9.29
2016-01-21,10.03
2016-01-22,10.88
2016-01-25,9.85
2016-01-26,11.05
2016-01-27,11.25
2016-01-28,12.05
2016-01-29,12.82
2016-02-01,12.21
2016-02-02,11.43
2016-02-03,12.04
2016-02-04,12.1
2016-02-05,11.62
2016-02-08,11.56
2016-02-09,10.93
2016-02-10,10.61
2016-02-11,10.58
2016-02-12,10.58
2016-02-16,10.12
2016-02-17,11.01
2016-02-18,10.57
2016-02-19,10.52
2016-02-22,11.23
2016-02-23,10.01
2016-02-24,10.33
2016-02-25,10.62
2016-02-26,10.76
2016-02-29,9.76
2016-03-01,9.61
2016-03-02,10.2
2016-03-03,10.57
2016-03-04,10.94
2016-03-07,10.39
2016-03-08,10.4
2016-03-09,11.72
2016-03-10,11.69
2016-03-11,12.6
2016-03-14,12.89
2016-03-15,12.7
2016-03-16,13.21
2016-03-17,13.35
2016-03-18,13.19
2016-03-21,13.43
2016-03-22,13.41
2016-03-23,13.02
2016-03-24,13.39
2016-03-28,13.22
2016-03-29,13.44
2016-03-30,13.68
2016-03-31,14.11
2016-04-01,13.81
2016-04-04,13.28
2016-04-05,13.39
2016-04-06,13.76
2016-04-07,13.67
2016-04-08,14.35
2016-04-11,14.42
2016-04-12,15.23
2016-04-13,14.62
2016-04-14,14.91
2016-04-15,14.56
2016-04-18,14.88
2016-04-19,15.63
2016-04-20,15.55
2016-04-21,15.42
2016-04-22,15.87
2016-04-25,15.33
2016-04-26,16.2
2016-04-27,16.85
2016-04-28,17.13
2016-04-29,17.93
2016-05-02,18.3
2016-05-03,17.45
2016-05-04,17.02
2016-05-05,17.11
2016-05-06,16.92
2016-05-09,16.81
2016-05-10,17.57
2016-05-11,18.08
2016-05-12,17.91
2016-05-13,17.41
2016-05-16,18.12
2016-05-17,18.55
2016-05-18,17.7
2016-05-19,17.27
2016-05-20,18.28
2016-05-23,18.01
2016-05-24,18
2016-05-25,18.52
2016-05-26,18.48
2016-05-27,18.46
2016-05-31,18.63
2016-06-01,19.19
2016-06-02,19.52
2016-06-03,19.31
2016-06-06,20.11
2016-06-07,20.29
2016-06-08,20.13
2016-06-09,19.82
2016-06-10,18.8
2016-06-13,18.74
2016-06-14,18.98
2016-06-15,19.04
2016-06-16,18.31
2016-06-17,18.8
2016-06-20,18.97
2016-06-21,19.32
2016-06-22,18.19
2016-06-23,18.69
2016-06-24,17.32
2016-06-27,16.9
2016-06-28,17.72
2016-06-29,18.23
2016-06-30,17.63
2016-07-01,18.29
2016-07-05,17.25
2016-07-06,17.56
2016-07-07,17.27
2016-07-08,17.65
2016-07-11,17.62
2016-07-12,18.25
2016-07-13,17.58
2016-07-14,17.82
2016-07-15,17.92
2016-07-18,17.96
2016-07-19,17.78
2016-07-20,17.91
2016-07-21,17.29
2016-07-22,17.19
2016-07-25,16.77
2016-07-26,16.99
2016-07-27,16.75
2016-07-28,17.42
2016-07-29,18.2
2016-08-01,17.22
2016-08-02,17.78
2016-08-03,18.29
2016-08-04,18.48
2016-08-05,18.75
2016-08-08,19.14
2016-08-09,19.05
2016-08-10,18.75
2016-08-11,19.19
2016-08-12,19.15
2016-08-15,19.9
2016-08-16,20.04
2016-08-17,19.82
2016-08-18,20.4
2016-08-19,20.41
2016-08-22,20.24
2016-08-23,20.35
2016-08-24,19.83
2016-08-25,19.71
2016-08-26,19.59
2016-08-29,19.44
2016-08-30,19.45
2016-08-31,19.1
2016-09-01,19.07
2016-09-02,19.22
2016-09-06,19.35
2016-09-07,19.32
2016-09-08,19.18
2016-09-09,18.14
2016-09-12,18.18
2016-09-13,17.38
2016-09-14,17.02
2016-09-15,16.88
2016-09-16,17.06
2016-09-19,17.09
2016-09-20,17.07
2016-09-21,18.07
2016-09-22,18.71
2016-09-23,18.3
2016-09-26,18.31
2016-09-27,17.76
2016-09-28,18.75
2016-09-29,19.33
2016-09-30,19.53
2016-10-03,19
2016-10-04,18.37
2016-10-05,18.98
2016-10-06,18.77
2016-10-07,18.32
2016-10-10,18.53
2016-10-11,18.38
2016-10-12,18.07
2016-10-13,18.06
2016-10-14,17.85
2016-10-17,17.47
2016-10-18,17.3
2016-10-19,17.54
2016-10-20,17.68
2016-10-21,17.81
2016-10-24,17.62
2016-10-25,17.08
2016-10-26,17.32
2016-10-27,17.39
2016-10-28,16.43
2016-10-31,16.07
2016-11-01,16.16
2016-11-02,16.11
2016-11-03,16.41
2016-11-04,16.09
2016-11-07,16.31
2016-11-08,16.02
2016-11-09,16.92
2016-11-10,17.16
2016-11-11,17.11
2016-11-14,17.19
2016-11-15,18.18
2016-11-16,17.79
2016-11-17,17.4
2016-11-18,17.02
2016-11-21,18.09
2016-11-22,18.34
2016-11-23,18.55
2016-11-25,18.21
2016-11-28,17.32
2016-11-29,16.95
2016-11-30,19.66
2016-12-01,19.58
2016-12-02,19.85
2016-12-05,20.2
2016-12-06,20.37
2016-12-07,20.17
2016-12-08,20.45
2016-12-09,19.99
2016-12-12,19.78
2016-12-13,19.77
2016-12-14,18.9
2016-12-15,18.92
2016-12-16,18.81
2016-12-19,18.67
2016-12-20,18.9
2016-12-21,19.01
2016-12-22,19.15
2016-12-23,18.97
2016-12-27,19.12
2016-12-28,18.96
2016-12-29,18.71
2016-12-30,18.41
2017-01-03,19.23
2017-01-04,19.19
2017-01-05,18.44
2017-01-06,18.37
2017-01-09,18.02
2017-01-10,17.86
2017-01-11,18.1
2017-01-12,18.46
2017-01-13,18.09
2017-01-17,18.33
2017-01-18,18.1
2017-01-19,17.85
2017-01-20,17.96
2017-01-23,17.86
2017-01-24,18.23
2017-01-25,18.53
2017-01-26,18.59
2017-01-27,18.16
2017-01-30,17.44
2017-01-31,17.44
2017-02-01,17.22
2017-02-02,17.35
2017-02-03,17.52
2017-02-06,17.08
2017-02-07,16.45
2017-02-08,16.77
2017-02-09,16.93
2017-02-10,17.21
2017-02-13,16.98
2017-02-14,17.18
2017-02-15,17.1
2017-02-16,17.04
2017-02-17,16.87
2017-02-21,17.28
2017-02-22,16.95
2017-02-23,14.66
2017-02-24,14.05
2017-02-27,13.95
2017-02-28,13.76
2017-03-01,14.27
2017-03-02,14.04
2017-03-03,14.05
2017-03-06,13.86
2017-03-07,13.73
2017-03-08,13.03
2017-03-09,12.92
2017-03-10,12.91
2017-03-13,12.92
2017-03-14,12.73
2017-03-15,13.51
2017-03-16,13.4
2017-03-17,13.16
2017-03-20,13.04
2017-03-21,12.54
2017-03-22,12.18
2017-03-23,11.98
2017-03-24,12.12
2017-03-27,12.16
2017-03-28,12.81
2017-03-29,12.92
2017-03-30,12.33
2017-03-31,12.71
2017-04-03,12.85
2017-04-04,12.88
2017-04-05,12.23
2017-04-06,12.28
2017-04-07,12.2
2017-04-10,12.37
2017-04-11,12.17
2017-04-12,11.77
2017-04-13,11.48
2017-04-17,11.47
2017-04-18,11.21
2017-04-19,10.97
2017-04-20,10.99
2017-04-21,11.05
2017-04-24,11.25
2017-04-25,11.79
2017-04-26,11.86
2017-04-27,11.63
2017-04-28,11.81
2017-05-01,11.68
2017-05-02,11.37
2017-05-03,11.22
2017-05-04,10.81
2017-05-05,11.47
2017-05-08,11.63
2017-05-09,11.51
2017-05-10,11.81
2017-05-11,11.59
2017-05-12,11.31
2017-05-15,11.48
2017-05-16,11.48
2017-05-17,11.17
2017-05-18,11.09
2017-05-19,11.3
2017-05-22,11.13
2017-05-23,11.1
2017-05-24,11.01
2017-05-25,10.45
2017-05-26,10.53
2017-05-30,10.01
2017-05-31,10
2017-06-01,10.2
2017-06-02,9.73
2017-06-05,9.75
2017-06-06,10.19
2017-06-07,9.68
2017-06-08,9.3
2017-06-09,9.85
2017-06-12,10.16
2017-06-13,10.57
2017-06-14,9.79
2017-06-15,9.09
2017-06-16,9.06
2017-06-19,9.3
2017-06-20,9.25
2017-06-21,9.23
2017-06-22,9.11
2017-06-23,9.67
2017-06-26,9.8
2017-06-27,9.76
2017-06-28,9.88
2017-06-29,9.93
2017-06-30,10.1
2017-07-03,10.37
2017-07-05,9.68
2017-07-06,9.18
2017-07-07,8.99
2017-07-10,9.12
2017-07-11,8.94
2017-07-12,9.23
2017-07-13,9.18
2017-07-14,9.42
2017-07-17,9.37
2017-07-18,9.02
2017-07-19,9.72
2017-07-20,9.49
2017-07-21,9.22
2017-07-24,9.27
2017-07-25,9.2
2017-07-26,9.27
2017-07-27,7.93
2017-07-28,8.34
2017-07-31,8.57
2017-08-01,8.39
2017-08-02,8.19
2017-08-03,7.53
2017-08-04,7.93
2017-08-07,7.49
2017-08-08,7.45
2017-08-09,7.49
2017-08-10,7.24
2017-08-11,7.3
2017-08-14,7.19
2017-08-15,7.29
2017-08-16,7.09
2017-08-17,7.12
2017-08-18,7.44
2017-08-21,7.2
2017-08-22,7.32
2017-08-23,7.51
2017-08-24,7.5
2017-08-25,7.49
2017-08-28,7.38
2017-08-29,7.34
2017-08-30,7.26
2017-08-31,7.55
2017-09-01,7.52
2017-09-05,7.53
2017-09-06,7.61
2017-09-07,7.72
2017-09-08,7.21
2017-09-11,7.21
2017-09-12,7.64
2017-09-13,7.98
2017-09-14,7.99
2017-09-15,7.96
2017-09-18,7.99
2017-09-19,7.98
2017-09-20,8.38
2017-09-21,8.35
2017-09-22,8.37
2017-09-25,8.88
2017-09-26,8.07
2017-09-27,8.49
2017-09-28,8.57
2017-09-29,8.57
2017-10-02,8.55
2017-10-03,8.55
2017-10-04,8.5
2017-10-05,9.14
2017-10-06,8.63
2017-10-09,9.02
2017-10-10,8.96
2017-10-11,9.03
2017-10-12,8.82
2017-10-13,8.91
2017-10-16,8.85
2017-10-17,8.62
2017-10-18,8.4
2017-10-19,8.4
2017-10-20,8.31
2017-10-23,7.79
2017-10-24,7.62
2017-10-25,7.675
2017-10-26,8.07
2017-10-27,8.61
2017-10-30,8.7
2017-10-31,8.95
2017-11-01,9.56
2017-11-02,9.49
2017-11-03,9.72
2017-11-06,10.34
2017-11-07,10
2017-11-08,9.75
2017-11-09,9.84
2017-11-10,9.71
2017-11-13,9.05
2017-11-14,8.75
2017-11-15,8.65
2017-11-16,8.54
2017-11-17,8.8
2017-11-20,8.67
2017-11-21,8.97
2017-11-22,9.38
2017-11-24,9.43
2017-11-27,9.07
2017-11-28,9.1
2017-11-29,9.27
2017-11-30,9.66
2017-12-01,10.34
2017-12-04,10.11
2017-12-05,9.56
2017-12-06,9.12
2017-12-07,9.19
2017-12-08,9.3
2017-12-11,9.46
2017-12-12,9.08
2017-12-13,8.86
2017-12-14,8.64
2017-12-15,8.46
2017-12-18,8.65
2017-12-19,8.83
2017-12-20,9
2017-12-21,9.61
2017-12-22,9.6
2017-12-26,9.85
2017-12-27,9.78
2017-12-28,9.83
2017-12-29,9.57
2018-01-02,10.06
2018-01-03,10.38
2018-01-04,10.48
2018-01-05,10.47
2018-01-08,10.71
2018-01-09,10.62
2018-01-10,10.57
2018-01-11,10.98
2018-01-12,11.09
2018-01-16,10.88
2018-01-17,10.97
2018-01-18,10.81
2018-01-19,10.87
2018-01-22,11.05
2018-01-23,10.88
2018-01-24,10.67
2018-01-25,10.47
2018-01-26,10.27
2018-01-29,10.09
2018-01-30,9.29
2018-01-31,9.36
2018-02-01,9.52
2018-02-02,8.91
2018-02-05,8.53
2018-02-06,8.43
2018-02-07,7.87
2018-02-08,7.66
2018-02-09,7.51
2018-02-12,7.8
2018-02-13,7.51
2018-02-14,7.91
2018-02-15,8.36
2018-02-16,8.68
2018-02-20,8.67
2018-02-21,8.29
2018-02-22,8.63
2018-02-23,8.89
2018-02-26,9.02
2018-02-27,8.6
2018-02-28,8.62
2018-03-01,9.55
2018-03-02,9.63
2018-03-05,9.55
2018-03-06,9.26
2018-03-07,9.01
2018-03-08,8.9
2018-03-09,9.3
2018-03-12,9.49
2018-03-13,9.43
2018-03-14,9.4
2018-03-15,9.22
2018-03-16,9.24
2018-03-19,8.76
2018-03-20,8.87
2018-03-21,9.6
2018-03-22,9.25
2018-03-23,9.52
2018-03-26,9.76
2018-03-27,9.39
2018-03-28,9.4
2018-03-29,9.79
2018-04-02,9.62
2018-04-03,9.86
2018-04-04,9.85
2018-04-05,10.08
2018-04-06,9.79
2018-04-09,9.93
2018-04-10,10.41
2018-04-11,10.74
2018-04-12,10.81
2018-04-13,11.27
2018-04-16,11.37
2018-04-17,11.55
2018-04-18,12.11
2018-04-19,12.27
2018-04-20,12.46
2018-04-23,12.55
2018-04-24,12.21
2018-04-25,12.4
2018-04-26,12.08
2018-04-27,12.1
2018-04-30,12.18
2018-05-01,12.06
2018-05-02,12.11
2018-05-03,11.8
2018-05-04,12.01
2018-05-07,12.01
2018-05-08,12.19
2018-05-09,12.74
2018-05-10,12.73
2018-05-11,12.69
2018-05-14,12.88
2018-05-15,12.99
2018-05-16,13.02
2018-05-17,13.19
2018-05-18,13.16
2018-05-21,13.56
2018-05-22,13.17
2018-05-23,13.12
2018-05-24,13.04
2018-05-25,12.16
2018-05-29,12.29
2018-05-30,12.52
2018-05-31,12.09
2018-06-01,11.8
2018-06-04,11.22
2018-06-05,11.28
2018-06-06,11.38
2018-06-07,11.85
2018-06-08,11.64
2018-06-11,11.9
2018-06-12,12
2018-06-13,11.94
2018-06-14,11.93
2018-06-15,11.28
2018-06-18,11.54
2018-06-19,11.57
2018-06-20,11.76
2018-06-21,11.42
2018-06-22,12.28
2018-06-25,11.94
2018-06-26,12.06
2018-06-27,12.24
2018-06-28,12.3
2018-06-29,12.26
2018-07-02,11.91
2018-07-03,12.07
2018-07-05,12.42
2018-07-06,12.88
2018-07-09,13.19
2018-07-10,13.37
2018-07-11,12.9
2018-07-12,12.77
2018-07-13,12.75
2018-07-16,12.09
2018-07-17,12.31
2018-07-18,12.42
2018-07-19,12.41
2018-07-20,12.15
2018-07-23,11.88
2018-07-24,11.78
2018-07-25,11.92
2018-07-26,10.64
2018-07-27,10.24
2018-07-30,10.48
2018-07-31,10.39
2018-08-01,10.15
2018-08-02,10.34
2018-08-03,10.05
2018-08-06,10.25
2018-08-07,10.33
2018-08-08,9.94
2018-08-09,9.93
2018-08-10,10
2018-08-13,9.73
2018-08-14,9.77
2018-08-15,9.22
2018-08-16,9.32
2018-08-17,9.28
2018-08-20,9.46
2018-08-21,9.75
2018-08-22,9.85
2018-08-23,9.74
2018-08-24,9.96
2018-08-27,10.07
2018-08-28,9.9
2018-08-29,10.12
2018-08-30,10.04
2018-08-31,9.97
2018-09-04,9.75
2018-09-05,9.86
2018-09-06,9.54
2018-09-07,9.46
2018-09-10,9.52
2018-09-11,10.05
2018-09-12,10.28
2018-09-13,10.37
2018-09-14,10.56
2018-09-17,10.44
2018-09-18,10.62
2018-09-19,10.9
2018-09-20,10.94
2018-09-21,11.09
2018-09-24,11.36
2018-09-25,11.37
2018-09-26,11.03
2018-09-27,11.26
2018-09-28,11.32
2018-10-01,11.46
2018-10-02,11.51
2018-10-03,11.87
2018-10-04,11.76
2018-10-05,11.4
2018-10-08,11.6
2018-10-09,11.77
2018-10-10,11.29
2018-10-11,10.95
2018-10-12,11.15
2018-10-15,11.14
2018-10-16,11.24
2018-10-17,10.84
2018-10-18,10.51
2018-10-19,10.51
2018-10-22,10.26
2018-10-23,9.74
2018-10-24,9.05
2018-10-25,9.24
2018-10-26,9.1
2018-10-29,8.44
2018-10-30,8.52
2018-10-31,8.91
2018-11-01,9.16
2018-11-02,9.21
2018-11-05,9.6
2018-11-06,9.43
2018-11-07,9.8
2018-11-08,9.17
2018-11-09,9.08
2018-11-12,8.69
2018-11-13,8.41
2018-11-14,8.07
2018-11-15,8.43
2018-11-16,8.38
2018-11-19,9.12
2018-11-20,9.12
2018-11-21,8.97
2018-11-23,8.64
2018-11-26,8.66
2018-11-27,8.46
2018-11-28,8.57
2018-11-29,8.5
2018-11-30,8.03
2018-12-03,8.46
2018-12-04,8.09
2018-12-06,7.62
2018-12-07,7.7
2018-12-10,7.18
2018-12-11,7.18
2018-12-12,7.35
2018-12-13,7.32
2018-12-14,7
2018-12-17,6.76
2018-12-18,6.26
2018-12-19,6
2018-12-20,5.71
2018-12-21,5.31
2018-12-24,5.11
2018-12-26,5.65
2018-12-27,5.75
2018-12-28,5.6
2018-12-31,5.63
2019-01-02,5.69
2019-01-03,5.75
2019-01-04,6.08
2019-01-07,8.53
2019-01-08,8.76
2019-01-09,8.51
2019-01-10,8.54
2019-01-11,8.51
2019-01-14,8.55
2019-01-15,8.76
2019-01-16,8.68
2019-01-17,8.75
2019-01-18,9
2019-01-22,8.63
2019-01-23,8.34
2019-01-24,8.34
2019-01-25,8.28
2019-01-28,8.28
2019-01-29,8.26
2019-01-30,8.61
2019-01-31,8.27
2019-02-01,8.42
2019-02-04,8.46
2019-02-05,8.12
2019-02-06,8.06
2019-02-07,7.76
2019-02-08,7.75
2019-02-11,7.92
2019-02-12,8.02
2019-02-13,8.08
2019-02-14,8.24
2019-02-15,8.37
2019-02-19,8.28
2019-02-20,8.19
2019-02-21,7.95
2019-02-22,7.96
2019-02-25,8.09
2019-02-26,7.9
2019-02-27,7.86
2019-02-28,7.76
2019-03-01,7.93
2019-03-04,8.08
2019-03-05,7.93
2019-03-06,7.61
2019-03-07,7.42
2019-03-08,7.22
2019-03-11,7.37
2019-03-12,7.61
2019-03-13,7.83
2019-03-14,7.85
2019-03-15,7.57
2019-03-18,7.75
2019-03-19,7.8
2019-03-20,8.1
2019-03-21,8.1
2019-03-22,7.59
2019-03-25,7.61
2019-03-26,7.82
2019-03-27,7.64
2019-03-28,7.71
2019-03-29,7.79
2019-04-01,8.11
2019-04-02,8.03
2019-04-03,7.71
2019-04-04,7.9
2019-04-05,8.28
2019-04-08,8.28
2019-04-09,7.92
2019-04-10,8.06
2019-04-11,7.97
2019-04-12,8.18
2019-04-15,8.06
2019-04-16,8.25
2019-04-17,8.21
2019-04-18,8.03
2019-04-22,8.08
2019-04-23,8.22
2019-04-24,8.05
2019-04-25,7.56
2019-04-26,7.45
2019-04-29,7.53
2019-04-30,7.52
2019-05-01,7.23
2019-05-02,7.16
2019-05-03,7.34
2019-05-06,7.45
2019-05-07,7.38
2019-05-08,7.43
2019-05-09,7.53
2019-05-10,7.54
2019-05-13,7.35
2019-05-14,7.6
2019-05-15,7.71
2019-05-16,7.9
2019-05-17,7.5
2019-05-20,7.9
2019-05-21,8.06
2019-05-22,7.68
2019-05-23,7.48
2019-05-24,7.37
2019-05-28,7.31
2019-05-29,7.36
2019-05-30,7.01
2019-05-31,6.91
2019-06-03,6.84
2019-06-04,6.97
2019-06-05,6.48
2019-06-06,6.68
2019-06-07,6.41
2019-06-10,6.13
2019-06-11,6.26
2019-06-12,5.8
2019-06-13,5.92
2019-06-14,5.915
2019-06-17,6.045
2019-06-18,6.135
2019-06-19,6.085
2019-06-20,6.285
2019-06-21,6.05
2019-06-24,6.005
2019-06-25,6.105
2019-06-26,7.1
2019-06-27,7.005
2019-06-28,7.14
2019-07-01,7.035
2019-07-02,7.055
2019-07-03,7.185
2019-07-04,7.185
2019-07-05,7.29
2019-07-08,7.265
2019-07-09,7.185
2019-07-10,7.155
2019-07-11,7.035
2019-07-12,7.055
2019-07-15,6.78
2019-07-16,6.525
2019-07-17,6.32
2019-07-18,6.31
2019-07-19,5.365
2019-07-22,5.185
2019-07-23,5.185
2019-07-24,5.295
2019-07-25,4.85
2019-07-26,4.825
2019-07-29,4.7
2019-07-30,5.02
2019-07-31,4.95
2019-08-01,4.58
2019-08-02,4.565
2019-08-05,4.215
2019-08-06,4.06
2019-08-07,3.995
2019-08-08,4.07
2019-08-09,4.175
2019-08-12,4.185
2019-08-13,4.185
2019-08-14,3.79
2019-08-15,3.755
2019-08-16,4.005
2019-08-19,4.105
2019-08-20,3.905
2019-08-21,3.99
2019-08-22,3.89
2019-08-23,3.53
2019-08-26,3.645
2019-08-27,3.545
2019-08-28,3.775
2019-08-29,3.89
2019-08-30,3.545
2019-09-02,3.545
2019-09-03,3.53
2019-09-04,3.82
2019-09-05,3.985
2019-09-06,3.79
2019-09-09,4.155
2019-09-10,4.145
2019-09-11,4.145
2019-09-12,4.01
2019-09-13,4.045
2019-09-16,5.02
2019-09-17,4.215
2019-09-18,4.135
2019-09-19,4.16
2019-09-20,4.305
2019-09-23,4.36
2019-09-24,4.225
2019-09-25,4.115
2019-09-26,3.965
2019-09-27,3.825
2019-09-30,3.695
2019-10-01,3.38
2019-10-02,3.105
2019-10-03,3.15
2019-10-04,3.155
2019-10-07,3.155
2019-10-08,3.165
2019-10-09,3.11
2019-10-10,3.055
2019-10-11,3.235
2019-10-14,2.89
2019-10-15,3.015
2019-10-16,2.855
2019-10-17,2.955
2019-10-18,2.725
2019-10-21,2.74
2019-10-22,2.805
2019-10-23,3.115
2019-10-24,3.455
2019-10-25,3.645
2019-10-28,3.605
2019-10-29,3.715
2019-10-30,3.37
2019-10-31,3.335
2019-11-01,3.49
2019-11-04,3.715
2019-11-05,3.81
2019-11-06,3.63
2019-11-07,3.605
2019-11-08,3.685
2019-11-11,3.515
2019-11-12,3.555
2019-11-13,3.505
2019-11-14,3.355
2019-11-15,3.475
2019-11-18,3.255
2019-11-19,3.065
2019-11-20,3.12
2019-11-21,3.205
2019-11-22,3.29
2019-11-25,3.35
