date,close
2014-06-13,7.85
2014-06-16,7.58
2014-06-17,7.76
2014-06-18,7.86
2014-06-19,7.8
2014-06-20,8.2
2014-06-23,8.21
2014-06-24,8.41
2014-06-25,8.42
2014-06-26,8.39
2014-06-27,8.15
2014-06-30,8.01
2014-07-01,8.17
2014-07-02,8.11
2014-07-03,7.96
2014-07-07,7.5
2014-07-08,7.27
2014-07-09,7.15
2014-07-10,7.08
2014-07-11,7.34
2014-07-14,7.48
2014-07-15,7.23
2014-07-16,7.24
2014-07-17,7.2
2014-07-18,7.35
2014-07-21,7.23
2014-07-22,7.28
2014-07-23,7.15
2014-07-24,7.24
2014-07-25,7.11
2014-07-28,6.66
2014-07-29,6.41
2014-07-30,6
2014-07-31,6.34
2014-08-01,6.32
2014-08-04,6.42
2014-08-05,6.55
2014-08-06,6.36
2014-08-07,6.5
2014-08-08,6.65
2014-08-11,6.72
2014-08-12,6.58
2014-08-13,6.61
2014-08-14,6.72
2014-08-15,6.69
2014-08-18,6.83
2014-08-19,6.93
2014-08-20,6.97
2014-08-21,7
2014-08-22,6.99
2014-08-25,7.01
2014-08-26,7.19
2014-08-27,7.22
2014-08-28,7.1
2014-08-29,7.13
2014-09-02,7.22
2014-09-03,7.09
2014-09-04,6.88
2014-09-05,7.01
2014-09-08,6.9
2014-09-09,6.77
2014-09-10,6.99
2014-09-11,6.86
2014-09-12,6.91
2014-09-15,7.01
2014-09-16,6.96
2014-09-17,6.83
2014-09-18,6.94
2014-09-19,6.86
2014-09-22,6.69
2014-09-23,6.59
2014-09-24,6.52
2014-09-25,6.46
2014-09-26,6.67
2014-09-29,6.69
2014-09-30,6.67
2014-10-01,6.4
2014-10-02,6.8
2014-10-03,6.84
2014-10-06,6.83
2014-10-07,6.84
2014-10-08,7.03
2014-10-09,6.69
2014-10-10,6.84
2014-10-13,7.01
2014-10-14,7.28
2014-10-15,7.58
2014-10-16,7.79
2014-10-17,7.64
2014-10-20,7.67
2014-10-21,7.84
2014-10-22,7.58
2014-10-23,7.48
2014-10-24,7.4
2014-10-27,7.35
2014-10-28,7.39
2014-10-29,7.2
2014-10-30,7.37
2014-10-31,7.4
2014-11-03,7.48
2014-11-04,7.72
2014-11-05,7.94
2014-11-06,7.9
2014-11-07,7.8
2014-11-10,7.8
2014-11-11,7.55
2014-11-12,7.88
2014-11-13,7.64
2014-11-14,7.69
2014-11-17,7.33
2014-11-18,7.32
2014-11-19,7.01
2014-11-20,7.22
2014-11-21,7.2
2014-11-24,7.45
2014-11-25,7.18
2014-11-26,7.34
2014-11-28,7.1
2014-12-01,7.1
2014-12-02,7.14
2014-12-03,7.26
2014-12-04,7.25
2014-12-05,7.6
2014-12-08,7.46
2014-12-09,7.75
2014-12-10,7.79
2014-12-11,7.35
2014-12-12,7.64
2014-12-15,7.55
2014-12-16,7.58
2014-12-17,7.97
2014-12-18,8.09
2014-12-19,8.15
2014-12-22,7.98
2014-12-23,8.03
2014-12-24,8.13
2014-12-26,8.21
2014-12-29,8
2014-12-30,7.99
2014-12-31,7.77
2015-01-02,7.38
2015-01-05,7.23
2015-01-06,6.91
2015-01-07,7.1
2015-01-08,7.17
2015-01-09,7.16
2015-01-12,7.03
2015-01-13,7.14
2015-01-14,7
2015-01-15,6.66
2015-01-16,6.75
2015-01-20,6.64
2015-01-21,6.49
2015-01-22,6.7
2015-01-23,6.7
2015-01-26,6.83
2015-01-27,6.67
2015-01-28,6.48
2015-01-29,6.68
2015-01-30,6.5
2015-02-02,6.67
2015-02-03,6.92
2015-02-04,6.89
2015-02-05,6.78
2015-02-06,6.85
2015-02-09,6.64
2015-02-10,6.88
2015-02-11,6.9
2015-02-12,6.97
2015-02-13,7.04
2015-02-17,7.14
2015-02-18,7.18
2015-02-19,7.14
2015-02-20,7
2015-02-23,6.96
2015-02-24,6.9
2015-02-25,6.88
2015-02-26,6.92
2015-02-27,6.86
2015-03-02,6.96
2015-03-03,6.99
2015-03-04,6.8
2015-03-05,6.8
2015-03-06,6.6
2015-03-09,6.73
2015-03-10,6.67
2015-03-11,6.64
2015-03-12,6.7
2015-03-13,6.74
2015-03-16,6.62
2015-03-17,6.56
2015-03-18,6.55
2015-03-19,6.55
2015-03-20,6.56
2015-03-23,6.46
2015-03-24,6.56
2015-03-25,6.31
2015-03-26,6.36
2015-03-27,6.18
2015-03-30,6.25
2015-03-31,6.14
2015-04-01,6.16
2015-04-02,6.13
2015-04-06,6.14
2015-04-07,6
2015-04-08,6.05
2015-04-09,5.88
2015-04-10,5.78
2015-04-13,5.45
2015-04-14,5.32
2015-04-15,5.37
2015-04-16,5.35
2015-04-17,5.25
2015-04-20,5.27
2015-04-21,5.26
2015-04-22,5.24
2015-04-23,5.21
2015-04-24,5.2
2015-04-27,5.17
2015-04-28,5.24
2015-04-29,5.13
2015-04-30,4.84
2015-05-01,4.98
2015-05-04,5.1
2015-05-05,5.34
2015-05-06,5.37
2015-05-07,5.49
2015-05-08,5.41
2015-05-11,5.37
2015-05-12,5.17
2015-05-13,5.25
2015-05-14,5.25
2015-05-15,5.28
2015-05-18,5.37
2015-05-19,5.29
2015-05-20,5.27
2015-05-21,5.42
2015-05-22,5.32
2015-05-26,5.35
2015-05-27,5.55
2015-05-28,5.58
2015-05-29,5.44
2015-06-01,5.41
2015-06-02,5.37
2015-06-03,5.65
2015-06-04,5.62
2015-06-05,5.67
2015-06-08,5.53
2015-06-09,5.4
2015-06-10,5.4
2015-06-11,5.63
2015-06-12,5.36
2015-06-15,5.18
2015-06-16,5.53
2015-06-17,5.76
2015-06-18,5.71
2015-06-19,5.48
2015-06-22,6.03
2015-06-23,5.85
2015-06-24,5.7
2015-06-25,5.69
2015-06-26,6.01
2015-06-29,5.93
2015-06-30,5.85
2015-07-01,5.88
2015-07-02,5.9
2015-07-06,6.02
2015-07-07,6.02
2015-07-08,5.87
2015-07-09,5.88
2015-07-10,5.63
2015-07-13,5.56
2015-07-14,5.45
2015-07-15,5.4
2015-07-16,5.38
2015-07-17,5.11
2015-07-20,5.07
2015-07-21,5.08
2015-07-22,4.82
2015-07-23,4.82
2015-07-24,4.81
2015-07-27,4.82
2015-07-28,4.85
2015-07-29,4.87
2015-07-30,4.97
2015-07-31,4.87
2015-08-03,4.85
2015-08-04,5.19
2015-08-05,5.54
2015-08-06,5.49
2015-08-07,5.43
2015-08-10,5.45
2015-08-11,5.39
2015-08-12,5.36
2015-08-13,5.25
2015-08-14,5.17
2015-08-17,5.1
2015-08-18,4.99
2015-08-19,4.88
2015-08-20,4.89
2015-08-21,4.89
2015-08-24,4.76
2015-08-25,4.63
2015-08-26,4.61
2015-08-27,4.7
2015-08-28,4.86
2015-08-31,4.71
2015-09-01,4.62
2015-09-02,4.62
2015-09-03,4.59
2015-09-04,4.72
2015-09-08,4.89
2015-09-09,4.93
2015-09-10,4.76
2015-09-11,4.8
2015-09-14,4.8
2015-09-15,4.77
2015-09-16,5.04
2015-09-17,5
2015-09-18,5.17
2015-09-21,4.85
2015-09-22,4.96
2015-09-23,4.85
2015-09-24,4.85
2015-09-25,4.82
2015-09-28,4.79
2015-09-29,4.55
2015-09-30,4.6
2015-10-01,4.89
2015-10-02,4.93
2015-10-05,5.04
2015-10-06,4.98
2015-10-07,5.07
2015-10-08,5.1
2015-10-09,5.1
2015-10-12,5.04
2015-10-13,5.03
2015-10-14,4.95
2015-10-15,5.09
2015-10-16,5.09
2015-10-19,5.1
2015-10-20,5.13
2015-10-21,5.09
2015-10-22,5.25
2015-10-23,5.16
2015-10-26,5.02
2015-10-27,4.88
2015-10-28,4.83
2015-10-29,4.82
2015-10-30,4.9
2015-11-02,5.08
2015-11-03,5.23
2015-11-04,5.34
2015-11-05,5.23
2015-11-06,5.2
2015-11-09,5.16
2015-11-10,5.03
2015-11-11,4.99
2015-11-12,4.83
2015-11-13,4.96
2015-11-16,4.8
2015-11-17,4.76
2015-11-18,4.86
2015-11-19,4.99
2015-11-20,4.96
2015-11-23,5.02
2015-11-24,5
2015-11-25,5.01
2015-11-27,5.03
2015-11-30,4.97
2015-12-01,4.99
2015-12-02,5.03
2015-12-03,5.05
2015-12-04,5.04
2015-12-07,5.02
2015-12-08,5.07
2015-12-09,5.05
2015-12-10,5.06
2015-12-11,4.98
2015-12-14,5.04
2015-12-15,4.88
2015-12-16,4.88
2015-12-17,4.875
2015-12-18,4.73
2015-12-21,4.49
2015-12-22,4.74
2015-12-23,4.75
2015-12-24,4.77
2015-12-28,4.7
2015-12-29,4.85
2015-12-30,4.79
2015-12-31,4.71
2016-01-04,4.72
2016-01-05,4.91
2016-01-06,5
2016-01-07,5.08
2016-01-08,4.89
2016-01-11,4.89
2016-01-12,4.89
2016-01-13,4.46
2016-01-14,4.71
2016-01-15,4.66
2016-01-19,4.6
2016-01-20,4.52
2016-01-21,4.43
2016-01-22,4.49
2016-01-25,4.44
2016-01-26,4.45
2016-01-27,4.59
2016-01-28,4.5
2016-01-29,4.47
2016-02-01,4.42
2016-02-02,4.4
2016-02-03,4.45
2016-02-04,4.48
2016-02-05,4.6
2016-02-08,4.52
2016-02-09,4.42
2016-02-10,4.42
2016-02-11,4.41
2016-02-12,4.21
2016-02-16,4.36
2016-02-17,4.29
2016-02-18,4.34
2016-02-19,4.31
2016-02-22,4.39
2016-02-23,4.28
2016-02-24,4.24
2016-02-25,4.3
2016-02-26,4.35
2016-02-29,4.49
2016-03-01,4.51
2016-03-02,4.58
2016-03-03,4.5
2016-03-04,4.53
2016-03-07,4.54
2016-03-08,4.34
2016-03-09,4.37
2016-03-10,4.36
2016-03-11,4.23
2016-03-14,4.24
2016-03-15,4.23
2016-03-16,4.31
2016-03-17,4.41
2016-03-18,4.91
2016-03-21,4.88
2016-03-22,4.93
2016-03-23,4.74
2016-03-24,4.68
2016-03-28,4.58
2016-03-29,4.44
2016-03-30,4.48
2016-03-31,4.5
2016-04-01,4.49
2016-04-04,4.5
2016-04-05,4.51
2016-04-06,4.47
2016-04-07,4.41
2016-04-08,4.49
2016-04-11,4.4
2016-04-12,4.42
2016-04-13,4.66
2016-04-14,4.62
2016-04-15,4.8
2016-04-18,4.86
2016-04-19,4.83
2016-04-20,4.83
2016-04-21,4.74
2016-04-22,4.79
2016-04-25,4.82
2016-04-26,4.75
2016-04-27,4.77
2016-04-28,4.84
2016-04-29,4.8
2016-05-02,4.81
2016-05-03,4.95
2016-05-04,4.9
2016-05-05,4.75
2016-05-06,4.5
2016-05-09,4.65
2016-05-10,4.64
2016-05-11,4.5301
2016-05-12,4.43
2016-05-13,4.35
2016-05-16,4.54
2016-05-17,4.44
2016-05-18,4.52
2016-05-19,4.8
2016-05-20,4.8
2016-05-23,5
2016-05-24,4.99
2016-05-25,4.99
2016-05-26,4.965
2016-05-27,4.91
2016-05-31,4.89
2016-06-01,4.94
2016-06-02,4.98
2016-06-03,5.02
2016-06-06,5
2016-06-07,5.26
2016-06-08,5.34
2016-06-09,5.59
2016-06-10,5.66
2016-06-13,5.61
2016-06-14,5.54
2016-06-15,5.41
2016-06-16,5.48
2016-06-17,5.55
2016-06-20,5.56
2016-06-21,5.63
2016-06-22,5.57
2016-06-23,5.67
2016-06-24,5.53
2016-06-27,5.54
2016-06-28,5.59
2016-06-29,5.61
2016-06-30,5.68
2016-07-01,5.74
2016-07-05,5.73
2016-07-06,5.73
2016-07-07,5.68
2016-07-08,5.73
2016-07-11,5.7
2016-07-12,5.49
2016-07-13,5.72
2016-07-14,6.1
2016-07-15,5.9
2016-07-18,5.89
2016-07-19,5.95
2016-07-20,5.91
2016-07-21,5.91
2016-07-22,5.85
2016-07-25,5.91
2016-07-26,5.905
2016-07-27,5.83
2016-07-28,5.79
2016-07-29,5.73
2016-08-01,5.7
2016-08-02,6.25
2016-08-03,6.01
2016-08-04,5.73
2016-08-05,6.02
2016-08-08,6.15
2016-08-09,6.15
2016-08-10,6.1
2016-08-11,6.1
2016-08-12,6.11
2016-08-15,6.14
2016-08-16,6.07
2016-08-17,6.15
2016-08-18,6.12
2016-08-19,6.085
2016-08-22,6.16
2016-08-23,6.09
2016-08-24,6.04
2016-08-25,6.09
2016-08-26,6.06
2016-08-29,6.04
2016-08-30,6.0199
2016-08-31,6.06
2016-09-01,6.03
2016-09-02,6.06
2016-09-06,6
2016-09-07,5.91
2016-09-08,5.9
2016-09-09,5.78
2016-09-12,5.67
2016-09-13,5.65
2016-09-14,5.76
2016-09-15,5.82
2016-09-16,6.04
2016-09-19,6.13
2016-09-20,6.1
2016-09-21,6.07
2016-09-22,6.09
2016-09-23,6.05
2016-09-26,6.05
2016-09-27,6.07
2016-09-28,5.99
2016-09-29,5.94
2016-09-30,5.9
2016-10-03,6.1
2016-10-04,5.91
2016-10-05,6.1
2016-10-06,6.12
2016-10-07,6.13
2016-10-10,5.95
2016-10-11,5.95
2016-10-12,5.8
2016-10-13,5.8
2016-10-14,5.8
2016-10-17,5.75
2016-10-18,5.85
2016-10-19,5.9
2016-10-20,5.75
2016-10-21,5.65
2016-10-24,5.75
2016-10-25,5.8
2016-10-26,5.7
2016-10-27,5.7
2016-10-28,5.65
2016-10-31,5.75
2016-11-01,5.9
2016-11-02,5.8
2016-11-03,5.75
2016-11-04,5.7
2016-11-07,5.9
2016-11-08,5.9
2016-11-09,5.85
2016-11-10,5.9
2016-11-11,6.06
2016-11-14,6.295
2016-11-15,6.35
2016-11-16,6.45
2016-11-17,6.55
2016-11-18,6.45
2016-11-21,6.25
2016-11-22,6.35
2016-11-23,6.5
2016-11-25,6.5
2016-11-28,6.35
2016-11-29,6.25
2016-11-30,6.35
2016-12-01,6.15
2016-12-02,6.15
2016-12-05,6.25
2016-12-06,6.4
2016-12-07,6.4
2016-12-08,6.85
2016-12-09,6.8
2016-12-12,6.85
2016-12-13,6.7
2016-12-14,6.85
2016-12-15,6.8
2016-12-16,6.75
2016-12-19,6.8
2016-12-20,6.85
2016-12-21,6.75
2016-12-22,6.8
2016-12-23,6.95
2016-12-27,7.25
2016-12-28,7.5
2016-12-29,8.35
2016-12-30,8.55
2017-01-03,9
2017-01-04,8.9
2017-01-05,9.15
2017-01-06,8.85
2017-01-09,8.6
2017-01-10,8.45
2017-01-11,8.35
2017-01-12,8.35
2017-01-13,8.3
2017-01-17,8.2
2017-01-18,8.2
2017-01-19,8.1
2017-01-20,8.05
2017-01-23,8.3
2017-01-24,9.75
2017-01-25,9.45
2017-01-26,9.4
2017-01-27,9.25
2017-01-30,9.2
2017-01-31,9.4
2017-02-01,9.45
2017-02-02,9.2
2017-02-03,9.45
2017-02-06,9.4
2017-02-07,9.4
2017-02-08,9.3
2017-02-09,9.475
2017-02-10,10.1
2017-02-13,10.85
2017-02-14,11.2
2017-02-15,10.75
2017-02-16,10.5
2017-02-17,10.4
2017-02-21,10.75
2017-02-22,11
2017-02-23,9.95
2017-02-24,10.1
2017-02-27,10
2017-02-28,10.1
2017-03-01,10.6
2017-03-02,10.5
2017-03-03,10.5
2017-03-06,11
2017-03-07,10.9
2017-03-08,10.95
2017-03-09,10.5
2017-03-10,10.5
2017-03-13,11.15
2017-03-14,11.4
2017-03-15,11.5
2017-03-16,11.7
2017-03-17,11.45
2017-03-20,12.15
2017-03-21,11.7
2017-03-22,11.6
2017-03-23,11.7
2017-03-24,12.1
2017-03-27,11.95
2017-03-28,12.1
2017-03-29,12.35
2017-03-30,12.5
2017-03-31,12.5
2017-04-03,12.35
2017-04-04,12.1
2017-04-05,11.9
2017-04-06,12.25
2017-04-07,12.55
2017-04-10,12.95
2017-04-11,13.1
2017-04-12,13.15
2017-04-13,12.7
2017-04-17,12.75
2017-04-18,12.95
2017-04-19,13
2017-04-20,13.25
2017-04-21,13
2017-04-24,13.7
2017-04-25,13
2017-04-26,12.9
2017-04-27,13.05
2017-04-28,12.75
2017-05-01,12.8
2017-05-02,12.8
2017-05-03,12.85
2017-05-04,12.7
2017-05-05,12.95
2017-05-08,12.95
2017-05-09,13.5
2017-05-10,13.2
2017-05-11,13.4
2017-05-12,13.45
2017-05-15,13.45
2017-05-16,13.65
2017-05-17,13.1
2017-05-18,12.75
2017-05-19,12.7
2017-05-22,13.2
2017-05-23,13.15
2017-05-24,13.05
2017-05-25,13.25
2017-05-26,13.2
2017-05-30,13.25
2017-05-31,13.4
2017-06-01,13.75
2017-06-02,13.6
2017-06-05,13.7
2017-06-06,13.4
2017-06-07,13.15
2017-06-08,13.65
2017-06-09,13.2
2017-06-12,12.5
2017-06-13,12.5
2017-06-14,11.8
2017-06-15,12
2017-06-16,11.85
2017-06-19,11.75
2017-06-20,12.1
2017-06-21,11.75
2017-06-22,11.85
2017-06-23,12
2017-06-26,12
2017-06-27,11.55
2017-06-28,11.35
2017-06-29,11.2
2017-06-30,11.1
2017-07-03,11.15
2017-07-05,11.25
2017-07-06,11
2017-07-07,11.3
2017-07-10,11.65
2017-07-11,11.75
2017-07-12,12.2
2017-07-13,11.85
2017-07-14,11.85
2017-07-17,11.6
2017-07-18,11.55
2017-07-19,11.9
2017-07-20,11.65
2017-07-21,11.35
2017-07-24,11.5
2017-07-25,11.45
2017-07-26,11.55
2017-07-27,11.15
2017-07-28,11.1
2017-07-31,11.35
2017-08-01,9.575
2017-08-02,9.15
2017-08-03,9.6
2017-08-04,9.15
2017-08-07,9.55
2017-08-08,9.15
2017-08-09,9.05
2017-08-10,8.8
2017-08-11,9.1
2017-08-14,9.45
2017-08-15,9.1
2017-08-16,9.1
2017-08-17,9
2017-08-18,9.05
2017-08-21,8.6
2017-08-22,8.95
2017-08-23,9
2017-08-24,8.7
2017-08-25,9.1
2017-08-28,9.2
2017-08-29,9.2
2017-08-30,9.25
2017-08-31,9.1
2017-09-01,9.1
2017-09-05,8.85
2017-09-06,8.6
2017-09-07,8.55
2017-09-08,8.55
2017-09-11,9
2017-09-12,9
2017-09-13,8.85
2017-09-14,8.6
2017-09-15,8.4
2017-09-18,8.4
2017-09-19,8.5
2017-09-20,8.8
2017-09-21,8.6
2017-09-22,8.75
2017-09-25,8.45
2017-09-26,8.45
2017-09-27,8.5
2017-09-28,8.6
2017-09-29,8.45
2017-10-02,8.55
2017-10-03,8.45
2017-10-04,8.2
2017-10-05,8.15
2017-10-06,8.15
2017-10-09,8.25
2017-10-10,8.1
2017-10-11,8.05
2017-10-12,8.35
2017-10-13,8.35
2017-10-16,8.5
2017-10-17,8.35
2017-10-18,8.4
2017-10-19,8.05
2017-10-20,8.15
2017-10-23,7.95
2017-10-24,8.05
2017-10-25,7.95
2017-10-26,8.05
2017-10-27,9
2017-10-30,8.3
2017-10-31,8.4
2017-11-01,8.1
2017-11-02,8.4
2017-11-03,8.2
2017-11-06,8.25
2017-11-07,7.95
2017-11-08,8.2
2017-11-09,7.9
2017-11-10,7.8
2017-11-13,7.9
2017-11-14,7.95
2017-11-15,7.75
2017-11-16,7.8
2017-11-17,7.6
2017-11-20,7.55
2017-11-21,7.275
2017-11-22,7.4
2017-11-24,7.25
2017-11-27,7.3
2017-11-28,7.25
2017-11-29,7.3
2017-11-30,7.45
2017-12-01,7.4
2017-12-04,7.15
2017-12-05,6.95
2017-12-06,6.85
2017-12-07,6.8
2017-12-08,6.85
2017-12-11,6.8
2017-12-12,6.9
2017-12-13,7.05
2017-12-14,6.9
2017-12-15,7
2017-12-18,6.95
2017-12-19,6.9
2017-12-20,6.95
2017-12-21,7
2017-12-22,7
2017-12-26,6.9
2017-12-27,7
2017-12-28,6.95
2017-12-29,6.85
2018-01-02,6.6
2018-01-03,6.5
2018-01-04,6.85
2018-01-05,6.8
2018-01-08,6.85
2018-01-09,6.65
2018-01-10,6.7
2018-01-11,6.8
2018-01-12,6.75
2018-01-16,6.75
2018-01-17,6.75
2018-01-18,6.8
2018-01-19,7.1
2018-01-22,7.2
2018-01-23,7.15
2018-01-24,6.85
2018-01-25,6.8
2018-01-26,6.9
2018-01-29,6.75
2018-01-30,6.85
2018-01-31,6.8
2018-02-01,6.65
2018-02-02,6.5
2018-02-05,6.35
2018-02-06,6.35
2018-02-07,6.35
2018-02-08,6.25
2018-02-09,6.2
2018-02-12,6.3
2018-02-13,6.35
2018-02-14,6.25
2018-02-15,6.3
2018-02-16,6.2
2018-02-20,6.25
2018-02-21,6.25
2018-02-22,6.15
2018-02-23,6.2
2018-02-26,6.275
2018-02-27,6.25
2018-02-28,6.05
2018-03-01,6.7
2018-03-02,6.8
2018-03-05,6.55
2018-03-06,6.7
2018-03-07,6.9
2018-03-08,7.1
2018-03-09,7.5
2018-03-12,7.15
2018-03-13,7.05
2018-03-14,6.75
2018-03-15,6.25
2018-03-16,6.5
2018-03-19,6.3
2018-03-20,6.15
2018-03-21,6.25
2018-03-22,6.05
2018-03-23,6.05
2018-03-26,6.1
2018-03-27,6.1
2018-03-28,6.7
2018-03-29,6.9
2018-04-02,6.65
2018-04-03,6.675
2018-04-04,6.6
2018-04-05,6.45
2018-04-06,6.3
2018-04-09,6.3
2018-04-10,6.45
2018-04-11,6.45
2018-04-12,6.5
2018-04-13,6.35
2018-04-16,6.375
2018-04-17,6.3
2018-04-18,6.3
2018-04-19,6.2
2018-04-20,6.25
2018-04-23,6.1
2018-04-24,6.15
2018-04-25,6.15
2018-04-26,6.35
2018-04-27,6.4
2018-04-30,6.55
2018-05-01,4.775
2018-05-02,4.8
2018-05-03,4.6
2018-05-04,4.7
2018-05-07,4.75
2018-05-08,4.75
2018-05-09,4.85
2018-05-10,4.9
2018-05-11,4.75
2018-05-14,4.65
2018-05-15,4.7
2018-05-16,4.7
2018-05-17,4.7
2018-05-18,4.8
2018-05-21,4.75
2018-05-22,4.7
2018-05-23,4.85
2018-05-24,4.8
2018-05-25,4.85
2018-05-29,5.05
2018-05-30,4.9
2018-05-31,4.7
2018-06-01,4.7
2018-06-04,4.7
2018-06-05,4.85
2018-06-06,4.85
2018-06-07,4.85
2018-06-08,4.7
2018-06-11,4.8
2018-06-12,4.7
2018-06-13,4.7
2018-06-14,4.675
2018-06-15,4.7
2018-06-18,4.7
2018-06-19,4.8
2018-06-20,4.9
2018-06-21,4.975
2018-06-22,4.9
2018-06-25,4.85
2018-06-26,4.95
2018-06-27,4.85
2018-06-28,4.8
2018-06-29,4.85
2018-07-02,4.85
2018-07-03,4.7
2018-07-05,4.85
2018-07-06,4.85
2018-07-09,4.95
2018-07-10,4.9
2018-07-11,4.8
2018-07-12,4.85
2018-07-13,4.85
2018-07-16,4.85
2018-07-17,4.975
2018-07-18,4.95
2018-07-19,4.9
2018-07-20,4.95
2018-07-23,4.875
2018-07-24,4.75
2018-07-25,4.6
2018-07-26,4.65
2018-07-27,4.65
2018-07-30,4.5
2018-07-31,4.7
2018-08-01,4.65
2018-08-02,4.85
2018-08-03,4.75
2018-08-06,4.75
2018-08-07,4.75
2018-08-08,4.7
2018-08-09,4.7
2018-08-10,4.7
2018-08-13,4.9
2018-08-14,4.85
2018-08-15,4.8
2018-08-16,4.9
2018-08-17,5.025
2018-08-20,5.35
2018-08-21,5.75
2018-08-22,5.95
2018-08-23,5.8
2018-08-24,5.625
2018-08-27,5.75
2018-08-28,5.75
2018-08-29,5.75
2018-08-30,5.75
2018-08-31,5.775
2018-09-04,5.95
2018-09-05,6.025
2018-09-06,5.65
2018-09-07,5.45
2018-09-10,5.3
2018-09-11,5.25
2018-09-12,5.15
2018-09-13,5.3
2018-09-14,5.2
2018-09-17,5.15
2018-09-18,5
2018-09-19,5.15
2018-09-20,5.1
2018-09-21,5.05
2018-09-24,5.15
2018-09-25,5.2
2018-09-26,5.2
2018-09-27,5.15
2018-09-28,5.2
2018-10-01,5.17
2018-10-02,5.2
2018-10-03,5.16
2018-10-04,5.13
2018-10-05,5
2018-10-08,4.71
2018-10-09,4.72
2018-10-10,4.56
2018-10-11,4.52
2018-10-12,4.75
2018-10-15,4.8
2018-10-16,4.55
2018-10-17,4.6
2018-10-18,4.52
2018-10-19,4.5
2018-10-22,4.49
2018-10-23,4.45
2018-10-24,4.29
2018-10-25,4.42
2018-10-26,4.38
2018-10-29,4.26
2018-10-30,4.7
2018-10-31,4.8
2018-11-01,4.91
2018-11-02,5.01
2018-11-05,4.96
2018-11-06,5
2018-11-07,5.09
2018-11-08,5
2018-11-09,4.85
2018-11-12,4.73
2018-11-13,4.69
2018-11-14,4.73
2018-11-15,4.84
2018-11-16,4.88
2018-11-19,4.83
2018-11-20,4.8
2018-11-21,4.8
2018-11-23,4.8
2018-11-26,4.87
2018-11-27,4.78
2018-11-28,4.8
2018-11-29,4.8
2018-11-30,4.72
2018-12-03,4.72
2018-12-04,4.62
2018-12-06,4.595
2018-12-07,4.63
2018-12-10,4.52
2018-12-11,4.5
2018-12-12,4.61
2018-12-13,4.7
2018-12-14,4.66
2018-12-17,4.7
2018-12-18,4.66
2018-12-19,4.61
2018-12-20,4.55
2018-12-21,4.71
2018-12-24,4.87
2018-12-26,5.07
2018-12-27,5.05
2018-12-28,5.11
2018-12-31,5.23
2019-01-02,5.36
2019-01-03,5.34
2019-01-04,5.4
2019-01-07,5.27
2019-01-08,5.37
2019-01-09,5.25
2019-01-10,5.2
2019-01-11,5.3
2019-01-14,5.3
2019-01-15,5.29
2019-01-16,5.27
2019-01-17,5.3
2019-01-18,5.3232
2019-01-22,5.3
2019-01-23,5.3
2019-01-24,5.3
2019-01-25,5.46
2019-01-28,5.36
2019-01-29,5.35
2019-01-30,5.3
2019-01-31,5.56
2019-02-01,5.4
2019-02-04,5.41
2019-02-05,5.42
2019-02-06,5.5
2019-02-07,5.46
2019-02-08,5.37
2019-02-11,5.36
2019-02-12,5.38
2019-02-13,5.35
2019-02-14,5.35
2019-02-15,5.48
2019-02-19,6.08
2019-02-20,6.2
2019-02-21,6.23
2019-02-22,6.25
2019-02-25,6.3
2019-02-26,6.44
2019-02-27,6.43
2019-02-28,6.33
2019-03-01,6.31
2019-03-04,6.41
2019-03-05,6.42
2019-03-06,6.36
2019-03-07,6.44
2019-03-08,6.46
2019-03-11,6.255
2019-03-12,6.18
2019-03-13,6.17
2019-03-14,6.01
2019-03-15,6.08
2019-03-18,6.15
2019-03-19,5.91
2019-03-20,5.96
2019-03-21,6.01
2019-03-22,6.1
2019-03-25,6.09
2019-03-26,6.03
2019-03-27,6.12
2019-03-28,6.13
2019-03-29,6.13
2019-04-01,6.2
2019-04-02,6.27
2019-04-03,6.26
2019-04-04,6.26
2019-04-05,6.24
2019-04-08,6.06
2019-04-09,6.06
2019-04-10,6
2019-04-11,5.97
2019-04-12,5.47
2019-04-15,4.99
2019-04-16,4.91
2019-04-17,4.88
2019-04-18,4.92
2019-04-22,4.99
2019-04-23,4.94
2019-04-24,4.77
2019-04-25,4.78
2019-04-26,4.83
2019-04-29,4.76
2019-04-30,4.79
2019-05-01,4.98
2019-05-02,5.08
2019-05-03,5.19
2019-05-06,5.33
2019-05-07,5.26
2019-05-08,5.19
2019-05-09,5.29
2019-05-10,5.17
2019-05-13,5.5
2019-05-14,5.61
2019-05-15,5.61
2019-05-16,5.68
2019-05-17,5.52
2019-05-20,5.5
2019-05-21,5.54
2019-05-22,5.54
2019-05-23,5.5
2019-05-24,5.51
2019-05-28,5.62
2019-05-29,5.68
2019-05-30,5.54
2019-05-31,5.3
2019-06-03,5.14
2019-06-04,4.97
2019-06-05,4.91
2019-06-06,4.92
2019-06-07,4.82
2019-06-10,4.77
2019-06-11,4.8
2019-06-12,4.89
2019-06-13,4.8
2019-06-14,4.75
2019-06-17,4.72
2019-06-18,4.75
2019-06-19,4.76
2019-06-20,4.73
2019-06-21,4.73
2019-06-24,4.73
2019-06-25,4.685
2019-06-26,4.755
2019-06-27,4.76
2019-06-28,4.885
2019-07-01,4.755
2019-07-02,4.585
2019-07-03,4.79
2019-07-04,4.79
2019-07-05,4.79
2019-07-08,5.015
2019-07-09,4.94
2019-07-10,5.02
2019-07-11,5
2019-07-12,4.99
2019-07-15,4.84
2019-07-16,4.75
2019-07-17,4.62
2019-07-18,5.055
2019-07-19,4.82
2019-07-22,4.815
2019-07-23,4.84
2019-07-24,4.92
2019-07-25,4.92
2019-07-26,4.92
2019-07-29,4.795
2019-07-30,5.25
2019-07-31,5.305
2019-08-01,5.19
2019-08-02,5.11
2019-08-05,5.08
2019-08-06,5.03
2019-08-07,5.03
2019-08-08,5.055
2019-08-09,5
2019-08-12,5
2019-08-13,5.18
2019-08-14,4.9
2019-08-15,4.85
2019-08-16,4.78
2019-08-19,4.85
2019-08-20,4.755
2019-08-21,4.75
2019-08-22,4.77
2019-08-23,4.77
2019-08-26,4.77
2019-08-27,4.77
2019-08-28,4.845
2019-08-29,4.85
2019-08-30,4.82
2019-09-02,4.82
2019-09-03,4.82
2019-09-04,4.77
2019-09-05,4.89
2019-09-06,4.885
2019-09-09,4.885
2019-09-10,5.33
2019-09-11,5.195
2019-09-12,5.19
2019-09-13,5.245
2019-09-16,5.35
2019-09-17,5.26
2019-09-18,5.26
2019-09-19,5.215
2019-09-20,5.32
2019-09-23,5.425
2019-09-24,5.395
2019-09-25,5.385
2019-09-26,5.27
2019-09-27,5.23
2019-09-30,5.23
2019-10-01,5.145
2019-10-02,4.9
2019-10-03,4.9
2019-10-04,4.9
2019-10-07,4.9
2019-10-08,4.9
2019-10-09,4.865
2019-10-10,4.96
2019-10-11,4.96
2019-10-14,4.955
2019-10-15,5.05
2019-10-16,5.1
2019-10-17,5.32
2019-10-18,5.3
2019-10-21,5.22
2019-10-22,5.22
2019-10-23,5.13
2019-10-24,5.25
2019-10-25,5.25
2019-10-28,5.51
2019-10-29,5.51
2019-10-30,5.83
2019-10-31,5.625
2019-11-01,5.82
2019-11-04,5.79
2019-11-05,5.85
2019-11-06,6.05
2019-11-07,6.13
2019-11-08,6.205
2019-11-11,6.17
2019-11-12,6.13
2019-11-13,5.915
2019-11-14,5.87
2019-11-15,5.93
2019-11-18,5.845
2019-11-19,6
2019-11-20,6
2019-11-21,6
2019-11-22,6
2019-11-25,5.99
