date,close
2013-06-20,18.5152
2013-06-21,19.0893
2013-06-24,18.892
2013-06-25,19.0624
2013-06-26,18.6857
2013-06-27,19.0176
2013-06-28,19.6096
2013-07-01,19.4213
2013-07-02,19.3316
2013-07-03,19.3136
2013-07-05,19.493
2013-07-08,19.7442
2013-07-09,19.9326
2013-07-10,20.0492
2013-07-11,20.2196
2013-07-12,20.2555
2013-07-15,20.3632
2013-07-16,20.0941
2013-07-17,20.0492
2013-07-18,20.2286
2013-07-19,19.9415
2013-07-22,19.9146
2013-07-23,19.8429
2013-07-24,19.6186
2013-07-25,19.7621
2013-07-26,19.8608
2013-07-29,20.0761
2013-07-30,20.1838
2013-07-31,19.9685
2013-08-01,20.3273
2013-08-02,20.2824
2013-08-05,20.3183
2013-08-06,19.9057
2013-08-07,19.4751
2013-08-08,19.7083
2013-08-09,19.6007
2013-08-12,19.6096
2013-08-13,19.8877
2013-08-14,20.0223
2013-08-15,19.4751
2013-08-16,19.4213
2013-08-19,19.0176
2013-08-20,19.8429
2013-08-21,19.502
2013-08-22,19.2329
2013-08-23,19.1521
2013-08-26,19.0463
2013-08-27,18.5872
2013-08-28,18.8032
2013-08-29,18.9293
2013-08-30,18.8662
2013-09-03,19.3433
2013-09-04,19.7754
2013-09-05,19.5863
2013-09-06,19.3343
2013-09-09,19.6763
2013-09-10,19.8654
2013-09-11,19.9644
2013-09-12,19.6403
2013-09-13,19.8564
2013-09-16,20.0094
2013-09-17,20.3874
2013-09-18,20.9185
2013-09-19,20.7025
2013-09-20,21.0715
2013-09-23,20.2614
2013-09-24,20.2434
2013-09-25,20.0634
2013-09-26,20.1534
2013-09-27,21.9716
2013-09-30,22.3857
2013-10-01,22.3317
2013-10-02,21.9446
2013-10-03,21.7646
2013-10-04,21.8456
2013-10-07,21.3955
2013-10-08,21.0445
2013-10-09,21.0625
2013-10-10,21.1705
2013-10-11,21.3685
2013-10-14,21.4496
2013-10-15,21.5666
2013-10-16,21.7196
2013-10-17,21.7088
2013-10-18,22.1156
2013-10-21,22.1426
2013-10-22,22.3317
2013-10-23,22.6917
2013-10-24,22.8447
2013-10-25,22.8897
2013-10-28,23.1328
2013-10-29,23.3398
2013-10-30,22.8177
2013-10-31,22.5387
2013-11-01,22.6827
2013-11-04,22.5657
2013-11-05,22.4217
2013-11-06,22.2218
2013-11-07,21.9806
2013-11-08,22.1426
2013-11-11,22.2867
2013-11-12,22.3677
2013-11-13,22.9527
2013-11-14,23.6998
2013-11-15,23.6908
2013-11-18,23.5738
2013-11-19,23.4748
2013-11-20,23.3218
2013-11-21,23.2318
2013-11-22,23.6728
2013-11-25,24.0149
2013-11-26,23.9156
2013-11-27,23.9878
2013-11-29,23.8344
2013-12-02,23.4914
2013-12-03,23.4012
2013-12-04,23.2117
2013-12-05,23.1304
2013-12-06,23.0402
2013-12-09,23.1936
2013-12-10,22.8236
2013-12-11,22.5619
2013-12-12,22.4265
2013-12-13,22.5709
2013-12-16,22.9319
2013-12-17,23.3651
2013-12-18,23.7261
2013-12-19,23.5907
2013-12-20,25.0617
2013-12-23,25.152
2013-12-24,25.3866
2013-12-26,25.5491
2013-12-27,25.54
2013-12-30,25.4047
2013-12-31,25.4227
2014-01-02,25.4047
2014-01-03,25.8018
2014-01-06,25.6574
2014-01-07,25.54
2014-01-08,25.0798
2014-01-09,24.8812
2014-01-10,24.3668
2014-01-13,24.7188
2014-01-14,24.9444
2014-01-15,24.791
2014-01-16,24.3217
2014-01-17,24.0961
2014-01-21,23.8705
2014-01-22,23.6539
2014-01-23,23.3019
2014-01-24,22.9229
2014-01-27,22.7063
2014-01-28,23.0943
2014-01-29,22.598
2014-01-30,23.1395
2014-01-31,23.1485
2014-02-03,22.1648
2014-02-04,22.3092
2014-02-05,22.255
2014-02-06,22.8236
2014-02-07,22.7604
2014-02-10,22.4897
2014-02-11,23.0763
2014-02-12,23.2026
2014-02-13,23.2748
2014-02-14,22.9951
2014-02-18,22.6882
2014-02-19,22.589
2014-02-20,22.3272
2014-02-21,22.8146
2014-02-24,22.5709
2014-02-25,23.2478
2014-02-26,24.0987
2014-02-27,24.4065
2014-02-28,24.4609
2014-03-03,24.307
2014-03-04,24.6827
2014-03-05,24.7596
2014-03-06,24.9044
2014-03-07,25.1217
2014-03-10,25.0402
2014-03-11,24.8773
2014-03-12,24.3794
2014-03-13,24.2345
2014-03-14,24.144
2014-03-17,24.4971
2014-03-18,25.0946
2014-03-19,25.1127
2014-03-20,25.511
2014-03-21,25.4476
2014-03-24,25.4476
2014-03-25,24.7143
2014-03-26,24.7822
2014-03-27,23.972
2014-03-28,24.488
2014-03-31,24.5242
2014-04-01,24.7777
2014-04-02,24.9769
2014-04-03,24.8682
2014-04-04,24.5876
2014-04-07,24.0987
2014-04-08,24.5333
2014-04-09,24.8139
2014-04-10,23.9811
2014-04-11,23.4831
2014-04-14,23.4288
2014-04-15,23.456
2014-04-16,23.7185
2014-04-17,23.6914
2014-04-21,23.9086
2014-04-22,24.1712
2014-04-23,24.1802
2014-04-24,24.4246
2014-04-25,23.9811
2014-04-28,24.3432
2014-04-29,24.488
2014-04-30,24.9226
2014-05-01,25.3752
2014-05-02,25.6558
2014-05-05,25.6377
2014-05-06,25.2575
2014-05-07,25.3118
2014-05-08,25.5653
2014-05-09,26.362
2014-05-12,27.1043
2014-05-13,26.715
2014-05-14,26.2081
2014-05-15,25.9455
2014-05-16,26.3801
2014-05-19,26.2805
2014-05-20,25.683
2014-05-21,25.7464
2014-05-22,26.0813
2014-05-23,26.6335
2014-05-27,26.8074
2014-05-28,26.4515
2014-05-29,26.2064
2014-05-30,26.0249
2014-06-02,26.1066
2014-06-03,26.3608
2014-06-04,26.6966
2014-06-05,27.1414
2014-06-06,27.2231
2014-06-09,27.3593
2014-06-10,27.1687
2014-06-11,26.742
2014-06-12,26.506
2014-06-13,26.4878
2014-06-16,26.8419
2014-06-17,27.0143
2014-06-18,26.8056
2014-06-19,27.3774
2014-06-20,27.2503
2014-06-23,27.3774
2014-06-24,27.1142
2014-06-25,27.3684
2014-06-26,26.4606
2014-06-27,26.8328
2014-06-30,26.9962
2014-07-01,27.7133
2014-07-02,27.1777
2014-07-03,27.4137
2014-07-07,26.9871
2014-07-08,26.5514
2014-07-09,26.7511
2014-07-10,26.1701
2014-07-11,25.0445
2014-07-14,24.9628
2014-07-15,24.6724
2014-07-16,24.0006
2014-07-17,24.0369
2014-07-18,24.4182
2014-07-21,24.3456
2014-07-22,23.7919
2014-07-23,24.273
2014-07-24,24.6996
2014-07-25,24.164
2014-07-28,24.1277
2014-07-29,24.3365
2014-07-30,24.4817
2014-07-31,23.8645
2014-08-01,24.3728
2014-08-04,24.8721
2014-08-05,25.0536
2014-08-06,25.4712
2014-08-07,25.1444
2014-08-08,25.8797
2014-08-11,25.916
2014-08-12,25.8161
2014-08-13,25.562
2014-08-14,25.807
2014-08-15,25.3169
2014-08-18,25.9069
2014-08-19,26.2473
2014-08-20,26.4425
2014-08-21,26.7148
2014-08-22,26.978
2014-08-25,26.978
2014-08-26,27.1323
2014-08-27,27.1687
2014-08-28,26.832
2014-08-29,26.9685
2014-09-02,26.8866
2014-09-03,27.0504
2014-09-04,27.014
2014-09-05,26.659
2014-09-08,26.7956
2014-09-09,27.2233
2014-09-10,27.2598
2014-09-11,27.9424
2014-09-12,28.5795
2014-09-15,28.5522
2014-09-16,28.6796
2014-09-17,28.6887
2014-09-18,28.5431
2014-09-19,27.9788
2014-09-22,27.278
2014-09-23,26.7227
2014-09-24,27.1232
2014-09-25,26.7683
2014-09-26,22.8545
2014-09-29,23.2095
2014-09-30,22.7817
2014-10-01,22.4358
2014-10-02,22.6816
2014-10-03,22.8818
2014-10-06,22.3721
2014-10-07,22.0353
2014-10-08,22.7908
2014-10-09,22.3812
2014-10-10,22.5086
2014-10-13,22.2902
2014-10-14,22.7908
2014-10-15,23.0274
2014-10-16,22.5997
2014-10-17,22.8545
2014-10-20,22.4267
2014-10-21,23.0183
2014-10-22,22.8818
2014-10-23,23.0274
2014-10-24,23.082
2014-10-27,22.8272
2014-10-28,23.3915
2014-10-29,23.4279
2014-10-30,24.0286
2014-10-31,24.0923
2014-11-03,24.238
2014-11-04,23.9831
2014-11-05,24.0559
2014-11-06,24.6202
2014-11-07,24.1834
2014-11-10,23.9376
2014-11-11,24.1196
2014-11-12,25.1208
2014-11-13,24.9206
2014-11-14,25.5304
2014-11-17,24.9752
2014-11-18,24.7022
2014-11-19,24.8023
2014-11-20,25.3666
2014-11-21,25.0116
2014-11-24,25.8945
2014-11-25,25.8671
2014-11-26,25.8215
2014-11-28,26.0497
2014-12-01,25.3834
2014-12-02,25.1917
2014-12-03,25.8397
2014-12-04,25.9127
2014-12-05,25.8123
2014-12-08,25.8123
2014-12-09,25.8397
2014-12-10,25.5111
2014-12-11,25.7119
2014-12-12,25.8489
2014-12-15,25.9493
2014-12-16,25.6846
2014-12-17,26.004
2014-12-18,26.3782
2014-12-19,21.3125
2014-12-22,20.6462
2014-12-23,20.6462
2014-12-24,20.8014
2014-12-26,21.1847
2014-12-29,22.0518
2014-12-30,22.134
2014-12-31,22.1888
2015-01-02,22.207
2015-01-05,22.0062
2015-01-06,21.5133
2015-01-07,22.3713
2015-01-08,22.8916
2015-01-09,22.2892
2015-01-12,22.6543
2015-01-13,22.5356
2015-01-14,21.9514
2015-01-15,21.632
2015-01-16,21.9788
2015-01-20,21.6776
2015-01-21,21.5772
2015-01-22,22.207
2015-01-23,22.1888
2015-01-26,22.4443
2015-01-27,22.563
2015-01-28,21.9788
2015-01-29,22.3257
2015-01-30,21.5407
2015-02-02,22.1157
2015-02-03,22.28
2015-02-04,22.2253
2015-02-05,22.1796
2015-02-06,21.9058
2015-02-09,21.5133
2015-02-10,21.6776
2015-02-11,21.4586
2015-02-12,21.7506
2015-02-13,21.4586
2015-02-17,21.5225
2015-02-18,21.705
2015-02-19,21.6867
2015-02-20,22.2344
2015-02-23,22.4078
2015-02-24,21.6776
2015-02-25,22.1082
2015-02-26,22.0075
2015-02-27,22.4289
2015-03-02,22.1174
2015-03-03,22.1724
2015-03-04,21.6959
2015-03-05,21.7876
2015-03-06,21.9433
2015-03-09,22.5022
2015-03-10,22.1174
2015-03-11,21.7417
2015-03-12,21.8883
2015-03-13,21.7876
2015-03-16,21.3936
2015-03-17,21.4944
2015-03-18,21.6685
2015-03-19,21.9158
2015-03-20,21.9891
2015-03-23,22.1266
2015-03-24,22.2182
2015-03-25,21.4669
2015-03-26,21.9342
2015-03-27,21.641
2015-03-30,22.6671
2015-03-31,22.4656
2015-04-01,22.4472
2015-04-02,22.658
2015-04-06,22.8504
2015-04-07,22.4014
2015-04-08,22.8779
2015-04-09,22.9145
2015-04-10,23.0428
2015-04-13,23.0244
2015-04-14,22.8137
2015-04-15,22.9237
2015-04-16,22.9053
2015-04-17,22.5755
2015-04-20,22.5663
2015-04-21,22.7954
2015-04-22,23.3085
2015-04-23,23.6383
2015-04-24,23.5833
2015-04-27,23.1069
2015-04-28,22.9328
2015-04-29,22.4656
2015-04-30,22.4747
2015-05-01,22.887
2015-05-04,22.7862
2015-05-05,22.8962
2015-05-06,23.1894
2015-05-07,24.0323
2015-05-08,24.0414
2015-05-11,24.243
2015-05-12,23.9773
2015-05-13,24.0964
2015-05-14,23.2077
2015-05-15,23.6291
2015-05-18,23.8216
2015-05-19,23.9498
2015-05-20,23.6841
2015-05-21,24.1789
2015-05-22,23.9773
2015-05-26,23.7666
2015-05-27,23.9045
2015-05-28,24.2171
2015-05-29,24.0608
2015-06-01,23.9505
2015-06-02,23.9045
2015-06-03,24.2815
2015-06-04,24.0516
2015-06-05,24.309
2015-06-08,24.4469
2015-06-09,24.4745
2015-06-10,24.309
2015-06-11,24.2539
2015-06-12,24.3918
2015-06-15,24.1711
2015-06-16,24.5297
2015-06-17,24.1987
2015-06-18,24.2723
2015-06-19,24.2539
2015-06-22,24.116
2015-06-23,24.6676
2015-06-24,24.8699
2015-06-25,24.8239
2015-06-26,25.9732
2015-06-29,25.5043
2015-06-30,25.5778
2015-07-01,25.9824
2015-07-02,25.6698
2015-07-06,25.7341
2015-07-07,25.8353
2015-07-08,25.5962
2015-07-09,25.4491
2015-07-10,25.679
2015-07-13,25.7709
2015-07-14,25.2376
2015-07-15,25.0859
2015-07-16,25.633
2015-07-17,25.4123
2015-07-20,25.4583
2015-07-21,25.3388
2015-07-22,25.6238
2015-07-23,25.2284
2015-07-24,24.7687
2015-07-27,24.6676
2015-07-28,24.8423
2015-07-29,25.2192
2015-07-30,25.1641
2015-07-31,25.2744
2015-08-03,25.8444
2015-08-04,26.3317
2015-08-05,26.2214
2015-08-06,25.6054
2015-08-07,25.2101
2015-08-10,25.9915
2015-08-11,25.9548
2015-08-12,25.2836
2015-08-13,25.4077
2015-08-14,25.9548
2015-08-17,26.2306
2015-08-18,26.1478
2015-08-19,26.4145
2015-08-20,25.2652
2015-08-21,24.4653
2015-08-24,23.3896
2015-08-25,23.4264
2015-08-26,24.3906
2015-08-27,24.8289
2015-08-28,24.5521
2015-08-31,24.3306
2015-09-01,23.9892
2015-09-02,23.98
2015-09-03,24.1184
2015-09-04,23.8693
2015-09-08,24.1184
2015-09-09,23.6848
2015-09-10,23.6478
2015-09-11,23.3987
2015-09-14,23.3526
2015-09-15,23.0204
2015-09-16,23.4818
2015-09-17,23.3157
2015-09-18,22.6237
2015-09-21,22.799
2015-09-22,22.7529
2015-09-23,23.288
2015-09-24,22.8544
2015-09-25,18.3702
2015-09-28,18.0381
2015-09-29,17.6874
2015-09-30,17.8074
2015-10-01,17.4568
2015-10-02,17.8258
2015-10-05,18.1672
2015-10-06,17.9642
2015-10-07,18.0196
2015-10-08,18.3149
2015-10-09,18.5271
2015-10-12,18.3333
2015-10-13,17.7705
2015-10-14,17.2815
2015-10-15,17.2999
2015-10-16,17.2353
2015-10-19,17.3737
2015-10-20,17.5306
2015-10-21,17.2815
2015-10-22,17.1615
2015-10-23,16.3588
2015-10-26,16.4603
2015-10-27,16.5433
2015-10-28,17.1523
2015-10-29,17.1431
2015-10-30,17.1892
2015-11-02,17.4568
2015-11-03,17.8535
2015-11-04,17.6505
2015-11-05,17.8535
2015-11-06,17.7059
2015-11-09,17.0508
2015-11-10,16.9862
2015-11-11,16.3035
2015-11-12,15.9344
2015-11-13,15.0763
2015-11-16,14.6888
2015-11-17,14.3197
2015-11-18,14.7626
2015-11-19,14.7165
2015-11-20,15.2055
2015-11-23,15.2424
2015-11-24,15.53
2015-11-25,16.0402
2015-11-27,15.8176
2015-11-30,15.3908
2015-12-01,15.3444
2015-12-02,15.2424
2015-12-03,15.0105
2015-12-04,14.9826
2015-12-07,15.2424
2015-12-08,15.1867
2015-12-09,15.1311
2015-12-10,15.1403
2015-12-11,15.2053
2015-12-14,14.8806
2015-12-15,14.7507
2015-12-16,15.029
2015-12-17,15.0847
2015-12-18,15.6784
2015-12-21,15.5393
2015-12-22,17.0607
2015-12-23,17.2648
2015-12-24,16.9494
2015-12-28,16.736
2015-12-29,17.1071
2015-12-30,16.7546
2015-12-31,16.7731
2016-01-04,17.3019
2016-01-05,17.4967
2016-01-06,17.1628
2016-01-07,15.4279
2016-01-08,15.7434
2016-01-11,15.5485
2016-01-12,15.8083
2016-01-13,15.4743
2016-01-14,15.9567
2016-01-15,15.9475
2016-01-19,15.7619
2016-01-20,16.3093
2016-01-21,16.7175
2016-01-22,17.237
2016-01-25,16.7082
2016-01-26,17.1906
2016-01-27,16.903
2016-01-28,16.9494
2016-01-29,17.571
2016-02-01,17.3483
2016-02-02,17.2463
2016-02-03,17.1535
2016-02-04,17.0143
2016-02-05,16.736
2016-02-08,16.6711
2016-02-09,16.5597
2016-02-10,16.7917
2016-02-11,16.235
2016-02-12,16.5969
2016-02-16,17.1535
2016-02-17,17.339
2016-02-18,17.172
2016-02-19,16.9772
2016-02-22,17.3669
2016-02-23,17.07
2016-02-24,17.2659
2016-02-25,17.2099
2016-02-26,17.098
2016-02-29,16.9954
2016-03-01,17.2752
2016-03-02,17.5924
2016-03-03,17.4245
2016-03-04,17.4991
2016-03-07,17.7043
2016-03-08,17.4151
2016-03-09,17.2379
2016-03-10,17.4151
2016-03-11,17.9095
2016-03-14,17.2099
2016-03-15,17.07
2016-03-16,16.8834
2016-03-17,17.8535
2016-03-18,18.3386
2016-03-21,18.693
2016-03-22,18.3759
2016-03-23,17.667
2016-03-24,17.7882
2016-03-28,19.9523
2016-03-29,20.3441
2016-03-30,19.9057
2016-03-31,19.6818
2016-04-01,19.4906
2016-04-04,19.0941
2016-04-05,18.833
2016-04-06,18.8889
2016-04-07,18.3759
2016-04-08,18.1987
2016-04-11,17.8535
2016-04-12,18.3293
2016-04-13,18.749
2016-04-14,18.5625
2016-04-15,18.6744
2016-04-18,18.7117
2016-04-19,18.3386
2016-04-20,18.4225
2016-04-21,18.0587
2016-04-22,18.2267
2016-04-25,18.2919
2016-04-26,18.6277
2016-04-27,18.7677
2016-04-28,18.5438
2016-04-29,18.4225
2016-05-02,18.5158
2016-05-03,18.6371
2016-05-04,19.0755
2016-05-05,18.4878
2016-05-06,18.8423
2016-05-09,18.9262
2016-05-10,18.8143
2016-05-11,18.208
2016-05-12,18.3013
2016-05-13,17.7976
2016-05-16,17.9841
2016-05-17,16.8088
2016-05-18,16.3424
2016-05-19,16.1092
2016-05-20,16.4077
2016-05-23,15.988
2016-05-24,15.9973
2016-05-25,16.2225
2016-05-26,16.4477
2016-05-27,17.0106
2016-05-31,17.0106
2016-06-01,17.2546
2016-06-02,17.2076
2016-06-03,17.0012
2016-06-06,16.776
2016-06-07,16.6916
2016-06-08,16.8417
2016-06-09,16.4758
2016-06-10,16.2882
2016-06-13,16.0348
2016-06-14,16.0724
2016-06-15,16.3069
2016-06-16,16.0536
2016-06-17,16.1756
2016-06-20,16.3444
2016-06-21,16.4477
2016-06-22,16.4007
2016-06-23,15.7533
2016-06-24,19.1874
2016-06-27,18.1928
2016-06-28,18.4368
2016-06-29,18.8308
2016-06-30,18.9434
2016-07-01,19.0185
2016-07-05,18.8777
2016-07-06,19.1968
2016-07-07,19.3563
2016-07-08,20.2195
2016-07-11,20.3602
2016-07-12,20.5385
2016-07-13,20.4634
2016-07-14,20.6792
2016-07-15,20.7355
2016-07-18,20.8293
2016-07-19,20.1913
2016-07-20,20.3883
2016-07-21,20.135
2016-07-22,20.3414
2016-07-25,20.4165
2016-07-26,20.3227
2016-07-27,20.6229
2016-07-28,20.2945
2016-07-29,20.3883
2016-08-01,20.4915
2016-08-02,19.9004
2016-08-03,20.1819
2016-08-04,20.2101
2016-08-05,20.8856
2016-08-08,20.9982
2016-08-09,20.4634
2016-08-10,20.2664
2016-08-11,20.698
2016-08-12,20.8012
2016-08-15,21.6831
2016-08-16,22.1523
2016-08-17,21.8145
2016-08-18,22.3587
2016-08-19,22.49
2016-08-22,22.5276
2016-08-23,22.8372
2016-08-24,22.5169
2016-08-25,22.2154
2016-08-26,22.3473
2016-08-29,22.4509
2016-08-30,22.6205
2016-08-31,22.677
2016-09-01,22.7524
2016-09-02,22.8654
2016-09-06,22.3755
2016-09-07,22.9691
2016-09-08,22.8278
2016-09-09,22.0458
2016-09-12,21.6784
2016-09-13,21.2638
2016-09-14,21.2921
2016-09-15,21.5841
2016-09-16,21.6218
2016-09-19,21.8668
2016-09-20,22.206
2016-09-21,22.4886
2016-09-22,22.6016
2016-09-23,21.4334
2016-09-26,21.3015
2016-09-27,21.4334
2016-09-28,21.9327
2016-09-29,21.782
2016-09-30,21.7443
2016-10-03,21.2356
2016-10-04,20.8776
2016-10-05,21.1037
2016-10-06,21.0471
2016-10-07,21.1131
2016-10-10,21.2827
2016-10-11,20.7739
2016-10-12,20.9247
2016-10-13,20.4536
2016-10-14,20.5572
2016-10-17,20.1144
2016-10-18,19.7093
2016-10-19,19.8789
2016-10-20,19.5774
2016-10-21,19.5963
2016-10-24,19.6999
2016-10-25,19.2383
2016-10-26,19.1535
2016-10-27,18.7295
2016-10-28,18.6259
2016-10-31,18.5505
2016-11-01,18.0983
2016-11-02,18.4657
2016-11-03,18.4092
2016-11-04,18.5222
2016-11-07,18.8426
2016-11-08,18.8426
2016-11-09,19.2194
2016-11-10,19.7847
2016-11-11,20.7551
2016-11-14,21.6218
2016-11-15,21.3392
2016-11-16,21.6407
2016-11-17,22.4415
2016-11-18,22.3002
2016-11-21,21.5841
2016-11-22,22.4263
2016-11-23,22.502
2016-11-25,22.379
2016-11-28,22.0289
2016-11-29,21.8207
2016-11-30,21.234
2016-12-01,21.5463
2016-12-02,21.499
2016-12-05,22.0478
2016-12-06,22.01
2016-12-07,22.5304
2016-12-08,23.0509
2016-12-09,22.9373
2016-12-12,22.3128
2016-12-13,22.2087
2016-12-14,21.991
2016-12-15,21.5179
2016-12-16,21.2246
2016-12-19,21.4706
2016-12-20,21.7734
2016-12-21,19.8714
2016-12-22,18.8211
2016-12-23,18.3669
2016-12-27,18.6129
2016-12-28,18.0168
2016-12-29,17.9505
2016-12-30,17.7991
2017-01-03,17.6477
2017-01-04,17.8748
2017-01-05,16.9948
2017-01-06,16.692
2017-01-09,16.7204
2017-01-10,16.8907
2017-01-11,16.6068
2017-01-12,16.4081
2017-01-13,16.4081
2017-01-17,16.6825
2017-01-18,16.6825
2017-01-19,16.1432
2017-01-20,16.1905
2017-01-23,15.9728
2017-01-24,16.4744
2017-01-25,16.6541
2017-01-26,16.3892
2017-01-27,16.1432
2017-01-30,16.181
2017-01-31,16.2756
2017-02-01,16.181
2017-02-02,16.2473
2017-02-03,16.4176
2017-02-06,16.0107
2017-02-07,15.8971
2017-02-08,16.2473
2017-02-09,16.7677
2017-02-10,16.9759
2017-02-13,16.9286
2017-02-14,17.1651
2017-02-15,17.1462
2017-02-16,16.3797
2017-02-17,16.3797
2017-02-21,16.4744
2017-02-22,16.4458
2017-02-23,15.8554
2017-02-24,16.322
2017-02-27,16.322
2017-02-28,15.5221
2017-03-01,15.5126
2017-03-02,15.8459
2017-03-03,15.8268
2017-03-06,15.5602
2017-03-07,15.265
2017-03-08,15.8459
2017-03-09,15.3031
2017-03-10,15.9316
2017-03-13,15.4364
2017-03-14,15.3078
2017-03-15,15.7173
2017-03-16,15.8554
2017-03-17,16.3982
2017-03-20,15.8744
2017-03-21,15.484
2017-03-22,14.6746
2017-03-23,15.2935
2017-03-24,12.3129
2017-03-27,12.6748
2017-03-28,13.0938
2017-03-29,13.5223
2017-03-30,13.6271
2017-03-31,13.5509
2017-04-03,13.6366
2017-04-04,13.608
2017-04-05,13.3604
2017-04-06,13.7985
2017-04-07,14.1794
2017-04-10,13.608
2017-04-11,13.8175
2017-04-12,13.7794
2017-04-13,13.7889
2017-04-17,13.9984
2017-04-18,14.0651
2017-04-19,14.2651
2017-04-20,14.9698
2017-04-21,14.6365
2017-04-24,14.646
2017-04-25,14.5508
2017-04-26,15.0936
2017-04-27,15.1745
2017-04-28,15.0555
2017-05-01,14.7983
2017-05-02,15.1126
2017-05-03,14.9317
2017-05-04,14.8745
2017-05-05,15.1507
2017-05-08,14.9888
2017-05-09,14.9983
2017-05-10,15.4554
2017-05-11,14.5508
2017-05-12,13.808
2017-05-15,13.3509
2017-05-16,13.2747
2017-05-17,13.0938
2017-05-18,13.0176
2017-05-19,13.2081
2017-05-22,13.4937
2017-05-23,13.3509
2017-05-24,13.5333
2017-05-25,13.5045
2017-05-26,13.5716
2017-05-30,13.5333
2017-05-31,13.5429
2017-06-01,13.6196
2017-06-02,13.3413
2017-06-05,13.5525
2017-06-06,13.3317
2017-06-07,13.4085
2017-06-08,13.4949
2017-06-09,14.1283
2017-06-12,14.1091
2017-06-13,13.8692
2017-06-14,13.61
2017-06-15,13.4373
2017-06-16,13.1973
2017-06-19,12.919
2017-06-20,12.4967
2017-06-21,11.9976
2017-06-22,12.2183
2017-06-23,13.1013
2017-06-26,13.4085
2017-06-27,13.5237
2017-06-28,13.7348
2017-06-29,13.8884
2017-06-30,13.6004
2017-07-03,14.1955
2017-07-05,14.0228
2017-07-06,13.7732
2017-07-07,13.9556
2017-07-10,13.5333
2017-07-11,13.4565
2017-07-12,13.4469
2017-07-13,13.7924
2017-07-14,13.706
2017-07-17,13.6772
2017-07-18,13.5333
2017-07-19,13.658
2017-07-20,13.5237
2017-07-21,13.4949
2017-07-24,12.6214
2017-07-25,13.0821
2017-07-26,12.9286
2017-07-27,13.3605
2017-07-28,13.1013
2017-07-31,13.2069
2017-08-01,13.2549
2017-08-02,13.0438
2017-08-03,13.015
2017-08-04,13.2165
2017-08-07,13.1589
2017-08-08,13.2165
2017-08-09,13.0534
2017-08-10,12.7942
2017-08-11,12.8518
2017-08-14,12.8038
2017-08-15,12.036
2017-08-16,11.6712
2017-08-17,11.5081
2017-08-18,10.5675
2017-08-21,9.4925
2017-08-22,10.0396
2017-08-23,10.0299
2017-08-24,9.9814
2017-08-25,10.35
2017-08-28,10.1075
2017-08-29,8.2451
2017-08-30,7.9928
2017-08-31,8.0801
2017-09-01,8.6234
2017-09-05,8.6816
2017-09-06,8.9144
2017-09-07,9.1763
2017-09-08,9.0211
2017-09-11,9.1181
2017-09-12,9.4479
2017-09-13,10.059
2017-09-14,9.8941
2017-09-15,10.1754
2017-09-18,9.5837
2017-09-19,9.2733
2017-09-20,9.1472
2017-09-21,8.9435
2017-09-22,9.4382
2017-09-25,10.1754
2017-09-26,10.7477
2017-09-27,10.9126
2017-09-28,11.3103
2017-09-29,11.6692
2017-10-02,11.2327
2017-10-03,11.1357
2017-10-04,10.7865
2017-10-05,10.9805
2017-10-06,11.0969
2017-10-09,10.7671
2017-10-10,10.6895
2017-10-11,10.4567
2017-10-12,10.1366
2017-10-13,10.0105
2017-10-16,9.8456
2017-10-17,9.574
2017-10-18,9.6904
2017-10-19,9.8456
2017-10-20,10.253
2017-10-23,10.4276
2017-10-24,10.1657
2017-10-25,10.1948
2017-10-26,10.0396
2017-10-27,9.7486
2017-10-30,9.3897
2017-10-31,8.992
2017-11-01,8.8562
2017-11-02,9.3509
2017-11-03,9.3994
2017-11-06,9.3218
2017-11-07,9.0987
2017-11-08,9.3121
2017-11-09,9.7001
2017-11-10,8.8319
2017-11-13,8.6234
2017-11-14,8.6137
2017-11-15,8.7689
2017-11-16,8.798
2017-11-17,9.4479
2017-11-20,9.7777
2017-11-21,9.7001
2017-11-22,9.7491
2017-11-24,9.9256
2017-11-27,9.7001
2017-11-28,10.3376
2017-11-29,10.7201
2017-11-30,10.5828
2017-12-01,10.4945
2017-12-04,10.8476
2017-12-05,10.7005
2017-12-06,10.6024
2017-12-07,10.6514
2017-12-08,10.9064
2017-12-11,10.877
2017-12-12,10.8966
2017-12-13,11.4851
2017-12-14,11.4949
2017-12-15,11.897
2017-12-18,11.8284
2017-12-19,11.5636
2017-12-20,11.4655
2017-12-21,12.9465
2017-12-22,13.28
2017-12-26,13.8194
2017-12-27,13.6134
2017-12-28,14.1431
2017-12-29,14.2509
2018-01-02,14.6138
2018-01-03,13.5154
2018-01-04,12.9857
2018-01-05,12.8092
2018-01-08,12.5934
2018-01-09,12.6915
2018-01-10,13.0544
2018-01-11,13.378
2018-01-12,13.2898
2018-01-16,12.7013
2018-01-17,12.9857
2018-01-18,12.9465
2018-01-19,13.123
2018-01-22,13.3388
2018-01-23,12.8288
2018-01-24,12.5346
2018-01-25,12.4561
2018-01-26,11.7401
2018-01-29,11.8382
2018-01-30,11.5243
2018-01-31,11.1124
2018-02-01,10.9555
2018-02-02,10.367
2018-02-05,9.9551
2018-02-06,10.2493
2018-02-07,10.4651
2018-02-08,10.1905
2018-02-09,10.4455
2018-02-12,10.0826
2018-02-13,10.215
2018-02-14,10.367
2018-02-15,10.0924
2018-02-16,9.9551
2018-02-20,9.3568
2018-02-21,10.0237
2018-02-22,10.1512
2018-02-23,10.2787
2018-02-26,10.828
2018-02-27,10.3866
2018-02-28,10.416
2018-03-01,10.3417
2018-03-02,10.2723
2018-03-05,10.6193
2018-03-06,10.8573
2018-03-07,10.3714
2018-03-08,10.0244
2018-03-09,10.3714
2018-03-12,10.4607
2018-03-13,10.2723
2018-03-14,10.1235
2018-03-15,10.1632
2018-03-16,10.4408
2018-03-19,10.2723
2018-03-20,10.2227
2018-03-21,9.9252
2018-03-22,9.8162
2018-03-23,10.4607
2018-03-26,13.7129
2018-03-27,13.7823
2018-03-28,13.7724
2018-03-29,13.4253
2018-04-02,13.3857
2018-04-03,13.3857
2018-04-04,13.5542
2018-04-05,13.4253
2018-04-06,13.3956
2018-04-09,13.3857
2018-04-10,13.3857
2018-04-11,13.4452
2018-04-12,13.3857
2018-04-13,13.3857
2018-04-16,13.3857
2018-04-17,13.4452
2018-04-18,13.3956
2018-04-19,13.3857
2018-04-20,13.4353
2018-04-23,13.4353
2018-04-24,13.4055
2018-04-25,13.465
2018-04-26,13.465
2018-04-27,13.465
2018-04-30,13.4551
2018-05-01,13.465
2018-05-02,13.4551
2018-05-03,13.4253
2018-05-04,13.4452
2018-05-07,13.4353
2018-05-08,13.4551
2018-05-09,13.4353
2018-05-10,13.4452
2018-05-11,13.4551
2018-05-14,13.4353
2018-05-15,13.4452
2018-05-16,13.465
2018-05-17,13.44
2018-05-18,13.47
2018-05-21,13.49
2018-05-22,13.47
2018-05-23,13.47
2018-05-24,13.5
2018-05-25,13.55
2018-05-29,13.54
2018-05-30,13.59
2018-05-31,13.61
2018-06-01,13.58
2018-06-04,13.58
2018-06-05,13.52
2018-06-06,13.55
2018-06-07,13.53
2018-06-08,13.48
2018-06-11,13.47
2018-06-12,13.48
2018-06-13,13.48
2018-06-14,13.48
2018-06-15,13.51
