date,close
2014-06-13,45.2807
2014-06-16,45.9619
2014-06-17,46.1566
2014-06-18,45.7089
2014-06-19,45.9425
2014-06-20,46.0884
2014-06-23,46.1371
2014-06-24,46.6237
2014-06-25,47.1297
2014-06-26,47.1102
2014-06-27,47.2076
2014-06-30,47.7623
2014-07-01,48.9106
2014-07-02,49.5334
2014-07-03,49.8059
2014-07-07,49.9713
2014-07-08,48.3461
2014-07-09,47.4995
2014-07-10,44.7649
2014-07-11,44.9401
2014-07-14,46.2831
2014-07-15,46.1274
2014-07-16,45.923
2014-07-17,45.5337
2014-07-18,45.1931
2014-07-21,44.9401
2014-07-22,46.1176
2014-07-23,45.5337
2014-07-24,45.3975
2014-07-25,44.7163
2014-07-28,44.1324
2014-07-29,43.967
2014-07-30,44.1519
2014-07-31,42.1958
2014-08-01,42.9744
2014-08-04,43.1009
2014-08-05,42.7311
2014-08-06,47.4508
2014-08-07,49.1539
2014-08-08,51.4408
2014-08-11,51.0807
2014-08-12,50.8569
2014-08-13,50.5649
2014-08-14,50.6136
2014-08-15,50.5357
2014-08-18,50.5455
2014-08-19,51.0418
2014-08-20,50.6039
2014-08-21,50.6428
2014-08-22,50.38
2014-08-25,51.1196
2014-08-26,51.4116
2014-08-27,51.5186
2014-08-28,50.925
2014-08-29,50.6136
2014-09-02,49.8545
2014-09-03,49.9324
2014-09-04,49.582
2014-09-05,49.9226
2014-09-08,49.981
2014-09-09,50.02
2014-09-10,49.7767
2014-09-11,51.2851
2014-09-12,50.5357
2014-09-15,50.1757
2014-09-16,49.7475
2014-09-17,49.7767
2014-09-18,50.1757
2014-09-19,50.1465
2014-09-22,49.5042
2014-09-23,49.5626
2014-09-24,50.1173
2014-09-25,49.7961
2014-09-26,49.582
2014-09-29,49.7086
2014-09-30,50.2924
2014-10-01,48.9203
2014-10-02,48.6965
2014-10-03,49.3874
2014-10-06,49.6599
2014-10-07,49.2706
2014-10-08,49.9324
2014-10-09,48.4337
2014-10-10,46.6431
2014-10-13,44.7455
2014-10-14,45.5337
2014-10-15,45.4364
2014-10-16,47.12
2014-10-17,49.0468
2014-10-20,50.2341
2014-10-21,52.3263
2014-10-22,50.3119
2014-10-23,52.083
2014-10-24,52.122
2014-10-27,51.47
2014-10-28,52.7253
2014-10-29,52.4918
2014-10-30,53.7958
2014-10-31,54.3602
2014-11-03,55.6642
2014-11-04,54.8565
2014-11-05,57.4646
2014-11-06,58.2042
2014-11-07,59.9266
2014-11-10,57.8733
2014-11-11,58.4085
2014-11-12,58.827
2014-11-13,57.63
2014-11-14,57.776
2014-11-17,57.8149
2014-11-18,57.9706
2014-11-19,58.5156
2014-11-20,60.7149
2014-11-21,59.8391
2014-11-24,61.1455
2014-11-25,60.5168
2014-11-26,60.782
2014-11-28,60.8999
2014-12-01,58.5818
2014-12-02,59.0336
2014-12-03,59.4756
2014-12-04,59.7801
2014-12-05,59.623
2014-12-08,59.4167
2014-12-09,59.6721
2014-12-10,58.5818
2014-12-11,58.3952
2014-12-12,57.3245
2014-12-15,56.077
2014-12-16,56.3815
2014-12-17,58.3067
2014-12-18,59.8784
2014-12-19,59.4167
2014-12-22,59.1417
2014-12-23,58.9354
2014-12-24,59.0533
2014-12-26,59.4069
2014-12-29,59.014
2014-12-30,58.4737
2014-12-31,58.7586
2015-01-02,58.6505
2015-01-05,57.4718
2015-01-06,56.7744
2015-01-07,57.295
2015-01-08,58.0022
2015-01-09,59.3872
2015-01-12,58.1005
2015-01-13,57.7272
2015-01-14,56.7843
2015-01-15,55.6939
2015-01-16,56.2244
2015-01-20,57.0986
2015-01-21,57.5799
2015-01-22,58.4639
2015-01-23,59.3283
2015-01-26,62.1277
2015-01-27,62.4322
2015-01-28,60.9097
2015-01-29,61.9804
2015-01-30,60.9981
2015-02-02,60.2614
2015-02-03,61.1455
2015-02-04,59.9569
2015-02-05,61.9706
2015-02-06,61.8429
2015-02-09,63.2966
2015-02-10,63.0216
2015-02-11,62.0393
2015-02-12,61.3616
2015-02-13,61.5089
2015-02-17,61.2339
2015-02-18,61.2633
2015-02-19,61.5678
2015-02-20,63.0216
2015-02-23,62.8644
2015-02-24,62.2849
2015-02-25,62.4126
2015-02-26,63.9547
2015-02-27,64.2494
2015-03-02,64.3771
2015-03-03,62.4813
2015-03-04,61.7348
2015-03-05,61.9607
2015-03-06,61.833
2015-03-09,62.2652
2015-03-10,61.5187
2015-03-11,61.7643
2015-03-12,61.9804
2015-03-13,60.6838
2015-03-16,60.9097
2015-03-17,62.0983
2015-03-18,62.776
2015-03-19,61.1749
2015-03-20,61.1848
2015-03-23,59.2595
2015-03-24,59.1515
2015-03-25,57.7862
2015-03-26,57.6585
2015-03-27,58.2871
2015-03-30,59.7801
2015-03-31,59.6328
2015-04-01,58.1005
2015-04-02,56.8923
2015-04-06,55.6448
2015-04-07,55.7725
2015-04-08,57.6683
2015-04-09,57.8254
2015-04-10,58.2969
2015-04-13,58.2675
2015-04-14,57.8942
2015-04-15,58.5621
2015-04-16,57.9924
2015-04-17,57.354
2015-04-20,58.0317
2015-04-21,57.8942
2015-04-22,58.7684
2015-04-23,58.4443
2015-04-24,58.9747
2015-04-27,59.1024
2015-04-28,59.3578
2015-04-29,58.7389
2015-04-30,58.1889
2015-05-01,59.4855
2015-05-04,60.7722
2015-05-05,58.9452
2015-05-06,60.0355
2015-05-07,59.5935
2015-05-08,60.7035
2015-05-11,59.8587
2015-05-12,59.1515
2015-05-13,59.5837
2015-05-14,59.623
2015-05-15,59.6819
2015-05-18,60.3891
2015-05-19,61.2633
2015-05-20,60.6936
2015-05-21,60.4775
2015-05-22,60.0552
2015-05-26,59.456
2015-05-27,59.9176
2015-05-28,61.008
2015-05-29,60.7231
2015-06-01,60.4677
2015-06-02,61.1553
2015-06-03,61.7741
2015-06-04,62.4028
2015-06-05,62.6876
2015-06-08,62.776
2015-06-09,62.7662
2015-06-10,64.0922
2015-06-11,63.6109
2015-06-12,62.9332
2015-06-15,62.2063
2015-06-16,62.1768
2015-06-17,62.5305
2015-06-18,64.1512
2015-06-19,64.1905
2015-06-22,65.2415
2015-06-23,66.1353
2015-06-24,66.0862
2015-06-25,66.1157
2015-06-26,67.373
2015-06-29,65.713
2015-06-30,67.3239
2015-07-01,66.7345
2015-07-02,68.7383
2015-07-06,68.5615
2015-07-07,68.2079
2015-07-08,66.5479
2015-07-09,66.2925
2015-07-10,67.2649
2015-07-13,67.1274
2015-07-14,67.3632
2015-07-15,66.5577
2015-07-16,66.6166
2015-07-17,66.5675
2015-07-20,65.9487
2015-07-21,65.8308
2015-07-22,66.322
2015-07-23,66.9113
2015-07-24,66.1844
2015-07-27,65.0647
2015-07-28,66.2728
2015-07-29,68.7874
2015-07-30,69.2982
2015-07-31,70.4671
2015-08-03,68.9151
2015-08-04,69.7599
2015-08-05,51.6372
2015-08-06,48.7101
2015-08-07,52.9436
2015-08-10,53.6116
2015-08-11,52.6686
2015-08-12,51.5292
2015-08-13,50.3701
2015-08-14,48.4744
2015-08-17,47.6689
2015-08-18,47.1876
2015-08-19,43.8185
2015-08-20,43.3273
2015-08-21,44.2212
2015-08-24,41.687
2015-08-25,40.5672
2015-08-26,38.3571
2015-08-27,39.8993
2015-08-28,39.7814
2015-08-31,39.084
2015-09-01,38.2098
2015-09-02,38.2785
2015-09-03,38.6714
2015-09-04,38.0428
2015-09-08,39.4671
2015-09-09,38.5437
2015-09-10,39.251
2015-09-11,39.1331
2015-09-14,38.5536
2015-09-15,38.8974
2015-09-16,40.0761
2015-09-17,40.636
2015-09-18,39.8698
2015-09-21,40.1154
2015-09-22,38.7206
2015-09-23,38.7402
2015-09-24,38.7304
2015-09-25,36.8641
2015-09-28,30.4991
2015-09-29,28.4953
2015-09-30,29.8606
2015-10-01,31.0491
2015-10-02,33.8387
2015-10-05,33.7209
2015-10-06,33.2887
2015-10-07,34.2611
2015-10-08,34.2611
2015-10-09,34.0647
2015-10-12,32.6699
2015-10-13,31.9037
2015-10-14,32.0805
2015-10-15,31.7662
2015-10-16,33.3574
2015-10-19,34.045
2015-10-20,34.1334
2015-10-21,36.8346
2015-10-22,36.3926
2015-10-23,35.4693
2015-10-26,34.5853
2015-10-27,33.9861
2015-10-28,35.8917
2015-10-29,34.8406
2015-10-30,34.8799
2015-11-02,35.764
2015-11-03,36.5792
2015-11-04,40.302
2015-11-05,39.9189
2015-11-06,39.4965
2015-11-09,38.8286
2015-11-10,38.4848
2015-11-11,38.3669
2015-11-12,37.2177
2015-11-13,36.4614
2015-11-16,36.5105
2015-11-17,36.0979
2015-11-18,38.2884
2015-11-19,38.0428
2015-11-20,38.1017
2015-11-23,39.251
2015-11-24,40.0564
2015-11-25,40.4788
2015-11-27,40.3609
2015-11-30,40.1546
2015-12-01,39.3688
2015-12-02,38.8482
2015-12-03,38.1116
2015-12-04,38.5634
2015-12-07,39.0742
2015-12-08,39.86
2015-12-09,38.7991
2015-12-10,39.1429
2015-12-11,37.9544
2015-12-14,38.8974
2015-12-15,39.3983
2015-12-16,41.353
2015-12-17,40.636
2015-12-18,39.3688
2015-12-21,39.0152
2015-12-22,40.9994
2015-12-23,41.3235
2015-12-24,42.1977
2015-12-28,40.6458
2015-12-29,41.9031
2015-12-30,41.8245
2015-12-31,42.571
2016-01-04,41.5396
2016-01-05,40.027
2016-01-06,39.3197
2016-01-07,36.481
2016-01-08,35.6854
2016-01-11,35.8327
2016-01-12,35.7738
2016-01-13,35.0567
2016-01-14,35.5577
2016-01-15,35.2237
2016-01-19,33.4557
2016-01-20,33.2396
2016-01-21,33.2199
2016-01-22,35.4791
2016-01-25,34.7326
2016-01-26,34.9683
2016-01-27,34.4477
2016-01-28,34.379
2016-01-29,36.923
2016-02-01,36.982
2016-02-02,34.8308
2016-02-03,36.147
2016-02-04,36.039
2016-02-05,34.7129
2016-02-08,31.5108
2016-02-09,31.1179
2016-02-10,30.0571
2016-02-11,28.7114
2016-02-12,29.8115
2016-02-16,32.2868
2016-02-17,32.9351
2016-02-18,32.8663
2016-02-19,32.8565
2016-02-22,34.9683
2016-02-23,34.7915
2016-02-24,35.705
2016-02-25,35.8917
2016-02-26,36.8739
2016-02-29,36.4221
2016-03-01,37.7579
2016-03-02,37.699
2016-03-03,38.4259
2016-03-04,38.0919
2016-03-07,38.6027
2016-03-08,36.7266
2016-03-09,36.1372
2016-03-10,35.0666
2016-03-11,35.6264
2016-03-14,36.0586
2016-03-15,35.0666
2016-03-16,35.263
2016-03-17,36.4712
2016-03-18,36.1372
2016-03-21,33.3476
2016-03-22,34.2022
2016-03-23,33.8191
2016-03-24,33.5932
2016-03-28,33.6619
2016-03-29,33.4262
2016-03-30,34.2316
2016-03-31,33.7405
2016-04-01,33.8191
2016-04-04,31.9725
2016-04-05,32.4341
2016-04-06,33.6521
2016-04-07,33.1413
2016-04-08,33.8387
2016-04-11,32.994
2016-04-12,36.6873
2016-04-13,37.6695
2016-04-14,38.2785
2016-04-15,37.7972
2016-04-18,38.1017
2016-04-19,37.8169
2016-04-20,38.0919
2016-04-21,38.2884
2016-04-22,38.9072
2016-04-25,38.3178
2016-04-26,37.6302
2016-04-27,38.9366
2016-04-28,37.6302
2016-04-29,36.373
2016-05-02,37.0311
2016-05-03,35.8818
2016-05-04,36.815
2016-05-05,37.5713
2016-05-06,37.7481
2016-05-09,36.923
2016-05-10,36.9525
2016-05-11,36.5989
2016-05-12,36.7757
2016-05-13,36.2158
2016-05-16,37.1784
2016-05-17,37.6597
2016-05-18,36.8641
2016-05-19,36.4221
2016-05-20,39.6144
2016-05-23,34.3495
2016-05-24,36.5007
2016-05-25,36.3533
2016-05-26,36.4221
2016-05-27,37.699
2016-05-31,38.7697
2016-06-01,38.5634
2016-06-02,38.3473
2016-06-03,38.2196
2016-06-06,38.1312
2016-06-07,38.2884
2016-06-08,38.8384
2016-06-09,38.1017
2016-06-10,36.2747
2016-06-13,34.8898
2016-06-14,35.2041
2016-06-15,35.155
2016-06-16,35.5086
2016-06-17,35.4791
2016-06-20,35.9113
2016-06-21,35.2335
2016-06-22,34.821
2016-06-23,35.7738
2016-06-24,33.5637
2016-06-27,31.9233
2016-06-28,32.3359
2016-06-29,33.5539
2016-06-30,34.1432
2016-07-01,34.1825
2016-07-05,32.9154
2016-07-06,32.9449
2016-07-07,32.8761
2016-07-08,33.8486
2016-07-11,34.8308
2016-07-12,35.6068
2016-07-13,35.2335
2016-07-14,35.0076
2016-07-15,35.8524
2016-07-18,35.5872
2016-07-19,34.8013
2016-07-20,35.5675
2016-07-21,35.7738
2016-07-22,35.5675
2016-07-25,36.9721
2016-07-26,37.2079
2016-07-27,37.2766
2016-07-28,37.2275
2016-07-29,36.8248
2016-08-01,36.7266
2016-08-02,35.3219
2016-08-03,41.2351
2016-08-04,41.0289
2016-08-05,41.3039
2016-08-08,40.2922
2016-08-09,39.1036
2016-08-10,37.4043
2016-08-11,37.6597
2016-08-12,37.424
2016-08-15,37.7874
2016-08-16,36.7167
2016-08-17,36.0881
2016-08-18,36.7266
2016-08-19,36.7462
2016-08-22,37.4829
2016-08-23,38.0232
2016-08-24,37.7678
2016-08-25,37.591
2016-08-26,37.6204
2016-08-29,37.9347
2016-08-30,38.8482
2016-08-31,38.6223
2016-09-01,38.8188
2016-09-02,39.4376
2016-09-06,38.2
2016-09-07,38.0232
2016-09-08,37.3454
2016-09-09,35.096
2016-09-12,40.2627
2016-09-13,38.5929
2016-09-14,38.2098
2016-09-15,38.7893
2016-09-16,37.6695
2016-09-19,38.0232
2016-09-20,37.5124
2016-09-21,37.7776
2016-09-22,38.3768
2016-09-23,37.8463
2016-09-26,37.3847
2016-09-27,37.7481
2016-09-28,38.475
2016-09-29,36.8346
2016-09-30,37.0409
2016-10-03,37.0016
2016-10-04,36.8444
2016-10-05,37.1293
2016-10-06,37.7383
2016-10-07,36.9427
2016-10-10,37.699
2016-10-11,36.9721
2016-10-12,36.756
2016-10-13,36.4908
2016-10-14,36.2354
2016-10-17,36.2453
2016-10-18,36.3926
2016-10-19,36.2944
2016-10-20,36.0979
2016-10-21,35.9997
2016-10-24,36.4417
2016-10-25,35.9997
2016-10-26,36.0488
2016-10-27,35.8524
2016-10-28,34.5263
2016-10-31,34.7228
2016-11-01,34.2316
2016-11-02,29.0748
2016-11-03,27.847
2016-11-04,27.3067
2016-11-07,26.7665
2016-11-08,26.4227
2016-11-09,26.6192
2016-11-10,27.6505
2016-11-11,27.7242
2016-11-14,28.3872
2016-11-15,28.1908
2016-11-16,28.4363
2016-11-17,28.8292
2016-11-18,28.9275
2016-11-21,28.4854
2016-11-22,28.289
2016-11-23,28.2399
2016-11-25,27.847
2016-11-28,27.7487
2016-11-29,27.3558
2016-11-30,26.7174
2016-12-01,26.2263
2016-12-02,27.1103
2016-12-05,28.289
2016-12-06,30.1062
2016-12-07,30.892
2016-12-08,30.892
2016-12-09,30.6955
2016-12-12,30.3517
2016-12-13,30.3026
2016-12-14,30.3026
2016-12-15,30.1553
2016-12-16,28.5346
2016-12-19,27.4541
2016-12-20,28.0925
2016-12-21,29.2712
2016-12-22,28.6328
2016-12-23,28.4363
2016-12-27,28.8783
2016-12-28,28.1416
2016-12-29,28.0434
2016-12-30,28.1416
2017-01-03,28.5837
2017-01-04,29.615
2017-01-05,29.0748
2017-01-06,28.8292
2017-01-09,28.5837
2017-01-10,29.1239
2017-01-11,29.2221
2017-01-12,28.4854
2017-01-13,28.9275
2017-01-17,28.5346
2017-01-18,28.731
2017-01-19,27.847
2017-01-20,28.0434
2017-01-23,28.3381
2017-01-24,28.8783
2017-01-25,29.4186
2017-01-26,29.5168
2017-01-27,29.4677
2017-01-30,29.4186
2017-01-31,29.8115
2017-02-01,29.7624
2017-02-02,29.7133
2017-02-03,30.0571
2017-02-06,30.1553
2017-02-07,29.4677
2017-02-08,32.0707
2017-02-09,32.8565
2017-02-10,33.4949
2017-02-13,34.5754
2017-02-14,34.0843
2017-02-15,34.0843
2017-02-16,33.7896
2017-02-17,33.4949
2017-02-21,33.8387
2017-02-22,33.6914
2017-02-23,33.2985
2017-02-24,33.0038
2017-02-27,33.1512
2017-02-28,32.8074
2017-03-01,33.2494
2017-03-02,33.4458
2017-03-03,33.2494
2017-03-06,32.5127
2017-03-07,32.218
2017-03-08,32.4636
2017-03-09,32.218
2017-03-10,32.5618
2017-03-13,32.1689
2017-03-14,32.218
2017-03-15,32.66
2017-03-16,33.2494
2017-03-17,33.0529
2017-03-20,32.7091
2017-03-21,32.0216
2017-03-22,32.7091
2017-03-23,32.9547
2017-03-24,34.821
2017-03-27,34.6245
2017-03-28,34.6737
2017-03-29,34.4772
2017-03-30,34.821
2017-03-31,35.6068
2017-04-03,35.0666
2017-04-04,34.9192
2017-04-05,35.0174
2017-04-06,35.3612
2017-04-07,35.3121
2017-04-10,35.4103
2017-04-11,35.6559
2017-04-12,35.4595
2017-04-13,35.4595
2017-04-17,35.9997
2017-04-18,35.9506
2017-04-19,36.8346
2017-04-20,36.8837
2017-04-21,37.0311
2017-04-24,37.9642
2017-04-25,38.6518
2017-04-26,38.8482
2017-04-27,38.8974
2017-04-28,38.9956
2017-05-01,39.3394
2017-05-02,39.3885
2017-05-03,39.2411
2017-05-04,39.3885
2017-05-05,39.8305
2017-05-08,39.4376
2017-05-09,39.4867
2017-05-10,42.9737
2017-05-11,40.4199
2017-05-12,38.7991
2017-05-15,40.1743
2017-05-16,39.7814
2017-05-17,38.1607
2017-05-18,38.6027
2017-05-19,38.75
2017-05-22,38.75
2017-05-23,38.1116
2017-05-24,37.6695
2017-05-25,37.5222
2017-05-26,37.3749
2017-05-30,36.8837
2017-05-31,36.8837
2017-06-01,37.3257
2017-06-02,36.7364
2017-06-05,36.8837
2017-06-06,36.3435
2017-06-07,36.0979
2017-06-08,35.6559
2017-06-09,36.0488
2017-06-12,34.6737
2017-06-13,35.263
2017-06-14,34.8701
2017-06-15,34.1825
2017-06-16,33.3967
2017-06-19,34.0843
2017-06-20,34.0843
2017-06-21,33.5441
2017-06-22,34.5754
2017-06-23,34.2316
2017-06-26,34.2316
2017-06-27,34.0352
2017-06-28,34.5754
2017-06-29,33.9861
2017-06-30,34.4281
2017-07-03,34.379
2017-07-05,34.2316
2017-07-06,33.4949
2017-07-07,34.1334
2017-07-10,34.379
2017-07-11,34.2316
2017-07-12,34.9192
2017-07-13,35.3612
2017-07-14,34.821
2017-07-17,36.6382
2017-07-18,35.1157
2017-07-19,35.2139
2017-07-20,35.263
2017-07-21,34.4772
2017-07-24,34.4281
2017-07-25,35.3121
2017-07-26,35.263
2017-07-27,35.1648
2017-07-28,34.4281
2017-07-31,34.4772
2017-08-01,34.5754
2017-08-02,30.0079
2017-08-03,29.5168
2017-08-04,30.2044
2017-08-07,29.8606
2017-08-08,29.2712
2017-08-09,29.3695
2017-08-10,28.3872
2017-08-11,28.289
2017-08-14,29.2712
2017-08-15,28.9766
2017-08-16,29.0748
2017-08-17,28.9766
2017-08-18,28.5837
2017-08-21,28.3381
2017-08-22,28.6819
2017-08-23,28.1416
2017-08-24,27.847
2017-08-25,28.289
2017-08-28,28.5346
2017-08-29,28.0925
2017-08-30,28.3872
2017-08-31,28.4609
2017-09-01,28.4854
2017-09-05,28.4854
2017-09-06,28.9766
2017-09-07,28.731
2017-09-08,28.8783
2017-09-11,28.8292
2017-09-12,28.6819
2017-09-13,29.3204
2017-09-14,28.4854
2017-09-15,28.9766
2017-09-18,28.4363
2017-09-19,28.1416
2017-09-20,28.0925
2017-09-21,27.9943
2017-09-22,28.1416
2017-09-25,27.5032
2017-09-26,27.8961
2017-09-27,29.0748
2017-09-28,29.3204
2017-09-29,29.2712
2017-10-02,29.615
2017-10-03,29.6641
2017-10-04,29.5659
2017-10-05,29.5659
2017-10-06,29.173
2017-10-09,28.5837
2017-10-10,28.8292
2017-10-11,28.731
2017-10-12,28.731
2017-10-13,28.6328
2017-10-16,28.731
2017-10-17,28.5346
2017-10-18,28.4854
2017-10-19,28.7801
2017-10-20,28.9275
2017-10-23,28.3872
2017-10-24,28.3381
2017-10-25,27.9943
2017-10-26,28.289
2017-10-27,28.2399
2017-10-30,27.847
2017-10-31,27.7979
2017-11-01,25.2931
2017-11-02,23.2304
2017-11-03,22.9848
2017-11-06,23.6724
2017-11-07,23.9671
2017-11-08,24.2617
2017-11-09,24.1635
2017-11-10,23.8197
2017-11-13,24.1144
2017-11-14,25.4404
2017-11-15,24.6546
2017-11-16,24.6055
2017-11-17,24.7038
2017-11-20,24.5564
2017-11-21,24.5564
2017-11-22,24.2126
2017-11-24,24.2617
2017-11-27,23.6724
2017-11-28,23.9671
2017-11-29,24.5564
2017-11-30,24.4582
2017-12-01,24.1144
2017-12-04,24.0653
2017-12-05,23.6724
2017-12-06,23.0339
2017-12-07,23.2795
2017-12-08,23.083
2017-12-11,22.8375
2017-12-12,22.5428
2017-12-13,22.9848
2017-12-14,21.5114
2017-12-15,21.6096
2017-12-18,21.2167
2017-12-19,20.9221
2017-12-20,21.8061
2017-12-21,22.199
2017-12-22,21.8061
2017-12-26,22.0517
2017-12-27,21.8061
2017-12-28,21.6588
2017-12-29,21.6096
2018-01-02,21.8552
2018-01-03,21.757
2018-01-04,22.641
2018-01-05,23.3286
2018-01-08,24.6546
2018-01-09,24.9002
2018-01-10,24.4582
2018-01-11,24.0653
2018-01-12,24.0653
2018-01-16,23.8688
2018-01-17,23.9671
2018-01-18,23.2795
2018-01-19,23.2795
2018-01-22,22.5919
2018-01-23,21.5605
2018-01-24,20.9712
2018-01-25,20.873
2018-01-26,21.1676
2018-01-29,21.4132
2018-01-30,21.0694
2018-01-31,20.8238
2018-02-01,20.7256
2018-02-02,20.4309
2018-02-05,20.0871
2018-02-06,20.5292
2018-02-07,21.4623
2018-02-08,21.0694
2018-02-09,21.0694
2018-02-12,21.1676
2018-02-13,21.3641
2018-02-14,21.4132
2018-02-15,21.5114
2018-02-16,21.6588
2018-02-20,21.2167
2018-02-21,21.3641
2018-02-22,21.315
2018-02-23,21.4623
2018-02-26,21.2659
2018-02-27,21.315
2018-02-28,21.2659
2018-03-01,20.0871
2018-03-02,20.0871
2018-03-05,19.7434
2018-03-06,20.3327
2018-03-07,20.7256
2018-03-08,20.6765
2018-03-09,20.8238
2018-03-12,20.8238
2018-03-13,20.7747
2018-03-14,19.6942
2018-03-15,19.8907
2018-03-16,19.596
2018-03-19,19.2522
2018-03-20,19.2031
2018-03-21,19.7434
2018-03-22,18.6629
2018-03-23,18.3682
2018-03-26,18.6138
2018-03-27,18.712
2018-03-28,18.8593
2018-03-29,19.3013
2018-04-02,18.6138
2018-04-03,19.0558
2018-04-04,19.7925
2018-04-05,20.2836
2018-04-06,19.8907
2018-04-09,19.5469
2018-04-10,19.7434
2018-04-11,19.596
2018-04-12,19.3505
2018-04-13,19.3505
2018-04-16,19.3013
2018-04-17,19.1049
2018-04-18,19.0558
2018-04-19,18.6629
2018-04-20,18.4664
2018-04-23,18.6629
2018-04-24,18.2209
2018-04-25,17.9753
2018-04-26,18.6629
2018-04-27,18.6138
2018-04-30,18.1226
2018-05-01,18.3682
2018-05-02,18.3682
2018-05-03,18.1717
2018-05-04,18.4173
2018-05-07,18.0735
2018-05-08,18.1226
2018-05-09,12.8676
2018-05-10,12.4501
2018-05-11,12.622
2018-05-14,13.4078
2018-05-15,13.506
2018-05-16,14.4392
2018-05-17,14.8321
2018-05-18,14.8812
2018-05-21,15.0285
2018-05-22,15.0776
2018-05-23,15.1759
2018-05-24,14.9794
2018-05-25,14.9303
2018-05-29,14.2918
2018-05-30,14.8812
2018-05-31,15.3723
2018-06-01,15.667
2018-06-04,15.6179
2018-06-05,15.8634
2018-06-06,16.2563
2018-06-07,16.551
2018-06-08,16.6492
2018-06-11,16.8948
2018-06-12,16.4037
2018-06-13,16.2563
2018-06-14,16.3546
2018-06-15,16.109
2018-06-18,16.6492
2018-06-19,16.993
2018-06-20,17.0913
2018-06-21,16.4037
2018-06-22,16.2072
2018-06-25,15.7161
2018-06-26,16.2072
2018-06-27,15.2741
2018-06-28,14.783
2018-06-29,14.8321
2018-07-02,15.4705
2018-07-03,15.0776
2018-07-05,15.3723
2018-07-06,15.1267
2018-07-09,15.5197
2018-07-10,15.5197
2018-07-11,15.4705
2018-07-12,15.2741
2018-07-13,15.2741
2018-07-16,15.1759
2018-07-17,15.225
2018-07-18,15.6179
2018-07-19,15.9617
2018-07-20,15.7161
2018-07-23,15.5688
2018-07-24,15.7161
2018-07-25,14.6847
2018-07-26,14.2427
2018-07-27,14.0954
2018-07-30,14.5374
2018-07-31,15.4705
2018-08-01,14.2427
2018-08-02,14.7338
2018-08-03,14.9794
2018-08-06,14.7338
2018-08-07,14.4883
2018-08-08,17.6315
2018-08-09,18.1717
2018-08-10,18.1226
2018-08-13,17.1895
2018-08-14,16.9439
2018-08-15,16.6984
2018-08-16,17.2386
2018-08-17,17.2386
2018-08-20,18.4664
2018-08-21,18.6645
2018-08-22,18.5159
2018-08-23,18.3674
2018-08-24,18.714
2018-08-27,18.6645
2018-08-28,18.615
2018-08-29,18.813
2018-08-30,18.5654
2018-08-31,18.7635
2018-09-04,18.912
2018-09-05,19.1595
2018-09-06,19.011
2018-09-07,19.011
2018-09-10,18.912
2018-09-11,18.9615
2018-09-12,18.7635
2018-09-13,18.615
2018-09-14,18.813
2018-09-17,19.8031
2018-09-18,20.7933
2018-09-19,20.3972
2018-09-20,20.5953
2018-09-21,21.0903
2018-09-24,20.6448
2018-09-25,20.4467
2018-09-26,20.5458
2018-09-27,18.6645
2018-09-28,18.3674
2018-10-01,17.803
2018-10-02,17.7733
2018-10-03,17.9218
2018-10-04,17.3773
2018-10-05,17.0109
2018-10-08,17.0802
2018-10-09,16.3772
2018-10-10,16.199
2018-10-11,16.496
2018-10-12,16.7337
2018-10-15,16.7039
2018-10-16,17.5654
2018-10-17,17.407
2018-10-18,16.9416
2018-10-19,16.4564
2018-10-22,16.4663
2018-10-23,16.2683
2018-10-24,15.2385
2018-10-25,15.6841
2018-10-26,15.4762
2018-10-29,15.5059
2018-10-30,15.8722
2018-10-31,15.6346
2018-11-01,16.3277
2018-11-02,16.1396
2018-11-05,16.0702
2018-11-06,16.6247
2018-11-07,14.6345
2018-11-08,14.6296
2018-11-09,14.4761
2018-11-12,14.4959
2018-11-13,14.7236
2018-11-14,14.5949
2018-11-15,15.1395
2018-11-16,15.2088
2018-11-19,15.09
2018-11-20,14.83
2018-11-21,15.22
2018-11-23,15.55
2018-11-26,15.75
2018-11-27,15.76
2018-11-28,16.2
2018-11-29,15.8
2018-11-30,15.65
2018-12-03,15.65
2018-12-04,14.92
2018-12-06,14.64
2018-12-07,15.02
2018-12-10,15.4
2018-12-11,15.23
2018-12-12,14.92
2018-12-13,14.56
2018-12-14,14.67
2018-12-17,14.34
2018-12-18,13.96
2018-12-19,14.06
2018-12-20,13.54
2018-12-21,13.09
2018-12-24,12.84
2018-12-26,12.74
2018-12-27,13.74
2018-12-28,13.25
2018-12-31,13.58
2019-01-02,13.81
2019-01-03,13.86
2019-01-04,14.18
2019-01-07,14.24
2019-01-08,14.05
2019-01-09,14.44
2019-01-10,14.03
2019-01-11,14.11
2019-01-14,13.97
2019-01-15,14.61
2019-01-16,15.06
2019-01-17,15.21
2019-01-18,15.37
2019-01-22,14.74
2019-01-23,14.67
2019-01-24,14.81
2019-01-25,14.82
2019-01-28,15.09
2019-01-29,15.11
2019-01-30,14.91
2019-01-31,15.38
2019-02-01,15.46
2019-02-04,15.82
2019-02-05,15.77
2019-02-06,15.06
2019-02-07,15.43
2019-02-08,15.68
2019-02-11,16.32
2019-02-12,16.31
2019-02-13,16.65
2019-02-14,16.4
2019-02-15,17.24
2019-02-19,17.19
2019-02-20,17.08
2019-02-21,16.92
2019-02-22,17.06
2019-02-25,16.76
2019-02-26,16.6
2019-02-27,16.78
2019-02-28,16.8
2019-03-01,17.01
2019-03-04,16.95
2019-03-05,16.94
2019-03-06,16.53
2019-03-07,16.44
2019-03-08,16.4
2019-03-11,16.67
2019-03-12,16.55
2019-03-13,16.28
2019-03-14,15.92
2019-03-15,15.87
2019-03-18,15.73
2019-03-19,15.54
2019-03-20,15.65
2019-03-21,15.68
2019-03-22,15.17
2019-03-25,15.51
2019-03-26,15.4
2019-03-27,15.45
2019-03-28,15.78
2019-03-29,15.61
2019-04-01,15.77
2019-04-02,15.68
2019-04-03,15.61
2019-04-04,15.72
2019-04-05,15.96
2019-04-08,15.44
2019-04-09,15.18
2019-04-10,15.24
2019-04-11,15.18
2019-04-12,14.98
2019-04-15,14.9
2019-04-16,15.23
2019-04-17,15.4
2019-04-18,15.48
2019-04-22,15.18
2019-04-23,15.45
2019-04-24,15.43
2019-04-25,15.13
2019-04-26,15.31
2019-04-29,15.17
2019-04-30,15.13
2019-05-01,14.96
2019-05-02,15.78
2019-05-03,16.47
2019-05-06,16.35
2019-05-07,15.72
2019-05-08,15.52
2019-05-09,15.47
2019-05-10,15.57
2019-05-13,15.31
2019-05-14,15.43
2019-05-15,15.38
2019-05-16,14.92
2019-05-17,14.92
2019-05-20,14.48
2019-05-21,14.51
2019-05-22,14.39
2019-05-23,14.2
2019-05-24,14.38
2019-05-28,14.28
2019-05-29,14.2
2019-05-30,13.94
2019-05-31,13.87
2019-06-03,13.91
2019-06-04,14.42
2019-06-05,14.3
2019-06-06,14.14
2019-06-07,14.4
2019-06-10,14.67
2019-06-11,14.55
2019-06-12,14.62
2019-06-13,14.39
2019-06-14,14.375
2019-06-17,14.135
2019-06-18,14.52
2019-06-19,14.61
2019-06-20,14.73
2019-06-21,14.605
2019-06-24,14.33
2019-06-25,14.72
2019-06-26,14.62
2019-06-27,14.635
2019-06-28,15.075
2019-07-01,15.06
2019-07-02,14.965
2019-07-03,15.11
2019-07-04,15.11
2019-07-05,15.54
2019-07-08,15.195
2019-07-09,15.07
2019-07-10,15.225
2019-07-11,14.95
2019-07-12,15.1
2019-07-15,14.92
2019-07-16,15.16
2019-07-17,15.3
2019-07-18,14.945
2019-07-19,14.875
2019-07-22,14.585
2019-07-23,14.77
2019-07-24,14.925
2019-07-25,14.845
2019-07-26,14.66
2019-07-29,14.38
2019-07-30,14.47
2019-07-31,14.1
2019-08-01,13.92
2019-08-02,13.68
2019-08-05,13.975
2019-08-06,14.235
2019-08-07,15.43
2019-08-08,16.625
2019-08-09,16.435
2019-08-12,15.92
2019-08-13,15.99
2019-08-14,15.465
2019-08-15,15.13
2019-08-16,15.43
2019-08-19,15.52
2019-08-20,15.32
2019-08-21,15.38
2019-08-22,15.15
2019-08-23,14.585
2019-08-26,14.74
2019-08-27,14.45
2019-08-28,14.345
2019-08-29,14.945
2019-08-30,14.96
2019-09-02,14.97
2019-09-03,14.815
2019-09-04,14.925
2019-09-05,14.25
2019-09-06,14.39
2019-09-09,14.94
2019-09-10,14.83
2019-09-11,15.125
2019-09-12,15.635
2019-09-13,16.075
2019-09-16,16.635
2019-09-17,16.58
2019-09-18,16.39
2019-09-19,16.74
2019-09-20,16.5
2019-09-23,15.88
2019-09-24,16.025
2019-09-25,16.37
2019-09-26,16.595
2019-09-27,16.58
2019-09-30,16.65
2019-10-01,16.445
2019-10-02,16.51
2019-10-03,16.44
2019-10-04,16.465
2019-10-07,16.57
2019-10-08,16.405
2019-10-09,16.17
2019-10-10,16.095
2019-10-11,16.575
2019-10-14,17.13
2019-10-15,16.67
2019-10-16,17.18
2019-10-17,17.72
2019-10-18,17.27
2019-10-21,17.585
2019-10-22,17.6
2019-10-23,17.67
2019-10-24,17.355
2019-10-25,17.38
2019-10-28,17.305
2019-10-29,17.26
2019-10-30,16.98
2019-10-31,16.82
2019-11-01,17.34
2019-11-04,17.5
2019-11-05,17.08
2019-11-06,16.83
2019-11-07,15.97
2019-11-08,16.04
2019-11-11,15.565
2019-11-12,15.775
2019-11-13,15.93
2019-11-14,15.83
2019-11-15,15.79
2019-11-18,16.005
2019-11-19,15.46
2019-11-20,15.18
2019-11-21,15.17
2019-11-22,15.51
2019-11-25,15.81
