date,close
2015-10-29,9.6747
2015-10-30,9.8129
2015-11-02,10.8135
2015-11-03,11.0678
2015-11-04,11.2834
2015-11-05,11.1618
2015-11-06,10.8909
2015-11-09,10.6421
2015-11-10,11.2668
2015-11-11,11.7036
2015-11-12,11.3498
2015-11-13,11.4659
2015-11-16,11.195
2015-11-17,10.9738
2015-11-18,10.5868
2015-11-19,10.9241
2015-11-20,10.9075
2015-11-23,10.8356
2015-11-24,10.8854
2015-11-25,10.8356
2015-11-27,10.7859
2015-11-30,10.9462
2015-12-01,11.4437
2015-12-02,11.4603
2015-12-03,11.5543
2015-12-04,12.0021
2015-12-07,12.2232
2015-12-08,11.9524
2015-12-09,11.8694
2015-12-10,12.0187
2015-12-11,11.8252
2015-12-14,11.6981
2015-12-15,11.7754
2015-12-16,11.9524
2015-12-17,12.1182
2015-12-18,12.5439
2015-12-21,12.9088
2015-12-22,12.7761
2015-12-23,12.9364
2015-12-24,12.953
2015-12-28,13.1686
2015-12-29,13.3787
2015-12-30,13.2626
2015-12-31,13.3566
2016-01-04,13.0249
2016-01-05,12.9309
2016-01-06,12.8922
2016-01-07,12.8093
2016-01-08,12.7982
2016-01-11,12.8922
2016-01-12,12.6047
2016-01-13,12.6766
2016-01-14,12.5377
2016-01-15,12.6672
2016-01-19,13.0126
2016-01-20,13.0299
2016-01-21,13.5134
2016-01-22,13.8502
2016-01-25,14.0747
2016-01-26,14.3078
2016-01-27,14.0401
2016-01-28,14.2128
2016-01-29,14.5928
2016-02-01,14.8432
2016-02-02,14.5496
2016-02-03,14.5496
2016-02-04,14.3078
2016-02-05,13.997
2016-02-08,13.0731
2016-02-09,12.9522
2016-02-10,12.814
2016-02-11,13.168
2016-02-12,13.5652
2016-02-16,13.8761
2016-02-17,13.9365
2016-02-18,13.9711
2016-02-19,14.2301
2016-02-22,14.1006
2016-02-23,13.807
2016-02-24,13.6775
2016-02-25,14.161
2016-02-26,14.0833
2016-02-29,14.1697
2016-03-01,14.6705
2016-03-02,15.2404
2016-03-03,14.9036
2016-03-04,14.8173
2016-03-07,15.2663
2016-03-08,15.0072
2016-03-09,15.1281
2016-03-10,14.8432
2016-03-11,15.6894
2016-03-14,15.5081
2016-03-15,15.344
2016-03-16,15.3526
2016-03-17,15.439
2016-03-18,15.3785
2016-03-21,15.6117
2016-03-22,15.5858
2016-03-23,15.4217
2016-03-24,15.603
2016-03-28,15.77
2016-03-29,15.9209
2016-03-30,15.9735
2016-03-31,15.7109
2016-04-01,15.5271
2016-04-04,15.212
2016-04-05,15.2645
2016-04-06,15.3258
2016-04-07,15.5008
2016-04-08,15.6759
2016-04-11,15.6671
2016-04-12,15.6759
2016-04-13,15.7109
2016-04-14,15.9209
2016-04-15,15.7459
2016-04-18,15.9034
2016-04-19,15.9997
2016-04-20,15.8247
2016-04-21,15.3958
2016-04-22,15.5271
2016-04-25,15.7284
2016-04-26,15.5446
2016-04-27,15.6058
2016-04-28,15.7021
2016-04-29,15.5358
2016-05-02,15.7284
2016-05-03,16.026
2016-05-04,16.6124
2016-05-05,16.5424
2016-05-06,16.6474
2016-05-09,16.6562
2016-05-10,16.3761
2016-05-11,16.2798
2016-05-12,16.4198
2016-05-13,16.6649
2016-05-16,16.84
2016-05-17,16.6912
2016-05-18,16.5511
2016-05-19,16.5511
2016-05-20,16.5949
2016-05-23,16.7874
2016-05-24,16.98
2016-05-25,17.0325
2016-05-26,16.9012
2016-05-27,17.1025
2016-05-31,17.015
2016-06-01,16.7962
2016-06-02,16.8837
2016-06-03,17.2076
2016-06-06,17.3301
2016-06-07,17.4089
2016-06-08,17.5489
2016-06-09,17.6802
2016-06-10,17.6277
2016-06-13,17.5227
2016-06-14,17.2776
2016-06-15,17.5839
2016-06-16,17.5752
2016-06-17,17.5577
2016-06-20,17.4877
2016-06-21,17.5314
2016-06-22,17.4001
2016-06-23,17.1726
2016-06-24,17.1551
2016-06-27,17.1052
2016-06-28,17.7279
2016-06-29,17.9141
2016-06-30,18.2509
2016-07-01,18.3484
2016-07-05,18.5523
2016-07-06,18.5611
2016-07-07,18.3927
2016-07-08,18.5789
2016-07-11,18.8891
2016-07-12,18.898
2016-07-13,18.898
2016-07-14,18.508
2016-07-15,18.5168
2016-07-18,18.7296
2016-07-19,18.765
2016-07-20,18.8005
2016-07-21,18.9246
2016-07-22,19.0132
2016-07-25,19.0841
2016-07-26,18.9689
2016-07-27,18.9512
2016-07-28,18.9955
2016-07-29,19.2437
2016-08-01,19.2968
2016-08-02,18.9068
2016-08-03,18.9866
2016-08-04,18.6675
2016-08-05,18.9689
2016-08-08,19.1107
2016-08-09,19.1018
2016-08-10,19.1816
2016-08-11,19.1018
2016-08-12,19.3146
2016-08-15,19.1905
2016-08-16,18.8537
2016-08-17,18.765
2016-08-18,18.6232
2016-08-19,18.4016
2016-08-22,18.2598
2016-08-23,18.2598
2016-08-24,18.2775
2016-08-25,18.5168
2016-08-26,18.1357
2016-08-29,18.2952
2016-08-30,18.1091
2016-08-31,18.3573
2016-09-01,18.2509
2016-09-02,18.4814
2016-09-06,18.8802
2016-09-07,18.9423
2016-09-08,18.8714
2016-09-09,18.1357
2016-09-12,18.2864
2016-09-13,17.4177
2016-09-14,17.6836
2016-09-15,17.6925
2016-09-16,17.7368
2016-09-19,18.0559
2016-09-20,18.1889
2016-09-21,18.5877
2016-09-22,19.0043
2016-09-23,19.0841
2016-09-26,19.0309
2016-09-27,18.898
2016-09-28,19.2409
2016-09-29,18.9809
2016-09-30,19.1244
2016-10-03,18.945
2016-10-04,18.5864
2016-10-05,18.0753
2016-10-06,17.8691
2016-10-07,18.0395
2016-10-10,18.2278
2016-10-11,17.8691
2016-10-12,18.1291
2016-10-13,18.416
2016-10-14,18.3443
2016-10-17,18.4071
2016-10-18,18.5416
2016-10-19,18.6043
2016-10-20,18.7119
2016-10-21,18.6312
2016-10-24,18.8823
2016-10-25,18.7926
2016-10-26,18.4071
2016-10-27,17.905
2016-10-28,17.8153
2016-10-31,18.0036
2016-11-01,17.8871
2016-11-02,17.636
2016-11-03,17.2325
2016-11-04,17.2594
2016-11-07,17.0981
2016-11-08,17.2056
2016-11-09,16.4435
2016-11-10,15.9056
2016-11-11,16.4973
2016-11-14,16.5153
2016-11-15,16.7125
2016-11-16,16.7035
2016-11-17,16.6498
2016-11-18,16.7035
2016-11-21,16.6767
2016-11-22,17.0443
2016-11-23,17.0443
2016-11-25,17.2774
2016-11-28,17.4657
2016-11-29,17.627
2016-11-30,17.1967
2016-12-01,16.5332
2016-12-02,16.9994
2016-12-05,17.2325
2016-12-06,17.2325
2016-12-07,17.5643
2016-12-08,17.6988
2016-12-09,17.6181
2016-12-12,17.6001
2016-12-13,17.5912
2016-12-14,17.1967
2016-12-15,17.1787
2016-12-16,17.4477
2016-12-19,18.0036
2016-12-20,17.9498
2016-12-21,17.6001
2016-12-22,17.7974
2016-12-23,17.8871
2016-12-27,17.8153
2016-12-28,17.8176
2016-12-29,18.2533
2016-12-30,18.6254
2017-01-03,18.5346
2017-01-04,18.7434
2017-01-05,18.7071
2017-01-06,18.7525
2017-01-09,18.6254
2017-01-10,18.7434
2017-01-11,18.7616
2017-01-12,18.7616
2017-01-13,18.6526
2017-01-17,19.0611
2017-01-18,18.9885
2017-01-19,18.816
2017-01-20,18.9522
2017-01-23,19.1791
2017-01-24,19.0429
2017-01-25,19.1973
2017-01-26,19.3516
2017-01-27,19.524
2017-01-30,19.4242
2017-01-31,19.7963
2017-02-01,19.3697
2017-02-02,19.3152
2017-02-03,19.3697
2017-02-06,19.2608
2017-02-07,19.2063
2017-02-08,19.3697
2017-02-09,19.4423
2017-02-10,19.5966
2017-02-13,19.6148
2017-02-14,19.3788
2017-02-15,19.2971
2017-02-16,19.4242
2017-02-17,19.76
2017-02-21,20.0142
2017-02-22,19.9597
2017-02-23,20.114
2017-02-24,20.4135
2017-02-27,20.3954
2017-02-28,20.1322
2017-03-01,20.0958
2017-03-02,19.9325
2017-03-03,19.8508
2017-03-06,19.9415
2017-03-07,19.8235
2017-03-08,19.3152
2017-03-09,19.17
2017-03-10,19.0611
2017-03-13,19.052
2017-03-14,18.9976
2017-03-15,19.3788
2017-03-16,19.4968
2017-03-17,19.7963
2017-03-20,19.6874
2017-03-21,19.6148
2017-03-22,19.4968
2017-03-23,20.0323
2017-03-24,20.4135
2017-03-27,20.2048
2017-03-28,20.1412
2017-03-29,20.4831
2017-03-30,20.5932
2017-03-31,20.9511
2017-04-03,20.5289
2017-04-04,20.5748
2017-04-05,20.9236
2017-04-06,21.2998
2017-04-07,21.1622
2017-04-10,21.1989
2017-04-11,21.5201
2017-04-12,21.2356
2017-04-13,21.3365
2017-04-17,21.621
2017-04-18,21.8137
2017-04-19,21.8504
2017-04-20,21.6485
2017-04-21,21.5935
2017-04-24,21.2998
2017-04-25,21.6027
2017-04-26,21.8963
2017-04-27,21.8688
2017-04-28,21.4099
2017-05-01,21.465
2017-05-02,21.4742
2017-05-03,21.0612
2017-05-04,20.272
2017-05-05,20.6941
2017-05-08,20.4555
2017-05-09,20.1802
2017-05-10,20.4464
2017-05-11,20.2169
2017-05-12,20.3729
2017-05-15,20.5932
2017-05-16,20.8593
2017-05-17,21.3732
2017-05-18,21.3549
2017-05-19,21.8229
2017-05-22,22.1992
2017-05-23,22.19
2017-05-24,22.0982
2017-05-25,22.2726
2017-05-26,22.4469
2017-05-30,22.3644
2017-05-31,22.5938
2017-06-01,23.0526
2017-06-02,23.3555
2017-06-05,23.1903
2017-06-06,23.1811
2017-06-07,23.2912
2017-06-08,23.2086
2017-06-09,23.3279
2017-06-12,23.695
2017-06-13,23.3646
2017-06-14,23.4748
2017-06-15,23.5757
2017-06-16,23.4564
2017-06-19,23.3371
2017-06-20,23.2821
2017-06-21,23.3188
2017-06-22,23.3555
2017-06-23,23.7225
2017-06-26,23.6491
2017-06-27,23.6032
2017-06-28,23.6426
2017-06-29,23.1145
2017-06-30,23.2628
2017-07-03,23.3832
2017-07-05,23.3184
2017-07-06,23.0682
2017-07-07,23.3832
2017-07-10,22.9293
2017-07-11,23.1331
2017-07-12,23.3369
2017-07-13,23.0497
2017-07-14,23.2535
2017-07-17,23.4017
2017-07-18,23.3276
2017-07-19,23.6333
2017-07-20,23.411
2017-07-21,23.4203
2017-07-24,23.3276
2017-07-25,23.3832
2017-07-26,23.763
2017-07-27,23.3554
2017-07-28,23.726
2017-07-31,23.5129
2017-08-01,23.4573
2017-08-02,23.0404
2017-08-03,22.5031
2017-08-04,22.4938
2017-08-07,22.5772
2017-08-08,22.4568
2017-08-09,22.3919
2017-08-10,22.2807
2017-08-11,22.1418
2017-08-14,22.4475
2017-08-15,22.8181
2017-08-16,23.3184
2017-08-17,23.1053
2017-08-18,23.1516
2017-08-21,23.4388
2017-08-22,23.5222
2017-08-23,23.4573
2017-08-24,23.4759
2017-08-25,23.4851
2017-08-28,23.3554
2017-08-29,23.2442
2017-08-30,23.3276
2017-08-31,23.5407
2017-09-01,23.5592
2017-09-05,23.6519
2017-09-06,23.5036
2017-09-07,23.3832
2017-09-08,23.272
2017-09-11,23.4851
2017-09-12,23.2257
2017-09-13,23.2257
2017-09-14,23.3739
2017-09-15,23.5963
2017-09-18,23.272
2017-09-19,23.4388
2017-09-20,23.4481
2017-09-21,23.4573
2017-09-22,23.3369
2017-09-25,23.235
2017-09-26,22.9756
2017-09-27,22.7532
2017-09-28,23.3357
2017-09-29,23.317
2017-10-02,23.5603
2017-10-03,23.9158
2017-10-04,23.8784
2017-10-05,23.8877
2017-10-06,23.7567
2017-10-09,23.6632
2017-10-10,23.7287
2017-10-11,23.7942
2017-10-12,23.5509
2017-10-13,23.6164
2017-10-16,23.8877
2017-10-17,23.8129
2017-10-18,23.7006
2017-10-19,23.6258
2017-10-20,23.4573
2017-10-23,23.0176
2017-10-24,23.0363
2017-10-25,22.5684
2017-10-26,22.8117
2017-10-27,23.186
2017-10-30,23.0456
2017-10-31,23.0924
2017-11-01,23.1111
2017-11-02,23.345
2017-11-03,23.7474
2017-11-06,23.7006
2017-11-07,24.2339
2017-11-08,24.4959
2017-11-09,24.4117
2017-11-10,24.1591
2017-11-13,24.2059
2017-11-14,24.4211
2017-11-15,24.3556
2017-11-16,24.524
2017-11-17,24.5708
2017-11-20,24.4398
2017-11-21,24.9357
2017-11-22,24.8889
2017-11-24,24.8515
2017-11-27,24.7579
2017-11-28,24.7953
2017-11-29,24.7486
2017-11-30,24.4211
2017-12-01,24.3556
2017-12-04,24
2017-12-05,23.7942
2017-12-06,23.71
2017-12-07,23.71
2017-12-08,23.7287
2017-12-11,24.0374
2017-12-12,24.1497
2017-12-13,24.4585
2017-12-14,24.4398
2017-12-15,24.8983
2017-12-18,24.9263
2017-12-19,24.6176
2017-12-20,24.1404
2017-12-21,23.869
2017-12-22,23.9065
2017-12-26,23.9813
2017-12-27,24.2246
2017-12-28,24.4847
2017-12-29,24.305
2018-01-02,24.2293
2018-01-03,24.3239
2018-01-04,24.0402
2018-01-05,23.8889
2018-01-08,24.0402
2018-01-09,23.7659
2018-01-10,23.1607
2018-01-11,23.0377
2018-01-12,22.7918
2018-01-16,22.8675
2018-01-17,23.0472
2018-01-18,22.4608
2018-01-19,22.3946
2018-01-22,22.8202
2018-01-23,23.0945
2018-01-24,22.8013
2018-01-25,22.8675
2018-01-26,22.8391
2018-01-29,22.3568
2018-01-30,22.1866
2018-01-31,22.319
2018-02-01,21.8083
2018-02-02,21.6948
2018-02-05,21.203
2018-02-06,21.2881
2018-02-07,21.2125
2018-02-08,20.5883
2018-02-09,21.0233
2018-02-12,21.2692
2018-02-13,21.3732
2018-02-14,20.9666
2018-02-15,21.0422
2018-02-16,21.1274
2018-02-20,20.5032
2018-02-21,20.1722
2018-02-22,20.2951
2018-02-23,20.541
2018-02-26,20.4464
2018-02-27,20.5978
2018-02-28,20.768
2018-03-01,20.9288
2018-03-02,21.0612
2018-03-05,20.8531
2018-03-06,21.099
2018-03-07,21.4016
2018-03-08,21.4016
2018-03-09,21.2125
2018-03-12,21.2503
2018-03-13,21.2787
2018-03-14,21.2503
2018-03-15,21.0612
2018-03-16,21.4016
2018-03-19,21.2219
2018-03-20,21.2125
2018-03-21,21.3354
2018-03-22,21.1936
2018-03-23,20.9288
2018-03-26,21.0422
2018-03-27,21.099
2018-03-28,21.9272
2018-03-29,22.1092
2018-04-02,21.6591
2018-04-03,21.7166
2018-04-04,22.0804
2018-04-05,22.1283
2018-04-06,21.9751
2018-04-09,22.0517
2018-04-10,21.9751
2018-04-11,21.9847
2018-04-12,21.4006
2018-04-13,21.5251
2018-04-16,21.8794
2018-04-17,22.1762
2018-04-18,22.0326
2018-04-19,21.6974
2018-04-20,21.4197
2018-04-23,21.2665
2018-04-24,21.3527
2018-04-25,21.5155
2018-04-26,21.7453
2018-04-27,21.9177
2018-04-30,21.6974
2018-05-01,21.7549
2018-05-02,21.6974
2018-05-03,21.6591
2018-05-04,21.7932
2018-05-07,21.9272
2018-05-08,21.8123
2018-05-09,22.09
2018-05-10,22.1858
2018-05-11,22.0421
2018-05-14,21.5538
2018-05-15,21.008
2018-05-16,21.1421
2018-05-17,21.1038
2018-05-18,21.1229
2018-05-21,21.3527
2018-05-22,21.257
2018-05-23,21.5347
2018-05-24,21.4485
2018-05-25,21.5155
2018-05-29,21.6113
2018-05-30,21.8219
2018-05-31,21.9177
2018-06-01,21.9081
2018-06-04,22.0038
2018-06-05,22.0421
2018-06-06,21.9272
2018-06-07,21.8985
2018-06-08,21.8794
2018-06-11,21.774
2018-06-12,22.0421
2018-06-13,21.8315
2018-06-14,22.0134
2018-06-15,22.2049
2018-06-18,22.0709
2018-06-19,21.8794
2018-06-20,22.2719
2018-06-21,22.5017
2018-06-22,22.9135
2018-06-25,23.2678
2018-06-26,23.7657
2018-06-27,23.6986
2018-06-28,24.0133
2018-06-29,23.8487
2018-07-02,23.8971
2018-07-03,24.2845
2018-07-05,24.6234
2018-07-06,24.6814
2018-07-09,24.1586
2018-07-10,24.0327
2018-07-11,24.1586
2018-07-12,24.1392
2018-07-13,24.0908
2018-07-16,24.023
2018-07-17,23.8681
2018-07-18,23.9262
2018-07-19,24.3038
2018-07-20,24.0714
2018-07-23,23.9068
2018-07-24,23.8681
2018-07-25,23.9552
2018-07-26,24.1005
2018-07-27,23.9746
2018-07-30,24.1876
2018-07-31,24.1102
2018-08-01,24.3329
2018-08-02,24.9526
2018-08-03,25.1365
2018-08-06,25.2915
2018-08-07,25.2624
2018-08-08,25.2334
2018-08-09,25.3399
2018-08-10,25.185
2018-08-13,25.185
2018-08-14,25.64
2018-08-15,25.8724
2018-08-16,26.1048
2018-08-17,26.3372
2018-08-20,26.3759
2018-08-21,26.1726
2018-08-22,26.1145
2018-08-23,25.8531
2018-08-24,26.0758
2018-08-27,26.0564
2018-08-28,26.2016
2018-08-29,26.2113
2018-08-30,26.1145
2018-08-31,26.0855
2018-09-04,25.9693
2018-09-05,25.9402
2018-09-06,25.9499
2018-09-07,25.6304
2018-09-10,25.6691
2018-09-11,25.6013
2018-09-12,25.611
2018-09-13,25.5529
2018-09-14,25.4367
2018-09-17,25.3302
2018-09-18,25.3108
2018-09-19,24.7105
2018-09-20,25.1559
2018-09-21,24.8751
2018-09-24,24.4587
2018-09-25,24.9332
2018-09-26,24.236
2018-09-27,24.7696
2018-09-28,25.1514
2018-10-01,24.7794
2018-10-02,24.7011
2018-10-03,24.5151
2018-10-04,24.427
2018-10-05,24.4367
2018-10-08,25.0731
2018-10-09,25.2787
2018-10-10,24.9067
2018-10-11,24.5934
2018-10-12,24.3291
2018-10-15,24.4759
2018-10-16,25.3277
2018-10-17,25.3962
2018-10-18,25.2102
2018-10-19,25.2689
2018-10-22,25.1906
2018-10-23,25.2493
2018-10-24,25.7291
2018-10-25,26.199
2018-10-26,25.5822
2018-10-29,25.9249
2018-10-30,26.3654
2018-10-31,25.5333
2018-11-01,25.6116
2018-11-02,25.4256
2018-11-05,25.7487
2018-11-06,25.9445
2018-11-07,26.571
2018-11-08,26.5906
2018-11-09,26.4536
2018-11-12,26.4927
2018-11-13,26.4634
2018-11-14,26.1305
2018-11-15,25.9836
2018-11-16,26.3557
2018-11-19,26.2578
2018-11-20,26.385
2018-11-21,26.2578
2018-11-23,26.5025
2018-11-26,26.2578
2018-11-27,26.3948
2018-11-28,26.7473
2018-11-29,27.1291
2018-11-30,27.1585
2018-12-03,27.3347
2018-12-04,26.9333
2018-12-06,27.7851
2018-12-07,27.648
2018-12-10,27.0704
2018-12-11,27.178
2018-12-12,26.8843
2018-12-13,26.9529
2018-12-14,26.8158
2018-12-17,25.9836
2018-12-18,26.5319
2018-12-19,26.4242
2018-12-20,26.1207
2018-12-21,25.778
2018-12-24,24.8088
2018-12-26,25.592
2018-12-27,25.3864
2018-12-28,25.4843
2018-12-31,25.6508
2019-01-02,24.8186
2019-01-03,25.0439
2019-01-04,25.0439
2019-01-07,25.0835
2019-01-08,25.5984
2019-01-09,25.5885
2019-01-10,25.7767
2019-01-11,26.0539
2019-01-14,25.7568
2019-01-15,26.252
2019-01-16,26.3609
2019-01-17,26.3411
2019-01-18,26.1827
2019-01-22,26.4104
2019-01-23,26.3312
2019-01-24,26.5887
2019-01-25,26.8263
2019-01-28,27.1432
2019-01-29,27.3908
2019-01-30,27.5591
2019-01-31,27.9651
2019-02-01,27.5393
2019-02-04,27.7869
2019-02-05,27.975
2019-02-06,27.8166
2019-02-07,28.0642
2019-02-08,28.1632
2019-02-11,28.2919
2019-02-12,27.9057
2019-02-13,27.8067
2019-02-14,27.7869
2019-02-15,27.5888
2019-02-19,27.371
2019-02-20,27.3413
2019-02-21,27.2224
2019-02-22,27.5888
2019-02-25,27.3413
2019-02-26,27.1927
2019-02-27,27.0739
2019-02-28,27.1234
2019-03-01,27.3512
2019-03-04,27.6879
2019-03-05,27.7077
2019-03-06,27.7869
2019-03-07,27.6483
2019-03-08,27.9255
2019-03-11,28.4009
2019-03-12,28.6385
2019-03-13,28.7475
2019-03-14,28.7673
2019-03-15,28.1929
2019-03-18,28.0741
2019-03-19,28.0246
2019-03-20,28.0543
2019-03-21,28.9257
2019-03-22,28.6682
2019-03-25,28.8465
2019-03-26,29.1238
2019-03-27,29.2525
2019-03-28,29.6
2019-03-29,29.6
2019-04-01,29.33
2019-04-02,29.67
2019-04-03,29.34
2019-04-04,29.15
2019-04-05,29.47
2019-04-08,29.16
2019-04-09,28.81
2019-04-10,29.26
2019-04-11,29.11
2019-04-12,28.91
2019-04-15,28.97
2019-04-16,28.06
2019-04-17,27.69
2019-04-18,28.18
2019-04-22,27.76
2019-04-23,28.31
2019-04-24,28.12
2019-04-25,28.18
2019-04-26,28.29
2019-04-29,28.19
2019-04-30,28.44
2019-05-01,28.3
2019-05-02,28.56
2019-05-03,28.78
2019-05-06,28.96
2019-05-07,28.44
2019-05-08,28.57
2019-05-09,28.65
2019-05-10,28.84
2019-05-13,29.12
2019-05-14,29.01
2019-05-15,28.95
2019-05-16,29.18
2019-05-17,29.23
2019-05-20,28.95
2019-05-21,29.2
2019-05-22,29.17
2019-05-23,29.18
2019-05-24,29.19
2019-05-28,28.99
2019-05-29,28.63
2019-05-30,28.75
2019-05-31,28.76
2019-06-03,28.4
2019-06-04,28.19
2019-06-05,28.78
2019-06-06,28.61
2019-06-07,28.3
2019-06-10,27.92
2019-06-11,27.82
2019-06-12,28.22
2019-06-13,28.27
2019-06-14,28.54
2019-06-17,28.7
2019-06-18,28.48
2019-06-19,28.755
2019-06-20,28.705
2019-06-21,28.405
2019-06-24,28.075
2019-06-25,28.245
2019-06-26,27.25
2019-06-27,27.15
2019-06-28,27.55
2019-07-01,26.97
2019-07-02,27.625
2019-07-03,27.92
2019-07-04,27.92
2019-07-05,27.82
2019-07-08,27.815
2019-07-09,27.89
2019-07-10,28.04
2019-07-11,27.815
2019-07-12,27.76
2019-07-15,27.74
2019-07-16,27.335
2019-07-17,27.195
2019-07-18,27.245
2019-07-19,26.715
2019-07-22,26.735
2019-07-23,26.95
2019-07-24,27.22
2019-07-25,26.895
2019-07-26,27.08
2019-07-29,27.15
2019-07-30,26.985
2019-07-31,27
2019-08-01,27.015
2019-08-02,27.035
2019-08-05,26.845
2019-08-06,27.09
2019-08-07,27.405
2019-08-08,27.73
2019-08-09,27.665
2019-08-12,27.555
2019-08-13,27.69
2019-08-14,27.495
2019-08-15,27.905
2019-08-16,28.02
2019-08-19,28.21
2019-08-20,27.78
2019-08-21,27.935
2019-08-22,28.16
2019-08-23,27.84
2019-08-26,28
2019-08-27,27.855
2019-08-28,27.995
2019-08-29,28.56
2019-08-30,28.515
2019-09-02,28.48
2019-09-03,28.74
2019-09-04,29.205
2019-09-05,28.685
2019-09-06,28.945
2019-09-09,28.855
2019-09-10,28.585
2019-09-11,28.53
2019-09-12,28.58
2019-09-13,28.23
2019-09-16,28.415
2019-09-17,28.75
2019-09-18,28.45
2019-09-19,28.505
2019-09-20,28.49
2019-09-23,28.22
2019-09-24,28.065
2019-09-25,28.205
2019-09-26,28.32
2019-09-27,28.005
2019-09-30,28.34
2019-10-01,28.075
2019-10-02,28.415
2019-10-03,28.65
2019-10-04,28.885
2019-10-07,29.015
2019-10-08,28.88
2019-10-09,28.965
2019-10-10,28.67
2019-10-11,28.46
2019-10-14,28.31
2019-10-15,28.11
2019-10-16,27.96
2019-10-17,28.12
2019-10-18,28.245
2019-10-21,28.345
2019-10-22,28.225
2019-10-23,28.405
2019-10-24,28.53
2019-10-25,28.225
2019-10-28,28.4
2019-10-29,28.415
2019-10-30,28.655
2019-10-31,28.65
2019-11-01,28.53
2019-11-04,28.41
2019-11-05,27.36
2019-11-06,27.435
2019-11-07,27.215
2019-11-08,27.095
2019-11-11,27.15
2019-11-12,26.955
2019-11-13,27.185
2019-11-14,27.585
2019-11-15,27.81
2019-11-18,27.95
2019-11-19,27.905
2019-11-20,28.08
2019-11-21,27.795
2019-11-22,27.7
2019-11-25,27.755
