date,close
2014-11-05,22.9408
2014-11-06,23.1209
2014-11-07,22.9736
2014-11-10,23.1618
2014-11-11,23.2191
2014-11-12,23.7347
2014-11-13,23.4482
2014-11-14,23.6201
2014-11-17,23.0881
2014-11-18,23.1209
2014-11-19,23.1291
2014-11-20,23.039
2014-11-21,22.9244
2014-11-24,22.9408
2014-11-25,22.8917
2014-11-26,22.8917
2014-11-28,22.6625
2014-12-01,21.9587
2014-12-02,22.9081
2014-12-03,23.4564
2014-12-04,22.8753
2014-12-05,22.7117
2014-12-08,21.2467
2014-12-09,20.9602
2014-12-10,19.9944
2014-12-11,20.461
2014-12-12,20.5428
2014-12-15,19.6998
2014-12-16,19.6916
2014-12-17,19.5607
2014-12-18,19.9371
2014-12-19,19.9044
2014-12-22,19.0942
2014-12-23,18.955
2014-12-24,19.3479
2014-12-26,19.7162
2014-12-29,21.2548
2014-12-30,22.106
2014-12-31,22.507
2015-01-02,22.4334
2015-01-05,20.862
2015-01-06,20.2645
2015-01-07,19.6261
2015-01-08,19.6343
2015-01-09,19.1105
2015-01-12,18.6358
2015-01-13,17.7765
2015-01-14,17.0153
2015-01-15,17.9811
2015-01-16,18.3412
2015-01-20,18.2266
2015-01-21,18.5131
2015-01-22,18.1611
2015-01-23,18.423
2015-01-26,19.2497
2015-01-27,19.0123
2015-01-28,18.5294
2015-01-29,18.8568
2015-01-30,19.1924
2015-02-02,19.7653
2015-02-03,20.0927
2015-02-04,20.0108
2015-02-05,19.9944
2015-02-06,20.0763
2015-02-09,19.6425
2015-02-10,19.4706
2015-02-11,19.2359
2015-02-12,19.581
2015-02-13,20.1069
2015-02-17,20.337
2015-02-18,20.2301
2015-02-19,20.2301
2015-02-20,20.6903
2015-02-23,21.1093
2015-02-24,20.9861
2015-02-25,20.8628
2015-02-26,21.2819
2015-02-27,21.3641
2015-03-02,21.3805
2015-03-03,21.4627
2015-03-04,21.4052
2015-03-05,21.4627
2015-03-06,21.3559
2015-03-09,21.4052
2015-03-10,20.2055
2015-03-11,20.5506
2015-03-12,20.1973
2015-03-13,20.0083
2015-03-16,20.1233
2015-03-17,20.5588
2015-03-18,20.4191
2015-03-19,20.5424
2015-03-20,20.7067
2015-03-23,20.2384
2015-03-24,19.7207
2015-03-25,19.8522
2015-03-26,20.0247
2015-03-27,19.9754
2015-03-30,19.9672
2015-03-31,19.8768
2015-04-01,20.0658
2015-04-02,20.1562
2015-04-06,20.4849
2015-04-07,19.9425
2015-04-08,20.8135
2015-04-09,20.2712
2015-04-10,20.7067
2015-04-13,20.5752
2015-04-14,20.6246
2015-04-15,20.6903
2015-04-16,20.7642
2015-04-17,20.6821
2015-04-20,20.5342
2015-04-21,20.5999
2015-04-22,20.6328
2015-04-23,20.5424
2015-04-24,20.5835
2015-04-27,20.6739
2015-04-28,20.0987
2015-04-29,20.6163
2015-04-30,20.5424
2015-05-01,20.8793
2015-05-04,20.8875
2015-05-05,21.0765
2015-05-06,21.2655
2015-05-07,21.2573
2015-05-08,21.6434
2015-05-11,21.3456
2015-05-12,21.5111
2015-05-13,21.9165
2015-05-14,22.4212
2015-05-15,22.1895
2015-05-18,22.264
2015-05-19,22.2557
2015-05-20,21.9496
2015-05-21,22.3136
2015-05-22,22.5122
2015-05-26,22.5453
2015-05-27,22.8928
2015-05-28,23.4967
2015-05-29,23.5795
2015-06-01,23.5795
2015-06-02,23.9931
2015-06-03,24.1917
2015-06-04,23.8773
2015-06-05,23.9931
2015-06-08,23.3726
2015-06-09,23.7615
2015-06-10,23.7201
2015-06-11,24.0676
2015-06-12,24.2082
2015-06-15,23.9269
2015-06-16,24.0676
2015-06-17,24.0014
2015-06-18,24.2662
2015-06-19,23.869
2015-06-22,23.8111
2015-06-23,23.9683
2015-06-24,23.9269
2015-06-25,23.9269
2015-06-26,24.1421
2015-06-29,23.7284
2015-06-30,23.6953
2015-07-01,23.1658
2015-07-02,23.6456
2015-07-06,23.5381
2015-07-07,23.1823
2015-07-08,23.0748
2015-07-09,23.2651
2015-07-10,23.1327
2015-07-13,23.1161
2015-07-14,23.2402
2015-07-15,22.9176
2015-07-16,23.0582
2015-07-17,22.9093
2015-07-20,21.9248
2015-07-21,21.7179
2015-07-22,21.5773
2015-07-23,22.1812
2015-07-24,22.628
2015-07-27,22.6776
2015-07-28,22.8017
2015-07-29,23.3809
2015-07-30,23.2402
2015-07-31,22.0737
2015-08-03,21.5524
2015-08-04,21.0643
2015-08-05,19.8729
2015-08-06,19.1862
2015-08-07,18.6733
2015-08-10,19.1614
2015-08-11,18.7944
2015-08-12,19.1781
2015-08-13,19.0113
2015-08-14,18.786
2015-08-17,18.3606
2015-08-18,18.102
2015-08-19,18.152
2015-08-20,18.5274
2015-08-21,18.2271
2015-08-24,18.0186
2015-08-25,18.394
2015-08-26,18.4941
2015-08-27,19.2782
2015-08-28,19.2198
2015-08-31,19.3199
2015-09-01,18.8528
2015-09-02,19.0947
2015-09-03,18.8111
2015-09-04,19.0029
2015-09-08,18.7944
2015-09-09,18.5358
2015-09-10,18.2688
2015-09-11,17.4763
2015-09-14,17.2678
2015-09-15,17.3095
2015-09-16,17.126
2015-09-17,16.9007
2015-09-18,17.5181
2015-09-21,17.418
2015-09-22,17.0009
2015-09-23,16.4753
2015-09-24,16.2501
2015-09-25,16.0082
2015-09-28,15.491
2015-09-29,14.1062
2015-09-30,14.8987
2015-10-01,15.3825
2015-10-02,16.3835
2015-10-05,17.6766
2015-10-06,18.2688
2015-10-07,18.6859
2015-10-08,19.2115
2015-10-09,19.9122
2015-10-12,19.8371
2015-10-13,20.5211
2015-10-14,20.6379
2015-10-15,21.1635
2015-10-16,21.0884
2015-10-19,20.6463
2015-10-20,20.4127
2015-10-21,20.079
2015-10-22,19.6369
2015-10-23,19.2281
2015-10-26,18.6442
2015-10-27,18.0603
2015-10-28,18.3522
2015-10-29,19.4784
2015-10-30,19.8705
2015-11-02,19.2615
2015-11-03,20.3877
2015-11-04,19.7704
2015-11-05,19.5702
2015-11-06,19.6249
2015-11-09,19.7174
2015-11-10,19.6164
2015-11-11,19.4734
2015-11-12,19.1536
2015-11-13,19.1199
2015-11-16,19.7763
2015-11-17,19.5912
2015-11-18,19.7848
2015-11-19,19.4145
2015-11-20,18.7917
2015-11-23,18.7412
2015-11-24,19.0779
2015-11-25,19.2882
2015-11-27,18.9685
2015-11-30,18.8675
2015-12-01,18.8422
2015-12-02,17.9754
2015-12-03,17.5799
2015-12-04,17.4032
2015-12-07,17.1591
2015-12-08,17.7061
2015-12-09,18.9769
2015-12-10,18.6487
2015-12-11,17.5799
2015-12-14,15.8716
2015-12-15,15.8968
2015-12-16,16.3849
2015-12-17,16.1745
2015-12-18,16.6205
2015-12-21,16.6626
2015-12-22,18.3036
2015-12-23,19.0358
2015-12-24,18.6487
2015-12-28,18.4467
2015-12-29,18.0932
2015-12-30,17.7987
2015-12-31,19.2041
2016-01-04,18.4635
2016-01-05,18.5982
2016-01-06,17.7146
2016-01-07,16.6626
2016-01-08,17.2685
2016-01-11,16.0988
2016-01-12,16.4017
2016-01-13,16.8898
2016-01-14,17.5799
2016-01-15,17.1844
2016-01-19,15.6948
2016-01-20,14.7102
2016-01-21,14.6429
2016-01-22,16.8393
2016-01-25,16.5027
2016-01-26,16.6879
2016-01-27,16.6542
2016-01-28,16.7552
2016-01-29,16.7131
2016-02-01,17.176
2016-02-02,16.427
2016-02-03,16.427
2016-02-04,17.4958
2016-02-05,17.2096
2016-02-08,17.1844
2016-02-09,17.3443
2016-02-10,18.314
2016-02-11,16.247
2016-02-12,16.366
2016-02-16,16.8424
2016-02-17,17.3102
2016-02-18,16.6638
2016-02-19,16.5957
2016-02-22,17.3783
2016-02-23,16.9615
2016-02-24,17.2507
2016-02-25,17.5144
2016-02-26,19.0455
2016-02-29,18.9009
2016-03-01,18.7903
2016-03-02,19.003
2016-03-03,19.1476
2016-03-04,19.0455
2016-03-07,19.3092
2016-03-08,18.6032
2016-03-09,19.1986
2016-03-10,19.2837
2016-03-11,19.726
2016-03-14,20.5511
2016-03-15,21.1721
2016-03-16,21.5464
2016-03-17,21.9632
2016-03-18,21.6654
2016-03-21,22.0312
2016-03-22,22.2694
2016-03-23,21.2401
2016-03-24,18.5096
2016-03-28,18.6032
2016-03-29,18.3395
2016-03-30,18.7223
2016-03-31,18.8073
2016-04-01,18.5522
2016-04-04,18.1098
2016-04-05,17.625
2016-04-06,17.8376
2016-04-07,17.659
2016-04-08,17.8631
2016-04-11,18.1013
2016-04-12,18.6457
2016-04-13,18.4926
2016-04-14,18.4841
2016-04-15,18.0673
2016-04-18,18.9434
2016-04-19,20.0833
2016-04-20,20.7213
2016-04-21,20.6532
2016-04-22,20.8574
2016-04-25,20.7383
2016-04-26,20.347
2016-04-27,21.0105
2016-04-28,21.5804
2016-04-29,21.725
2016-05-02,20.5341
2016-05-03,20.6362
2016-05-04,20.7723
2016-05-05,20.7978
2016-05-06,20.9594
2016-05-09,20.603
2016-05-10,20.7662
2016-05-11,20.9551
2016-05-12,20.7662
2016-05-13,20.5772
2016-05-16,20.1736
2016-05-17,20.5601
2016-05-18,20.0791
2016-05-19,20.9036
2016-05-20,20.9895
2016-05-23,20.9981
2016-05-24,20.4227
2016-05-25,20.9465
2016-05-26,21.0496
2016-05-27,21.4704
2016-05-31,21.1269
2016-06-01,21.1956
2016-06-02,21.4017
2016-06-03,21.2643
2016-06-06,21.4532
2016-06-07,21.5992
2016-06-08,21.2042
2016-06-09,20.8521
2016-06-10,21.771
2016-06-13,22.209
2016-06-14,22.0544
2016-06-15,21.0839
2016-06-16,21.6594
2016-06-17,22.4323
2016-06-20,22.2519
2016-06-21,22.3808
2016-06-22,22.1317
2016-06-23,22.5611
2016-06-24,21.5477
2016-06-27,21.625
2016-06-28,22.3206
2016-06-29,23.1795
2016-06-30,23.9352
2016-07-01,23.6604
2016-07-05,23.3169
2016-07-06,23.2568
2016-07-07,22.9991
2016-07-08,23.7377
2016-07-11,23.7205
2016-07-12,23.8407
2016-07-13,22.9991
2016-07-14,23.1279
2016-07-15,23.4113
2016-07-18,23.5573
2016-07-19,23.7463
2016-07-20,23.2911
2016-07-21,23.085
2016-07-22,22.9304
2016-07-25,22.6642
2016-07-26,22.5096
2016-07-27,22.1145
2016-07-28,21.8139
2016-07-29,21.8311
2016-08-01,21.7796
2016-08-02,21.6851
2016-08-03,21.8311
2016-08-04,21.7366
2016-08-05,21.8311
2016-08-08,22.1
2016-08-09,21.8138
2016-08-10,21.8658
2016-08-11,21.7444
2016-08-12,22.0827
2016-08-15,23.0281
2016-08-16,23.0541
2016-08-17,23.002
2016-08-18,23.5918
2016-08-19,23.4878
2016-08-22,23.0888
2016-08-23,23.3577
2016-08-24,23.2189
2016-08-25,23.323
2016-08-26,23.8173
2016-08-29,23.9041
2016-08-30,24.0429
2016-08-31,23.9041
2016-09-01,24.0168
2016-09-02,24.0689
2016-09-06,24.0515
2016-09-07,24.0255
2016-09-08,23.9388
2016-09-09,23.401
2016-09-12,23.401
2016-09-13,22.3429
2016-09-14,22.0913
2016-09-15,21.8224
2016-09-16,21.7184
2016-09-19,22.1347
2016-09-20,22.1781
2016-09-21,23.1408
2016-09-22,23.2015
2016-09-23,22.8026
2016-09-26,23.2362
2016-09-27,22.5163
2016-09-28,22.6898
2016-09-29,22.5337
2016-09-30,23.1582
2016-10-03,23.0714
2016-10-04,23.0888
2016-10-05,23.1582
2016-10-06,22.9413
2016-10-07,22.9587
2016-10-10,23.4878
2016-10-11,23.323
2016-10-12,23.748
2016-10-13,24.2163
2016-10-14,24.4245
2016-10-17,24.8321
2016-10-18,25.5954
2016-10-19,25.7255
2016-10-20,26.1592
2016-10-21,26.3587
2016-10-24,24.7628
2016-10-25,25.1878
2016-10-26,25.2571
2016-10-27,26.6796
2016-10-28,25.951
2016-10-31,25.2745
2016-11-01,24.5633
2016-11-02,24.2597
2016-11-03,24.0862
2016-11-04,24.0776
2016-11-07,23.9561
2016-11-08,24.2495
2016-11-09,25.2041
2016-11-10,24.9676
2016-11-11,24.4859
2016-11-14,24.7399
2016-11-15,26.0273
2016-11-16,25.4668
2016-11-17,25.0114
2016-11-18,25.3792
2016-11-21,26.614
2016-11-22,25.9922
2016-11-23,25.9835
2016-11-25,25.9047
2016-11-28,25.3091
2016-11-29,24.3984
2016-11-30,24.6698
2016-12-01,25.2041
2016-12-02,25.0289
2016-12-05,24.9413
2016-12-06,25.0902
2016-12-07,24.6961
2016-12-08,25.0201
2016-12-09,25.1953
2016-12-12,25.0902
2016-12-13,24.8187
2016-12-14,24.5122
2016-12-15,24.4684
2016-12-16,24.521
2016-12-19,25.3617
2016-12-20,25.2566
2016-12-21,25.9047
2016-12-22,26.7103
2016-12-23,26.938
2016-12-27,27.2708
2016-12-28,27.0344
2016-12-29,27.1044
2016-12-30,27.0431
2017-01-03,26.7716
2017-01-04,27.3847
2017-01-05,28.024
2017-01-06,29.3814
2017-01-09,29.1712
2017-01-10,28.4618
2017-01-11,28.637
2017-01-12,29.2763
2017-01-13,29.3551
2017-01-17,29.2413
2017-01-18,29.7492
2017-01-19,29.539
2017-01-20,29.5828
2017-01-23,29.285
2017-01-24,29.7842
2017-01-25,30.1871
2017-01-26,30.4148
2017-01-27,30.3535
2017-01-30,29.6648
2017-01-31,29.5942
2017-02-01,29.8414
2017-02-02,30.2122
2017-02-03,29.8061
2017-02-06,29.9208
2017-02-07,31.0244
2017-02-08,30.9979
2017-02-09,31.2098
2017-02-10,31.3334
2017-02-13,30.9891
2017-02-14,30.9626
2017-02-15,31.1569
2017-02-16,30.9185
2017-02-17,31.0421
2017-02-21,30.9273
2017-02-22,30.6978
2017-02-23,30.636
2017-02-24,30.2563
2017-02-27,30.6801
2017-02-28,30.2828
2017-03-01,30.8479
2017-03-02,30.945
2017-03-03,30.7066
2017-03-06,30.7772
2017-03-07,30.8302
2017-03-08,30.892
2017-03-09,30.839
2017-03-10,30.8655
2017-03-13,31.2628
2017-03-14,30.6448
2017-03-15,30.8214
2017-03-16,30.6536
2017-03-17,30.4417
2017-03-20,30.3623
2017-03-21,30.1151
2017-03-22,29.9208
2017-03-23,29.7266
2017-03-24,29.6118
2017-03-27,29.1351
2017-03-28,28.7378
2017-03-29,28.7643
2017-03-30,29.1174
2017-03-31,29.2763
2017-04-03,29.3911
2017-04-04,29.6913
2017-04-05,29.6295
2017-04-06,29.859
2017-04-07,29.3911
2017-04-10,29.4617
2017-04-11,29.4794
2017-04-12,29.1439
2017-04-13,28.6318
2017-04-17,28.985
2017-04-18,28.985
2017-04-19,28.7378
2017-04-20,28.8437
2017-04-21,28.7378
2017-04-24,28.8084
2017-04-25,29.2145
2017-04-26,29.8149
2017-04-27,29.7884
2017-04-28,30.0356
2017-05-01,30.6235
2017-05-02,30.4364
2017-05-03,30.0801
2017-05-04,29.1983
2017-05-05,29.8664
2017-05-08,29.8931
2017-05-09,29.8307
2017-05-10,30.3919
2017-05-11,30.4275
2017-05-12,30.7215
2017-05-15,30.9531
2017-05-16,31.0154
2017-05-17,30.6413
2017-05-18,30.0445
2017-05-19,30.2583
2017-05-22,30.3563
2017-05-23,30.9263
2017-05-24,30.8996
2017-05-25,30.5878
2017-05-26,30.5344
2017-05-30,30.766
2017-05-31,30.8551
2017-06-01,31.2915
2017-06-02,30.7482
2017-06-05,30.6858
2017-06-06,30.9085
2017-06-07,30.0267
2017-06-08,29.4477
2017-06-09,29.5813
2017-06-12,29.4833
2017-06-13,29.5724
2017-06-14,29.3497
2017-06-15,28.9934
2017-06-16,28.8776
2017-06-19,27.8266
2017-06-20,26.8913
2017-06-21,26.5706
2017-06-22,26.5439
2017-06-23,27.212
2017-06-26,28.2808
2017-06-27,28.2808
2017-06-28,28.6995
2017-06-29,29.3497
2017-06-30,29.5546
2017-07-03,30.0445
2017-07-05,29.8753
2017-07-06,29.4744
2017-07-07,29.1627
2017-07-10,28.9578
2017-07-11,28.9044
2017-07-12,29.1449
2017-07-13,29.0825
2017-07-14,29.5813
2017-07-17,30.0356
2017-07-18,30.0623
2017-07-19,30.3741
2017-07-20,30.4097
2017-07-21,30.5166
2017-07-24,30.7393
2017-07-25,30.7571
2017-07-26,30.6947
2017-07-27,30.5611
2017-07-28,30.3741
2017-07-31,30.8996
2017-08-01,31.0345
2017-08-02,31.484
2017-08-03,30.7198
2017-08-04,30.6569
2017-08-07,30.4052
2017-08-08,29.5151
2017-08-09,29.4971
2017-08-10,29.0206
2017-08-11,28.8319
2017-08-14,29.2005
2017-08-15,28.5532
2017-08-16,28.5442
2017-08-17,28.2295
2017-08-18,28.1486
2017-08-21,27.8429
2017-08-22,28.0767
2017-08-23,28.688
2017-08-24,28.7689
2017-08-25,29.1735
2017-08-28,28.9667
2017-08-29,28.9757
2017-08-30,29.3893
2017-08-31,30.3602
2017-09-01,30.1624
2017-09-05,30.1804
2017-09-06,30.1984
2017-09-07,28.0767
2017-09-08,28.0587
2017-09-11,28.2745
2017-09-12,28.4633
2017-09-13,28.2924
2017-09-14,28.2924
2017-09-15,27.9328
2017-09-18,28.1935
2017-09-19,28.2385
2017-09-20,28.1216
2017-09-21,28.0677
2017-09-22,28.1935
2017-09-25,28.688
2017-09-26,28.4003
2017-09-27,28.1306
2017-09-28,27.9688
2017-09-29,28.3464
2017-10-02,28.4093
2017-10-03,28.5352
2017-10-04,28.5172
2017-10-05,28.706
2017-10-06,28.6431
2017-10-09,28.5262
2017-10-10,28.3284
2017-10-11,28.3374
2017-10-12,28.2205
2017-10-13,27.9688
2017-10-16,27.3485
2017-10-17,27.0158
2017-10-18,26.8
2017-10-19,26.818
2017-10-20,26.863
2017-10-23,26.0539
2017-10-24,25.955
2017-10-25,25.5953
2017-10-26,25.901
2017-10-27,26.2606
2017-10-30,26.1527
2017-10-31,26.1073
2017-11-01,26.4529
2017-11-02,25.1703
2017-11-03,25.2704
2017-11-06,25.4705
2017-11-07,25.9071
2017-11-08,25.3341
2017-11-09,25.0339
2017-11-10,24.9247
2017-11-13,24.388
2017-11-14,23.9241
2017-11-15,24.0878
2017-11-16,24.1424
2017-11-17,24.2879
2017-11-20,24.3061
2017-11-21,24.1424
2017-11-22,23.9423
2017-11-24,23.9605
2017-11-27,23.4238
2017-11-28,23.7058
2017-11-29,23.7331
2017-11-30,25.0612
2017-12-01,25.9981
2017-12-04,25.4796
2017-12-05,25.9162
2017-12-06,25.7252
2017-12-07,25.9253
2017-12-08,26.0436
2017-12-11,26.4529
2017-12-12,25.9799
2017-12-13,26.3256
2017-12-14,26.6895
2017-12-15,26.7986
2017-12-18,27.1261
2017-12-19,26.4984
2017-12-20,26.3347
2017-12-21,26.1528
2017-12-22,26.5439
2017-12-26,26.4075
2017-12-27,25.9981
2017-12-28,26.2164
2017-12-29,26.4166
2018-01-02,26.5621
2018-01-03,27.0988
2018-01-04,27.5172
2018-01-05,27.9084
2018-01-08,28.0448
2018-01-09,28.1358
2018-01-10,28.2359
2018-01-11,28.6088
2018-01-12,28.8817
2018-01-16,28.8817
2018-01-17,28.154
2018-01-18,28.6634
2018-01-19,28.8363
2018-01-22,29.8187
2018-01-23,30.0097
2018-01-24,29.9642
2018-01-25,30.1644
2018-01-26,30.1371
2018-01-29,29.2274
2018-01-30,28.2177
2018-01-31,28.0014
2018-02-01,27.6332
2018-02-02,27.2098
2018-02-05,26.906
2018-02-06,27.5964
2018-02-07,26.8876
2018-02-08,25.5713
2018-02-09,25.5437
2018-02-12,25.8198
2018-02-13,26.0039
2018-02-14,25.6633
2018-02-15,25.4792
2018-02-16,25.4976
2018-02-20,24.8625
2018-02-21,24.3194
2018-02-22,23.9788
2018-02-23,24.3838
2018-02-26,24.2089
2018-02-27,24.1629
2018-02-28,24.0341
2018-03-01,24.255
2018-03-02,24.2274
2018-03-05,24.7612
2018-03-06,24.7797
2018-03-07,24.8165
2018-03-08,24.8349
2018-03-09,24.8809
2018-03-12,25.3319
2018-03-13,25.1294
2018-03-14,24.7152
2018-03-15,24.1721
2018-03-16,24.3838
2018-03-19,23.491
2018-03-20,23.4081
2018-03-21,23.8131
2018-03-22,23.2977
2018-03-23,23.0583
2018-03-26,23.1596
2018-03-27,23.0031
2018-03-28,23.4449
2018-03-29,23.8315
2018-04-02,23.4633
2018-04-03,23.2056
2018-04-04,23.1044
2018-04-05,23.3897
2018-04-06,22.7454
2018-04-09,22.3864
2018-04-10,22.9571
2018-04-11,23.2977
2018-04-12,22.6901
2018-04-13,23.0859
2018-04-16,24.6416
2018-04-17,24.7797
2018-04-18,25.0098
2018-04-19,24.8533
2018-04-20,24.2089
2018-04-23,24.301
2018-04-24,23.7211
2018-04-25,23.8776
2018-04-26,24.1905
2018-04-27,24.6876
2018-04-30,24.6784
2018-05-01,24.8073
2018-05-02,24.6765
2018-05-03,24.0601
2018-05-04,24.6672
2018-05-07,24.8633
2018-05-08,24.9754
2018-05-09,25.1995
2018-05-10,25.2649
2018-05-11,25.0501
2018-05-14,25.8907
2018-05-15,25.4517
2018-05-16,25.8253
2018-05-17,26.1242
2018-05-18,26.3017
2018-05-21,27.3104
2018-05-22,27.4785
2018-05-23,27.8148
2018-05-24,27.189
2018-05-25,26.9648
2018-05-29,26.8154
2018-05-30,27.7961
2018-05-31,28.2538
2018-06-01,28.9356
2018-06-04,29.1411
2018-06-05,29.0103
2018-06-06,29.1037
2018-06-07,29.3839
2018-06-08,28.8048
2018-06-11,29.1971
2018-06-12,29.3932
2018-06-13,28.8515
2018-06-14,28.8328
2018-06-15,28.3191
2018-06-18,28.5059
2018-06-19,28.3005
2018-06-20,28.7114
2018-06-21,28.562
2018-06-22,28.7301
2018-06-25,28.3285
2018-06-26,28.7861
2018-06-27,27.8802
2018-06-28,27.7681
2018-06-29,27.5719
2018-07-02,27.1516
2018-07-03,27.5065
2018-07-05,28.0109
2018-07-06,28.0763
2018-07-09,28.8048
2018-07-10,28.3472
2018-07-11,27.8428
2018-07-12,28.151
2018-07-13,28.0296
2018-07-16,27.8708
2018-07-17,27.9829
2018-07-18,28.8235
2018-07-19,29.7668
2018-07-20,29.552
2018-07-23,29.9536
2018-07-24,29.3839
2018-07-25,29.8135
2018-07-26,30.5794
2018-07-27,29.6454
2018-07-30,30.0377
2018-07-31,30.8596
2018-08-01,30.8833
2018-08-02,32.0562
2018-08-03,30.5333
2018-08-06,29.7293
2018-08-07,29.5591
2018-08-08,29.8901
2018-08-09,30.6657
2018-08-10,30.5049
2018-08-13,29.5496
2018-08-14,29.5496
2018-08-15,28.9064
2018-08-16,28.6415
2018-08-17,29.1334
2018-08-20,29.3793
2018-08-21,29.1902
2018-08-22,29.6536
2018-08-23,29.2753
2018-08-24,29.1239
2018-08-27,28.7267
2018-08-28,28.2916
2018-08-29,28.1402
2018-08-30,28.1308
2018-08-31,27.6862
2018-09-04,27.97
2018-09-05,28.1591
2018-09-06,27.9227
2018-09-07,27.9132
2018-09-10,28.3199
2018-09-11,28.3672
2018-09-12,28.547
2018-09-13,29.0483
2018-09-14,28.4524
2018-09-17,28.2348
2018-09-18,28.8686
2018-09-19,28.6794
2018-09-20,28.7645
2018-09-21,28.424
2018-09-24,28.2253
2018-09-25,27.62
2018-09-26,26.8538
2018-09-27,27.0524
2018-09-28,27.1092
2018-10-01,27.5443
2018-10-02,27.6011
2018-10-03,27.847
2018-10-04,27.8375
2018-10-05,28.1308
2018-10-08,27.8848
2018-10-09,32.094
2018-10-10,32.1886
2018-10-11,31.4225
2018-10-12,31.1009
2018-10-15,30.9495
2018-10-16,32.094
2018-10-17,31.5076
2018-10-18,31.3846
2018-10-19,31.1009
2018-10-22,31.0063
2018-10-23,30.1455
2018-10-24,29.5212
2018-10-25,29.6442
2018-10-26,28.8118
2018-10-29,28.5848
2018-10-30,28.2443
2018-10-31,28.5186
2018-11-01,28.077
2018-11-02,27.7123
2018-11-05,27.981
2018-11-06,27.5011
2018-11-07,27.3091
2018-11-08,27.0595
2018-11-09,27.1459
2018-11-12,27.0691
2018-11-13,26.714
2018-11-14,26.9635
2018-11-15,26.4356
2018-11-16,26.6468
2018-11-19,26.8484
2018-11-20,25.9077
2018-11-21,26.2436
2018-11-23,25.3701
2018-11-26,26.0324
2018-11-27,26.0228
2018-11-28,26.8004
2018-11-29,26.8388
2018-11-30,26.5508
2018-12-03,27.2611
2018-12-04,26.3876
2018-12-06,26.2052
2018-12-07,26.138
2018-12-10,25.9653
2018-12-11,25.8213
2018-12-12,25.8405
2018-12-13,25.8693
2018-12-14,25.9365
2018-12-17,24.3334
2018-12-18,23.3639
2018-12-19,23.5367
2018-12-20,21.7033
2018-12-21,21.0026
2018-12-24,19.7355
2018-12-26,20.6666
2018-12-27,20.3306
2018-12-28,20.5706
2018-12-31,20.5322
2019-01-02,21.0986
2019-01-03,21.5593
2019-01-04,22.9608
2019-01-07,23.5559
2019-01-08,24.3622
2019-01-09,23.4983
2019-01-10,22.7496
2019-01-11,22.2696
2019-01-14,22.0297
2019-01-15,22.5
2019-01-16,22.644
2019-01-17,22.8456
2019-01-18,23.1144
2019-01-22,22.7304
2019-01-23,22.8648
2019-01-24,23.2775
2019-01-25,23.8535
2019-01-28,24.2278
2019-01-29,24.6694
2019-01-30,25.2549
2019-01-31,24.6196
2019-02-01,24.5806
2019-02-04,24.9617
2019-02-05,25.1963
2019-02-06,25.0106
2019-02-07,23.8964
2019-02-08,23.5836
2019-02-11,23.8769
2019-02-12,24.6001
2019-02-13,24.4046
2019-02-14,25.0497
2019-02-15,25.5188
2019-02-19,26.0759
2019-02-20,25.7534
2019-02-21,25.2647
2019-02-22,24.8835
2019-02-25,24.991
2019-02-26,24.6099
2019-02-27,24.1896
2019-02-28,23.6032
2019-03-01,23.5934
2019-03-04,23.5446
2019-03-05,23.5348
2019-03-06,23.2513
2019-03-07,23.3393
2019-03-08,23.0852
2019-03-11,22.9288
2019-03-12,23.3198
2019-03-13,12.2561
2019-03-14,12.7936
2019-03-15,12.8425
2019-03-18,13.3409
2019-03-19,13.4875
2019-03-20,13.3605
2019-03-21,13.1943
2019-03-22,12.9989
2019-03-25,13.0086
2019-03-26,12.95
2019-03-27,13.0282
2019-03-28,13.1748
2019-03-29,13.468
2019-04-01,13.986
2019-04-02,13.7612
2019-04-03,13.7417
2019-04-04,13.6048
2019-04-05,13.8492
2019-04-08,13.9274
2019-04-09,13.6146
2019-04-10,13.4289
2019-04-11,13.7123
2019-04-12,13.9469
2019-04-15,13.8394
2019-04-16,13.8101
2019-04-17,13.468
2019-04-18,13.3409
2019-04-22,13.2139
2019-04-23,13.1943
2019-04-24,13.0575
2019-04-25,12.77
2019-04-26,12.66
2019-04-29,12.58
2019-04-30,12.21
2019-05-01,12.03
2019-05-02,12.29
2019-05-03,12.2
2019-05-06,12.07
2019-05-07,12.33
2019-05-08,12.26
2019-05-09,12.24
2019-05-10,12.99
2019-05-13,12.81
2019-05-14,12.97
2019-05-15,13.34
2019-05-16,13.58
2019-05-17,13.33
2019-05-20,13.31
2019-05-21,13.27
2019-05-22,13.44
2019-05-23,13.04
2019-05-24,12.91
2019-05-28,12.61
2019-05-29,12.41
2019-05-30,12.28
2019-05-31,12.22
2019-06-03,12.4
2019-06-04,12.71
2019-06-05,12.71
2019-06-06,12.77
2019-06-07,12.81
2019-06-10,12.76
2019-06-11,12.71
2019-06-12,12.12
2019-06-13,12.175
2019-06-14,11.625
2019-06-17,11.73
2019-06-18,11.91
2019-06-19,11.75
2019-06-20,11.805
2019-06-21,11.75
2019-06-24,11.29
2019-06-25,11.015
2019-06-26,11.11
2019-06-27,11.27
2019-06-28,11.5
2019-07-01,11.66
2019-07-02,11.565
2019-07-03,11.805
2019-07-04,11.805
2019-07-05,11.935
2019-07-08,11.85
2019-07-09,11.925
2019-07-10,12.09
2019-07-11,11.995
2019-07-12,11.72
2019-07-15,11.54
2019-07-16,11.375
2019-07-17,11.24
2019-07-18,11.005
2019-07-19,10.965
2019-07-22,11.18
2019-07-23,10.99
2019-07-24,11.095
2019-07-25,10.405
2019-07-26,9.465
2019-07-29,8.795
2019-07-30,9.12
2019-07-31,9.135
2019-08-01,8.44
2019-08-02,8.38
2019-08-05,7.945
2019-08-06,7.825
2019-08-07,7.85
2019-08-08,7.675
2019-08-09,7.265
2019-08-12,7.045
2019-08-13,7.225
2019-08-14,6.895
2019-08-15,7.355
2019-08-16,7.51
2019-08-19,7.74
2019-08-20,7.745
2019-08-21,7.625
2019-08-22,7.465
2019-08-23,7.205
2019-08-26,7.09
2019-08-27,6.82
2019-08-28,6.945
2019-08-29,7.225
2019-08-30,7.12
2019-09-02,7.115
2019-09-03,6.95
2019-09-04,7.2
2019-09-05,7.145
2019-09-06,6.66
2019-09-09,7.225
2019-09-10,7.21
2019-09-11,7.465
2019-09-12,7.105
2019-09-13,7.225
2019-09-16,7.775
2019-09-17,7.525
2019-09-18,7.705
2019-09-19,7.195
2019-09-20,7.315
2019-09-23,7.36
2019-09-24,7.055
2019-09-25,7.265
2019-09-26,7.445
2019-09-27,7.41
2019-09-30,7.39
2019-10-01,7.17
2019-10-02,7.155
2019-10-03,7.01
2019-10-04,7.085
2019-10-07,7.1
2019-10-08,6.805
2019-10-09,6.91
2019-10-10,7.175
2019-10-11,7.335
2019-10-14,7.425
2019-10-15,7.65
2019-10-16,7.255
2019-10-17,7.505
2019-10-18,7.26
2019-10-21,7.26
2019-10-22,7.38
2019-10-23,7.535
2019-10-24,7.3
2019-10-25,7.4
2019-10-28,7.34
2019-10-29,7.395
2019-10-30,7.17
2019-10-31,6.395
2019-11-01,6.675
2019-11-04,7.175
2019-11-05,7.045
2019-11-06,6.835
2019-11-07,6.395
2019-11-08,6.145
2019-11-11,5.56
2019-11-12,5.755
2019-11-13,5.61
2019-11-14,5.365
2019-11-15,5.32
2019-11-18,4.99
2019-11-19,4.775
2019-11-20,4.79
2019-11-21,4.865
2019-11-22,4.825
2019-11-25,4.985
