date,close
2014-06-13,111.1136
2014-06-16,111.8127
2014-06-17,111.3804
2014-06-18,111.7023
2014-06-19,112.521
2014-06-20,113.5512
2014-06-23,112.7049
2014-06-24,110.9297
2014-06-25,111.0217
2014-06-26,110.7457
2014-06-27,110.9941
2014-06-30,110.0375
2014-07-01,110.7733
2014-07-02,110.1386
2014-07-03,111.4724
2014-07-07,110.479
2014-07-08,109.7799
2014-07-09,110.1938
2014-07-10,110.3042
2014-07-11,111.9139
2014-07-14,112.5302
2014-07-15,113.2752
2014-07-16,113.312
2014-07-17,112.7325
2014-07-18,113.9375
2014-07-21,115.0872
2014-07-22,116.3842
2014-07-23,116.4578
2014-07-24,117.6627
2014-07-25,117.3316
2014-07-28,117.5432
2014-07-29,116.237
2014-07-30,115.7587
2014-07-31,113.3856
2014-08-01,113.4684
2014-08-04,113.4684
2014-08-05,113.2016
2014-08-06,111.2792
2014-08-07,110.6537
2014-08-08,113.0085
2014-08-11,113.588
2014-08-12,113.1648
2014-08-13,115.124
2014-08-14,114.9861
2014-08-15,114.8573
2014-08-18,116.5682
2014-08-19,116.8257
2014-08-20,117.8927
2014-08-21,117.7639
2014-08-22,117.3684
2014-08-25,117.7547
2014-08-26,117.0649
2014-08-27,117.3868
2014-08-28,117.3498
2014-08-29,117.6642
2014-09-02,118.9128
2014-09-03,118.3209
2014-09-04,117.6642
2014-09-05,117.951
2014-09-08,117.9695
2014-09-09,118.8296
2014-09-10,120.2262
2014-09-11,120.0135
2014-09-12,120.2262
2014-09-15,120.7626
2014-09-16,122.0205
2014-09-17,122.6124
2014-09-18,122.4922
2014-09-19,123.6205
2014-09-22,121.9927
2014-09-23,119.1626
2014-09-24,120.2262
2014-09-25,119.2181
2014-09-26,122.0205
2014-09-29,122.0667
2014-09-30,121.8632
2014-10-01,118.4042
2014-10-02,117.3683
2014-10-03,118.8204
2014-10-06,118.1544
2014-10-07,115.2503
2014-10-08,116.8688
2014-10-09,114.7046
2014-10-10,114.6954
2014-10-13,112.3461
2014-10-14,114.8618
2014-10-15,112.1797
2014-10-16,112.4664
2014-10-17,115.0931
2014-10-20,115.3058
2014-10-21,116.6561
2014-10-22,115.7127
2014-10-23,119.4955
2014-10-24,120.9661
2014-10-27,120.9661
2014-10-28,124.12
2014-10-29,127.4866
2014-10-30,126.9779
2014-10-31,127.5975
2014-11-03,126.6727
2014-11-04,128.1617
2014-11-05,127.4866
2014-11-06,127.7363
2014-11-07,125.8865
2014-11-10,125.4611
2014-11-11,126.5709
2014-11-12,125.8033
2014-11-13,126.8946
2014-11-14,125.8495
2014-11-17,125.7015
2014-11-18,127.7085
2014-11-19,127.2091
2014-11-20,128.0507
2014-11-21,128.6797
2014-11-24,130.1502
2014-11-25,130.9271
2014-11-26,131.4756
2014-11-28,130.9922
2014-12-01,128.9752
2014-12-02,130.2858
2014-12-03,131.0294
2014-12-04,129.9791
2014-12-05,137.2755
2014-12-08,136.2345
2014-12-09,137.1454
2014-12-10,134.1432
2014-12-11,135.4445
2014-12-12,131.5778
2014-12-15,131.8938
2014-12-16,133.6505
2014-12-17,133.4925
2014-12-18,138.0749
2014-12-19,139.3297
2014-12-22,141.5047
2014-12-23,140.6496
2014-12-24,141.0585
2014-12-26,140.8633
2014-12-29,140.4265
2014-12-30,140.1291
2014-12-31,136.9967
2015-01-02,136.1323
2015-01-05,133.2602
2015-01-06,133.9945
2015-01-07,138.2329
2015-01-08,141.4396
2015-01-09,141.9694
2015-01-12,141.2537
2015-01-13,141.2816
2015-01-14,141.3839
2015-01-15,141.5698
2015-01-16,142.5178
2015-01-20,142.8896
2015-01-21,143.3637
2015-01-22,145.4643
2015-01-23,145.1762
2015-01-26,144.572
2015-01-27,142.1553
2015-01-28,141.4303
2015-01-29,146.7935
2015-01-30,145.8826
2015-02-02,147.9646
2015-02-03,149.1636
2015-02-04,150.4277
2015-02-05,151.5338
2015-02-06,150.7995
2015-02-09,151.4781
2015-02-10,153.2627
2015-02-11,154.5639
2015-02-12,155.4934
2015-02-13,155.354
2015-02-17,155.7816
2015-02-18,155.8559
2015-02-19,158.1332
2015-02-20,160.0572
2015-02-23,158.4957
2015-02-24,158.1889
2015-02-25,156.7575
2015-02-26,155.2269
2015-02-27,154.6669
2015-03-02,155.9642
2015-03-03,152.7255
2015-03-04,153.0055
2015-03-05,152.3988
2015-03-06,149.7201
2015-03-09,150.5228
2015-03-10,147.788
2015-03-11,147.4987
2015-03-12,149.3374
2015-03-13,147.06
2015-03-16,150.5881
2015-03-17,150.4201
2015-03-18,151.9881
2015-03-19,151.6894
2015-03-20,151.7828
2015-03-23,151.8761
2015-03-24,151.2881
2015-03-25,148.5814
2015-03-26,148.6934
2015-03-27,149.7854
2015-03-30,151.8388
2015-03-31,150.2334
2015-04-01,149.8507
2015-04-02,150.8588
2015-04-06,151.9135
2015-04-07,152.0535
2015-04-08,153.2668
2015-04-09,153.6028
2015-04-10,154.3309
2015-04-13,152.6788
2015-04-14,152.3615
2015-04-15,152.3615
2015-04-16,152.4921
2015-04-17,149.4867
2015-04-20,151.8481
2015-04-21,151.6615
2015-04-22,151.2788
2015-04-23,151.9788
2015-04-24,150.9988
2015-04-27,149.4587
2015-04-28,149.8134
2015-04-29,148.5347
2015-04-30,143.7746
2015-05-01,145.6133
2015-05-04,145.4453
2015-05-05,143.0652
2015-05-06,143.0839
2015-05-07,143.2332
2015-05-08,145.8933
2015-05-11,145.9306
2015-05-12,145.0813
2015-05-13,144.8759
2015-05-14,147.1627
2015-05-15,147.48
2015-05-18,147.4893
2015-05-19,148.3387
2015-05-20,148.9827
2015-05-21,150.4387
2015-05-22,149.3374
2015-05-26,147.9093
2015-05-27,148.7027
2015-05-28,150.5413
2015-05-29,149.3218
2015-06-01,150.0347
2015-06-02,150.4193
2015-06-03,150.3349
2015-06-04,148.3274
2015-06-05,147.5488
2015-06-08,146.9578
2015-06-09,147.4832
2015-06-10,148.7402
2015-06-11,150.8133
2015-06-12,151.0853
2015-06-15,150.0535
2015-06-16,151.4887
2015-06-17,152.7833
2015-06-18,154.9314
2015-06-19,154.8282
2015-06-22,155.2222
2015-06-23,154.1904
2015-06-24,153.1022
2015-06-25,152.0891
2015-06-26,151.7514
2015-06-29,148.8527
2015-06-30,148.8058
2015-07-01,150.1848
2015-07-02,149.622
2015-07-06,149.3874
2015-07-07,151.3949
2015-07-08,150.7101
2015-07-09,152.6144
2015-07-10,155.1284
2015-07-13,156.9389
2015-07-14,158.0552
2015-07-15,158.149
2015-07-16,159.3404
2015-07-17,158.5242
2015-07-20,159.3122
2015-07-21,156.4417
2015-07-22,155.9821
2015-07-23,155.2504
2015-07-24,154.5937
2015-07-27,152.4924
2015-07-28,153.2241
2015-07-29,162.6986
2015-07-30,164.5466
2015-07-31,162.2953
2015-08-03,161.4979
2015-08-04,161.4604
2015-08-05,162.9238
2015-08-06,162.1639
2015-08-07,161.9576
2015-08-10,164.3965
2015-08-11,162.5392
2015-08-12,160.9351
2015-08-13,162.1546
2015-08-14,163.3928
2015-08-17,163.89
2015-08-18,164.6311
2015-08-19,164.7436
2015-08-20,161.9013
2015-08-21,155.1097
2015-08-24,150.1098
2015-08-25,149.8002
2015-08-26,154.2935
2015-08-27,157.4986
2015-08-28,156.0469
2015-08-31,154.3501
2015-09-01,150.2307
2015-09-02,155.1702
2015-09-03,155.2079
2015-09-04,152.9927
2015-09-08,158.3753
2015-09-09,156.7256
2015-09-10,156.1977
2015-09-11,158.856
2015-09-14,158.2056
2015-09-15,160.5622
2015-09-16,161.1561
2015-09-17,160.9299
2015-09-18,159.2896
2015-09-21,160.4491
2015-09-22,158.0171
2015-09-23,157.8191
2015-09-24,157.2158
2015-09-25,156.0752
2015-09-28,153.3226
2015-09-29,154.171
2015-09-30,156.4334
2015-10-01,156.2166
2015-10-02,157.9228
2015-10-05,160.6094
2015-10-06,158.7523
2015-10-07,161.3823
2015-10-08,163.7861
2015-10-09,165.6714
2015-10-12,167.0288
2015-10-13,166.8497
2015-10-14,163.8332
2015-10-15,164.0783
2015-10-16,164.8513
2015-10-19,164.5685
2015-10-20,164.446
2015-10-21,164.1443
2015-10-22,169.2063
2015-10-23,169.5174
2015-10-26,169.9511
2015-10-27,170.2433
2015-10-28,179.5755
2015-10-29,179.1702
2015-10-30,176.9832
2015-11-02,178.6706
2015-11-03,175.9369
2015-11-04,175.4939
2015-11-05,175.7295
2015-11-06,173.4577
2015-11-09,171.2425
2015-11-10,171.0822
2015-11-11,171.2802
2015-11-12,169.9699
2015-11-13,168.5653
2015-11-16,175.9086
2015-11-17,175.4656
2015-11-18,177.3509
2015-11-19,177.464
2015-11-20,178.614
2015-11-23,177.0587
2015-11-24,177.2189
2015-11-25,177.7585
2015-11-27,178.3643
2015-11-30,176.4236
2015-12-01,177.323
2015-12-02,175.7894
2015-12-03,173.2996
2015-12-04,177.9289
2015-12-07,177.9667
2015-12-08,177.9762
2015-12-09,176.6035
2015-12-10,177.465
2015-12-11,176.1018
2015-12-14,177.0958
2015-12-15,177.8247
2015-12-16,179.6329
2015-12-17,178.2697
2015-12-18,175.0036
2015-12-21,178.9323
2015-12-22,179.2732
2015-12-23,179.8696
2015-12-24,179.9737
2015-12-28,179.8506
2015-12-29,181.2707
2015-12-30,179.9453
2015-12-31,178.743
2016-01-04,177.5123
2016-01-05,182.1321
2016-01-06,180.3145
2016-01-07,178.0803
2016-01-08,176.1491
2016-01-11,178.0803
2016-01-12,178.8471
2016-01-13,175.0036
2016-01-14,175.6568
2016-01-15,174.3883
2016-01-19,176.7928
2016-01-20,172.8262
2016-01-21,171.5577
2016-01-22,174.2936
2016-01-25,172.1352
2016-01-26,172.7694
2016-01-27,168.6892
2016-01-28,170.5447
2016-01-29,175.193
2016-02-01,178.5821
2016-02-02,177.4461
2016-02-03,179.6518
2016-02-04,176.4142
2016-02-05,176.5467
2016-02-08,175.7231
2016-02-09,177.3325
2016-02-10,178.2886
2016-02-11,174.1043
2016-02-12,171.5861
2016-02-16,174.3977
2016-02-17,179.9264
2016-02-18,182.4067
2016-02-19,180.5133
2016-02-22,182.0185
2016-02-23,181.1097
2016-02-24,179.8885
2016-02-25,183.4155
2016-02-26,182.7405
2016-02-29,182.7405
2016-03-01,184.3187
2016-03-02,183.7863
2016-03-03,182.6455
2016-03-04,181.6472
2016-03-07,177.4737
2016-03-08,177.6449
2016-03-09,177.5308
2016-03-10,177.5403
2016-03-11,180.5254
2016-03-14,179.2705
2016-03-15,182.2177
2016-03-16,182.1226
2016-03-17,181.4951
2016-03-18,184.4232
2016-03-21,184.6039
2016-03-22,184.756
2016-03-23,185.3454
2016-03-24,184.6229
2016-03-28,185.2694
2016-03-29,186.9806
2016-03-30,188.9295
2016-03-31,188.1404
2016-04-01,190.4316
2016-04-04,191.2587
2016-04-05,192.2949
2016-04-06,192.1333
2016-04-07,190.6597
2016-04-08,190.6787
2016-04-11,189.671
2016-04-12,190.327
2016-04-13,191.2111
2016-04-14,190.2604
2016-04-15,191.9241
2016-04-18,192.7893
2016-04-19,191.6484
2016-04-20,191.6389
2016-04-21,190.1369
2016-04-22,190.8499
2016-04-25,190.8309
2016-04-26,193.5308
2016-04-27,196.7916
2016-04-28,195.4702
2016-04-29,196.0881
2016-05-02,198.037
2016-05-03,199.2634
2016-05-04,200.1666
2016-05-05,201.4785
2016-05-06,203.5415
2016-05-09,204.0454
2016-05-10,206.7073
2016-05-11,203.7507
2016-05-12,207.2302
2016-05-13,203.4274
2016-05-16,205.0911
2016-05-17,203.0662
2016-05-18,203.5795
2016-05-19,200.6609
2016-05-20,202.2296
2016-05-23,201.6972
2016-05-24,204.0929
2016-05-25,203.7602
2016-05-26,203.3989
2016-05-27,203.8457
2016-05-31,202.182
2016-06-01,203.6117
2016-06-02,203.7167
2016-06-03,205.4352
2016-06-06,205.6834
2016-06-07,205.9221
2016-06-08,207.8029
2016-06-09,208.6812
2016-06-10,207.5165
2016-06-13,205.3111
2016-06-14,207.0868
2016-06-15,207.3542
2016-06-16,206.9245
2016-06-17,204.6141
2016-06-20,205.4161
2016-06-21,205.1201
2016-06-22,205.1583
2016-06-23,204.9769
2016-06-24,203.077
2016-06-27,204.4518
2016-06-28,206.3422
2016-06-29,207.4019
2016-06-30,212.2136
2016-07-01,211.7554
2016-07-05,211.5167
2016-07-06,211.6886
2016-07-07,210.5143
2016-07-08,211.9177
2016-07-11,211.9081
2016-07-12,210.4856
2016-07-13,211.7363
2016-07-14,211.1157
2016-07-15,211.4308
2016-07-18,210.8102
2016-07-19,211.5167
2016-07-20,212.4714
2016-07-21,208.328
2016-07-22,209.655
2016-07-25,209.2063
2016-07-26,208.4616
2016-07-27,207.9461
2016-07-28,207.3923
2016-07-29,206.8195
2016-08-01,206.8768
2016-08-02,208.7767
2016-08-03,208.7576
2016-08-04,208.4521
2016-08-05,209.0344
2016-08-08,206.2849
2016-08-09,206.9245
2016-08-10,207.3446
2016-08-11,208.1179
2016-08-12,208.328
2016-08-15,209.8555
2016-08-16,207.2682
2016-08-17,208.6526
2016-08-18,208.2611
2016-08-19,207.5737
2016-08-22,208.3757
2016-08-23,204.786
2016-08-24,204.3087
2016-08-25,204.6347
2016-08-26,203.187
2016-08-29,204.3087
2016-08-30,203.8485
2016-08-31,203.3212
2016-09-01,203.0911
2016-09-02,204.4429
2016-09-06,205.9002
2016-09-07,204.0786
2016-09-08,203.954
2016-09-09,200.6079
2016-09-12,201.5954
2016-09-13,199.7642
2016-09-14,200.1957
2016-09-15,202.6692
2016-09-16,202.2953
2016-09-19,202.4487
2016-09-20,203.3595
2016-09-21,206.9453
2016-09-22,207.5588
2016-09-23,208.0957
2016-09-26,208.0478
2016-09-27,209.0545
2016-09-28,208.9107
2016-09-29,204.7977
2016-09-30,205.1236
2016-10-03,206.2262
2016-10-04,204.0498
2016-10-05,203.7143
2016-10-06,205.3729
2016-10-07,206.5426
2016-10-10,207.6835
2016-10-11,206.3412
2016-10-12,207.904
2016-10-13,209.3613
2016-10-14,209.8886
2016-10-17,210.0995
2016-10-18,210.3871
2016-10-19,209.16
2016-10-20,208.393
2016-10-21,206.9548
2016-10-24,207.5301
2016-10-25,210.4734
2016-10-26,218.6419
2016-10-27,216.0533
2016-10-28,218.9583
2016-10-31,219.5528
2016-11-01,218.9967
2016-11-02,219.2364
2016-11-03,216.2355
2016-11-04,215.9383
2016-11-07,220.569
2016-11-08,220.3869
2016-11-09,232.3041
2016-11-10,235.0557
2016-11-11,237.2896
2016-11-14,240.7602
2016-11-15,237.2416
2016-11-16,235.2666
2016-11-17,234.5667
2016-11-18,235.3337
2016-11-21,236.1295
2016-11-22,237.836
2016-11-23,237.3758
2016-11-25,238.325
2016-11-28,238.6893
2016-11-29,241.4122
2016-11-30,239.3509
2016-12-01,239.6588
2016-12-02,241.3907
2016-12-05,238.1385
2016-12-06,238.4752
2016-12-07,237.8017
2016-12-08,228.7376
2016-12-09,229.4208
2016-12-12,223.3011
2016-12-13,222.8104
2016-12-14,223.33
2016-12-15,223.2241
2016-12-16,222.9451
2016-12-19,224.7156
2016-12-20,226.2551
2016-12-21,224.3403
2016-12-22,224.8888
2016-12-23,224.1863
2016-12-27,224.4269
2016-12-28,223.1856
2016-12-29,223.8399
2016-12-30,223.7918
2017-01-03,226.0146
2017-01-04,226.3609
2017-01-05,227.073
2017-01-06,227.785
2017-01-09,226.8998
2017-01-10,224.3018
2017-01-11,222.8008
2017-01-12,220.4914
2017-01-13,221.4729
2017-01-17,219.8468
2017-01-18,221.5403
2017-01-19,223.609
2017-01-20,223.3396
2017-01-23,222.9355
2017-01-24,223.8015
2017-01-25,222.1176
2017-01-26,218.3842
2017-01-27,221.1457
2017-01-30,220.809
2017-01-31,220.4241
2017-02-01,220.1739
2017-02-02,221.165
2017-02-03,222.6179
2017-02-06,224.0228
2017-02-07,224.1767
2017-02-08,223.6379
2017-02-09,225.9664
2017-02-10,227.3232
2017-02-13,230.0462
2017-02-14,230.5658
2017-02-15,232.4614
2017-02-16,234.3281
2017-02-17,234.3762
2017-02-21,234.8958
2017-02-22,233.7989
2017-02-23,234.6456
2017-02-24,235.7906
2017-02-27,239.2065
2017-02-28,237.7536
2017-03-01,236.6374
2017-03-02,234.7446
2017-03-03,234.6094
2017-03-06,234.5998
2017-03-07,235.4303
2017-03-08,235.2275
2017-03-09,235.7587
2017-03-10,235.2468
2017-03-13,236.0484
2017-03-14,235.4207
2017-03-15,235.4883
2017-03-16,232.0502
2017-03-17,235.8842
2017-03-20,234.6674
2017-03-21,231.5094
2017-03-22,232.8807
2017-03-23,231.2969
2017-03-24,228.7666
2017-03-27,227.7526
2017-03-28,229.066
2017-03-29,228.419
2017-03-30,230.872
2017-03-31,229.6938
2017-04-03,229.6648
2017-04-04,229.5006
2017-04-05,228.0134
2017-04-06,228.5638
2017-04-07,230.6305
2017-04-10,231.1424
2017-04-11,232.7938
2017-04-12,231.1617
2017-04-13,231.9729
2017-04-17,234.7736
2017-04-18,234.8509
2017-04-19,235.3917
2017-04-20,236.4637
2017-04-21,237.893
2017-04-24,240.6067
2017-04-25,239.6313
2017-04-26,239.5637
2017-04-27,239.8921
2017-04-28,237.5356
2017-05-01,235.9711
2017-05-02,236.9272
2017-05-03,237.1011
2017-05-04,237.3328
2017-05-05,240.3846
2017-05-08,240.6067
2017-05-09,240.9447
2017-05-10,239.612
2017-05-11,239.0422
2017-05-12,238.9746
2017-05-15,239.7472
2017-05-16,238.907
2017-05-17,237.8833
2017-05-18,238.4241
2017-05-19,241.3214
2017-05-22,240.9061
2017-05-23,242.065
2017-05-24,244.7015
2017-05-25,247.734
2017-05-26,248.1879
2017-05-30,247.4346
2017-05-31,250.3415
2017-06-01,249.7502
2017-06-02,250.6324
2017-06-05,247.8112
2017-06-06,245.465
2017-06-07,246.8999
2017-06-08,248.325
2017-06-09,248.8582
2017-06-12,248.1796
2017-06-13,249.7308
2017-06-14,251.7376
2017-06-15,250.7487
2017-06-16,250.7003
2017-06-19,253.2985
2017-06-20,252.2224
2017-06-21,252.3484
2017-06-22,249.0521
2017-06-23,249.5466
2017-06-26,248.1408
2017-06-27,247.5397
2017-06-28,249.7017
2017-06-29,247.1035
2017-06-30,248.8776
2017-07-03,249.8374
2017-07-05,252.3387
2017-07-06,251.0396
2017-07-07,253.9965
2017-07-10,253.7929
2017-07-11,254.6267
2017-07-12,255.9064
2017-07-13,255.8095
2017-07-14,256.7499
2017-07-17,256.7305
2017-07-18,256.1779
2017-07-19,256.8371
2017-07-20,256.6917
2017-07-21,257.2055
2017-07-24,257.1764
2017-07-25,255.9937
2017-07-26,255.8095
2017-07-27,252.804
2017-07-28,256.0421
2017-07-31,255.1017
2017-08-01,256.5657
2017-08-02,258.6889
2017-08-03,260.5794
2017-08-04,261.0253
2017-08-07,261.3549
2017-08-08,261.5876
2017-08-09,264.7676
2017-08-10,262.2954
2017-08-11,261.0641
2017-08-14,263.1194
2017-08-15,262.8673
2017-08-16,261.7524
2017-08-17,259.9492
2017-08-18,259.4451
2017-08-21,259.5323
2017-08-22,264.4961
2017-08-23,262.5086
2017-08-24,261.3117
2017-08-25,262.0804
2017-08-28,260.6889
2017-08-29,263.433
2017-08-30,263.7152
2017-08-31,264.8829
2017-09-01,261.5939
2017-09-05,260.8544
2017-09-06,258.1297
2017-09-07,258.7136
2017-09-08,260.251
2017-09-11,262.0512
2017-09-12,261.7204
2017-09-13,259.5212
2017-09-14,258.5384
2017-09-15,259.8423
2017-09-18,268.5417
2017-09-19,270.8382
2017-09-20,272.5022
2017-09-21,272.8719
2017-09-22,273.9715
2017-09-25,273.7964
2017-09-26,277.0756
2017-09-27,279.1191
2017-09-28,276.9589
2017-09-29,279.9754
2017-10-02,282.0968
2017-10-03,283.245
2017-10-04,284.3154
2017-10-05,284.8019
2017-10-06,285.4344
2017-10-09,285.9502
2017-10-10,285.4344
2017-10-11,287.2444
2017-10-12,290.6404
2017-10-13,288.4218
2017-10-16,287.8185
2017-10-17,286.3978
2017-10-18,284.1402
2017-10-19,284.7727
2017-10-20,286.6702
2017-10-23,286.135
2017-10-24,286.1156
2017-10-25,296.6346
2017-10-26,289.969
2017-10-27,289.6479
2017-10-30,288.3926
2017-10-31,287.5752
2017-11-01,286.2518
2017-11-02,293.2483
2017-11-03,293.5402
2017-11-06,293.7348
2017-11-07,295.1458
2017-11-08,295.1361
2017-11-09,291.088
2017-11-10,290.1052
2017-11-13,290.4458
2017-11-14,292.3725
2017-11-15,291.8665
2017-11-16,292.4601
2017-11-17,288.8597
2017-11-20,292.8396
2017-11-21,296.1189
2017-11-22,293.8905
2017-11-24,294.5717
2017-11-27,295.4572
2017-11-28,299.6122
2017-11-29,298.4348
2017-11-30,299.1257
2017-12-01,292.5164
2017-12-04,293.4243
2017-12-05,290.681
2017-12-06,293.0729
2017-12-07,295.494
2017-12-08,298.413
2017-12-11,297.3294
2017-12-12,299.9848
2017-12-13,301.1368
2017-12-14,299.6236
2017-12-15,303.099
2017-12-18,301.0782
2017-12-19,299.8286
2017-12-20,299.3405
2017-12-21,297.261
2017-12-22,296.5679
2017-12-26,296.6265
2017-12-27,298.8914
2017-12-28,300.9708
2017-12-29,299.6236
2018-01-02,297.9932
2018-01-03,299.3697
2018-01-04,301.2246
2018-01-05,300.9025
2018-01-08,300.9415
2018-01-09,303.021
2018-01-10,300.307
2018-01-11,302.2009
2018-01-12,307.6679
2018-01-16,305.1199
2018-01-17,309.9719
2018-01-18,306.8381
2018-01-19,308.859
2018-01-22,307.6582
2018-01-23,306.0376
2018-01-24,306.0181
2018-01-25,317.2841
2018-01-26,327.5934
2018-01-29,330.3074
2018-01-30,331.4008
2018-01-31,332.4454
2018-02-01,334.7201
2018-02-02,328.7942
2018-02-05,314.7165
2018-02-06,319.7247
2018-02-07,329.6435
2018-02-08,316.3176
2018-02-09,324.7915
2018-02-12,329.4287
2018-02-13,335.2082
2018-02-14,341.3196
2018-02-15,348.4365
2018-02-16,347.5481
2018-02-20,342.042
2018-02-21,342.4911
2018-02-22,340.3531
2018-02-23,343.1647
2018-02-26,346.6597
2018-02-27,345.2637
2018-02-28,341.7296
2018-03-01,331.4789
2018-03-02,335.9942
2018-03-05,337.6984
2018-03-06,334.8385
2018-03-07,339.6866
2018-03-08,339.2361
2018-03-09,342.4486
2018-03-12,337.6298
2018-03-13,337.2479
2018-03-14,333.1049
2018-03-15,333.81
2018-03-16,331.6651
2018-03-19,337.8355
2018-03-20,340.431
2018-03-21,340.0784
2018-03-22,331.861
2018-03-23,338.6582
2018-03-26,347.9237
2018-03-27,342.1058
2018-03-28,337.62
2018-03-29,341.9393
2018-04-02,338.4134
2018-04-03,338.9227
2018-04-04,346.1705
2018-04-05,352.6249
2018-04-06,344.4859
2018-04-09,340.4408
2018-04-10,339.6083
2018-04-11,339.5201
2018-04-12,344.8091
2018-04-13,343.3889
2018-04-16,344.5152
2018-04-17,347.7376
2018-04-18,350.3429
2018-04-19,350.6563
2018-04-20,348.5995
2018-04-23,348.7954
2018-04-24,334.4957
2018-04-25,325.7787
2018-04-26,327.0911
2018-04-27,315.2302
2018-04-30,315.4163
2018-05-01,300.9011
2018-05-02,300.8424
2018-05-03,309.1871
2018-05-04,307.3948
2018-05-07,310.6073
2018-05-08,322.4976
2018-05-09,320.8522
2018-05-10,319.6964
2018-05-11,318.6093
2018-05-14,312.1646
2018-05-15,313.3889
2018-05-16,314.5544
2018-05-17,317.8453
2018-05-18,322.2527
2018-05-21,324.5446
2018-05-22,317.8257
2018-05-23,321.479
2018-05-24,325.9648
2018-05-25,325.1029
2018-05-29,319.765
2018-05-30,324.7503
2018-05-31,320.5192
2018-06-01,324.3923
2018-06-04,327.1645
2018-06-05,323.6059
2018-06-06,329.5336
2018-06-07,332.3353
2018-06-08,332.8858
2018-06-11,328.6882
2018-06-12,323.7632
2018-06-13,322.2592
2018-06-14,317.0884
2018-06-15,316.066
2018-06-18,316.9508
2018-06-19,308.5163
2018-06-20,306.7862
2018-06-21,308.1329
2018-06-22,306.7665
2018-06-25,308.3983
2018-06-26,304.0926
2018-06-27,301.3893
2018-06-28,302.5001
2018-06-29,302.4805
2018-07-02,303.6306
2018-07-03,303.6011
2018-07-05,303.0211
2018-07-06,302.1462
2018-07-09,308.3787
2018-07-10,309.7746
2018-07-11,306.4814
2018-07-12,316.6657
2018-07-13,316.2725
2018-07-16,314.8962
2018-07-17,315.7515
2018-07-18,318.2189
2018-07-19,318.6612
2018-07-20,318.4351
2018-07-23,311.2983
2018-07-24,310.8068
2018-07-25,290.4874
2018-07-26,290.3006
2018-07-27,296.5331
2018-07-30,289.8288
2018-07-31,295.3928
2018-08-01,295.7958
2018-08-02,293.6233
2018-08-03,292.2077
2018-08-06,290.4186
2018-08-07,290.2515
2018-08-08,289.9467
2018-08-09,286.4864
2018-08-10,286.3783
2018-08-13,287.0664
2018-08-14,288.8752
2018-08-15,286.5651
2018-08-16,287.0369
2018-08-17,289.3962
2018-08-20,292.4535
2018-08-21,293.1219
2018-08-22,292.1979
2018-08-23,292.5321
2018-08-24,294.1707
2018-08-27,296.2336
2018-08-28,296.5099
2018-08-29,293.2528
2018-08-30,294.8123
2018-08-31,294.6149
2018-09-04,293.7858
2018-09-05,292.8975
2018-09-06,297.7733
2018-09-07,296.6185
2018-09-10,299.9941
2018-09-11,299.0367
2018-09-12,299.5894
2018-09-13,299.471
2018-09-14,303.35
2018-09-17,306.9822
2018-09-18,313.5064
2018-09-19,308.2061
2018-09-20,297.497
2018-09-21,302.7084
2018-09-24,302.1359
2018-09-25,310.3282
2018-09-26,310.496
2018-09-27,312.6575
2018-09-28,313.2498
2018-10-01,314.3651
2018-10-02,314.6316
2018-10-03,313.5064
2018-10-04,313.9604
2018-10-05,316.1812
2018-10-08,314.8586
2018-10-09,310.1209
2018-10-10,305.0378
2018-10-11,293.7562
2018-10-12,298.4445
2018-10-15,301.6326
2018-10-16,308.0383
2018-10-17,305.4819
2018-10-18,304.1988
2018-10-19,303.6757
2018-10-22,302.7676
2018-10-23,300.1718
2018-10-24,282.1488
2018-10-25,266.475
2018-10-26,266.3368
2018-10-29,252.9726
2018-10-30,257.7103
2018-10-31,258.5492
2018-11-01,269.6038
2018-11-02,270.2454
2018-11-05,275.8122
2018-11-06,279.0693
2018-11-07,282.1982
2018-11-08,280.3426
2018-11-09,282.0205
2018-11-12,273.9467
2018-11-13,270.0875
2018-11-14,267.2054
2018-11-15,268.8142
2018-11-16,269.1005
2018-11-19,265.7643
2018-11-20,263.3461
2018-11-21,264.2345
2018-11-23,263.129
2018-11-26,262.448
2018-11-27,256.9601
2018-11-28,259.7238
2018-11-29,257.2859
2018-11-30,257.6925
2018-12-03,259.2692
2018-12-04,247.737
2018-12-06,254.8467
2018-12-07,255.3722
2018-12-10,267.9554
2018-12-11,265.7442
2018-12-12,267.8364
2018-12-13,265.5954
2018-12-14,260.4987
2018-12-17,255.0748
2018-12-18,254.7773
2018-12-19,251.2175
2018-12-20,241.5694
2018-12-21,233.2599
2018-12-24,224.3258
2018-12-26,230.6818
2018-12-27,237.5535
2018-12-28,240.2109
2018-12-31,242.8386
2019-01-02,244.2963
2019-01-03,237.9005
2019-01-04,245.8134
2019-01-07,247.7271
2019-01-08,248.8476
2019-01-09,250.0276
2019-01-10,255.4912
2019-01-11,253.8948
2019-01-14,257.7719
2019-01-15,256.7604
2019-01-16,253.5874
2019-01-17,261.8572
2019-01-18,265.4963
2019-01-22,262.5017
2019-01-23,267.9554
2019-01-24,267.5489
2019-01-25,270.5434
2019-01-28,271.9912
2019-01-29,277.7721
2019-01-30,278.4563
2019-01-31,273.2306
2019-02-01,270.6624
2019-02-04,276.3839
2019-02-05,276.1161
2019-02-06,278.0497
2019-02-07,276.1856
2019-02-08,278.258
2019-02-11,279.1008
2019-02-12,281.6888
2019-02-13,280.9154
2019-02-14,278.2381
2019-02-15,284.5644
2019-02-19,284.9313
2019-02-20,285.794
2019-02-21,285.0801
2019-02-22,287.4798
2019-02-25,285.8269
2019-02-26,285.329
2019-02-27,285.5481
2019-02-28,288.7245
2019-03-01,285.7771
2019-03-04,281.8937
2019-03-05,281.6647
2019-03-06,279.265
2019-03-07,275.2621
2019-03-08,274.7841
2019-03-11,278.0302
2019-03-12,273.9975
2019-03-13,277.9705
2019-03-14,273.5793
2019-03-15,270.0544
2019-03-18,273.7187
2019-03-19,269.8552
2019-03-20,269.3076
2019-03-21,271.319
2019-03-22,267.2165
2019-03-25,267.4555
2019-03-26,264.7172
2019-03-27,262.7954
2019-03-28,265.8623
2019-03-29,268.4512
2019-04-01,272.942
2019-04-02,272.1653
2019-04-03,265.6233
2019-04-04,269.8552
2019-04-05,275.1227
2019-04-08,275.7201
2019-04-09,272.3047
2019-04-10,269.3773
2019-04-11,276.208
2019-04-12,281.8439
2019-04-15,279.026
2019-04-16,280.4101
2019-04-17,277.5822
2019-04-18,279.962
2019-04-22,281.6846
2019-04-23,291.3632
2019-04-24,278.8069
2019-04-25,278.0004
2019-04-26,281.9236
2019-04-29,284.7814
2019-04-30,288.6747
2019-05-01,288.0772
2019-05-02,288.6946
2019-05-03,290.7956
2019-05-06,290.0986
2019-05-07,287.1512
2019-05-08,289.3219
2019-05-09,293.743
2019-05-10,299.5183
2019-05-13,294.221
2019-05-14,294.3803
2019-05-15,293.2352
2019-05-16,303.4116
2019-05-17,305.3832
2019-05-20,313.2396
2019-05-21,314.8925
2019-05-22,315.2808
2019-05-23,309.7644
2019-05-24,310.7403
2019-05-28,306.9166
2019-05-29,304.7061
2019-05-30,308.4899
2019-05-31,303.25
2019-06-03,306.94
2019-06-04,312.27
2019-06-05,316.77
2019-06-06,314.82
2019-06-07,318.29
2019-06-10,311.31
2019-06-11,300.73
2019-06-12,304.85
2019-06-13,306.25
2019-06-14,310
2019-06-17,309.91
2019-06-18,313.24
2019-06-19,314.21
2019-06-20,323.685
2019-06-21,322.53
2019-06-24,321.94
2019-06-25,321.05
2019-06-26,319.27
2019-06-27,318.15
2019-06-28,322.8
2019-07-01,318.64
2019-07-02,323.28
2019-07-03,325.2
2019-07-04,325.2
2019-07-05,324.635
2019-07-08,323.67
2019-07-09,324.76
2019-07-10,324.56
2019-07-11,324.63
2019-07-12,328.43
2019-07-15,324.53
2019-07-16,323.51
2019-07-17,321.895
2019-07-18,320.9
2019-07-19,322.635
2019-07-22,323.07
2019-07-23,324.02
2019-07-24,342.75
2019-07-25,354.44
2019-07-26,352.68
2019-07-29,355.86
2019-07-30,352.18
2019-07-31,346.19
2019-08-01,345.69
2019-08-02,341.19
2019-08-05,343.62
2019-08-06,354.3
2019-08-07,361.95
2019-08-08,368.825
2019-08-09,371.21
2019-08-12,372.72
2019-08-13,370.24
2019-08-14,361.86
2019-08-15,365.27
2019-08-16,368.49
2019-08-19,370.38
2019-08-20,369.45
2019-08-21,369.435
2019-08-22,372.645
2019-08-23,360.11
2019-08-26,365.97
2019-08-27,364.06
2019-08-28,364.17
2019-08-29,368.12
2019-08-30,368.08
2019-09-02,367.44
2019-09-03,365.72
2019-09-04,371.87
2019-09-05,368.6
2019-09-06,367.13
2019-09-09,355.62
2019-09-10,354.49
2019-09-11,358.765
2019-09-12,365.17
2019-09-13,363.41
2019-09-16,371.195
2019-09-17,374.67
2019-09-18,377.16
2019-09-19,375.64
2019-09-20,369.84
2019-09-23,369.93
2019-09-24,369.98
2019-09-25,374.995
2019-09-26,382.83
2019-09-27,370.77
2019-09-30,374.67
2019-10-01,367.745
2019-10-02,361.97
2019-10-03,364.34
2019-10-04,369.57
2019-10-07,369.09
2019-10-08,368.455
2019-10-09,367.52
2019-10-10,369.045
2019-10-11,362.485
2019-10-14,366.83
2019-10-15,364.025
2019-10-16,364.68
2019-10-17,356.04
2019-10-18,350.01
2019-10-21,350.05
2019-10-22,352.44
2019-10-23,352.69
2019-10-24,357.2
2019-10-25,345.12
2019-10-28,346.71
2019-10-29,346.7
2019-10-30,354.415
2019-10-31,351.93
2019-11-01,352.23
2019-11-04,340.73
2019-11-05,338.42
2019-11-06,343.45
2019-11-07,343.45
2019-11-08,349.97
2019-11-11,349.73
2019-11-12,351.8
2019-11-13,353.67
2019-11-14,355.49
2019-11-15,356.53
2019-11-18,356.11
2019-11-19,353.315
2019-11-20,353.35
2019-11-21,348.635
2019-11-22,349.09
2019-11-25,349.53
