date,close
2014-06-13,47.12
2014-06-16,41.22
2014-06-17,44.73
2014-06-18,42.7
2014-06-19,42.59
2014-06-20,42.37
2014-06-23,43.11
2014-06-24,41.37
2014-06-25,42.98
2014-06-26,43.4
2014-06-27,45.55
2014-06-30,46.55
2014-07-01,44.15
2014-07-02,45.08
2014-07-03,42.99
2014-07-07,41.83
2014-07-08,36.04
2014-07-09,38.01
2014-07-10,37.57
2014-07-11,36.58
2014-07-14,37.12
2014-07-15,35.53
2014-07-16,35.07
2014-07-17,33.35
2014-07-18,34.85
2014-07-21,34.1
2014-07-22,36.07
2014-07-23,35.03
2014-07-24,36.56
2014-07-25,36.58
2014-07-28,34.92
2014-07-29,35.94
2014-07-30,35.97
2014-07-31,34.69
2014-08-01,33.6
2014-08-04,35.09
2014-08-05,36.02
2014-08-06,36.31
2014-08-07,35.48
2014-08-08,35.52
2014-08-11,37.51
2014-08-12,37.38
2014-08-13,37.31
2014-08-14,37.78
2014-08-15,38.81
2014-08-18,38.18
2014-08-19,37.53
2014-08-20,36.53
2014-08-21,36.65
2014-08-22,36.32
2014-08-25,37.79
2014-08-26,38.81
2014-08-27,37.85
2014-08-28,36.06
2014-08-29,36
2014-09-02,36.6
2014-09-03,36.71
2014-09-04,37.46
2014-09-05,37.98
2014-09-08,40.36
2014-09-09,39.73
2014-09-10,39.21
2014-09-11,40.95
2014-09-12,40.56
2014-09-15,39.06
2014-09-16,38.99
2014-09-17,39.62
2014-09-18,39.7
2014-09-19,39.57
2014-09-22,38.74
2014-09-23,39.27
2014-09-24,39.36
2014-09-25,38.1
2014-09-26,42.1
2014-09-29,38.38
2014-09-30,34.94
2014-10-01,32.59
2014-10-02,33.79
2014-10-03,33.09
2014-10-06,33.18
2014-10-07,32.32
2014-10-08,33.79
2014-10-09,32.15
2014-10-10,30.47
2014-10-13,30.69
2014-10-14,31.1
2014-10-15,30.7
2014-10-16,32.66
2014-10-17,33.28
2014-10-20,35.01
2014-10-21,34.24
2014-10-22,33.6
2014-10-23,35.12
2014-10-24,35.72
2014-10-27,36.42
2014-10-28,38.03
2014-10-29,39.81
2014-10-30,40.05
2014-10-31,41.08
2014-11-03,43.3
2014-11-04,40.4
2014-11-05,37.71
2014-11-06,41.73
2014-11-07,42.14
2014-11-10,42.68
2014-11-11,43
2014-11-12,42.41
2014-11-13,40.43
2014-11-14,39.77
2014-11-17,40.78
2014-11-18,40.71
2014-11-19,39.95
2014-11-20,41.8
2014-11-21,41.21
2014-11-24,42.42
2014-11-25,42.1
2014-11-26,42.42
2014-11-28,41.88
2014-12-01,42.25
2014-12-02,43.85
2014-12-03,45.58
2014-12-04,45.03
2014-12-05,44.84
2014-12-08,45.91
2014-12-09,41.34
2014-12-10,37.48
2014-12-11,33.5
2014-12-12,34.85
2014-12-15,31.89
2014-12-16,31.07
2014-12-17,32.61
2014-12-18,36.12
2014-12-19,38.55
2014-12-22,39.09
2014-12-23,36.5
2014-12-24,37.78
2014-12-26,38.49
2014-12-29,37.79
2014-12-30,35.96
2014-12-31,37.43
2015-01-02,37.99
2015-01-05,35.97
2015-01-06,33.47
2015-01-07,30.96
2015-01-08,32.01
2015-01-09,32.04
2015-01-12,29.9
2015-01-13,28.45
2015-01-14,28.06
2015-01-15,27.76
2015-01-16,26.65
2015-01-20,26
2015-01-21,25.62
2015-01-22,26.34
2015-01-23,27.66
2015-01-26,28.6
2015-01-27,28.32
2015-01-28,26.67
2015-01-29,26.83
2015-01-30,26.53
2015-02-02,26.45
2015-02-03,26.86
2015-02-04,26.59
2015-02-05,28.26
2015-02-06,26.99
2015-02-09,26.97
2015-02-10,26.61
2015-02-11,26.6
2015-02-12,27.25
2015-02-13,27.12
2015-02-17,27.25
2015-02-18,27.8
2015-02-19,27.77
2015-02-20,27.55
2015-02-23,28.41
2015-02-24,28.1
2015-02-25,27.97
2015-02-26,27.96
2015-02-27,27.26
2015-03-02,27.64
2015-03-03,27.09
2015-03-04,27.04
2015-03-05,27.97
2015-03-06,27.01
2015-03-09,26.29
2015-03-10,26.245
2015-03-11,28.33
2015-03-12,28.72
2015-03-13,28.08
2015-03-16,31.56
2015-03-17,34.45
2015-03-18,31.79
2015-03-19,33.05
2015-03-20,31.44
2015-03-23,30.84
2015-03-24,30.29
2015-03-25,29.4
2015-03-26,29.07
2015-03-27,29.74
2015-03-30,30.91
2015-03-31,30.61
2015-04-01,30.16
2015-04-02,29.45
2015-04-06,29.71
2015-04-07,31.22
2015-04-08,31.91
2015-04-09,31.41
2015-04-10,32.08
2015-04-13,33.27
2015-04-14,33.31
2015-04-15,33.86
2015-04-16,34.83
2015-04-17,33.79
2015-04-20,33
2015-04-21,32.84
2015-04-22,32.24
2015-04-23,32.62
2015-04-24,31.49
2015-04-27,29.46
2015-04-28,28.48
2015-04-29,28.5
2015-04-30,27.16
2015-05-01,29.02
2015-05-04,29.96
2015-05-05,29.78
2015-05-06,28.81
2015-05-07,28.43
2015-05-08,28.74
2015-05-11,29.45
2015-05-12,30.26
2015-05-13,29.34
2015-05-14,26.83
2015-05-15,24.81
2015-05-18,27.02
2015-05-19,26.38
2015-05-20,26.09
2015-05-21,26.27
2015-05-22,26.15
2015-05-26,26.84
2015-05-27,27.14
2015-05-28,27.38
2015-05-29,26.92
2015-06-01,26.94
2015-06-02,26.54
2015-06-03,26.91
2015-06-04,27.51
2015-06-05,28.09
2015-06-08,28.11
2015-06-09,27.79
2015-06-10,28.11
2015-06-11,28.11
2015-06-12,26.84
2015-06-15,26.78
2015-06-16,26.75
2015-06-17,27
2015-06-18,27.77
2015-06-19,27.54
2015-06-22,28.02
2015-06-23,28.23
2015-06-24,27.31
2015-06-25,26.35
2015-06-26,26.04
2015-06-29,25.04
2015-06-30,27.21
2015-07-01,25.9
2015-07-02,25.1
2015-07-06,25.86
2015-07-07,25.9
2015-07-08,24.93
2015-07-09,25.33
2015-07-10,25.57
2015-07-13,26.63
2015-07-14,26.94
2015-07-15,26.39
2015-07-16,26.62
2015-07-17,25.91
2015-07-20,23.98
2015-07-21,23.26
2015-07-22,23.21
2015-07-23,22.95
2015-07-24,21.45
2015-07-27,21.14
2015-07-28,21.34
2015-07-29,19.98
2015-07-30,20.08
2015-07-31,20.52
2015-08-03,20.95
2015-08-04,21.7
2015-08-05,22.35
2015-08-06,22.12
2015-08-07,22.05
2015-08-10,13.44
2015-08-11,13.31
2015-08-12,13
2015-08-13,12.71
2015-08-14,12.02
2015-08-17,14.4
2015-08-18,13.42
2015-08-19,13.55
2015-08-20,12.95
2015-08-21,13.18
2015-08-24,12.79
2015-08-25,13
2015-08-26,13.52
2015-08-27,13.96
2015-08-28,14.14
2015-08-31,13.86
2015-09-01,13.37
2015-09-02,14.63
2015-09-03,14.19
2015-09-04,13.98
2015-09-08,14.61
2015-09-09,14.14
2015-09-10,14.54
2015-09-11,14.95
2015-09-14,15.06
2015-09-15,15.15
2015-09-16,14.75
2015-09-17,15.31
2015-09-18,14.94
2015-09-21,14.45
2015-09-22,13.75
2015-09-23,13.57
2015-09-24,13.43
2015-09-25,12.6
2015-09-28,11.36
2015-09-29,10.37
2015-09-30,10.53
2015-10-01,10.91
2015-10-02,11.73
2015-10-05,11.68
2015-10-06,11.44
2015-10-07,12.3
2015-10-08,11.71
2015-10-09,11.75
2015-10-12,11.56
2015-10-13,10.94
2015-10-14,11.37
2015-10-15,12.62
2015-10-16,12.71
2015-10-19,13.83
2015-10-20,13.69
2015-10-21,13.43
2015-10-22,13.18
2015-10-23,13.24
2015-10-26,12.84
2015-10-27,12.09
2015-10-28,13.05
2015-10-29,13.24
2015-10-30,13.35
2015-11-02,14.05
2015-11-03,14.07
2015-11-04,15.05
2015-11-05,14.97
2015-11-06,15.58
2015-11-09,15.7
2015-11-10,17.09
2015-11-11,16.5
2015-11-12,16.01
2015-11-13,15.88
2015-11-16,16.24
2015-11-17,16.1
2015-11-18,16.89
2015-11-19,16.6
2015-11-20,16.54
2015-11-23,17.91
2015-11-24,18.41
2015-11-25,18.7
2015-11-27,18.98
2015-11-30,18.7
2015-12-01,17.69
2015-12-02,17.57
2015-12-03,16.38
2015-12-04,16.75
2015-12-07,15.06
2015-12-08,15.34
2015-12-09,15
2015-12-10,15.15
2015-12-11,14.01
2015-12-14,13.59
2015-12-15,13.92
2015-12-16,13.7
2015-12-17,13.72
2015-12-18,13.47
2015-12-21,13.56
2015-12-22,14.01
2015-12-23,14.24
2015-12-24,13.96
2015-12-28,13.7
2015-12-29,13.8
2015-12-30,13.35
2015-12-31,13.25
2016-01-04,13.46
2016-01-05,13.7
2016-01-06,11.59
2016-01-07,9.95
2016-01-08,9.44
2016-01-11,8.12
2016-01-12,8.16
2016-01-13,6.94
2016-01-14,6.84
2016-01-15,6.54
2016-01-19,6.39
2016-01-20,6.82
2016-01-21,7.29
2016-01-22,7
2016-01-25,6.77
2016-01-26,6.68
2016-01-27,6.33
2016-01-28,5.94
2016-01-29,6.22
2016-02-01,6.07
2016-02-02,5.84
2016-02-03,5.88
2016-02-04,5.96
2016-02-05,5.76
2016-02-08,5.45
2016-02-09,5.8
2016-02-10,5.34
2016-02-11,5.33
2016-02-12,5.55
2016-02-16,5.83
2016-02-17,6.46
2016-02-18,6.1
2016-02-19,6.13
2016-02-22,6.24
2016-02-23,5.82
2016-02-24,5.91
2016-02-25,5.8
2016-02-26,6.09
2016-02-29,5.9
2016-03-01,6.37
2016-03-02,6.93
2016-03-03,7.33
2016-03-04,7.88
2016-03-07,8.42
2016-03-08,7.84
2016-03-09,7.62
2016-03-10,7.35
2016-03-11,7.9
2016-03-14,8.87
2016-03-15,7.67
2016-03-16,7.69
2016-03-17,7.76
2016-03-18,8.32
2016-03-21,8.9
2016-03-22,9.26
2016-03-23,8.37
2016-03-24,8.42
2016-03-28,8.24
2016-03-29,8.69
2016-03-30,8.64
2016-03-31,8.92
2016-04-01,8.97
2016-04-04,9.29
2016-04-05,8.99
2016-04-06,9.06
2016-04-07,9.08
2016-04-08,8.94
2016-04-11,8.84
2016-04-12,8.97
2016-04-13,9
2016-04-14,9
2016-04-15,8.98
2016-04-18,9.04
2016-04-19,9.04
2016-04-20,9.03
2016-04-21,9.92
2016-04-22,10.25
2016-04-25,10.07
2016-04-26,9.59
2016-04-27,9.44
2016-04-28,9.4
2016-04-29,9.3
2016-05-02,9.52
2016-05-03,8.63
2016-05-04,8.04
2016-05-05,8
2016-05-06,7.89
2016-05-09,8.26
2016-05-10,8.18
2016-05-11,8.05
2016-05-12,7.98
2016-05-13,7.63
2016-05-16,8
2016-05-17,8.03
2016-05-18,8.18
2016-05-19,8.21
2016-05-20,8.59
2016-05-23,8.7
2016-05-24,9.43
2016-05-25,9.69
2016-05-26,9.53
2016-05-27,9.62
2016-05-31,9.57
2016-06-01,9.58
2016-06-02,9.7
2016-06-03,9.25
2016-06-06,9.32
2016-06-07,9.56
2016-06-08,9.29
2016-06-09,9.125
2016-06-10,8.53
2016-06-13,8.36
2016-06-14,8.07
2016-06-15,7.91
2016-06-16,8.06
2016-06-17,7.62
2016-06-20,7.71
2016-06-21,7.62
2016-06-22,7.68
2016-06-23,8.03
2016-06-24,7.52
2016-06-27,6.76
2016-06-28,7.02
2016-06-29,6.97
2016-06-30,6.71
2016-07-01,7.19
2016-07-05,6.98
2016-07-06,7.09
2016-07-07,7.1
2016-07-08,7.11
2016-07-11,7.39
2016-07-12,7.53
2016-07-13,7.17
2016-07-14,7.19
2016-07-15,7.63
2016-07-18,7.62
2016-07-19,7.1
2016-07-20,7.11
2016-07-21,7.14
2016-07-22,7.03
2016-07-25,7.13
2016-07-26,7.36
2016-07-27,7.67
2016-07-28,7.36
2016-07-29,7.38
2016-08-01,7.23
2016-08-02,6.98
2016-08-03,6.99
2016-08-04,6.8
2016-08-05,6.92
2016-08-08,6.79
2016-08-09,6.97
2016-08-10,6.7
2016-08-11,6.95
2016-08-12,6.97
2016-08-15,7.22
2016-08-16,7.2
2016-08-17,6.99
2016-08-18,7.79
2016-08-19,8.08
2016-08-22,7.76
2016-08-23,7.82
2016-08-24,7.15
2016-08-25,6.85
2016-08-26,6.92
2016-08-29,7.12
2016-08-30,9.73
2016-08-31,9.95
2016-09-01,11.1
2016-09-02,10.62
2016-09-06,8.97
2016-09-07,9.14
2016-09-08,9.22
2016-09-09,8.5
2016-09-12,8.97
2016-09-13,8.72
2016-09-14,9.03
2016-09-15,9.11
2016-09-16,9.3
2016-09-19,9.13
2016-09-20,9.2
2016-09-21,9.57
2016-09-22,9.71
2016-09-23,9.35
2016-09-26,9.35
2016-09-27,9.69
2016-09-28,9.73
2016-09-29,9.45
2016-09-30,9.73
2016-10-03,9.86
2016-10-04,9.92
2016-10-05,10.11
2016-10-06,9.71
2016-10-07,9.56
2016-10-10,9.77
2016-10-11,9.37
2016-10-12,8.97
2016-10-13,9.12
2016-10-14,8.61
2016-10-17,8.5
2016-10-18,8.62
2016-10-19,8.45
2016-10-20,8.57
2016-10-21,8.59
2016-10-24,8.48
2016-10-25,8.45
2016-10-26,8.35
2016-10-27,7.84
2016-10-28,7.52
2016-10-31,7.24
2016-11-01,7.13
2016-11-02,6.53
2016-11-03,6.39
2016-11-04,6.83
2016-11-07,6.92
2016-11-08,7.79
2016-11-09,9.32
2016-11-10,9.8
2016-11-11,9.93
2016-11-14,10.07
2016-11-15,9.77
2016-11-16,9.47
2016-11-17,9.95
2016-11-18,9.87
2016-11-21,9.97
2016-11-22,9.67
2016-11-23,10.01
2016-11-25,9.91
2016-11-28,9.29
2016-11-29,9.3
2016-11-30,9.23
2016-12-01,9.03
2016-12-02,9.28
2016-12-05,8.87
2016-12-06,9.13
2016-12-07,9.18
2016-12-08,9.18
2016-12-09,9.21
2016-12-12,9.14
2016-12-13,9.23
2016-12-14,9.22
2016-12-15,9.67
2016-12-16,9.75
2016-12-19,9.47
2016-12-20,9.5
2016-12-21,9.32
2016-12-22,9.04
2016-12-23,9.56
2016-12-27,9.37
2016-12-28,9.2
2016-12-29,9.34
2016-12-30,9.4
2017-01-03,9.64
2017-01-04,10.56
2017-01-05,10.74
2017-01-06,11.01
2017-01-09,10.95
2017-01-10,10.66
2017-01-11,10.38
2017-01-12,10.25
2017-01-13,10.12
2017-01-17,9.84
2017-01-18,9.79
2017-01-19,10.47
2017-01-20,10.39
2017-01-23,10.38
2017-01-24,10.32
2017-01-25,10.79
2017-01-26,10.73
2017-01-27,10.84
2017-01-30,10.28
2017-01-31,10.35
2017-02-01,10.56
2017-02-02,10.65
2017-02-03,10.78
2017-02-06,10.82
2017-02-07,10.32
2017-02-08,10.1
2017-02-09,10.13
2017-02-10,10.12
2017-02-13,10.12
2017-02-14,10.25
2017-02-15,10.84
2017-02-16,10.67
2017-02-17,10.6
2017-02-21,10.58
2017-02-22,10.44
2017-02-23,10.27
2017-02-24,10.1
2017-02-27,11.13
2017-02-28,10.37
2017-03-01,11.03
2017-03-02,13.84
2017-03-03,11.63
2017-03-06,11.66
2017-03-07,11.39
2017-03-08,11.87
2017-03-09,11.76
2017-03-10,10.55
2017-03-13,10
2017-03-14,10
2017-03-15,10.04
2017-03-16,10.51
2017-03-17,10.37
2017-03-20,10.67
2017-03-21,10.14
2017-03-22,10.1
2017-03-23,10.36
2017-03-24,10.48
2017-03-27,10.83
2017-03-28,11.31
2017-03-29,11.97
2017-03-30,12.78
2017-03-31,12.84
2017-04-03,12.52
2017-04-04,12.61
2017-04-05,12.21
2017-04-06,12.26
2017-04-07,11.36
2017-04-10,11.44
2017-04-11,10.84
2017-04-12,10.55
2017-04-13,10.96
2017-04-17,11.28
2017-04-18,11.21
2017-04-19,11.72
2017-04-20,11.67
2017-04-21,11.31
2017-04-24,11.31
2017-04-25,10.41
2017-04-26,10.38
2017-04-27,10.21
2017-04-28,10.22
2017-05-01,10.17
2017-05-02,9.73
2017-05-03,9.49
2017-05-04,8.67
2017-05-05,8.32
2017-05-08,8.76
2017-05-09,8.74
2017-05-10,8.94
2017-05-11,9.61
2017-05-12,9.74
2017-05-15,9.78
2017-05-16,9.96
2017-05-17,9.65
2017-05-18,9.8
2017-05-19,9.95
2017-05-22,9.78
2017-05-23,9.53
2017-05-24,9.44
2017-05-25,9.09
2017-05-26,8.95
2017-05-30,8.35
2017-05-31,8.12
2017-06-01,8.83
2017-06-02,8.88
2017-06-05,8.72
2017-06-06,8.64
2017-06-07,8.71
2017-06-08,9.2
2017-06-09,9.18
2017-06-12,8.97
2017-06-13,9.07
2017-06-14,9.22
2017-06-15,9.18
2017-06-16,9.08
2017-06-19,9.18
2017-06-20,9.32
2017-06-21,9.5
2017-06-22,9.96
2017-06-23,9.97
2017-06-26,9.52
2017-06-27,9.17
2017-06-28,9.74
2017-06-29,9.5
2017-06-30,9.05
2017-07-03,9.42
2017-07-05,9.63
2017-07-06,9.48
2017-07-07,9.3
2017-07-10,9.46
2017-07-11,9.52
2017-07-12,9.58
2017-07-13,9.59
2017-07-14,9.44
2017-07-17,9.45
2017-07-18,9.25
2017-07-19,9.44
2017-07-20,9.38
2017-07-21,9.34
2017-07-24,9.37
2017-07-25,9.19
2017-07-26,9.14
2017-07-27,8.8
2017-07-28,8.91
2017-07-31,8.44
2017-08-01,8.42
2017-08-02,8.26
2017-08-03,8.15
2017-08-04,8.31
2017-08-07,8.48
2017-08-08,8.85
2017-08-09,8.48
2017-08-10,8.25
2017-08-11,8.55
2017-08-14,8.89
2017-08-15,8.65
2017-08-16,8.42
2017-08-17,8.15
2017-08-18,8.21
2017-08-21,8.22
2017-08-22,8.66
2017-08-23,9
2017-08-24,9.01
2017-08-25,9.05
2017-08-28,9.77
2017-08-29,9.98
2017-08-30,9.78
2017-08-31,10.22
2017-09-01,10.27
2017-09-05,10.31
2017-09-06,10.43
2017-09-07,10.55
2017-09-08,10.81
2017-09-11,10.6
2017-09-12,10.6
2017-09-13,10.59
2017-09-14,10.57
2017-09-15,11
2017-09-18,10.86
2017-09-19,10.52
2017-09-20,11.16
2017-09-21,10.48
2017-09-22,10.63
2017-09-25,10.82
2017-09-26,10.64
2017-09-27,10.98
2017-09-28,10.88
2017-09-29,10.98
2017-10-02,11.99
2017-10-03,11.78
2017-10-04,11.67
2017-10-05,11.48
2017-10-06,11.69
2017-10-09,11.36
2017-10-10,11.42
2017-10-11,11.38
2017-10-12,11.59
2017-10-13,11.34
2017-10-16,11.38
2017-10-17,11.43
2017-10-18,11.33
2017-10-19,11.01
2017-10-20,10.97
2017-10-23,10.64
2017-10-24,10.49
2017-10-25,10.37
2017-10-26,9.99
2017-10-27,10.16
2017-10-30,10.22
2017-10-31,10.21
2017-11-01,10.36
2017-11-02,10.49
2017-11-03,11.23
2017-11-06,11.2
2017-11-07,10.96
2017-11-08,11.07
2017-11-09,10.77
2017-11-10,10.91
2017-11-13,10.71
2017-11-14,10.54
2017-11-15,11.17
2017-11-16,11.39
2017-11-17,11.47
2017-11-20,11.11
2017-11-21,11.07
2017-11-22,11.33
2017-11-24,11.23
2017-11-27,11.21
2017-11-28,11.21
2017-11-29,11.16
2017-11-30,11.19
2017-12-01,11.26
2017-12-04,11.21
2017-12-05,10.66
2017-12-06,10.33
2017-12-07,10.63
2017-12-08,11.11
2017-12-11,10.51
2017-12-12,9.6
2017-12-13,9.66
2017-12-14,9.25
2017-12-15,9.24
2017-12-18,9.15
2017-12-19,9.15
2017-12-20,9.18
2017-12-21,9.43
2017-12-22,9.8
2017-12-26,9.61
2017-12-27,9.67
2017-12-28,9.79
2017-12-29,9.6
2018-01-02,9.92
2018-01-03,10.1
2018-01-04,10.17
2018-01-05,10.25
2018-01-08,10.06
2018-01-09,10.08
2018-01-10,10.01
2018-01-11,10.52
2018-01-12,10.78
2018-01-16,10.04
2018-01-17,10.18
2018-01-18,10
2018-01-19,10.01
2018-01-22,10.27
2018-01-23,10.78
2018-01-24,10.45
2018-01-25,11.8
2018-01-26,12.28
2018-01-29,12.43
2018-01-30,11.99
2018-01-31,11.82
2018-02-01,11.78
2018-02-02,11.66
2018-02-05,11.2
2018-02-06,12.49
2018-02-07,13.11
2018-02-08,13.68
2018-02-09,13.06
2018-02-12,13.2
2018-02-13,14.17
2018-02-14,14.48
2018-02-15,14.77
2018-02-16,14.98
2018-02-20,14.59
2018-02-21,14.8
2018-02-22,14.59
2018-02-23,14.85
2018-02-26,14.86
2018-02-27,14.95
2018-02-28,14.77
2018-03-01,15.45
2018-03-02,15.29
2018-03-05,16.18
2018-03-06,16.23
2018-03-07,15.99
2018-03-08,16.46
2018-03-09,16.86
2018-03-12,17.25
2018-03-13,17.01
2018-03-14,16.81
2018-03-15,16.16
2018-03-16,16.01
2018-03-19,15.24
2018-03-20,15.66
2018-03-21,15.32
2018-03-22,14.97
2018-03-23,13.76
2018-03-26,14.22
2018-03-27,13.42
2018-03-28,13.27
2018-03-29,13.42
2018-04-02,12.54
2018-04-03,12.75
2018-04-04,13.46
2018-04-05,13
2018-04-06,12.48
2018-04-09,12
2018-04-10,12.76
2018-04-11,12.64
2018-04-12,13.87
2018-04-13,13.9
2018-04-16,14.05
2018-04-17,15.13
2018-04-18,14.71
2018-04-19,14.77
2018-04-20,14.59
2018-04-23,14.05
2018-04-24,13.62
2018-04-25,14.55
2018-04-26,14.89
2018-04-27,15.15
2018-04-30,13.08
2018-05-01,14.51
2018-05-02,15.52
2018-05-03,15.62
2018-05-04,16.48
2018-05-07,17.35
2018-05-08,16.93
2018-05-09,17.49
2018-05-10,17.01
2018-05-11,17.98
2018-05-14,18.2
2018-05-15,18.42
2018-05-16,18.54
2018-05-17,19.08
2018-05-18,19.75
2018-05-21,19.88
2018-05-22,18.82
2018-05-23,19.06
2018-05-24,17.34
2018-05-25,17.68
2018-05-29,17.84
2018-05-30,18.55
2018-05-31,18.58
2018-06-01,18.12
2018-06-04,17.5
2018-06-05,17.76
2018-06-06,17.92
2018-06-07,17.32
2018-06-08,17.59
2018-06-11,17.05
2018-06-12,17.3
2018-06-13,17.5
2018-06-14,18.04
2018-06-15,18.65
2018-06-18,18.64
2018-06-19,18.8
2018-06-20,19.56
2018-06-21,18.83
2018-06-22,18.68
2018-06-25,18.17
2018-06-26,18.28
2018-06-27,17.05
2018-06-28,16.95
2018-06-29,16.99
2018-07-02,18.05
2018-07-03,17.89
2018-07-05,18.57
2018-07-06,18.71
2018-07-09,18.66
2018-07-10,18.63
2018-07-11,18.57
2018-07-12,18.59
2018-07-13,18.64
2018-07-16,18.34
2018-07-17,18.46
2018-07-18,18.72
2018-07-19,19.19
2018-07-20,18.93
2018-07-23,18.47
2018-07-24,18.16
2018-07-25,17.33
2018-07-26,17.36
2018-07-27,17.08
2018-07-30,17.21
2018-07-31,17.78
2018-08-01,17.74
2018-08-02,17.71
2018-08-03,17.62
2018-08-06,17.65
2018-08-07,18.38
2018-08-08,18
2018-08-09,18.14
2018-08-10,18.08
2018-08-13,18.01
2018-08-14,18.51
2018-08-15,17.94
2018-08-16,18.2
2018-08-17,17.9
2018-08-20,17.36
2018-08-21,18
2018-08-22,18.26
2018-08-23,18.02
2018-08-24,18.16
2018-08-27,18.12
2018-08-28,18.34
2018-08-29,20.05
2018-08-30,21.18
2018-08-31,21.05
2018-09-04,20.76
2018-09-05,20.99
2018-09-06,19.25
2018-09-07,19.01
2018-09-10,19.31
2018-09-11,19.74
2018-09-12,18.6
2018-09-13,18.86
2018-09-14,18.72
2018-09-17,18
2018-09-18,18.57
2018-09-19,18.49
2018-09-20,18.98
2018-09-21,18.32
2018-09-24,18.26
2018-09-25,18.09
2018-09-26,17.17
2018-09-27,17.1
2018-09-28,17.03
2018-10-01,16.95
2018-10-02,15.83
2018-10-03,16.48
2018-10-04,14.87
2018-10-05,15.01
2018-10-08,15.55
2018-10-09,15.56
2018-10-10,12.435
2018-10-11,12.45
2018-10-12,12.6
2018-10-15,12.62
2018-10-16,13.11
2018-10-17,12.8
2018-10-18,12.52
2018-10-19,12.27
2018-10-22,11.99
2018-10-23,12.15
2018-10-24,10.75
2018-10-25,11.06
2018-10-26,10.91
2018-10-29,10.43
2018-10-30,10.55
2018-10-31,10.54
2018-11-01,11.22
2018-11-02,11.24
2018-11-05,11.14
2018-11-06,11.22
2018-11-07,11.92
2018-11-08,11.55
2018-11-09,11.6
2018-11-12,10.72
2018-11-13,10.98
2018-11-14,10.34
2018-11-15,11
2018-11-16,11.16
2018-11-19,10.68
2018-11-20,10.22
2018-11-21,10.4
2018-11-23,10.51
2018-11-26,10.73
2018-11-27,10.13
2018-11-28,10.46
2018-11-29,9.56
2018-11-30,10.4
2018-12-03,10.96
2018-12-04,10.56
2018-12-06,10.19
2018-12-07,10.01
2018-12-10,10.1
2018-12-11,10.3
2018-12-12,10.45
2018-12-13,9.81
2018-12-14,9.62
2018-12-17,9.51
2018-12-18,9.16
2018-12-19,8.9
2018-12-20,8.87
2018-12-21,8.2
2018-12-24,8.28
2018-12-26,9.17
2018-12-27,9.24
2018-12-28,9.13
2018-12-31,9.37
2019-01-02,9.56
2019-01-03,9.34
2019-01-04,10.06
2019-01-07,10.23
2019-01-08,10.25
2019-01-09,10.23
2019-01-10,10.17
2019-01-11,10.09
2019-01-14,9.69
2019-01-15,9.93
2019-01-16,9.84
2019-01-17,9.71
2019-01-18,9.86
2019-01-22,9.16
2019-01-23,8.94
2019-01-24,9.01
2019-01-25,9.09
2019-01-28,8.34
2019-01-29,8.24
2019-01-30,8.56
2019-01-31,8.47
2019-02-01,8.56
2019-02-04,8.99
2019-02-05,8.94
2019-02-06,9.01
2019-02-07,8.93
2019-02-08,8.8
2019-02-11,8.62
2019-02-12,8.76
2019-02-13,9.16
2019-02-14,8.81
2019-02-15,9.21
2019-02-19,9.17
2019-02-20,9.33
2019-02-21,8.97
2019-02-22,5.07
2019-02-25,5.06
2019-02-26,4.87
2019-02-27,4.4
2019-02-28,4.13
2019-03-01,4.18
2019-03-04,4.49
2019-03-05,4.31
2019-03-06,4.24
2019-03-07,4.14
2019-03-08,4.22
2019-03-11,4.12
2019-03-12,4.46
2019-03-13,4.42
2019-03-14,4.4
2019-03-15,4.71
2019-03-18,5.31
2019-03-19,5.35
2019-03-20,5.4
2019-03-21,5.82
2019-03-22,5.44
2019-03-25,5.5
2019-03-26,5.51
2019-03-27,5.63
2019-03-28,5.7
2019-03-29,5.84
2019-04-01,5.53
2019-04-02,5.58
2019-04-03,5.65
2019-04-04,5.76
2019-04-05,5.56
2019-04-08,5.45
2019-04-09,5.12
2019-04-10,5.33
2019-04-11,5.29
2019-04-12,5.14
2019-04-15,5.14
2019-04-16,5.11
2019-04-17,4.82
2019-04-18,4.63
2019-04-22,4.85
2019-04-23,4.98
2019-04-24,4.86
2019-04-25,4.8
2019-04-26,4.85
2019-04-29,4.86
2019-04-30,4.67
2019-05-01,4.7
2019-05-02,4.82
2019-05-03,4.81
2019-05-06,4.91
2019-05-07,4.74
2019-05-08,4.71
2019-05-09,4.63
2019-05-10,4.63
2019-05-13,4.32
2019-05-14,4.64
2019-05-15,4.79
2019-05-16,4.69
2019-05-17,4.64
2019-05-20,5.14
2019-05-21,5.23
2019-05-22,5.79
2019-05-23,6.1
2019-05-24,6.19
2019-05-28,5.8
2019-05-29,6.03
2019-05-30,5.78
2019-05-31,5.64
2019-06-03,5.36
2019-06-04,5.39
2019-06-05,5.46
2019-06-06,5.43
2019-06-07,5.68
2019-06-10,5.89
2019-06-11,5.56
2019-06-12,5.43
2019-06-13,5.795
2019-06-14,5.755
2019-06-17,6.055
2019-06-18,5.97
2019-06-19,5.985
2019-06-20,6.15
2019-06-21,6.36
2019-06-24,6.28
2019-06-25,5.935
2019-06-26,6.035
2019-06-27,6.13
2019-06-28,5.9
2019-07-01,5.66
2019-07-02,6.52
2019-07-03,8.88
2019-07-04,8.88
2019-07-05,8.535
2019-07-08,8.39
2019-07-09,7.99
2019-07-10,7.78
2019-07-11,7.7
2019-07-12,7.985
2019-07-15,8.415
2019-07-16,7.94
2019-07-17,7.9
2019-07-18,8.35
2019-07-19,8.335
2019-07-22,8.34
2019-07-23,8.785
2019-07-24,8.845
2019-07-25,8.57
2019-07-26,8.685
2019-07-29,8.67
2019-07-30,8.85
2019-07-31,8.825
2019-08-01,8.815
2019-08-02,8.32
2019-08-05,7.9
2019-08-06,8.295
2019-08-07,8.72
2019-08-08,9.115
2019-08-09,8.86
2019-08-12,8.745
2019-08-13,8.835
2019-08-14,8.585
2019-08-15,8.8
2019-08-16,9.09
2019-08-19,9.275
2019-08-20,9.22
2019-08-21,9.31
2019-08-22,9.155
2019-08-23,8.66
2019-08-26,8.88
2019-08-27,8.675
2019-08-28,8.915
2019-08-29,8.99
2019-08-30,8.645
2019-09-02,8.635
2019-09-03,8.31
2019-09-04,8.505
2019-09-05,9.455
2019-09-06,9.55
2019-09-09,9.695
2019-09-10,10.305
2019-09-11,10.395
2019-09-12,10.61
2019-09-13,11.11
2019-09-16,11.855
2019-09-17,11.665
2019-09-18,11.695
2019-09-19,11.325
2019-09-20,10.645
2019-09-23,10.045
2019-09-24,9.935
2019-09-25,10.135
2019-09-26,9.905
2019-09-27,9.805
2019-09-30,9.605
2019-10-01,9.235
2019-10-02,9.825
2019-10-03,10.39
2019-10-04,10.5
2019-10-07,10.535
2019-10-08,9.545
2019-10-09,9.845
2019-10-10,9.98
2019-10-11,10.185
2019-10-14,10.11
2019-10-15,10.51
2019-10-16,10.465
2019-10-17,10.855
2019-10-18,10.69
2019-10-21,11.13
2019-10-22,11.365
2019-10-23,11.095
2019-10-24,11.14
2019-10-25,11.16
2019-10-28,11.275
2019-10-29,11.505
2019-10-30,11.605
2019-10-31,11.675
2019-11-01,12.545
2019-11-04,13.39
2019-11-05,14.12
2019-11-06,13.935
2019-11-07,14.455
2019-11-08,14.68
2019-11-11,15.255
2019-11-12,15.445
2019-11-13,15.075
2019-11-14,15.375
2019-11-15,15.58
2019-11-18,15.435
2019-11-19,15.585
2019-11-20,16.255
2019-11-21,16.065
2019-11-22,16.25
2019-11-25,16.995
