date,close
2013-11-07,36.2862
2013-11-08,36.623
2013-11-11,36.685
2013-11-12,36.9864
2013-11-13,37.1814
2013-11-14,37.4118
2013-11-15,37.2789
2013-11-18,37.1902
2013-11-19,36.9332
2013-11-20,36.7907
2013-11-21,37.4052
2013-11-22,37.0223
2013-11-25,36.8887
2013-11-26,37.3073
2013-11-27,37.5477
2013-11-29,37.3518
2013-12-02,37.521
2013-12-03,37.8416
2013-12-04,38.0465
2013-12-05,37.5388
2013-12-06,37.9307
2013-12-09,37.6991
2013-12-10,37.334
2013-12-11,37.3429
2013-12-12,36.4345
2013-12-13,36.2118
2013-12-16,36.7996
2013-12-17,37.0045
2013-12-18,37.6279
2013-12-19,37.7526
2013-12-20,38.4205
2013-12-23,38.4116
2013-12-24,38.661
2013-12-26,38.7767
2013-12-27,38.8569
2013-12-30,39.2131
2013-12-31,39.3022
2014-01-02,38.8124
2014-01-03,38.8925
2014-01-06,38.5808
2014-01-07,39.1953
2014-01-08,39.1686
2014-01-09,39.3913
2014-01-10,39.5427
2014-01-13,39.1063
2014-01-14,39.6406
2014-01-15,39.8633
2014-01-16,39.6495
2014-01-17,39.4358
2014-01-21,39.8633
2014-01-22,39.9613
2014-01-23,39.3467
2014-01-24,38.7678
2014-01-27,38.5897
2014-01-28,39.1775
2014-01-29,38.4205
2014-01-30,39.0528
2014-01-31,38.5541
2014-02-03,37.521
2014-02-04,38.2513
2014-02-05,38.6877
2014-02-06,39.3645
2014-02-07,39.5427
2014-02-10,39.8455
2014-02-11,40.3709
2014-02-12,40.5223
2014-02-13,40.932
2014-02-14,41.1012
2014-02-18,41.2704
2014-02-19,41.1012
2014-02-20,41.7514
2014-02-21,42.161
2014-02-24,42.0809
2014-02-25,41.8493
2014-02-26,41.3862
2014-02-27,41.6356
2014-02-28,41.9295
2014-03-03,41.3595
2014-03-04,41.8048
2014-03-05,42.4942
2014-03-06,42.7449
2014-03-07,42.4584
2014-03-10,42.145
2014-03-11,42.0107
2014-03-12,42.0018
2014-03-13,41.4556
2014-03-14,41.6347
2014-03-17,42.8613
2014-03-18,42.6823
2014-03-19,42.5838
2014-03-20,42.7539
2014-03-21,42.4136
2014-03-24,41.6078
2014-03-25,41.6884
2014-03-26,41.4466
2014-03-27,41.581
2014-03-28,41.9481
2014-03-31,42.7628
2014-04-01,42.6196
2014-04-02,42.7987
2014-04-03,42.6733
2014-04-04,41.9749
2014-04-07,41.187
2014-04-08,41.3571
2014-04-09,41.5989
2014-04-10,41.1512
2014-04-11,40.5065
2014-04-14,40.614
2014-04-15,39.8977
2014-04-16,40.1573
2014-04-17,40.4617
2014-04-21,40.408
2014-04-22,40.2021
2014-04-23,40.3185
2014-04-24,41.6436
2014-04-25,40.9631
2014-04-28,41.1601
2014-04-29,40.7751
2014-04-30,40.6856
2014-05-01,41.0527
2014-05-02,41.4108
2014-05-05,41.5362
2014-05-06,41.2765
2014-05-07,41.6257
2014-05-08,41.3482
2014-05-09,42.0376
2014-05-12,42.548
2014-05-13,42.5659
2014-05-14,42.3331
2014-05-15,41.6794
2014-05-16,41.769
2014-05-19,41.9033
2014-05-20,41.6974
2014-05-21,41.187
2014-05-22,41.0258
2014-05-23,41.0527
2014-05-27,40.5602
2014-05-28,41.0527
2014-05-29,41.1601
2014-05-30,40.8647
2014-06-02,40.8826
2014-06-03,40.8915
2014-06-04,41.3687
2014-06-05,40.6034
2014-06-06,41.1076
2014-06-09,41.2156
2014-06-10,40.7565
2014-06-11,40.2973
2014-06-12,40.2973
2014-06-13,40.1353
2014-06-16,40.2613
2014-06-17,40.6754
2014-06-18,41.3597
2014-06-19,42.7911
2014-06-20,42.8722
2014-06-23,42.8362
2014-06-24,42.395
2014-06-25,42.8092
2014-06-26,42.8902
2014-06-27,43.1423
2014-06-30,43.0162
2014-07-01,43.1513
2014-07-02,43.2503
2014-07-03,43.1693
2014-07-07,43.3853
2014-07-08,42.8542
2014-07-09,43.1603
2014-07-10,43.6284
2014-07-11,43.5204
2014-07-14,43.6284
2014-07-15,43.4123
2014-07-16,43.6194
2014-07-17,43.5564
2014-07-18,43.9075
2014-07-21,43.6644
2014-07-22,43.6104
2014-07-23,43.8985
2014-07-24,43.9345
2014-07-25,43.2593
2014-07-28,42.9712
2014-07-29,42.9532
2014-07-30,42.0439
2014-07-31,40.9185
2014-08-01,40.7925
2014-08-04,40.5224
2014-08-05,40.2343
2014-08-06,40.8735
2014-08-07,40.7025
2014-08-08,41.4137
2014-08-11,41.5577
2014-08-12,41.5667
2014-08-13,42.1789
2014-08-14,42.44
2014-08-15,42.7461
2014-08-18,43.0702
2014-08-19,43.5114
2014-08-20,42.9352
2014-08-21,42.8272
2014-08-22,42.404
2014-08-25,42.6561
2014-08-26,42.7641
2014-08-27,42.9532
2014-08-28,42.8542
2014-08-29,43.0162
2014-09-02,42.5121
2014-09-03,43.3085
2014-09-04,41.969
2014-09-05,42.5663
2014-09-08,42.1228
2014-09-09,41.7065
2014-09-10,41.444
2014-09-11,41.5707
2014-09-12,40.901
2014-09-15,40.91
2014-09-16,41.1997
2014-09-17,41.5255
2014-09-18,41.3807
2014-09-19,41.8785
2014-09-22,41.7427
2014-09-23,40.7833
2014-09-24,41.435
2014-09-25,40.729
2014-09-26,40.9824
2014-09-29,40.8286
2014-09-30,40.1498
2014-10-01,39.6157
2014-10-02,39.48
2014-10-03,39.8963
2014-10-06,39.6791
2014-10-07,38.5115
2014-10-08,39.2175
2014-10-09,38.0499
2014-10-10,37.5974
2014-10-13,36.6018
2014-10-14,36.6471
2014-10-15,36.2126
2014-10-16,36.2126
2014-10-17,37.2082
2014-10-20,37.9323
2014-10-21,37.697
2014-10-22,37.3983
2014-10-23,38.1948
2014-10-24,38.3577
2014-10-27,38.3577
2014-10-28,39.1994
2014-10-29,38.9188
2014-10-30,38.7921
2014-10-31,39.2356
2014-11-03,38.8826
2014-11-04,38.4572
2014-11-05,38.1857
2014-11-06,38.7921
2014-11-07,38.6654
2014-11-10,38.5749
2014-11-11,38.5115
2014-11-12,38.7921
2014-11-13,38.6745
2014-11-14,38.2762
2014-11-17,39.1451
2014-11-18,39.489
2014-11-19,39.662
2014-11-20,40.0261
2014-11-21,39.7985
2014-11-24,39.9169
2014-11-25,39.9351
2014-11-26,39.8714
2014-11-28,39.9988
2014-12-01,39.6074
2014-12-02,40.5359
2014-12-03,39.9624
2014-12-04,39.7166
2014-12-05,40.2355
2014-12-08,39.6711
2014-12-09,39.8076
2014-12-10,39.8167
2014-12-11,40.3083
2014-12-12,39.2979
2014-12-15,38.5605
2014-12-16,38.1054
2014-12-17,38.9155
2014-12-18,40.3174
2014-12-19,40.7817
2014-12-22,40.6451
2014-12-23,41.2641
2014-12-24,41.0548
2014-12-26,41.1094
2014-12-29,41.2823
2014-12-30,40.8272
2014-12-31,40.2537
2015-01-02,39.9442
2015-01-05,40.2537
2015-01-06,39.1613
2015-01-07,39.7621
2015-01-08,40.1171
2015-01-09,39.8441
2015-01-12,39.5254
2015-01-13,39.2433
2015-01-14,39.4162
2015-01-15,38.4695
2015-01-16,39.2524
2015-01-20,39.5163
2015-01-21,39.9897
2015-01-22,40.1809
2015-01-23,39.4617
2015-01-26,39.4162
2015-01-27,39.3252
2015-01-28,38.8336
2015-01-29,39.0885
2015-01-30,38.3238
2015-02-02,38.5423
2015-02-03,39.2159
2015-02-04,39.1795
2015-02-05,39.3161
2015-02-06,38.6242
2015-02-09,38.5787
2015-02-10,39.7348
2015-02-11,39.3616
2015-02-12,40.372
2015-02-13,39.7712
2015-02-17,39.9442
2015-02-18,40.2264
2015-02-19,40.4813
2015-02-20,40.6997
2015-02-23,40.809
2015-02-24,41.2641
2015-02-25,41.7375
2015-02-26,42.0197
2015-02-27,42.0561
2015-03-02,42.2382
2015-03-03,41.7648
2015-03-04,41.0779
2015-03-05,40.6566
2015-03-06,39.9697
2015-03-09,39.8689
2015-03-10,39.2003
2015-03-11,38.8706
2015-03-12,39.1545
2015-03-13,38.3302
2015-03-16,38.8339
2015-03-17,38.2386
2015-03-18,39.0629
2015-03-19,39.2003
2015-03-20,39.6308
2015-03-23,39.7773
2015-03-24,40.3543
2015-03-25,40.3452
2015-03-26,40.0338
2015-03-27,40.2994
2015-03-30,40.9497
2015-03-31,40.4826
2015-04-01,40.7298
2015-04-02,41.0138
2015-04-06,41.8564
2015-04-07,41.9113
2015-04-08,41.8747
2015-04-09,42.2594
2015-04-10,41.8747
2015-04-13,41.3527
2015-04-14,40.9313
2015-04-15,41.4076
2015-04-16,41.6183
2015-04-17,41.2977
2015-04-20,41.2977
2015-04-21,40.6749
2015-04-22,41.2061
2015-04-23,41.316
2015-04-24,41.5816
2015-04-27,41.3984
2015-04-28,41.5267
2015-04-29,41.197
2015-04-30,40.6749
2015-05-01,42.177
2015-05-04,41.8014
2015-05-05,40.8306
2015-05-06,41.2977
2015-05-07,41.5541
2015-05-08,42.1128
2015-05-11,41.8106
2015-05-12,41.545
2015-05-13,41.4442
2015-05-14,42.4792
2015-05-15,42.6441
2015-05-18,42.6349
2015-05-19,42.2594
2015-05-20,42.3601
2015-05-21,41.4809
2015-05-22,41.0321
2015-05-26,40.6566
2015-05-27,41.2427
2015-05-28,40.8947
2015-05-29,40.51
2015-06-01,40.6199
2015-06-02,40.6566
2015-06-03,40.8317
2015-06-04,40.4446
2015-06-05,39.8363
2015-06-08,39.5782
2015-06-09,39.569
2015-06-10,39.9008
2015-06-11,39.8363
2015-06-12,40.2326
2015-06-15,39.8178
2015-06-16,40.3616
2015-06-17,40.8501
2015-06-18,41.4953
2015-06-19,41.2373
2015-06-22,41.2833
2015-06-23,41.0621
2015-06-24,41.016
2015-06-25,40.9884
2015-06-26,41.394
2015-06-29,40.2234
2015-06-30,40.039
2015-07-01,40.0667
2015-07-02,39.781
2015-07-06,39.145
2015-07-07,40.546
2015-07-08,40.0114
2015-07-09,40.4907
2015-07-10,40.9515
2015-07-13,41.864
2015-07-14,42.1313
2015-07-15,41.6705
2015-07-16,42.0299
2015-07-17,41.9285
2015-07-20,41.9654
2015-07-21,41.7903
2015-07-22,41.8179
2015-07-23,41.8548
2015-07-24,41.3571
2015-07-27,41.1912
2015-07-28,41.7903
2015-07-29,42.583
2015-07-30,41.8825
2015-07-31,47.0809
2015-08-03,45.0255
2015-08-04,46.5647
2015-08-05,47.7814
2015-08-06,49.21
2015-08-07,47.6616
2015-08-10,48.1962
2015-08-11,48.104
2015-08-12,48.6847
2015-08-13,48.3529
2015-08-14,48.3805
2015-08-17,48.8506
2015-08-18,48.528
2015-08-19,48.4266
2015-08-20,48.1501
2015-08-21,47.7353
2015-08-24,46.6385
2015-08-25,46.4173
2015-08-26,47.7261
2015-08-27,47.7906
2015-08-28,47.809
2015-08-31,47.4588
2015-09-01,46.9426
2015-09-02,47.7675
2015-09-03,47.8509
2015-09-04,46.331
2015-09-08,47.4339
2015-09-09,45.5246
2015-09-10,45.6544
2015-09-11,45.4412
2015-09-14,45.4134
2015-09-15,45.1447
2015-09-16,45.8398
2015-09-17,45.4598
2015-09-18,44.9593
2015-09-21,45.3764
2015-09-22,44.6071
2015-09-23,45.3393
2015-09-24,45.0612
2015-09-25,45.0798
2015-09-28,43.393
2015-09-29,44.2178
2015-09-30,44.811
2015-10-01,45.2095
2015-10-02,45.5339
2015-10-05,45.849
2015-10-06,45.2559
2015-10-07,46.2383
2015-10-08,46.5905
2015-10-09,47.1095
2015-10-12,47.1836
2015-10-13,46.5534
2015-10-14,46.4236
2015-10-15,46.6183
2015-10-16,47.1558
2015-10-19,47.4153
2015-10-20,47.1744
2015-10-21,46.8314
2015-10-22,47.5543
2015-10-23,47.7397
2015-10-26,47.2114
2015-10-27,47.0261
2015-10-28,47.6656
2015-10-29,47.3783
2015-10-30,47.5821
2015-11-02,47.5451
2015-11-03,47.7953
2015-11-04,46.9705
2015-11-05,47.9436
2015-11-06,46.85
2015-11-09,46.4514
2015-11-10,47.2763
2015-11-11,47.7675
2015-11-12,47.8324
2015-11-13,47.1373
2015-11-16,47.23
2015-11-17,46.7202
2015-11-18,47.2607
2015-11-19,47.3167
2015-11-20,46.6922
2015-11-23,47.1209
2015-11-24,47.3633
2015-11-25,47.9411
2015-11-27,48.0529
2015-11-30,46.8786
2015-12-01,47.0184
2015-12-02,46.3847
2015-12-03,46.2262
2015-12-04,46.6736
2015-12-07,46.3381
2015-12-08,46.2542
2015-12-09,46.2635
2015-12-10,46.2728
2015-12-11,45.5552
2015-12-14,46.3474
2015-12-15,46.599
2015-12-16,47.7547
2015-12-17,45.6764
2015-12-18,45.3595
2015-12-21,45.5273
2015-12-22,46.394
2015-12-23,46.6736
2015-12-24,46.6177
2015-12-28,46.3194
2015-12-29,46.5338
2015-12-30,46.2449
2015-12-31,45.8907
2016-01-04,45.3409
2016-01-05,44.6885
2016-01-06,44.6326
2016-01-07,43.7751
2016-01-08,43.3185
2016-01-11,43.2905
2016-01-12,43.6913
2016-01-13,43.1041
2016-01-14,43.0389
2016-01-15,42.7779
2016-01-19,43.1414
2016-01-20,42.7034
2016-01-21,42.0883
2016-01-22,42.256
2016-01-25,42.517
2016-01-26,42.7686
2016-01-27,42.3772
2016-01-28,42.9084
2016-01-29,43.2625
2016-02-01,43.9615
2016-02-02,43.188
2016-02-03,43.188
2016-02-04,43.5421
2016-02-05,43.5421
2016-02-08,43.4862
2016-02-09,44.3809
2016-02-10,44.3343
2016-02-11,43.9988
2016-02-12,44.9122
2016-02-16,45.4527
2016-02-17,45.723
2016-02-18,45.2943
2016-02-19,45.6018
2016-02-22,46.0212
2016-02-23,45.695
2016-02-24,46.1051
2016-02-25,46.6922
2016-02-26,45.7509
2016-02-29,45.2104
2016-03-01,45.6857
2016-03-02,45.4419
2016-03-03,46.1639
2016-03-04,46.3515
2016-03-07,46.0327
2016-03-08,45.9108
2016-03-09,46.5484
2016-03-10,46.9422
2016-03-11,47.2142
2016-03-14,47.5236
2016-03-15,47.111
2016-03-16,46.5953
2016-03-17,47.0829
2016-03-18,46.464
2016-03-21,46.5859
2016-03-22,46.4359
2016-03-23,46.6984
2016-03-24,46.5015
2016-03-28,46.9329
2016-03-29,47.1954
2016-03-30,47.9081
2016-03-31,47.5799
2016-04-01,48.2738
2016-04-04,48.9021
2016-04-05,48.7802
2016-04-06,49.3991
2016-04-07,49.1365
2016-04-08,49.2678
2016-04-11,49.3522
2016-04-12,49.5304
2016-04-13,49.671
2016-04-14,50.1399
2016-04-15,50.3274
2016-04-18,50.2524
2016-04-19,50.4306
2016-04-20,49.5397
2016-04-21,48.5176
2016-04-22,48.602
2016-04-25,48.7052
2016-04-26,48.4426
2016-04-27,48.7239
2016-04-28,50.5431
2016-04-29,49.2115
2016-05-02,49.0521
2016-05-03,48.9208
2016-05-04,49.5304
2016-05-05,50.0555
2016-05-06,50.6837
2016-05-09,50.2618
2016-05-10,50.7494
2016-05-11,50.6369
2016-05-12,50.4493
2016-05-13,49.5491
2016-05-16,49.7377
2016-05-17,48.9833
2016-05-18,48.1157
2016-05-19,47.8044
2016-05-20,47.8139
2016-05-23,47.248
2016-05-24,48.0874
2016-05-25,48.3703
2016-05-26,47.9648
2016-05-27,48.6155
2016-05-31,36.6007
2016-06-01,37.0251
2016-06-02,37.2514
2016-06-03,37.8456
2016-06-06,37.2326
2016-06-07,37.3646
2016-06-08,37.6758
2016-06-09,37.2514
2016-06-10,36.3555
2016-06-13,35.8085
2016-06-14,35.2616
2016-06-15,35.139
2016-06-16,35.1295
2016-06-17,35.337
2016-06-20,35.7048
2016-06-21,35.403
2016-06-22,35.2238
2016-06-23,35.5256
2016-06-24,33.0736
2016-06-27,32.0174
2016-06-28,31.9042
2016-06-29,32.885
2016-06-30,33.6583
2016-07-01,33.3
2016-07-05,32.8661
2016-07-06,32.8096
2016-07-07,33.5546
2016-07-08,33.696
2016-07-11,33.6489
2016-07-12,33.9035
2016-07-13,33.9601
2016-07-14,34.5165
2016-07-15,34.5354
2016-07-18,34.8938
2016-07-19,35.3653
2016-07-20,35.7331
2016-07-21,35.9028
2016-07-22,36.0726
2016-07-25,35.9123
2016-07-26,36.0349
2016-07-27,35.3653
2016-07-28,35.4124
2016-07-29,35.205
2016-08-01,35.7897
2016-08-02,34.9032
2016-08-03,34.5448
2016-08-04,34.6391
2016-08-05,34.6014
2016-08-08,34.7051
2016-08-09,35.271
2016-08-10,35.6765
2016-08-11,36.2235
2016-08-12,36.3555
2016-08-15,36.5158
2016-08-16,36.0443
2016-08-17,36.0632
2016-08-18,36.0443
2016-08-19,35.9877
2016-08-22,36.0726
2016-08-23,36.1292
2016-08-24,36.1763
2016-08-25,36.2329
2016-08-26,36.4121
2016-08-29,36.4593
2016-08-30,35.9877
2016-08-31,36.2612
2016-09-01,36.1575
2016-09-02,36.7516
2016-09-06,37.0251
2016-09-07,37.8739
2016-09-08,38.8075
2016-09-09,38.1285
2016-09-12,38.6661
2016-09-13,37.4872
2016-09-14,37.3929
2016-09-15,37.4778
2016-09-16,37.0345
2016-09-19,37.11
2016-09-20,37.4872
2016-09-21,37.4401
2016-09-22,37.9305
2016-09-23,37.9399
2016-09-26,37.2703
2016-09-27,37.1571
2016-09-28,37.11
2016-09-29,36.9873
2016-09-30,37.8118
2016-10-03,36.9589
2016-10-04,36.5987
2016-10-05,36.9683
2016-10-06,37.1958
2016-10-07,36.8167
2016-10-10,35.888
2016-10-11,35.888
2016-10-12,36.1154
2016-10-13,36.0112
2016-10-14,35.9828
2016-10-17,35.6227
2016-10-18,36.0396
2016-10-19,36.087
2016-10-20,35.9164
2016-10-21,35.8501
2016-10-24,36.0112
2016-10-25,35.9164
2016-10-26,36.2007
2016-10-27,36.0301
2016-10-28,36.2386
2016-10-31,36.4282
2016-11-01,36.5135
2016-11-02,36.7219
2016-11-03,36.7125
2016-11-04,35.9354
2016-11-07,36.5419
2016-11-08,36.9968
2016-11-09,36.2671
2016-11-10,33.0924
2016-11-11,33.6136
2016-11-14,33.2345
2016-11-15,33.2914
2016-11-16,32.8934
2016-11-17,32.2869
2016-11-18,31.9647
2016-11-21,32.1826
2016-11-22,31.9647
2016-11-23,31.5003
2016-11-25,31.7372
2016-11-28,31.7183
2016-11-29,31.2824
2016-11-30,30.7611
2016-12-01,29.7566
2016-12-02,29.8703
2016-12-05,29.9367
2016-12-06,29.6713
2016-12-07,30.3726
2016-12-08,29.9841
2016-12-09,30.6095
2016-12-12,30.4484
2016-12-13,30.1641
2016-12-14,29.9272
2016-12-15,30.4674
2016-12-16,30.7706
2016-12-19,30.7138
2016-12-20,30.5527
2016-12-21,30.7043
2016-12-22,30.6
2016-12-23,30.5053
2016-12-27,30.2399
2016-12-28,30.1339
2016-12-29,30.0957
2016-12-30,29.9242
2017-01-03,29.8956
2017-01-04,30.1053
2017-01-05,30.4483
2017-01-06,30.4293
2017-01-09,30.4579
2017-01-10,30.0195
2017-01-11,30.9725
2017-01-12,30.7247
2017-01-13,30.6389
2017-01-17,30.6961
2017-01-18,31.4299
2017-01-19,32.2686
2017-01-20,32.4306
2017-01-23,32.6402
2017-01-24,32.9261
2017-01-25,33.1739
2017-01-26,32.8118
2017-01-27,32.7165
2017-01-30,32.5259
2017-01-31,32.9071
2017-02-01,33.1072
2017-02-02,33.3073
2017-02-03,33.193
2017-02-06,33.4694
2017-02-07,33.6695
2017-02-08,33.9744
2017-02-09,33.5075
2017-02-10,33.3836
2017-02-13,33.5456
2017-02-14,33.4408
2017-02-15,33.7934
2017-02-16,33.7838
2017-02-17,33.7362
2017-02-21,33.7267
2017-02-22,33.9173
2017-02-23,33.9268
2017-02-24,33.3073
2017-02-27,33.355
2017-02-28,33.0596
2017-03-01,32.869
2017-03-02,32.9738
2017-03-03,33.4789
2017-03-06,33.2978
2017-03-07,33.7267
2017-03-08,33.8124
2017-03-09,33.6981
2017-03-10,34.003
2017-03-13,34.0697
2017-03-14,33.7838
2017-03-15,34.2413
2017-03-16,34.4986
2017-03-17,34.3747
2017-03-20,34.3175
2017-03-21,34.6701
2017-03-22,35.1752
2017-03-23,35.6422
2017-03-24,35.9186
2017-03-27,36.0043
2017-03-28,36.1378
2017-03-29,35.8804
2017-03-30,35.9281
2017-03-31,35.9186
2017-04-03,35.7566
2017-04-04,35.9186
2017-04-05,35.728
2017-04-06,35.5688
2017-04-07,35.4634
2017-04-10,35.5592
2017-04-11,35.6743
2017-04-12,35.6263
2017-04-13,35.8085
2017-04-17,36.1153
2017-04-18,36.5371
2017-04-19,36.3933
2017-04-20,36.1249
2017-04-21,35.8085
2017-04-24,36.5275
2017-04-25,37.0261
2017-04-26,36.6618
2017-04-27,36.4221
2017-04-28,37.0261
2017-05-01,36.7001
2017-05-02,36.518
2017-05-03,36.1345
2017-05-04,37.5342
2017-05-05,38.0999
2017-05-08,38.4354
2017-05-09,38.3971
2017-05-10,38.3971
2017-05-11,38.3491
2017-05-12,38.3971
2017-05-15,38.6943
2017-05-16,38.6176
2017-05-17,38.5696
2017-05-18,38.2327
2017-05-19,38.9077
2017-05-22,39.2163
2017-05-23,39.5634
2017-05-24,39.8237
2017-05-25,39.6695
2017-05-26,39.872
2017-05-30,39.5248
2017-05-31,39.573
2017-06-01,39.6309
2017-06-02,39.2645
2017-06-05,39.7562
2017-06-06,39.4863
2017-06-07,39.4766
2017-06-08,39.3898
2017-06-09,39.1102
2017-06-12,38.8595
2017-06-13,38.7245
2017-06-14,39.6887
2017-06-15,39.4766
2017-06-16,39.0041
2017-06-19,39.2741
2017-06-20,39.2934
2017-06-21,39.0909
2017-06-22,39.0813
2017-06-23,39.1681
2017-06-26,39.467
2017-06-27,39.3705
2017-06-28,39.6887
2017-06-29,39.1102
2017-06-30,39.2163
2017-07-03,39.0523
2017-07-05,39.5345
2017-07-06,39.0678
2017-07-07,39.252
2017-07-10,39.8532
2017-07-11,39.3393
2017-07-12,40.6289
2017-07-13,40.5998
2017-07-14,41.1913
2017-07-17,40.9198
2017-07-18,40.8229
2017-07-19,40.8132
2017-07-20,40.7356
2017-07-21,40.7938
2017-07-24,41.2107
2017-07-25,41.3659
2017-07-26,41.7828
2017-07-27,41.8507
2017-07-28,41.9671
2017-07-31,41.9186
2017-08-01,42.3743
2017-08-02,41.9671
2017-08-03,42.1513
2017-08-04,42.3743
2017-08-07,42.2289
2017-08-08,42.3355
2017-08-09,41.7246
2017-08-10,41.9089
2017-08-11,42.4228
2017-08-14,42.2967
2017-08-15,42.4131
2017-08-16,42.9949
2017-08-17,42.1513
2017-08-18,42.4519
2017-08-21,42.1513
2017-08-22,42.5683
2017-08-23,42.2386
2017-08-24,41.8293
2017-08-25,41.7416
2017-08-28,41.8293
2017-08-29,41.8293
2017-08-30,41.7416
2017-08-31,41.8975
2017-09-01,42.6381
2017-09-05,42.5504
2017-09-06,42.4529
2017-09-07,41.9463
2017-09-08,41.157
2017-09-11,41.4883
2017-09-12,41.1375
2017-09-13,40.3191
2017-09-14,39.8222
2017-09-15,40.4165
2017-09-18,40.5432
2017-09-19,40.2216
2017-09-20,39.6175
2017-09-21,39.7052
2017-09-22,39.5981
2017-09-25,39.3739
2017-09-26,39.6468
2017-09-27,39.9098
2017-09-28,40.4945
2017-09-29,40.5529
2017-10-02,40.7478
2017-10-03,40.3386
2017-10-04,40.2801
2017-10-05,40.1242
2017-10-06,39.7734
2017-10-09,40.0463
2017-10-10,40.4945
2017-10-11,40.7965
2017-10-12,40.7575
2017-10-13,40.816
2017-10-16,40.9232
2017-10-17,40.8257
2017-10-18,40.8745
2017-10-19,40.8647
2017-10-20,40.855
2017-10-23,40.6796
2017-10-24,40.6211
2017-10-25,40.1242
2017-10-26,40.2216
2017-10-27,39.8027
2017-10-30,39.3155
2017-10-31,39.8124
2017-11-01,39.3642
2017-11-02,38.5945
2017-11-03,38.9063
2017-11-06,38.838
2017-11-07,36.9186
2017-11-08,38.5165
2017-11-09,38.5555
2017-11-10,38.4873
2017-11-13,38.4093
2017-11-14,38.3314
2017-11-15,37.8442
2017-11-16,37.5714
2017-11-17,37.4048
2017-11-20,37.64
2017-11-21,37.3167
2017-11-22,37.8065
2017-11-24,37.8555
2017-11-27,38.0906
2017-11-28,37.9535
2017-11-29,37.5518
2017-11-30,38.1984
2017-12-01,38.943
2017-12-04,38.9234
2017-12-05,38.5217
2017-12-06,38.7372
2017-12-07,38.5217
2017-12-08,37.9828
2017-12-11,38.4923
2017-12-12,38.3943
2017-12-13,38.1396
2017-12-14,38.3062
2017-12-15,38.3943
2017-12-18,38.5511
2017-12-19,38.5707
2017-12-20,38.6686
2017-12-21,38.5707
2017-12-22,38.6001
2017-12-26,38.4923
2017-12-27,38.6392
2017-12-28,38.4825
2017-12-29,39.0409
2018-01-02,38.9038
2018-01-03,38.5903
2018-01-04,38.894
2018-01-05,38.218
2018-01-08,38.3551
2018-01-09,38.845
2018-01-10,38.0122
2018-01-11,37.8457
2018-01-12,38.0024
2018-01-16,38.0122
2018-01-17,38.7372
2018-01-18,38.0612
2018-01-19,38.8352
2018-01-22,38.943
2018-01-23,38.5707
2018-01-24,39.0213
2018-01-25,39.9422
2018-01-26,40.0598
2018-01-29,39.7463
2018-01-30,39.4426
2018-01-31,39.3446
2018-02-01,38.5511
2018-02-02,37.5224
2018-02-05,36.7778
2018-02-06,36.7288
2018-02-07,37.3754
2018-02-08,36.8366
2018-02-09,36.4545
2018-02-12,36.6211
2018-02-13,36.6407
2018-02-14,36.4643
2018-02-15,38.1396
2018-02-16,38.1788
2018-02-20,37.7281
2018-02-21,36.9934
2018-02-22,37.1305
2018-02-23,37.9731
2018-02-26,37.8744
2018-02-27,37.6278
2018-02-28,37.4996
2018-03-01,37.2826
2018-03-02,37.8547
2018-03-05,38.8607
2018-03-06,39.5018
2018-03-07,39.7879
2018-03-08,40.5079
2018-03-09,40.3402
2018-03-12,41.2082
2018-03-13,41.4745
2018-03-14,40.646
2018-03-15,40.2218
2018-03-16,40.2021
2018-03-19,39.8372
2018-03-20,40.2218
2018-03-21,40.3599
2018-03-22,39.8175
2018-03-23,39.5906
2018-03-26,39.926
2018-03-27,39.995
2018-03-28,40.863
2018-03-29,41.0898
2018-04-02,40.2021
2018-04-03,40.4783
2018-04-04,40.9123
2018-04-05,41.1293
2018-04-06,41.1588
2018-04-09,41.0898
2018-04-10,40.6065
2018-04-11,40.4092
2018-04-12,40.3008
2018-04-13,40.6953
2018-04-16,40.9616
2018-04-17,41.2772
2018-04-18,40.7545
2018-04-19,40.3205
2018-04-20,39.995
2018-04-23,39.8865
2018-04-24,39.6794
2018-04-25,39.2257
2018-04-26,39.3243
2018-04-27,39.0185
2018-04-30,38.6635
2018-05-01,38.0421
2018-05-02,37.7857
2018-05-03,37.6081
2018-05-04,37.8646
2018-05-07,37.3615
2018-05-08,37.6377
2018-05-09,37.6476
2018-05-10,38.4662
2018-05-11,38.4364
2018-05-14,38.2676
2018-05-15,37.8605
2018-05-16,37.7315
2018-05-17,38.0492
2018-05-18,37.9102
2018-05-21,37.94
2018-05-22,38.3173
2018-05-23,37.93
2018-05-24,37.5726
2018-05-25,37.4634
2018-05-29,37.7017
2018-05-30,37.8407
2018-05-31,37.7017
2018-06-01,37.6222
2018-06-04,37.8307
2018-06-05,37.6719
2018-06-06,37.9499
2018-06-07,37.8407
2018-06-08,38.1485
2018-06-11,38.1783
2018-06-12,38.5159
2018-06-13,39.1613
2018-06-14,39.2209
2018-06-15,39.906
2018-06-18,39.2506
2018-06-19,38.9925
2018-06-20,38.9329
2018-06-21,38.8138
2018-06-22,39.628
2018-06-25,39.8663
2018-06-26,40.0648
2018-06-27,39.5386
2018-06-28,39.9854
2018-06-29,40.3528
2018-07-02,40.0251
2018-07-03,40.3131
2018-07-05,40.4124
2018-07-06,40.5216
2018-07-09,40.5415
2018-07-10,41.4252
2018-07-11,41.6535
2018-07-12,41.9018
2018-07-13,41.3755
2018-07-16,41.1372
2018-07-17,41.6039
2018-07-18,41.4847
2018-07-19,41.3656
2018-07-20,41.6635
2018-07-23,41.3457
2018-07-24,41.306
2018-07-25,41.5741
2018-07-26,41.7528
2018-07-27,41.2564
2018-07-30,41.0975
2018-07-31,40.9486
2018-08-01,40.4322
2018-08-02,39.9358
2018-08-03,40.2833
2018-08-06,40.2734
2018-08-07,40.2932
2018-08-08,40.601
2018-08-09,42.3287
2018-08-10,41.9216
2018-08-13,41.6933
2018-08-14,41.6734
2018-08-15,42.4479
2018-08-16,42.4578
2018-08-17,42.4578
2018-08-20,42.2791
2018-08-21,41.95
2018-08-22,42.1
2018-08-23,41.98
2018-08-24,42.22
2018-08-27,42.31
2018-08-28,41.88
2018-08-29,41.94
2018-08-30,42.13
2018-08-31,42.64
2018-09-04,42.58
2018-09-05,42.31
2018-09-06,42.59
2018-09-07,42.8
2018-09-10,43.33
2018-09-11,43.27
2018-09-12,44.83
2018-09-13,45.35
2018-09-14,45.5
2018-09-17,45.78
2018-09-18,45.77
2018-09-19,45.69
2018-09-20,46
2018-09-21,45.86
2018-09-24,45.3
2018-09-25,45.41
2018-09-26,45.71
2018-09-27,45.56
2018-09-28,45.47
2018-10-01,45.54
2018-10-02,44.9
2018-10-03,44.95
2018-10-04,44.81
2018-10-05,44.81
2018-10-08,44.76
2018-10-09,43.78
2018-10-10,43.06
2018-10-11,42.62
2018-10-12,43.12
2018-10-15,43.42
2018-10-16,44.8
2018-10-17,45.37
2018-10-18,45.01
2018-10-19,45
2018-10-22,44.39
2018-10-23,44.48
2018-10-24,44.29
2018-10-25,43.53
2018-10-26,44.19
2018-10-29,44.38
2018-10-30,45.06
2018-10-31,45.49
2018-11-01,45.8
2018-11-02,45.83
2018-11-05,46.18
2018-11-06,46.72
