date,close
2014-06-13,151.2823
2014-06-16,151.1083
2014-06-17,151.0337
2014-06-18,152.1441
2014-06-19,151.4978
2014-06-20,150.4453
2014-06-23,150.9343
2014-06-24,149.8901
2014-06-25,149.7575
2014-06-26,149.4675
2014-06-27,150.5779
2014-06-30,150.2133
2014-07-01,154.423
2014-07-02,156.1135
2014-07-03,156.2295
2014-07-07,155.8234
2014-07-08,155.1439
2014-07-09,156.1383
2014-07-10,155.5417
2014-07-11,155.7903
2014-07-14,157.3316
2014-07-15,156.1963
2014-07-16,159.4033
2014-07-17,159.511
2014-07-18,159.5193
2014-07-21,158.152
2014-07-22,160.8369
2014-07-23,160.4557
2014-07-24,161.7899
2014-07-25,161.0938
2014-07-28,162.2373
2014-07-29,161.2346
2014-07-30,160.7623
2014-07-31,158.8315
2014-08-01,156.7432
2014-08-04,157.1493
2014-08-05,155.0445
2014-08-06,155.0194
2014-08-07,153.6274
2014-08-08,155.5696
2014-08-11,156.2698
2014-08-12,156.1614
2014-08-13,156.6699
2014-08-14,156.6116
2014-08-15,156.1948
2014-08-18,157.8452
2014-08-19,158.4371
2014-08-20,158.4621
2014-08-21,159.404
2014-08-22,158.7205
2014-08-25,159.3457
2014-08-26,160.8711
2014-08-27,160.2543
2014-08-28,160.0459
2014-08-29,160.2959
2014-09-02,159.6791
2014-09-03,160.0042
2014-09-04,158.9456
2014-09-05,159.379
2014-09-08,158.4954
2014-09-09,158.3704
2014-09-10,159.6624
2014-09-11,159.8125
2014-09-12,159.4457
2014-09-15,159.8875
2014-09-16,160.8461
2014-09-17,160.7127
2014-09-18,161.5046
2014-09-19,161.713
2014-09-22,160.9711
2014-09-23,159.7291
2014-09-24,160.3043
2014-09-25,157.5535
2014-09-26,158.4287
2014-09-29,158.0786
2014-09-30,156.0197
2014-10-01,156.0197
2014-10-02,155.803
2014-10-03,157.2701
2014-10-06,157.5785
2014-10-07,154.8027
2014-10-08,157.8452
2014-10-09,155.3945
2014-10-10,154.9861
2014-10-13,152.9772
2014-10-14,153.2106
2014-10-15,151.5018
2014-10-16,149.9096
2014-10-17,151.7518
2014-10-20,140.9571
2014-10-21,136.064
2014-10-22,134.8637
2014-10-23,135.1887
2014-10-24,135.1054
2014-10-27,134.9303
2014-10-28,136.3724
2014-10-29,136.2557
2014-10-30,136.9976
2014-10-31,137.0393
2014-11-03,137.0059
2014-11-04,135.5805
2014-11-05,134.8887
2014-11-06,135.5098
2014-11-07,136.0217
2014-11-10,137.2135
2014-11-11,137.054
2014-11-12,135.8958
2014-11-13,136.626
2014-11-14,137.7758
2014-11-17,137.7758
2014-11-18,135.8707
2014-11-19,135.4846
2014-11-20,134.8216
2014-11-21,135.0566
2014-11-24,136.0889
2014-11-25,135.7616
2014-11-26,135.921
2014-11-28,136.1057
2014-12-01,135.5769
2014-12-02,136.5253
2014-12-03,138.078
2014-12-04,137.6835
2014-12-05,137.0289
2014-12-08,135.8455
2014-12-09,136.7939
2014-12-10,134.7125
2014-12-11,135.1825
2014-12-12,130.407
2014-12-15,128.4598
2014-12-16,127.075
2014-12-17,127.5115
2014-12-18,132.3373
2014-12-19,133.0339
2014-12-22,135.493
2014-12-23,136.1644
2014-12-24,135.8119
2014-12-26,136.2483
2014-12-29,134.7125
2014-12-30,134.3264
2014-12-31,134.6537
2015-01-02,136.0133
2015-01-05,133.8732
2015-01-06,130.9861
2015-01-07,130.13
2015-01-08,132.9584
2015-01-09,133.5375
2015-01-12,131.2966
2015-01-13,131.6071
2015-01-14,130.7595
2015-01-15,129.7271
2015-01-16,131.8841
2015-01-20,131.7246
2015-01-21,127.6457
2015-01-22,130.4154
2015-01-23,130.8182
2015-01-26,131.2295
2015-01-27,128.9718
2015-01-28,127.1925
2015-01-29,130.4909
2015-01-30,128.6697
2015-02-02,129.8027
2015-02-03,133.0003
2015-02-04,131.733
2015-02-05,132.5303
2015-02-06,132.4543
2015-02-09,131.6345
2015-02-10,134.0094
2015-02-11,133.7051
2015-02-12,133.9756
2015-02-13,135.5645
2015-02-17,136.0378
2015-02-18,137.0773
2015-02-19,138.5141
2015-02-20,138.3113
2015-02-23,137.6858
2015-02-24,139.3086
2015-02-25,137.6013
2015-02-26,135.9617
2015-02-27,136.866
2015-03-02,135.6321
2015-03-03,136.0969
2015-03-04,134.7362
2015-03-05,136.2237
2015-03-06,133.9587
2015-03-09,135.8772
2015-03-10,133.3755
2015-03-11,132.5219
2015-03-12,133.5192
2015-03-13,130.3921
2015-03-16,132.7585
2015-03-17,132.6571
2015-03-18,135.0658
2015-03-19,135.0658
2015-03-20,137.6605
2015-03-23,139.1395
2015-03-24,137.7619
2015-03-25,134.5503
2015-03-26,135.7251
2015-03-27,135.5645
2015-03-30,137.483
2015-03-31,135.649
2015-04-01,134.5334
2015-04-02,135.6067
2015-04-06,136.9506
2015-04-07,136.9759
2015-04-08,136.79
2015-04-09,137.2041
2015-04-10,137.6436
2015-04-13,137.2379
2015-04-14,137.1703
2015-04-15,138.7169
2015-04-16,137.8718
2015-04-17,135.7927
2015-04-20,140.4326
2015-04-21,138.8268
2015-04-22,139.7565
2015-04-23,143.8809
2015-04-24,143.4921
2015-04-27,144.295
2015-04-28,146.9911
2015-04-29,147.3968
2015-04-30,144.7683
2015-05-01,146.7798
2015-05-04,147.0334
2015-05-05,146.2812
2015-05-06,144.808
2015-05-07,145.6084
2015-05-08,147.0476
2015-05-11,145.7191
2015-05-12,145.2338
2015-05-13,146.707
2015-05-14,148.2142
2015-05-15,147.5415
2015-05-18,147.3712
2015-05-19,147.7288
2015-05-20,147.9673
2015-05-21,147.6096
2015-05-22,146.6559
2015-05-26,144.8761
2015-05-27,146.4685
2015-05-28,146.2216
2015-05-29,144.4674
2015-06-01,144.9187
2015-06-02,144.4674
2015-06-03,144.6973
2015-06-04,143.3859
2015-06-05,142.5513
2015-06-08,140.7971
2015-06-09,141.0867
2015-06-10,143.8457
2015-06-11,143.7265
2015-06-12,142.2022
2015-06-15,141.5806
2015-06-16,142.0745
2015-06-17,142.3555
2015-06-18,143.2752
2015-06-19,142.2022
2015-06-22,142.8324
2015-06-23,143.5902
2015-06-24,142.1852
2015-06-25,141.4273
2015-06-26,140.8993
2015-06-29,138.7789
2015-06-30,138.5149
2015-07-01,140.0733
2015-07-02,140.5842
2015-07-06,140.2777
2015-07-07,140.5076
2015-07-08,138.9407
2015-07-09,139.5283
2015-07-10,142.1681
2015-07-13,144.2374
2015-07-14,143.5817
2015-07-15,143.5136
2015-07-16,145.617
2015-07-17,146.9028
2015-07-20,147.5074
2015-07-21,138.8641
2015-07-22,136.5478
2015-07-23,137.723
2015-07-24,136.0369
2015-07-27,135.4578
2015-07-28,136.2924
2015-07-29,137.178
2015-07-30,137.0673
2015-07-31,137.9444
2015-08-03,135.1513
2015-08-04,134.206
2015-08-05,134.4615
2015-08-06,134.2211
2015-08-07,133.1907
2015-08-10,134.5903
2015-08-11,133.5256
2015-08-12,134.0837
2015-08-13,133.1478
2015-08-14,133.7317
2015-08-17,134.2125
2015-08-18,133.9549
2015-08-19,132.1775
2015-08-20,131.0785
2015-08-21,127.8071
2015-08-24,123.1877
2015-08-25,121.0325
2015-08-26,125.9611
2015-08-27,127.5409
2015-08-28,127.0601
2015-08-31,126.9828
2015-09-01,122.5094
2015-09-02,124.5443
2015-09-03,126.0297
2015-09-04,123.3852
2015-09-08,126.4161
2015-09-09,124.5443
2015-09-10,125.5317
2015-09-11,126.5363
2015-09-14,125.0595
2015-09-15,126.6737
2015-09-16,127.4293
2015-09-17,127.1975
2015-09-18,124.0807
2015-09-21,125.7722
2015-09-22,124.012
2015-09-23,123.3508
2015-09-24,123.9948
2015-09-25,124.862
2015-09-28,122.372
2015-09-29,122.3291
2015-09-30,124.4756
2015-10-01,123.2907
2015-10-02,124.1408
2015-10-05,127.9703
2015-10-06,127.747
2015-10-07,128.8718
2015-10-08,130.7522
2015-10-09,130.8467
2015-10-12,129.7734
2015-10-13,128.4683
2015-10-14,128.8031
2015-10-15,128.8718
2015-10-16,129.1294
2015-10-19,128.1248
2015-10-20,120.7578
2015-10-21,120.9982
2015-10-22,123.72
2015-10-23,124.2266
2015-10-26,123.3508
2015-10-27,118.3708
2015-10-28,120.9209
2015-10-29,120.6805
2015-10-30,120.2769
2015-11-02,120.5259
2015-11-03,121.8225
2015-11-04,121.6078
2015-11-05,120.1138
2015-11-06,119.8191
2015-11-09,117.2711
2015-11-10,117.4097
2015-11-11,117.0197
2015-11-12,115.3037
2015-11-13,114.1857
2015-11-16,115.8844
2015-11-17,115.9797
2015-11-18,117.7131
2015-11-19,118.5104
2015-11-20,120.0358
2015-11-23,120.0011
2015-11-24,120.1225
2015-11-25,119.6024
2015-11-27,120.0011
2015-11-30,120.8331
2015-12-01,122.4452
2015-12-02,121.0758
2015-12-03,120.3998
2015-12-04,121.7085
2015-12-07,120.9458
2015-12-08,119.6458
2015-12-09,118.3977
2015-12-10,118.5451
2015-12-11,116.6297
2015-12-14,117.8084
2015-12-15,119.4204
2015-12-16,120.7205
2015-12-17,118.5191
2015-12-18,116.9157
2015-12-21,117.4357
2015-12-22,119.5418
2015-12-23,120.0705
2015-12-24,119.8191
2015-12-28,119.2644
2015-12-29,121.1451
2015-12-30,120.7638
2015-12-31,119.2731
2016-01-04,117.8257
2016-01-05,117.7391
2016-01-06,117.1497
2016-01-07,115.1477
2016-01-08,114.0817
2016-01-11,115.4684
2016-01-12,115.1824
2016-01-13,113.683
2016-01-14,115.191
2016-01-15,112.695
2016-01-19,111.0309
2016-01-20,105.6142
2016-01-21,106.5242
2016-01-22,106.1688
2016-01-25,105.8048
2016-01-26,106.2468
2016-01-27,104.8341
2016-01-28,105.9262
2016-01-29,108.1535
2016-02-01,108.1882
2016-02-02,106.5502
2016-02-03,108.0929
2016-02-04,110.6323
2016-02-05,111.4296
2016-02-08,111.1757
2016-02-09,108.6279
2016-02-10,105.2308
2016-02-11,103.182
2016-02-12,105.975
2016-02-16,107.4634
2016-02-17,110.4052
2016-02-18,115.9649
2016-02-19,116.5165
2016-02-22,117.1206
2016-02-23,115.9211
2016-02-24,116.2713
2016-02-25,117.7597
2016-02-26,115.5971
2016-02-29,114.7216
2016-03-01,117.6459
2016-03-02,119.3357
2016-03-03,120.649
2016-03-04,120.649
2016-03-07,122.7065
2016-03-08,121.7609
2016-03-09,122.9341
2016-03-10,122.7415
2016-03-11,124.6414
2016-03-14,125.0092
2016-03-15,125.1668
2016-03-16,126.769
2016-03-17,128.7389
2016-03-18,128.7827
2016-03-21,130.1311
2016-03-22,129.667
2016-03-23,127.3031
2016-03-24,129.5357
2016-03-28,129.9297
2016-03-29,130.7439
2016-03-30,129.9384
2016-03-31,132.6001
2016-04-01,133.5369
2016-04-04,133.1429
2016-04-05,131.3305
2016-04-06,131.348
2016-04-07,129.7983
2016-04-08,130.7614
2016-04-11,130.6739
2016-04-12,131.0066
2016-04-13,132.4074
2016-04-14,132.3462
2016-04-15,132.8365
2016-04-18,133.5456
2016-04-19,126.0773
2016-04-20,127.9247
2016-04-21,130.7177
2016-04-22,130.0172
2016-04-25,130.2886
2016-04-26,130.525
2016-04-27,131.742
2016-04-28,128.7652
2016-04-29,127.7759
2016-05-02,127.1892
2016-05-03,126.1911
2016-05-04,126.2962
2016-05-05,128.2399
2016-05-06,130.2023
2016-05-09,130.2465
2016-05-10,132.5714
2016-05-11,131.6697
2016-05-12,131.5725
2016-05-13,130.5824
2016-05-16,132.1206
2016-05-17,130.8299
2016-05-18,130.2465
2016-05-19,128.1161
2016-05-20,130.1669
2016-05-23,129.7426
2016-05-24,131.104
2016-05-25,134.0918
2016-05-26,134.7548
2016-05-27,135.1084
2016-05-31,135.904
2016-06-01,134.8167
2016-06-02,135.6919
2016-06-03,135.1526
2016-06-06,135.0112
2016-06-07,135.5416
2016-06-08,136.1339
2016-06-09,135.6211
2016-06-10,134.693
2016-06-13,133.7294
2016-06-14,133.5349
2016-06-15,133.199
2016-06-16,133.5349
2016-06-17,134.357
2016-06-20,135.7891
2016-06-21,136.1781
2016-06-22,135.1791
2016-06-23,137.3272
2016-06-24,129.5835
2016-06-27,126.852
2016-06-28,128.7968
2016-06-29,131.2366
2016-06-30,134.1714
2016-07-01,134.6753
2016-07-05,134.083
2016-07-06,134.693
2016-07-07,134.8963
2016-07-08,136.5405
2016-07-11,137.3096
2016-07-12,138.8212
2016-07-13,139.6875
2016-07-14,141.6853
2016-07-15,141.2433
2016-07-18,141.314
2016-07-19,141.0665
2016-07-20,142.64
2016-07-21,141.8356
2016-07-22,143.2676
2016-07-25,143.7803
2016-07-26,143.3118
2016-07-27,143.0555
2016-07-28,142.6488
2016-07-29,141.9858
2016-08-01,142.7195
2016-08-02,141.9505
2016-08-03,142.03
2016-08-04,142.8079
2016-08-05,144.5318
2016-08-08,144.4783
2016-08-09,144.2375
2016-08-10,144.5139
2016-08-11,145.8068
2016-08-12,144.398
2016-08-15,144.3356
2016-08-16,143.2835
2016-08-17,143.0517
2016-08-18,143.872
2016-08-19,142.695
2016-08-22,142.6594
2016-08-23,142.8912
2016-08-24,141.8123
2016-08-25,141.4378
2016-08-26,141.1614
2016-08-29,142.4097
2016-08-30,142.1244
2016-08-31,141.6607
2016-09-01,142.2492
2016-09-02,142.2581
2016-09-06,142.9714
2016-09-07,144.1216
2016-09-08,141.7677
2016-09-09,138.8165
2016-09-12,141.1347
2016-09-13,138.9235
2016-09-14,137.3542
2016-09-15,138.7897
2016-09-16,137.167
2016-09-19,138.0853
2016-09-20,137.7109
2016-09-21,138.6738
2016-09-22,139.191
2016-09-23,138.1834
2016-09-26,137.2918
2016-09-27,139.7794
2016-09-28,141.1347
2016-09-29,140.9742
2016-09-30,141.634
2016-10-03,140.5284
2016-10-04,139.503
2016-10-05,140.0558
2016-10-06,139.8775
2016-10-07,138.7986
2016-10-10,140.0023
2016-10-11,138.014
2016-10-12,137.5682
2016-10-13,137.06
2016-10-14,137.7109
2016-10-17,137.9962
2016-10-18,134.3851
2016-10-19,134.8666
2016-10-20,135.0984
2016-10-21,133.4133
2016-10-24,134.2514
2016-10-25,134.5278
2016-10-26,135.357
2016-10-27,136.7301
2016-10-28,136.0703
2016-10-31,137.0332
2016-11-01,136.2308
2016-11-02,135.4818
2016-11-03,135.8563
2016-11-04,135.9098
2016-11-07,138.8432
2016-11-08,139.6079
2016-11-09,139.284
2016-11-10,144.1514
2016-11-11,145.0961
2016-11-14,142.343
2016-11-15,142.7569
2016-11-16,143.3147
2016-11-17,143.7736
2016-11-18,144.3044
2016-11-21,146.4457
2016-11-22,146.3557
2016-11-23,145.7349
2016-11-25,146.7786
2016-11-28,148.0202
2016-11-29,147.1295
2016-11-30,145.9509
2016-12-01,143.7916
2016-12-02,143.9715
2016-12-05,143.8095
2016-12-06,144.2684
2016-12-07,148.2631
2016-12-08,148.7759
2016-12-09,149.8196
2016-12-12,148.9019
2016-12-13,151.4121
2016-12-14,151.61
2016-12-15,151.1692
2016-12-16,150.0085
2016-12-19,149.9636
2016-12-20,150.7913
2016-12-21,150.5484
2016-12-22,150.3055
2016-12-23,149.9906
2016-12-27,150.3774
2016-12-28,149.5227
2016-12-29,149.8916
2016-12-30,149.3428
2017-01-03,150.4224
2017-01-04,152.2848
2017-01-05,151.781
2017-01-06,152.5277
2017-01-09,150.8363
2017-01-10,148.9199
2017-01-11,150.9262
2017-01-12,151.1062
2017-01-13,150.5574
2017-01-17,151.0522
2017-01-18,150.0715
2017-01-19,150.0805
2017-01-20,153.4454
2017-01-23,153.8773
2017-01-24,158.2589
2017-01-25,160.4092
2017-01-26,160.7421
2017-01-27,159.5185
2017-01-30,158.1689
2017-01-31,157.0173
2017-02-01,156.8104
2017-02-02,157.0713
2017-02-03,158.1869
2017-02-06,158.2229
2017-02-07,160.5621
2017-02-08,159.7551
2017-02-09,160.6982
2017-02-10,162.0312
2017-02-13,162.6478
2017-02-14,163.3461
2017-02-15,164.7517
2017-02-16,164.525
2017-02-17,163.8358
2017-02-21,163.464
2017-02-22,164.2711
2017-02-23,164.7245
2017-02-24,164.4524
2017-02-27,162.6841
2017-02-28,163.065
2017-03-01,164.9965
2017-03-02,163.7088
2017-03-03,163.2736
2017-03-06,163.6544
2017-03-07,163.5728
2017-03-08,162.7295
2017-03-09,160.671
2017-03-10,161.2604
2017-03-13,160.0181
2017-03-14,159.347
2017-03-15,159.4286
2017-03-16,160.7254
2017-03-17,159.2835
2017-03-20,159.3289
2017-03-21,157.6785
2017-03-22,158.4946
2017-03-23,158.5309
2017-03-24,157.6331
2017-03-27,157.5787
2017-03-28,158.2498
2017-03-29,157.7329
2017-03-30,157.6603
2017-03-31,157.9142
2017-04-03,158.2407
2017-04-04,158.2588
2017-04-05,156.7716
2017-04-06,156.3817
2017-04-07,156.1006
2017-04-10,155.2482
2017-04-11,154.6859
2017-04-12,154.7585
2017-04-13,153.7338
2017-04-17,155.1575
2017-04-18,154.2053
2017-04-19,146.6243
2017-04-20,147.1774
2017-04-21,145.4363
2017-04-24,145.7719
2017-04-25,145.4454
2017-04-26,145.1462
2017-04-27,145.3819
2017-04-28,145.3547
2017-05-01,144.0398
2017-05-02,144.2756
2017-05-03,143.8494
2017-05-04,144.2303
2017-05-05,140.603
2017-05-08,140.1268
2017-05-09,139.2843
2017-05-10,138.4969
2017-05-11,137.9475
2017-05-12,137.6911
2017-05-15,138.7349
2017-05-16,140.722
2017-05-17,138.2038
2017-05-18,138.0665
2017-05-19,139.1653
2017-05-22,139.7697
2017-05-23,139.2111
2017-05-24,139.6506
2017-05-25,140.2824
2017-05-26,139.6323
2017-05-30,138.9364
2017-05-31,139.7605
2017-06-01,139.7971
2017-06-02,139.2294
2017-06-05,139.5591
2017-06-06,139.5224
2017-06-07,138.2496
2017-06-08,139.2752
2017-06-09,141.1066
2017-06-12,142.0955
2017-06-13,141.2439
2017-06-14,140.841
2017-06-15,141.2164
2017-06-16,142.2786
2017-06-19,141.7842
2017-06-20,141.8849
2017-06-21,140.8227
2017-06-22,141.3813
2017-06-23,141.1157
2017-06-26,142.1413
2017-06-27,141.7017
2017-06-28,142.2237
2017-06-29,141.134
2017-06-30,140.8593
2017-07-03,142.4618
2017-07-05,140.7128
2017-07-06,139.5133
2017-07-07,140.0444
2017-07-10,140.4839
2017-07-11,140.2733
2017-07-12,140.7403
2017-07-13,140.6762
2017-07-14,141.2347
2017-07-17,140.1085
2017-07-18,141.015
2017-07-19,135.0905
2017-07-20,135.2096
2017-07-21,134.6785
2017-07-24,133.6804
2017-07-25,133.8635
2017-07-26,133.1035
2017-07-27,132.8379
2017-07-28,132.1237
2017-07-31,132.4717
2017-08-01,132.9204
2017-08-02,132.2702
2017-08-03,132.7189
2017-08-04,132.9204
2017-08-07,131.3729
2017-08-08,131.5024
2017-08-09,131.1878
2017-08-10,131.2525
2017-08-11,131.2525
2017-08-14,131.6967
2017-08-15,131.4654
2017-08-16,131.8633
2017-08-17,130.1976
2017-08-18,129.2723
2017-08-21,129.8553
2017-08-22,130.4845
2017-08-23,131.5301
2017-08-24,132.2704
2017-08-25,133.0107
2017-08-28,131.8725
2017-08-29,132.4555
2017-08-30,131.9188
2017-08-31,132.3537
2017-09-01,133.3253
2017-09-05,132.363
2017-09-06,133.0847
2017-09-07,132.2334
2017-09-08,131.817
2017-09-11,134.0471
2017-09-12,134.8799
2017-09-13,135.0928
2017-09-14,134.6764
2017-09-15,134.0101
2017-09-18,133.7603
2017-09-19,133.6122
2017-09-20,134.991
2017-09-21,134.4173
2017-09-22,134.297
2017-09-25,134.9817
2017-09-26,135.6202
2017-09-27,134.7874
2017-09-28,134.7874
2017-09-29,134.2507
2017-10-02,135.7128
2017-10-03,135.8238
2017-10-04,135.5462
2017-10-05,135.7683
2017-10-06,135.5462
2017-10-09,136.3883
2017-10-10,137.4154
2017-10-11,136.6011
2017-10-12,136.0551
2017-10-13,136.1199
2017-10-16,135.8701
2017-10-17,135.6017
2017-10-18,147.6221
2017-10-19,148.8898
2017-10-20,149.9725
2017-10-23,147.6406
2017-10-24,144.2445
2017-10-25,142.0376
2017-10-26,142.1347
2017-10-27,142.2088
2017-10-30,142.838
2017-10-31,142.5604
2017-11-01,142.5326
2017-11-02,141.9034
2017-11-03,140.2655
2017-11-06,139.5807
2017-11-07,140.0527
2017-11-08,140.2563
2017-11-09,140.4712
2017-11-10,139.4057
2017-11-13,138.6954
2017-11-14,139.1534
2017-11-15,137.4804
2017-11-16,139.3683
2017-11-17,139.2281
2017-11-20,140.6674
2017-11-21,142.0133
2017-11-22,141.845
2017-11-24,141.9104
2017-11-27,142.0413
2017-11-28,142.4993
2017-11-29,143.5086
2017-11-30,143.9012
2017-12-01,144.6395
2017-12-04,146.2283
2017-12-05,145.1909
2017-12-06,144.0227
2017-12-07,143.5273
2017-12-08,144.6862
2017-12-11,145.247
2017-12-12,146.49
2017-12-13,143.8451
2017-12-14,143.9292
2017-12-15,142.5273
2017-12-18,143.303
2017-12-19,143.2096
2017-12-20,142.9479
2017-12-21,141.5927
2017-12-22,142.5273
2017-12-26,142.8357
2017-12-27,143.1161
2017-12-28,143.9666
2017-12-29,143.3871
2018-01-02,144.1628
2018-01-03,148.1256
2018-01-04,151.1257
2018-01-05,151.864
2018-01-08,152.7799
2018-01-09,153.1164
2018-01-10,153.4435
2018-01-11,153.4622
2018-01-12,152.4715
2018-01-16,153.1351
2018-01-17,157.6212
2018-01-18,158.0604
2018-01-19,151.7518
2018-01-22,151.9668
2018-01-23,155.3781
2018-01-24,154.5557
2018-01-25,154.6491
2018-01-26,156.3968
2018-01-29,155.8921
2018-01-30,152.9201
2018-01-31,152.9949
2018-02-01,151.7799
2018-02-02,148.6303
2018-02-05,142.5553
2018-02-06,145.1816
2018-02-07,143.789
2018-02-08,139.2965
2018-02-09,141.1086
2018-02-12,142.8924
2018-02-13,142.279
2018-02-14,146.0636
2018-02-15,147.2434
2018-02-16,147.4038
2018-02-20,146.4411
2018-02-21,145.3086
2018-02-22,144.5724
2018-02-23,146.7809
2018-02-26,149.669
2018-02-27,147.753
2018-02-28,147.0735
2018-03-01,145.167
2018-03-02,145.8088
2018-03-05,148.1306
2018-03-06,146.9697
2018-03-07,149.4236
2018-03-08,147.4321
2018-03-09,150.3579
2018-03-12,151.2546
2018-03-13,150.3674
2018-03-14,149.2348
2018-03-15,150.6411
2018-03-16,151.2546
2018-03-19,148.5081
2018-03-20,147.4227
2018-03-21,147.8852
2018-03-22,143.5437
2018-03-23,140.5235
2018-03-26,144.7517
2018-03-27,143.3738
2018-03-28,143.9495
2018-03-29,144.8084
2018-04-02,141.6372
2018-04-03,141.4295
2018-04-04,145.4596
2018-04-05,145.3746
2018-04-06,142.1091
2018-04-09,144.1099
2018-04-10,146.6582
2018-04-11,146.6299
2018-04-12,149.1876
2018-04-13,147.904
2018-04-16,149.0177
2018-04-17,151.868
2018-04-18,140.4291
2018-04-19,139.4003
2018-04-20,136.7577
2018-04-23,137.6637
2018-04-24,137.3806
2018-04-25,137.7392
2018-04-26,138.4754
2018-04-27,138.2489
2018-04-30,136.8143
2018-05-01,136.8521
2018-05-02,134.4453
2018-05-03,134.0112
2018-05-04,135.8233
2018-05-07,135.1721
2018-05-08,134.9644
2018-05-09,136.0905
2018-05-10,137.646
2018-05-11,137.5506
2018-05-14,137.7032
2018-05-15,137.1688
2018-05-16,138.0182
2018-05-17,137.8941
2018-05-18,137.4933
2018-05-21,138.8388
2018-05-22,138.4571
2018-05-23,138.0563
2018-05-24,137.4838
2018-05-25,137.0734
2018-05-29,134.764
2018-05-30,136.1
2018-05-31,134.8499
2018-06-01,135.4607
2018-06-04,136.5008
2018-06-05,137.1307
2018-06-06,138.0945
2018-06-07,138.7148
2018-06-08,139.4591
2018-06-11,139.879
2018-06-12,140.1557
2018-06-13,139.6595
2018-06-14,138.5621
2018-06-15,138.7434
2018-06-18,137.875
2018-06-19,137.3215
2018-06-20,136.1096
2018-06-21,134.7927
2018-06-22,134.8213
2018-06-25,132.4451
2018-06-26,132.7219
2018-06-27,131.195
2018-06-28,133.638
2018-06-29,133.3135
2018-07-02,133.4662
2018-07-03,133.1895
2018-07-05,134.9644
2018-07-06,135.9664
2018-07-09,137.7891
2018-07-10,138.0945
2018-07-11,138.314
2018-07-12,139.7549
2018-07-13,139.2301
2018-07-16,138.8102
2018-07-17,136.9303
2018-07-18,137.9132
2018-07-19,142.4174
2018-07-20,139.6595
2018-07-23,139.0392
2018-07-24,139.6881
2018-07-25,139.9172
2018-07-26,140.0031
2018-07-27,138.5144
2018-07-30,138.8388
2018-07-31,138.3044
2018-08-01,136.9398
2018-08-02,136.4245
2018-08-03,140.9478
2018-08-06,139.3541
2018-08-07,140.2893
2018-08-08,140.1748
2018-08-09,139.6443
2018-08-10,139.3645
2018-08-13,137.6572
2018-08-14,138.2842
2018-08-15,138.8147
2018-08-16,140.1941
2018-08-17,140.8886
2018-08-20,141.3227
2018-08-21,140.8018
2018-08-22,140.0976
2018-08-23,140.223
2018-08-24,140.8693
2018-08-27,141.4963
2018-08-28,141.3998
2018-08-29,142.3162
2018-08-30,140.7632
2018-08-31,141.2937
2018-09-04,140.522
2018-09-05,141.4674
2018-09-06,141.2069
2018-09-07,140.3002
2018-09-10,140.4931
2018-09-11,141.3034
2018-09-12,141.3805
2018-09-13,143.6763
2018-09-14,143.0782
2018-09-17,142.702
2018-09-18,143.3001
2018-09-19,143.7824
2018-09-20,145.7984
2018-09-21,145.9913
2018-09-24,144.718
2018-09-25,143.6377
2018-09-26,146.2421
2018-09-27,146.136
2018-09-28,145.8563
2018-10-01,147.5829
2018-10-02,148.3063
2018-10-03,147.7951
2018-10-04,145.9527
2018-10-05,143.7534
2018-10-08,143.1361
2018-10-09,142.0268
2018-10-10,137.6379
2018-10-11,134.0979
2018-10-12,135.8631
2018-10-15,136.1331
2018-10-16,139.9819
2018-10-17,129.3038
2018-10-18,125.9277
2018-10-19,124.5291
2018-10-22,125.4165
2018-10-23,126.5644
2018-10-24,122.706
2018-10-25,121.9729
2018-10-26,120.3717
2018-10-29,115.404
2018-10-30,111.3141
2018-10-31,111.3431
2018-11-01,112.6935
2018-11-02,111.5746
2018-11-05,115.8092
2018-11-06,118.7608
2018-11-07,120.4199
2018-11-08,120.5274
2018-11-09,120.6837
2018-11-12,118.1047
2018-11-13,118.0461
2018-11-14,117.4209
2018-11-15,118.6322
2018-11-16,118.7592
2018-11-19,117.5283
2018-11-20,114.4902
2018-11-21,115.8286
2018-11-23,114.4805
2018-11-26,116.7957
2018-11-27,117.2548
2018-11-28,120.1561
2018-11-29,118.6713
2018-11-30,121.3968
2018-12-03,122.4127
2018-12-04,118.7885
2018-12-06,121.0451
2018-12-07,116.5808
2018-12-10,118.3294
2018-12-11,118.0949
2018-12-12,118.3587
2018-12-13,117.9386
2018-12-14,117.1278
2018-12-17,113.4157
2018-12-18,113.953
2018-12-19,113.738
2018-12-20,110.4069
2018-12-21,108.375
2018-12-24,105.0829
2018-12-26,108.8146
2018-12-27,111.1493
2018-12-28,110.4167
2018-12-31,111.0419
2019-01-02,112.5463
2019-01-03,110.2994
2019-01-04,114.6075
2019-01-07,115.4183
2019-01-08,117.0594
2019-01-09,117.8996
2019-01-10,118.9741
2019-01-11,118.6517
2019-01-14,117.6065
2019-01-15,118.9155
2019-01-16,118.808
2019-01-17,119.3649
2019-01-18,120.9572
2019-01-22,119.6872
2019-01-23,129.8175
2019-01-24,129.4658
2019-01-25,130.8725
2019-01-28,131.1656
2019-01-29,131.2242
2019-01-30,131.273
2019-01-31,131.3121
2019-02-01,130.9995
2019-02-04,132.0643
2019-02-05,132.416
2019-02-06,133.1682
2019-02-07,131.6265
2019-02-08,132.1404
2019-02-11,132.4171
2019-02-12,134.4529
2019-02-13,135.9057
2019-02-14,134.8779
2019-02-15,136.4097
2019-02-19,137.0718
2019-02-20,136.38
2019-02-21,136.2219
2019-02-22,137.6153
2019-02-25,137.8229
2019-02-26,138.0798
2019-02-27,137.5363
2019-02-28,136.5085
2019-03-01,137.5659
2019-03-04,136.805
2019-03-05,136.2614
2019-03-06,135.372
2019-03-07,133.771
2019-03-08,133.5042
2019-03-11,136.0934
2019-03-12,136.6567
2019-03-13,136.9334
2019-03-14,137.1607
2019-03-15,137.7932
2019-03-18,138.5641
2019-03-19,138.8408
2019-03-20,137.9612
2019-03-21,139.7796
2019-03-22,137.813
2019-03-25,137.5462
2019-03-26,138.574
2019-03-27,137.6055
2019-03-28,138.2775
2019-03-29,139.4436
2019-04-01,141.6178
2019-04-02,141.3213
2019-04-03,141.9439
2019-04-04,141.1039
2019-04-05,141.598
2019-04-08,141.7067
2019-04-09,140.4418
2019-04-10,141.3411
2019-04-11,142.0922
2019-04-12,142.6555
2019-04-15,142.2108
2019-04-16,143.4362
2019-04-17,137.477
2019-04-18,138.6827
2019-04-22,137.2596
2019-04-23,138.7914
2019-04-24,138.3071
2019-04-25,137.0026
2019-04-26,137.8031
2019-04-29,137.4177
2019-04-30,138.6234
2019-05-01,138.91
2019-05-02,137.9514
2019-05-03,138.6036
2019-05-06,138.7321
2019-05-07,136.0242
2019-05-08,136.38
2019-05-09,135.34
2019-05-10,135.32
2019-05-13,131.42
2019-05-14,133.31
2019-05-15,134.4
2019-05-16,135.88
2019-05-17,134.32
2019-05-20,135.12
2019-05-21,136.45
2019-05-22,136.35
2019-05-23,132.39
2019-05-24,132.28
2019-05-28,130.46
2019-05-29,129.69
2019-05-30,129.57
2019-05-31,126.99
2019-06-03,128.27
2019-06-04,132.69
2019-06-05,131.49
2019-06-06,132.22
2019-06-07,133.31
2019-06-10,134.74
2019-06-11,135.95
2019-06-12,134.87
2019-06-13,135.7
2019-06-14,135.58
2019-06-17,134.95
2019-06-18,136.55
2019-06-19,137.12
2019-06-20,138.85
2019-06-21,139.23
2019-06-24,139.4
2019-06-25,138.54
2019-06-26,138.81
2019-06-27,138.73
2019-06-28,137.9
2019-07-01,139.97
2019-07-02,140.18
2019-07-03,141.49
2019-07-04,141.49
2019-07-05,141.2
2019-07-08,140.88
2019-07-09,139.19
2019-07-10,140.51
2019-07-11,141.01
2019-07-12,142.655
2019-07-15,143.15
2019-07-16,143.72
2019-07-17,143.02
2019-07-18,149.49
2019-07-19,149.99
2019-07-22,149.75
2019-07-23,150.34
2019-07-24,149.995
2019-07-25,150.29
2019-07-26,151.205
2019-07-29,151.08
2019-07-30,149.515
2019-07-31,148.59
2019-08-01,150.3
2019-08-02,147.25
2019-08-05,140.97
2019-08-06,140.76
2019-08-07,139.32
2019-08-08,139.985
2019-08-09,136.12
2019-08-12,134.15
2019-08-13,135.635
2019-08-14,131.41
2019-08-15,132.13
2019-08-16,133.87
2019-08-19,135.06
2019-08-20,133.11
2019-08-21,134.25
2019-08-22,134.5
2019-08-23,129.08
2019-08-26,129.665
2019-08-27,131.16
2019-08-28,132.63
2019-08-29,134.82
2019-08-30,135.61
2019-09-02,135.46
2019-09-03,134.23
2019-09-04,136.29
2019-09-05,140.95
2019-09-06,140.49
2019-09-09,142.625
2019-09-10,144.94
2019-09-11,143.4
2019-09-12,143.61
2019-09-13,143.73
2019-09-16,142.5
2019-09-17,142.21
2019-09-18,142.21
2019-09-19,142.86
2019-09-20,142.22
2019-09-23,142.035
2019-09-24,141.725
2019-09-25,143.3
2019-09-26,143.53
2019-09-27,143.1
2019-09-30,145.47
2019-10-01,143.65
2019-10-02,141.72
2019-10-03,141.83
2019-10-04,143
2019-10-07,141.4
2019-10-08,138.28
2019-10-09,139.675
2019-10-10,141.195
2019-10-11,142.77
2019-10-14,141.955
2019-10-15,143.39
2019-10-16,142.13
2019-10-17,134.37
2019-10-18,134.295
2019-10-21,132.585
2019-10-22,133.975
2019-10-23,134.455
2019-10-24,134.125
2019-10-25,135.52
2019-10-28,135.99
2019-10-29,133.945
2019-10-30,135.12
2019-10-31,133.605
2019-11-01,135.395
2019-11-04,137.605
2019-11-05,137.995
2019-11-06,138.61
2019-11-07,137.765
2019-11-08,137.5
2019-11-11,135.39
2019-11-12,135.48
2019-11-13,134.405
2019-11-14,133.64
2019-11-15,134.18
2019-11-18,134.12
2019-11-19,134.575
2019-11-20,133.125
2019-11-21,133.845
2019-11-22,134.25
2019-11-25,135.87
