date,close
2015-12-17,31.63
2015-12-18,29.1255
2015-12-21,29.6071
2015-12-22,30.7193
2015-12-23,32.3656
2015-12-24,32.7946
2015-12-28,32.0503
2015-12-29,32.9873
2015-12-30,33.4689
2015-12-31,33.6266
2016-01-04,33.1449
2016-01-05,33.3901
2016-01-06,33.3201
2016-01-07,33.1011
2016-01-08,33.0661
2016-01-11,32.7421
2016-01-12,32.637
2016-01-13,32.1554
2016-01-14,32.5757
2016-01-15,32.9348
2016-01-19,33.9068
2016-01-20,32.8122
2016-01-21,32.4794
2016-01-22,33.2675
2016-01-25,32.4444
2016-01-26,32.7596
2016-01-27,33.1011
2016-01-28,33.1011
2016-01-29,33.6703
2016-02-01,34.1432
2016-02-02,34.6774
2016-02-03,35.518
2016-02-04,36.0084
2016-02-05,36.7878
2016-02-08,36.3149
2016-02-09,36.1135
2016-02-10,36.4112
2016-02-11,35.842
2016-02-12,35.5443
2016-02-16,35.5969
2016-02-17,36.1748
2016-02-18,36.3412
2016-02-19,36.3937
2016-02-22,33.933
2016-02-23,33.3288
2016-02-24,34.3796
2016-02-25,34.1782
2016-02-26,34.0907
2016-02-29,33.9681
2016-03-01,33.7842
2016-03-02,33.9593
2016-03-03,33.7842
2016-03-04,33.7404
2016-03-07,34.3271
2016-03-08,34.1695
2016-03-09,34.258
2016-03-10,33.7799
2016-03-11,33.9304
2016-03-14,34.3908
2016-03-15,34.1783
2016-03-16,34.6653
2016-03-17,35.1346
2016-03-18,35.8253
2016-03-21,35.5685
2016-03-22,35.6925
2016-03-23,35.6659
2016-03-24,35.8695
2016-03-28,35.5508
2016-03-29,35.9492
2016-03-30,35.6659
2016-03-31,35.5154
2016-04-01,35.0903
2016-04-04,35.4268
2016-04-05,34.9398
2016-04-06,34.745
2016-04-07,34.6033
2016-04-08,34.4617
2016-04-11,34.4351
2016-04-12,34.0544
2016-04-13,34.1252
2016-04-14,33.9216
2016-04-15,34.0455
2016-04-18,34.0455
2016-04-19,34.196
2016-04-20,33.6382
2016-04-21,33.0804
2016-04-22,33.2486
2016-04-25,33.8242
2016-04-26,34.5679
2016-04-27,35.8253
2016-04-28,35.7367
2016-04-29,35.5065
2016-05-02,36.0201
2016-05-03,35.6925
2016-05-04,36.1706
2016-05-05,35.7633
2016-05-06,35.7013
2016-05-09,35.6393
2016-05-10,35.6039
2016-05-11,35.7544
2016-05-12,35.9404
2016-05-13,36.4097
2016-05-16,36.6045
2016-05-17,35.9404
2016-05-18,35.4711
2016-05-19,35.9669
2016-05-20,36.0112
2016-05-23,35.9846
2016-05-24,36.7284
2016-05-25,36.3477
2016-05-26,36.693
2016-05-27,36.9232
2016-05-31,37.2066
2016-06-01,37.6227
2016-06-02,37.6759
2016-06-03,38.7384
2016-06-06,38.9686
2016-06-07,38.9193
2016-06-08,38.7154
2016-06-09,38.7959
2016-06-10,38.9927
2016-06-13,38.6886
2016-06-14,39.0642
2016-06-15,38.5455
2016-06-16,38.8138
2016-06-17,38.8496
2016-06-20,38.8049
2016-06-21,39.6008
2016-06-22,38.7333
2016-06-23,39.1805
2016-06-24,38.9479
2016-06-27,39.8602
2016-06-28,40.2894
2016-06-29,40.9781
2016-06-30,41.1927
2016-07-01,41.5773
2016-07-05,41.4073
2016-07-06,41.4431
2016-07-07,40.7634
2016-07-08,41.0317
2016-07-11,41.0228
2016-07-12,40.6561
2016-07-13,40.9781
2016-07-14,41.0943
2016-07-15,41.1927
2016-07-18,41.0586
2016-07-19,40.2447
2016-07-20,39.8065
2016-07-21,39.8423
2016-07-22,40.361
2016-07-25,40.3341
2016-07-26,40.2984
2016-07-27,39.8065
2016-07-28,39.887
2016-07-29,40.3699
2016-08-01,40.361
2016-08-02,40.2358
2016-08-03,40.1106
2016-08-04,40.2
2016-08-05,39.7618
2016-08-08,39.3504
2016-08-09,39.2431
2016-08-10,39.2967
2016-08-11,39.2431
2016-08-12,39.2788
2016-08-15,38.9211
2016-08-16,38.4113
2016-08-17,38.5902
2016-08-18,38.9032
2016-08-19,38.778
2016-08-22,38.9032
2016-08-23,38.8764
2016-08-24,38.6618
2016-08-25,38.617
2016-08-26,37.5617
2016-08-29,37.83
2016-08-30,37.4634
2016-08-31,37.204
2016-09-01,37.3113
2016-09-02,37.7495
2016-09-06,37.6136
2016-09-07,38.3582
2016-09-08,38.2498
2016-09-09,37.0299
2016-09-12,37.1654
2016-09-13,37.3371
2016-09-14,37.1745
2016-09-15,37.2739
2016-09-16,37.2287
2016-09-19,37.798
2016-09-20,37.9335
2016-09-21,39.0088
2016-09-22,39.3522
2016-09-23,38.8461
2016-09-26,38.801
2016-09-27,38.6022
2016-09-28,38.6654
2016-09-29,38.2769
2016-09-30,37.7528
2016-10-03,37.1745
2016-10-04,35.9275
2016-10-05,35.9094
2016-10-06,35.8823
2016-10-07,35.7377
2016-10-10,36.3341
2016-10-11,35.7829
2016-10-12,36.054
2016-10-13,36.56
2016-10-14,36.1444
2016-10-17,36.2438
2016-10-18,36.5691
2016-10-19,36.2257
2016-10-20,35.7377
2016-10-21,35.8281
2016-10-24,35.9636
2016-10-25,34.7076
2016-10-26,34.6715
2016-10-27,34.6895
2016-10-28,35.051
2016-10-31,35.6112
2016-11-01,34.9877
2016-11-02,34.9064
2016-11-03,35.295
2016-11-04,35.0058
2016-11-07,35.5389
2016-11-08,35.8552
2016-11-09,34.0389
2016-11-10,32.8733
2016-11-11,33.0179
2016-11-14,32.9727
2016-11-15,33.4426
2016-11-16,33.4968
2016-11-17,33.6956
2016-11-18,33.4606
2016-11-21,33.6504
2016-11-22,33.7769
2016-11-23,33.5149
2016-11-25,33.9124
2016-11-28,34.2648
2016-11-29,33.7769
2016-11-30,32.6835
2016-12-01,32.1865
2016-12-02,32.2588
2016-12-05,32.7197
2016-12-06,32.6835
2016-12-07,33.1173
2016-12-08,33.8323
2016-12-09,33.9055
2016-12-12,34.1706
2016-12-13,34.0243
2016-12-14,33.2562
2016-12-15,33.7134
2016-12-16,34.4632
2016-12-19,35.0576
2016-12-20,34.4724
2016-12-21,34.7467
2016-12-22,34.6095
2016-12-23,34.6278
2016-12-27,34.5272
2016-12-28,34.0609
2016-12-29,34.6461
2016-12-30,34.637
2017-01-03,34.8473
2017-01-04,35.3776
2017-01-05,34.9753
2017-01-06,35.4142
2017-01-09,35.2405
2017-01-10,35.7251
2017-01-11,36.2371
2017-01-12,36.1
2017-01-13,36.1274
2017-01-17,36.1
2017-01-18,35.7159
2017-01-19,35.3136
2017-01-20,35.2588
2017-01-23,35.0302
2017-01-24,35.2953
2017-01-25,35.5331
2017-01-26,35.1125
2017-01-27,34.701
2017-01-30,34.5638
2017-01-31,35.4782
2017-02-01,35.2496
2017-02-02,35.5148
2017-02-03,35.6611
2017-02-06,35.6885
2017-02-07,35.9628
2017-02-08,36.484
2017-02-09,36.6303
2017-02-10,36.9504
2017-02-13,37.0144
2017-02-14,36.9047
2017-02-15,36.8041
2017-02-16,37.2887
2017-02-17,37.4076
2017-02-21,38.9803
2017-02-22,39.4192
2017-02-23,39.3095
2017-02-24,39.7667
2017-02-27,39.6478
2017-02-28,39.977
2017-03-01,39.9587
2017-03-02,39.9313
2017-03-03,39.5107
2017-03-06,39.2546
2017-03-07,39.1815
2017-03-08,38.6014
2017-03-09,38.546
2017-03-10,39.3219
2017-03-13,38.9062
2017-03-14,38.897
2017-03-15,39.4512
2017-03-16,38.9155
2017-03-17,39.2572
2017-03-20,38.8139
2017-03-21,39.3127
2017-03-22,39.5621
2017-03-23,39.6637
2017-03-24,39.8669
2017-03-27,39.6914
2017-03-28,39.7191
2017-03-29,39.95
2017-03-30,39.4327
2017-03-31,39.4789
2017-04-03,39.4512
2017-04-04,39.95
2017-04-05,40.2456
2017-04-06,39.8115
2017-04-07,39.8576
2017-04-10,39.7283
2017-04-11,39.7191
2017-04-12,40.107
2017-04-13,39.95
2017-04-17,40.3564
2017-04-18,40.4396
2017-04-19,40.1347
2017-04-20,40.2179
2017-04-21,40.4303
2017-04-24,40.2086
2017-04-25,40.5504
2017-04-26,40.3564
2017-04-27,40.5874
2017-04-28,40.1809
2017-05-01,40.1717
2017-05-02,40.5319
2017-05-03,39.9685
2017-05-04,40.2641
2017-05-05,40.7536
2017-05-08,40.7629
2017-05-09,40.4119
2017-05-10,40.5042
2017-05-11,40.5781
2017-05-12,40.8922
2017-05-15,40.9661
2017-05-16,40.846
2017-05-17,40.5874
2017-05-18,40.6428
2017-05-19,40.7444
2017-05-22,41.04
2017-05-23,41.2247
2017-05-24,41.7143
2017-05-25,41.7605
2017-05-26,41.8251
2017-05-30,41.8621
2017-05-31,41.9637
2017-06-01,42.4348
2017-06-02,42.3054
2017-06-05,42.25
2017-06-06,42.3516
2017-06-07,42.1297
2017-06-08,42.0737
2017-06-09,41.7287
2017-06-12,41.7753
2017-06-13,42.2975
2017-06-14,42.1577
2017-06-15,42.4188
2017-06-16,42.7172
2017-06-19,42.6239
2017-06-20,42.6612
2017-06-21,42.5773
2017-06-22,42.4934
2017-06-23,42.512
2017-06-26,42.6053
2017-06-27,42.2975
2017-06-28,42.0271
2017-06-29,41.2998
2017-06-30,41.1692
2017-07-03,40.8522
2017-07-05,40.5445
2017-07-06,40.5445
2017-07-07,40.4419
2017-07-10,40.6004
2017-07-11,40.5445
2017-07-12,40.7403
2017-07-13,40.675
2017-07-14,41.0573
2017-07-17,41.0294
2017-07-18,41.0294
2017-07-19,42.1017
2017-07-20,42.0085
2017-07-21,42.1297
2017-07-24,42.5493
2017-07-25,42.3721
2017-07-26,42.5866
2017-07-27,42.5027
2017-07-28,42.139
2017-07-31,42.3535
2017-08-01,42.5027
2017-08-02,42.6985
2017-08-03,43.0342
2017-08-04,42.9037
2017-08-07,43.2766
2017-08-08,43.7615
2017-08-09,43.5191
2017-08-10,43.7615
2017-08-11,43.3606
2017-08-14,43.6683
2017-08-15,43.7149
2017-08-16,43.976
2017-08-17,43.7615
2017-08-18,43.976
2017-08-21,44.1718
2017-08-22,44.5262
2017-08-23,45.0111
2017-08-24,45.1603
2017-08-25,45.2815
2017-08-28,45.5985
2017-08-29,45.6265
2017-08-30,45.412
2017-08-31,45.5239
2017-09-01,45.3281
2017-09-05,45.0577
2017-09-06,44.694
2017-09-07,45.204
2017-09-08,45.5145
2017-09-11,45.7498
2017-09-12,44.8747
2017-09-13,44.4324
2017-09-14,44.6206
2017-09-15,44.7053
2017-09-18,44.2442
2017-09-19,44.009
2017-09-20,43.7455
2017-09-21,43.8114
2017-09-22,43.7549
2017-09-25,44.3195
2017-09-26,44.3572
2017-09-27,43.9902
2017-09-28,44.4042
2017-09-29,44.6206
2017-10-02,44.7335
2017-10-03,44.6771
2017-10-04,45.1099
2017-10-05,45.4581
2017-10-06,44.8276
2017-10-09,44.583
2017-10-10,45.0535
2017-10-11,45.4016
2017-10-12,45.5334
2017-10-13,45.157
2017-10-16,44.9594
2017-10-17,45.2699
2017-10-18,45.3358
2017-10-19,45.5145
2017-10-20,45.4487
2017-10-23,45.4204
2017-10-24,46.5778
2017-10-25,46.926
2017-10-26,47.5282
2017-10-27,48.0269
2017-10-30,47.8293
2017-10-31,48.6762
2017-11-01,48.2433
2017-11-02,47.4718
2017-11-03,48.074
2017-11-06,47.8293
2017-11-07,48.2904
2017-11-08,48.1304
2017-11-09,47.7917
2017-11-10,47.5753
2017-11-13,48.1869
2017-11-14,49.4572
2017-11-15,49.0526
2017-11-16,48.9302
2017-11-17,48.4033
2017-11-20,48.3186
2017-11-21,48.6386
2017-11-22,48.6762
2017-11-24,49.1279
2017-11-27,49.2784
2017-11-28,49.7583
2017-11-29,49.7113
2017-11-30,49.9371
2017-12-01,49.6077
2017-12-04,49.2031
2017-12-05,48.4504
2017-12-06,48.7044
2017-12-07,49.0149
2017-12-08,49.4628
2017-12-11,49.8328
2017-12-12,48.5709
2017-12-13,48.9599
2017-12-14,48.9124
2017-12-15,49.6336
2017-12-18,49.1876
2017-12-19,48.2198
2017-12-20,48.5139
2017-12-21,48.0111
2017-12-22,48.3716
2017-12-26,47.7928
2017-12-27,48.1059
2017-12-28,48.3431
2017-12-29,47.9921
2018-01-02,47.5461
2018-01-03,46.9673
2018-01-04,46.455
2018-01-05,46.2367
2018-01-08,46.5593
2018-01-09,46.4075
2018-01-10,45.5346
2018-01-11,46.3221
2018-01-12,46.0375
2018-01-16,45.8382
2018-01-17,45.9426
2018-01-18,45.3543
2018-01-19,45.212
2018-01-22,45.2215
2018-01-23,45.6769
2018-01-24,45.8762
2018-01-25,46.3316
2018-01-26,46.1893
2018-01-29,45.3543
2018-01-30,45.8003
2018-01-31,46.2272
2018-02-01,46.0754
2018-02-02,46.3126
2018-02-05,44.8609
2018-02-06,43.4851
2018-02-07,44.1683
2018-02-08,43.7792
2018-02-09,44.8514
2018-02-12,45.5346
2018-02-13,45.62
2018-02-14,45.9521
2018-02-15,47.0622
2018-02-16,47.6505
2018-02-20,47.0432
2018-02-21,46.2462
2018-02-22,46.1703
2018-02-23,47.1761
2018-02-26,46.9484
2018-02-27,46.2367
2018-02-28,46.0375
2018-03-01,45.8572
2018-03-02,45.601
2018-03-05,46.3696
2018-03-06,45.9141
2018-03-07,45.7908
2018-03-08,46.0416
2018-03-09,46.1182
2018-03-12,46.7022
2018-03-13,46.9895
2018-03-14,47.4586
2018-03-15,47.7937
2018-03-16,47.7267
2018-03-19,47.5065
2018-03-20,47.5735
2018-03-21,47.3629
2018-03-22,47.7841
2018-03-23,47.1331
2018-03-26,47.6501
2018-03-27,48.3969
2018-03-28,48.5883
2018-03-29,48.9426
2018-04-02,48.6266
2018-04-03,48.9713
2018-04-04,48.6649
2018-04-05,49.0192
2018-04-06,48.799
2018-04-09,48.8085
2018-04-10,48.2054
2018-04-11,48.349
2018-04-12,47.4969
2018-04-13,47.9373
2018-04-16,48.7607
2018-04-17,49.4213
2018-04-18,49.1724
2018-04-19,49.0192
2018-04-20,48.5692
2018-04-23,48.8947
2018-04-24,49.5649
2018-04-25,48.8277
2018-04-26,50.6851
2018-04-27,50.2734
2018-04-30,50.4649
2018-05-01,50.8287
2018-05-02,51.1255
2018-05-03,51.4606
2018-05-04,51.9488
2018-05-07,51.6999
2018-05-08,50.3787
2018-05-09,49.7468
2018-05-10,50.1968
2018-05-11,50.3595
2018-05-14,50.1872
2018-05-15,49.7372
2018-05-16,49.5457
2018-05-17,49.2777
2018-05-18,49.2777
2018-05-21,49.5457
2018-05-22,49.4021
2018-05-23,50.7904
2018-05-24,51.1159
2018-05-25,51.1446
2018-05-29,50.9436
2018-05-30,50.8382
2018-05-31,50.8287
2018-06-01,50.034
2018-06-04,49.5936
2018-06-05,49.3447
2018-06-06,48.2915
2018-06-07,48.6701
2018-06-08,48.728
2018-06-11,47.9748
2018-06-12,48.419
2018-06-13,48.1004
2018-06-14,48.5542
2018-06-15,48.7763
2018-06-18,49.0564
2018-06-19,49.6358
2018-06-20,49.2495
2018-06-21,49.3268
2018-06-22,49.7324
2018-06-25,50.3021
2018-06-26,50.0993
2018-06-27,50.3794
2018-06-28,50.7849
2018-06-29,51.1133
2018-07-02,51.2967
2018-07-03,51.4802
2018-07-05,51.8279
2018-07-06,52.2721
2018-07-09,50.4276
2018-07-10,50.9105
2018-07-11,50.9877
2018-07-12,50.9491
2018-07-13,51.0843
2018-07-16,51.1712
2018-07-17,50.9588
2018-07-18,50.6884
2018-07-19,51.007
2018-07-20,50.6401
2018-07-23,50.4759
2018-07-24,48.3707
2018-07-25,48.1583
2018-07-26,48.1004
2018-07-27,47.9845
2018-07-30,47.7237
2018-07-31,48.3418
2018-08-01,48.2549
2018-08-02,48.7763
2018-08-03,49.0757
2018-08-06,48.9791
2018-08-07,48.6508
2018-08-08,48.4577
2018-08-09,48.8632
2018-08-10,48.5832
2018-08-13,47.7044
2018-08-14,47.7624
2018-08-15,47.7334
2018-08-16,48.2162
2018-08-17,48.6894
2018-08-20,48.7474
2018-08-21,48.3225
2018-08-22,47.8879
2018-08-23,48.0714
2018-08-24,48.3707
2018-08-27,48.0328
2018-08-28,47.9169
2018-08-29,48.2838
2018-08-30,48.168
2018-08-31,47.6465
2018-09-04,47.9072
2018-09-05,48.6315
2018-09-06,48.9919
2018-09-07,48.4853
2018-09-10,48.4074
2018-09-11,48.3003
2018-09-12,48.3295
2018-09-13,48.5633
2018-09-14,48.4269
2018-09-17,48.4756
2018-09-18,48.612
2018-09-19,47.7644
2018-09-20,47.8619
2018-09-21,47.8521
2018-09-24,47.0923
2018-09-25,46.3226
2018-09-26,45.7868
2018-09-27,46.0791
2018-09-28,46.6928
2018-10-01,46.4006
2018-10-02,46.9266
2018-10-03,45.6699
2018-10-04,45.3972
2018-10-05,45.855
2018-10-08,46.2934
2018-10-09,46.5077
2018-10-10,45.8356
2018-10-11,44.9685
2018-10-12,44.988
2018-10-15,45.329
2018-10-16,46.1083
2018-10-17,46.3908
2018-10-18,46.8292
2018-10-19,47.365
2018-10-22,47.443
2018-10-23,46.761
2018-10-24,47.8521
2018-10-25,46.6636
2018-10-26,46.3714
2018-10-29,46.3616
2018-10-30,46.1083
2018-10-31,45.7966
2018-11-01,46.4493
2018-11-02,45.8063
2018-11-05,46.1668
2018-11-06,46.839
2018-11-07,47.5891
2018-11-08,46.9948
2018-11-09,47.6475
2018-11-12,47.8814
2018-11-13,48.8361
2018-11-14,48.651
2018-11-15,48.2223
2018-11-16,48.7192
2018-11-19,49.3037
2018-11-20,49.2062
2018-11-21,47.9106
2018-11-23,47.9301
2018-11-26,47.8326
2018-11-27,48.1541
2018-11-28,48.0275
2018-11-29,48.271
2018-11-30,49.0796
2018-12-03,49.557
2018-12-04,49.4693
2018-12-06,50.4824
2018-12-07,50.7357
2018-12-10,51.0698
2018-12-11,51.3252
2018-12-12,50.9617
2018-12-13,51.9933
2018-12-14,52.1505
2018-12-17,50.382
2018-12-18,50.2543
2018-12-19,50.0382
2018-12-20,50.5785
2018-12-21,50.1757
2018-12-24,48.2893
2018-12-26,48.5546
2018-12-27,48.928
2018-12-28,48.9574
2018-12-31,49.2129
2019-01-02,47.8374
2019-01-03,47.69
2019-01-04,48.3679
2019-01-07,47.5623
2019-01-08,48.3876
2019-01-09,48.0044
2019-01-10,48.4957
2019-01-11,48.1223
2019-01-14,46.9237
2019-01-15,47.7588
2019-01-16,48.142
2019-01-17,48.4465
2019-01-18,48.3188
2019-01-22,48.1027
2019-01-23,48.5743
2019-01-24,48.8002
2019-01-25,48.2893
2019-01-28,47.69
2019-01-29,47.8669
2019-01-30,48.3385
2019-01-31,48.9967
2019-02-01,48.7315
2019-02-04,48.8297
2019-02-05,48.9476
2019-02-06,48.6922
2019-02-07,49.2227
2019-02-08,49.6255
2019-02-11,49.6747
2019-02-12,49.6059
2019-02-13,49.5469
2019-02-14,49.5764
2019-02-15,49.7434
2019-02-19,50.2838
2019-02-20,47.6606
2019-02-21,48.0437
2019-02-22,48.4072
2019-02-25,48.3188
2019-02-26,47.8472
2019-02-27,47.6409
2019-02-28,47.5034
2019-03-01,47.8571
2019-03-04,47.749
2019-03-05,47.4346
2019-03-06,47.6507
2019-03-07,47.6904
2019-03-08,47.8887
2019-03-11,48.4241
2019-03-12,49.0785
2019-03-13,49.0685
2019-03-14,49.0091
2019-03-15,49.1181
2019-03-18,49.0785
2019-03-19,48.2754
2019-03-20,48.3943
2019-03-21,48.9397
2019-03-22,49.6139
2019-03-25,49.7527
2019-03-26,50.0303
2019-03-27,49.8816
2019-03-28,49.5841
2019-03-29,49.9212
2019-04-01,49.6833
2019-04-02,49.832
2019-04-03,49.8221
2019-04-04,49.4751
2019-04-05,50.0699
2019-04-08,50.0997
2019-04-09,50.2881
2019-04-10,50.4665
2019-04-11,50.6053
2019-04-12,51.0416
2019-04-15,51.3291
2019-04-16,50.9028
2019-04-17,50.9127
2019-04-18,51.1606
2019-04-22,51.5968
2019-04-23,51.9042
2019-04-24,52.1818
2019-04-25,50.8433
2019-04-26,50.6252
2019-04-29,50.2286
2019-04-30,50.7739
2019-05-01,50.3079
2019-05-02,50.0898
2019-05-03,50.4467
2019-05-06,49.7923
2019-05-07,49.5445
2019-05-08,48.6025
2019-05-09,48.6521
2019-05-10,49.4751
2019-05-13,49.9807
2019-05-14,49.5841
2019-05-15,49.6833
2019-05-16,49.7328
2019-05-17,49.7328
2019-05-20,49.832
2019-05-21,49.6733
2019-05-22,49.9906
2019-05-23,50.1691
2019-05-24,50.3971
2019-05-28,50.1493
2019-05-29,49.3759
2019-05-30,49.1379
2019-05-31,49.6337
2019-06-03,50.7144
2019-06-04,50.3178
2019-06-05,51.23
2019-06-06,51.75
2019-06-07,51.64
2019-06-10,51.22
2019-06-11,50.73
2019-06-12,51.29
2019-06-13,51.29
2019-06-14,51.665
2019-06-17,51.41
2019-06-18,50.66
2019-06-19,51.555
2019-06-20,51.58
2019-06-21,51.735
2019-06-24,51.42
2019-06-25,51.4
2019-06-26,50.64
2019-06-27,50.35
2019-06-28,50.36
2019-07-01,50.41
2019-07-02,51
2019-07-03,50.99
2019-07-04,50.99
2019-07-05,51.15
2019-07-08,51.105
2019-07-09,50.85
2019-07-10,51.17
2019-07-11,51.005
2019-07-12,49.99
2019-07-15,49.73
2019-07-16,49.39
2019-07-17,49.575
2019-07-18,49.77
2019-07-19,49.18
2019-07-22,48.92
2019-07-23,48.625
2019-07-24,48.555
2019-07-25,48.975
2019-07-26,49
2019-07-29,49.625
2019-07-30,50.315
2019-07-31,50.505
2019-08-01,51.035
2019-08-02,50.16
2019-08-05,49.175
2019-08-06,50.485
2019-08-07,50.04
2019-08-08,50.69
2019-08-09,50.385
2019-08-12,49.545
2019-08-13,49.29
2019-08-14,48.48
2019-08-15,48.91
2019-08-16,49.28
2019-08-19,49.525
2019-08-20,49.215
2019-08-21,49.29
2019-08-22,49.5
2019-08-23,48.985
2019-08-26,49.3
2019-08-27,49.36
2019-08-28,49.25
2019-08-29,50.13
2019-08-30,50.645
2019-09-02,50.56
2019-09-03,51.47
2019-09-04,51.915
2019-09-05,50.57
2019-09-06,50.155
2019-09-09,49.58
2019-09-10,50.05
2019-09-11,50.66
2019-09-12,50.935
2019-09-13,50.785
2019-09-16,50.77
2019-09-17,51.115
2019-09-18,51.195
2019-09-19,51.235
2019-09-20,51.58
2019-09-23,51.84
2019-09-24,52.06
2019-09-25,52.07
2019-09-26,52.07
2019-09-27,52.25
2019-09-30,52.22
2019-10-01,51.9
2019-10-02,51.435
2019-10-03,51.095
2019-10-04,51.47
2019-10-07,51
2019-10-08,50.65
2019-10-09,50.52
2019-10-10,49.945
2019-10-11,49.875
2019-10-14,49.605
2019-10-15,49.55
2019-10-16,49.595
2019-10-17,49.94
2019-10-18,50.47
2019-10-21,50.85
2019-10-22,51.025
2019-10-23,51.29
2019-10-24,51.175
2019-10-25,50.16
2019-10-28,49.76
2019-10-29,50.115
2019-10-30,49.41
2019-10-31,49.955
2019-11-01,50.075
2019-11-04,49.425
2019-11-05,49.48
2019-11-06,49.525
2019-11-07,48.71
2019-11-08,48.32
2019-11-11,48.25
2019-11-12,48.13
2019-11-13,48.7
2019-11-14,48.745
2019-11-15,48.87
2019-11-18,48.75
2019-11-19,48.53
2019-11-20,48.73
2019-11-21,48.695
2019-11-22,48.29
2019-11-25,48.56
