date,close
2014-06-13,63.9856
2014-06-16,64.5143
2014-06-17,66.5253
2014-06-18,66.5773
2014-06-19,66.4473
2014-06-20,66.4993
2014-06-23,65.1298
2014-06-24,64.0376
2014-06-25,64.7397
2014-06-26,63.9509
2014-06-27,63.9769
2014-06-30,64.107
2014-07-01,63.6909
2014-07-02,62.7288
2014-07-03,63.3962
2014-07-07,63.0842
2014-07-08,61.2899
2014-07-09,62.096
2014-07-10,61.602
2014-07-11,60.4838
2014-07-14,60.6398
2014-07-15,60.3885
2014-07-16,58.9236
2014-07-17,57.6495
2014-07-18,54.0697
2014-07-21,52.5615
2014-07-22,55.1878
2014-07-23,54.5291
2014-07-24,55.1618
2014-07-25,54.3124
2014-07-28,53.9136
2014-07-29,53.0469
2014-07-30,52.5615
2014-07-31,50.8712
2014-08-01,51.166
2014-08-04,50.4725
2014-08-05,50.2038
2014-08-06,40.3225
2014-08-07,41.484
2014-08-08,41.614
2014-08-11,42.9836
2014-08-12,42.2295
2014-08-13,41.6314
2014-08-14,42.1775
2014-08-15,43.5296
2014-08-18,42.9836
2014-08-19,42.9749
2014-08-20,42.6542
2014-08-21,41.8134
2014-08-22,43.0702
2014-08-25,42.7929
2014-08-26,40.5219
2014-08-27,40.5479
2014-08-28,39.2564
2014-08-29,38.7623
2014-09-02,36.7688
2014-09-03,36.3614
2014-09-04,36.4134
2014-09-05,36.3874
2014-09-08,36.5694
2014-09-09,36.2227
2014-09-10,35.9998
2014-09-11,36.1047
2014-09-12,36.2708
2014-09-15,35.624
2014-09-16,35.7988
2014-09-17,37.8789
2014-09-18,38.5344
2014-09-19,37.8177
2014-09-22,36.8738
2014-09-23,38.5169
2014-09-24,38.1761
2014-09-25,37.8964
2014-09-26,38.919
2014-09-29,38.6568
2014-09-30,39.356
2014-10-01,38.246
2014-10-02,38.3247
2014-10-03,39.321
2014-10-06,40.4397
2014-10-07,40.2474
2014-10-08,40.8155
2014-10-09,40.2474
2014-10-10,41.0078
2014-10-13,42.2139
2014-10-14,42.7995
2014-10-15,38.8928
2014-10-16,38.045
2014-10-17,38.1062
2014-10-20,39.557
2014-10-21,42.6247
2014-10-22,41.2788
2014-10-23,42.5111
2014-10-24,43.0093
2014-10-27,41.6546
2014-10-28,43.2278
2014-10-29,42.7733
2014-10-30,34.7151
2014-10-31,46.1731
2014-11-03,45.6837
2014-11-04,44.0668
2014-11-05,38.246
2014-11-06,35.4405
2014-11-07,35.3968
2014-11-10,36.3931
2014-11-11,35.1258
2014-11-12,35.2832
2014-11-13,34.7151
2014-11-14,34.4354
2014-11-17,33.4565
2014-11-18,34.3305
2014-11-19,35.2431
2014-11-20,35.393
2014-11-21,36.2924
2014-11-24,36.9096
2014-11-25,36.9449
2014-11-26,36.8831
2014-11-28,36.8567
2014-12-01,36.7068
2014-12-02,36.9184
2014-12-03,37.033
2014-12-04,37.5797
2014-12-05,39.4402
2014-12-08,41.0714
2014-12-09,39.5813
2014-12-10,38.7524
2014-12-11,37.8619
2014-12-12,35.4106
2014-12-15,34.1586
2014-12-16,34.4495
2014-12-17,34.8375
2014-12-18,36.6098
2014-12-19,38.3997
2014-12-22,38.1528
2014-12-23,39.2286
2014-12-24,39.9163
2014-12-26,40.5688
2014-12-29,40.3307
2014-12-30,39.0434
2014-12-31,38.532
2015-01-02,37.2446
2015-01-05,36.2395
2015-01-06,35.393
2015-01-07,35.5341
2015-01-08,37.4563
2015-01-09,36.6892
2015-01-12,36.0102
2015-01-13,36.116
2015-01-14,36.7244
2015-01-15,37.3505
2015-01-16,37.95
2015-01-20,37.9589
2015-01-21,38.9376
2015-01-22,39.7311
2015-01-23,37.4915
2015-01-26,37.5973
2015-01-27,37.6238
2015-01-28,36.7685
2015-01-29,37.1829
2015-01-30,36.1337
2015-02-02,37.9941
2015-02-03,39.8193
2015-02-04,39.2991
2015-02-05,44.6953
2015-02-06,46.5205
2015-02-09,48.187
2015-02-10,49.0688
2015-02-11,48.9277
2015-02-12,51.3348
2015-02-13,50.1886
2015-02-17,49.5714
2015-02-18,49.4391
2015-02-19,48.575
2015-02-20,48.6455
2015-02-23,48.4163
2015-02-24,48.6279
2015-02-25,49.8258
2015-02-26,49.9057
2015-02-27,48.0777
2015-03-02,46.5426
2015-03-03,46.2054
2015-03-04,47.705
2015-03-05,47.0927
2015-03-06,48.1931
2015-03-09,48.7521
2015-03-10,48.7787
2015-03-11,49.7016
2015-03-12,49.8879
2015-03-13,49.462
2015-03-16,49.8879
2015-03-17,49.9057
2015-03-18,50.9262
2015-03-19,52.062
2015-03-20,51.8047
2015-03-23,53.4108
2015-03-24,52.5589
2015-03-25,52.5589
2015-03-26,51.9466
2015-03-27,52.0443
2015-03-30,53.6504
2015-03-31,53.4286
2015-04-01,52.6743
2015-04-02,54.2361
2015-04-06,55.1944
2015-04-07,54.449
2015-04-08,54.3425
2015-04-09,54.0408
2015-04-10,53.9166
2015-04-13,53.6504
2015-04-14,53.3487
2015-04-15,53.5084
2015-04-16,52.6033
2015-04-17,52.0797
2015-04-20,50.7132
2015-04-21,50.518
2015-04-22,50.5712
2015-04-23,52.6477
2015-04-24,51.8579
2015-04-27,51.219
2015-04-28,52.0886
2015-04-29,52.0443
2015-04-30,50.1808
2015-05-01,52.275
2015-05-04,51.6716
2015-05-05,50.4559
2015-05-06,52.5944
2015-05-07,47.9091
2015-05-08,45.6907
2015-05-11,45.0784
2015-05-12,45.3446
2015-05-13,46.0723
2015-05-14,45.7883
2015-05-15,45.7972
2015-05-18,45.9835
2015-05-19,46.7112
2015-05-20,47.4526
2015-05-21,46.4521
2015-05-22,46.8452
2015-05-26,46.193
2015-05-27,45.4248
2015-05-28,45.0675
2015-05-29,45.2015
2015-06-01,45.4516
2015-06-02,45.4963
2015-06-03,45.6749
2015-06-04,45.3891
2015-06-05,45.4159
2015-06-08,45.0853
2015-06-09,45.4516
2015-06-10,45.7107
2015-06-11,45.3087
2015-06-12,44.9156
2015-06-15,44.8173
2015-06-16,45.0585
2015-06-17,45.4159
2015-06-18,45.2819
2015-06-19,44.8173
2015-06-22,44.7191
2015-06-23,44.2188
2015-06-24,43.7811
2015-06-25,43.5131
2015-06-26,43.3255
2015-06-29,42.7359
2015-06-30,42.1017
2015-07-01,41.9141
2015-07-02,42.4679
2015-07-06,40.9582
2015-07-07,40.6099
2015-07-08,38.6088
2015-07-09,37.3493
2015-07-10,37.1795
2015-07-13,38.0103
2015-07-14,37.6798
2015-07-15,37.0813
2015-07-16,37.4029
2015-07-17,35.8664
2015-07-20,35.0624
2015-07-21,35.8217
2015-07-22,35.7413
2015-07-23,36.0897
2015-07-24,34.5532
2015-07-27,34.5979
2015-07-28,35.3036
2015-07-29,35.7056
2015-07-30,35.5895
2015-07-31,35.4197
2015-08-03,35.0445
2015-08-04,35.3572
2015-08-05,36.2952
2015-08-06,34.982
2015-08-07,42.191
2015-08-10,43.3077
2015-08-11,42.7181
2015-08-12,40.1989
2015-08-13,40.1007
2015-08-14,40.6277
2015-08-17,41.128
2015-08-18,41.2441
2015-08-19,41.1012
2015-08-20,40.994
2015-08-21,40.3955
2015-08-24,37.8942
2015-08-25,37.2421
2015-08-26,38.8726
2015-08-27,40.6834
2015-08-28,41.2149
2015-08-31,41.1519
2015-09-01,40.287
2015-09-02,41.0708
2015-09-03,41.269
2015-09-04,40.7555
2015-09-08,40.1519
2015-09-09,39.8005
2015-09-10,39.3501
2015-09-11,39.4312
2015-09-14,38.6294
2015-09-15,38.6835
2015-09-16,40.0978
2015-09-17,38.7195
2015-09-18,37.5303
2015-09-21,37.4493
2015-09-22,36.5664
2015-09-23,36.9448
2015-09-24,36.7736
2015-09-25,37.125
2015-09-28,35.8367
2015-09-29,36.9538
2015-09-30,37.188
2015-10-01,36.6385
2015-10-02,39.7465
2015-10-05,41.305
2015-10-06,41.9536
2015-10-07,31.1882
2015-10-08,31.963
2015-10-09,33.008
2015-10-12,32.9629
2015-10-13,32.5305
2015-10-14,33.1071
2015-10-15,33.089
2015-10-16,33.5575
2015-10-19,33.9269
2015-10-20,34.1611
2015-10-21,33.8188
2015-10-22,34.8818
2015-10-23,34.8908
2015-10-26,33.1611
2015-10-27,32.3593
2015-10-28,32.9269
2015-10-29,31.4044
2015-10-30,34.4223
2015-11-02,35.8457
2015-11-03,36.5124
2015-11-04,36.2962
2015-11-05,35.3142
2015-11-06,31.4945
2015-11-09,32.1071
2015-11-10,32.6116
2015-11-11,31.2423
2015-11-12,30.4495
2015-11-13,29.7288
2015-11-16,30.0982
2015-11-17,28.7288
2015-11-18,29.6033
2015-11-19,30.2318
2015-11-20,30.8785
2015-11-23,31.1244
2015-11-24,31.8895
2015-11-25,32.2721
2015-11-27,32.3359
2015-11-30,31.762
2015-12-01,31.9806
2015-12-02,32.4816
2015-12-03,31.68
2015-12-04,31.1426
2015-12-07,31.7256
2015-12-08,33.8934
2015-12-09,33.3925
2015-12-10,32.6729
2015-12-11,32.1537
2015-12-14,32.2903
2015-12-15,32.3359
2015-12-16,34.4126
2015-12-17,34.5219
2015-12-18,34.2305
2015-12-21,34.7314
2015-12-22,34.9501
2015-12-23,35.5512
2015-12-24,35.1049
2015-12-28,34.0574
2015-12-29,35.1049
2015-12-30,35.0685
2015-12-31,34.5128
2016-01-04,34.4126
2016-01-05,33.5564
2016-01-06,32.3632
2016-01-07,30.9604
2016-01-08,30.25
2016-01-11,29.4211
2016-01-12,30.1862
2016-01-13,29.9312
2016-01-14,29.4939
2016-01-15,29.0021
2016-01-19,27.9181
2016-01-20,28.3736
2016-01-21,27.572
2016-01-22,28.9474
2016-01-25,28.1185
2016-01-26,28.4647
2016-01-27,27.5629
2016-01-28,27.9455
2016-01-29,28.829
2016-02-01,29.0658
2016-02-02,28.5193
2016-02-03,29.0567
2016-02-04,30.6052
2016-02-05,30.7145
2016-02-08,30.4686
2016-02-09,30.004
2016-02-10,29.9129
2016-02-11,28.4282
2016-02-12,26.5427
2016-02-16,26.397
2016-02-17,26.7431
2016-02-18,26.06
2016-02-19,25.6228
2016-02-22,26.1511
2016-02-23,26.397
2016-02-24,27.1854
2016-02-25,27.8402
2016-02-26,28.458
2016-02-29,28.1168
2016-03-01,28.8453
2016-03-02,28.2459
2016-03-03,29.7952
2016-03-04,30.2747
2016-03-07,31.7317
2016-03-08,30.8741
2016-03-09,31.1139
2016-03-10,31.3352
2016-03-11,32.4879
2016-03-14,33.4654
2016-03-15,33.8804
2016-03-16,33.8896
2016-03-17,34.1201
2016-03-18,33.8896
2016-03-21,34.6365
2016-03-22,34.821
2016-03-23,34.5536
2016-03-24,33.9541
2016-03-28,34.4798
2016-03-29,35.2083
2016-03-30,35.5034
2016-03-31,35.2728
2016-04-01,35.863
2016-04-04,34.1294
2016-04-05,34.5812
2016-04-06,35.1345
2016-04-07,35.4665
2016-04-08,35.3282
2016-04-11,35.7155
2016-04-12,36.4901
2016-04-13,36.1581
2016-04-14,36.6745
2016-04-15,37.0526
2016-04-18,37.0618
2016-04-19,37.1633
2016-04-20,36.8221
2016-04-21,35.4573
2016-04-22,35.7063
2016-04-25,35.2821
2016-04-26,35.3651
2016-04-27,36.4256
2016-04-28,36.278
2016-04-29,37.5967
2016-05-02,36.3333
2016-05-03,34.7011
2016-05-04,34.2216
2016-05-05,34.4245
2016-05-06,35.236
2016-05-09,34.4429
2016-05-10,35.8354
2016-05-11,35.6878
2016-05-12,36.7022
2016-05-13,35.2083
2016-05-16,35.4019
2016-05-17,35.614
2016-05-18,35.6786
2016-05-19,35.1622
2016-05-20,35.8907
2016-05-23,35.5864
2016-05-24,36.2533
2016-05-25,36.6023
2016-05-26,36.6582
2016-05-27,36.8443
2016-05-31,36.714
2016-06-01,37.198
2016-06-02,38.4822
2016-06-03,38.3985
2016-06-06,38.7614
2016-06-07,38.8731
2016-06-08,38.7894
2016-06-09,38.9476
2016-06-10,38.5009
2016-06-13,37.3282
2016-06-14,37.3376
2016-06-15,37.868
2016-06-16,41.786
2016-06-17,41.0508
2016-06-20,42.1025
2016-06-21,42.5585
2016-06-22,43.1727
2016-06-23,44.2429
2016-06-24,42.0094
2016-06-27,39.9992
2016-06-28,40.2039
2016-06-29,40.9578
2016-06-30,42.9866
2016-07-01,43.9079
2016-07-05,42.0373
2016-07-06,43.3216
2016-07-07,43.5543
2016-07-08,44.4012
2016-07-11,45.2015
2016-07-12,46.5323
2016-07-13,46.309
2016-07-14,46.4486
2016-07-15,47.5561
2016-07-18,47.6956
2016-07-19,47.5561
2016-07-20,47.7515
2016-07-21,47.4444
2016-07-22,47.8166
2016-07-25,48.3564
2016-07-26,48.7473
2016-07-27,48.9148
2016-07-28,48.5425
2016-07-29,49.6965
2016-08-01,49.0079
2016-08-02,48.9986
2016-08-03,49.3708
2016-08-04,49.9106
2016-08-05,55.3735
2016-08-08,54.75
2016-08-09,54.722
2016-08-10,53.7542
2016-08-11,54.1916
2016-08-12,54.145
2016-08-15,54.5731
2016-08-16,54.4149
2016-08-17,54.7593
2016-08-18,54.8616
2016-08-19,54.2102
2016-08-22,54.3032
2016-08-23,55.1874
2016-08-24,54.9486
2016-08-25,55.1359
2016-08-26,54.6584
2016-08-29,55.8943
2016-08-30,54.4524
2016-08-31,54.1903
2016-09-01,54.6678
2016-09-02,55.164
2016-09-06,55.604
2016-09-07,56.4373
2016-09-08,56.1096
2016-09-09,54.7146
2016-09-12,55.5478
2016-09-13,53.4038
2016-09-14,54.0779
2016-09-15,54.0686
2016-09-16,53.8439
2016-09-19,55.8662
2016-09-20,55.1265
2016-09-21,58.3098
2016-09-22,59.864
2016-09-23,59.0962
2016-09-26,59.0588
2016-09-27,59.4801
2016-09-28,59.8452
2016-09-29,59.2648
2016-09-30,60.6504
2016-10-03,61.6897
2016-10-04,61.493
2016-10-05,61.5305
2016-10-06,61.3058
2016-10-07,60.5381
2016-10-10,61.362
2016-10-11,60.744
2016-10-12,61.0156
2016-10-13,60.51
2016-10-14,60.201
2016-10-17,59.8733
2016-10-18,59.658
2016-10-19,59.995
2016-10-20,59.8733
2016-10-21,59.2179
2016-10-24,58.4221
2016-10-25,57.9634
2016-10-26,57.5889
2016-10-27,57.9166
2016-10-28,58.4315
2016-10-31,57.7199
2016-11-01,56.1564
2016-11-02,54.9954
2016-11-03,55.2389
2016-11-04,50.1925
2016-11-07,50.7449
2016-11-08,50.4921
2016-11-09,50.6512
2016-11-10,49.0503
2016-11-11,49.2469
2016-11-14,49.2094
2016-11-15,50.3797
2016-11-16,51.2326
2016-11-17,50.8934
2016-11-18,50.5823
2016-11-21,51.5908
2016-11-22,51.3269
2016-11-23,50.6295
2016-11-25,50.8274
2016-11-28,50.1111
2016-11-29,50.5164
2016-11-30,49.1781
2016-12-01,47.3402
2016-12-02,47.6136
2016-12-05,48.5466
2016-12-06,48.5937
2016-12-07,45.0972
2016-12-08,46.4826
2016-12-09,47.5476
2016-12-12,46.7182
2016-12-13,47.2554
2016-12-14,46.8219
2016-12-15,47.5005
2016-12-16,47.3779
2016-12-19,47.3968
2016-12-20,47.246
2016-12-21,47.3214
2016-12-22,45.8417
2016-12-23,45.8511
2016-12-27,46.4543
2016-12-28,45.6721
2016-12-29,45.6909
2016-12-30,45.0312
2017-01-03,45.9642
2017-01-04,46.7182
2017-01-05,45.9077
2017-01-06,47.001
2017-01-09,46.2564
2017-01-10,46.0679
2017-01-11,46.7842
2017-01-12,47.5287
2017-01-13,48.3958
2017-01-17,48.9613
2017-01-18,48.6314
2017-01-19,47.9529
2017-01-20,48.4052
2017-01-23,48.0471
2017-01-24,48.7351
2017-01-25,49.2063
2017-01-26,48.8199
2017-01-27,48.8105
2017-01-30,48.6409
2017-01-31,48.8953
2017-02-01,48.9519
2017-02-02,48.9047
2017-02-03,49.1404
2017-02-06,49.4891
2017-02-07,49.5456
2017-02-08,49.376
2017-02-09,49.9603
2017-02-10,50.2619
2017-02-13,50.4127
2017-02-14,51.2986
2017-02-15,51.8358
2017-02-16,51.9678
2017-02-17,45.4553
2017-02-21,45.3139
2017-02-22,45.3234
2017-02-23,44.8391
2017-02-24,47.194
2017-02-27,47.5454
2017-02-28,47.0421
2017-03-01,47.1845
2017-03-02,47.4789
2017-03-03,48.1246
2017-03-06,47.8303
2017-03-07,47.6878
2017-03-08,47.7733
2017-03-09,47.0706
2017-03-10,46.6528
2017-03-13,47.9632
2017-03-14,47.8777
2017-03-15,49.2071
2017-03-16,49.6914
2017-03-17,49.8149
2017-03-20,50.6315
2017-03-21,50.0143
2017-03-22,50.8784
2017-03-23,51.4576
2017-03-24,51.3057
2017-03-27,51.4956
2017-03-28,51.9704
2017-03-29,51.9514
2017-03-30,52.5307
2017-03-31,52.7396
2017-04-03,52.1603
2017-04-04,51.3532
2017-04-05,51.3627
2017-04-06,51.3817
2017-04-07,51.1348
2017-04-10,51.0398
2017-04-11,51.1158
2017-04-12,51.4007
2017-04-13,51.2867
2017-04-17,52.3313
2017-04-18,52.4452
2017-04-19,52.2268
2017-04-20,52.5686
2017-04-21,52.5876
2017-04-24,53.1004
2017-04-25,54.2304
2017-04-26,52.4072
2017-04-27,52.3218
2017-04-28,52.4452
2017-05-01,53.0909
2017-05-02,52.9105
2017-05-03,52.825
2017-05-04,51.5811
2017-05-05,52.5402
2017-05-08,53.7176
2017-05-09,54.1734
2017-05-10,56.1201
2017-05-11,55.4649
2017-05-12,54.7907
2017-05-15,54.9616
2017-05-16,55.0376
2017-05-17,53.4802
2017-05-18,52.7491
2017-05-19,53.0814
2017-05-22,52.787
2017-05-23,52.4072
2017-05-24,52.7609
2017-05-25,52.4837
2017-05-26,52.4646
2017-05-30,52.13
2017-05-31,52.455
2017-06-01,53.927
2017-06-02,54.1564
2017-06-05,53.9078
2017-06-06,54.7872
2017-06-07,55.2555
2017-06-08,54.9688
2017-06-09,55.8099
2017-06-12,55.9724
2017-06-13,56.565
2017-06-14,56.1827
2017-06-15,56.0584
2017-06-16,55.8959
2017-06-19,56.7753
2017-06-20,56.4599
2017-06-21,57.8171
2017-06-22,59.8243
2017-06-23,61
2017-06-26,60.9522
2017-06-27,60.0633
2017-06-28,60.1302
2017-06-29,60.2736
2017-06-30,60.0633
2017-07-03,59.9773
2017-07-05,60.1684
2017-07-06,59.1648
2017-07-07,59.4038
2017-07-10,59.9008
2017-07-11,60.1206
2017-07-12,60.0633
2017-07-13,59.9964
2017-07-14,60.2736
2017-07-17,60.2067
2017-07-18,60.3214
2017-07-19,60.761
2017-07-20,61.4014
2017-07-21,61.2676
2017-07-24,61.8411
2017-07-25,62.7204
2017-07-26,60.9904
2017-07-27,60.5699
2017-07-28,60.8566
2017-07-31,60.5603
2017-08-01,60.3309
2017-08-02,59.3751
2017-08-03,58.6104
2017-08-04,57.9127
2017-08-07,58.9354
2017-08-08,59.9486
2017-08-09,59.4038
2017-08-10,57.8458
2017-08-11,57.8458
2017-08-14,53.5351
2017-08-15,51.3272
2017-08-16,53.0572
2017-08-17,51.4036
2017-08-18,53.0285
2017-08-21,54.8732
2017-08-22,56.5555
2017-08-23,56.9593
2017-08-24,56.9113
2017-08-25,56.9786
2017-08-28,57.469
2017-08-29,57.4498
2017-08-30,58.6038
2017-08-31,58.498
2017-09-01,59.45
2017-09-05,59.6328
2017-09-06,60.2578
2017-09-07,60.104
2017-09-08,59.5174
2017-09-11,59.8828
2017-09-12,60.2001
2017-09-13,59.402
2017-09-14,59.2866
2017-09-15,59.6328
2017-09-18,59.1808
2017-09-19,59.8059
2017-09-20,59.3827
2017-09-21,58.7577
2017-09-22,59.1039
2017-09-25,58.4499
2017-09-26,58.5846
2017-09-27,59.2769
2017-09-28,59.3731
2017-09-29,59.1231
2017-10-02,58.0749
2017-10-03,58.373
2017-10-04,58.4692
2017-10-05,59.5366
2017-10-06,60.3348
2017-10-09,59.979
2017-10-10,60.7483
2017-10-11,60.3925
2017-10-12,61.8157
2017-10-13,61.4215
2017-10-16,61.508
2017-10-17,61.1618
2017-10-18,61.4407
2017-10-19,61.2772
2017-10-20,60.7387
2017-10-23,60.7002
2017-10-24,60.7483
2017-10-25,60.0463
2017-10-26,60.6617
2017-10-27,60.9887
2017-10-30,60.6137
2017-10-31,61.1714
2017-11-01,61.4022
2017-11-02,58.5269
2017-11-03,58.0268
2017-11-06,57.8729
2017-11-07,58.1903
2017-11-08,59.2962
2017-11-09,59.0462
2017-11-10,59.7482
2017-11-13,61.181
2017-11-14,60.6233
2017-11-15,60.5463
2017-11-16,61.2524
2017-11-17,61.5619
2017-11-20,62.4324
2017-11-21,63.0224
2017-11-22,63.8542
2017-11-24,64.0282
2017-11-27,64.0282
2017-11-28,65.1986
2017-11-29,65.7305
2017-11-30,65.6822
2017-12-01,64.1637
2017-12-04,64.3861
2017-12-05,64.3958
2017-12-06,64.2023
2017-12-07,63.4092
2017-12-08,65.334
2017-12-11,65.0341
2017-12-12,65.0631
2017-12-13,65.0631
2017-12-14,64.241
2017-12-15,65.2276
2017-12-18,66.1561
2017-12-19,65.5467
2017-12-20,66.0207
2017-12-21,65.6435
2017-12-22,67.6746
2017-12-26,67.6359
2017-12-27,67.2297
2017-12-28,66.0303
2017-12-29,65.9917
2018-01-02,66.3108
2018-01-03,65.8176
2018-01-04,66.1657
2018-01-05,66.5333
2018-01-08,66.1657
2018-01-09,66.543
2018-01-10,65.1212
2018-01-11,65.7305
2018-01-12,66.4172
2018-01-16,66.1077
2018-01-17,66.4849
2018-01-18,66.069
2018-01-19,67.6939
2018-01-22,68.516
2018-01-23,69.696
2018-01-24,70.8857
2018-01-25,70.0732
2018-01-26,71.0211
2018-01-29,71.2532
2018-01-30,70.6729
2018-01-31,69.4832
2018-02-01,69.2898
2018-02-02,67.6842
2018-02-05,65.0438
2018-02-06,66.1174
2018-02-07,66.3398
2018-02-08,64.4732
2018-02-09,65.3823
2018-02-12,66.011
2018-02-13,66.1657
2018-02-14,67.8874
2018-02-15,70.3827
2018-02-16,66.8041
2018-02-20,69.019
2018-02-21,69.3091
2018-02-22,69.019
2018-02-23,69.8113
2018-02-26,70.3557
2018-02-27,69.1211
2018-02-28,68.4405
2018-03-01,68.6447
2018-03-02,70.3363
2018-03-05,70.3557
2018-03-06,70.1224
2018-03-07,69.8502
2018-03-08,69.9863
2018-03-09,70.3557
2018-03-12,72.0084
2018-03-13,72.2612
2018-03-14,71.2015
2018-03-15,70.6279
2018-03-16,72.1834
2018-03-19,70.0738
2018-03-20,71.1723
2018-03-21,72.2806
2018-03-22,71.0848
2018-03-23,69.8405
2018-03-26,71.8237
2018-03-27,70.2974
2018-03-28,71.0168
2018-03-29,71.6584
2018-04-02,70.1613
2018-04-03,72.0473
2018-04-04,72.7958
2018-04-05,72.9611
2018-04-06,71.0654
2018-04-09,71.7945
2018-04-10,73.0583
2018-04-11,73.0097
2018-04-12,73.0972
2018-04-13,69.0238
2018-04-16,69.2474
2018-04-17,69.2183
2018-04-18,69.6946
2018-04-19,69.0627
2018-04-20,69.1502
2018-04-23,69.1113
2018-04-24,69.4516
2018-04-25,69.646
2018-04-26,70.2099
2018-04-27,68.8586
2018-04-30,69.1697
2018-05-01,70.871
2018-05-02,71.3959
2018-05-03,71.8431
2018-05-04,73.4472
2018-05-07,74.0791
2018-05-08,72.8931
2018-05-09,74.3221
2018-05-10,74.8277
2018-05-11,75.1388
2018-05-14,75.411
2018-05-15,75.6248
2018-05-16,76.8206
2018-05-17,77.0928
2018-05-18,77.0831
2018-05-21,78.6094
2018-05-22,78.5413
2018-05-23,79.3288
2018-05-24,79.0505
2018-05-25,78.2009
2018-05-29,79.402
2018-05-30,80.4274
2018-05-31,79.9684
2018-06-01,81.2184
2018-06-04,81.6969
2018-06-05,81.1403
2018-06-06,80.7985
2018-06-07,79.7438
2018-06-08,80.2419
2018-06-11,79.2751
2018-06-12,80.1344
2018-06-13,80.0563
2018-06-14,81.57
2018-06-15,80.9059
2018-06-18,80.486
2018-06-19,79.8317
2018-06-20,80.8766
2018-06-21,79.7243
2018-06-22,79.2458
2018-06-25,77.4587
2018-06-26,78.1325
2018-06-27,77.0779
2018-06-28,76.8338
2018-06-29,76.3553
2018-07-02,76.2088
2018-07-03,76.1892
2018-07-05,76.9021
2018-07-06,77.0095
2018-07-09,77.1462
2018-07-10,76.8631
2018-07-11,75.8768
2018-07-12,75.4568
2018-07-13,75.4666
2018-07-16,74.0018
2018-07-17,74.3924
2018-07-18,72.9764
2018-07-19,72.9081
2018-07-20,72.8886
2018-07-23,72.9276
2018-07-24,70.2714
2018-07-25,70.8964
2018-07-26,71.8339
2018-07-27,70.8574
2018-07-30,70.8378
2018-07-31,71.1406
2018-08-01,71.3749
2018-08-02,74.1385
2018-08-03,82.566
2018-08-06,83.3863
2018-08-07,80.4958
2018-08-08,81.4918
2018-08-09,80.9743
2018-08-10,79.4704
2018-08-13,79.0798
2018-08-14,79.9587
2018-08-15,77.3513
2018-08-16,77.3416
2018-08-17,77.8786
2018-08-20,78.1423
2018-08-21,78.445
2018-08-22,79.4118
2018-08-23,77.6833
2018-08-24,77.5759
2018-08-27,78.9626
2018-08-28,78.6696
2018-08-29,78.406
2018-08-30,77.7438
2018-08-31,78.0872
2018-09-04,78.5678
2018-09-05,79.2251
2018-09-06,78.921
2018-09-07,77.9106
2018-09-10,78.7837
2018-09-11,79.7548
2018-09-12,81.2361
2018-09-13,80.9615
2018-09-14,82.0209
2018-09-17,82.0013
2018-09-18,82.9136
2018-09-19,81.6089
2018-09-20,82.2564
2018-09-21,82.8057
2018-09-24,83.8358
2018-09-25,80.265
2018-09-26,80.3336
2018-09-27,80.5789
2018-09-28,80.8536
2018-10-01,80.2159
2018-10-02,79.9118
2018-10-03,79.9805
2018-10-04,76.8903
2018-10-05,75.3894
2018-10-08,74.3496
2018-10-09,71.6126
2018-10-10,67.5415
2018-10-11,65.6972
2018-10-12,67.3551
2018-10-15,67.463
2018-10-16,69.1699
2018-10-17,70.2882
2018-10-18,69.474
2018-10-19,69.1209
2018-10-22,70.3962
2018-10-23,68.7873
2018-10-24,67.4532
2018-10-25,68.1202
2018-10-26,66.3741
2018-10-29,66.0994
2018-10-30,67.7867
2018-10-31,68.8854
2018-11-01,70.2981
2018-11-02,70.1313
2018-11-05,70.8572
2018-11-06,71.1908
2018-11-07,71.436
2018-11-08,61.6457
2018-11-09,63.7843
2018-11-12,63.7058
2018-11-13,64.8437
2018-11-14,65.3048
2018-11-15,66.7272
2018-11-16,66.4918
2018-11-19,64.2551
2018-11-20,64.1178
2018-11-21,64.8633
2018-11-23,64.5494
2018-11-26,64.2257
2018-11-27,64.0295
2018-11-28,64.4906
2018-11-29,64.7816
2018-11-30,65.0775
2018-12-03,66.9025
2018-12-04,63.9529
2018-12-06,62.927
2018-12-07,62.9171
2018-12-10,62.6902
2018-12-11,63.1144
2018-12-12,64.0713
2018-12-13,63.292
2018-12-14,62.927
2018-12-17,59.6125
2018-12-18,60.5003
2018-12-19,59.1685
2018-12-20,58.2117
2018-12-21,56.3768
2018-12-24,55.6764
2018-12-26,59.0304
2018-12-27,59.5533
2018-12-28,59.1192
2018-12-31,60.5003
2019-01-02,60.0169
2019-01-03,58.7838
2019-01-04,60.6483
2019-01-07,60.7765
2019-01-08,60.9738
2019-01-09,60.6384
2019-01-10,60.8357
2019-01-11,61.1415
2019-01-14,60.1452
2019-01-15,61.2204
2019-01-16,60.7962
2019-01-17,63.3709
2019-01-18,63.5879
2019-01-22,61.7926
2019-01-23,61.9011
2019-01-24,62.4634
2019-01-25,62.5225
2019-01-28,62.7593
2019-01-29,62.1477
2019-01-30,62.7692
2019-01-31,64.7618
2019-02-01,65.6497
2019-02-04,65.1466
2019-02-05,65.2748
2019-02-06,65.6497
2019-02-07,64.8704
2019-02-08,66.1528
2019-02-11,66.3994
2019-02-12,67.6226
2019-02-13,68.5598
2019-02-14,62.5916
2019-02-15,62.2365
2019-02-19,61.2105
2019-02-20,61.5657
2019-02-21,61.9307
2019-02-22,63.5879
2019-02-25,63.3993
2019-02-26,61.8612
2019-02-27,60.7796
2019-02-28,59.6484
2019-03-01,58.8049
2019-03-04,59.2812
2019-03-05,59.7178
2019-03-06,57.5347
2019-03-07,56.9393
2019-03-08,58.1301
2019-03-11,58.4973
2019-03-12,58.8049
2019-03-13,58.8347
2019-03-14,58.5469
2019-03-15,59.2316
2019-03-18,56.2546
2019-03-19,56.3935
2019-03-20,52.1861
2019-03-21,51.4716
2019-03-22,48.9015
2019-03-25,47.0757
2019-03-26,47.7405
2019-03-27,47.7405
2019-03-28,47.5321
2019-03-29,47.4924
2019-04-01,48.9015
2019-04-02,48.5741
2019-04-03,48.4848
2019-04-04,49.3381
2019-04-05,50.3503
2019-04-08,50.5785
2019-04-09,50.2015
2019-04-10,51.3823
2019-04-11,50.3702
2019-04-12,50.0328
2019-04-15,49.4969
2019-04-16,49.229
2019-04-17,49.6061
2019-04-18,49.3878
2019-04-22,48.0779
2019-04-23,48.1672
2019-04-24,49.4473
2019-04-25,49.5267
2019-04-26,50.0725
2019-04-29,50.3106
2019-04-30,50.4793
2019-05-01,63.826
2019-05-02,60.0155
2019-05-03,58.1202
2019-05-06,57.5149
2019-05-07,55.0539
2019-05-08,54.8058
2019-05-09,54.4784
2019-05-10,53.5754
2019-05-13,52.1861
2019-05-14,52.0174
2019-05-15,53.0494
2019-05-16,52.0968
2019-05-17,50.7175
2019-05-20,51.1343
2019-05-21,51.2335
2019-05-22,50.9854
2019-05-23,49.9732
2019-05-24,49.3977
2019-05-28,48.1672
2019-05-29,47.81
2019-05-30,48.2
2019-05-31,46.69
2019-06-03,48.09
2019-06-04,49.25
2019-06-05,48.88
2019-06-06,48.65
2019-06-07,49.06
2019-06-10,49.33
2019-06-11,50.55
2019-06-12,50.81
2019-06-13,51.235
2019-06-14,51.28
2019-06-17,49.835
2019-06-18,50.47
2019-06-19,48.74
2019-06-20,48.19
2019-06-21,48.965
2019-06-24,47.17
2019-06-25,48.06
2019-06-26,49.25
2019-06-27,48.1
2019-06-28,49.64
2019-07-01,48.44
2019-07-02,48.135
2019-07-03,47.1
2019-07-04,47.1
2019-07-05,47.22
2019-07-08,45.55
2019-07-09,45.07
2019-07-10,45.8
2019-07-11,44.53
2019-07-12,45.08
2019-07-15,44.24
2019-07-16,45.52
2019-07-17,38.98
2019-07-18,39.375
2019-07-19,41.07
2019-07-22,39.99
2019-07-23,39.725
2019-07-24,39.87
2019-07-25,39.375
2019-07-26,40.87
2019-07-29,40.13
2019-07-30,40.54
2019-07-31,40.03
2019-08-01,39.035
2019-08-02,39.21
2019-08-05,38.24
2019-08-06,38.56
2019-08-07,40.405
2019-08-08,41.94
2019-08-09,40.82
2019-08-12,40.18
2019-08-13,40.12
2019-08-14,39.55
2019-08-15,39.24
2019-08-16,40.48
2019-08-19,40.45
2019-08-20,40.195
2019-08-21,40.365
2019-08-22,40.885
2019-08-23,39.955
2019-08-26,40.065
2019-08-27,39.82
2019-08-28,40.185
2019-08-29,39.97
2019-08-30,40.62
2019-09-02,40.67
2019-09-03,40.495
2019-09-04,40.95
2019-09-05,42.68
2019-09-06,42.915
2019-09-09,42.795
2019-09-10,43.54
2019-09-11,44.08
2019-09-12,44.375
2019-09-13,44.035
2019-09-16,44.555
2019-09-17,43.53
2019-09-18,43.13
2019-09-19,42.56
2019-09-20,42.76
2019-09-23,42.57
2019-09-24,42.745
2019-09-25,43.8
2019-09-26,42.755
2019-09-27,42.06
2019-09-30,42.505
2019-10-01,42.445
2019-10-02,40.425
2019-10-03,40.42
2019-10-04,41.505
2019-10-07,41.48
2019-10-08,40.31
2019-10-09,40.52
2019-10-10,41.09
2019-10-11,41.86
2019-10-14,42.16
2019-10-15,42.63
2019-10-16,42.5
2019-10-17,43.145
2019-10-18,42.98
2019-10-21,43.325
2019-10-22,44.44
2019-10-23,44.865
2019-10-24,44.535
2019-10-25,44.52
2019-10-28,44.83
2019-10-29,44.5
2019-10-30,46.255
2019-10-31,44.5
2019-11-01,45.11
2019-11-04,46.74
2019-11-05,46.25
2019-11-06,39.535
2019-11-07,40.555
2019-11-08,41.34
2019-11-11,39.8
2019-11-12,40.05
2019-11-13,39.53
2019-11-14,39.01
2019-11-15,39.215
2019-11-18,38.99
2019-11-19,38.85
2019-11-20,37.92
2019-11-21,37.71
2019-11-22,38.03
2019-11-25,38.55
