date,close
2017-04-13,20.7231
2017-04-17,21.3963
2017-04-18,21.3963
2017-04-19,21.4251
2017-04-20,21.3482
2017-04-21,21.3674
2017-04-24,21.5886
2017-04-25,21.829
2017-04-26,22.0694
2017-04-27,21.7617
2017-04-28,21.6175
2017-05-01,21.6367
2017-05-02,21.7328
2017-05-03,21.6848
2017-05-04,21.6848
2017-05-05,21.5405
2017-05-08,21.2713
2017-05-09,21.1463
2017-05-10,21.3867
2017-05-11,21.6175
2017-05-12,21.329
2017-05-15,21.0116
2017-05-16,21.2328
2017-05-17,20.8578
2017-05-18,20.7424
2017-05-19,20.7808
2017-05-22,21.0886
2017-05-23,21.2617
2017-05-24,21.579
2017-05-25,21.377
2017-05-26,21.4347
2017-05-30,21.4636
2017-05-31,21.0212
2017-06-01,21.4828
2017-06-02,21.6367
2017-06-05,21.6175
2017-06-06,21.5886
2017-06-07,21.454
2017-06-08,22.2329
2017-06-09,22.5502
2017-06-12,22.5791
2017-06-13,22.6079
2017-06-14,22.3964
2017-06-15,22.4252
2017-06-16,21.7521
2017-06-19,21.5501
2017-06-20,21.4155
2017-06-21,21.2905
2017-06-22,20.9635
2017-06-23,20.2039
2017-06-26,20.5212
2017-06-27,20.7616
2017-06-28,21.4155
2017-06-29,21.0405
2017-06-30,21.0405
2017-07-03,21.5213
2017-07-05,21.4732
2017-07-06,21.3963
2017-07-07,21.7713
2017-07-10,21.4732
2017-07-11,21.5405
2017-07-12,21.5213
2017-07-13,21.4251
2017-07-14,21.3963
2017-07-17,21.252
2017-07-18,21.1174
2017-07-19,21.1366
2017-07-20,21.4155
2017-07-21,21.3001
2017-07-24,21.7617
2017-07-25,21.9156
2017-07-26,21.5213
2017-07-27,21.8963
2017-07-28,21.7425
2017-07-31,21.9636
2017-08-01,22.0887
2017-08-02,21.9925
2017-08-03,21.9733
2017-08-04,22.0502
2017-08-07,21.5501
2017-08-08,21.5309
2017-08-09,20.9732
2017-08-10,20.0596
2017-08-11,19.8577
2017-08-14,20.5116
2017-08-15,20.8289
2017-08-16,20.6462
2017-08-17,20.877
2017-08-18,19.8577
2017-08-21,19.8
2017-08-22,19.9827
2017-08-23,20.1846
2017-08-24,20.175
2017-08-25,20.1269
2017-08-28,19.9058
2017-08-29,19.9923
2017-08-30,20.0981
2017-08-31,20.0404
2017-09-01,20.0308
2017-09-05,20.0885
2017-09-06,20.3385
2017-09-07,19.9538
2017-09-08,19.7423
2017-09-11,20.175
2017-09-12,21.0405
2017-09-13,21.454
2017-09-14,21.0789
2017-09-15,20.55
2017-09-18,21.1655
2017-09-19,21.3001
2017-09-20,21.4059
2017-09-21,21.3578
2017-09-22,21.3386
2017-09-25,21.0501
2017-09-26,21.2328
2017-09-27,21.7425
2017-09-28,21.9348
2017-09-29,22.0406
2017-10-02,21.9925
2017-10-03,22.0598
2017-10-04,21.5213
2017-10-05,21.6559
2017-10-06,21.7809
2017-10-09,21.6271
2017-10-10,21.954
2017-10-11,21.9733
2017-10-12,21.829
2017-10-13,21.7232
2017-10-16,21.8579
2017-10-17,21.7521
2017-10-18,21.7521
2017-10-19,21.9444
2017-10-20,21.8771
2017-10-23,21.704
2017-10-24,21.7425
2017-10-25,22.1656
2017-10-26,22.5887
2017-10-27,23.3003
2017-10-30,23.1849
2017-10-31,23.4253
2017-11-01,23.5792
2017-11-02,24.1273
2017-11-03,24.2716
2017-11-06,24.4831
2017-11-07,23.2426
2017-11-08,22.1175
2017-11-09,21.2905
2017-11-10,21.204
2017-11-13,21.5405
2017-11-14,21.5982
2017-11-15,21.5886
2017-11-16,21.6078
2017-11-17,21.829
2017-11-20,22.5599
2017-11-21,22.8772
2017-11-22,23.0214
2017-11-24,23.108
2017-11-27,22.8964
2017-11-28,23.4734
2017-11-29,23.9157
2017-11-30,23.4638
2017-12-01,24.0408
2017-12-04,24.3004
2017-12-05,23.8677
2017-12-06,23.7811
2017-12-07,24.3389
2017-12-08,24.31
2017-12-11,23.8869
2017-12-12,23.8581
2017-12-13,23.8388
2017-12-14,24.0311
2017-12-15,24.6658
2017-12-18,25.4928
2017-12-19,25.5698
2017-12-20,25.8294
2017-12-21,25.6852
2017-12-22,25.9256
2017-12-26,25.7332
2017-12-27,25.6563
2017-12-28,26.0987
2017-12-29,26.0794
2018-01-02,25.9736
2018-01-03,26.2237
2018-01-04,26.4545
2018-01-05,26.3968
2018-01-08,26.1467
2018-01-09,26.5795
2018-01-10,26.6468
2018-01-11,27.1661
2018-01-12,27.0891
2018-01-16,26.8103
2018-01-17,27.2141
2018-01-18,26.993
2018-01-19,27.6276
2018-01-22,27.3103
2018-01-23,27.2045
2018-01-24,27.1949
2018-01-25,27.3776
2018-01-26,27.2238
2018-01-29,27.2334
2018-01-30,27.0891
2018-01-31,26.9064
2018-02-01,27.0507
2018-02-02,25.5217
2018-02-05,25.5601
2018-02-06,25.7236
2018-02-07,25.9256
2018-02-08,24.3196
2018-02-09,25.3293
2018-02-12,26.0602
2018-02-13,26.3006
2018-02-14,26.916
2018-02-15,26.9257
2018-02-16,27.0122
2018-02-20,26.5699
2018-02-21,27.5892
2018-02-22,27.0795
2018-02-23,27.1084
2018-02-26,27.1372
2018-02-27,26.8006
2018-02-28,26.4867
2018-03-01,26.4674
2018-03-02,26.8924
2018-03-05,27.4044
2018-03-06,28.0612
2018-03-07,27.9936
2018-03-08,27.8777
2018-03-09,28.2061
2018-03-12,27.7811
2018-03-13,27.8873
2018-03-14,27.6459
2018-03-15,27.414
2018-03-16,27.5782
2018-03-19,27.3657
2018-03-20,26.8924
2018-03-21,27.0856
2018-03-22,26.4191
2018-03-23,25.8975
2018-03-26,26.6896
2018-03-27,25.7912
2018-03-28,26.1583
2018-03-29,26.3032
2018-04-02,25.598
2018-04-03,26.2066
2018-04-04,26.1776
2018-04-05,26.3032
2018-04-06,25.8202
2018-04-09,25.9844
2018-04-10,26.5157
2018-04-11,26.6123
2018-04-12,27.0953
2018-04-13,26.7861
2018-04-16,27.2208
2018-04-17,27.0276
2018-04-18,26.4481
2018-04-19,26.931
2018-04-20,27.2788
2018-04-23,27.6362
2018-04-24,27.9646
2018-04-25,27.8197
2018-04-26,28.351
2018-04-27,28.834
2018-04-30,28.2351
2018-05-01,28.863
2018-05-02,28.7277
2018-05-03,27.9743
2018-05-04,28.5732
2018-05-07,28.6022
2018-05-08,28.8726
2018-05-09,29.0948
2018-05-10,29.0368
2018-05-11,29.2011
2018-05-14,28.3027
2018-05-15,28.3703
2018-05-16,28.38
2018-05-17,28.322
2018-05-18,28.0709
2018-05-21,28.0612
2018-05-22,28.1482
2018-05-23,28.4476
2018-05-24,28.6891
2018-05-25,29.0175
2018-05-29,28.2061
2018-05-30,28.1482
2018-05-31,28.3373
2018-06-01,28.4732
2018-06-04,28.9582
2018-06-05,28.9388
2018-06-06,29.1716
2018-06-07,29.4433
2018-06-08,30.3067
2018-06-11,29.4433
2018-06-12,29.2396
2018-06-13,29.2396
2018-06-14,28.9776
2018-06-15,29.1037
2018-06-18,29.1522
2018-06-19,29.3075
2018-06-20,29.3754
2018-06-21,29.2008
2018-06-22,29.1522
2018-06-25,28.6187
2018-06-26,28.6769
2018-06-27,27.8038
2018-06-28,27.8232
2018-06-29,28.0075
2018-07-02,27.8911
2018-07-03,27.8135
2018-07-05,27.8717
2018-07-06,27.959
2018-07-09,28.706
2018-07-10,28.5605
2018-07-11,28.2985
2018-07-12,28.0657
2018-07-13,27.8135
2018-07-16,28.2015
2018-07-17,28.347
2018-07-18,28.7351
2018-07-19,28.6575
2018-07-20,28.6769
2018-07-23,27.862
2018-07-24,27.5709
2018-07-25,27.4739
2018-07-26,27.3478
2018-07-27,27.0568
2018-07-30,26.9404
2018-07-31,26.4165
2018-08-01,26.659
2018-08-02,27.1247
2018-08-03,26.8239
2018-08-06,26.5329
2018-08-07,26.8336
2018-08-08,27.2508
2018-08-09,27.3866
2018-08-10,27.1732
2018-08-13,27.0471
2018-08-14,27.2314
2018-08-15,26.6105
2018-08-16,27.212
2018-08-17,27.6097
2018-08-20,27.406
2018-08-21,27.8523
2018-08-22,27.9881
2018-08-23,27.8911
2018-08-24,27.5806
2018-08-27,27.5515
2018-08-28,27.3866
2018-08-29,27.0956
2018-08-30,27.2314
2018-08-31,27.5533
2018-09-04,27.7581
2018-09-05,27.3875
2018-09-06,27.4362
2018-09-07,27.4557
2018-09-10,27.1826
2018-09-11,27.0071
2018-09-12,26.3536
2018-09-13,26.3926
2018-09-14,26.6364
2018-09-17,26.3829
2018-09-18,26.1
2018-09-19,26.1683
2018-09-20,26.9876
2018-09-21,26.5584
2018-09-24,25.8854
2018-09-25,25.8659
2018-09-26,25.4563
2018-09-27,25.5051
2018-09-28,25.4758
2018-10-01,25.3588
2018-10-02,24.9881
2018-10-03,25.6221
2018-10-04,25.5928
2018-10-05,25.1149
2018-10-08,25.271
2018-10-09,24.8613
2018-10-10,24.2469
2018-10-11,23.808
2018-10-12,23.1252
2018-10-15,23.5349
2018-10-16,23.4276
2018-10-17,23.3983
2018-10-18,22.3157
2018-10-19,21.4184
2018-10-22,21.0673
2018-10-23,21.2331
2018-10-24,19.8969
2018-10-25,20.5308
2018-10-26,20.7454
2018-10-29,21.0283
2018-10-30,21.2428
2018-10-31,21.5159
2018-11-01,21.5159
2018-11-02,20.9307
2018-11-05,20.96
2018-11-06,21.5549
2018-11-07,21.1551
2018-11-08,21.4086
2018-11-09,21.5062
2018-11-12,21.1843
2018-11-13,20.6966
2018-11-14,20.3748
2018-11-15,20.7357
2018-11-16,20.6479
2018-11-19,20.2577
2018-11-20,20.1407
2018-11-21,19.8969
2018-11-23,19.8286
2018-11-26,20.326
2018-11-27,19.9456
2018-11-28,20.2577
2018-11-29,19.9749
2018-11-30,20.1518
2018-12-03,20.4269
2018-12-04,19.3461
2018-12-06,19.2478
2018-12-07,19.3068
2018-12-10,19.0906
2018-12-11,19.0022
2018-12-12,19.4149
2018-12-13,18.8352
2018-12-14,18.5109
2018-12-17,17.8821
2018-12-18,17.6659
2018-12-19,17.2042
2018-12-20,17.4891
2018-12-21,16.8996
2018-12-24,16.0055
2018-12-26,16.9389
2018-12-27,16.7031
2018-12-28,16.5753
2018-12-31,16.4869
2019-01-02,16.5557
2019-01-03,16.1234
2019-01-04,16.5557
2019-01-07,16.5655
2019-01-08,16.8603
2019-01-09,16.9978
2019-01-10,17.0666
2019-01-11,17.1157
2019-01-14,17.2631
2019-01-15,17.2828
2019-01-16,18.1081
2019-01-17,17.9116
2019-01-18,18.6092
2019-01-22,18.3341
2019-01-23,18.3635
2019-01-24,18.0983
2019-01-25,18.5207
2019-01-28,18.7959
2019-01-29,18.5699
2019-01-30,18.8155
2019-01-31,18.4225
2019-02-01,18.6288
2019-02-04,18.9236
2019-02-05,18.8941
2019-02-06,19.0808
2019-02-07,19.4149
2019-02-08,18.9334
2019-02-11,19.0906
2019-02-12,19.4345
2019-02-13,19.6605
2019-02-14,19.405
2019-02-15,19.9061
2019-02-19,19.8177
2019-02-20,19.7784
2019-02-21,19.6507
2019-02-22,19.7194
2019-02-25,19.8177
2019-02-26,19.4836
2019-02-27,19.6998
2019-02-28,19.8138
2019-03-01,19.9823
2019-03-04,19.8534
2019-03-05,19.9228
2019-03-06,19.4669
2019-03-07,19.0803
2019-03-08,19.1794
2019-03-11,19.4569
2019-03-12,19.5263
2019-03-13,19.7543
2019-03-14,19.5461
2019-03-15,19.5561
2019-03-18,20.0616
2019-03-19,20.0814
2019-03-20,19.229
2019-03-21,18.9019
2019-03-22,17.6133
2019-03-25,17.7224
2019-03-26,18.2081
2019-03-27,18.1288
2019-03-28,18.4558
2019-03-29,18.3865
2019-04-01,19.1299
2019-04-02,18.9713
2019-04-03,19.3281
2019-04-04,20.0219
2019-04-05,20.2301
2019-04-08,19.9922
2019-04-09,19.6651
2019-04-10,19.6453
2019-04-11,19.903
2019-04-12,20.4779
2019-04-15,20.0616
2019-04-16,20.5373
2019-04-17,20.795
2019-04-18,20.2994
2019-04-22,20.0616
2019-04-23,20.805
2019-04-24,20.8644
2019-04-25,20.7752
2019-04-26,21.2113
2019-04-29,22.2521
2019-04-30,22.5494
2019-05-01,22.1926
2019-05-02,22.3314
2019-05-03,22.8567
2019-05-06,22.7179
2019-05-07,22.2719
2019-05-08,21.925
2019-05-09,21.7862
2019-05-10,21.816
2019-05-13,20.5572
2019-05-14,21.0924
2019-05-15,20.9239
2019-05-16,21.1122
2019-05-17,20.6166
2019-05-20,20.7058
2019-05-21,20.8644
2019-05-22,20.3887
2019-05-23,19.9525
2019-05-24,20.1508
2019-05-28,19.6354
2019-05-29,19.675
2019-05-30,19.33
2019-05-31,18.5
2019-06-03,18.91
2019-06-04,19.68
2019-06-05,19.76
2019-06-06,19.46
2019-06-07,19.39
2019-06-10,19.54
2019-06-11,19.65
2019-06-12,19.67
2019-06-13,19.855
2019-06-14,19.975
2019-06-17,19.97
2019-06-18,20.27
2019-06-19,20.44
2019-06-20,20.5
2019-06-21,20.665
2019-06-24,20.24
2019-06-25,19.99
2019-06-26,20.02
2019-06-27,20.43
2019-06-28,20.75
2019-07-01,20.745
2019-07-02,19.95
2019-07-03,19.905
2019-07-04,19.905
2019-07-05,20.335
2019-07-08,20.14
2019-07-09,20.085
2019-07-10,20.085
2019-07-11,20.115
2019-07-12,20.24
2019-07-15,19.595
2019-07-16,19.47
2019-07-17,18.98
2019-07-18,19.005
2019-07-19,19.625
2019-07-22,15.86
2019-07-23,16.185
2019-07-24,16.635
2019-07-25,16.575
2019-07-26,17
2019-07-29,16.975
2019-07-30,17.19
2019-07-31,17.12
2019-08-01,15.995
2019-08-02,16.075
2019-08-05,15.415
2019-08-06,15.525
2019-08-07,15.265
2019-08-08,15.775
2019-08-09,15.525
2019-08-12,15.275
2019-08-13,15.455
2019-08-14,15.09
2019-08-15,14.975
2019-08-16,15.44
2019-08-19,15.665
2019-08-20,15.58
2019-08-21,15.755
2019-08-22,15.72
2019-08-23,15.03
2019-08-26,15.285
2019-08-27,14.82
2019-08-28,15.15
2019-08-29,15.355
2019-08-30,15.375
2019-09-02,15.365
2019-09-03,14.87
2019-09-04,15.085
2019-09-05,15.755
2019-09-06,15.645
2019-09-09,17.07
2019-09-10,17.275
2019-09-11,17.655
2019-09-12,17.805
2019-09-13,17.915
2019-09-16,18.27
2019-09-17,17.64
2019-09-18,17.955
2019-09-19,17.7
2019-09-20,17.755
2019-09-23,17.755
2019-09-24,17.39
2019-09-25,17.945
2019-09-26,17.555
2019-09-27,17.675
2019-09-30,17.535
2019-10-01,17.155
2019-10-02,17.145
2019-10-03,16.9
2019-10-04,17.07
2019-10-07,16.89
2019-10-08,16.16
2019-10-09,16.165
2019-10-10,16.32
2019-10-11,16.735
2019-10-14,17.02
2019-10-15,17.54
2019-10-16,17.465
2019-10-17,17.555
2019-10-18,17.745
2019-10-21,17.685
2019-10-22,17.955
2019-10-23,15.76
2019-10-24,15.32
2019-10-25,15.75
2019-10-28,15.685
2019-10-29,15.525
2019-10-30,15.705
2019-10-31,15.365
2019-11-01,15.53
2019-11-04,16.205
2019-11-05,16.495
2019-11-06,16.325
2019-11-07,16.605
2019-11-08,16.335
2019-11-11,16.405
2019-11-12,16.475
2019-11-13,16.385
2019-11-14,16.235
2019-11-15,16.48
2019-11-18,16.43
2019-11-19,16.275
2019-11-20,15.985
2019-11-21,16.245
2019-11-22,16.405
2019-11-25,16.515
