date,close
2014-06-13,19.4
2014-06-16,19.37
2014-06-17,19.43
2014-06-18,19.5
2014-06-19,19.4
2014-06-20,19.52
2014-06-23,19.66
2014-06-24,19.73
2014-06-25,19.76
2014-06-26,19.83
2014-06-27,19.93
2014-06-30,20.01
2014-07-01,20.4
2014-07-02,20.28
2014-07-03,20.28
2014-07-07,20.1
2014-07-08,19.99
2014-07-09,19.83
2014-07-10,19.51
2014-07-11,19.22
2014-07-14,19.06
2014-07-15,19.22
2014-07-16,19.14
2014-07-17,18.9
2014-07-18,18.78
2014-07-21,18.66
2014-07-22,18.44
2014-07-23,19.23
2014-07-24,19.26
2014-07-25,19.14
2014-07-28,19.08
2014-07-29,19.07
2014-07-30,19.09
2014-07-31,18.96
2014-08-01,19.15
2014-08-04,19.1
2014-08-05,19.15
2014-08-06,19.09
2014-08-07,19
2014-08-08,19.01
2014-08-11,19.12
2014-08-12,19.1
2014-08-13,19.17
2014-08-14,19.1
2014-08-15,19.09
2014-08-18,19.08
2014-08-19,18.91
2014-08-20,18.55
2014-08-21,18.61
2014-08-22,18.77
2014-08-25,18.61
2014-08-26,19.06
2014-08-27,19
2014-08-28,18.59
2014-08-29,18.58
2014-09-02,18.81
2014-09-03,18.44
2014-09-04,18.13
2014-09-05,17.86
2014-09-08,18.31
2014-09-09,18.35
2014-09-10,18.6
2014-09-11,18.56
2014-09-12,18.65
2014-09-15,18.52
2014-09-16,18.38
2014-09-17,18.7
2014-09-18,18.9
2014-09-19,19
2014-09-22,18.68
2014-09-23,18.68
2014-09-24,18.45
2014-09-25,18.2
2014-09-26,18.17
2014-09-29,18.11
2014-09-30,17.96
2014-10-01,18.22
2014-10-02,18.39
2014-10-03,18.48
2014-10-06,18.295
2014-10-07,18.07
2014-10-08,18.56
2014-10-09,17.83
2014-10-10,17.6
2014-10-13,17.61
2014-10-14,17.4
2014-10-15,17.39
2014-10-16,17.8
2014-10-17,17.58
2014-10-20,17.52
2014-10-21,18.21
2014-10-22,18.25
2014-10-23,18.64
2014-10-24,18.3
2014-10-27,18.49
2014-10-28,18.87
2014-10-29,19.09
2014-10-30,18.89
2014-10-31,19.1
2014-11-03,19.16
2014-11-04,19.12
2014-11-05,18.98
2014-11-06,19.09
2014-11-07,19.03
2014-11-10,19.13
2014-11-11,18.87
2014-11-12,19.07
2014-11-13,18.85
2014-11-14,18.6
2014-11-17,18.3
2014-11-18,18.51
2014-11-19,18.19
2014-11-20,18.07
2014-11-21,18.06
2014-11-24,18.27
2014-11-25,18.35
2014-11-26,18.3
2014-11-28,18
2014-12-01,17.5
2014-12-02,18.37
2014-12-03,18.58
2014-12-04,18.78
2014-12-05,19.15
2014-12-08,18.72
2014-12-09,18.71
2014-12-10,18.25
2014-12-11,18.35
2014-12-12,18.17
2014-12-15,18.36
2014-12-16,18.49
2014-12-17,19
2014-12-18,18.84
2014-12-19,18.84
2014-12-22,18.82
2014-12-23,19.05
2014-12-24,18.88
2014-12-26,18.98
2014-12-29,19.22
2014-12-30,20.05
2014-12-31,19.46
2015-01-02,18.99
2015-01-05,18.86
2015-01-06,18.09
2015-01-07,18.33
2015-01-08,18.25
2015-01-09,18.25
2015-01-12,18.05
2015-01-13,18.2
2015-01-14,17.96
2015-01-15,18.27
2015-01-16,19.02
2015-01-20,18.46
2015-01-21,18.28
2015-01-22,19.09
2015-01-23,19.09
2015-01-26,19.26
2015-01-27,19.19
2015-01-28,19.9
2015-01-29,19.95
2015-01-30,19.65
2015-02-02,20.65
2015-02-03,21.07
2015-02-04,21.01
2015-02-05,21.24
2015-02-06,21.69
2015-02-09,22.07
2015-02-10,22.28
2015-02-11,22.38
2015-02-12,22.43
2015-02-13,22.29
2015-02-17,22.4
2015-02-18,21.68
2015-02-19,22.12
2015-02-20,22.14
2015-02-23,22.28
2015-02-24,22.56
2015-02-25,22.64
2015-02-26,22.6
2015-02-27,22.14
2015-03-02,22.18
2015-03-03,22.82
2015-03-04,22.67
2015-03-05,22.73
2015-03-06,22.99
2015-03-09,23.46
2015-03-10,22.92
2015-03-11,23.24
2015-03-12,24.07
2015-03-13,24.05
2015-03-16,24
2015-03-17,24.07
2015-03-18,23.94
2015-03-19,23.82
2015-03-20,24.32
2015-03-23,24.48
2015-03-24,24.65
2015-03-25,24.49
2015-03-26,24.37
2015-03-27,24.18
2015-03-30,24.33
2015-03-31,24.36
2015-04-01,24.47
2015-04-02,24.73
2015-04-06,24.72
2015-04-07,24.34
2015-04-08,24.48
2015-04-09,24.21
2015-04-10,24.09
2015-04-13,24.05
2015-04-14,24.25
2015-04-15,25.11
2015-04-16,25.26
2015-04-17,24.5
2015-04-20,24.88
2015-04-21,25.4
2015-04-22,25.3
2015-04-23,24.9
2015-04-24,24.78
2015-04-27,24.91
2015-04-28,25.58
2015-04-29,25.71
2015-04-30,25.21
2015-05-01,25.07
2015-05-04,25.22
2015-05-05,25.08
2015-05-06,25.21
2015-05-07,24.92
2015-05-08,24.99
2015-05-11,25.14
2015-05-12,25
2015-05-13,25.01
2015-05-14,25.11
2015-05-15,24.9
2015-05-18,25.34
2015-05-19,25.62
2015-05-20,25.67
2015-05-21,25.54
2015-05-22,25.18
2015-05-26,24.93
2015-05-27,25.4
2015-05-28,25.11
2015-05-29,25.1
2015-06-01,25.04
2015-06-02,25.73
2015-06-03,26.03
2015-06-04,25.63
2015-06-05,26.19
2015-06-08,26.35
2015-06-09,26.69
2015-06-10,27.45
2015-06-11,27.02
2015-06-12,26.88
2015-06-15,26.54
2015-06-16,26.64
2015-06-17,26.08
2015-06-18,26.46
2015-06-19,26.86
2015-06-22,26.89
2015-06-23,27.35
2015-06-24,27.38
2015-06-25,27.36
2015-06-26,27.49
2015-06-29,26.76
2015-06-30,26.89
2015-07-01,27.54
2015-07-02,27.18
2015-07-06,26.99
2015-07-07,26.63
2015-07-08,26.7
2015-07-09,26.87
2015-07-10,27.56
2015-07-13,28.22
2015-07-14,28.66
2015-07-15,29
2015-07-16,28.85
2015-07-17,28.99
2015-07-20,29.02
2015-07-21,28.65
2015-07-22,28.87
2015-07-23,24.16
2015-07-24,23.42
2015-07-27,24.7
2015-07-28,25.01
2015-07-29,25.45
2015-07-30,25.39
2015-07-31,25.15
2015-08-03,25.24
2015-08-04,25.29
2015-08-05,25.22
2015-08-06,25.37
2015-08-07,24.95
2015-08-10,25.16
2015-08-11,25.14
2015-08-12,24.63
2015-08-13,24.57
2015-08-14,24.87
2015-08-17,24.81
2015-08-18,24.97
2015-08-19,24.61
2015-08-20,23.79
2015-08-21,23.58
2015-08-24,23.15
2015-08-25,22.51
2015-08-26,23.36
2015-08-27,23.92
2015-08-28,24
2015-08-31,24.51
2015-09-01,23.81
2015-09-02,24
2015-09-03,23.76
2015-09-04,23.99
2015-09-08,24.54
2015-09-09,24.7
2015-09-10,24.76
2015-09-11,25.08
2015-09-14,25.32
2015-09-15,25.98
2015-09-16,25.66
2015-09-17,25.01
2015-09-18,24.92
2015-09-21,24.95
2015-09-22,24.74
2015-09-23,24.58
2015-09-24,24.66
2015-09-25,24.9
2015-09-28,24.61
2015-09-29,25.01
2015-09-30,25.7
2015-10-01,25.27
2015-10-02,24.3
2015-10-05,24.93
2015-10-06,24.52
2015-10-07,24.57
2015-10-08,24.85
2015-10-09,24.58
2015-10-12,24.91
2015-10-13,25.45
2015-10-14,24.5
2015-10-15,25.04
2015-10-16,24.85
2015-10-19,25.35
2015-10-20,25.44
2015-10-21,25.92
2015-10-22,26.26
2015-10-23,27.27
2015-10-26,27.14
2015-10-27,26.93
2015-10-28,28.09
2015-10-29,27.77
2015-10-30,27.5
2015-11-02,28.46
2015-11-03,28.67
2015-11-04,29.24
2015-11-05,30.91
2015-11-06,30.49
2015-11-09,30.6
2015-11-10,30.39
2015-11-11,30.09
2015-11-12,30.1
2015-11-13,29.49
2015-11-16,29.72
2015-11-17,29.81
2015-11-18,29.92
2015-11-19,29.95
2015-11-20,29.96
2015-11-23,30.39
2015-11-24,30.63
2015-11-25,30.85
2015-11-27,31
2015-11-30,31
2015-12-01,30.3
2015-12-02,29.76
2015-12-03,29.1
2015-12-04,29.64
2015-12-07,28.53
2015-12-08,28.58
2015-12-09,27.75
2015-12-10,27.34
2015-12-11,26.55
2015-12-14,26.62
2015-12-15,26.96
2015-12-16,28.01
2015-12-17,28.46
2015-12-18,27.85
2015-12-21,27.87
2015-12-22,28.19
2015-12-23,28.19
2015-12-24,27.49
2015-12-28,27.74
2015-12-29,27.6
2015-12-30,27.98
2015-12-31,27.22
2016-01-04,26.5
2016-01-05,25.95
2016-01-06,25.87
2016-01-07,25.35
2016-01-08,24.76
2016-01-11,24.7
2016-01-12,24.53
2016-01-13,23.95
2016-01-14,24.18
2016-01-15,23.76
2016-01-19,23.32
2016-01-20,23.34
2016-01-21,24.83
2016-01-22,25.7
2016-01-25,24.02
2016-01-26,24.61
2016-01-27,24.21
2016-01-28,24.86
2016-01-29,25.1
2016-02-01,24.75
2016-02-02,23.26
2016-02-03,22.78
2016-02-04,22.4
2016-02-05,22.01
2016-02-08,22.63
2016-02-09,22.82
2016-02-10,22.78
2016-02-11,21.78
2016-02-12,22.59
2016-02-16,22.95
2016-02-17,22.81
2016-02-18,22.04
2016-02-19,22.71
2016-02-22,23.43
2016-02-23,22.68
2016-02-24,22.58
2016-02-25,22.85
2016-02-26,23.38
2016-02-29,22.65
2016-03-01,23.83
2016-03-02,24.38
2016-03-03,24.96
2016-03-04,24.79
2016-03-07,25.11
2016-03-08,24.55
2016-03-09,24.18
2016-03-10,24.06
2016-03-11,25.01
2016-03-14,24.55
2016-03-15,24.1
2016-03-16,23.6
2016-03-17,23.79
2016-03-18,24.32
2016-03-21,23.98
2016-03-22,23.98
2016-03-23,23.51
2016-03-24,23.84
2016-03-28,23.91
2016-03-29,23.84
2016-03-30,23.83
2016-03-31,23.63
2016-04-01,24.15
2016-04-04,23.86
2016-04-05,23.5
2016-04-06,23.47
2016-04-07,22.34
2016-04-08,22.64
2016-04-11,22.95
2016-04-12,22.91
2016-04-13,24.2
2016-04-14,25.06
2016-04-15,24.68
2016-04-18,25.68
2016-04-19,25.65
2016-04-20,25.85
2016-04-21,25.88
2016-04-22,25.72
2016-04-25,25.39
2016-04-26,25.74
2016-04-27,26.25
2016-04-28,25.76
2016-04-29,25.98
2016-05-02,25.96
2016-05-03,25.16
2016-05-04,24.97
2016-05-05,24.49
2016-05-06,24.71
2016-05-09,24.69
2016-05-10,26
2016-05-11,26.66
2016-05-12,26.8
2016-05-13,26.29
2016-05-16,25.97
2016-05-17,25.27
2016-05-18,25.82
2016-05-19,25.94
2016-05-20,26.18
2016-05-23,26.39
2016-05-24,26.86
2016-05-25,27.21
2016-05-26,26.54
2016-05-27,26.93
2016-05-31,26.89
2016-06-01,27.13
2016-06-02,27.27
2016-06-03,26.62
2016-06-06,26.83
2016-06-07,26.89
2016-06-08,26.95
2016-06-09,26.52
2016-06-10,25.79
2016-06-13,25.42
2016-06-14,25.19
2016-06-15,25.39
2016-06-16,25.22
2016-06-17,25.14
2016-06-20,25.4
2016-06-21,25.4
2016-06-22,25.28
2016-06-23,26.14
2016-06-24,24.78
2016-06-27,24.24
2016-06-28,24.14
2016-06-29,24.61
2016-06-30,25.13
2016-07-01,24.55
2016-07-05,23.99
2016-07-06,24.28
2016-07-07,24.43
2016-07-08,25.21
2016-07-11,25.57
2016-07-12,26.08
2016-07-13,26.28
2016-07-14,26.58
2016-07-15,26.76
2016-07-18,26.45
2016-07-19,26.78
2016-07-20,26.18
2016-07-21,25.99
2016-07-22,26.08
2016-07-25,25.74
2016-07-26,25.97
2016-07-27,25.88
2016-07-28,25.81
2016-07-29,25.74
2016-08-01,25.5
2016-08-02,25.21
2016-08-03,25.46
2016-08-04,25.6
2016-08-05,26.94
2016-08-08,26.62
2016-08-09,26.85
2016-08-10,26.69
2016-08-11,26.76
2016-08-12,26.29
2016-08-15,26.25
2016-08-16,26.15
2016-08-17,25.71
2016-08-18,25.7
2016-08-19,25.86
2016-08-22,25.7
2016-08-23,25.7
2016-08-24,25.82
2016-08-25,25.92
2016-08-26,25.91
2016-08-29,26.12
2016-08-30,26.64
2016-08-31,26.74
2016-09-01,26.56
2016-09-02,26.8
2016-09-06,26.51
2016-09-07,26.84
2016-09-08,26.56
2016-09-09,26.41
2016-09-12,26.12
2016-09-13,25.67
2016-09-14,25.37
2016-09-15,25.44
2016-09-16,25.4
2016-09-19,25.23
2016-09-20,25.24
2016-09-21,25.54
2016-09-22,25.81
2016-09-23,25.66
2016-09-26,24.8
2016-09-27,25.01
2016-09-28,25.22
2016-09-29,24.63
2016-09-30,25.16
2016-10-03,24.79
2016-10-04,24.77
2016-10-05,25.06
2016-10-06,25.02
2016-10-07,24.97
2016-10-10,25.41
2016-10-11,25.09
2016-10-12,25.19
2016-10-13,24.55
2016-10-14,24.63
2016-10-17,24.49
2016-10-18,25.03
2016-10-19,25.85
2016-10-20,25.94
2016-10-21,25.6
2016-10-24,25.87
2016-10-25,25.39
2016-10-26,25.15
2016-10-27,27.25
2016-10-28,27
2016-10-31,27.07
2016-11-01,26.68
2016-11-02,26.25
2016-11-03,26.05
2016-11-04,24.85
2016-11-07,25.45
2016-11-08,25.5
2016-11-09,25.97
2016-11-10,26.55
2016-11-11,27.56
2016-11-14,29.14
2016-11-15,29.56
2016-11-16,29.76
2016-11-17,29.55
2016-11-18,29.91
2016-11-21,30.17
2016-11-22,30.7
2016-11-23,30.96
2016-11-25,31.11
2016-11-28,30.72
2016-11-29,30.83
2016-11-30,30.5
2016-12-01,30.88
2016-12-02,30.79
2016-12-05,33.13
2016-12-06,33.58
2016-12-07,33.66
2016-12-08,35.1
2016-12-09,35.57
2016-12-12,34.8
2016-12-13,34.45
2016-12-14,34.24
2016-12-15,34.61
2016-12-16,34.58
2016-12-19,34.91
2016-12-20,36.43
2016-12-21,36.01
2016-12-22,36.27
2016-12-23,36.39
2016-12-27,36.68
2016-12-28,35.94
2016-12-29,35.27
2016-12-30,35.82
2017-01-03,35.65
2017-01-04,36.21
2017-01-05,35.78
2017-01-06,36.04
2017-01-09,35.98
2017-01-10,35.91
2017-01-11,36.15
2017-01-12,35.4
2017-01-13,35.49
2017-01-17,34.11
2017-01-18,34.62
2017-01-19,34.13
2017-01-20,34.34
2017-01-23,33.83
2017-01-24,34.48
2017-01-25,34.82
2017-01-26,34.6
2017-01-27,34.86
2017-01-30,34.34
2017-01-31,34.46
2017-02-01,34.63
2017-02-02,34
2017-02-03,34.28
2017-02-06,34.09
2017-02-07,34.36
2017-02-08,34.19
2017-02-09,34.62
2017-02-10,34.74
2017-02-13,34.93
2017-02-14,35.32
2017-02-15,35.39
2017-02-16,35.36
2017-02-17,34.99
2017-02-21,34.85
2017-02-22,34.87
2017-02-23,34.96
2017-02-24,34.95
2017-02-27,34.97
2017-02-28,34.33
2017-03-01,35.19
2017-03-02,34.36
2017-03-03,34.89
2017-03-06,34.32
2017-03-07,34.09
2017-03-08,33.77
2017-03-09,33.59
2017-03-10,33.31
2017-03-13,33.2
2017-03-14,32.82
2017-03-15,32.23
2017-03-16,32.7
2017-03-17,32.82
2017-03-20,32.27
2017-03-21,30.66
2017-03-22,30.23
2017-03-23,30.89
2017-03-24,30.62
2017-03-27,30.5
2017-03-28,30.93
2017-03-29,30.5
2017-03-30,31.63
2017-03-31,31.53
2017-04-03,30.89
2017-04-04,30.76
2017-04-05,30.13
2017-04-06,30.33
2017-04-07,30.11
2017-04-10,30.05
2017-04-11,30.53
2017-04-12,30.05
2017-04-13,29.43
2017-04-17,29.8
2017-04-18,29.69
2017-04-19,29.77
2017-04-20,29.67
2017-04-21,29.66
2017-04-24,30.34
2017-04-25,30.39
2017-04-26,30.7
2017-04-27,31.46
2017-04-28,30.93
2017-05-01,31.59
2017-05-02,31.21
2017-05-03,31.2
2017-05-04,31.3
2017-05-05,31.16
2017-05-08,31.17
2017-05-09,31.01
2017-05-10,30.68
2017-05-11,30.07
2017-05-12,29.81
2017-05-15,30.1
2017-05-16,29.89
2017-05-17,28.69
2017-05-18,28.83
2017-05-19,28.75
2017-05-22,28.6
2017-05-23,29.84
2017-05-24,29.75
2017-05-25,29.15
2017-05-26,29.02
2017-05-30,28.45
2017-05-31,27.95
2017-06-01,28.02
2017-06-02,28.22
2017-06-05,28.63
2017-06-06,28.48
2017-06-07,28.83
2017-06-08,29.41
2017-06-09,30.14
2017-06-12,30.19
2017-06-13,29.01
2017-06-14,29.58
2017-06-15,29.41
2017-06-16,28.57
2017-06-19,28.59
2017-06-20,27.99
2017-06-21,27.81
2017-06-22,27.37
2017-06-23,27.42
2017-06-26,27.6
2017-06-27,27.87
2017-06-28,28.11
2017-06-29,28.95
2017-06-30,28.28
2017-07-03,29.27
2017-07-05,28.62
2017-07-06,28.58
2017-07-07,29.12
2017-07-10,28.75
2017-07-11,28.7
2017-07-12,28.74
2017-07-13,28.71
2017-07-14,28.54
2017-07-17,28.34
2017-07-18,28.07
2017-07-19,27.95
2017-07-20,27.92
2017-07-21,27.79
2017-07-24,28.01
2017-07-25,28.49
2017-07-26,28.24
2017-07-27,28.68
2017-07-28,28.76
2017-07-31,29.85
2017-08-01,29.76
2017-08-02,29.59
2017-08-03,29.25
2017-08-04,29.67
2017-08-07,29.56
2017-08-08,29.27
2017-08-09,28.89
2017-08-10,28.32
2017-08-11,27.98
2017-08-14,28.74
2017-08-15,28.58
2017-08-16,28.57
2017-08-17,27.66
2017-08-18,27.82
2017-08-21,27.84
2017-08-22,28.05
2017-08-23,28.13
2017-08-24,28.37
2017-08-25,28.71
2017-08-28,28.27
2017-08-29,28.14
2017-08-30,28.5
2017-08-31,28.18
2017-09-01,28.36
2017-09-05,27.55
2017-09-06,27.39
2017-09-07,27.04
2017-09-08,27.41
2017-09-11,28.06
2017-09-12,28.69
2017-09-13,28.73
2017-09-14,28.5
2017-09-15,28.6
2017-09-18,29.49
2017-09-19,29.62
2017-09-20,30.04
2017-09-21,30.34
2017-09-22,30.61
2017-09-25,30.75
2017-09-26,30.85
2017-09-27,31.64
2017-09-28,32.45
2017-09-29,32.62
2017-10-02,33.01
2017-10-03,33.05
2017-10-04,32.57
2017-10-05,32.81
2017-10-06,32.56
2017-10-09,32.95
2017-10-10,33.06
2017-10-11,33.06
2017-10-12,33.05
2017-10-13,33.06
2017-10-16,33.08
2017-10-17,32.44
2017-10-18,32.7
2017-10-19,33.16
2017-10-20,32.4
2017-10-23,31.31
2017-10-24,30.99
2017-10-25,30.56
2017-10-26,28.65
2017-10-27,28.59
2017-10-30,27.8
2017-10-31,27.34
2017-11-01,26.89
2017-11-02,26.84
2017-11-03,26.61
2017-11-06,26.73
2017-11-07,26.16
2017-11-08,25.52
2017-11-09,25.19
2017-11-10,25.06
2017-11-13,25.91
2017-11-14,26.44
2017-11-15,26.51
2017-11-16,26.55
2017-11-17,26.76
2017-11-20,27.04
2017-11-21,26.83
2017-11-22,26.89
2017-11-24,26.64
2017-11-27,26.62
2017-11-28,26.75
2017-11-29,28.4
2017-11-30,27.1
2017-12-01,27.07
2017-12-04,27.21
2017-12-05,26.91
2017-12-06,26.76
2017-12-07,26.74
2017-12-08,26.92
2017-12-11,26.59
2017-12-12,26.95
2017-12-13,26.47
2017-12-14,25.82
2017-12-15,26.52
2017-12-18,26.94
2017-12-19,26.81
2017-12-20,26.65
2017-12-21,26.57
2017-12-22,26.57
2017-12-26,26.34
2017-12-27,26.08
2017-12-28,26.37
2017-12-29,25.99
2018-01-02,26.65
2018-01-03,27.95
2018-01-04,27.68
2018-01-05,27.42
2018-01-08,27.91
2018-01-09,27.92
2018-01-10,28.44
2018-01-11,29.74
2018-01-12,30
2018-01-16,29.76
2018-01-17,29.78
2018-01-18,29.58
2018-01-19,30.38
2018-01-22,30.46
2018-01-23,30.41
2018-01-24,30.19
2018-01-25,31.29
2018-01-26,31.11
2018-01-29,30.25
2018-01-30,30.22
2018-01-31,30.65
2018-02-01,30.93
2018-02-02,30.83
2018-02-05,29.36
2018-02-06,29.86
2018-02-07,30.03
2018-02-08,29.14
2018-02-09,29.4
2018-02-12,29.68
2018-02-13,29.67
2018-02-14,29.82
2018-02-15,30
2018-02-16,30.77
2018-02-20,30.03
2018-02-21,30.5
2018-02-22,30.06
2018-02-23,30.59
2018-02-26,30.79
2018-02-27,30.35
2018-02-28,29.34
2018-03-01,28.93
2018-03-02,29.94
2018-03-05,30.35
2018-03-06,30.8
2018-03-07,31.08
2018-03-08,30.77
2018-03-09,31.19
2018-03-12,31.73
2018-03-13,31.51
2018-03-14,31.57
2018-03-15,31.68
2018-03-16,31.95
2018-03-19,31.77
2018-03-20,31.44
2018-03-21,31.35
2018-03-22,30.21
2018-03-23,28.99
2018-03-26,29.92
2018-03-27,29.11
2018-03-28,29.24
2018-03-29,29.15
2018-04-02,28.75
2018-04-03,29.36
2018-04-04,29.39
2018-04-05,29.67
2018-04-06,28.86
2018-04-09,28.67
2018-04-10,29.23
2018-04-11,29.1
2018-04-12,29.66
2018-04-13,29.22
2018-04-16,29.45
2018-04-17,29.25
2018-04-18,29.09
2018-04-19,29.48
2018-04-20,29.76
2018-04-23,29.89
2018-04-24,29.99
2018-04-25,29.8
2018-04-26,29.39
2018-04-27,28.79
2018-04-30,28.82
2018-05-01,29.67
2018-05-02,29.12
2018-05-03,28.72
2018-05-04,29.16
2018-05-07,29.42
2018-05-08,29.82
2018-05-09,29.85
2018-05-10,29.94
2018-05-11,29.86
2018-05-14,29.39
2018-05-15,29.39
2018-05-16,29.31
2018-05-17,29.56
2018-05-18,29.08
2018-05-21,29.25
2018-05-22,29.8
2018-05-23,30.07
2018-05-24,30.34
2018-05-25,30.3
2018-05-29,29.72
2018-05-30,30.46
2018-05-31,30.31
2018-06-01,30.66
2018-06-04,31.22
2018-06-05,31.01
2018-06-06,31.82
2018-06-07,32.07
2018-06-08,31.55
2018-06-11,30.89
2018-06-12,30.51
2018-06-13,30.71
2018-06-14,30.25
2018-06-15,30.48
2018-06-18,30.23
2018-06-19,30.9
2018-06-20,31.63
2018-06-21,31.34
2018-06-22,31.1
2018-06-25,30.5
2018-06-26,30
2018-06-27,29.32
2018-06-28,28.96
2018-06-29,28.38
2018-07-02,28.99
2018-07-03,29.09
2018-07-05,29.24
2018-07-06,29.36
2018-07-09,29.8
2018-07-10,29.42
2018-07-11,29.41
2018-07-12,28.88
2018-07-13,28.59
2018-07-16,28.75
2018-07-17,28.85
2018-07-18,29.21
2018-07-19,28.83
2018-07-20,28.69
2018-07-23,28.88
2018-07-24,28.73
2018-07-25,27.82
2018-07-26,25.85
2018-07-27,25.81
2018-07-30,25.04
2018-07-31,25.47
2018-08-01,25.38
2018-08-02,25.83
2018-08-03,25.71
2018-08-06,25.95
2018-08-07,26.27
2018-08-08,26.52
2018-08-09,25.2
2018-08-10,24.98
2018-08-13,24.54
2018-08-14,24.94
2018-08-15,24.33
2018-08-16,24.76
2018-08-17,24.67
2018-08-20,24.67
2018-08-21,25.48
2018-08-22,25.55
2018-08-23,25.56
2018-08-24,24.91
2018-08-27,24.91
2018-08-28,24.66
2018-08-29,24.67
2018-08-30,24.54
2018-08-31,24.7
2018-09-04,24.75
2018-09-05,24.64
2018-09-06,24.55
2018-09-07,24.5
2018-09-10,24.42
2018-09-11,24.63
2018-09-12,24.13
2018-09-13,23.97
2018-09-14,24.17
2018-09-17,24.07
2018-09-18,23.97
2018-09-19,24.25
2018-09-20,24.81
2018-09-21,24.42
2018-09-24,24.04
2018-09-25,23.84
2018-09-26,23.54
2018-09-27,23.31
2018-09-28,23.53
2018-10-01,23.11
2018-10-02,23.32
2018-10-03,23.9
2018-10-04,23.62
2018-10-05,23.22
2018-10-08,23.8
2018-10-09,23.52
2018-10-10,23.28
2018-10-11,22.78
2018-10-12,21.81
2018-10-15,22.12
2018-10-16,21.52
2018-10-17,20.78
2018-10-18,20.01
2018-10-19,19.87
2018-10-22,19.15
2018-10-23,19.13
2018-10-24,18.6
2018-10-25,19.2
2018-10-26,21.08
2018-10-29,21.39
2018-10-30,21.03
2018-10-31,20.49
2018-11-01,20.73
2018-11-02,20.75
2018-11-05,21.03
2018-11-06,21.36
2018-11-07,21.56
2018-11-08,20.67
2018-11-09,20.27
2018-11-12,19.9
2018-11-13,19.65
2018-11-14,19.38
2018-11-15,19.59
2018-11-16,19.97
2018-11-19,19.95
2018-11-20,19.56
2018-11-21,19.8
2018-11-23,19.45
2018-11-26,19.6
2018-11-27,19.07
2018-11-28,19.48
2018-11-29,19.29
2018-11-30,19.51
2018-12-03,19.3
2018-12-04,18.02
2018-12-06,18.14
2018-12-07,18.08
2018-12-10,18.27
2018-12-11,18.08
2018-12-12,18.55
2018-12-13,17.95
2018-12-14,17.82
2018-12-17,18.13
2018-12-18,17.9
2018-12-19,17.69
2018-12-20,17.69
2018-12-21,17.11
2018-12-24,17.48
2018-12-26,18.39
2018-12-27,18.21
2018-12-28,18.29
2018-12-31,18.2
2019-01-02,19.01
2019-01-03,18.98
2019-01-04,19.58
2019-01-07,19.54
2019-01-08,19.5
2019-01-09,19.53
2019-01-10,19.1
2019-01-11,19.14
2019-01-14,19.67
2019-01-15,19.6
2019-01-16,20.33
2019-01-17,20.58
2019-01-18,20.97
2019-01-22,20.72
2019-01-23,20.68
2019-01-24,20.7
2019-01-25,20.03
2019-01-28,20.17
2019-01-29,20.25
2019-01-30,20.02
2019-01-31,19.67
2019-02-01,19.92
2019-02-04,20.22
2019-02-05,20.26
2019-02-06,20.17
2019-02-07,20.32
2019-02-08,19.94
2019-02-11,20.21
2019-02-12,20.48
2019-02-13,20.79
2019-02-14,20.85
2019-02-15,21.49
2019-02-19,21.76
2019-02-20,21.92
2019-02-21,21.83
2019-02-22,22.12
2019-02-25,21.7
2019-02-26,21.23
2019-02-27,21.3
2019-02-28,21.39
2019-03-01,21.58
2019-03-04,20.86
2019-03-05,20.6
2019-03-06,19.92
2019-03-07,19.28
2019-03-08,19.3
2019-03-11,19.25
2019-03-12,19.1
2019-03-13,19.25
2019-03-14,19.28
2019-03-15,19.11
2019-03-18,19.39
2019-03-19,19.02
2019-03-20,18.21
2019-03-21,18.14
2019-03-22,17.65
2019-03-25,17.81
2019-03-26,18.15
2019-03-27,18.25
2019-03-28,18.45
2019-03-29,18.31
2019-04-01,18.74
2019-04-02,18.78
2019-04-03,18.62
2019-04-04,19.1
2019-04-05,19.21
2019-04-08,19.58
2019-04-09,19.23
2019-04-10,19.58
2019-04-11,21.16
2019-04-12,21.91
2019-04-15,21.87
2019-04-16,22.88
2019-04-17,22.89
2019-04-18,22.3
2019-04-22,22
2019-04-23,22.27
2019-04-24,22.37
2019-04-25,21.62
2019-04-26,21.75
2019-04-29,22.36
2019-04-30,22.65
2019-05-01,22.2
2019-05-02,22.68
2019-05-03,23.01
2019-05-06,22.86
2019-05-07,22.32
2019-05-08,21.91
2019-05-09,21.74
2019-05-10,21.75
2019-05-13,20.89
2019-05-14,21.24
2019-05-15,20.7
2019-05-16,20.75
2019-05-17,20.67
2019-05-20,20.8
2019-05-21,21.03
2019-05-22,20.79
2019-05-23,20.44
2019-05-24,20.57
2019-05-28,20.36
2019-05-29,20.19
2019-05-30,19.81
2019-05-31,19.72
2019-06-03,19.47
2019-06-04,20.14
2019-06-05,19.94
2019-06-06,20.24
2019-06-07,20.3
2019-06-10,20.75
2019-06-11,20.8
2019-06-12,20.74
2019-06-13,20.715
2019-06-14,20.59
2019-06-17,19.95
2019-06-18,20.3
2019-06-19,20.52
2019-06-20,20.17
2019-06-21,20.24
2019-06-24,19.965
2019-06-25,19.94
2019-06-26,20.21
2019-06-27,20.58
2019-06-28,21.08
2019-07-01,20.815
2019-07-02,19.94
2019-07-03,20.285
2019-07-04,20.285
2019-07-05,20.77
2019-07-08,20.32
2019-07-09,20.17
2019-07-10,20.2
2019-07-11,20.26
2019-07-12,20.28
2019-07-15,20.01
2019-07-16,19.935
2019-07-17,19.66
2019-07-18,19.935
2019-07-19,19.755
2019-07-22,19.27
2019-07-23,20.035
2019-07-24,20.65
2019-07-25,19.595
2019-07-26,20.61
2019-07-29,20.31
2019-07-30,20.71
2019-07-31,20.645
2019-08-01,19.66
2019-08-02,19.385
2019-08-05,18.86
2019-08-06,19.305
2019-08-07,19.065
2019-08-08,19.555
2019-08-09,19.45
2019-08-12,19.33
2019-08-13,19.63
2019-08-14,18.95
2019-08-15,18.555
2019-08-16,18.915
2019-08-19,19.165
2019-08-20,18.87
2019-08-21,19.15
2019-08-22,19.04
2019-08-23,18.315
2019-08-26,18.565
2019-08-27,18.41
2019-08-28,18.52
2019-08-29,18.81
2019-08-30,18.92
2019-09-02,18.89
2019-09-03,18.4
2019-09-04,18.315
2019-09-05,18.925
2019-09-06,19.02
2019-09-09,20.125
2019-09-10,19.85
2019-09-11,20.55
2019-09-12,20.67
2019-09-13,21.485
2019-09-16,21.28
2019-09-17,21.015
2019-09-18,21.015
2019-09-19,20.76
2019-09-20,20.54
2019-09-23,20.805
2019-09-24,20.82
2019-09-25,21.37
2019-09-26,21.17
2019-09-27,21.04
2019-09-30,20.745
2019-10-01,20.02
2019-10-02,20.05
2019-10-03,19.56
2019-10-04,19.84
2019-10-07,20.095
2019-10-08,19.42
2019-10-09,19.485
2019-10-10,19.46
2019-10-11,20.1
2019-10-14,20.41
2019-10-15,20.81
2019-10-16,20.825
2019-10-17,20.94
2019-10-18,20.94
2019-10-21,21.545
2019-10-22,21.4
2019-10-23,21.615
2019-10-24,22.52
2019-10-25,22.74
2019-10-28,23.845
2019-10-29,24.045
2019-10-30,23.995
2019-10-31,23.475
2019-11-01,23.99
2019-11-04,24.655
2019-11-05,25.395
2019-11-06,24.995
2019-11-07,25.225
2019-11-08,24.805
2019-11-11,24.805
2019-11-12,24.84
2019-11-13,24.215
2019-11-14,24.355
2019-11-15,24.21
2019-11-18,24.025
2019-11-19,24
2019-11-20,23.97
2019-11-21,23.9
2019-11-22,23.91
2019-11-25,24
