date,close
2014-06-13,32.86
2014-06-16,31.95
2014-06-17,32.22
2014-06-18,31.85
2014-06-19,32.18
2014-06-20,31.94
2014-06-23,30.94
2014-06-24,29.85
2014-06-25,29.64
2014-06-26,29.05
2014-06-27,29.92
2014-06-30,30.82
2014-07-01,30.83
2014-07-02,30.6
2014-07-03,31.16
2014-07-07,30.41
2014-07-08,30.7
2014-07-09,30.22
2014-07-10,29.63
2014-07-11,30.05
2014-07-14,30.21
2014-07-15,29.98
2014-07-16,29.85
2014-07-17,29.93
2014-07-18,30.07
2014-07-21,30.31
2014-07-22,30.64
2014-07-23,30.69
2014-07-24,28.35
2014-07-25,28.37
2014-07-28,28.12
2014-07-29,27.68
2014-07-30,27.3
2014-07-31,27.19
2014-08-01,27.15
2014-08-04,27.6
2014-08-05,27.39
2014-08-06,27.2
2014-08-07,26.49
2014-08-08,26.86
2014-08-11,28.07
2014-08-12,28.81
2014-08-13,27.98
2014-08-14,28.29
2014-08-15,28.7
2014-08-18,29.14
2014-08-19,29.14
2014-08-20,29.29
2014-08-21,29.3
2014-08-22,29.34
2014-08-25,29.65
2014-08-26,30.44
2014-08-27,30.63
2014-08-28,30.62
2014-08-29,30.5
2014-09-02,30.59
2014-09-03,30.5
2014-09-04,30.43
2014-09-05,30.68
2014-09-08,30.58
2014-09-09,30.58
2014-09-10,30.85
2014-09-11,31.09
2014-09-12,30.58
2014-09-15,29.81
2014-09-16,29.98
2014-09-17,31.04
2014-09-18,31.48
2014-09-19,31.35
2014-09-22,31.57
2014-09-23,31.25
2014-09-24,31.62
2014-09-25,31.01
2014-09-26,31.17
2014-09-29,31.07
2014-09-30,30.62
2014-10-01,29.57
2014-10-02,29.6
2014-10-03,29.87
2014-10-06,29.2
2014-10-07,27.82
2014-10-08,28.18
2014-10-09,26.56
2014-10-10,24.7
2014-10-13,23.27
2014-10-14,22.56
2014-10-15,23.51
2014-10-16,25.01
2014-10-17,26.15
2014-10-20,25.35
2014-10-21,27.28
2014-10-22,26.4
2014-10-23,26.8
2014-10-24,26.86
2014-10-27,25.93
2014-10-28,27.24
2014-10-29,26.68
2014-10-30,24.06
2014-10-31,28.64
2014-11-03,27.37
2014-11-04,27.07
2014-11-05,27.89
2014-11-06,28.84
2014-11-07,28.63
2014-11-10,24.93
2014-11-11,24.81
2014-11-12,24.38
2014-11-13,24.06
2014-11-14,25.13
2014-11-17,24.68
2014-11-18,25.21
2014-11-19,24.1
2014-11-20,24.66
2014-11-21,24.57
2014-11-24,24.7
2014-11-25,25.25
2014-11-26,26.5
2014-11-28,24.1
2014-12-01,22.24
2014-12-02,23.18
2014-12-03,23.6
2014-12-04,23.5
2014-12-05,24.28
2014-12-08,23.6
2014-12-09,24.12
2014-12-10,22.59
2014-12-11,20.14
2014-12-12,19.18
2014-12-15,18.68
2014-12-16,18.87
2014-12-17,20.71
2014-12-18,21.36
2014-12-19,21.22
2014-12-22,21.44
2014-12-23,21.81
2014-12-24,21.95
2014-12-26,22.17
2014-12-29,22.44
2014-12-30,22.72
2014-12-31,22.61
2015-01-02,21.7
2015-01-05,21.27
2015-01-06,20.7
2015-01-07,20.65
2015-01-08,20.92
2015-01-09,20.65
2015-01-12,19.83
2015-01-13,19.49
2015-01-14,19.12
2015-01-15,18.86
2015-01-16,18.49
2015-01-20,18.34
2015-01-21,18.77
2015-01-22,18.65
2015-01-23,19.05
2015-01-26,19.64
2015-01-27,19.54
2015-01-28,18.64
2015-01-29,18.67
2015-01-30,18.52
2015-02-02,19.52
2015-02-03,20.2
2015-02-04,19.61
2015-02-05,20.22
2015-02-06,20.87
2015-02-09,20.71
2015-02-10,20.3
2015-02-11,20.02
2015-02-12,20.22
2015-02-13,20.75
2015-02-17,20.64
2015-02-18,20.74
2015-02-19,20.57
2015-02-20,20.64
2015-02-23,20.24
2015-02-24,20.29
2015-02-25,20.73
2015-02-26,20.53
2015-02-27,22.07
2015-03-02,21.97
2015-03-03,21.34
2015-03-04,20.98
2015-03-05,21.43
2015-03-06,20.06
2015-03-09,20.49
2015-03-10,19.86
2015-03-11,20.21
2015-03-12,20.25
2015-03-13,19.74
2015-03-16,19.6
2015-03-17,19.7
2015-03-18,17.82
2015-03-19,18.27
2015-03-20,19.03
2015-03-23,19.85
2015-03-24,20.1
2015-03-25,19.86
2015-03-26,19.71
2015-03-27,19.4
2015-03-30,20.3
2015-03-31,19.3
2015-04-01,18.73
2015-04-02,19.49
2015-04-06,19.89
2015-04-07,19.88
2015-04-08,19.32
2015-04-09,19.17
2015-04-10,18.81
2015-04-13,18.9
2015-04-14,18.91
2015-04-15,20.13
2015-04-16,19.44
2015-04-17,18.82
2015-04-20,18.39
2015-04-21,18.2
2015-04-22,17.89
2015-04-23,17.75
2015-04-24,17.88
2015-04-27,18.14
2015-04-28,18.48
2015-04-29,18.56
2015-04-30,17.94
2015-05-01,18.08
2015-05-04,18.18
2015-05-05,18.09
2015-05-06,18.16
2015-05-07,18.07
2015-05-08,18.52
2015-05-11,18.45
2015-05-12,16.19
2015-05-13,16.96
2015-05-14,17.11
2015-05-15,16.84
2015-05-18,17.27
2015-05-19,17
2015-05-20,17.94
2015-05-21,18.09
2015-05-22,17.69
2015-05-26,17.42
2015-05-27,17.55
2015-05-28,17.73
2015-05-29,17.66
2015-06-01,17.85
2015-06-02,18.17
2015-06-03,19.11
2015-06-04,18.69
2015-06-05,19.18
2015-06-08,18.9
2015-06-09,18.5
2015-06-10,18.87
2015-06-11,18.91
2015-06-12,19.29
2015-06-15,19.16
2015-06-16,19.2
2015-06-17,19.25
2015-06-18,19.91
2015-06-19,20.7
2015-06-22,21.49
2015-06-23,21.17
2015-06-24,20.67
2015-06-25,20.51
2015-06-26,20.58
2015-06-29,19.97
2015-06-30,19.87
2015-07-01,19.91
2015-07-02,19.5
2015-07-06,19.39
2015-07-07,19.74
2015-07-08,19.01
2015-07-09,19.02
2015-07-10,19.29
2015-07-13,19.39
2015-07-14,19.72
2015-07-15,18.47
2015-07-16,18.59
2015-07-17,18.48
2015-07-20,17.76
2015-07-21,18.16
2015-07-22,17.94
2015-07-23,17.66
2015-07-24,17.19
2015-07-27,17.36
2015-07-28,17.32
2015-07-29,17.92
2015-07-30,17.87
2015-07-31,18.43
2015-08-03,17.62
2015-08-04,17.86
2015-08-05,17.14
2015-08-06,16.39
2015-08-07,16.5
2015-08-10,17.49
2015-08-11,17.74
2015-08-12,18.12
2015-08-13,17.93
2015-08-14,17.41
2015-08-17,17.29
2015-08-18,16.24
2015-08-19,16.37
2015-08-20,15.51
2015-08-21,15.41
2015-08-24,14.9
2015-08-25,14.67
2015-08-26,14.72
2015-08-27,15.51
2015-08-28,15.87
2015-08-31,16.56
2015-09-01,15.69
2015-09-02,16.3
2015-09-03,16.53
2015-09-04,16.56
2015-09-08,17.63
2015-09-09,17.47
2015-09-10,17.63
2015-09-11,17.35
2015-09-14,17.74
2015-09-15,17.87
2015-09-16,18.21
2015-09-17,18.31
2015-09-18,17.76
2015-09-21,18.2
2015-09-22,17.39
2015-09-23,16.71
2015-09-24,17.23
2015-09-25,17.2
2015-09-28,16.19
2015-09-29,15.57
2015-09-30,15.83
2015-10-01,15.84
2015-10-02,16.22
2015-10-05,17.52
2015-10-06,17.74
2015-10-07,18.1
2015-10-08,18.53
2015-10-09,18.96
2015-10-12,18.77
2015-10-13,18.28
2015-10-14,17.61
2015-10-15,17.96
2015-10-16,16.16
2015-10-19,15.71
2015-10-20,16.4
2015-10-21,16.31
2015-10-22,16.39
2015-10-23,16.22
2015-10-26,16.22
2015-10-27,15.67
2015-10-28,16.47
2015-10-29,16.39
2015-10-30,16.77
2015-11-02,17.37
2015-11-03,17.23
2015-11-04,18.1
2015-11-05,18.69
2015-11-06,17.79
2015-11-09,17.36
2015-11-10,17.35
2015-11-11,17.23
2015-11-12,16.97
2015-11-13,16.81
2015-11-16,18
2015-11-17,17.71
2015-11-18,18.27
2015-11-19,18.84
2015-11-20,18.94
2015-11-23,18.87
2015-11-24,19.44
2015-11-25,19.44
2015-11-27,19.47
2015-11-30,20.43
2015-12-01,20.72
2015-12-02,20.48
2015-12-03,20.3
2015-12-04,19.54
2015-12-07,18.79
2015-12-08,18.62
2015-12-09,18.61
2015-12-10,17.91
2015-12-11,17.22
2015-12-14,16.79
2015-12-15,17.26
2015-12-16,17.76
2015-12-17,17.41
2015-12-18,17.11
2015-12-21,16.79
2015-12-22,17.04
2015-12-23,17.93
2015-12-24,17.94
2015-12-28,17.51
2015-12-29,17.78
2015-12-30,17.68
2015-12-31,17.38
2016-01-04,17.57
2016-01-05,17.21
2016-01-06,16.66
2016-01-07,15.99
2016-01-08,15.76
2016-01-11,15.13
2016-01-12,15.01
2016-01-13,14.54
2016-01-14,14.74
2016-01-15,14.33
2016-01-19,13.74
2016-01-20,13.83
2016-01-21,13.72
2016-01-22,13.97
2016-01-25,13.76
2016-01-26,14.32
2016-01-27,14.44
2016-01-28,14.6
2016-01-29,15.44
2016-02-01,15.4
2016-02-02,14.85
2016-02-03,14.58
2016-02-04,15.1
2016-02-05,14.89
2016-02-08,13.37
2016-02-09,13.1
2016-02-10,12.92
2016-02-11,12.75
2016-02-12,13.26
2016-02-16,13.85
2016-02-17,14.75
2016-02-18,14.51
2016-02-19,14.39
2016-02-22,14.8
2016-02-23,14.26
2016-02-24,14.22
2016-02-25,14.52
2016-02-26,16.23
2016-02-29,16.98
2016-03-01,17.88
2016-03-02,17.91
2016-03-03,18.42
2016-03-04,18.5
2016-03-07,18.92
2016-03-08,18.3
2016-03-09,18.68
2016-03-10,18.55
2016-03-11,19.43
2016-03-14,19.11
2016-03-15,18.67
2016-03-16,19.09
2016-03-17,19.77
2016-03-18,19.87
2016-03-21,20.11
2016-03-22,20.76
2016-03-23,20.23
2016-03-24,20.28
2016-03-28,19.86
2016-03-29,20.17
2016-03-30,20.17
2016-03-31,20.24
2016-04-01,20.25
2016-04-04,19.58
2016-04-05,19.52
2016-04-06,19.86
2016-04-07,19.79
2016-04-08,20.55
2016-04-11,20.03
2016-04-12,21.06
2016-04-13,21.5
2016-04-14,21.1
2016-04-15,21.07
2016-04-18,21.39
2016-04-19,21.91
2016-04-20,22.18
2016-04-21,22.12
2016-04-22,22.47
2016-04-25,21.85
2016-04-26,22.34
2016-04-27,23.46
2016-04-28,23.06
2016-04-29,22.66
2016-05-02,22.45
2016-05-03,22.5
2016-05-04,22.17
2016-05-05,22.07
2016-05-06,22.33
2016-05-09,22.25
2016-05-10,22.5
2016-05-11,22.32
2016-05-12,21.81
2016-05-13,21.28
2016-05-16,22.24
2016-05-17,21.78
2016-05-18,21.55
2016-05-19,21.43
2016-05-20,22.29
2016-05-23,22.32
2016-05-24,22.77
2016-05-25,23.44
2016-05-26,22.9
2016-05-27,22.82
2016-05-31,23
2016-06-01,22.8
2016-06-02,22.79
2016-06-03,22.78
2016-06-06,23.56
2016-06-07,24.01
2016-06-08,23.95
2016-06-09,23.44
2016-06-10,22.42
2016-06-13,22.85
2016-06-14,23.13
2016-06-15,23.02
2016-06-16,22.79
2016-06-17,23.04
2016-06-20,23.58
2016-06-21,23.68
2016-06-22,23.35
2016-06-23,23.91
2016-06-24,22.17
2016-06-27,21.03
2016-06-28,21.17
2016-06-29,21.71
2016-06-30,22.32
2016-07-01,22.74
2016-07-05,22.78
2016-07-06,23.16
2016-07-07,23.9
2016-07-08,24.21
2016-07-11,24.26
2016-07-12,24.72
2016-07-13,24.47
2016-07-14,24.52
2016-07-15,24.53
2016-07-18,24.7
2016-07-19,24.48
2016-07-20,24.6
2016-07-21,24.27
2016-07-22,24.12
2016-07-25,24.16
2016-07-26,24.39
2016-07-27,24.6
2016-07-28,24.5
2016-07-29,24.45
2016-08-01,24.39
2016-08-02,24.41
2016-08-03,24.79
2016-08-04,24.37
2016-08-05,28.25
2016-08-08,29.38
2016-08-09,30.03
2016-08-10,29.95
2016-08-11,29.94
2016-08-12,29.74
2016-08-15,30.58
2016-08-16,30.47
2016-08-17,30.32
2016-08-18,30.76
2016-08-19,30.24
2016-08-22,30.53
2016-08-23,30.86
2016-08-24,30.92
2016-08-25,30.36
2016-08-26,30.04
2016-08-29,30.26
2016-08-30,30.11
2016-08-31,29.45
2016-09-01,29.43
2016-09-02,29.62
2016-09-06,29.73
2016-09-07,29.12
2016-09-08,29.31
2016-09-09,28.21
2016-09-12,27.74
2016-09-13,27.17
2016-09-14,27.13
2016-09-15,27.66
2016-09-16,27.71
2016-09-19,28.53
2016-09-20,27.53
2016-09-21,28.2
2016-09-22,28.68
2016-09-23,28.55
2016-09-26,28.55
2016-09-27,29.22
2016-09-28,29.72
2016-09-29,29.86
2016-09-30,29.74
2016-10-03,29.29
2016-10-04,29.06
2016-10-05,29.53
2016-10-06,30.17
2016-10-07,29.55
2016-10-10,29.7
2016-10-11,29.2
2016-10-12,29.5
2016-10-13,29.25
2016-10-14,29.15
2016-10-17,29.3
2016-10-18,29.7
2016-10-19,29.6
2016-10-20,29.2
2016-10-21,29.15
2016-10-24,29.7
2016-10-25,28.75
2016-10-26,28.45
2016-10-27,27.75
2016-10-28,28.2
2016-10-31,28.55
2016-11-01,27.95
2016-11-02,27.45
2016-11-03,28.3
2016-11-04,29.4
2016-11-07,28.95
2016-11-08,29
2016-11-09,31.9
2016-11-10,33.35
2016-11-11,34.75
2016-11-14,36.7
2016-11-15,37.9
2016-11-16,35.55
2016-11-17,35.75
2016-11-18,35.5
2016-11-21,35.75
2016-11-22,35.4
2016-11-23,37.05
2016-11-25,37.05
2016-11-28,36.35
2016-11-29,36.55
2016-11-30,37.95
2016-12-01,37.9
2016-12-02,37.4
2016-12-05,38.95
2016-12-06,39
2016-12-07,40.05
2016-12-08,39.9
2016-12-09,39.9
2016-12-12,39.1
2016-12-13,38.7
2016-12-14,38.15
2016-12-15,39.15
2016-12-16,38.35
2016-12-19,38.3
2016-12-20,39.35
2016-12-21,39
2016-12-22,39.2
2016-12-23,39
2016-12-27,39.4
2016-12-28,38.6
2016-12-29,38.4
2016-12-30,38.25
2017-01-03,36.3
2017-01-04,37.15
2017-01-05,35.95
2017-01-06,35.95
2017-01-09,34.5
2017-01-10,35.75
2017-01-11,36.05
2017-01-12,35.5
2017-01-13,36
2017-01-17,35.6
2017-01-18,35.3
2017-01-19,36.5
2017-01-20,37.2
2017-01-23,36.4
2017-01-24,40.25
2017-01-25,40.85
2017-01-26,41.55
2017-01-27,38.75
2017-01-30,38.4
2017-01-31,37.25
2017-02-01,36.6
2017-02-02,35.5
2017-02-03,38.9
2017-02-06,37.65
2017-02-07,37.95
2017-02-08,37.2
2017-02-09,38.25
2017-02-10,38.85
2017-02-13,38.45
2017-02-14,38.55
2017-02-15,39.2
2017-02-16,39.3
2017-02-17,37.8
2017-02-21,38.8
2017-02-22,37.5
2017-02-23,37.05
2017-02-24,40.1
2017-02-27,40.5
2017-02-28,39.25
2017-03-01,40.5
2017-03-02,39.8
2017-03-03,40.8
2017-03-06,40.35
2017-03-07,40.45
2017-03-08,39.5
2017-03-09,38.7
2017-03-10,39.8
2017-03-13,39.3
2017-03-14,39.1
2017-03-15,39.8
2017-03-16,39.1
2017-03-17,39.35
2017-03-20,38.85
2017-03-21,37.65
2017-03-22,38.25
2017-03-23,38.45
2017-03-24,38.05
2017-03-27,38.2
2017-03-28,39.1
2017-03-29,39.2
2017-03-30,39.35
2017-03-31,40.05
2017-04-03,38.6
2017-04-04,38.7
2017-04-05,39.2
2017-04-06,39.95
2017-04-07,40.25
2017-04-10,41.05
2017-04-11,41.25
2017-04-12,39.65
2017-04-13,41.45
2017-04-17,41.75
2017-04-18,42.35
2017-04-19,42.95
2017-04-20,43.65
2017-04-21,43.55
2017-04-24,44
2017-04-25,44.55
2017-04-26,45
2017-04-27,44.85
2017-04-28,44.15
2017-05-01,44.75
2017-05-02,44.65
2017-05-03,44
2017-05-04,43.45
2017-05-05,47.15
2017-05-08,45.65
2017-05-09,45.7
2017-05-10,44.9
2017-05-11,44.85
2017-05-12,43.6
2017-05-15,43.35
2017-05-16,42.9
2017-05-17,41.1
2017-05-18,41.15
2017-05-19,41.45
2017-05-22,41.8
2017-05-23,43.1
2017-05-24,41
2017-05-25,40.5
2017-05-26,41.3
2017-05-30,41.55
2017-05-31,42.4
2017-06-01,43.55
2017-06-02,44
2017-06-05,42.95
2017-06-06,42.95
2017-06-07,43.7
2017-06-08,45.15
2017-06-09,45.35
2017-06-12,45.1
2017-06-13,45.5
2017-06-14,44.9
2017-06-15,44.48
2017-06-16,44.65
2017-06-19,45.6
2017-06-20,44.45
2017-06-21,43.45
2017-06-22,43.8
2017-06-23,44.4
2017-06-26,45.1
2017-06-27,44.65
2017-06-28,45
2017-06-29,44.05
2017-06-30,45.15
2017-07-03,45.55
2017-07-05,45.3
2017-07-06,45.3
2017-07-07,45.9
2017-07-10,45.6
2017-07-11,45.5
2017-07-12,45.65
2017-07-13,45.9
2017-07-14,45.7
2017-07-17,46.15
2017-07-18,45.05
2017-07-19,46.15
2017-07-20,45.65
2017-07-21,45.3
2017-07-24,46.85
2017-07-25,46.35
2017-07-26,46.2
2017-07-27,46.5
2017-07-28,46.15
2017-07-31,46.2
2017-08-01,46.35
2017-08-02,45.6
2017-08-03,45.75
2017-08-04,42.85
2017-08-07,44.65
2017-08-08,43.15
2017-08-09,43.1
2017-08-10,41.1
2017-08-11,40.25
2017-08-14,40.55
2017-08-15,40
2017-08-16,38.75
2017-08-17,39.2
2017-08-18,39.65
2017-08-21,39.3
2017-08-22,39.45
2017-08-23,39.9
2017-08-24,40.35
2017-08-25,39.7
2017-08-28,39.75
2017-08-29,40.45
2017-08-30,40.05
2017-08-31,40.8
2017-09-01,41.95
2017-09-05,40.45
2017-09-06,39.7
2017-09-07,39.5
2017-09-08,40.15
2017-09-11,40.9
2017-09-12,43.15
2017-09-13,43.05
2017-09-14,46.9
2017-09-15,43.85
2017-09-18,44.6
2017-09-19,46.05
2017-09-20,45.45
2017-09-21,45.7
2017-09-22,45.9
2017-09-25,45.7
2017-09-26,46.5
2017-09-27,46.9
2017-09-28,46.7
2017-09-29,46.4
2017-10-02,46.7
2017-10-03,46.35
2017-10-04,46.05
2017-10-05,45.95
2017-10-06,45.95
2017-10-09,45.25
2017-10-10,44.5
2017-10-11,44.2
2017-10-12,43.5
2017-10-13,42.25
2017-10-16,43.8
2017-10-17,43.25
2017-10-18,43.35
2017-10-19,41.95
2017-10-20,42.9
2017-10-23,42.35
2017-10-24,42.15
2017-10-25,43.05
2017-10-26,44.05
2017-10-27,44.55
2017-10-30,43.95
2017-10-31,43.55
2017-11-01,42.8
2017-11-02,41.7
2017-11-03,42.85
2017-11-06,44.95
2017-11-07,43.65
2017-11-08,43.35
2017-11-09,43.1
2017-11-10,42.9
2017-11-13,42.45
2017-11-14,41.15
2017-11-15,39.93
2017-11-16,40.25
2017-11-17,40.6
2017-11-20,41.6
2017-11-21,42.3
2017-11-22,42.25
2017-11-24,42.2
2017-11-27,41.65
2017-11-28,42.7
2017-11-29,44.25
2017-11-30,44.85
2017-12-01,44.85
2017-12-04,45.75
2017-12-05,45
2017-12-06,46.5
2017-12-07,46
2017-12-08,47.45
2017-12-11,46.85
2017-12-12,46.6
2017-12-13,46.65
2017-12-14,45.35
2017-12-15,46.2
2017-12-18,47
2017-12-19,46.9
2017-12-20,48.9
2017-12-21,50.7
2017-12-22,50.25
2017-12-26,49.85
2017-12-27,49.8
2017-12-28,49.65
2017-12-29,48.95
2018-01-02,50.05
2018-01-03,49.85
2018-01-04,49.9
2018-01-05,49.7
2018-01-08,50.45
2018-01-09,49.95
2018-01-10,49.9
2018-01-11,51.6
2018-01-12,52.5
2018-01-16,51.15
2018-01-17,51.9
2018-01-18,52.05
2018-01-19,53.3
2018-01-22,53.85
2018-01-23,53.25
2018-01-24,52.8
2018-01-25,52.75
2018-01-26,53.25
2018-01-29,53.9
2018-01-30,53.65
2018-01-31,53.4
2018-02-01,54.75
2018-02-02,53.35
2018-02-05,50.9
2018-02-06,52.25
2018-02-07,52.1
2018-02-08,49.3
2018-02-09,49
2018-02-12,49.6
2018-02-13,48.75
2018-02-14,49.9
2018-02-15,50.6
2018-02-16,51
2018-02-20,50.25
2018-02-21,50.65
2018-02-22,52.65
2018-02-23,52.7
2018-02-26,52.75
2018-02-27,51.45
2018-02-28,50.95
2018-03-01,49.6
2018-03-02,49.25
2018-03-05,49.6
2018-03-06,49.75
2018-03-07,51.1
2018-03-08,51.15
2018-03-09,51.5
2018-03-12,51.8
2018-03-13,51.9
2018-03-14,50.85
2018-03-15,49.25
2018-03-16,49.9
2018-03-19,49.75
2018-03-20,48.3
2018-03-21,49.45
2018-03-22,47.05
2018-03-23,45.2
2018-03-26,46.5
2018-03-27,45.95
2018-03-28,45.5
2018-03-29,47.05
2018-04-02,47.05
2018-04-03,47.9
2018-04-04,47.3
2018-04-05,47.45
2018-04-06,46.55
2018-04-09,45.8
2018-04-10,46.1
2018-04-11,45.85
2018-04-12,45.95
2018-04-13,45.2
2018-04-16,46.15
2018-04-17,46.65
2018-04-18,46.6
2018-04-19,45.4
2018-04-20,44.55
2018-04-23,44.9
2018-04-24,45.25
2018-04-25,45.55
2018-04-26,45.55
2018-04-27,45
2018-04-30,44
2018-05-01,46.8
2018-05-02,46.1
2018-05-03,45.4
2018-05-04,45.55
2018-05-07,45.8
2018-05-08,47.65
2018-05-09,48.4
2018-05-10,48.65
2018-05-11,48.45
2018-05-14,48.95
2018-05-15,48.85
2018-05-16,50.45
2018-05-17,49.45
2018-05-18,49.35
2018-05-21,50.5
2018-05-22,48.6
2018-05-23,47.7
2018-05-24,47.6
2018-05-25,47.8
2018-05-29,47.75
2018-05-30,47.9
2018-05-31,46.65
2018-06-01,47.9
2018-06-04,49.15
2018-06-05,50.6
2018-06-06,51.1
2018-06-07,50.85
2018-06-08,50.3
2018-06-11,49.75
2018-06-12,49.15
2018-06-13,50.3
2018-06-14,50.8
2018-06-15,52.15
2018-06-18,53.5
2018-06-19,53.3
2018-06-20,54.5
2018-06-21,53.6
2018-06-22,52.1
2018-06-25,50.75
2018-06-26,51.15
2018-06-27,50.7
2018-06-28,50.1
2018-06-29,50.75
2018-07-02,51
2018-07-03,50.65
2018-07-05,51.7
2018-07-06,52.45
2018-07-09,53.15
2018-07-10,53.2
2018-07-11,51.95
2018-07-12,51.35
2018-07-13,51.95
2018-07-16,50.6
2018-07-17,50.8
2018-07-18,51.2
2018-07-19,52.15
2018-07-20,51.3
2018-07-23,51.25
2018-07-24,50.1
2018-07-25,48.85
2018-07-26,48.85
2018-07-27,47.8
2018-07-30,45.8
2018-07-31,46.55
2018-08-01,47.4
2018-08-02,47.35
2018-08-03,46.7
2018-08-06,46.45
2018-08-07,46.5
2018-08-08,45.7
2018-08-09,46.5
2018-08-10,46.95
2018-08-13,43.75
2018-08-14,45.45
2018-08-15,44.6
2018-08-16,42.1
2018-08-17,43.3
2018-08-20,44.35
2018-08-21,43.3
2018-08-22,42.85
2018-08-23,43.1
2018-08-24,42.05
2018-08-27,42.35
2018-08-28,42.5
2018-08-29,44.9
2018-08-30,44.2
2018-08-31,43.8
2018-09-04,43.1
2018-09-05,42.5
2018-09-06,40.95
2018-09-07,40.65
2018-09-10,42.8
2018-09-11,43.15
2018-09-12,44.65
2018-09-13,43
2018-09-14,42.85
2018-09-17,43.1
2018-09-18,42.8
2018-09-19,43.3
2018-09-20,45.7
2018-09-21,45.8
2018-09-24,45.4
2018-09-25,44.95
2018-09-26,43.9
2018-09-27,44.35
2018-09-28,44.65
2018-10-01,43.8
2018-10-02,44
2018-10-03,43.63
2018-10-04,41.63
2018-10-05,41.73
2018-10-08,42.36
2018-10-09,42.4
2018-10-10,41.48
2018-10-11,41.14
2018-10-12,41.41
2018-10-15,42.21
2018-10-16,43.15
2018-10-17,43.1
2018-10-18,43.05
2018-10-19,43.04
2018-10-22,43.5
2018-10-23,42.58
2018-10-24,40.13
2018-10-25,42.14
2018-10-26,41.23
2018-10-29,41.02
2018-10-30,43.06
2018-10-31,43.51
2018-11-01,45.1
2018-11-02,47.73
2018-11-05,48.78
2018-11-06,48.23
2018-11-07,48.96
2018-11-08,50.67
2018-11-09,49.74
2018-11-12,46.68
2018-11-13,45.63
2018-11-14,46
2018-11-15,46.45
2018-11-16,47.12
2018-11-19,44.75
2018-11-20,42.18
2018-11-21,43.29
2018-11-23,43.59
2018-11-26,45.3
2018-11-27,45.57
2018-11-28,45.31
2018-11-29,44.89
2018-11-30,45.09
2018-12-03,45.39
2018-12-04,42.73
2018-12-06,42.64
2018-12-07,40.86
2018-12-10,41.02
2018-12-11,40.25
2018-12-12,40.9
2018-12-13,40.67
2018-12-14,39.5
2018-12-17,38.33
2018-12-18,39.4
2018-12-19,39.28
2018-12-20,38.06
2018-12-21,37.73
2018-12-24,37.83
2018-12-26,40.58
2018-12-27,40.55
2018-12-28,40.15
2018-12-31,40.56
2019-01-02,40.88
2019-01-03,40.05
2019-01-04,42.69
2019-01-07,43.92
2019-01-08,44.3
2019-01-09,44.88
2019-01-10,45.78
2019-01-11,45.37
2019-01-14,44.96
2019-01-15,44.83
2019-01-16,45.24
2019-01-17,44.76
2019-01-18,46.54
2019-01-22,45.64
2019-01-23,43.22
2019-01-24,44.65
2019-01-25,45.21
2019-01-28,45.56
2019-01-29,44.29
2019-01-30,44.48
2019-01-31,44.38
2019-02-01,43.19
2019-02-04,42.39
2019-02-05,43.03
2019-02-06,42.66
2019-02-07,41.29
2019-02-08,41.4
2019-02-11,41.58
2019-02-12,42.84
2019-02-13,43.31
2019-02-14,43.14
2019-02-15,43.46
2019-02-19,43.73
2019-02-20,44.5
2019-02-21,44.37
2019-02-22,44.6
2019-02-25,45.35
2019-02-26,44.66
2019-02-27,42.87
2019-02-28,43.18
2019-03-01,46.89
2019-03-04,47.12
2019-03-05,47.61
2019-03-06,47.26
2019-03-07,46.65
2019-03-08,46.02
2019-03-11,46.76
2019-03-12,47.68
2019-03-13,47.71
2019-03-14,47.21
2019-03-15,47.65
2019-03-18,48.04
2019-03-19,47.47
2019-03-20,47
2019-03-21,47.77
2019-03-22,45.38
2019-03-25,45.72
2019-03-26,46.17
2019-03-27,46.14
2019-03-28,47.22
2019-03-29,48.1
2019-04-01,48.68
2019-04-02,49.01
2019-04-03,49.5
2019-04-04,49.8
2019-04-05,50.34
2019-04-08,50.71
2019-04-09,49.58
2019-04-10,50.44
2019-04-11,50.66
2019-04-12,51.51
2019-04-15,51.55
2019-04-16,52.27
2019-04-17,52.17
2019-04-18,51.87
2019-04-22,52.35
2019-04-23,52.53
2019-04-24,52.61
2019-04-25,51.18
2019-04-26,51.19
2019-04-29,51.37
2019-04-30,50.65
2019-05-01,50.89
2019-05-02,50.21
2019-05-03,49.9
2019-05-06,51.64
2019-05-07,51.24
2019-05-08,51.49
2019-05-09,51.06
2019-05-10,51.27
2019-05-13,47.7
2019-05-14,48.37
2019-05-15,47.87
2019-05-16,48.27
2019-05-17,46.32
2019-05-20,45.84
2019-05-21,47.8
2019-05-22,47.31
2019-05-23,45.75
2019-05-24,46.05
2019-05-28,46.35
2019-05-29,46.67
2019-05-30,47.54
2019-05-31,46.49
2019-06-03,47.11
2019-06-04,49.83
2019-06-05,49.56
2019-06-06,49.55
2019-06-07,49.65
2019-06-10,49.13
2019-06-11,49.3
2019-06-12,48.84
2019-06-13,48.57
2019-06-14,48.54
2019-06-17,47.755
2019-06-18,48.25
2019-06-19,48.33
2019-06-20,48.7
2019-06-21,48.12
2019-06-24,48.035
2019-06-25,47.85
2019-06-26,49.015
2019-06-27,49.03
2019-06-28,51.43
2019-07-01,52.02
2019-07-02,51.69
2019-07-03,52.14
2019-07-04,52.14
2019-07-05,52.045
2019-07-08,52.05
2019-07-09,51.29
2019-07-10,51.19
2019-07-11,50.81
2019-07-12,51.47
2019-07-15,51.17
2019-07-16,50.87
2019-07-17,50.37
2019-07-18,49.34
2019-07-19,49.86
2019-07-22,49.325
2019-07-23,50.65
2019-07-24,52.75
2019-07-25,51.77
2019-07-26,51.96
2019-07-29,52.125
2019-07-30,53.285
2019-07-31,51.26
2019-08-01,50.19
2019-08-02,57.96
2019-08-05,57.97
2019-08-06,60.08
2019-08-07,60.1
2019-08-08,60.2
2019-08-09,61.27
2019-08-12,60.135
2019-08-13,60.99
2019-08-14,59.005
2019-08-15,59.04
2019-08-16,60.37
2019-08-19,60.915
2019-08-20,61.04
2019-08-21,61.99
2019-08-22,61.29
2019-08-23,60.45
2019-08-26,60.52
2019-08-27,59.89
2019-08-28,61.53
2019-08-29,62.695
2019-08-30,62.785
2019-09-02,62.88
2019-09-03,61.96
2019-09-04,63.625
2019-09-05,63.55
2019-09-06,63.68
2019-09-09,64.27
2019-09-10,64.86
2019-09-11,63.98
2019-09-12,63.615
2019-09-13,64.21
2019-09-16,66.4
2019-09-17,65.37
2019-09-18,64.8
2019-09-19,64.61
2019-09-20,63.195
2019-09-23,63.7
2019-09-24,63.64
2019-09-25,65.15
2019-09-26,65.08
2019-09-27,64.35
2019-09-30,64.905
2019-10-01,63.67
2019-10-02,63.13
2019-10-03,62.995
2019-10-04,63.25
2019-10-07,64.5
2019-10-08,64.02
2019-10-09,64.3
2019-10-10,64.77
2019-10-11,65.69
2019-10-14,66.255
2019-10-15,66.69
2019-10-16,66.99
2019-10-17,67.51
2019-10-18,67.89
2019-10-21,67.9
2019-10-22,68.305
2019-10-23,67.695
2019-10-24,65.16
2019-10-25,65.085
2019-10-28,63.945
2019-10-29,65.71
2019-10-30,64.41
2019-10-31,62.97
2019-11-01,68.48
2019-11-04,71.41
2019-11-05,72.75
2019-11-06,71.735
2019-11-07,70.83
2019-11-08,70.735
2019-11-11,70.675
2019-11-12,70.34
2019-11-13,71.095
2019-11-14,70.93
2019-11-15,71.89
2019-11-18,72.335
2019-11-19,71.075
2019-11-20,66.59
2019-11-21,65.045
2019-11-22,64.635
2019-11-25,65.995
