date,close
2014-06-13,21.4993
2014-06-16,21.4748
2014-06-17,21.2621
2014-06-18,21.6219
2014-06-19,21.9
2014-06-20,21.5238
2014-06-23,21.6628
2014-06-24,21.8427
2014-06-25,21.9572
2014-06-26,21.8182
2014-06-27,21.81
2014-06-30,21.6301
2014-07-01,21.3684
2014-07-02,21.2621
2014-07-03,21.4993
2014-07-07,21.9736
2014-07-08,21.9245
2014-07-09,22.0063
2014-07-10,21.8755
2014-07-11,21.9981
2014-07-14,21.9163
2014-07-15,21.8427
2014-07-16,21.8346
2014-07-17,21.4257
2014-07-18,21.4257
2014-07-21,21.5156
2014-07-22,21.6547
2014-07-23,21.6383
2014-07-24,21.5565
2014-07-25,21.5484
2014-07-28,21.2131
2014-07-29,21.1885
2014-07-30,21.0495
2014-07-31,20.796
2014-08-01,20.8532
2014-08-04,21.0004
2014-08-05,20.8941
2014-08-06,20.9596
2014-08-07,20.8614
2014-08-08,20.8941
2014-08-11,21.164
2014-08-12,20.9023
2014-08-13,20.8369
2014-08-14,20.657
2014-08-15,20.4362
2014-08-18,20.4934
2014-08-19,20.0518
2014-08-20,20.0028
2014-08-21,20.0845
2014-08-22,19.7901
2014-08-25,19.5612
2014-08-26,19.2995
2014-08-27,19.2095
2014-08-28,19.1604
2014-08-29,19.5121
2014-09-02,19.4385
2014-09-03,19.5693
2014-09-04,19.4467
2014-09-05,19.6593
2014-09-08,19.5448
2014-09-09,19.3731
2014-09-10,19.5448
2014-09-11,19.3076
2014-09-12,19.0623
2014-09-15,18.7597
2014-09-16,18.8088
2014-09-17,18.4899
2014-09-18,18.7352
2014-09-19,18.3672
2014-09-22,18.1055
2014-09-23,17.8684
2014-09-24,18.22
2014-09-25,18.1628
2014-09-26,18.3181
2014-09-29,17.991
2014-09-30,18.0646
2014-10-01,17.942
2014-10-02,17.8029
2014-10-03,18.0401
2014-10-06,18.2936
2014-10-07,18.0892
2014-10-08,18.3672
2014-10-09,18.081
2014-10-10,17.8357
2014-10-13,17.9747
2014-10-14,17.9992
2014-10-15,17.7375
2014-10-16,17.4922
2014-10-17,17.2714
2014-10-20,17.713
2014-10-21,17.7539
2014-10-22,17.4431
2014-10-23,17.4022
2014-10-24,17.4431
2014-10-27,17.255
2014-10-28,17.3532
2014-10-29,17.3041
2014-10-30,18.4899
2014-10-31,17.3286
2014-11-03,17.4595
2014-11-04,17.4022
2014-11-05,17.3286
2014-11-06,17.8602
2014-11-07,18.2854
2014-11-10,18.22
2014-11-11,18.1791
2014-11-12,18.2445
2014-11-13,18.4899
2014-11-14,18.449
2014-11-17,18.3181
2014-11-18,18.2037
2014-11-19,18.3754
2014-11-20,18.4899
2014-11-21,18.7107
2014-11-24,18.7352
2014-11-25,18.3263
2014-11-26,18.1791
2014-11-28,17.8765
2014-12-01,17.206
2014-12-02,17.2877
2014-12-03,17.4595
2014-12-04,17.3368
2014-12-05,17.3205
2014-12-08,17.0997
2014-12-09,17.0506
2014-12-10,16.4863
2014-12-11,16.2328
2014-12-12,16.0447
2014-12-15,15.6931
2014-12-16,15.734
2014-12-17,16.0202
2014-12-18,16.2901
2014-12-19,16.1838
2014-12-22,16.4209
2014-12-23,16.4863
2014-12-24,16.3882
2014-12-26,16.2901
2014-12-29,16.38
2014-12-30,16.2574
2014-12-31,16.1265
2015-01-02,15.9221
2015-01-05,15.8566
2015-01-06,15.8321
2015-01-07,16.2328
2015-01-08,16.4454
2015-01-09,16.3964
2015-01-12,16.0529
2015-01-13,15.9793
2015-01-14,15.7258
2015-01-15,15.5704
2015-01-16,15.5541
2015-01-20,15.6031
2015-01-21,16.012
2015-01-22,16.5517
2015-01-23,16.47
2015-01-26,16.5845
2015-01-27,16.5272
2015-01-28,16.2819
2015-01-29,15.9221
2015-01-30,15.5704
2015-02-02,15.7013
2015-02-03,16.1102
2015-02-04,16.1347
2015-02-05,17.0261
2015-02-06,16.331
2015-02-09,16.4863
2015-02-10,16.1756
2015-02-11,15.9711
2015-02-12,16.3555
2015-02-13,16.4863
2015-02-17,16.519
2015-02-18,16.4373
2015-02-19,16.3964
2015-02-20,16.5599
2015-02-23,16.6417
2015-02-24,16.7807
2015-02-25,17.0015
2015-02-26,17.0097
2015-02-27,17.1733
2015-03-02,16.7398
2015-03-03,16.838
2015-03-04,16.9688
2015-03-05,17.1487
2015-03-06,17.1487
2015-03-09,17.1896
2015-03-10,16.4536
2015-03-11,16.8625
2015-03-12,16.8789
2015-03-13,16.331
2015-03-16,16.609
2015-03-17,16.7807
2015-03-18,17.4186
2015-03-19,16.9688
2015-03-20,17.4758
2015-03-23,17.1978
2015-03-24,17.1651
2015-03-25,17.7539
2015-03-26,17.4677
2015-03-27,17.3695
2015-03-30,17.6557
2015-03-31,17.7293
2015-04-01,18.4899
2015-04-02,17.942
2015-04-06,18.0646
2015-04-07,18.1791
2015-04-08,17.9338
2015-04-09,17.9583
2015-04-10,18.1546
2015-04-13,18.0728
2015-04-14,18.0565
2015-04-15,18.1301
2015-04-16,18.3917
2015-04-17,18.1055
2015-04-20,17.9829
2015-04-21,18.1129
2015-04-22,18.0959
2015-04-23,18.2067
2015-04-24,18.4711
2015-04-27,18.5905
2015-04-28,18.8548
2015-04-29,18.582
2015-04-30,18.599
2015-05-01,18.6246
2015-05-04,18.13
2015-05-05,18.3176
2015-05-06,18.3347
2015-05-07,18.3773
2015-05-08,18.6843
2015-05-11,18.7013
2015-05-12,18.8804
2015-05-13,18.9487
2015-05-14,18.9231
2015-05-15,19.1533
2015-05-18,18.8463
2015-05-19,18.7013
2015-05-20,18.8037
2015-05-21,18.889
2015-05-22,18.7866
2015-05-26,18.0788
2015-05-27,18.1641
2015-05-28,18.4626
2015-05-29,18.2238
2015-06-01,17.8742
2015-06-02,18.1129
2015-06-03,17.7718
2015-06-04,17.678
2015-06-05,17.3966
2015-06-08,17.4563
2015-06-09,17.4051
2015-06-10,17.5501
2015-06-11,17.8059
2015-06-12,17.6439
2015-06-15,17.1408
2015-06-16,17.4989
2015-06-17,17.2687
2015-06-18,17.5586
2015-06-19,17.2857
2015-06-22,17.3369
2015-06-23,17.5586
2015-06-24,17.3369
2015-06-25,17.2431
2015-06-26,17.2857
2015-06-29,17.0725
2015-06-30,17.2687
2015-07-01,17.0811
2015-07-02,17.0896
2015-07-06,16.8679
2015-07-07,16.7911
2015-07-08,16.9276
2015-07-09,17.0896
2015-07-10,17.4648
2015-07-13,17.7207
2015-07-14,17.9424
2015-07-15,17.8059
2015-07-16,17.8059
2015-07-17,17.6439
2015-07-20,17.7633
2015-07-21,17.6951
2015-07-22,17.7036
2015-07-23,17.4137
2015-07-24,17.209
2015-07-27,16.9532
2015-07-28,17.1834
2015-07-29,17.3369
2015-07-30,17.1919
2015-07-31,17.2175
2015-08-03,17.0555
2015-08-04,17.0043
2015-08-05,17.064
2015-08-06,17.371
2015-08-07,17.1749
2015-08-10,17.5927
2015-08-11,17.1919
2015-08-12,17.0725
2015-08-13,16.8594
2015-08-14,16.8423
2015-08-17,16.6035
2015-08-18,16.6291
2015-08-19,16.4074
2015-08-20,16.3989
2015-08-21,16.0407
2015-08-24,15.4096
2015-08-25,15.3755
2015-08-26,15.8275
2015-08-27,16.6035
2015-08-28,16.433
2015-08-31,16.3989
2015-09-01,15.9554
2015-09-02,16.2027
2015-09-03,16.0407
2015-09-04,15.7252
2015-09-08,16.0236
2015-09-09,15.8957
2015-09-10,16.1686
2015-09-11,16.126
2015-09-14,16.2112
2015-09-15,16.3306
2015-09-16,16.7059
2015-09-17,16.4841
2015-09-18,16.0151
2015-09-21,16.1516
2015-09-22,15.7934
2015-09-23,15.4779
2015-09-24,15.674
2015-09-25,15.6569
2015-09-28,15.2476
2015-09-29,15.3585
2015-09-30,15.5376
2015-10-01,15.4437
2015-10-02,15.9128
2015-10-05,16.4074
2015-10-06,16.7656
2015-10-07,17.1152
2015-10-08,17.2516
2015-10-09,17.064
2015-10-12,17.1067
2015-10-13,16.7656
2015-10-14,16.5609
2015-10-15,16.6376
2015-10-16,16.6547
2015-10-19,16.3989
2015-10-20,16.3562
2015-10-21,16.2283
2015-10-22,16.8082
2015-10-23,16.8594
2015-10-26,16.6632
2015-10-27,16.4671
2015-10-28,16.612
2015-10-29,16.4159
2015-10-30,16.1942
2015-11-02,16.3306
2015-11-03,16.433
2015-11-04,16.1004
2015-11-05,15.9895
2015-11-06,15.9298
2015-11-09,15.7422
2015-11-10,15.7422
2015-11-11,15.7166
2015-11-12,15.3158
2015-11-13,15.3329
2015-11-16,15.3158
2015-11-17,15.2561
2015-11-18,15.7763
2015-11-19,15.8275
2015-11-20,15.7849
2015-11-23,15.7763
2015-11-24,15.7507
2015-11-25,15.7166
2015-11-27,15.4011
2015-11-30,15.4182
2015-12-01,15.7763
2015-12-02,15.7934
2015-12-03,15.7678
2015-12-04,15.8531
2015-12-07,15.367
2015-12-08,14.898
2015-12-09,15.222
2015-12-10,15.2732
2015-12-11,14.9832
2015-12-14,14.8639
2015-12-15,14.9662
2015-12-16,15.3244
2015-12-17,15.1879
2015-12-18,14.898
2015-12-21,14.8212
2015-12-22,15.1453
2015-12-23,15.5034
2015-12-24,15.5546
2015-12-28,15.3755
2015-12-29,15.4949
2015-12-30,15.1282
2015-12-31,15.0429
2016-01-04,14.7871
2016-01-05,15.0259
2016-01-06,14.8127
2016-01-07,14.5228
2016-01-08,14.2754
2016-01-11,14.2584
2016-01-12,14.3096
2016-01-13,14.2669
2016-01-14,14.3437
2016-01-15,13.6273
2016-01-19,13.7211
2016-01-20,13.7382
2016-01-21,14.0623
2016-01-22,14.4972
2016-01-25,14.1049
2016-01-26,14.2925
2016-01-27,14.139
2016-01-28,14.4034
2016-01-29,14.7445
2016-02-01,14.8383
2016-02-02,14.1219
2016-02-03,14.301
2016-02-04,14.5483
2016-02-05,14.5569
2016-02-08,14.4204
2016-02-09,14.1902
2016-02-10,14.3096
2016-02-11,14.0452
2016-02-12,14.6592
2016-02-16,14.6763
2016-02-17,15.1623
2016-02-18,15.0856
2016-02-19,14.9065
2016-02-22,15.0941
2016-02-23,14.7615
2016-02-24,14.5824
2016-02-25,14.591
2016-02-26,14.7104
2016-02-29,14.6592
2016-03-01,15.1623
2016-03-02,15.5546
2016-03-03,15.8701
2016-03-04,15.7678
2016-03-07,15.8787
2016-03-08,15.6996
2016-03-09,15.8275
2016-03-10,15.8019
2016-03-11,16.0748
2016-03-14,15.9895
2016-03-15,15.8446
2016-03-16,16.0577
2016-03-17,16.5694
2016-03-18,16.8338
2016-03-21,16.7059
2016-03-22,16.74
2016-03-23,16.2368
2016-03-24,16.0663
2016-03-28,16.2368
2016-03-29,16.4415
2016-03-30,16.595
2016-03-31,16.5012
2016-04-01,16.7656
2016-04-04,16.5779
2016-04-05,16.3647
2016-04-06,16.4756
2016-04-07,16.2965
2016-04-08,16.5779
2016-04-11,16.7656
2016-04-12,17.0129
2016-04-13,17.1408
2016-04-14,17.0214
2016-04-15,17.2602
2016-04-18,16.8856
2016-04-19,17.4959
2016-04-20,17.4157
2016-04-21,17.175
2016-04-22,17.0592
2016-04-25,17.0592
2016-04-26,17.184
2016-04-27,17.2642
2016-04-28,17.2374
2016-04-29,17.2909
2016-05-02,16.9433
2016-05-03,16.6938
2016-05-04,16.667
2016-05-05,16.6759
2016-05-06,16.9077
2016-05-09,16.667
2016-05-10,16.7651
2016-05-11,16.7027
2016-05-12,16.5333
2016-05-13,16.4085
2016-05-16,16.4175
2016-05-17,16.5066
2016-05-18,16.462
2016-05-19,16.4798
2016-05-20,16.4175
2016-05-23,16.257
2016-05-24,16.3016
2016-05-25,16.3996
2016-05-26,16.3016
2016-05-27,16.1946
2016-05-31,16.0877
2016-06-01,16.1144
2016-06-02,16.3729
2016-06-03,16.4977
2016-06-06,16.5868
2016-06-07,16.774
2016-06-08,16.8007
2016-06-09,16.7472
2016-06-10,16.5244
2016-06-13,16.4442
2016-06-14,16.257
2016-06-15,16.5155
2016-06-16,16.5957
2016-06-17,16.7918
2016-06-20,16.8898
2016-06-21,16.8453
2016-06-22,16.9166
2016-06-23,17.175
2016-06-24,16.3462
2016-06-27,16.0342
2016-06-28,16.5868
2016-06-29,17.0324
2016-06-30,17.2642
2016-07-01,17.2553
2016-07-05,17.0948
2016-07-06,17.1037
2016-07-07,17.0948
2016-07-08,17.3711
2016-07-11,17.4781
2016-07-12,17.7009
2016-07-13,17.79
2016-07-14,18.0218
2016-07-15,18.1109
2016-07-18,18.2892
2016-07-19,18.2892
2016-07-20,18.4852
2016-07-21,18.3515
2016-07-22,18.4407
2016-07-25,18.307
2016-07-26,18.3694
2016-07-27,18.2
2016-07-28,18.0307
2016-07-29,18.3337
2016-08-01,18.3783
2016-08-02,18.3515
2016-08-03,18.6278
2016-08-04,18.6011
2016-08-05,18.9576
2016-08-08,19.1715
2016-08-09,19.0735
2016-08-10,19.2339
2016-08-11,19.5815
2016-08-12,19.6885
2016-08-15,20.0628
2016-08-16,19.8667
2016-08-17,19.733
2016-08-18,19.7152
2016-08-19,19.5904
2016-08-22,19.3409
2016-08-23,19.1983
2016-08-24,19.1983
2016-08-25,19.2072
2016-08-26,19.1002
2016-08-29,19.0378
2016-08-30,19.0467
2016-08-31,18.8685
2016-09-01,18.8774
2016-09-02,19.2606
2016-09-06,19.4211
2016-09-07,19.1715
2016-09-08,19.02
2016-09-09,18.5565
2016-09-12,18.5565
2016-09-13,18.2178
2016-09-14,18.2178
2016-09-15,18.4318
2016-09-16,18.2178
2016-09-19,18.3872
2016-09-20,18.4496
2016-09-21,18.7081
2016-09-22,18.7348
2016-09-23,18.5922
2016-09-26,18.4852
2016-09-27,18.4496
2016-09-28,18.5744
2016-09-29,18.3337
2016-09-30,18.4407
2016-10-03,18.5031
2016-10-04,18.3783
2016-10-05,18.3872
2016-10-06,18.3605
2016-10-07,18.2892
2016-10-10,18.4496
2016-10-11,18.4941
2016-10-12,18.3515
2016-10-13,18.3783
2016-10-14,18.2892
2016-10-17,18.307
2016-10-18,18.7437
2016-10-19,18.8328
2016-10-20,18.922
2016-10-21,19.2072
2016-10-24,19.3052
2016-10-25,19.5993
2016-10-26,19.4835
2016-10-27,19.6617
2016-10-28,19.84
2016-10-31,20.3658
2016-11-01,19.9202
2016-11-02,19.9915
2016-11-03,20.1698
2016-11-04,20.0539
2016-11-07,20.3658
2016-11-08,20.4995
2016-11-09,20.1163
2016-11-10,20.1698
2016-11-11,19.8489
2016-11-14,19.9915
2016-11-15,20.0806
2016-11-16,19.9469
2016-11-17,20.0539
2016-11-18,19.8311
2016-11-21,20.0004
2016-11-22,20.0182
2016-11-23,19.8935
2016-11-25,19.7865
2016-11-28,19.4835
2016-11-29,19.3765
2016-11-30,19.3052
2016-12-01,18.913
2016-12-02,18.7794
2016-12-05,19.2785
2016-12-06,19.5191
2016-12-07,20.0272
2016-12-08,20.2322
2016-12-09,20.9274
2016-12-12,20.5798
2016-12-13,20.7313
2016-12-14,20.2678
2016-12-15,20.1519
2016-12-16,19.7152
2016-12-19,19.4211
2016-12-20,19.5013
2016-12-21,19.2161
2016-12-22,19.2606
2016-12-23,19.1983
2016-12-27,19.2696
2016-12-28,19.4835
2016-12-29,19.528
2016-12-30,19.4924
2017-01-03,19.6083
2017-01-04,19.6083
2017-01-05,19.6439
2017-01-06,19.5548
2017-01-09,19.5102
2017-01-10,19.332
2017-01-11,19.2696
2017-01-12,19.2874
2017-01-13,19.4746
2017-01-17,19.5191
2017-01-18,19.5637
2017-01-19,19.5369
2017-01-20,19.5369
2017-01-23,19.4746
2017-01-24,19.3943
2017-01-25,19.6617
2017-01-26,19.7954
2017-01-27,19.7509
2017-01-30,19.2874
2017-01-31,19.2428
2017-02-01,19.0378
2017-02-02,19.2696
2017-02-03,19.4746
2017-02-06,19.4122
2017-02-07,19.5102
2017-02-08,19.4211
2017-02-09,19.43
2017-02-10,19.6528
2017-02-13,19.6439
2017-02-14,19.4567
2017-02-15,19.5815
2017-02-16,19.5013
2017-02-17,19.4122
2017-02-21,19.7419
2017-02-22,19.6974
2017-02-23,19.6974
2017-02-24,19.5548
2017-02-27,19.6261
2017-02-28,19.5904
2017-03-01,20.1876
2017-03-02,19.9737
2017-03-03,20.3124
2017-03-06,20.2143
2017-03-07,20.6154
2017-03-08,20.3748
2017-03-09,20.3569
2017-03-10,20.348
2017-03-13,20.5976
2017-03-14,20.7224
2017-03-15,20.8293
2017-03-16,21.3373
2017-03-17,21.5067
2017-03-20,21.4799
2017-03-21,21.373
2017-03-22,21.4889
2017-03-23,21.8543
2017-03-24,22.1217
2017-03-27,22.0415
2017-03-28,22.6832
2017-03-29,22.6832
2017-03-30,22.4782
2017-03-31,22.3534
2017-04-03,22.5138
2017-04-04,22.291
2017-04-05,22.193
2017-04-06,22.2019
2017-04-07,22.3088
2017-04-10,22.1217
2017-04-11,22.1038
2017-04-12,22.0325
2017-04-13,22.2019
2017-04-17,22.6386
2017-04-18,22.2108
2017-04-19,21.8179
2017-04-20,21.8456
2017-04-21,21.9748
2017-04-24,22.1225
2017-04-25,22.2886
2017-04-26,22.104
2017-04-27,21.7718
2017-04-28,21.8087
2017-05-01,22.2702
2017-05-02,22.4271
2017-05-03,22.344
2017-05-04,22.1779
2017-05-05,22.2333
2017-05-08,22.1225
2017-05-09,21.8087
2017-05-10,21.8549
2017-05-11,21.9379
2017-05-12,21.9379
2017-05-15,22.3625
2017-05-16,22.3809
2017-05-17,22.2425
2017-05-18,21.9102
2017-05-19,22.2979
2017-05-22,22.1963
2017-05-23,22.667
2017-05-24,22.9716
2017-05-25,22.9255
2017-05-26,22.907
2017-05-30,22.9808
2017-05-31,22.7962
2017-06-01,22.8147
2017-06-02,22.8608
2017-06-05,22.8332
2017-06-06,22.6024
2017-06-07,22.344
2017-06-08,22.4455
2017-06-09,22.5563
2017-06-12,22.8424
2017-06-13,23.4423
2017-06-14,23.4977
2017-06-15,23.3408
2017-06-16,23.4331
2017-06-19,23.553
2017-06-20,23.35
2017-06-21,23.1562
2017-06-22,23.2577
2017-06-23,23.1746
2017-06-26,23.3315
2017-06-27,23.2854
2017-06-28,23.3408
2017-06-29,23.2854
2017-06-30,23.4515
2017-07-03,23.6822
2017-07-05,23.5992
2017-07-06,23.5254
2017-07-07,23.5623
2017-07-10,23.7561
2017-07-11,23.6638
2017-07-12,24.3098
2017-07-13,24.5775
2017-07-14,24.0883
2017-07-17,24.1714
2017-07-18,24.0699
2017-07-19,23.9868
2017-07-20,24.0145
2017-07-21,23.9499
2017-07-24,24.439
2017-07-25,24.6698
2017-07-26,24.8174
2017-07-27,24.799
2017-07-28,25.4173
2017-07-31,26.0911
2017-08-01,26.368
2017-08-02,26.8017
2017-08-03,26.9771
2017-08-04,26.8848
2017-08-07,27.2909
2017-08-08,27.6877
2017-08-09,27.3278
2017-08-10,26.9586
2017-08-11,26.8663
2017-08-14,27.1986
2017-08-15,27.2078
2017-08-16,27.0417
2017-08-17,26.7833
2017-08-18,26.8756
2017-08-21,26.9217
2017-08-22,26.6264
2017-08-23,27.134
2017-08-24,27.337
2017-08-25,27.4847
2017-08-28,27.3647
2017-08-29,27.3093
2017-08-30,27.1894
2017-08-31,26.9956
2017-09-01,26.9217
2017-09-05,26.7833
2017-09-06,26.5895
2017-09-07,26.8756
2017-09-08,26.8202
2017-09-11,27.2447
2017-09-12,27.2909
2017-09-13,27.0232
2017-09-14,26.774
2017-09-15,27.3001
2017-09-18,27.1709
2017-09-19,27.0694
2017-09-20,27.337
2017-09-21,27.8908
2017-09-22,28.14
2017-09-25,27.4016
2017-09-26,27.2171
2017-09-27,27.2263
2017-09-28,27.4016
2017-09-29,27.4201
2017-10-02,27.6231
2017-10-03,28.2784
2017-10-04,28.1677
2017-10-05,28.1492
2017-10-06,28.0754
2017-10-09,27.9554
2017-10-10,28.6107
2017-10-11,28.5645
2017-10-12,28.7676
2017-10-13,28.8045
2017-10-16,29.0906
2017-10-17,28.666
2017-10-18,29.0168
2017-10-19,28.4445
2017-10-20,28.4353
2017-10-23,28.3984
2017-10-24,28.1307
2017-10-25,28.2323
2017-10-26,28.4815
2017-10-27,28.4261
2017-10-30,29.1737
2017-10-31,28.8691
2017-11-01,28.5738
2017-11-02,28.7768
2017-11-03,28.6753
2017-11-06,28.6291
2017-11-07,28.3892
2017-11-08,28.6753
2017-11-09,28.4722
2017-11-10,28.0477
2017-11-13,27.78
2017-11-14,27.6231
2017-11-15,27.5585
2017-11-16,28.0108
2017-11-17,28.3615
2017-11-20,26.4603
2017-11-21,27.0048
2017-11-22,26.5895
2017-11-24,26.4603
2017-11-27,26.5156
2017-11-28,26.4972
2017-11-29,25.8696
2017-11-30,25.3527
2017-12-01,25.3343
2017-12-04,25.0205
2017-12-05,24.5959
2017-12-06,24.8913
2017-12-07,24.7067
2017-12-08,24.9374
2017-12-11,25.6942
2017-12-12,25.6296
2017-12-13,25.9619
2017-12-14,25.9157
2017-12-15,26.7556
2017-12-18,29.5059
2017-12-19,29.589
2017-12-20,29.4136
2017-12-21,28.583
2017-12-22,28.6845
2017-12-26,28.6753
2017-12-27,28.5738
2017-12-28,28.8322
2017-12-29,28.8599
2018-01-02,29.8751
2018-01-03,29.912
2018-01-04,30.0966
2018-01-05,30.7611
2018-01-08,30.355
2018-01-09,30.3458
2018-01-10,30.5488
2018-01-11,31.0195
2018-01-12,31.1303
2018-01-16,31.3794
2018-01-17,31.7671
2018-01-18,31.8686
2018-01-19,31.5087
2018-01-22,31.9332
2018-01-23,31.6379
2018-01-24,31.8317
2018-01-25,31.9424
2018-01-26,32.0993
2018-01-29,31.7025
2018-01-30,31.6102
2018-01-31,31.4256
2018-02-01,31.1949
2018-02-02,30.4104
2018-02-05,29.1737
2018-02-06,30.2258
2018-02-07,30.0873
2018-02-08,29.0629
2018-02-09,29.0168
2018-02-12,29.6259
2018-02-13,29.6259
2018-02-14,30.0504
2018-02-15,30.3642
2018-02-16,30.3365
2018-02-20,30.7057
2018-02-21,30.8349
2018-02-22,30.918
2018-02-23,30.9272
2018-02-26,30.7703
2018-02-27,30.3181
2018-02-28,30.1335
2018-03-01,29.9305
2018-03-02,29.9489
2018-03-05,30.2258
2018-03-06,30.0873
2018-03-07,29.9674
2018-03-08,29.8197
2018-03-09,30.4842
2018-03-12,30.6503
2018-03-13,30.5119
2018-03-14,30.6319
2018-03-15,30.5765
2018-03-16,30.6411
2018-03-19,30.595
2018-03-20,30.3919
2018-03-21,30.558
2018-03-22,30.0135
2018-03-23,29.6628
2018-03-26,29.9212
2018-03-27,29.9674
2018-03-28,30.4011
2018-03-29,30.9272
2018-04-02,31.0656
2018-04-03,31.5456
2018-04-04,31.4994
2018-04-05,31.4994
2018-04-06,31.2502
2018-04-09,31.1303
2018-04-10,31.5179
2018-04-11,31.8963
2018-04-12,32.0163
2018-04-13,32.0716
2018-04-16,32.0532
2018-04-17,32.247
2018-04-18,32.9881
2018-04-19,32.7857
2018-04-20,32.7664
2018-04-23,32.3328
2018-04-24,32.4099
2018-04-25,31.8991
2018-04-26,32.0244
2018-04-27,32.0629
2018-04-30,31.8316
2018-05-01,31.7449
2018-05-02,31.4269
2018-05-03,31.2438
2018-05-04,31.2534
2018-05-07,31.263
2018-05-08,30.9739
2018-05-09,31.2823
2018-05-10,32.0629
2018-05-11,32.1497
2018-05-14,32.0437
2018-05-15,31.7835
2018-05-16,31.8991
2018-05-17,32.0051
2018-05-18,31.7642
2018-05-21,31.8605
2018-05-22,31.8991
2018-05-23,31.6485
2018-05-24,31.5232
2018-05-25,32.1882
2018-05-29,31.0703
2018-05-30,31.822
2018-05-31,30.9932
2018-06-01,31.1667
2018-06-04,31.5329
2018-06-05,31.0703
2018-06-06,31.0607
2018-06-07,30.6655
2018-06-08,30.6655
2018-06-11,30.7234
2018-06-12,30.4921
2018-06-13,30.8583
2018-06-14,30.627
2018-06-15,30.6848
2018-06-18,30.7523
2018-06-19,30.5981
2018-06-20,30.6655
2018-06-21,30.839
2018-06-22,30.6077
2018-06-25,30.4053
2018-06-26,30.521
2018-06-27,30.0777
2018-06-28,30.3282
2018-06-29,30.2897
2018-07-02,29.5283
2018-07-03,30.7137
2018-07-05,30.5403
2018-07-06,30.4632
2018-07-09,30.6655
2018-07-10,30.5981
2018-07-11,30.4632
2018-07-12,30.5692
2018-07-13,30.2608
2018-07-16,30.3571
2018-07-17,30.4535
2018-07-18,30.5017
2018-07-19,30.0488
2018-07-20,30.6945
2018-07-23,30.5403
2018-07-24,31.0125
2018-07-25,31.5618
2018-07-26,31.5136
2018-07-27,31.6678
2018-07-30,31.5618
2018-07-31,31.6196
2018-08-01,31.3401
2018-08-02,31.3305
2018-08-03,31.6196
2018-08-06,30.7812
2018-08-07,30.6463
2018-08-08,30.6559
2018-08-09,30.6945
2018-08-10,29.9813
2018-08-13,29.7115
2018-08-14,29.6729
2018-08-15,28.7381
2018-08-16,29.5958
2018-08-17,29.5669
2018-08-20,29.4609
2018-08-21,29.5476
2018-08-22,29.6729
2018-08-23,29.6344
2018-08-24,29.7596
2018-08-27,30.1066
2018-08-28,30.0873
2018-08-29,30.0391
2018-08-30,29.3163
2018-08-31,29.4898
2018-09-04,28.5261
2018-09-05,28.6321
2018-09-06,29.3934
2018-09-07,29.326
2018-09-10,29.1429
2018-09-11,29.3742
2018-09-12,29.6054
2018-09-13,30.1355
2018-09-14,29.8946
2018-09-17,30.2319
2018-09-18,30.4439
2018-09-19,30.4824
2018-09-20,31.5136
2018-09-21,31.8413
2018-09-24,31.0992
2018-09-25,31.1956
2018-09-26,31.1474
2018-09-27,31.1474
2018-09-28,30.8197
2018-10-01,30.7426
2018-10-02,30.5113
2018-10-03,30.5788
2018-10-04,30.0777
2018-10-05,30.174
2018-10-08,30.1066
2018-10-09,29.9717
2018-10-10,28.8923
2018-10-11,28.9116
2018-10-12,29.3356
2018-10-15,29.3838
2018-10-16,29.8849
2018-10-17,29.8078
2018-10-18,29.2392
2018-10-19,29.3934
2018-10-22,29.0947
2018-10-23,28.7959
2018-10-24,28.0346
2018-10-25,28.3719
2018-10-26,28.4393
2018-10-29,27.89
2018-10-30,27.9671
2018-10-31,28.3912
2018-11-01,30.1933
2018-11-02,30.2126
2018-11-05,29.8175
2018-11-06,29.8271
2018-11-07,29.9909
2018-11-08,29.3452
2018-11-09,29.4416
2018-11-12,28.5261
2018-11-13,28.7188
2018-11-14,29.0947
2018-11-15,29.9524
2018-11-16,30.2126
2018-11-19,30.309
2018-11-20,29.3934
2018-11-21,29.6247
2018-11-23,29.2681
2018-11-26,29.6633
2018-11-27,29.4223
2018-11-28,30.4535
2018-11-29,30.2704
2018-11-30,29.8367
2018-12-03,30.5403
2018-12-04,29.9909
2018-12-06,30.1548
2018-12-07,29.4031
2018-12-10,29.085
2018-12-11,29.2585
2018-12-12,29.5283
2018-12-13,29.6536
2018-12-14,29.4802
2018-12-17,29.0176
2018-12-18,28.9405
2018-12-19,28.449
2018-12-20,28.4586
2018-12-21,28.2081
2018-12-24,27.9286
2018-12-26,28.5164
2018-12-27,28.6514
2018-12-28,28.555
2018-12-31,28.8152
2019-01-02,28.873
2019-01-03,28.6321
2019-01-04,29.432
2019-01-07,28.9887
2019-01-08,29.3067
2019-01-09,29.4609
2019-01-10,29.4705
2019-01-11,29.8175
2019-01-14,29.7693
2019-01-15,29.8078
2019-01-16,30.1644
2019-01-17,30.203
2019-01-18,30.5499
2019-01-22,30.2222
2019-01-23,30.6463
2019-01-24,30.627
2019-01-25,30.7908
2019-01-28,30.6655
2019-01-29,30.839
2019-01-30,30.8101
2019-01-31,31.1667
2019-02-01,31.1185
2019-02-04,31.3883
2019-02-05,31.4365
2019-02-06,31.0221
2019-02-07,30.8197
2019-02-08,30.5788
2019-02-11,30.3475
2019-02-12,30.8294
2019-02-13,30.4053
2019-02-14,30.1837
2019-02-15,30.5306
2019-02-19,30.415
2019-02-20,30.6174
2019-02-21,30.6366
2019-02-22,31.2727
2019-02-25,31.2052
2019-02-26,31.3209
2019-02-27,31.2245
2019-02-28,30.5017
2019-03-01,30.2319
2019-03-04,30.6174
2019-03-05,30.4053
2019-03-06,30.2993
2019-03-07,29.7596
2019-03-08,29.6536
2019-03-11,29.7596
2019-03-12,29.7886
2019-03-13,30.0584
2019-03-14,29.8367
2019-03-15,29.9235
2019-03-18,30.0777
2019-03-19,29.6922
2019-03-20,29.5958
2019-03-21,29.3645
2019-03-22,28.2562
2019-03-25,28.2177
2019-03-26,28.3333
2019-03-27,28.102
2019-03-28,28.3333
2019-03-29,28.6706
2019-04-01,29.4223
2019-04-02,29.0658
2019-04-03,29.326
2019-04-04,29.6247
2019-04-05,29.9717
2019-04-08,30.0873
2019-04-09,29.6633
2019-04-10,29.5958
2019-04-11,29.1621
2019-04-12,29.4031
2019-04-15,29.42
2019-04-16,29.71
2019-04-17,29.72
2019-04-18,29.46
2019-04-22,29.37
2019-04-23,29.37
2019-04-24,28.92
2019-04-25,28.8
2019-04-26,28.65
2019-04-29,28.37
2019-04-30,28
2019-05-01,27.56
2019-05-02,27.92
2019-05-03,28.39
2019-05-06,28.45
2019-05-07,28.46
2019-05-08,28.16
2019-05-09,28.28
2019-05-10,28.38
2019-05-13,27.67
2019-05-14,28.18
2019-05-15,28.3
2019-05-16,28.17
2019-05-17,27.9
2019-05-20,27.84
2019-05-21,28.08
2019-05-22,28.07
2019-05-23,27.98
2019-05-24,27.99
2019-05-28,27.26
2019-05-29,27.52
2019-05-30,27.71
2019-05-31,27.95
2019-06-03,28.41
2019-06-04,28.83
2019-06-05,28.49
2019-06-06,28.49
2019-06-07,28.88
2019-06-10,28.93
2019-06-11,29.75
2019-06-12,29.49
2019-06-13,29.5
2019-06-14,29.31
2019-06-17,29.275
2019-06-18,29.21
2019-06-19,29.325
2019-06-20,29.46
2019-06-21,29.155
2019-06-24,29.365
2019-06-25,29.53
2019-06-26,30.04
2019-06-27,29.78
2019-06-28,29.9
2019-07-01,29.995
2019-07-02,29.97
2019-07-03,30.21
2019-07-04,30.21
2019-07-05,30.065
2019-07-08,29.94
2019-07-09,29.51
2019-07-10,29.72
2019-07-11,29.93
2019-07-12,30.085
2019-07-15,30.03
2019-07-16,30.26
2019-07-17,30.02
2019-07-18,30.165
2019-07-19,30.08
2019-07-22,29.87
2019-07-23,29.495
2019-07-24,29.64
2019-07-25,29.545
2019-07-26,29.8
2019-07-29,29.685
2019-07-30,29.305
2019-07-31,29.035
2019-08-01,28.85
2019-08-02,28.555
2019-08-05,27.645
2019-08-06,27.755
2019-08-07,28.01
2019-08-08,28.6
2019-08-09,28.57
2019-08-12,28.14
2019-08-13,28.51
2019-08-14,27.995
2019-08-15,28.135
2019-08-16,28.44
2019-08-19,28.67
2019-08-20,28.455
2019-08-21,28.455
2019-08-22,28.29
2019-08-23,27.905
2019-08-26,27.815
2019-08-27,27.8
2019-08-28,27.73
2019-08-29,27.87
2019-08-30,28.45
2019-09-02,28.41
2019-09-03,28.02
2019-09-04,28.16
2019-09-05,28.385
2019-09-06,28.485
2019-09-09,28.45
2019-09-10,28.5
2019-09-11,28.735
2019-09-12,28.975
2019-09-13,29.17
2019-09-16,29.09
2019-09-17,28.9
2019-09-18,28.66
2019-09-19,28.52
2019-09-20,28.545
2019-09-23,28.445
2019-09-24,28.325
2019-09-25,28.5
2019-09-26,28.46
2019-09-27,28.635
2019-09-30,28.03
2019-10-01,27.855
2019-10-02,27.725
2019-10-03,28.25
2019-10-04,28.61
2019-10-07,28.4
2019-10-08,28.05
2019-10-09,28.335
2019-10-10,28.395
2019-10-11,29.01
2019-10-14,28.95
2019-10-15,28.83
2019-10-16,28.985
2019-10-17,29.1
2019-10-18,28.95
2019-10-21,27.365
2019-10-22,27.675
2019-10-23,27.42
2019-10-24,27.385
2019-10-25,26.905
2019-10-28,26.97
2019-10-29,26.16
2019-10-30,24.68
2019-10-31,24.185
2019-11-01,24.595
2019-11-04,25.135
2019-11-05,24.635
2019-11-06,24.215
2019-11-07,24.38
2019-11-08,24.31
2019-11-11,24.015
2019-11-12,22.865
2019-11-13,22.87
2019-11-14,22.165
2019-11-15,25.04
2019-11-18,24.65
2019-11-19,24.04
2019-11-20,23.59
2019-11-21,23.35
2019-11-22,22.97
2019-11-25,23.285
