date,close
2014-06-13,48.86
2014-06-16,49.1
2014-06-17,49.445
2014-06-18,49.82
2014-06-19,49.46
2014-06-20,48.97
2014-06-23,48.9
2014-06-24,48.19
2014-06-25,48.53
2014-06-26,48.34
2014-06-27,48.7
2014-06-30,49.17
2014-07-01,49.93
2014-07-02,49.19
2014-07-03,50.01
2014-07-07,49.3
2014-07-08,47.54
2014-07-09,48.1
2014-07-10,47.13
2014-07-11,47.23
2014-07-14,47.75
2014-07-15,48.4
2014-07-16,48.59
2014-07-17,48.22
2014-07-18,49.77
2014-07-21,49.26
2014-07-22,47.6
2014-07-23,47.75
2014-07-24,48
2014-07-25,48.04
2014-07-28,49.35
2014-07-29,50.34
2014-07-30,49.87
2014-07-31,48.02
2014-08-01,48.91
2014-08-04,49.74
2014-08-05,50.28
2014-08-06,51.44
2014-08-07,51.59
2014-08-08,52.32
2014-08-11,52.68
2014-08-12,52.36
2014-08-13,52.62
2014-08-14,52.88
2014-08-15,52.92
2014-08-18,54.05
2014-08-19,54.19
2014-08-20,53.47
2014-08-21,54.415
2014-08-22,54.75
2014-08-25,54.225
2014-08-26,55.345
2014-08-27,55.17
2014-08-28,54.57
2014-08-29,55.14
2014-09-02,54.53
2014-09-03,54.52
2014-09-04,54.32
2014-09-05,54.84
2014-09-08,54.78
2014-09-09,54.52
2014-09-10,55.42
2014-09-11,55.83
2014-09-12,55.58
2014-09-15,53.83
2014-09-16,53.73
2014-09-17,52.98
2014-09-18,53.265
2014-09-19,52.09
2014-09-22,51.55
2014-09-23,50.73
2014-09-24,51.03
2014-09-25,49.72
2014-09-26,49.935
2014-09-29,50.745
2014-09-30,50.4
2014-10-01,46.66
2014-10-02,46.185
2014-10-03,47.34
2014-10-06,47.195
2014-10-07,47.445
2014-10-08,48.99
2014-10-09,47.64
2014-10-10,45.79
2014-10-13,45.44
2014-10-14,46.575
2014-10-15,47.45
2014-10-16,46.98
2014-10-17,47.06
2014-10-20,47.96
2014-10-21,48.465
2014-10-22,47.26
2014-10-23,46.7
2014-10-24,44.98
2014-10-27,43.7
2014-10-28,42.97
2014-10-29,42.88
2014-10-30,43.1
2014-10-31,44.34
2014-11-03,45.65
2014-11-04,45.37
2014-11-05,46.14
2014-11-06,47.61
2014-11-07,48.06
2014-11-10,48.35
2014-11-11,49.39
2014-11-12,49.43
2014-11-13,48.78
2014-11-14,49.2
2014-11-17,48.85
2014-11-18,48.54
2014-11-19,47.74
2014-11-20,47.76
2014-11-21,47.92
2014-11-24,47.87
2014-11-25,47.92
2014-11-26,47.77
2014-11-28,47.3
2014-12-01,46.81
2014-12-02,46.48
2014-12-03,47.47
2014-12-04,48.14
2014-12-05,49.19
2014-12-08,49.06
2014-12-09,49.76
2014-12-10,48.92
2014-12-11,48.43
2014-12-12,47.87
2014-12-15,48
2014-12-16,48.21
2014-12-17,49.87
2014-12-18,51.3
2014-12-19,51.62
2014-12-22,52.42
2014-12-23,53.39
2014-12-24,53.625
2014-12-26,54.03
2014-12-29,53.62
2014-12-30,52.55
2014-12-31,51.69
2015-01-02,51.55
2015-01-05,50.39
2015-01-06,48.81
2015-01-07,48.25
2015-01-08,48.95
2015-01-09,48.21
2015-01-12,48.37
2015-01-13,48.64
2015-01-14,48.4
2015-01-15,47.7
2015-01-16,47.51
2015-01-20,47.82
2015-01-21,47.61
2015-01-22,48.15
2015-01-23,47.95
2015-01-26,48.18
2015-01-27,47.47
2015-01-28,45.3
2015-01-29,44.45
2015-01-30,43.58
2015-02-02,43.45
2015-02-03,44.64
2015-02-04,44.47
2015-02-05,44.97
2015-02-06,44.57
2015-02-09,44.07
2015-02-10,44.07
2015-02-11,43.69
2015-02-12,43.73
2015-02-13,43.68
2015-02-17,43.56
2015-02-18,44.43
2015-02-19,45.09
2015-02-20,45
2015-02-23,44.72
2015-02-24,44.925
2015-02-25,45.59
2015-02-26,46.84
2015-02-27,48.27
2015-03-02,49.13
2015-03-03,48.505
2015-03-04,47.81
2015-03-05,47.84
2015-03-06,46.88
2015-03-09,46.19
2015-03-10,45.26
2015-03-11,45.29
2015-03-12,45.39
2015-03-13,45
2015-03-16,45.95
2015-03-17,45.13
2015-03-18,45.065
2015-03-19,44.87
2015-03-20,45.82
2015-03-23,45.48
2015-03-24,44.44
2015-03-25,43.68
2015-03-26,43.66
2015-03-27,44.14
2015-03-30,44.13
2015-03-31,43.7
2015-04-01,43.47
2015-04-02,43.71
2015-04-06,43.94
2015-04-07,44.12
2015-04-08,46.6
2015-04-09,47.24
2015-04-10,46.74
2015-04-13,46.78
2015-04-14,46.59
2015-04-15,47.16
2015-04-16,46.84
2015-04-17,45.78
2015-04-20,46.31
2015-04-21,46.73
2015-04-22,47.105
2015-04-23,47.27
2015-04-24,47.28
2015-04-27,46.21
2015-04-28,47.14
2015-04-29,47.46
2015-04-30,45.75
2015-05-01,45.5
2015-05-04,45.75
2015-05-05,44.72
2015-05-06,44.43
2015-05-07,44.59
2015-05-08,44.41
2015-05-11,44.5
2015-05-12,44.47
2015-05-13,45.23
2015-05-14,46.51
2015-05-15,46.17
2015-05-18,46.95
2015-05-19,46.62
2015-05-20,45.96
2015-05-21,45.64
2015-05-22,45.44
2015-05-26,44.5
2015-05-27,45.34
2015-05-28,45.365
2015-05-29,44.43
2015-06-01,44.92
2015-06-02,45.09
2015-06-03,46.27
2015-06-04,45.28
2015-06-05,45.04
2015-06-08,44.14
2015-06-09,43.82
2015-06-10,44.22
2015-06-11,44.22
2015-06-12,44
2015-06-15,44
2015-06-16,44.43
2015-06-17,44.63
2015-06-18,45.12
2015-06-19,44.5
2015-06-22,44.39
2015-06-23,44.625
2015-06-24,44.19
2015-06-25,44.74
2015-06-26,44.45
2015-06-29,42.99
2015-06-30,42.41
2015-07-01,41.02
2015-07-02,40.41
2015-07-06,40.27
2015-07-07,40.57
2015-07-08,40.46
2015-07-09,40.18
2015-07-10,40.54
2015-07-13,41.2
2015-07-14,41.31
2015-07-15,40.76
2015-07-16,40.43
2015-07-17,39.98
2015-07-20,40.27
2015-07-21,40.14
2015-07-22,40.16
2015-07-23,40.51
2015-07-24,40.57
2015-07-27,39.61
2015-07-28,34.84
2015-07-29,36.11
2015-07-30,37.6
2015-07-31,37.47
2015-08-03,37.66
2015-08-04,37.78
2015-08-05,38.25
2015-08-06,37.66
2015-08-07,37.73
2015-08-10,39.15
2015-08-11,37.92
2015-08-12,37.63
2015-08-13,37.32
2015-08-14,37.51
2015-08-17,37.94
2015-08-18,37.31
2015-08-19,37.48
2015-08-20,36.57
2015-08-21,36.34
2015-08-24,35.1
2015-08-25,34.49
2015-08-26,35.14
2015-08-27,35.99
2015-08-28,35.7
2015-08-31,35.84
2015-09-01,34.99
2015-09-02,35.37
2015-09-03,35.09
2015-09-04,35.23
2015-09-08,35.97
2015-09-09,35.55
2015-09-10,35.25
2015-09-11,35.94
2015-09-14,35.88
2015-09-15,36.1
2015-09-16,36.05
2015-09-17,35.85
2015-09-18,35.3
2015-09-21,35.16
2015-09-22,34.69
2015-09-23,34.72
2015-09-24,34.78
2015-09-25,34.56
2015-09-28,34.07
2015-09-29,34.02
2015-09-30,33.96
2015-10-01,34.54
2015-10-02,35.12
2015-10-05,35.25
2015-10-06,35.64
2015-10-07,35.68
2015-10-08,35.61
2015-10-09,36.27
2015-10-12,36.11
2015-10-13,35.93
2015-10-14,35.69
2015-10-15,35.77
2015-10-16,35.14
2015-10-19,35.2
2015-10-20,36.23
2015-10-21,36.06
2015-10-22,37.17
2015-10-23,36.81
2015-10-26,37.67
2015-10-27,38.73
2015-10-28,40.52
2015-10-29,40.87
2015-10-30,40.52
2015-11-02,40.5
2015-11-03,40.88
2015-11-04,41.14
2015-11-05,40.99
2015-11-06,41
2015-11-09,41.07
2015-11-10,40.68
2015-11-11,40.22
2015-11-12,39.95
2015-11-13,38.82
2015-11-16,39.5
2015-11-17,39.42
2015-11-18,39.88
2015-11-19,40.25
2015-11-20,40.16
2015-11-23,40.61
2015-11-24,40.55
2015-11-25,40.59
2015-11-27,40.79
2015-11-30,40.98
2015-12-01,41.31
2015-12-02,42.24
2015-12-03,42.57
2015-12-04,42.91
2015-12-07,41.75
2015-12-08,41.21
2015-12-09,40.57
2015-12-10,39.91
2015-12-11,38.91
2015-12-14,38.84
2015-12-15,39.55
2015-12-16,40.22
2015-12-17,40.22
2015-12-18,39.54
2015-12-21,38.95
2015-12-22,39.26
2015-12-23,39.82
2015-12-24,39.77
2015-12-28,39.58
2015-12-29,40.55
2015-12-30,39.83
2015-12-31,39.35
2016-01-04,37.97
2016-01-05,37.97
2016-01-06,37.32
2016-01-07,35.55
2016-01-08,35.04
2016-01-11,35.31
2016-01-12,34.74
2016-01-13,33.93
2016-01-14,34.55
2016-01-15,31.45
2016-01-19,31.01
2016-01-20,30.76
2016-01-21,30.945
2016-01-22,31.62
2016-01-25,30.41
2016-01-26,31.37
2016-01-27,36.39
2016-01-28,35.92
2016-01-29,37.52
2016-02-01,39.06
2016-02-02,38.05
2016-02-03,38.27
2016-02-04,39
2016-02-05,38.19
2016-02-08,36.63
2016-02-09,34.91
2016-02-10,34.58
2016-02-11,34.15
2016-02-12,35.11
2016-02-16,35.92
2016-02-17,37.06
2016-02-18,36.42
2016-02-19,36.97
2016-02-22,37.12
2016-02-23,36.06
2016-02-24,37.36
2016-02-25,37.69
2016-02-26,38.29
2016-02-29,37.47
2016-03-01,38.49
2016-03-02,38.39
2016-03-03,38.36
2016-03-04,38.64
2016-03-07,39.3
2016-03-08,38.38
2016-03-09,38.15
2016-03-10,38
2016-03-11,39.2
2016-03-14,39.52
2016-03-15,38.51
2016-03-16,38.8
2016-03-17,39.49
2016-03-18,40.58
2016-03-21,40.01
2016-03-22,40.05
2016-03-23,39.11
2016-03-24,39.99
2016-03-28,40.07
2016-03-29,41.1
2016-03-30,42.14
2016-03-31,43.17
2016-04-01,43.55
2016-04-04,42.88
2016-04-05,42.01
2016-04-06,42.35
2016-04-07,41.33
2016-04-08,41.75
2016-04-11,41.16
2016-04-12,41.15
2016-04-13,42.31
2016-04-14,43.07
2016-04-15,42.74
2016-04-18,44.03
2016-04-19,43.61
2016-04-20,43.88
2016-04-21,43.92
2016-04-22,44.14
2016-04-25,44.02
2016-04-26,44.43
2016-04-27,44.67
2016-04-28,43.91
2016-04-29,43.77
2016-05-02,44.43
2016-05-03,42.93
2016-05-04,42.39
2016-05-05,42.4
2016-05-06,43.07
2016-05-09,43.13
2016-05-10,44.06
2016-05-11,43.53
2016-05-12,44.03
2016-05-13,43.63
2016-05-16,44.24
2016-05-17,43.72
2016-05-18,44.05
2016-05-19,43.34
2016-05-20,44.28
2016-05-23,44.06
2016-05-24,45.19
2016-05-25,45.79
2016-05-26,45
2016-05-27,45.37
2016-05-31,45.28
2016-06-01,46.43
2016-06-02,46.64
2016-06-03,46.5
2016-06-06,46.53
2016-06-07,46.7
2016-06-08,47.25
2016-06-09,47.24
2016-06-10,46.19
2016-06-13,45.41
2016-06-14,45.29
2016-06-15,45.19
2016-06-16,45.23
2016-06-17,44.91
2016-06-20,45.14
2016-06-21,45.78
2016-06-22,44.93
2016-06-23,45.57
2016-06-24,42.92
2016-06-27,41.81
2016-06-28,42.61
2016-06-29,42.7
2016-06-30,43.19
2016-07-01,43.13
2016-07-05,42.41
2016-07-06,42.78
2016-07-07,43.03
2016-07-08,44.23
2016-07-11,44.53
2016-07-12,44.45
2016-07-13,44.2
2016-07-14,44.4
2016-07-15,45.25
2016-07-18,46.25
2016-07-19,46.34
2016-07-20,47.35
2016-07-21,47.72
2016-07-22,48.54
2016-07-25,49.07
2016-07-26,51.45
2016-07-27,51.81
2016-07-28,51.47
2016-07-29,51.74
2016-08-01,51.68
2016-08-02,50.28
2016-08-03,50.52
2016-08-04,50.66
2016-08-05,51.2
2016-08-08,50.57
2016-08-09,50.69
2016-08-10,50.67
2016-08-11,51.09
2016-08-12,50.88
2016-08-15,51.45
2016-08-16,51.32
2016-08-17,51.48
2016-08-18,52.06
2016-08-19,52.25
2016-08-22,52.01
2016-08-23,52.12
2016-08-24,51.75
2016-08-25,51.93
2016-08-26,51.74
2016-08-29,52.06
2016-08-30,52.14
2016-08-31,51.54
2016-09-01,52.12
2016-09-02,52.25
2016-09-06,52.64
2016-09-07,52.7
2016-09-08,52.42
2016-09-09,51.27
2016-09-12,52.21
2016-09-13,52.11
2016-09-14,51.47
2016-09-15,52.99
2016-09-16,52.36
2016-09-19,52.48
2016-09-20,52.23
2016-09-21,52.64
2016-09-22,53.15
2016-09-23,53.31
2016-09-26,53.2
2016-09-27,53.56
2016-09-28,53.5
2016-09-29,52.52
2016-09-30,53.13
2016-10-03,53.53
2016-10-04,53.69
2016-10-05,55.04
2016-10-06,55.75
2016-10-07,54.93
2016-10-10,55.58
2016-10-11,53.96
2016-10-12,53.75
2016-10-13,53.25
2016-10-14,53.34
2016-10-17,52.74
2016-10-18,51.94
2016-10-19,52.66
2016-10-20,52.74
2016-10-21,53.29
2016-10-24,53.75
2016-10-25,55.67
2016-10-26,55.06
2016-10-27,54.52
2016-10-28,53.43
2016-10-31,53.5
2016-11-01,52.9
2016-11-02,51.4
2016-11-03,51.35
2016-11-04,51.85
2016-11-07,52.9
2016-11-08,52.3
2016-11-09,52.25
2016-11-10,51.7
2016-11-11,53.65
2016-11-14,53.95
2016-11-15,54.35
2016-11-16,54.6
2016-11-17,55.6
2016-11-18,56.05
2016-11-21,57
2016-11-22,57.2
2016-11-23,55.6
2016-11-25,55.45
2016-11-28,54.25
2016-11-29,54.6
2016-11-30,54
2016-12-01,51.45
2016-12-02,51.05
2016-12-05,53
2016-12-06,54.05
2016-12-07,54.35
2016-12-08,54.15
2016-12-09,53.975
2016-12-12,53.6
2016-12-13,53.65
2016-12-14,53
2016-12-15,53.9
2016-12-16,53.7
2016-12-19,54
2016-12-20,52.9
2016-12-21,53.25
2016-12-22,52.2
2016-12-23,52.85
2016-12-27,52.95
2016-12-28,51.75
2016-12-29,52.25
2016-12-30,51.4
2017-01-03,52.4
2017-01-04,52.4
2017-01-05,52.35
2017-01-06,52.85
2017-01-09,53.6
2017-01-10,53.85
2017-01-11,54.8
2017-01-12,54.05
2017-01-13,55.1
2017-01-17,54.1
2017-01-18,53.75
2017-01-19,54.15
2017-01-20,55.25
2017-01-23,55.85
2017-01-24,56.8
2017-01-25,51.275
2017-01-26,49.9
2017-01-27,50.3
2017-01-30,49.85
2017-01-31,49.1
2017-02-01,49
2017-02-02,49.2
2017-02-03,50.1
2017-02-06,49.95
2017-02-07,50.5
2017-02-08,50.55
2017-02-09,50.7
2017-02-10,50.85
2017-02-13,51.05
2017-02-14,50.8
2017-02-15,51.15
2017-02-16,51.25
2017-02-17,51.4
2017-02-21,51.8
2017-02-22,51.55
2017-02-23,51.15
2017-02-24,50.45
2017-02-27,50
2017-02-28,49.05
2017-03-01,50.1
2017-03-02,49.2
2017-03-03,49.1
2017-03-06,48.85
2017-03-07,48.7
2017-03-08,49.55
2017-03-09,48.5
2017-03-10,49.2
2017-03-13,49.8
2017-03-14,49.75
2017-03-15,49.95
2017-03-16,50.95
2017-03-17,50.8
2017-03-20,50.95
2017-03-21,49.25
2017-03-22,49.4
2017-03-23,49.35
2017-03-24,49.1
2017-03-27,49.3
2017-03-28,49.25
2017-03-29,49.7
2017-03-30,50.65
2017-03-31,50.8
2017-04-03,50.65
2017-04-04,50.55
2017-04-05,50.05
2017-04-06,50.45
2017-04-07,50.7
2017-04-10,51.2
2017-04-11,51.45
2017-04-12,50.65
2017-04-13,49.75
2017-04-17,50.55
2017-04-18,50.25
2017-04-19,50.4
2017-04-20,51.45
2017-04-21,50.15
2017-04-24,50.65
2017-04-25,51
2017-04-26,51.55
2017-04-27,50.7
2017-04-28,50.45
2017-05-01,51.7
2017-05-02,52.45
2017-05-03,55.9
2017-05-04,55.85
2017-05-05,56.45
2017-05-08,58
2017-05-09,57.7
2017-05-10,57.6
2017-05-11,56.75
2017-05-12,56.85
2017-05-15,57.55
2017-05-16,56.75
2017-05-17,55.4
2017-05-18,55
2017-05-19,55.7
2017-05-22,55.25
2017-05-23,55.2
2017-05-24,55.45
2017-05-25,55.4
2017-05-26,55.6
2017-05-30,56.2
2017-05-31,56.125
2017-06-01,56.5
2017-06-02,56.35
2017-06-05,56.2
2017-06-06,57.25
2017-06-07,58
2017-06-08,58.4
2017-06-09,57.5
2017-06-12,57
2017-06-13,56.95
2017-06-14,56.55
2017-06-15,56.35
2017-06-16,56.4
2017-06-19,56.8
2017-06-20,56.8
2017-06-21,56.85
2017-06-22,57.2
2017-06-23,58.2
2017-06-26,58.5
2017-06-27,57.6
2017-06-28,57.95
2017-06-29,56.65
2017-06-30,56.45
2017-07-03,55.3
2017-07-05,55.7
2017-07-06,55.75
2017-07-07,57.15
2017-07-10,57.325
2017-07-11,56.9
2017-07-12,58.15
2017-07-13,58
2017-07-14,58.45
2017-07-17,59.75
2017-07-18,59.45
2017-07-19,60.2
2017-07-20,60.05
2017-07-21,60.25
2017-07-24,61.05
2017-07-25,63.2
2017-07-26,61.7
2017-07-27,60.35
2017-07-28,60.05
2017-07-31,59.55
2017-08-01,60.4
2017-08-02,60.1
2017-08-03,59.9
2017-08-04,60.4
2017-08-07,60.75
2017-08-08,59.2
2017-08-09,58.3
2017-08-10,57.25
2017-08-11,58.95
2017-08-14,59.7
2017-08-15,58.8
2017-08-16,59.1
2017-08-17,58.65
2017-08-18,58.3
2017-08-21,58.1
2017-08-22,59.35
2017-08-23,59.1
2017-08-24,59.65
2017-08-25,59.8
2017-08-28,59.8
2017-08-29,59.8
2017-08-30,60.15
2017-08-31,61.05
2017-09-01,60.85
2017-09-05,60.8
2017-09-06,60.6
2017-09-07,60.5
2017-09-08,60.15
2017-09-11,60.65
2017-09-12,60.95
2017-09-13,60.95
2017-09-14,61.45
2017-09-15,60.95
2017-09-18,61.1
2017-09-19,61.1
2017-09-20,61.2
2017-09-21,60.7
2017-09-22,60.85
2017-09-25,60
2017-09-26,60.55
2017-09-27,61.6
2017-09-28,61.15
2017-09-29,60.8
2017-10-02,61.3
2017-10-03,61.8
2017-10-04,61.95
2017-10-05,62.55
2017-10-06,62.65
2017-10-09,62.5
2017-10-10,62.4
2017-10-11,62.3
2017-10-12,61.35
2017-10-13,61.7
2017-10-16,62
2017-10-17,60.7
2017-10-18,57.95
2017-10-19,58.05
2017-10-20,58.55
2017-10-23,57.9
2017-10-24,52.5
2017-10-25,51.4
2017-10-26,51.55
2017-10-27,51.35
2017-10-30,51.85
2017-10-31,52.05
2017-11-01,51.6
2017-11-02,52
2017-11-03,53.25
2017-11-06,53.3
2017-11-07,53.75
2017-11-08,54.5
2017-11-09,53.6
2017-11-10,54.3
2017-11-13,53.5
2017-11-14,53.8
2017-11-15,54.85
2017-11-16,55.3
2017-11-17,54.25
2017-11-20,54.4
2017-11-21,54.5
2017-11-22,54.4
2017-11-24,54.9
2017-11-27,54.55
2017-11-28,54.7
2017-11-29,53.95
2017-11-30,53.9
2017-12-01,54
2017-12-04,54
2017-12-05,53.95
2017-12-06,53.85
2017-12-07,53.75
2017-12-08,53.3
2017-12-11,53.35
2017-12-12,53.65
2017-12-13,53.75
2017-12-14,53.35
2017-12-15,53.25
2017-12-18,53.75
2017-12-19,53.2
2017-12-20,53.2
2017-12-21,53
2017-12-22,52.3
2017-12-26,52.4
2017-12-27,52.55
2017-12-28,52.5
2017-12-29,52.5
2018-01-02,53
2018-01-03,54
2018-01-04,54.125
2018-01-05,53.85
2018-01-08,54.65
2018-01-09,54.55
2018-01-10,53.4
2018-01-11,54.7
2018-01-12,53.9
2018-01-16,52.05
2018-01-17,52.65
2018-01-18,52.35
2018-01-19,52.55
2018-01-22,51.15
2018-01-23,53.45
2018-01-24,54.85
2018-01-25,54.85
2018-01-26,55.9
2018-01-29,54.7
2018-01-30,53.8
2018-01-31,53.35
2018-02-01,53.55
2018-02-02,52.9
2018-02-05,51.65
2018-02-06,51.9
2018-02-07,51.85
2018-02-08,49.75
2018-02-09,49.75
2018-02-12,50.55
2018-02-13,51.35
2018-02-14,52.3
2018-02-15,52.75
2018-02-16,52.5
2018-02-20,52.55
2018-02-21,53
2018-02-22,53
2018-02-23,53.55
2018-02-26,53.725
2018-02-27,52.7
2018-02-28,52.05
2018-03-01,51.9
2018-03-02,50.8
2018-03-05,52.4
2018-03-06,52.55
2018-03-07,53.6
2018-03-08,53.7
2018-03-09,55.05
2018-03-12,55.45
2018-03-13,55.15
2018-03-14,55.95
2018-03-15,57.1
2018-03-16,58.55
2018-03-19,58.1
2018-03-20,58.15
2018-03-21,58.4
2018-03-22,57.8
2018-03-23,56.55
2018-03-26,57.2
2018-03-27,56.95
2018-03-28,56.25
2018-03-29,57.2
2018-04-02,63.4
2018-04-03,65.15
2018-04-04,67.1
2018-04-05,66.4
2018-04-06,66.35
2018-04-09,66.7
2018-04-10,67.6
2018-04-11,68.45
2018-04-12,68.5
2018-04-13,68.55
2018-04-16,68.65
2018-04-17,70.55
2018-04-18,71.2
2018-04-19,70.4
2018-04-20,69.95
2018-04-23,70.2
2018-04-24,69.45
2018-04-25,68.65
2018-04-26,69.8
2018-04-27,69.4
2018-04-30,69.95
2018-05-01,67.45
2018-05-02,67.55
2018-05-03,67.65
2018-05-04,67.65
2018-05-07,67.9
2018-05-08,68.75
2018-05-09,69.6
2018-05-10,70.5
2018-05-11,69.65
2018-05-14,68.4
2018-05-15,68.25
2018-05-16,67.8
2018-05-17,67.9
2018-05-18,68.1
2018-05-21,68.45
2018-05-22,67.8
2018-05-23,68.55
2018-05-24,68.6
2018-05-25,68.45
2018-05-29,68.2
2018-05-30,68.45
2018-05-31,68.35
2018-06-01,68.75
2018-06-04,69.9
2018-06-05,70.75
2018-06-06,70.55
2018-06-07,70.35
2018-06-08,70.25
2018-06-11,69.8
2018-06-12,71.6
2018-06-13,71.8
2018-06-14,71.45
2018-06-15,69.85
2018-06-18,71.25
2018-06-19,70.45
2018-06-20,70.9
2018-06-21,70.65
2018-06-22,69.15
2018-06-25,67.9
2018-06-26,67.35
2018-06-27,65.1
2018-06-28,66.7
2018-06-29,65.85
2018-07-02,67
2018-07-03,67.55
2018-07-05,68.25
2018-07-06,68.65
2018-07-09,69.2
2018-07-10,68.95
2018-07-11,69.25
2018-07-12,69.95
2018-07-13,69.7
2018-07-16,69.85
2018-07-17,70
2018-07-18,69.45
2018-07-19,69.3
2018-07-20,68.25
2018-07-23,68.05
2018-07-24,65.75
2018-07-25,64.95
2018-07-26,64.75
2018-07-27,63.65
2018-07-30,63.1
2018-07-31,64.9
2018-08-01,64.65
2018-08-02,66.8
2018-08-03,65.65
2018-08-06,66.15
2018-08-07,66.65
2018-08-08,66.75
2018-08-09,67.2
2018-08-10,67.25
2018-08-13,66.55
2018-08-14,65.9
2018-08-15,64.9
2018-08-16,64.95
2018-08-17,65
2018-08-20,64.7
2018-08-21,64.8
2018-08-22,65.85
2018-08-23,67.5
2018-08-24,68.2
2018-08-27,68.35
2018-08-28,68.4
2018-08-29,69.35
2018-08-30,69.05
2018-08-31,69.65
2018-09-04,69.7
2018-09-05,68.4
2018-09-06,67.85
2018-09-07,68.75
2018-09-10,69.25
2018-09-11,69.1
2018-09-12,69.9
2018-09-13,69.8
2018-09-14,69.6
2018-09-17,68.5
2018-09-18,68.8
2018-09-19,68.5
2018-09-20,69.2
2018-09-21,68.5
2018-09-24,69.1
2018-09-25,69.6
2018-09-26,69.75
2018-09-27,69.8
2018-09-28,70
2018-10-01,67.83
2018-10-02,65.85
2018-10-03,66.06
2018-10-04,66.05
2018-10-05,65.44
2018-10-08,63.8
2018-10-09,62.86
2018-10-10,59.8
2018-10-11,59.34
2018-10-12,60.08
2018-10-15,60.31
2018-10-16,62.14
2018-10-17,62.67
2018-10-18,60.35
2018-10-19,59.3
2018-10-22,60.31
2018-10-23,59.56
2018-10-24,58.11
2018-10-25,59.82
2018-10-26,57.97
2018-10-29,55.15
2018-10-30,55.36
2018-10-31,58.22
2018-11-01,60.37
2018-11-02,58.39
2018-11-05,58.35
2018-11-06,58.75
2018-11-07,60.36
2018-11-08,59.92
2018-11-09,59.44
2018-11-12,58.25
2018-11-13,57.86
2018-11-14,57.42
2018-11-15,58.85
2018-11-16,58.44
2018-11-19,55.82
2018-11-20,55.65
2018-11-21,57.39
2018-11-23,57.56
2018-11-26,57.53
2018-11-27,57.29
2018-11-28,58.84
2018-11-29,58.48
2018-11-30,58.94
2018-12-03,58.35
2018-12-04,56.7
2018-12-06,57.31
2018-12-07,56.24
2018-12-10,56.27
2018-12-11,57.24
2018-12-12,57.92
2018-12-13,58
2018-12-14,56.73
2018-12-17,55.99
2018-12-18,57.04
2018-12-19,58.01
2018-12-20,58
2018-12-21,55.26
2018-12-24,53.98
2018-12-26,57.61
2018-12-27,58.38
2018-12-28,57.77
2018-12-31,59.09
2019-01-02,57.44
2019-01-03,55.78
2019-01-04,58.06
2019-01-07,58.46
2019-01-08,59.93
2019-01-09,60.5
2019-01-10,60.81
2019-01-11,61.08
2019-01-14,60.2
2019-01-15,61.08
2019-01-16,61.55
2019-01-17,62.03
2019-01-18,62.53
2019-01-22,62.74
2019-01-23,62.79
2019-01-24,62.8
2019-01-25,62.28
2019-01-28,61.57
2019-01-29,63.42
2019-01-30,65.67
2019-01-31,66.07
2019-02-01,66.08
2019-02-04,67.65
2019-02-05,67.75
2019-02-06,68.3
2019-02-07,67.76
2019-02-08,68.36
2019-02-11,66.54
2019-02-12,67.67
2019-02-13,67.77
2019-02-14,67.83
2019-02-15,68.07
2019-02-19,68.58
2019-02-20,68.03
2019-02-21,68.4
2019-02-22,67.75
2019-02-25,66.97
2019-02-26,67.55
2019-02-27,67.44
2019-02-28,67.39
2019-03-01,67.5
2019-03-04,66.52
2019-03-05,65.42
2019-03-06,64.47
2019-03-07,64.69
2019-03-08,64.21
2019-03-11,65.44
2019-03-12,65.51
2019-03-13,65.12
2019-03-14,65.09
2019-03-15,64.63
2019-03-18,65.09
2019-03-19,65.83
2019-03-20,65.52
2019-03-21,66.69
2019-03-22,64.51
2019-03-25,63.67
2019-03-26,64.85
2019-03-27,64.5
2019-03-28,64.25
2019-03-29,64.74
2019-04-01,65.62
2019-04-02,62.31
2019-04-03,63.19
2019-04-04,63.13
2019-04-05,63
2019-04-08,63
2019-04-09,63.51
2019-04-10,63.41
2019-04-11,63.7
2019-04-12,63.13
2019-04-15,63.57
2019-04-16,62.68
2019-04-17,61.49
2019-04-18,61.27
2019-04-22,61.4
2019-04-23,62.13
2019-04-24,61.63
2019-04-25,61.28
2019-04-26,61.46
2019-04-29,61.52
2019-04-30,52.6
2019-05-01,52.6
2019-05-02,52.32
2019-05-03,52.85
2019-05-06,53.21
2019-05-07,51.69
2019-05-08,50.44
2019-05-09,49.99
2019-05-10,50.21
2019-05-13,48.91
2019-05-14,49.31
2019-05-15,49.88
2019-05-16,50
2019-05-17,49.27
2019-05-20,48.68
2019-05-21,48.82
2019-05-22,48.31
2019-05-23,47.49
2019-05-24,47.38
2019-05-28,46.54
2019-05-29,46.42
2019-05-30,46.76
2019-05-31,46.05
2019-06-03,46
2019-06-04,47.22
2019-06-05,47.06
2019-06-06,47.49
2019-06-07,47.38
2019-06-10,47.83
2019-06-11,47.69
2019-06-12,47.84
2019-06-13,48.045
2019-06-14,47.705
2019-06-17,48.08
2019-06-18,48.47
2019-06-19,48.56
2019-06-20,48.79
2019-06-21,48.68
2019-06-24,47.83
2019-06-25,47.275
2019-06-26,47.82
2019-06-27,48.27
2019-06-28,49.13
2019-07-01,49.955
2019-07-02,49.75
2019-07-03,50.91
2019-07-04,50.91
2019-07-05,51.07
2019-07-08,50.85
2019-07-09,50.735
2019-07-10,50.8
2019-07-11,50.595
2019-07-12,50.465
2019-07-15,50.365
2019-07-16,49.64
2019-07-17,50.16
2019-07-18,50.14
2019-07-19,49.79
2019-07-22,50.195
2019-07-23,49.83
2019-07-24,50.77
2019-07-25,49.71
2019-07-26,50.27
2019-07-29,50.495
2019-07-30,44.875
2019-07-31,45.415
2019-08-01,44.51
2019-08-02,43.52
2019-08-05,41.99
2019-08-06,42.645
2019-08-07,42.875
2019-08-08,44.27
2019-08-09,43.9
2019-08-12,43.33
2019-08-13,42.825
2019-08-14,42
2019-08-15,41.345
2019-08-16,41.92
2019-08-19,42.21
2019-08-20,41.47
2019-08-21,41.535
2019-08-22,41.735
2019-08-23,41.21
2019-08-26,41.61
2019-08-27,41.92
2019-08-28,41.995
2019-08-29,43.18
2019-08-30,43.39
2019-09-02,43.4
2019-09-03,43.09
2019-09-04,42.845
2019-09-05,44.61
2019-09-06,44.99
2019-09-09,45.83
2019-09-10,46.83
2019-09-11,47.3
2019-09-12,46.1
2019-09-13,45.99
2019-09-16,44.795
2019-09-17,45.03
2019-09-18,44.91
2019-09-19,44.48
2019-09-20,45.085
2019-09-23,45.035
2019-09-24,44.42
2019-09-25,45.165
2019-09-26,44.4
2019-09-27,43.755
2019-09-30,44.66
2019-10-01,44.655
2019-10-02,44.18
2019-10-03,45.31
2019-10-04,45.64
2019-10-07,45.675
2019-10-08,44.365
2019-10-09,45.01
2019-10-10,44.865
2019-10-11,45.51
2019-10-14,45.49
2019-10-15,45.3
2019-10-16,45.145
2019-10-17,45.735
2019-10-18,45.615
2019-10-21,45.89
2019-10-22,45.615
2019-10-23,45.75
2019-10-24,45.93
2019-10-25,46.96
2019-10-28,47.23
2019-10-29,49.14
2019-10-30,50.51
2019-10-31,49.67
2019-11-01,49.9
2019-11-04,50.08
2019-11-05,49.955
2019-11-06,49.555
2019-11-07,49.71
2019-11-08,49.5
2019-11-11,49.815
2019-11-12,49.72
2019-11-13,48.805
2019-11-14,48.585
2019-11-15,48.645
2019-11-18,49.17
2019-11-19,49.16
2019-11-20,49.34
2019-11-21,49.415
2019-11-22,49.915
2019-11-25,50.24
