date,close
2014-06-13,27.29
2014-06-16,27.09
2014-06-17,27.99
2014-06-18,28.3
2014-06-19,29.82
2014-06-20,32.15
2014-06-23,31.64
2014-06-24,30.17
2014-06-25,31.34
2014-06-26,31.5
2014-06-27,30.24
2014-06-30,31.98
2014-07-01,30.8
2014-07-02,30.06
2014-07-03,30.19
2014-07-07,31.04
2014-07-08,29.52
2014-07-09,28.54
2014-07-10,29.13
2014-07-11,28.43
2014-07-14,28.76
2014-07-15,28.32
2014-07-16,27.77
2014-07-17,25.77
2014-07-18,25.77
2014-07-21,25.77
2014-07-22,26.51
2014-07-23,24.8
2014-07-24,24.81
2014-07-25,24.39
2014-07-28,24.64
2014-07-29,25.12
2014-07-30,25.27
2014-07-31,24.88
2014-08-01,24.93
2014-08-04,26.06
2014-08-05,27.73
2014-08-06,28.31
2014-08-07,27.56
2014-08-08,27.07
2014-08-11,27.89
2014-08-12,28
2014-08-13,28.25
2014-08-14,29.77
2014-08-15,33.13
2014-08-18,35.95
2014-08-19,34.09
2014-08-20,34.68
2014-08-21,35.26
2014-08-22,34.91
2014-08-25,34.52
2014-08-26,33.67
2014-08-27,34.42
2014-08-28,33.31
2014-08-29,35.4
2014-09-02,34.77
2014-09-03,36.16
2014-09-04,37.7
2014-09-05,38.89
2014-09-08,41.81
2014-09-09,41.17
2014-09-10,47.11
2014-09-11,45.98
2014-09-12,47.71
2014-09-15,43.11
2014-09-16,42.57
2014-09-17,44.33
2014-09-18,45.41
2014-09-19,42.7
2014-09-22,39.08
2014-09-23,40.19
2014-09-24,42.38
2014-09-25,40.43
2014-09-26,40.85
2014-09-29,39.9
2014-09-30,42.81
2014-10-01,40.27
2014-10-02,43.27
2014-10-03,42.82
2014-10-06,40.51
2014-10-07,42.09
2014-10-08,42.39
2014-10-09,40.67
2014-10-10,36.45
2014-10-13,33.12
2014-10-14,34.17
2014-10-15,36.06
2014-10-16,40.1
2014-10-17,41.69
2014-10-20,41.96
2014-10-21,43.47
2014-10-22,38.85
2014-10-23,38.52
2014-10-24,39.15
2014-10-27,37.9
2014-10-28,40.48
2014-10-29,38.17
2014-10-30,35.04
2014-10-31,38.92
2014-11-03,38.45
2014-11-04,37.77
2014-11-05,35.75
2014-11-06,36.35
2014-11-07,35.38
2014-11-10,37.28
2014-11-11,35.21
2014-11-12,35.04
2014-11-13,32.53
2014-11-14,33.16
2014-11-17,32.16
2014-11-18,33.79
2014-11-19,32.94
2014-11-20,34.29
2014-11-21,34.24
2014-11-24,32.07
2014-11-25,32.24
2014-11-26,33.07
2014-11-28,30
2014-12-01,26.98
2014-12-02,27.57
2014-12-03,28.53
2014-12-04,28.04
2014-12-05,30.23
2014-12-08,26.16
2014-12-09,26.54
2014-12-10,23.82
2014-12-11,24.53
2014-12-12,24.7
2014-12-15,26.08
2014-12-16,26.6
2014-12-17,27.32
2014-12-18,27.8
2014-12-19,29.56
2014-12-22,29.73
2014-12-23,27.3
2014-12-24,28
2014-12-26,28.32
2014-12-29,26.72
2014-12-30,25.41
2014-12-31,26.34
2015-01-02,25.47
2015-01-05,23.33
2015-01-06,21.8
2015-01-07,22.67
2015-01-08,23.89
2015-01-09,23.98
2015-01-12,21.75
2015-01-13,22.4
2015-01-14,23
2015-01-15,21.5
2015-01-16,20.49
2015-01-20,18.23
2015-01-21,19.23
2015-01-22,19.61
2015-01-23,19.33
2015-01-26,19.36
2015-01-27,19.81
2015-01-28,19.53
2015-01-29,19.21
2015-01-30,19.68
2015-02-02,22.9
2015-02-03,23.34
2015-02-04,21.86
2015-02-05,19.82
2015-02-06,19.92
2015-02-09,19.89
2015-02-10,19.56
2015-02-11,19.73
2015-02-12,21.25
2015-02-13,21.04
2015-02-17,20.61
2015-02-18,20.35
2015-02-19,20.22
2015-02-20,20.81
2015-02-23,20.7
2015-02-24,20.6
2015-02-25,20.53
2015-02-26,21
2015-02-27,22.37
2015-03-02,28.1
2015-03-03,26.46
2015-03-04,26.65
2015-03-05,26.89
2015-03-06,26.99
2015-03-09,24.86
2015-03-10,22.41
2015-03-11,22.95
2015-03-12,24.16
2015-03-13,23.57
2015-03-16,21.87
2015-03-17,24.15
2015-03-18,24.12
2015-03-19,25.13
2015-03-20,27.6
2015-03-23,27.15
2015-03-24,28.46
2015-03-25,26.83
2015-03-26,26.14
2015-03-27,26.59
2015-03-30,26.34
2015-03-31,26.51
2015-04-01,27.01
2015-04-02,26.41
2015-04-06,26.84
2015-04-07,26.57
2015-04-08,26.14
2015-04-09,27.09
2015-04-10,29.2
2015-04-13,30.35
2015-04-14,30.11
2015-04-15,29.59
2015-04-16,30.6
2015-04-17,31.09
2015-04-20,29.78
2015-04-21,29.03
2015-04-22,29.06
2015-04-23,28.86
2015-04-24,29
2015-04-27,27.59
2015-04-28,27.81
2015-04-29,28.8
2015-04-30,27.45
2015-05-01,27.12
2015-05-04,26.7
2015-05-05,24.81
2015-05-06,24.52
2015-05-07,24
2015-05-08,23.49
2015-05-11,24.34
2015-05-12,25.86
2015-05-13,24.64
2015-05-14,25.12
2015-05-15,25.5
2015-05-18,24.93
2015-05-19,24.52
2015-05-20,23.84
2015-05-21,23.81
2015-05-22,22.82
2015-05-26,22.23
2015-05-27,22.51
2015-05-28,22.42
2015-05-29,22.04
2015-06-01,22.1
2015-06-02,22.55
2015-06-03,23.55
2015-06-04,22.73
2015-06-05,23.59
2015-06-08,22.68
2015-06-09,22.02
2015-06-10,22.87
2015-06-11,23.08
2015-06-12,24.53
2015-06-15,24.7
2015-06-16,23.39
2015-06-17,23.65
2015-06-18,25.15
2015-06-19,25.91
2015-06-22,23.67
2015-06-23,24.55
2015-06-24,23.97
2015-06-25,24.1
2015-06-26,22.72
2015-06-29,22.4
2015-06-30,23.55
2015-07-01,23.43
2015-07-02,22.34
2015-07-06,20.9
2015-07-07,18.42
2015-07-08,19.62
2015-07-09,20.32
2015-07-10,20.19
2015-07-13,20.38
2015-07-14,21.13
2015-07-15,20.43
2015-07-16,20.96
2015-07-17,20.51
2015-07-20,20.41
2015-07-21,19.97
2015-07-22,18.99
2015-07-23,19
2015-07-24,18.28
2015-07-27,17.66
2015-07-28,17.86
2015-07-29,18.25
2015-07-30,18.16
2015-07-31,17.558
2015-08-03,16.74
2015-08-04,16.29
2015-08-05,16.88
2015-08-06,17.06
2015-08-07,16.39
2015-08-10,17.53
2015-08-11,15.43
2015-08-12,16.01
2015-08-13,15.73
2015-08-14,16.24
2015-08-17,15.61
2015-08-18,14.72
2015-08-19,14.5
2015-08-20,13.79
2015-08-21,12.21
2015-08-24,11.61
2015-08-25,11.58
2015-08-26,12.26
2015-08-27,13.43
2015-08-28,14.13
2015-08-31,14.07
2015-09-01,13.39
2015-09-02,13.74
2015-09-03,13.91
2015-09-04,13.89
2015-09-08,15.08
2015-09-09,14.87
2015-09-10,15.0501
2015-09-11,17.34
2015-09-14,14.8
2015-09-15,14.8
2015-09-16,15.32
2015-09-17,15.16
2015-09-18,14.7
2015-09-21,14.77
2015-09-22,14.19
2015-09-23,15.8
2015-09-24,15.63
2015-09-25,15.4
2015-09-28,14.99
2015-09-29,14.9
2015-09-30,15.99
2015-10-01,15.81
2015-10-02,17.83
2015-10-05,18.37
2015-10-06,18.15
2015-10-07,18.23
2015-10-08,18.24
2015-10-09,18.32
2015-10-12,18.1
2015-10-13,18.34
2015-10-14,18.88
2015-10-15,18.98
2015-10-16,18.65
2015-10-19,18.99
2015-10-20,18.29
2015-10-21,17.39
2015-10-22,17.53
2015-10-23,16.8
2015-10-26,16.62
2015-10-27,16.19
2015-10-28,16.58
2015-10-29,16.41
2015-10-30,16.7
2015-11-02,16.74
2015-11-03,16.34
2015-11-04,16.41
2015-11-05,16.33
2015-11-06,16.3
2015-11-09,15.94
2015-11-10,13.69
2015-11-11,15.11
2015-11-12,13.23
2015-11-13,12.76
2015-11-16,12.7
2015-11-17,12.16
2015-11-18,14.05
2015-11-19,14.04
2015-11-20,15.05
2015-11-23,15.37
2015-11-24,15.49
2015-11-25,15.31
2015-11-27,15.41
2015-11-30,15.83
2015-12-01,16.1
2015-12-02,16.23
2015-12-03,16.68
2015-12-04,17.04
2015-12-07,17.74
2015-12-08,17.37
2015-12-09,17.51
2015-12-10,16.57
2015-12-11,16.14
2015-12-14,16.16
2015-12-15,17.14
2015-12-16,17.22
2015-12-17,16.15
2015-12-18,17.34
2015-12-21,16.77
2015-12-22,16.95
2015-12-23,17.34
2015-12-24,17.75
2015-12-28,17.61
2015-12-29,17.09
2015-12-30,16.46
2015-12-31,16.65
2016-01-04,16.6
2016-01-05,16.37
2016-01-06,15.65
2016-01-07,14.67
2016-01-08,15.39
2016-01-11,14.21
2016-01-12,14
2016-01-13,13.1
2016-01-14,13.16
2016-01-15,12.9
2016-01-19,12.4
2016-01-20,12.73
2016-01-21,12.91
2016-01-22,13.21
2016-01-25,13.38
2016-01-26,13.68
2016-01-27,13.8
2016-01-28,14.6
2016-01-29,15.28
2016-02-01,15.74
2016-02-02,15.16
2016-02-03,15.82
2016-02-04,17
2016-02-05,16.27
2016-02-08,14.03
2016-02-09,13.9
2016-02-10,14.09
2016-02-11,13.72
2016-02-12,14.21
2016-02-16,14.75
2016-02-17,15.59
2016-02-18,16.41
2016-02-19,16.5
2016-02-22,18.97
2016-02-23,17.99
2016-02-24,18.73
2016-02-25,18.6
2016-02-26,18.97
2016-02-29,18.44
2016-03-01,19.04
2016-03-02,18.9
2016-03-03,18.62
2016-03-04,19.01
2016-03-07,18.95
2016-03-08,18.88
2016-03-09,19.2
2016-03-10,19.25
2016-03-11,19.04
2016-03-14,19.05
2016-03-15,18.75
2016-03-16,18.5
2016-03-17,18.35
2016-03-18,17.8
2016-03-21,17.55
2016-03-22,18.16
2016-03-23,17.59
2016-03-24,17.59
2016-03-28,16.9
2016-03-29,16.8
2016-03-30,18.14
2016-03-31,18.61
2016-04-01,18.6
2016-04-04,18.93
2016-04-05,18.7
2016-04-06,18.92
2016-04-07,19.04
2016-04-08,19.03
2016-04-11,18.95
2016-04-12,19.37
2016-04-13,21.03
2016-04-14,24
2016-04-15,22.97
2016-04-18,25.39
2016-04-19,25.26
2016-04-20,25.5
2016-04-21,25.87
2016-04-22,26.07
2016-04-25,24.01
2016-04-26,25.04
2016-04-27,25.97
2016-04-28,26.95
2016-04-29,25.95
2016-05-02,24.66
2016-05-03,24.69
2016-05-04,24.65
2016-05-05,25.79
2016-05-06,25.38
2016-05-09,24.75
2016-05-10,25.06
2016-05-11,26.41
2016-05-12,26.03
2016-05-13,24.32
2016-05-16,25.54
2016-05-17,24.52
2016-05-18,24.5
2016-05-19,23.87
2016-05-20,24.3
2016-05-23,25.48
2016-05-24,26.17
2016-05-25,26.12
2016-05-26,24.98
2016-05-27,24.69
2016-05-31,24.87
2016-06-01,24.52
2016-06-02,24.02
2016-06-03,22.73
2016-06-06,22.48
2016-06-07,24.21
2016-06-08,24.78
2016-06-09,23.98
2016-06-10,23
2016-06-13,22.09
2016-06-14,21.59
2016-06-15,21.68
2016-06-16,21.3
2016-06-17,20
2016-06-20,20.51
2016-06-21,20.05
2016-06-22,20.15
2016-06-23,21.1
2016-06-24,21.1
2016-06-27,21.7
2016-06-28,22.98
2016-06-29,21.73
2016-06-30,22.57
2016-07-01,23.19
2016-07-05,22.95
2016-07-06,23.34
2016-07-07,22.75
2016-07-08,23.33
2016-07-11,23.53
2016-07-12,23.21
2016-07-13,22.85
2016-07-14,21.83
2016-07-15,21.99
2016-07-18,22.02
2016-07-19,22.01
2016-07-20,21.93
2016-07-21,22.2
2016-07-22,22.24
2016-07-25,22.2
2016-07-26,21.88
2016-07-27,21.95
2016-07-28,21.87
2016-07-29,22.86
2016-08-01,22.9
2016-08-02,23.98
2016-08-03,25.45
2016-08-04,24.41
2016-08-05,24.63
2016-08-08,25.81
2016-08-09,24.8
2016-08-10,25.25
2016-08-11,23.15
2016-08-12,23.4
2016-08-15,23.5
2016-08-16,23.2
2016-08-17,23.96
2016-08-18,24.55
2016-08-19,24.39
2016-08-22,24.77
2016-08-23,24.84
2016-08-24,24.59
2016-08-25,24.43
2016-08-26,24.64
2016-08-29,24.71
2016-08-30,24.68
2016-08-31,24.06
2016-09-01,24.34
2016-09-02,24.87
2016-09-06,24.86
2016-09-07,24.58
2016-09-08,25.13
2016-09-09,24.87
2016-09-12,25.44
2016-09-13,24.48
2016-09-14,23.62
2016-09-15,23
2016-09-16,22.1
2016-09-19,20.35
2016-09-20,19.93
2016-09-21,19.89
2016-09-22,20.21
2016-09-23,20.93
2016-09-26,20.94
2016-09-27,21.78
2016-09-28,22.41
2016-09-29,21.19
2016-09-30,21.2
2016-10-03,21.64
2016-10-04,20.45
2016-10-05,21.45
2016-10-06,22.45
2016-10-07,22.99
2016-10-10,23.09
2016-10-11,22.64
2016-10-12,22.26
2016-10-13,23.46
2016-10-14,22.63
2016-10-17,23.15
2016-10-18,23.12
2016-10-19,23.47
2016-10-20,23.8
2016-10-21,23.4
2016-10-24,23.56
2016-10-25,23.42
2016-10-26,23.49
2016-10-27,23.46
2016-10-28,23.27
2016-10-31,22.61
2016-11-01,22.67
2016-11-02,23.5
2016-11-03,23.35
2016-11-04,23.23
2016-11-07,23.42
2016-11-08,23.24
2016-11-09,23.27
2016-11-10,22.31
2016-11-11,22.33
2016-11-14,21.89
2016-11-15,23.03
2016-11-16,22.87
2016-11-17,22.63
2016-11-18,21.36
2016-11-21,20.7
2016-11-22,21.15
2016-11-23,21.65
2016-11-25,21.86
2016-11-28,20.38
2016-11-29,20.02
2016-11-30,20.2
2016-12-01,19.96
2016-12-02,19.92
2016-12-05,19.92
2016-12-06,19.73
2016-12-07,21.25
2016-12-08,21.23
2016-12-09,21.17
2016-12-12,20.79
2016-12-13,21.25
2016-12-14,20.97
2016-12-15,20.41
2016-12-16,20.71
2016-12-19,20.85
2016-12-20,21.31
2016-12-21,21.27
2016-12-22,20.89
2016-12-23,20.5
2016-12-27,19.9
2016-12-28,19.67
2016-12-29,19.6
2016-12-30,19.3
2017-01-03,19.85
2017-01-04,19.76
2017-01-05,20.22
2017-01-06,20.47
2017-01-09,20.61
2017-01-10,20.62
2017-01-11,21.14
2017-01-12,21.26
2017-01-13,21.33
2017-01-17,22.84
2017-01-18,22.84
2017-01-19,22.95
2017-01-20,23.28
2017-01-23,23.11
2017-01-24,22.9
2017-01-25,23.36
2017-01-26,23.27
2017-01-27,25.05
2017-01-30,24.19
2017-01-31,24.42
2017-02-01,24.8
2017-02-02,24.51
2017-02-03,24.51
2017-02-06,24.05
2017-02-07,22.47
2017-02-08,23.5
2017-02-09,23.62
2017-02-10,23.5
2017-02-13,23.5
2017-02-14,23.82
2017-02-15,25.39
2017-02-16,25
2017-02-17,25.07
2017-02-21,26.18
2017-02-22,26.95
2017-02-23,26.22
2017-02-24,25.79
2017-02-27,25.63
2017-02-28,24.79
2017-03-01,23.02
2017-03-02,23.45
2017-03-03,24.47
2017-03-06,25.51
2017-03-07,23.94
2017-03-08,23.32
2017-03-09,23.49
2017-03-10,23.78
2017-03-13,23.15
2017-03-14,22.83
2017-03-15,22.32
2017-03-16,23.08
2017-03-17,22.1
2017-03-20,22.32
2017-03-21,21.95
2017-03-22,21.81
2017-03-23,21.72
2017-03-24,21.91
2017-03-27,20.65
2017-03-28,20.96
2017-03-29,19.76
2017-03-30,18.92
2017-03-31,18.77
2017-04-03,18.74
2017-04-04,18.51
2017-04-05,18.87
2017-04-06,19.65
2017-04-07,19.45
2017-04-10,20.07
2017-04-11,19.79
2017-04-12,19.08
2017-04-13,18.76
2017-04-17,18.35
2017-04-18,18.77
2017-04-19,18.88
2017-04-20,18.63
2017-04-21,18.31
2017-04-24,18.51
2017-04-25,18.48
2017-04-26,18.79
2017-04-27,18.57
2017-04-28,18.61
2017-05-01,18.96
2017-05-02,18.74
2017-05-03,18.84
2017-05-04,18.52
2017-05-05,18.9
2017-05-08,19.71
2017-05-09,22.18
2017-05-10,23.55
2017-05-11,23.92
2017-05-12,23.26
2017-05-15,23.27
2017-05-16,23.66
2017-05-17,22.32
2017-05-18,22.05
2017-05-19,22.54
2017-05-22,23.3
2017-05-23,23.04
2017-05-24,23.02
2017-05-25,22.75
2017-05-26,22.35
2017-05-30,21.81
2017-05-31,21.76
2017-06-01,21.59
2017-06-02,21.06
2017-06-05,20.22
2017-06-06,20.07
2017-06-07,20.37
2017-06-08,21.37
2017-06-09,19.93
2017-06-12,19.61
2017-06-13,21.11
2017-06-14,19.84
2017-06-15,19.32
2017-06-16,19.8
2017-06-19,19.41
2017-06-20,19.28
2017-06-21,19.03
2017-06-22,19.29
2017-06-23,20.1
2017-06-26,19.73
2017-06-27,20.06
2017-06-28,20.77
2017-06-29,20.76
2017-06-30,20.76
2017-07-03,20.25
2017-07-05,20
2017-07-06,19.77
2017-07-07,20.4
2017-07-10,20
2017-07-11,20.41
2017-07-12,20.9
2017-07-13,20.51
2017-07-14,21.4
2017-07-17,20.75
2017-07-18,22.17
2017-07-19,23.71
2017-07-20,23.42
2017-07-21,23.75
2017-07-24,24.62
2017-07-25,24.83
2017-07-26,25
2017-07-27,24.15
2017-07-28,24.37
2017-07-31,25.36
2017-08-01,25.28
2017-08-02,25.27
2017-08-03,25.28
2017-08-04,27.6
2017-08-07,29.35
2017-08-08,26.39
2017-08-09,27.15
2017-08-10,25.68
2017-08-11,26.18
2017-08-14,26.46
2017-08-15,26.57
2017-08-16,25.46
2017-08-17,24.74
2017-08-18,25.33
2017-08-21,24
2017-08-22,24.34
2017-08-23,24.51
2017-08-24,24.95
2017-08-25,25.2
2017-08-28,25.21
2017-08-29,24.33
2017-08-30,25.05
2017-08-31,25.44
2017-09-01,26.45
2017-09-05,25.78
2017-09-06,26.26
2017-09-07,26.52
2017-09-08,26.56
2017-09-11,27.01
2017-09-12,26.1
2017-09-13,25.96
2017-09-14,26.62
2017-09-15,28.15
2017-09-18,28.72
2017-09-19,29.42
2017-09-20,28.22
2017-09-21,27.97
2017-09-22,28.34
2017-09-25,27.46
2017-09-26,27.61
2017-09-27,28.5
2017-09-28,29.49
2017-09-29,29.02
2017-10-02,28.88
2017-10-03,30.38
2017-10-04,29.94
2017-10-05,30.63
2017-10-06,30.42
2017-10-09,31.93
2017-10-10,34.38
2017-10-11,32.6
2017-10-12,32.6
2017-10-13,32.98
2017-10-16,31.75
2017-10-17,30.46
2017-10-18,31.69
2017-10-19,32.7
2017-10-20,36.95
2017-10-23,36.07
2017-10-24,36.87
2017-10-25,35.92
2017-10-26,35.62
2017-10-27,36.73
2017-10-30,37.98
2017-10-31,37.7
2017-11-01,40.24
2017-11-02,40.37
2017-11-03,39.78
2017-11-06,39.81
2017-11-07,39.35
2017-11-08,40.45
2017-11-09,38.99
2017-11-10,39.81
2017-11-13,40.17
2017-11-14,42.85
2017-11-15,39.78
2017-11-16,39.87
2017-11-17,43.06
2017-11-20,47.03
2017-11-21,46.3
2017-11-22,49.45
2017-11-24,53.35
2017-11-27,51.36
2017-11-28,53.82
2017-11-29,52.01
2017-11-30,54.58
2017-12-01,56.95
2017-12-04,47.04
2017-12-05,49.21
2017-12-06,47.37
2017-12-07,46.48
2017-12-08,49.41
2017-12-11,52.2
2017-12-12,50.6
2017-12-13,48.33
2017-12-14,46.83
2017-12-15,47.17
2017-12-18,50.26
2017-12-19,48.5
2017-12-20,48.01
2017-12-21,50.89
2017-12-22,54
2017-12-26,52.9
2017-12-27,57.21
2017-12-28,60.67
2017-12-29,59.44
2018-01-02,62.57
2018-01-03,63.14
2018-01-04,62.5
2018-01-05,64.78
2018-01-08,55.85
2018-01-09,59.93
2018-01-10,60.53
2018-01-11,64
2018-01-12,68.24
2018-01-16,64.25
2018-01-17,63.6
2018-01-18,63.47
2018-01-19,61
2018-01-22,63.25
2018-01-23,62.55
2018-01-24,58.66
2018-01-25,59.22
2018-01-26,58.49
2018-01-29,60.59
2018-01-30,57.16
2018-01-31,54.44
2018-02-01,53.38
2018-02-02,51.46
2018-02-05,48.38
2018-02-06,52.3
2018-02-07,50.13
2018-02-08,49.02
2018-02-09,49.73
2018-02-12,49.48
2018-02-13,51.57
2018-02-14,53.39
2018-02-15,53.29
2018-02-16,53.27
2018-02-20,61.51
2018-02-21,62.31
2018-02-22,61.91
2018-02-23,59.61
2018-02-26,56.7
2018-02-27,55.39
2018-02-28,49.14
2018-03-01,47.73
2018-03-02,47.97
2018-03-05,46.73
2018-03-06,47.2
2018-03-07,48.27
2018-03-08,45.1
2018-03-09,44.55
2018-03-12,47.08
2018-03-13,45.01
2018-03-14,45.06
2018-03-15,45.4
2018-03-16,47.46
2018-03-19,44.44
2018-03-20,46
2018-03-21,50.22
2018-03-22,50.77
2018-03-23,49.59
2018-03-26,51.12
2018-03-27,47.52
2018-03-28,46.72
2018-03-29,48.95
2018-04-02,48.58
2018-04-03,50.96
2018-04-04,54.55
2018-04-05,53.8
2018-04-06,55.84
2018-04-09,57.42
2018-04-10,61.06
2018-04-11,59.26
2018-04-12,52.97
2018-04-13,51.65
2018-04-16,51.29
2018-04-17,52.29
2018-04-18,54.64
2018-04-19,53.32
2018-04-20,54.51
2018-04-23,53.8
2018-04-24,53.1
2018-04-25,52.03
2018-04-26,54.58
2018-04-27,54.49
2018-04-30,53.35
2018-05-01,52.45
2018-05-02,54.32
2018-05-03,53.21
2018-05-04,54.01
2018-05-07,54.35
2018-05-08,54.32
2018-05-09,54.91
2018-05-10,54.93
2018-05-11,55.11
2018-05-14,60.26
2018-05-15,59.07
2018-05-16,67.27
2018-05-17,65.12
2018-05-18,64.87
2018-05-21,65.52
2018-05-22,67.98
2018-05-23,63.75
2018-05-24,64.59
2018-05-25,65.7
2018-05-29,65.02
2018-05-30,57.15
2018-05-31,57.66
2018-06-01,52.72
2018-06-04,41.8
2018-06-05,42.19
2018-06-06,40.16
2018-06-07,40.16
2018-06-08,39.96
2018-06-11,39.37
2018-06-12,39.93
2018-06-13,39.69
2018-06-14,37.74
2018-06-15,35.12
2018-06-18,34.72
2018-06-19,35.38
2018-06-20,34.92
2018-06-21,34.62
2018-06-22,35.27
2018-06-25,33.5
2018-06-26,35.21
2018-06-27,35.1
2018-06-28,35.51
2018-06-29,35.54
2018-07-02,36.38
2018-07-03,37.1
2018-07-05,38.69
2018-07-06,38.55
2018-07-09,39.39
2018-07-10,38.13
2018-07-11,37.18
2018-07-12,37.33
2018-07-13,37.35
2018-07-16,35.48
2018-07-17,36.19
2018-07-18,37.64
2018-07-19,37.4
2018-07-20,36.85
2018-07-23,37.86
2018-07-24,38.25
2018-07-25,38.55
2018-07-26,37.91
2018-07-27,36.99
2018-07-30,36.07
2018-07-31,35.27
2018-08-01,36.1
2018-08-02,35.23
2018-08-03,35.5
2018-08-06,37.47
2018-08-07,40.3
2018-08-08,40.01
2018-08-09,39.85
2018-08-10,38.7
2018-08-13,37.09
2018-08-14,37.66
2018-08-15,36.72
2018-08-16,37.11
2018-08-17,35.13
2018-08-20,35.2
2018-08-21,34.33
2018-08-22,33.59
2018-08-23,34.12
2018-08-24,36.66
2018-08-27,37.15
2018-08-28,36.85
2018-08-29,37.23
2018-08-30,35.13
2018-08-31,35.67
2018-09-04,35.84
2018-09-05,33.09
2018-09-06,33.33
2018-09-07,31.05
2018-09-10,31.28
2018-09-11,31.72
2018-09-12,31.11
2018-09-13,31.65
2018-09-14,30.8
2018-09-17,29.57
2018-09-18,29.76
2018-09-19,29.55
2018-09-20,30.87
2018-09-21,30.21
2018-09-24,30.75
2018-09-25,27.74
2018-09-26,26.63
2018-09-27,25.57
2018-09-28,26.11
2018-10-01,26.41
2018-10-02,27.5
2018-10-03,28.02
2018-10-04,27.3
2018-10-05,26.37
2018-10-08,26.3
2018-10-09,26.15
2018-10-10,25.12
2018-10-11,25.19
2018-10-12,25.75
2018-10-15,27.03
2018-10-16,27.8
2018-10-17,24.93
2018-10-18,24.61
2018-10-19,23.16
2018-10-22,22.96
2018-10-23,22.38
2018-10-24,21.01
2018-10-25,21.87
2018-10-26,21.05
2018-10-29,20.92
2018-10-30,21.17
2018-10-31,21.35
2018-11-01,24.16
2018-11-02,25.72
2018-11-05,26.18
2018-11-06,26.97
2018-11-07,28.06
2018-11-08,25.66
2018-11-09,25.62
2018-11-12,25
2018-11-13,21.43
2018-11-14,21.62
2018-11-15,23.19
2018-11-16,24.25
2018-11-19,24.19
2018-11-20,23
2018-11-21,23.96
2018-11-23,23.79
2018-11-26,22.79
2018-11-27,25.5
2018-11-28,27.17
2018-11-29,26
2018-11-30,26.12
2018-12-03,26.5
2018-12-04,24.97
2018-12-06,25.01
2018-12-07,24.3
2018-12-10,25.12
2018-12-11,24.71
2018-12-12,25.33
2018-12-13,25.48
2018-12-14,24.59
2018-12-17,24.37
2018-12-18,24.78
2018-12-19,24.74
2018-12-20,23.79
2018-12-21,22.19
2018-12-24,22.57
2018-12-26,23.45
2018-12-27,23.94
2018-12-28,23.58
2018-12-31,23.4
2019-01-02,24.05
2019-01-03,23.3
2019-01-04,24.74
2019-01-07,26.56
2019-01-08,26.05
2019-01-09,25.82
2019-01-10,26.86
2019-01-11,26.48
2019-01-14,25.79
2019-01-15,25.81
2019-01-16,27.08
2019-01-17,28.05
2019-01-18,29.33
2019-01-22,30.28
2019-01-23,31.18
2019-01-24,33.16
2019-01-25,34.54
2019-01-28,34.69
2019-01-29,33.68
2019-01-30,36.93
2019-01-31,40.06
2019-02-01,34.78
2019-02-04,34.31
2019-02-05,33.66
2019-02-06,34.24
2019-02-07,32.48
2019-02-08,31.35
2019-02-11,33.22
2019-02-12,34.31
2019-02-13,34.31
2019-02-14,34.97
2019-02-15,30.6
2019-02-19,33.82
2019-02-20,33.67
2019-02-21,35.63
2019-02-22,39.85
2019-02-25,39.05
2019-02-26,36.88
2019-02-27,36.37
2019-02-28,36.38
2019-03-01,38.67
2019-03-04,38
2019-03-05,36.36
2019-03-06,35.13
2019-03-07,33.51
2019-03-08,32.4
2019-03-11,34.28
2019-03-12,34.26
2019-03-13,33.68
2019-03-14,33.63
2019-03-15,32.89
2019-03-18,33.6
2019-03-19,35.26
2019-03-20,35.7
2019-03-21,32.64
2019-03-22,31.45
2019-03-25,31.7
2019-03-26,31.17
2019-03-27,31.05
2019-03-28,32.37
2019-03-29,33.03
2019-04-01,35.52
2019-04-02,34.88
2019-04-03,34.28
2019-04-04,35.62
2019-04-05,36.24
2019-04-08,36.86
2019-04-09,35.11
2019-04-10,35.13
2019-04-11,33.45
2019-04-12,35.08
2019-04-15,34.74
2019-04-16,35.63
2019-04-17,37.47
2019-04-18,37.3
2019-04-22,37.63
2019-04-23,37.89
2019-04-24,37.95
2019-04-25,37.46
2019-04-26,37.38
2019-04-29,36.99
2019-04-30,37.05
2019-05-01,37.14
2019-05-02,37.98
2019-05-03,38.26
2019-05-06,35.67
2019-05-07,35.73
2019-05-08,35.19
2019-05-09,33.72
2019-05-10,34.41
2019-05-13,32.4
2019-05-14,33.4
2019-05-15,34.88
2019-05-16,36.25
2019-05-17,32.77
2019-05-20,31.14
2019-05-21,35.88
2019-05-22,38.55
2019-05-23,36.44
2019-05-24,36.56
2019-05-28,36.57
2019-05-29,35.95
2019-05-30,37.76
2019-05-31,38
2019-06-03,43.07
2019-06-04,42.14
2019-06-05,41.88
2019-06-06,41.46
2019-06-07,42.38
2019-06-10,45.72
2019-06-11,45.04
2019-06-12,43.97
2019-06-13,45.45
2019-06-14,45.44
2019-06-17,41.825
2019-06-18,42.7
2019-06-19,44.01
2019-06-20,42.925
2019-06-21,42.5
2019-06-24,42.855
2019-06-25,40.27
2019-06-26,40.82
2019-06-27,41.53
2019-06-28,42.345
2019-07-01,44.23
2019-07-02,43.63
2019-07-03,42.47
2019-07-04,42.47
2019-07-05,43.375
2019-07-08,41.38
2019-07-09,40.63
2019-07-10,41.11
2019-07-11,38.87
2019-07-12,42.17
2019-07-15,42.92
2019-07-16,41.78
2019-07-17,42.81
2019-07-18,42.83
2019-07-19,44.54
2019-07-22,42.78
2019-07-23,43.55
2019-07-24,43.925
2019-07-25,42.82
2019-07-26,43.12
2019-07-29,42.14
2019-07-30,43.37
2019-07-31,41.9
2019-08-01,42.49
2019-08-02,43.55
2019-08-05,39.78
2019-08-06,40.51
2019-08-07,41.27
2019-08-08,42.8
2019-08-09,42.065
2019-08-12,43.155
2019-08-13,42.38
2019-08-14,39.75
2019-08-15,41.39
2019-08-16,43.78
2019-08-19,44.32
2019-08-20,45.415
2019-08-21,52.78
2019-08-22,50.11
2019-08-23,48.695
2019-08-26,50.82
2019-08-27,51.405
2019-08-28,51.49
2019-08-29,51.46
2019-08-30,51.585
2019-09-02,51.585
2019-09-03,50.33
2019-09-04,51.63
2019-09-05,50.97
2019-09-06,51.075
2019-09-09,48.27
2019-09-10,48.33
2019-09-11,49.38
2019-09-12,47.715
2019-09-13,48.47
2019-09-16,51.11
2019-09-17,51.22
2019-09-18,51.27
2019-09-19,51.23
2019-09-20,51.02
2019-09-23,51.5
2019-09-24,48.11
2019-09-25,47.54
2019-09-26,46.505
2019-09-27,44.82
2019-09-30,45.975
2019-10-01,44.835
2019-10-02,43.81
2019-10-03,44.355
2019-10-04,45.38
2019-10-07,43.72
2019-10-08,43.775
2019-10-09,43.83
2019-10-10,43.97
2019-10-11,43.54
2019-10-14,43.985
2019-10-15,43.56
2019-10-16,40.62
2019-10-17,40.76
2019-10-18,40.4
2019-10-21,39.825
2019-10-22,39.46
2019-10-23,39.335
2019-10-24,41.37
2019-10-25,40.92
2019-10-28,39.795
2019-10-29,39.61
2019-10-30,36.815
2019-10-31,37.68
2019-11-01,38.725
2019-11-04,37.47
2019-11-05,37.53
2019-11-06,37.38
2019-11-07,36.38
2019-11-08,36.805
2019-11-11,36.825
2019-11-12,40.445
2019-11-13,38.12
2019-11-14,38.98
2019-11-15,39.08
2019-11-18,38.79
2019-11-19,38.77
2019-11-20,39.48
2019-11-21,37.505
2019-11-22,37.94
2019-11-25,36.92
