date,close
2014-06-13,25.11
2014-06-16,27.99
2014-06-17,28.13
2014-06-18,28.64
2014-06-19,28.98
2014-06-20,29.33
2014-06-23,30.56
2014-06-24,30.14
2014-06-25,29.14
2014-06-26,30.54
2014-06-27,30.08
2014-06-30,26
2014-07-01,26.48
2014-07-02,26.26
2014-07-03,26.38
2014-07-07,25.86
2014-07-08,25.31
2014-07-09,25.81
2014-07-10,24.98
2014-07-11,23.8
2014-07-14,23.09
2014-07-15,20.5
2014-07-16,19.59
2014-07-17,19.09
2014-07-18,19.78
2014-07-21,20.33
2014-07-22,20.5
2014-07-23,20.35
2014-07-24,20.03
2014-07-25,20.01
2014-07-28,19.52
2014-07-29,19.14
2014-07-30,19.67
2014-07-31,18.18
2014-08-01,17.29
2014-08-04,16.24
2014-08-05,15.94
2014-08-06,17.046
2014-08-07,17
2014-08-08,17.01
2014-08-11,17.26
2014-08-12,17.29
2014-08-13,17.69
2014-08-14,17.49
2014-08-15,17.14
2014-08-18,17.9
2014-08-19,17.48
2014-08-20,16.79
2014-08-21,17.16
2014-08-22,18.42
2014-08-25,20.72
2014-08-26,20.16
2014-08-27,20.82
2014-08-28,20.33
2014-08-29,20.26
2014-09-02,20.03
2014-09-03,19.5
2014-09-04,18.58
2014-09-05,17.96
2014-09-08,18.91
2014-09-09,18.07
2014-09-10,18.56
2014-09-11,18.08
2014-09-12,17.98
2014-09-15,16.94
2014-09-16,17.13
2014-09-17,17.23
2014-09-18,16.96
2014-09-19,16.7
2014-09-22,17.29
2014-09-23,16.86
2014-09-24,17.48
2014-09-25,17.52
2014-09-26,18.79
2014-09-29,20.3
2014-09-30,21.48
2014-10-01,21.76
2014-10-02,25.94
2014-10-03,28.78
2014-10-06,28.52
2014-10-07,28.46
2014-10-08,29.22
2014-10-09,28.78
2014-10-10,27.36
2014-10-13,27.38
2014-10-14,24.53
2014-10-15,24.66
2014-10-16,25.39
2014-10-17,23.54
2014-10-20,24.14
2014-10-21,24.38
2014-10-22,23.39
2014-10-23,23.96
2014-10-24,22.76
2014-10-27,22.58
2014-10-28,22.63
2014-10-29,21.71
2014-10-30,20.99
2014-10-31,21.72
2014-11-03,22.89
2014-11-04,22.27
2014-11-05,21.27
2014-11-06,20.8
2014-11-07,20.35
2014-11-10,20.51
2014-11-11,20.45
2014-11-12,20.4
2014-11-13,20.73
2014-11-14,20.69
2014-11-17,20.79
2014-11-18,21.39
2014-11-19,20.28
2014-11-20,20.11
2014-11-21,20.01
2014-11-24,19.85
2014-11-25,19.72
2014-11-26,20.28
2014-11-28,20.22
2014-12-01,18.18
2014-12-02,18.88
2014-12-03,18.7
2014-12-04,18.3
2014-12-05,19.27
2014-12-08,18.71
2014-12-09,18.68
2014-12-10,17.47
2014-12-11,17.25
2014-12-12,17.73
2014-12-15,17.28
2014-12-16,17.29
2014-12-17,17.94
2014-12-18,18.25
2014-12-19,17.94
2014-12-22,19.35
2014-12-23,18.44
2014-12-24,18.47
2014-12-26,18.72
2014-12-29,18.92
2014-12-30,19.28
2014-12-31,19.19
2015-01-02,18.55
2015-01-05,18.27
2015-01-06,18.27
2015-01-07,19.26
2015-01-08,21.6
2015-01-09,23.55
2015-01-12,24.57
2015-01-13,26
2015-01-14,23.15
2015-01-15,20.15
2015-01-16,20.96
2015-01-20,20.59
2015-01-21,20.35
2015-01-22,21.34
2015-01-23,20.4
2015-01-26,21.97
2015-01-27,21.66
2015-01-28,20.485
2015-01-29,22.92
2015-01-30,21.5
2015-02-02,21.25
2015-02-03,22.27
2015-02-04,21.76
2015-02-05,22.16
2015-02-06,22.1
2015-02-09,22.74
2015-02-10,23.09
2015-02-11,23.02
2015-02-12,23.19
2015-02-13,22.86
2015-02-17,22.96
2015-02-18,22.09
2015-02-19,19.43
2015-02-20,18.05
2015-02-23,18
2015-02-24,18.37
2015-02-25,19.03
2015-02-26,20.24
2015-02-27,20
2015-03-02,19.77
2015-03-03,18.71
2015-03-04,17.8
2015-03-05,17.94
2015-03-06,18.15
2015-03-09,19.23
2015-03-10,18.55
2015-03-11,18.82
2015-03-12,19.72
2015-03-13,20.02
2015-03-16,20.81
2015-03-17,20.69
2015-03-18,20.91
2015-03-19,21.98
2015-03-20,21.37
2015-03-23,21.33
2015-03-24,21.02
2015-03-25,20.52
2015-03-26,21.48
2015-03-27,22.3
2015-03-30,22.76
2015-03-31,22.5
2015-04-01,22.92
2015-04-02,22.7
2015-04-06,22.4
2015-04-07,21.94
2015-04-08,22.11
2015-04-09,21.61
2015-04-10,21.6
2015-04-13,22.17
2015-04-14,21.97
2015-04-15,22.29
2015-04-16,22.15
2015-04-17,22.05
2015-04-20,22.97
2015-04-21,23.52
2015-04-22,23.62
2015-04-23,23.62
2015-04-24,23.5
2015-04-27,23.23
2015-04-28,23.59
2015-04-29,23.59
2015-04-30,22.8
2015-05-01,21.86
2015-05-04,22.43
2015-05-05,21.82
2015-05-06,22.24
2015-05-07,22.47
2015-05-08,22.46
2015-05-11,22.62
2015-05-12,22.6
2015-05-13,22.49
2015-05-14,23.13
2015-05-15,23.08
2015-05-18,23.82
2015-05-19,23.61
2015-05-20,23.39
2015-05-21,23.15
2015-05-22,22.87
2015-05-26,22.66
2015-05-27,22.55
2015-05-28,22.46
2015-05-29,22.32
2015-06-01,22.51
2015-06-02,23.79
2015-06-03,24.37
2015-06-04,25.91
2015-06-05,27.29
2015-06-08,28.58
2015-06-09,27.88
2015-06-10,27.57
2015-06-11,26.75
2015-06-12,26.72
2015-06-15,25.68
2015-06-16,25.05
2015-06-17,24.62
2015-06-18,24.78
2015-06-19,25.45
2015-06-22,26.48
2015-06-23,27.46
2015-06-24,26.83
2015-06-25,27.03
2015-06-26,27.09
2015-06-29,26.41
2015-06-30,25.81
2015-07-01,25.31
2015-07-02,25.28
2015-07-06,24.79
2015-07-07,24.44
2015-07-08,24.61
2015-07-09,24.78
2015-07-10,24.91
2015-07-13,25.24
2015-07-14,25.01
2015-07-15,25.14
2015-07-16,26.71
2015-07-17,26.48
2015-07-20,28.68
2015-07-21,28.55
2015-07-22,30.25
2015-07-23,28.88
2015-07-24,28.03
2015-07-27,26.91
2015-07-28,26.45
2015-07-29,26.2
2015-07-30,27.93
2015-07-31,27.88
2015-08-03,25.11
2015-08-04,24.22
2015-08-05,23.48
2015-08-06,22.91
2015-08-07,23.07
2015-08-10,22.89
2015-08-11,21.23
2015-08-12,20.29
2015-08-13,19.34
2015-08-14,19.22
2015-08-17,19.55
2015-08-18,18.86
2015-08-19,19.12
2015-08-20,18.34
2015-08-21,17.93
2015-08-24,17.91
2015-08-25,18.25
2015-08-26,18.61
2015-08-27,18.59
2015-08-28,19.1
2015-08-31,19.62
2015-09-01,19.29
2015-09-02,19.36
2015-09-03,18.74
2015-09-04,18.64
2015-09-08,17.36
2015-09-09,17.05
2015-09-10,17.67
2015-09-11,17.77
2015-09-14,17.6
2015-09-15,18.09
2015-09-16,18.02
2015-09-17,18.18
2015-09-18,19
2015-09-21,18.75
2015-09-22,17.98
2015-09-23,17.8
2015-09-24,18.01
2015-09-25,17.27
2015-09-28,16.54
2015-09-29,15.45
2015-09-30,16.18
2015-10-01,17.31
2015-10-02,17.28
2015-10-05,16.74
2015-10-06,15.95
2015-10-07,16.86
2015-10-08,16.84
2015-10-09,17
2015-10-12,16.83
2015-10-13,16.22
2015-10-14,15.79
2015-10-15,16.71
2015-10-16,16.75
2015-10-19,16.45
2015-10-20,16.08
2015-10-21,15.97
2015-10-22,15.97
2015-10-23,16.95
2015-10-26,17.18
2015-10-27,17.12
2015-10-28,17.96
2015-10-29,17.4
2015-10-30,16.77
2015-11-02,17.98
2015-11-03,17.03
2015-11-04,16.89
2015-11-05,17.72
2015-11-06,18.18
2015-11-09,18.49
2015-11-10,17.92
2015-11-11,17.3
2015-11-12,16.71
2015-11-13,16.91
2015-11-16,16.59
2015-11-17,16.77
2015-11-18,16.59
2015-11-19,16.58
2015-11-20,16.6
2015-11-23,17.42
2015-11-24,17.45
2015-11-25,17.21
2015-11-27,17.23
2015-11-30,17.13
2015-12-01,17.28
2015-12-02,17.76
2015-12-03,18.11
2015-12-04,18.18
2015-12-07,17.16
2015-12-08,17.99
2015-12-09,20.6
2015-12-10,20.7
2015-12-11,21.43
2015-12-14,21.77
2015-12-15,21.89
2015-12-16,23.24
2015-12-17,22.2
2015-12-18,21.68
2015-12-21,21.53
2015-12-22,21.81
2015-12-23,22.14
2015-12-24,21.84
2015-12-28,22.41
2015-12-29,22.39
2015-12-30,21.69
2015-12-31,21.49
2016-01-04,21.27
2016-01-05,21.25
2016-01-06,20.68
2016-01-07,19.97
2016-01-08,19.95
2016-01-11,18.97
2016-01-12,18.95
2016-01-13,18
2016-01-14,17.63
2016-01-15,17.58
2016-01-19,17.36
2016-01-20,15.34
2016-01-21,15.22
2016-01-22,14.9
2016-01-25,14.83
2016-01-26,14.82
2016-01-27,14.48
2016-01-28,14.18
2016-01-29,14.81
2016-02-01,14.58
2016-02-02,13.58
2016-02-03,13.26
2016-02-04,12.93
2016-02-05,12.69
2016-02-08,12.14
2016-02-09,11.33
2016-02-10,12.37
2016-02-11,11.49
2016-02-12,11.47
2016-02-16,11.52
2016-02-17,12.31
2016-02-18,12.05
2016-02-19,12.3
2016-02-22,12.03
2016-02-23,11.4
2016-02-24,11.47
2016-02-25,11.42
2016-02-26,11.85
2016-02-29,12.03
2016-03-01,11.84
2016-03-02,12.16
2016-03-03,12.42
2016-03-04,13.05
2016-03-07,13.83
2016-03-08,13.34
2016-03-09,13.02
2016-03-10,12.9
2016-03-11,13.07
2016-03-14,13.29
2016-03-15,12.53
2016-03-16,12.42
2016-03-17,12.49
2016-03-18,13.17
2016-03-21,13.01
2016-03-22,12.62
2016-03-23,12.02
2016-03-24,13.52
2016-03-28,13.51
2016-03-29,14.06
2016-03-30,13.83
2016-03-31,14.37
2016-04-01,13.78
2016-04-04,14.5
2016-04-05,13.94
2016-04-06,14.81
2016-04-07,14.73
2016-04-08,14.46
2016-04-11,13.41
2016-04-12,13.48
2016-04-13,13.4
2016-04-14,13.4
2016-04-15,13.07
2016-04-18,13.31
2016-04-19,12.97
2016-04-20,13.68
2016-04-21,13.38
2016-04-22,13.49
2016-04-25,12.97
2016-04-26,12.85
2016-04-27,12.98
2016-04-28,12.7
2016-04-29,12.55
2016-05-02,12.96
2016-05-03,12.72
2016-05-04,12.16
2016-05-05,11.81
2016-05-06,11.61
2016-05-09,11.59
2016-05-10,11.78
2016-05-11,11.44
2016-05-12,11.61
2016-05-13,12.32
2016-05-16,12.05
2016-05-17,11.43
2016-05-18,11.35
2016-05-19,11.27
2016-05-20,11.5
2016-05-23,11.81
2016-05-24,12.4
2016-05-25,13.14
2016-05-26,12.3
2016-05-27,12.45
2016-05-31,12.71
2016-06-01,13.03
2016-06-02,13.41
2016-06-03,13.43
2016-06-06,14.04
2016-06-07,14.02
2016-06-08,14.17
2016-06-09,14.32
2016-06-10,15.02
2016-06-13,13.9
2016-06-14,13.68
2016-06-15,16.87
2016-06-16,16.28
2016-06-17,15.91
2016-06-20,15.71
2016-06-21,15.38
2016-06-22,15.29
2016-06-23,15.35
2016-06-24,14.96
2016-06-27,14.43
2016-06-28,14.22
2016-06-29,14.23
2016-06-30,14.39
2016-07-01,16.22
2016-07-05,16.26
2016-07-06,16.54
2016-07-07,16.68
2016-07-08,16.78
2016-07-11,17.55
2016-07-12,18.39
2016-07-13,18.44
2016-07-14,19.07
2016-07-15,19.65
2016-07-18,19.46
2016-07-19,19.4
2016-07-20,19.47
2016-07-21,19.88
2016-07-22,20.43
2016-07-25,19.64
2016-07-26,19.59
2016-07-27,19.96
2016-07-28,20.09
2016-07-29,19.65
2016-08-01,20.52
2016-08-02,20.09
2016-08-03,20.49
2016-08-04,21.05
2016-08-05,21.07
2016-08-08,20.97
2016-08-09,22
2016-08-10,20.72
2016-08-11,21.33
2016-08-12,21.53
2016-08-15,22.37
2016-08-16,22.28
2016-08-17,22.33
2016-08-18,23.02
2016-08-19,22.61
2016-08-22,23.05
2016-08-23,22.57
2016-08-24,22.08
2016-08-25,21.99
2016-08-26,22.02
2016-08-29,21.96
2016-08-30,21.64
2016-08-31,21.88
2016-09-01,22
2016-09-02,22.09
2016-09-06,23.6
2016-09-07,25.5
2016-09-08,24.36
2016-09-09,24.19
2016-09-12,25.36
2016-09-13,25.29
2016-09-14,26.18
2016-09-15,26.77
2016-09-16,27.2
2016-09-19,28.29
2016-09-20,25.97
2016-09-21,26.73
2016-09-22,27.335
2016-09-23,27.41
2016-09-26,27.01
2016-09-27,27.18
2016-09-28,27.14
2016-09-29,26.36
2016-09-30,27.26
2016-10-03,26.05
2016-10-04,26.3
2016-10-05,27.26
2016-10-06,27.38
2016-10-07,26.95
2016-10-10,27.4
2016-10-11,26.5
2016-10-12,26.55
2016-10-13,26.9
2016-10-14,25.9
2016-10-17,24.65
2016-10-18,25.05
2016-10-19,23.75
2016-10-20,23.25
2016-10-21,22.75
2016-10-24,22.35
2016-10-25,22.65
2016-10-26,21.45
2016-10-27,21.5
2016-10-28,21.5
2016-10-31,21.25
2016-11-01,20.4
2016-11-02,20.2
2016-11-03,20.15
2016-11-04,21.95
2016-11-07,21.95
2016-11-08,23
2016-11-09,23.5
2016-11-10,23.9
2016-11-11,25.6
2016-11-14,26.25
2016-11-15,27.2
2016-11-16,25.8
2016-11-17,25.8
2016-11-18,25.4
2016-11-21,25.8
2016-11-22,25.2
2016-11-23,25.05
2016-11-25,25
2016-11-28,23.95
2016-11-29,24.6
2016-11-30,24.95
2016-12-01,23.3
2016-12-02,23.05
2016-12-05,23.15
2016-12-06,23.1
2016-12-07,22.25
2016-12-08,22.25
2016-12-09,22.6
2016-12-12,22.55
2016-12-13,23.3
2016-12-14,22.95
2016-12-15,23.2
2016-12-16,23.05
2016-12-19,22.8
2016-12-20,23.025
2016-12-21,22.05
2016-12-22,22.1
2016-12-23,22.3
2016-12-27,21.8
2016-12-28,21.7
2016-12-29,21.65
2016-12-30,20.75
2017-01-03,20.95
2017-01-04,21.5
2017-01-05,20.7
2017-01-06,20.15
2017-01-09,20.35
2017-01-10,23.2
2017-01-11,23
2017-01-12,22.4
2017-01-13,22.65
2017-01-17,21.85
2017-01-18,22.05
2017-01-19,21.35
2017-01-20,20.45
2017-01-23,20.2
2017-01-24,20.3
2017-01-25,20.15
2017-01-26,19.7
2017-01-27,20.55
2017-01-30,19.7
2017-01-31,20.95
2017-02-01,20.5
2017-02-02,21.85
2017-02-03,22.5
2017-02-06,22.1
2017-02-07,22.05
2017-02-08,22.375
2017-02-09,23.6
2017-02-10,23.45
2017-02-13,23.4
2017-02-14,23.65
2017-02-15,23.8
2017-02-16,23.3
2017-02-17,23.15
2017-02-21,24.2
2017-02-22,24.45
2017-02-23,24.75
2017-02-24,26.6
2017-02-27,26.95
2017-02-28,25.5
2017-03-01,26.05
2017-03-02,25.75
2017-03-03,26.15
2017-03-06,25
2017-03-07,24.9
2017-03-08,24.5
2017-03-09,24.1
2017-03-10,23.7
2017-03-13,23.45
2017-03-14,22.2
2017-03-15,22.15
2017-03-16,23.2
2017-03-17,23.2
2017-03-20,23.3
2017-03-21,22.7
2017-03-22,22.75
2017-03-23,22.75
2017-03-24,22.5
2017-03-27,22.85
2017-03-28,23.55
2017-03-29,23.1
2017-03-30,24.1
2017-03-31,24.2
2017-04-03,24.725
2017-04-04,24.9
2017-04-05,25.15
2017-04-06,25.05
2017-04-07,24.75
2017-04-10,24.25
2017-04-11,24.25
2017-04-12,23.8
2017-04-13,23.05
2017-04-17,23.15
2017-04-18,23.45
2017-04-19,25.15
2017-04-20,25
2017-04-21,24.75
2017-04-24,25.95
2017-04-25,25.9
2017-04-26,26.6
2017-04-27,26.75
2017-04-28,27.3
2017-05-01,27.45
2017-05-02,27.6
2017-05-03,27.4
2017-05-04,29.25
2017-05-05,29.5
2017-05-08,29.15
2017-05-09,28.85
2017-05-10,28.125
2017-05-11,27.1
2017-05-12,27.45
2017-05-15,28.1
2017-05-16,29.2
2017-05-17,26.9
2017-05-18,28
2017-05-19,27.85
2017-05-22,28.4
2017-05-23,28.1
2017-05-24,28.85
2017-05-25,28.7
2017-05-26,28.25
2017-05-30,28.05
2017-05-31,27.9
2017-06-01,28.3
2017-06-02,28.5
2017-06-05,28.3
2017-06-06,28.2
2017-06-07,26.9
2017-06-08,27
2017-06-09,27.2
2017-06-12,26.3
2017-06-13,26.45
2017-06-14,26.5
2017-06-15,27.15
2017-06-16,27.9
2017-06-19,28.25
2017-06-20,28.25
2017-06-21,29.55
2017-06-22,30.3
2017-06-23,30.25
2017-06-26,28.5
2017-06-27,27.25
2017-06-28,27.9
2017-06-29,27.2
2017-06-30,27.35
2017-07-03,27.6
2017-07-05,27.65
2017-07-06,26.85
2017-07-07,27.4
2017-07-10,27.35
2017-07-11,28
2017-07-12,28.85
2017-07-13,28.7
2017-07-14,29.4
2017-07-17,28.9
2017-07-18,29.25
2017-07-19,29
2017-07-20,27.65
2017-07-21,27.6
2017-07-24,27.25
2017-07-25,27.8
2017-07-26,27.7
2017-07-27,27.1
2017-07-28,25.95
2017-07-31,26.25
2017-08-01,26.45
2017-08-02,26.25
2017-08-03,26.5
2017-08-04,25.15
2017-08-07,25.15
2017-08-08,23.1
2017-08-09,22.875
2017-08-10,21.1
2017-08-11,21.3
2017-08-14,21.6
2017-08-15,22.4
2017-08-16,22.4
2017-08-17,23.55
2017-08-18,21.7
2017-08-21,21.175
2017-08-22,22.25
2017-08-23,22.55
2017-08-24,22.2
2017-08-25,22.55
2017-08-28,23.05
2017-08-29,22.7
2017-08-30,22.65
2017-08-31,23
2017-09-01,23.25
2017-09-05,23.5
2017-09-06,23.075
2017-09-07,22.6
2017-09-08,23.2
2017-09-11,23.55
2017-09-12,23.6
2017-09-13,23.25
2017-09-14,23.35
2017-09-15,23.3
2017-09-18,23.8
2017-09-19,22.55
2017-09-20,23.35
2017-09-21,23
2017-09-22,22.7
2017-09-25,22.4
2017-09-26,21.9
2017-09-27,22.45
2017-09-28,22.2
2017-09-29,22.45
2017-10-02,22.55
2017-10-03,22.2
2017-10-04,22.3
2017-10-05,21.9
2017-10-06,22.2
2017-10-09,21.6
2017-10-10,20.55
2017-10-11,20.45
2017-10-12,19.8
2017-10-13,20.1
2017-10-16,20.55
2017-10-17,20.6
2017-10-18,20.25
2017-10-19,19.95
2017-10-20,19.85
2017-10-23,19.5
2017-10-24,18.7
2017-10-25,18.95
2017-10-26,18.2
2017-10-27,19.25
2017-10-30,19.45
2017-10-31,19.85
2017-11-01,20.05
2017-11-02,19.3
2017-11-03,18
2017-11-06,19.4
2017-11-07,18.8
2017-11-08,18.9
2017-11-09,19.55
2017-11-10,18.75
2017-11-13,19.15
2017-11-14,19.45
2017-11-15,20.75
2017-11-16,21.15
2017-11-17,22.45
2017-11-20,24.7
2017-11-21,26.05
2017-11-22,26.3
2017-11-24,26.55
2017-11-27,26.6
2017-11-28,28.7
2017-11-29,28
2017-11-30,29.55
2017-12-01,27.8
2017-12-04,27.25
2017-12-05,27.7
2017-12-06,27.1
2017-12-07,28.2
2017-12-08,29.15
2017-12-11,28.75
2017-12-12,30
2017-12-13,28.55
2017-12-14,26.7
2017-12-15,27.25
2017-12-18,27.9
2017-12-19,27.75
2017-12-20,27.6
2017-12-21,28.05
2017-12-22,27.4
2017-12-26,27.7
2017-12-27,27.6
2017-12-28,27.45
2017-12-29,26.2
2018-01-02,27.45
2018-01-03,28.8
2018-01-04,29.25
2018-01-05,28.5
2018-01-08,27
2018-01-09,27.15
2018-01-10,26.05
2018-01-11,27.7
2018-01-12,27.35
2018-01-16,27.05
2018-01-17,27.85
2018-01-18,27.85
2018-01-19,28.25
2018-01-22,28.6
2018-01-23,28.95
2018-01-24,28.85
2018-01-25,29.7
2018-01-26,29.9
2018-01-29,28.95
2018-01-30,29.1
2018-01-31,28.9
2018-02-01,29.1
2018-02-02,28.55
2018-02-05,26.85
2018-02-06,25.4
2018-02-07,26.55
2018-02-08,23.6
2018-02-09,23.9
2018-02-12,23.25
2018-02-13,22.9
2018-02-14,23.25
2018-02-15,24.9
2018-02-16,25.15
2018-02-20,24.55
2018-02-21,24.95
2018-02-22,25.95
2018-02-23,25.75
2018-02-26,26.5
2018-02-27,26.4
2018-02-28,26.3
2018-03-01,25.25
2018-03-02,25.25
2018-03-05,25.85
2018-03-06,25.95
2018-03-07,26.75
2018-03-08,26.4
2018-03-09,26.85
2018-03-12,27.3
2018-03-13,25.4
2018-03-14,25.9
2018-03-15,25.2
2018-03-16,25.45
2018-03-19,25.2
2018-03-20,24.75
2018-03-21,24.75
2018-03-22,24.25
2018-03-23,23.3
2018-03-26,23.25
2018-03-27,22.65
2018-03-28,22.55
2018-03-29,22.85
2018-04-02,22.25
2018-04-03,22.5
2018-04-04,23.3
2018-04-05,23.2
2018-04-06,23.25
2018-04-09,23.4
2018-04-10,24.2
2018-04-11,24.5
2018-04-12,24.35
2018-04-13,24.2
2018-04-16,24.3
2018-04-17,24.7
2018-04-18,24.95
2018-04-19,24.35
2018-04-20,24.5
2018-04-23,24.65
2018-04-24,24.45
2018-04-25,23.35
2018-04-26,23.25
2018-04-27,23.05
2018-04-30,22.2
2018-05-01,22
2018-05-02,22.1
2018-05-03,21.95
2018-05-04,22
2018-05-07,22.25
2018-05-08,22.4
2018-05-09,22.45
2018-05-10,19.025
2018-05-11,19.9
2018-05-14,20
2018-05-15,20.1
2018-05-16,21.65
2018-05-17,22.15
2018-05-18,21.6
2018-05-21,21.95
2018-05-22,21.4
2018-05-23,21
2018-05-24,20.45
2018-05-25,20.175
2018-05-29,20.2
2018-05-30,20.85
2018-05-31,20.4
2018-06-01,20.4
2018-06-04,20.15
2018-06-05,20.35
2018-06-06,20.85
2018-06-07,20.6
2018-06-08,20.85
2018-06-11,21.45
2018-06-12,21.65
2018-06-13,21.85
2018-06-14,23
2018-06-15,23.15
2018-06-18,23.5
2018-06-19,23.55
2018-06-20,23.8
2018-06-21,23.85
2018-06-22,24
2018-06-25,23.4
2018-06-26,23.6
2018-06-27,22.45
2018-06-28,22
2018-06-29,22.3
2018-07-02,21.7
2018-07-03,21.2
2018-07-05,20.55
2018-07-06,21.15
2018-07-09,21.15
2018-07-10,20.95
2018-07-11,21
2018-07-12,21.45
2018-07-13,20.95
2018-07-16,21.35
2018-07-17,22.1
2018-07-18,21.6
2018-07-19,22.35
2018-07-20,21.6
2018-07-23,21.8
2018-07-24,20.95
2018-07-25,21.225
2018-07-26,20.65
2018-07-27,20.4
2018-07-30,20.9
2018-07-31,21.95
2018-08-01,21.35
2018-08-02,21.8
2018-08-03,21.4
2018-08-06,21.8
2018-08-07,21.15
2018-08-08,22.3
2018-08-09,22.25
2018-08-10,22.25
2018-08-13,22.4
2018-08-14,22.95
2018-08-15,21.8
2018-08-16,21.8
2018-08-17,22.05
2018-08-20,21.95
2018-08-21,22.65
2018-08-22,23.3
2018-08-23,23.35
2018-08-24,23.15
2018-08-27,23.9
2018-08-28,23.8
2018-08-29,23.8
2018-08-30,24.2
2018-08-31,24.6
2018-09-04,24.2
2018-09-05,23.55
2018-09-06,23.6
2018-09-07,22.35
2018-09-10,21.7
2018-09-11,21.65
2018-09-12,21.35
2018-09-13,20.8
2018-09-14,21.45
2018-09-17,21.05
2018-09-18,22.5
2018-09-19,22.1
2018-09-20,22.15
2018-09-21,22.55
2018-09-24,23.2
2018-09-25,22.55
2018-09-26,22.75
2018-09-27,23.4
2018-09-28,22.95
2018-10-01,21.94
2018-10-02,20.49
2018-10-03,19.97
2018-10-04,19.02
2018-10-05,20.16
2018-10-08,18.41
2018-10-09,18.005
2018-10-10,17.37
2018-10-11,16.58
2018-10-12,16.55
2018-10-15,16.12
2018-10-16,17
2018-10-17,17.17
2018-10-18,16.55
2018-10-19,16.73
2018-10-22,16.04
2018-10-23,15.67
2018-10-24,15.22
2018-10-25,14.83
2018-10-26,14.96
2018-10-29,14.4
2018-10-30,14.65
2018-10-31,14.94
2018-11-01,15.61
2018-11-02,16.18
2018-11-05,16.01
2018-11-06,16.3
2018-11-07,14.42
2018-11-08,14.97
2018-11-09,14.67
2018-11-12,14.49
2018-11-13,14.82
2018-11-14,14.21
2018-11-15,14.44
2018-11-16,14.43
2018-11-19,13.26
2018-11-20,12.91
2018-11-21,13.37
2018-11-23,13.5
2018-11-26,13.19
2018-11-27,13.02
2018-11-28,14.02
2018-11-29,13.96
2018-11-30,14.77
2018-12-03,15.01
2018-12-04,14.33
2018-12-06,14.91
2018-12-07,14.15
2018-12-10,14.23
2018-12-11,13.69
2018-12-12,14.06
2018-12-13,13.06
2018-12-14,12.89
2018-12-17,12.28
2018-12-18,11.59
2018-12-19,11.17
2018-12-20,10.65
2018-12-21,10.42
2018-12-24,10.51
2018-12-26,10.9
2018-12-27,10.99
2018-12-28,11.78
2018-12-31,11.5
2019-01-02,11.89
2019-01-03,11.76
2019-01-04,13.03
2019-01-07,14.62
2019-01-08,14.46
2019-01-09,15.05
2019-01-10,15.67
2019-01-11,15.03
2019-01-14,15.17
2019-01-15,15.9
2019-01-16,15.99
2019-01-17,16.3
2019-01-18,16.76
2019-01-22,16.85
2019-01-23,16.56
2019-01-24,17.35
2019-01-25,18.93
2019-01-28,20.08
2019-01-29,17.41
2019-01-30,18.32
2019-01-31,18.21
2019-02-01,18.4
2019-02-04,18.26
2019-02-05,19.01
2019-02-06,18.34
2019-02-07,18.75
2019-02-08,18.99
2019-02-11,19.47
2019-02-12,18.79
2019-02-13,19.4
2019-02-14,19.15
2019-02-15,19.79
2019-02-19,19.47
2019-02-20,21.52
2019-02-21,21.54
2019-02-22,21.8
2019-02-25,20.78
2019-02-26,20.94
2019-02-27,21.13
2019-02-28,21.38
2019-03-01,22.15
2019-03-04,21.54
2019-03-05,21.35
2019-03-06,20.58
2019-03-07,20.82
2019-03-08,20.37
2019-03-11,20.31
2019-03-12,19.95
2019-03-13,20.48
2019-03-14,20.05
2019-03-15,19.82
2019-03-18,20.01
2019-03-19,19.88
2019-03-20,19.97
2019-03-21,20.54
2019-03-22,19.89
2019-03-25,20.32
2019-03-26,20.75
2019-03-27,20.69
2019-03-28,20.99
2019-03-29,21.02
2019-04-01,20.52
2019-04-02,20.29
2019-04-03,20.2
2019-04-04,19.91
2019-04-05,18.68
2019-04-08,18.6
2019-04-09,17.79
2019-04-10,18
2019-04-11,18.27
2019-04-12,18.65
2019-04-15,18.76
2019-04-16,19
2019-04-17,18.35
2019-04-18,18.1
2019-04-22,18.25
2019-04-23,18.26
2019-04-24,18.28
2019-04-25,18.83
2019-04-26,19.05
2019-04-29,19.61
2019-04-30,19.5
2019-05-01,19.5
2019-05-02,19.75
2019-05-03,19.96
2019-05-06,19.85
2019-05-07,19.89
2019-05-08,20
2019-05-09,19.77
2019-05-10,20.63
2019-05-13,18.9
2019-05-14,18.8
2019-05-15,19.2
2019-05-16,19.59
2019-05-17,19.3
2019-05-20,19.01
2019-05-21,19.07
2019-05-22,19.2
2019-05-23,19
2019-05-24,19.06
2019-05-28,19.32
2019-05-29,19.02
2019-05-30,18.8
2019-05-31,18.91
2019-06-03,18.81
2019-06-04,20.71
2019-06-05,21.07
2019-06-06,20.79
2019-06-07,20.72
2019-06-10,20.93
2019-06-11,19.94
2019-06-12,20.12
2019-06-13,19.905
2019-06-14,19.76
2019-06-17,20.12
2019-06-18,20.015
2019-06-19,19.9
2019-06-20,20.22
2019-06-21,19.88
2019-06-24,20.035
2019-06-25,19.95
2019-06-26,19.92
2019-06-27,21.89
2019-06-28,23.25
2019-07-01,22.86
2019-07-02,23.35
2019-07-03,23.85
2019-07-04,23.85
2019-07-05,23.415
2019-07-08,21.5
2019-07-09,20.96
2019-07-10,20.485
2019-07-11,18.965
2019-07-12,19.09
2019-07-15,19.46
2019-07-16,19.08
2019-07-17,19.05
2019-07-18,18.79
2019-07-19,18.75
2019-07-22,18.775
2019-07-23,18.89
2019-07-24,19.32
2019-07-25,18.855
2019-07-26,19.45
2019-07-29,19.15
2019-07-30,18.86
2019-07-31,18.655
2019-08-01,17.56
2019-08-02,17.42
2019-08-05,17.085
2019-08-06,16.975
2019-08-07,17.17
2019-08-08,16.62
2019-08-09,17.3
2019-08-12,17.31
2019-08-13,18.5
2019-08-14,18.51
2019-08-15,17.83
2019-08-16,18.3
2019-08-19,18.455
2019-08-20,18.02
2019-08-21,18.22
2019-08-22,18.16
2019-08-23,17.755
2019-08-26,18.4
2019-08-27,18.68
2019-08-28,18.805
2019-08-29,19.385
2019-08-30,18.76
2019-09-02,18.79
2019-09-03,18.035
2019-09-04,18.035
2019-09-05,18.44
2019-09-06,19.055
2019-09-09,19.095
2019-09-10,19.48
2019-09-11,20.845
2019-09-12,20.43
2019-09-13,20.46
2019-09-16,19.485
2019-09-17,21.22
2019-09-18,21.36
2019-09-19,21.49
2019-09-20,21.42
2019-09-23,21.45
2019-09-24,21.1
2019-09-25,21.11
2019-09-26,20.69
2019-09-27,18.92
2019-09-30,18.58
2019-10-01,17.55
2019-10-02,16.01
2019-10-03,17.225
2019-10-04,17.67
2019-10-07,18.05
2019-10-08,18
2019-10-09,18.11
2019-10-10,18.135
2019-10-11,18
2019-10-14,17.915
2019-10-15,18.06
2019-10-16,17.31
2019-10-17,17.49
2019-10-18,17.5
2019-10-21,16.775
2019-10-22,17.58
2019-10-23,17.87
2019-10-24,17.85
2019-10-25,17.53
2019-10-28,16.58
2019-10-29,16.15
2019-10-30,15.465
2019-10-31,15.385
2019-11-01,15.83
2019-11-04,15.99
2019-11-05,16.31
2019-11-06,15.82
2019-11-07,15.67
2019-11-08,15.41
2019-11-11,14.95
2019-11-12,15.495
2019-11-13,15.95
2019-11-14,15.73
2019-11-15,16.085
2019-11-18,16.245
2019-11-19,16.7
2019-11-20,16.365
2019-11-21,16.23
2019-11-22,15.975
2019-11-25,15.81
