date,close
2014-06-13,32.1146
2014-06-16,31.9263
2014-06-17,31.9451
2014-06-18,32.4629
2014-06-19,32.8113
2014-06-20,32.8678
2014-06-23,32.5571
2014-06-24,31.1166
2014-06-25,32.0957
2014-06-26,32.397
2014-06-27,32.5759
2014-06-30,32.896
2014-07-01,33.2726
2014-07-02,33.8375
2014-07-03,33.8752
2014-07-07,33.1596
2014-07-08,32.9807
2014-07-09,32.9337
2014-07-10,32.3782
2014-07-11,32.3311
2014-07-14,32.7548
2014-07-15,32.5194
2014-07-16,33.5551
2014-07-17,32.8489
2014-07-18,32.8678
2014-07-21,33.2161
2014-07-22,34.1388
2014-07-23,34.5719
2014-07-24,35.2027
2014-07-25,35.5228
2014-07-28,35.2592
2014-07-29,34.8355
2014-07-30,34.12
2014-07-31,32.3405
2014-08-01,32.1522
2014-08-04,32.4535
2014-08-05,31.738
2014-08-06,31.7568
2014-08-07,31.2013
2014-08-08,31.8604
2014-08-11,31.9357
2014-08-12,31.8039
2014-08-13,31.9357
2014-08-14,30.9
2014-08-15,30.9565
2014-08-18,30.7871
2014-08-19,30.7588
2014-08-20,30.853
2014-08-21,30.4716
2014-08-22,30.354
2014-08-25,30.8953
2014-08-26,31.625
2014-08-27,31.8227
2014-08-28,31.5779
2014-08-29,32.5194
2014-09-02,31.8227
2014-09-03,32.6324
2014-09-04,31.2625
2014-09-05,31.6485
2014-09-08,30.7278
2014-09-09,30.0763
2014-09-10,30.199
2014-09-11,30.7986
2014-09-12,29.6419
2014-09-15,29.8968
2014-09-16,30.6995
2014-09-17,30.6617
2014-09-18,30.8978
2014-09-19,31.2283
2014-09-22,30.3501
2014-09-23,30.7798
2014-09-24,31.3416
2014-09-25,30.8978
2014-09-26,31.4361
2014-09-29,31.2661
2014-09-30,30.7184
2014-10-01,30.3123
2014-10-02,28.5842
2014-10-03,28.3198
2014-10-06,28.3293
2014-10-07,27.5172
2014-10-08,27.5455
2014-10-09,25.4019
2014-10-10,23.7635
2014-10-13,21.6483
2014-10-14,20.5057
2014-10-15,21.6813
2014-10-16,22.7767
2014-10-17,22.8192
2014-10-20,23.112
2014-10-21,24.8401
2014-10-22,23.5983
2014-10-23,24.3726
2014-10-24,23.0884
2014-10-27,21.2564
2014-10-28,21.5869
2014-10-29,21.9552
2014-10-30,21.7097
2014-10-31,21.7474
2014-11-03,21.6341
2014-11-04,20.0477
2014-11-05,20.3829
2014-11-06,20.6851
2014-11-07,21.1148
2014-11-10,20.5482
2014-11-11,20.9165
2014-11-12,20.4396
2014-11-13,19.906
2014-11-14,20.1421
2014-11-17,19.4811
2014-11-18,19.1364
2014-11-19,19.2545
2014-11-20,20.0949
2014-11-21,20.4349
2014-11-24,20.3971
2014-11-25,19.9013
2014-11-26,19.2592
2014-11-28,16.7048
2014-12-01,16.6859
2014-12-02,16.6671
2014-12-03,16.5632
2014-12-04,15.9399
2014-12-05,15.0428
2014-12-08,14.4964
2014-12-09,15.0001
2014-12-10,14.1733
2014-12-11,14.3016
2014-12-12,13.6459
2014-12-15,13.6174
2014-12-16,14.1686
2014-12-17,15.3422
2014-12-18,15.8126
2014-12-19,16.5823
2014-12-22,16.1927
2014-12-23,16.0026
2014-12-24,15.8031
2014-12-26,15.7746
2014-12-29,16.0501
2014-12-30,15.9741
2014-12-31,15.7651
2015-01-02,15.8221
2015-01-05,14.9858
2015-01-06,14.4917
2015-01-07,13.9785
2015-01-08,14.0165
2015-01-09,13.9595
2015-01-12,13.2278
2015-01-13,13.3323
2015-01-14,13.6269
2015-01-15,13.0378
2015-01-16,13.9975
2015-01-20,14.0641
2015-01-21,15.0048
2015-01-22,15.1474
2015-01-23,15.0713
2015-01-26,15.651
2015-01-27,16.397
2015-01-28,14.9953
2015-01-29,15.1949
2015-01-30,16.3067
2015-02-02,16.8579
2015-02-03,16.8959
2015-02-04,16.0976
2015-02-05,16.6583
2015-02-06,17.1144
2015-02-09,17.0384
2015-02-10,15.9456
2015-02-11,15.9836
2015-02-12,16.1642
2015-02-13,17.238
2015-02-17,17.5801
2015-02-18,17.6086
2015-02-19,17.4755
2015-02-20,17.409
2015-02-23,16.7248
2015-02-24,16.6203
2015-02-25,16.9719
2015-02-26,16.9624
2015-02-27,17.7559
2015-03-02,17.3235
2015-03-03,17.8462
2015-03-04,17.6656
2015-03-05,18.4923
2015-03-06,17.5516
2015-03-09,17.0165
2015-03-10,16.2044
2015-03-11,16.405
2015-03-12,16.5388
2015-03-13,16.2999
2015-03-16,16.3668
2015-03-17,16.6917
2015-03-18,17.5611
2015-03-19,17.1216
2015-03-20,17.0929
2015-03-23,17.3891
2015-03-24,17.9528
2015-03-25,18.1917
2015-03-26,18.2443
2015-03-27,18.1105
2015-03-30,18.0771
2015-03-31,17.9385
2015-04-01,18.4783
2015-04-02,18.507
2015-04-06,19.4242
2015-04-07,19.3
2015-04-08,18.4306
2015-04-09,19.0803
2015-04-10,19.128
2015-04-13,19.4386
2015-04-14,20.523
2015-04-15,21.488
2015-04-16,20.781
2015-04-17,20.3032
2015-04-20,20.1313
2015-04-21,19.4195
2015-04-22,20.0739
2015-04-23,20.7905
2015-04-24,20.2125
2015-04-27,20.2077
2015-04-28,20.695
2015-04-29,21.5692
2015-04-30,21.3542
2015-05-01,21.4593
2015-05-04,21.187
2015-05-05,20.5851
2015-05-06,20.7714
2015-05-07,20.265
2015-05-08,21.1154
2015-05-11,20.1313
2015-05-12,20.5517
2015-05-13,20.394
2015-05-14,20.0548
2015-05-15,19.9593
2015-05-18,20.4179
2015-05-19,19.5867
2015-05-20,19.9402
2015-05-21,20.5421
2015-05-22,20.4466
2015-05-26,19.1663
2015-05-27,19.4099
2015-05-28,19.0707
2015-05-29,19.3
2015-06-01,19.1089
2015-06-02,19.8446
2015-06-03,19.8446
2015-06-04,19.3956
2015-06-05,19.988
2015-06-08,20.084
2015-06-09,20.0168
2015-06-10,20.5448
2015-06-11,20.3624
2015-06-12,20.1224
2015-06-15,19.8535
2015-06-16,20.036
2015-06-17,20.0936
2015-06-18,19.3351
2015-06-19,18.9799
2015-06-22,19.0567
2015-06-23,19.2103
2015-06-24,18.6055
2015-06-25,17.9431
2015-06-26,17.9815
2015-06-29,18.0295
2015-06-30,18.0631
2015-07-01,17.031
2015-07-02,17.0694
2015-07-06,16.3878
2015-07-07,16.8582
2015-07-08,16.5702
2015-07-09,16.9158
2015-07-10,17.0022
2015-07-13,17.2038
2015-07-14,17.7415
2015-07-15,16.695
2015-07-16,16.4742
2015-07-17,15.9942
2015-07-20,15.8502
2015-07-21,16.215
2015-07-22,16.0326
2015-07-23,16.4454
2015-07-24,15.4662
2015-07-27,15.0918
2015-07-28,15.8118
2015-07-29,16.4934
2015-07-30,16.2534
2015-07-31,15.8262
2015-08-03,15.8982
2015-08-04,16.1862
2015-08-05,16.0614
2015-08-06,17.2326
2015-08-07,16.2246
2015-08-10,17.3767
2015-08-11,16.7622
2015-08-12,17.3863
2015-08-13,16.8582
2015-08-14,16.0614
2015-08-17,15.8118
2015-08-18,16.0422
2015-08-19,15.3126
2015-08-20,14.9094
2015-08-21,14.0741
2015-08-24,13.0949
2015-08-25,12.7109
2015-08-26,13.0853
2015-08-27,14.4677
2015-08-28,15.0438
2015-08-31,15.6294
2015-09-01,14.7462
2015-09-02,14.1893
2015-09-03,14.3333
2015-09-04,13.9589
2015-09-08,14.2296
2015-09-09,13.6109
2015-09-10,14.0266
2015-09-11,13.7463
2015-09-14,13.6883
2015-09-15,13.9589
2015-09-16,14.3843
2015-09-17,14.2779
2015-09-18,13.0212
2015-09-21,13.0019
2015-09-22,13.0067
2015-09-23,13.0309
2015-09-24,13.4563
2015-09-25,13.5046
2015-09-28,13.2339
2015-09-29,13.4273
2015-09-30,12.7022
2015-10-01,12.6249
2015-10-02,13.7849
2015-10-05,14.9353
2015-10-06,16.134
2015-10-07,15.7086
2015-10-08,16.4046
2015-10-09,16.4143
2015-10-12,15.5733
2015-10-13,15.38
2015-10-14,15.438
2015-10-15,15.467
2015-10-16,14.2924
2015-10-19,13.8333
2015-10-20,14.1619
2015-10-21,13.8429
2015-10-22,14.2296
2015-10-23,14.5679
2015-10-26,14.3069
2015-10-27,13.7656
2015-10-28,14.0653
2015-10-29,14.0556
2015-10-30,14.3939
2015-11-02,15.148
2015-11-03,15.931
2015-11-04,15.9406
2015-11-05,15.2736
2015-11-06,15.6313
2015-11-09,15.6313
2015-11-10,15.699
2015-11-11,14.9353
2015-11-12,14.6743
2015-11-13,14.5873
2015-11-16,15.148
2015-11-17,14.9063
2015-11-18,15.8923
2015-11-19,15.2156
2015-11-20,14.8386
2015-11-23,15.0899
2015-11-24,16.018
2015-11-25,16.0953
2015-11-27,15.5636
2015-11-30,15.6796
2015-12-01,15.6603
2015-12-02,14.8483
2015-12-03,15.2156
2015-12-04,14.5196
2015-12-07,13.9879
2015-12-08,14.0561
2015-12-09,14.2021
2015-12-10,14.7667
2015-12-11,14.4065
2015-12-14,14.3286
2015-12-15,15.1268
2015-12-16,15.2923
2015-12-17,14.4746
2015-12-18,13.6862
2015-12-21,13.7446
2015-12-22,14.3481
2015-12-23,15.3702
2015-12-24,15.3312
2015-12-28,14.5525
2015-12-29,14.7764
2015-12-30,14.7959
2015-12-31,14.6791
2016-01-04,14.7764
2016-01-05,14.3092
2016-01-06,13.7933
2016-01-07,13.2092
2016-01-08,12.9074
2016-01-11,12.6154
2016-01-12,12.7712
2016-01-13,12.2261
2016-01-14,12.8393
2016-01-15,12.4986
2016-01-19,11.7491
2016-01-20,11.3305
2016-01-21,11.6712
2016-01-22,12.3331
2016-01-25,11.1845
2016-01-26,11.6031
2016-01-27,12.0898
2016-01-28,13.1508
2016-01-29,13.9977
2016-02-01,12.9756
2016-02-02,12.1579
2016-02-03,12.703
2016-02-04,13.7738
2016-02-05,13.3747
2016-02-08,12.9172
2016-02-09,12.4499
2016-02-10,12.2553
2016-02-11,12.2358
2016-02-12,12.7809
2016-02-16,13.3844
2016-02-17,14.28
2016-02-18,14.3286
2016-02-19,14.6012
2016-02-22,15.0295
2016-02-23,14.4357
2016-02-24,14.5428
2016-02-25,14.426
2016-02-26,14.9127
2016-02-29,15.1268
2016-03-01,15.3799
2016-03-02,15.8277
2016-03-03,16.5091
2016-03-04,17.0152
2016-03-07,17.94
2016-03-08,17.02
2016-03-09,17.2451
2016-03-10,17.3136
2016-03-11,17.5289
2016-03-14,17.3625
2016-03-15,17.5191
2016-03-16,17.7932
2016-03-17,17.9302
2016-03-18,16.883
2016-03-21,17.1374
2016-03-22,16.7753
2016-03-23,16.5502
2016-03-24,16.5698
2016-03-28,16.3936
2016-03-29,16.6187
2016-03-30,16.834
2016-03-31,17.2451
2016-04-01,16.2076
2016-04-04,16.0217
2016-04-05,16.0511
2016-04-06,16.6579
2016-04-07,16.3545
2016-04-08,17.0298
2016-04-11,17.2451
2016-04-12,18.2238
2016-04-13,18.2532
2016-04-14,17.8519
2016-04-15,17.2647
2016-04-18,17.4115
2016-04-19,18.0281
2016-04-20,18.3511
2016-04-21,18.3119
2016-04-22,18.6545
2016-04-25,18.3021
2016-04-26,18.1455
2016-04-27,18.6838
2016-04-28,18.7425
2016-04-29,19.3298
2016-05-02,18.8208
2016-05-03,18.1945
2016-05-04,17.1864
2016-05-05,17.0787
2016-05-06,17.48
2016-05-09,16.6872
2016-05-10,17.3821
2016-05-11,17.48
2016-05-12,17.3625
2016-05-13,16.9417
2016-05-16,17.3234
2016-05-17,17.5681
2016-05-18,16.9906
2016-05-19,16.8047
2016-05-20,17.0689
2016-05-23,16.9417
2016-05-24,17.2255
2016-05-25,18.2042
2016-05-26,18.3119
2016-05-27,18.2042
2016-05-31,18.214
2016-06-01,17.8323
2016-06-02,17.5779
2016-06-03,17.8813
2016-06-06,19.7702
2016-06-07,21.0536
2016-06-08,21.1222
2016-06-09,21.2691
2016-06-10,20.6421
2016-06-13,20.3874
2016-06-14,20.4364
2016-06-15,20.6029
2016-06-16,20.1523
2016-06-17,20.5442
2016-06-20,20.1719
2016-06-21,20.6715
2016-06-22,20.6911
2016-06-23,21.1712
2016-06-24,19.9955
2016-06-27,18.9375
2016-06-28,19.4469
2016-06-29,20.3972
2016-06-30,20.887
2016-07-01,21.2495
2016-07-05,20.1523
2016-07-06,20.1327
2016-07-07,20.0053
2016-07-08,20.6617
2016-07-11,20.2796
2016-07-12,21.2299
2016-07-13,20.5637
2016-07-14,20.6421
2016-07-15,20.8185
2016-07-18,20.7009
2016-07-19,20.1915
2016-07-20,20.0249
2016-07-21,19.7408
2016-07-22,20.1719
2016-07-25,19.4273
2016-07-26,19.7996
2016-07-27,19.2412
2016-07-28,18.8689
2016-07-29,18.9962
2016-08-01,18.3986
2016-08-02,18.4084
2016-08-03,18.9766
2016-08-04,18.9277
2016-08-05,19.4077
2016-08-08,19.9759
2016-08-09,19.4763
2016-08-10,19.1432
2016-08-11,19.1726
2016-08-12,19.0452
2016-08-15,19.682
2016-08-16,19.8878
2016-08-17,19.5547
2016-08-18,20.7401
2016-08-19,20.7891
2016-08-22,20.2502
2016-08-23,20.407
2016-08-24,20.3874
2016-08-25,20.3286
2016-08-26,20.1425
2016-08-29,20.0543
2016-08-30,19.5645
2016-08-31,19.0942
2016-09-01,19.0942
2016-09-02,19.3391
2016-09-06,20.1727
2016-09-07,20.1139
2016-09-08,20.2512
2016-09-09,18.7899
2016-09-12,18.7409
2016-09-13,18.0839
2016-09-14,18.0642
2016-09-15,18.6625
2016-09-16,18.5938
2016-09-19,18.888
2016-09-20,18.4173
2016-09-21,19.1724
2016-09-22,19.1528
2016-09-23,18.4369
2016-09-26,18.6526
2016-09-27,18.4565
2016-09-28,19.9962
2016-09-29,21.3495
2016-09-30,21.9379
2016-10-03,21.6634
2016-10-04,21.222
2016-10-05,22.1537
2016-10-06,22.5656
2016-10-07,22.5754
2016-10-10,23.5855
2016-10-11,23.8601
2016-10-12,23.7424
2016-10-13,24.0856
2016-10-14,23.6247
2016-10-17,23.2717
2016-10-18,23.7228
2016-10-19,24.1151
2016-10-20,23.6345
2016-10-21,23.9287
2016-10-24,23.6934
2016-10-25,22.9186
2016-10-26,22.9186
2016-10-27,22.8794
2016-10-28,22.2125
2016-10-31,22.0458
2016-11-01,21.7026
2016-11-02,20.9769
2016-11-03,21.0357
2016-11-04,20.9867
2016-11-07,21.2515
2016-11-08,21.2711
2016-11-09,21.9576
2016-11-10,21.9576
2016-11-11,21.5751
2016-11-14,22.1243
2016-11-15,23.1442
2016-11-16,23.203
2016-11-17,23.3992
2016-11-18,23.6443
2016-11-21,24.2622
2016-11-22,23.9974
2016-11-23,24.272
2016-11-25,23.7228
2016-11-28,23.2521
2016-11-29,22.5165
2016-11-30,26.1549
2016-12-01,27.165
2016-12-02,27.5475
2016-12-05,28.2241
2016-12-06,28.0573
2016-12-07,28.0671
2016-12-08,28.2879
2016-12-09,27.6451
2016-12-12,28.1358
2016-12-13,26.2025
2016-12-14,26.0259
2016-12-15,26.232
2016-12-16,26.281
2016-12-19,26.3203
2016-12-20,26.4969
2016-12-21,26.4086
2016-12-22,26.3792
2016-12-23,26.1927
2016-12-27,26.5853
2016-12-28,26.2516
2016-12-29,26.4773
2016-12-30,26.4184
2017-01-03,27.1937
2017-01-04,27.8512
2017-01-05,28.1751
2017-01-06,28.1751
2017-01-09,27.5568
2017-01-10,27.7335
2017-01-11,27.6942
2017-01-12,27.7923
2017-01-13,27.0171
2017-01-17,27.3998
2017-01-18,26.9974
2017-01-19,26.9876
2017-01-20,27.0661
2017-01-23,25.9277
2017-01-24,26.4969
2017-01-25,27.9984
2017-01-26,27.7531
2017-01-27,27.7923
2017-01-30,26.8895
2017-01-31,27.5176
2017-02-01,27.9101
2017-02-02,27.233
2017-02-03,27.7433
2017-02-06,27.3213
2017-02-07,26.5656
2017-02-08,26.7815
2017-02-09,27.3213
2017-02-10,27.3704
2017-02-13,28.0868
2017-02-14,28.9209
2017-02-15,28.0181
2017-02-16,27.2428
2017-02-17,26.9189
2017-02-21,27.1446
2017-02-22,26.5558
2017-02-23,27.0563
2017-02-24,26.1927
2017-02-27,27.3802
2017-02-28,27.1054
2017-03-01,27.8512
2017-03-02,27.1348
2017-03-03,27.3017
2017-03-06,27.174
2017-03-07,26.3294
2017-03-08,24.9741
2017-03-09,24.7384
2017-03-10,24.7876
2017-03-13,25.0822
2017-03-14,24.5617
2017-03-15,25.7402
2017-03-16,25.5437
2017-03-17,25.2197
2017-03-20,24.9152
2017-03-21,24.4635
2017-03-22,24.1296
2017-03-23,24.051
2017-03-24,23.56
2017-03-27,22.6466
2017-03-28,23.0296
2017-03-29,23.4814
2017-03-30,23.8546
2017-03-31,23.8349
2017-04-03,23.7269
2017-04-04,23.9135
2017-04-05,24.2179
2017-04-06,24.8367
2017-04-07,24.3947
2017-04-10,25.0822
2017-04-11,25.1509
2017-04-12,24.5028
2017-04-13,23.3734
2017-04-17,23.2359
2017-04-18,22.9707
2017-04-19,22.3127
2017-04-20,22.0476
2017-04-21,22.0868
2017-04-24,21.9297
2017-04-25,22.2047
2017-04-26,22.5877
2017-04-27,21.5369
2017-04-28,21.257
2017-05-01,21.5565
2017-05-02,21.203
2017-05-03,21.203
2017-05-04,20.3191
2017-05-05,21.3798
2017-05-08,21.1441
2017-05-09,20.8887
2017-05-10,21.3012
2017-05-11,20.8593
2017-05-12,20.3879
2017-05-15,21.3208
2017-05-16,21.419
2017-05-17,21.2324
2017-05-18,21.6842
2017-05-19,22.4109
2017-05-22,22.0672
2017-05-23,21.586
2017-05-24,21.6646
2017-05-25,20.6137
2017-05-26,21.1342
2017-05-30,20.8494
2017-05-31,20.9378
2017-06-01,21.3405
2017-06-02,20.8102
2017-06-05,21.0458
2017-06-06,21.1638
2017-06-07,19.1388
2017-06-08,19.5517
2017-06-09,20.2791
2017-06-12,20.3971
2017-06-13,21.0065
2017-06-14,19.8761
2017-06-15,19.6303
2017-06-16,20.0629
2017-06-19,20.053
2017-06-20,19.3846
2017-06-21,19.1192
2017-06-22,19.188
2017-06-23,19.3158
2017-06-26,19.4534
2017-06-27,19.591
2017-06-28,19.6795
2017-06-29,19.7778
2017-06-30,19.8466
2017-07-03,20.5249
2017-07-05,19.8761
2017-07-06,19.3453
2017-07-07,19.4436
2017-07-10,19.6795
2017-07-11,19.9351
2017-07-12,19.6697
2017-07-13,20.0825
2017-07-14,20.1218
2017-07-17,19.768
2017-07-18,19.8859
2017-07-19,21.1441
2017-07-20,20.4266
2017-07-21,19.4141
2017-07-24,18.8538
2017-07-25,19.4042
2017-07-26,19.4141
2017-07-27,19.0995
2017-07-28,19.1782
2017-07-31,19.0111
2017-08-01,18.9422
2017-08-02,19.3453
2017-08-03,18.8931
2017-08-04,18.7653
2017-08-07,18.0084
2017-08-08,17.4874
2017-08-09,16.9959
2017-08-10,16.5831
2017-08-11,16.5437
2017-08-14,16.357
2017-08-15,15.9736
2017-08-16,15.2659
2017-08-17,15.1774
2017-08-18,15.3642
2017-08-21,15.1381
2017-08-22,15.1479
2017-08-23,15.3642
2017-08-24,15.0004
2017-08-25,15.5804
2017-08-28,15.3445
2017-08-29,15.4231
2017-08-30,15.5313
2017-08-31,15.6984
2017-09-01,15.6689
2017-09-05,16.7109
2017-09-06,17.134
2017-09-07,17.1931
2017-09-08,16.7305
2017-09-11,17.2915
2017-09-12,17.5769
2017-09-13,17.8525
2017-09-14,18.1575
2017-09-15,18.3642
2017-09-18,18.4134
2017-09-19,18.3839
2017-09-20,19.1811
2017-09-21,19.0531
2017-09-22,19.2204
2017-09-25,20.1455
2017-09-26,20.1947
2017-09-27,20.4408
2017-09-28,20.5097
2017-09-29,20.6081
2017-10-02,20.4998
2017-10-03,20.4309
2017-10-04,20.4801
2017-10-05,20.9624
2017-10-06,20.4211
2017-10-09,20.7065
2017-10-10,20.6179
2017-10-11,20.9722
2017-10-12,20.2046
2017-10-13,20.1652
2017-10-16,20.0963
2017-10-17,19.9093
2017-10-18,19.2106
2017-10-19,18.6299
2017-10-20,18.6201
2017-10-23,18.2264
2017-10-24,18.0394
2017-10-25,17.6852
2017-10-26,18.7874
2017-10-27,19.4468
2017-10-30,19.4369
2017-10-31,19.4665
2017-11-01,19.6338
2017-11-02,19.6092
2017-11-03,19.9389
2017-11-06,20.6868
2017-11-07,20.4998
2017-11-08,20.3522
2017-11-09,20.549
2017-11-10,20.5097
2017-11-13,20.2538
2017-11-14,19.6042
2017-11-15,19.4271
2017-11-16,19.3188
2017-11-17,19.7027
2017-11-20,19.9389
2017-11-21,19.7617
2017-11-22,20.1357
2017-11-24,20.1652
2017-11-27,19.555
2017-11-28,19.7715
2017-11-29,20.1652
2017-11-30,21.2478
2017-12-01,21.6316
2017-12-04,21.4938
2017-12-05,20.923
2017-12-06,20.6866
2017-12-07,21.2481
2017-12-08,21.2973
2017-12-11,21.9573
2017-12-12,21.5929
2017-12-13,20.992
2017-12-14,20.3123
2017-12-15,20.2827
2017-12-18,20.6964
2017-12-19,21.1594
2017-12-20,21.9672
2017-12-21,22.6272
2017-12-22,22.2529
2017-12-26,22.637
2017-12-27,22.6075
2017-12-28,22.3218
2017-12-29,22.6666
2018-01-02,22.8341
2018-01-03,23.1197
2018-01-04,23.2675
2018-01-05,23.3364
2018-01-08,23.9373
2018-01-09,23.2182
2018-01-10,23.4547
2018-01-11,24.3314
2018-01-12,24.3314
2018-01-16,23.6812
2018-01-17,23.9078
2018-01-18,23.5236
2018-01-19,24.1147
2018-01-22,23.9866
2018-01-23,24.1541
2018-01-24,23.6615
2018-01-25,23.8585
2018-01-26,24.2033
2018-01-29,23.8881
2018-01-30,23.6812
2018-01-31,23.2675
2018-02-01,24.1935
2018-02-02,22.6961
2018-02-05,21.8391
2018-02-06,22.6173
2018-02-07,21.5042
2018-02-08,18.4308
2018-02-09,17.7708
2018-02-12,17.8791
2018-02-13,17.5343
2018-02-14,18.0269
2018-02-15,18.1352
2018-02-16,17.82
2018-02-20,17.692
2018-02-21,17.6624
2018-02-22,18.5884
2018-02-23,19.2976
2018-02-26,19.5045
2018-02-27,18.6967
2018-02-28,17.8003
2018-03-01,18.1549
2018-03-02,18.5194
2018-03-05,18.9332
2018-03-06,19.0908
2018-03-07,18.7555
2018-03-08,19.1894
2018-03-09,19.6528
2018-03-12,19.4458
2018-03-13,19.0217
2018-03-14,19.0316
2018-03-15,18.3118
2018-03-16,18.6865
2018-03-19,18.3413
2018-03-20,18.5583
2018-03-21,19.5444
2018-03-22,18.647
2018-03-23,18.0948
2018-03-26,17.9272
2018-03-27,17.2172
2018-03-28,16.9509
2018-03-29,17.2665
2018-04-02,16.7044
2018-04-03,17.0594
2018-04-04,16.9904
2018-04-05,17.5722
2018-04-06,17.3158
2018-04-09,17.4243
2018-04-10,18.4104
2018-04-11,19.002
2018-04-12,19.1795
2018-04-13,19.7317
2018-04-16,19.7317
2018-04-17,19.9092
2018-04-18,20.3332
2018-04-19,20.0177
2018-04-20,19.712
2018-04-23,19.7712
2018-04-24,19.3669
2018-04-25,19.5838
2018-04-26,20.8164
2018-04-27,20.8362
2018-04-30,21.1221
2018-05-01,21.201
2018-05-02,21.5264
2018-05-03,21.4179
2018-05-04,21.6053
2018-05-07,21.7631
2018-05-08,22.1378
2018-05-09,21.9406
2018-05-10,22.3054
2018-05-11,22.2758
2018-05-14,22.5026
2018-05-15,22.6604
2018-05-16,22.9267
2018-05-17,23.3014
2018-05-18,22.69
2018-05-21,22.7492
2018-05-22,22.1279
2018-05-23,21.9702
2018-05-24,21.6941
2018-05-25,20.708
2018-05-29,20.491
2018-05-30,21.063
2018-05-31,20.3924
2018-06-01,19.2288
2018-06-04,18.6569
2018-06-05,18.9133
2018-06-06,18.8935
2018-06-07,19.5655
2018-06-08,18.4686
2018-06-11,18.4587
2018-06-12,18.4785
2018-06-13,18.7255
2018-06-14,18.4686
2018-06-15,17.688
2018-06-18,17.5694
2018-06-19,17.7077
2018-06-20,17.9646
2018-06-21,17.6484
2018-06-22,17.8461
2018-06-25,17.4113
2018-06-26,17.6978
2018-06-27,18.4686
2018-06-28,18.0733
2018-06-29,17.7868
2018-07-02,17.1445
2018-07-03,17.599
2018-07-05,17.5397
2018-07-06,17.8658
2018-07-09,18.5674
2018-07-10,18.4785
2018-07-11,17.4903
2018-07-12,17.2532
2018-07-13,17.0753
2018-07-16,17.016
2018-07-17,16.8678
2018-07-18,16.8876
2018-07-19,16.7591
2018-07-20,16.6998
2018-07-23,15.7709
2018-07-24,16.0081
2018-07-25,15.9982
2018-07-26,15.85
2018-07-27,16.769
2018-07-30,16.8777
2018-07-31,16.9963
2018-08-01,16.9864
2018-08-02,16.5417
2018-08-03,16.5121
2018-08-06,16.4923
2018-08-07,16.601
2018-08-08,16.6208
2018-08-09,16.4824
2018-08-10,16.7196
2018-08-13,16.6306
2018-08-14,16.9469
2018-08-15,16.2156
2018-08-16,16.354
2018-08-17,16.7887
2018-08-20,17.105
2018-08-21,17.5002
2018-08-22,17.5793
2018-08-23,17.2433
2018-08-24,17.2729
2018-08-27,17.5397
2018-08-28,17.2927
2018-08-29,17.5002
2018-08-30,17.105
2018-08-31,16.9271
2018-09-04,17.0457
2018-09-05,16.3028
2018-09-06,16.0057
2018-09-07,15.8967
2018-09-10,16.0255
2018-09-11,16.7584
2018-09-12,17.4121
2018-09-13,17.1843
2018-09-14,17.4617
2018-09-17,16.8377
2018-09-18,17.2933
2018-09-19,17.7192
2018-09-20,17.7192
2018-09-21,17.7192
2018-09-24,17.531
2018-09-25,17.5409
2018-09-26,17.1249
2018-09-27,16.9268
2018-09-28,16.9466
2018-10-01,17.6498
2018-10-02,17.5211
2018-10-03,17.6597
2018-10-04,17.4815
2018-10-05,17.6498
2018-10-08,17.6895
2018-10-09,17.7786
2018-10-10,16.5901
2018-10-11,16.3325
2018-10-12,16.3722
2018-10-15,16.6594
2018-10-16,16.7882
2018-10-17,16.4217
2018-10-18,16.1245
2018-10-19,16.0156
2018-10-22,15.5699
2018-10-23,14.7577
2018-10-24,13.8069
2018-10-25,15.144
2018-10-26,16.0354
2018-10-29,15.5204
2018-10-30,16.075
2018-10-31,16.4811
2018-11-01,16.3623
2018-11-02,16.1047
2018-11-05,17.0061
2018-11-06,16.7782
2018-11-07,16.7683
2018-11-08,16.3028
2018-11-09,15.976
2018-11-12,15.4213
2018-11-13,14.5497
2018-11-14,14.6389
2018-11-15,14.9459
2018-11-16,15.2232
2018-11-19,15.3421
2018-11-20,14.2823
2018-11-21,14.5002
2018-11-23,13.9456
2018-11-26,14.6488
2018-11-27,14.4903
2018-11-28,14.7577
2018-11-29,14.5993
2018-11-30,13.7475
2018-12-03,14.4111
2018-12-04,13.4899
2018-12-06,12.735
2018-12-07,12.9237
2018-12-10,12.4866
2018-12-11,12.5164
2018-12-12,13.1125
2018-12-13,12.5661
2018-12-14,12.2085
2018-12-17,12.0198
2018-12-18,11.6025
2018-12-19,10.7185
2018-12-20,10.2218
2018-12-21,9.9337
2018-12-24,9.6059
2018-12-26,10.3906
2018-12-27,10.2218
2018-12-28,10.2416
2018-12-31,10.2814
2019-01-02,10.5396
2019-01-03,10.8079
2019-01-04,11.384
2019-01-07,11.6224
2019-01-08,11.7218
2019-01-09,12.5959
2019-01-10,12.6853
2019-01-11,12.6357
2019-01-14,12.6853
2019-01-15,12.6754
2019-01-16,12.5363
2019-01-17,12.427
2019-01-18,12.7747
2019-01-22,12.0694
2019-01-23,11.384
2019-01-24,11.6522
2019-01-25,11.9204
2019-01-28,11.5628
2019-01-29,11.7218
2019-01-30,12.0694
2019-01-31,12.0496
2019-02-01,12.4966
2019-02-04,12.8045
2019-02-05,12.6655
2019-02-06,12.6456
2019-02-07,12.7151
2019-02-08,12.5959
2019-02-11,12.9734
2019-02-12,13.3807
2019-02-13,13.49
2019-02-14,13.6787
2019-02-15,14.3144
2019-02-19,14.3641
2019-02-20,14.225
2019-02-21,13.7979
2019-02-22,13.8873
2019-02-25,14.086
2019-02-26,13.5297
2019-02-27,13.48
2019-02-28,13.1721
2019-03-01,13.4204
2019-03-04,13.6688
2019-03-05,13.3707
2019-03-06,12.9224
2019-03-07,12.8925
2019-03-08,12.7132
2019-03-11,13.1416
2019-03-12,13.5401
2019-03-13,13.8689
2019-03-14,14.0283
2019-03-15,13.849
2019-03-18,14.3671
2019-03-19,14.2376
2019-03-20,14.5066
2019-03-21,14.6162
2019-03-22,13.7892
2019-03-25,14.0383
2019-03-26,14.3073
2019-03-27,14.0383
2019-03-28,14.2575
2019-03-29,13.9685
2019-04-01,14.397
2019-04-02,14.2176
2019-04-03,13.9088
2019-04-04,14.387
2019-04-05,14.9948
2019-04-08,15.2638
2019-04-09,15.1442
2019-04-10,15.3335
2019-04-11,15.0645
2019-04-12,15.1442
2019-04-15,14.8752
2019-04-16,15.5826
2019-04-17,15.4332
2019-04-18,15.3236
2019-04-22,16.1007
2019-04-23,15.7719
2019-04-24,15.0844
2019-04-25,14.7457
2019-04-26,14.2276
2019-04-29,14.0283
2019-04-30,13.5401
2019-05-01,12.753
2019-05-02,13.022
2019-05-03,13.5202
2019-05-06,13.6696
2019-05-07,13.2213
2019-05-08,12.8626
2019-05-09,12.8228
2019-05-10,12.4242
2019-05-13,12.0656
2019-05-14,12.7331
2019-05-15,12.773
2019-05-16,13.0121
2019-05-17,12.3943
2019-05-20,12.2349
2019-05-21,12.3844
2019-05-22,11.9958
2019-05-23,11.3681
2019-05-24,10.9995
2019-05-28,10.8799
2019-05-29,11.2486
2019-05-30,11.0892
2019-05-31,10.591
2019-06-03,10.9895
2019-06-04,10.86
2019-06-05,10.46
2019-06-06,10.78
2019-06-07,10.89
2019-06-10,10.99
2019-06-11,10.82
2019-06-12,10.31
2019-06-13,11.03
2019-06-14,11.115
2019-06-17,11.335
2019-06-18,11.56
2019-06-19,11.715
2019-06-20,11.985
2019-06-21,11.995
2019-06-24,11.985
2019-06-25,11.85
2019-06-26,12.205
2019-06-27,11.69
2019-06-28,11.425
2019-07-01,11.835
2019-07-02,11.13
2019-07-03,11.15
2019-07-04,11.15
2019-07-05,11.435
2019-07-08,11.565
2019-07-09,11.505
2019-07-10,11.755
2019-07-11,11.645
2019-07-12,11.645
2019-07-15,11.015
2019-07-16,10.685
2019-07-17,10.605
2019-07-18,10.585
2019-07-19,10.78
2019-07-22,10.925
2019-07-23,11.3
2019-07-24,11.25
2019-07-25,10.405
2019-07-26,10.585
2019-07-29,10.25
2019-07-30,11.515
2019-07-31,11.655
2019-08-01,10.46
2019-08-02,10.335
2019-08-05,9.99
2019-08-06,9.705
2019-08-07,9.715
2019-08-08,9.735
2019-08-09,9.185
2019-08-12,8.915
2019-08-13,8.975
2019-08-14,8.56
2019-08-15,8.495
2019-08-16,8.585
2019-08-19,8.775
2019-08-20,8.385
2019-08-21,8.565
2019-08-22,8.38
2019-08-23,7.89
2019-08-26,8.035
2019-08-27,8.14
2019-08-28,8.545
2019-08-29,8.88
2019-08-30,8.64
2019-09-02,8.635
2019-09-03,8.415
2019-09-04,8.445
2019-09-05,8.955
2019-09-06,8.94
2019-09-09,9.615
2019-09-10,9.625
2019-09-11,9.575
2019-09-12,8.97
2019-09-13,9.105
2019-09-16,11.015
2019-09-17,9.865
2019-09-18,9.735
2019-09-19,9.625
2019-09-20,9.665
2019-09-23,9.74
2019-09-24,9.035
2019-09-25,9.105
2019-09-26,8.925
2019-09-27,8.615
2019-09-30,8.535
2019-10-01,8.365
2019-10-02,8.15
2019-10-03,8.275
2019-10-04,8.295
2019-10-07,8.01
2019-10-08,7.905
2019-10-09,7.825
2019-10-10,7.875
2019-10-11,8.255
2019-10-14,8.125
2019-10-15,8.21
2019-10-16,7.835
2019-10-17,7.795
2019-10-18,7.835
2019-10-21,8.295
2019-10-22,8.555
2019-10-23,8.615
2019-10-24,8.59
2019-10-25,9.165
2019-10-28,8.915
2019-10-29,9.185
2019-10-30,8.475
2019-10-31,8.315
2019-11-01,8.925
2019-11-04,9.71
2019-11-05,9.385
2019-11-06,8.875
2019-11-07,9.035
2019-11-08,9.115
2019-11-11,9.135
2019-11-12,9.035
2019-11-13,8.57
2019-11-14,8.465
2019-11-15,8.775
2019-11-18,8.58
2019-11-19,8.475
2019-11-20,8.475
2019-11-21,8.875
2019-11-22,9.06
2019-11-25,9.15
