date,close
2014-06-13,29.2792
2014-06-16,29.0116
2014-06-17,29.4414
2014-06-18,29.8713
2014-06-19,29.9037
2014-06-20,29.9362
2014-06-23,29.8226
2014-06-24,29.7902
2014-06-25,30.0416
2014-06-26,29.9763
2014-06-27,30.2946
2014-06-30,30.164
2014-07-01,30.4007
2014-07-02,30.2375
2014-07-03,30.2783
2014-07-07,30.2701
2014-07-08,30.262
2014-07-09,30.262
2014-07-10,30.5884
2014-07-11,30.1885
2014-07-14,30.417
2014-07-15,30.2456
2014-07-16,30.4415
2014-07-17,30.1477
2014-07-18,30.6129
2014-07-21,30.3436
2014-07-22,30.5639
2014-07-23,30.8333
2014-07-24,30.6945
2014-07-25,30.8169
2014-07-28,31.0863
2014-07-29,30.7027
2014-07-30,30.515
2014-07-31,29.707
2014-08-01,29.7315
2014-08-04,30.4252
2014-08-05,30.3191
2014-08-06,30.262
2014-08-07,30.0661
2014-08-08,30.1804
2014-08-11,30.5721
2014-08-12,30.4905
2014-08-13,30.8822
2014-08-14,30.9067
2014-08-15,30.7761
2014-08-18,31.2087
2014-08-19,31.4698
2014-08-20,31.6167
2014-08-21,31.5923
2014-08-22,31.3474
2014-08-25,31.3066
2014-08-26,31.4617
2014-08-27,31.4943
2014-08-28,31.2821
2014-08-29,31.6167
2014-09-02,31.9105
2014-09-03,31.9432
2014-09-04,31.4617
2014-09-05,31.8779
2014-09-08,31.9677
2014-09-09,31.5188
2014-09-10,31.1924
2014-09-11,31.3719
2014-09-12,30.262
2014-09-15,30.0171
2014-09-16,30.7272
2014-09-17,30.9965
2014-09-18,31.2984
2014-09-19,30.9067
2014-09-22,30.5803
2014-09-23,30.4334
2014-09-24,30.7435
2014-09-25,30.6945
2014-09-26,31.7045
2014-09-29,31.2939
2014-09-30,30.6617
2014-10-01,30.2264
2014-10-02,30.1854
2014-10-03,30.5878
2014-10-06,30.5467
2014-10-07,30.4399
2014-10-08,31.5978
2014-10-09,31.8277
2014-10-10,31.2282
2014-10-13,31.0147
2014-10-14,31.1379
2014-10-15,30.6452
2014-10-16,31.3761
2014-10-17,31.3268
2014-10-20,31.8277
2014-10-21,32.8788
2014-10-22,32.7145
2014-10-23,33.4536
2014-10-24,33.4371
2014-10-27,33.4946
2014-10-28,33.8641
2014-10-29,33.9791
2014-10-30,34.5539
2014-10-31,34.9809
2014-11-03,35.3668
2014-11-04,35.2683
2014-11-05,34.8085
2014-11-06,34.4964
2014-11-07,34.2254
2014-11-10,34.8249
2014-11-11,34.5621
2014-11-12,34.5621
2014-11-13,34.5539
2014-11-14,34.3568
2014-11-17,34.365
2014-11-18,34.5703
2014-11-19,34.0366
2014-11-20,34.3568
2014-11-21,34.3897
2014-11-24,34.324
2014-11-25,34.1844
2014-11-26,34.8988
2014-11-28,35.449
2014-12-01,34.9316
2014-12-02,35.3586
2014-12-03,35.5885
2014-12-04,35.5064
2014-12-05,35.9663
2014-12-08,35.9991
2014-12-09,36.2619
2014-12-10,36.1059
2014-12-11,36.2373
2014-12-12,36.0402
2014-12-15,35.7281
2014-12-16,36.2783
2014-12-17,37.354
2014-12-18,37.4279
2014-12-19,37.2719
2014-12-22,37.9124
2014-12-23,38.0684
2014-12-24,38.2162
2014-12-26,38.4954
2014-12-29,38.2974
2014-12-30,38.2313
2014-12-31,37.6537
2015-01-02,37.6042
2015-01-05,38.3139
2015-01-06,38.0003
2015-01-07,38.974
2015-01-08,40.2448
2015-01-09,39.7414
2015-01-12,39.9477
2015-01-13,39.6672
2015-01-14,39.7414
2015-01-15,39.7084
2015-01-16,40.1128
2015-01-20,39.6177
2015-01-21,39.4691
2015-01-22,40.8472
2015-01-23,40.4511
2015-01-26,40.6492
2015-01-27,40.3273
2015-01-28,39.5682
2015-01-29,39.9808
2015-01-30,38.3221
2015-02-02,38.0663
2015-02-03,39.073
2015-02-04,38.941
2015-02-05,39.6919
2015-02-06,38.8832
2015-02-09,38.8585
2015-02-10,39.9808
2015-02-11,40.3273
2015-02-12,40.9875
2015-02-13,40.4181
2015-02-17,41.3506
2015-02-18,40.8472
2015-02-19,40.2201
2015-02-20,40.3521
2015-02-23,41.0288
2015-02-24,39.9973
2015-02-25,40.2778
2015-02-26,40.4099
2015-02-27,40.088
2015-03-02,40.9132
2015-03-03,40.1623
2015-03-04,39.3536
2015-03-05,38.7925
2015-03-06,36.7955
2015-03-09,37.3814
2015-03-10,37.6619
2015-03-11,37.5464
2015-03-12,38.4871
2015-03-13,38.3056
2015-03-16,38.6604
2015-03-17,38.5697
2015-03-18,38.6934
2015-03-19,38.7347
2015-03-20,40.5584
2015-03-23,40.088
2015-03-24,39.3041
2015-03-25,37.992
2015-03-26,37.7692
2015-03-27,37.9603
2015-03-30,38.517
2015-03-31,38.6914
2015-04-01,38.2677
2015-04-02,38.492
2015-04-06,38.5834
2015-04-07,37.2624
2015-04-08,37.6114
2015-04-09,37.2043
2015-04-10,37.2043
2015-04-13,36.8886
2015-04-14,37.1378
2015-04-15,36.9799
2015-04-16,37.3123
2015-04-17,36.9716
2015-04-20,37.5948
2015-04-21,37.8274
2015-04-22,37.7609
2015-04-23,38.0102
2015-04-24,38.6333
2015-04-27,38.384
2015-04-28,38.2345
2015-04-29,37.1627
2015-04-30,35.6756
2015-05-01,36.1907
2015-05-04,36.0993
2015-05-05,34.7866
2015-05-06,34.4626
2015-05-07,35.4595
2015-05-08,35.6672
2015-05-11,35.0275
2015-05-12,34.8946
2015-05-13,34.3545
2015-05-14,35.1355
2015-05-15,35.6008
2015-05-18,35.8334
2015-05-19,35.6008
2015-05-20,35.0774
2015-05-21,34.7367
2015-05-22,34.6703
2015-05-26,34.5955
2015-05-27,35.6257
2015-05-28,35.7836
2015-05-29,35.6257
2015-06-01,36.1657
2015-06-02,35.6672
2015-06-03,35.3681
2015-06-04,35.3931
2015-06-05,35.1355
2015-06-08,34.8946
2015-06-09,34.9943
2015-06-10,35.31
2015-06-11,35.2685
2015-06-12,35.2186
2015-06-15,34.961
2015-06-16,35.3598
2015-06-17,35.8002
2015-06-18,36.5978
2015-06-19,36.9966
2015-06-22,36.5313
2015-06-23,36.4898
2015-06-24,36.1159
2015-06-25,35.958
2015-06-26,36.184
2015-06-29,35.4643
2015-06-30,35.8827
2015-07-01,36.979
2015-07-02,36.8367
2015-07-06,37.1882
2015-07-07,37.4643
2015-07-08,36.979
2015-07-09,36.7196
2015-07-10,37.389
2015-07-13,37.4141
2015-07-14,37.9915
2015-07-15,38.0752
2015-07-16,38.6944
2015-07-17,38.4183
2015-07-20,38.5187
2015-07-21,38.5103
2015-07-22,38.4016
2015-07-23,36.4016
2015-07-24,35.4894
2015-07-27,35.2133
2015-07-28,34.4769
2015-07-29,34.4183
2015-07-30,33.9832
2015-07-31,34.0585
2015-08-03,34.1589
2015-08-04,33.866
2015-08-05,33.6819
2015-08-06,32.9622
2015-08-07,32.9539
2015-08-10,33.0459
2015-08-11,33.1714
2015-08-12,33.5564
2015-08-13,33.548
2015-08-14,33.4141
2015-08-17,33.7823
2015-08-18,33.707
2015-08-19,33.4643
2015-08-20,33.2049
2015-08-21,32.4685
2015-08-24,31.5313
2015-08-25,30.8702
2015-08-26,31.866
2015-08-27,32.5355
2015-08-28,32.4685
2015-08-31,31.8493
2015-09-01,31.2886
2015-09-02,31.5731
2015-09-03,31.3388
2015-09-04,30.912
2015-09-08,31.4309
2015-09-09,31.3221
2015-09-10,31.3304
2015-09-11,32.2175
2015-09-14,32.2677
2015-09-15,31.9497
2015-09-16,31.8242
2015-09-17,32.3514
2015-09-18,30.3932
2015-09-21,30.5857
2015-09-22,29.9413
2015-09-23,30.0501
2015-09-24,29.7572
2015-09-25,30.251
2015-09-28,29.5419
2015-09-29,29.7107
2015-09-30,29.9218
2015-10-01,29.8458
2015-10-02,29.7107
2015-10-05,30.6392
2015-10-06,31.2132
2015-10-07,31.7449
2015-10-08,32.4792
2015-10-09,32.513
2015-10-12,32.1669
2015-10-13,31.4833
2015-10-14,31.3482
2015-10-15,31.9981
2015-10-16,31.1878
2015-10-19,31.4833
2015-10-20,31.4326
2015-10-21,30.462
2015-10-22,30.9346
2015-10-23,28.6388
2015-10-26,28.107
2015-10-27,27.9467
2015-10-28,28.4531
2015-10-29,29.255
2015-10-30,28.8498
2015-11-02,29.7276
2015-11-03,29.9471
2015-11-04,29.7783
2015-11-05,30.0146
2015-11-06,29.9302
2015-11-09,29.3225
2015-11-10,29.6685
2015-11-11,29.2043
2015-11-12,28.892
2015-11-13,28.5966
2015-11-16,28.4109
2015-11-17,27.7779
2015-11-18,27.7103
2015-11-19,26.6806
2015-11-20,26.6637
2015-11-23,26.765
2015-11-24,26.6131
2015-11-25,26.9338
2015-11-27,27.3812
2015-11-30,26.8832
2015-12-01,27.1448
2015-12-02,26.2417
2015-12-03,25.2795
2015-12-04,25.8872
2015-12-07,25.7774
2015-12-08,25.5327
2015-12-09,25.2288
2015-12-10,24.9756
2015-12-11,24.5451
2015-12-14,24.562
2015-12-15,24.7139
2015-12-16,24.3932
2015-12-17,23.8868
2015-12-18,23.5576
2015-12-21,23.355
2015-12-22,23.431
2015-12-23,24.3848
2015-12-24,24.4776
2015-12-28,24.0049
2015-12-29,24.6449
2015-12-30,24.1756
2015-12-31,23.9111
2016-01-04,23.2028
2016-01-05,23.4417
2016-01-06,22.6993
2016-01-07,22.8273
2016-01-08,22.4433
2016-01-11,22.4177
2016-01-12,21.7179
2016-01-13,20.8731
2016-01-14,20.7366
2016-01-15,19.9429
2016-01-19,18.7653
2016-01-20,19.2261
2016-01-21,19.576
2016-01-22,19.9685
2016-01-25,19.3968
2016-01-26,20.3782
2016-01-27,20.1819
2016-01-28,19.6101
2016-01-29,20.839
2016-02-01,19.7723
2016-02-02,19.1664
2016-02-03,19.192
2016-02-04,19.8576
2016-02-05,20.4806
2016-02-08,20.0112
2016-02-09,20.0368
2016-02-10,20.3184
2016-02-11,19.6187
2016-02-12,20.327
2016-02-16,21.5131
2016-02-17,21.8971
2016-02-18,22.8273
2016-02-19,22.8785
2016-02-22,23.0662
2016-02-23,22.998
2016-02-24,22.9724
2016-02-25,23.2369
2016-02-26,23.0406
2016-02-29,23.1772
2016-03-01,24.1073
2016-03-02,24.4145
2016-03-03,24.6108
2016-03-04,24.2439
2016-03-07,24.4743
2016-03-08,23.0321
2016-03-09,22.486
2016-03-10,22.0507
2016-03-11,22.6908
2016-03-14,23.0833
2016-03-15,23.7148
2016-03-16,24.0817
2016-03-17,23.7575
2016-03-18,24.1329
2016-03-21,24.15
2016-03-22,23.7404
2016-03-23,23.399
2016-03-24,23.5356
2016-03-28,23.9412
2016-03-29,24.668
2016-03-30,25.0314
2016-03-31,25.1525
2016-04-01,23.9325
2016-04-04,23.7076
2016-04-05,23.3182
2016-04-06,23.1451
2016-04-07,22.5308
2016-04-08,23.0759
2016-04-11,23.0846
2016-04-12,23.6297
2016-04-13,23.9498
2016-04-14,24.019
2016-04-15,24.3219
2016-04-18,24.019
2016-04-19,24.218
2016-04-20,23.9758
2016-04-21,24.2007
2016-04-22,24.2007
2016-04-25,24.2613
2016-04-26,24.8324
2016-04-27,24.9102
2016-04-28,24.0623
2016-04-29,23.9152
2016-05-02,24.244
2016-05-03,24.0883
2016-05-04,24.1315
2016-05-05,23.7508
2016-05-06,23.7941
2016-05-09,24.2353
2016-05-10,24.5209
2016-05-11,23.2057
2016-05-12,22.5827
2016-05-13,22.2193
2016-05-16,22.4962
2016-05-17,21.9252
2016-05-18,21.2849
2016-05-19,20.5667
2016-05-20,20.6446
2016-05-23,20.783
2016-05-24,21.0772
2016-05-25,21.631
2016-05-26,21.6483
2016-05-27,21.5791
2016-05-31,21.8213
2016-06-01,21.8559
2016-06-02,23.1019
2016-06-03,22.5222
2016-06-06,22.5308
2016-06-07,22.6174
2016-06-08,22.8769
2016-06-09,22.6952
2016-06-10,22.2886
2016-06-13,21.8386
2016-06-14,21.7348
2016-06-15,22.427
2016-06-16,22.5049
2016-06-17,22.8423
2016-06-20,22.9721
2016-06-21,23.1451
2016-06-22,23.4566
2016-06-23,23.7162
2016-06-24,22.0896
2016-06-27,21.1258
2016-06-28,21.8379
2016-06-29,22.8137
2016-06-30,23.0775
2016-07-01,23.7105
2016-07-05,23.0071
2016-07-06,22.8577
2016-07-07,23.1038
2016-07-08,23.5962
2016-07-11,24.1676
2016-07-12,25.2226
2016-07-13,24.4577
2016-07-14,24.3346
2016-07-15,25.3017
2016-07-18,25.9171
2016-07-19,26.1984
2016-07-20,26.3479
2016-07-21,26.7435
2016-07-22,27.3677
2016-07-25,27.2798
2016-07-26,26.2951
2016-07-27,25.5567
2016-07-28,25.6709
2016-07-29,26.0666
2016-08-01,26.6028
2016-08-02,26.2863
2016-08-03,26.3743
2016-08-04,26.471
2016-08-05,27.2182
2016-08-08,27.4204
2016-08-09,27.0072
2016-08-10,26.216
2016-08-11,26.1369
2016-08-12,26.3303
2016-08-15,26.594
2016-08-16,26.7083
2016-08-17,26.049
2016-08-18,26.1721
2016-08-19,26.5061
2016-08-22,26.2951
2016-08-23,26.1193
2016-08-24,25.9347
2016-08-25,26.0138
2016-08-26,26.216
2016-08-29,26.4534
2016-08-30,26.4798
2016-08-31,26.4094
2016-09-01,26.0138
2016-09-02,26.2776
2016-09-06,25.6182
2016-09-07,25.6094
2016-09-08,25.0116
2016-09-09,24.0533
2016-09-12,24.15
2016-09-13,23.7632
2016-09-14,23.8072
2016-09-15,24.0006
2016-09-16,23.8335
2016-09-19,23.4028
2016-09-20,22.9544
2016-09-21,23.1566
2016-09-22,23.5874
2016-09-23,23.3764
2016-09-26,22.9808
2016-09-27,22.7082
2016-09-28,23.1811
2016-09-29,23.199
2016-09-30,23.7344
2016-10-03,23.5381
2016-10-04,23.4488
2016-10-05,23.2882
2016-10-06,23.6897
2016-10-07,23.6541
2016-10-10,24.5463
2016-10-11,24.3233
2016-10-12,24.4928
2016-10-13,24.2251
2016-10-14,23.8057
2016-10-17,23.7344
2016-10-18,24.1805
2016-10-19,24.5909
2016-10-20,23.8771
2016-10-21,23.5202
2016-10-24,23.5559
2016-10-25,23.3953
2016-10-26,23.0295
2016-10-27,22.5387
2016-10-28,22.155
2016-10-31,21.6643
2016-11-01,21.6643
2016-11-02,21.7267
2016-11-03,21.2271
2016-11-04,21.4591
2016-11-07,21.584
2016-11-08,22.0837
2016-11-09,23.1722
2016-11-10,23.2882
2016-11-11,24.1359
2016-11-14,25.0638
2016-11-15,24.4571
2016-11-16,24.6534
2016-11-17,24.4036
2016-11-18,24.0823
2016-11-21,24.2073
2016-11-22,24.698
2016-11-23,24.7069
2016-11-25,25.1352
2016-11-28,24.8408
2016-11-29,25.2869
2016-11-30,25.6617
2016-12-01,26.0007
2016-12-02,25.3672
2016-12-05,26.0543
2016-12-06,26.4915
2016-12-07,27.5354
2016-12-08,27.8031
2016-12-09,27.9994
2016-12-12,27.9459
2016-12-13,27.3659
2016-12-14,27.0357
2016-12-15,27.0268
2016-12-16,27.0714
2016-12-19,27.2945
2016-12-20,27.3659
2016-12-21,26.8841
2016-12-22,26.6432
2016-12-23,26.9733
2016-12-27,26.893
2016-12-28,26.649
2016-12-29,26.658
2016-12-30,26.884
2017-01-03,27.1822
2017-01-04,27.5888
2017-01-05,26.1972
2017-01-06,26.0164
2017-01-09,26.161
2017-01-10,26.5496
2017-01-11,26.2875
2017-01-12,26.0797
2017-01-13,26.4592
2017-01-17,26.6129
2017-01-18,26.6671
2017-01-19,26.4773
2017-01-20,26.5496
2017-01-23,26.8117
2017-01-24,27.2996
2017-01-25,27.887
2017-01-26,28.4654
2017-01-27,28.3298
2017-01-30,27.4984
2017-01-31,27.0285
2017-02-01,26.405
2017-02-02,26.4412
2017-02-03,26.7213
2017-02-06,26.4683
2017-02-07,26.2333
2017-02-08,26.2785
2017-02-09,26.5586
2017-02-10,26.4863
2017-02-13,26.7303
2017-02-14,26.7846
2017-02-15,26.7846
2017-02-16,26.3689
2017-02-17,26.0345
2017-02-21,26.4412
2017-02-22,25.9803
2017-02-23,25.7363
2017-02-24,25.3297
2017-02-27,25.9532
2017-02-28,25.9803
2017-03-01,26.3598
2017-03-02,26.0345
2017-03-03,25.8899
2017-03-06,25.7634
2017-03-07,25.3387
2017-03-08,25.0676
2017-03-09,24.4531
2017-03-10,24.8236
2017-03-13,25.0043
2017-03-14,25.0857
2017-03-15,25.5465
2017-03-16,25.6188
2017-03-17,25.7815
2017-03-20,25.5646
2017-03-21,24.8507
2017-03-22,25.2483
2017-03-23,25.2754
2017-03-24,25.411
2017-03-27,25.0676
2017-03-28,25.5194
2017-03-29,26.0141
2017-03-30,26.3255
2017-03-31,26.756
2017-04-03,26.3255
2017-04-04,26.4354
2017-04-05,26.3163
2017-04-06,26.7285
2017-04-07,26.3621
2017-04-10,26.8201
2017-04-11,27.1041
2017-04-12,26.6644
2017-04-13,27.1041
2017-04-17,27.1774
2017-04-18,27.3606
2017-04-19,27.5804
2017-04-20,27.6262
2017-04-21,27.5529
2017-04-24,28.0201
2017-04-25,28.4048
2017-04-26,28.8628
2017-04-27,28.5788
2017-04-28,27.2598
2017-05-01,27.6812
2017-05-02,28.1208
2017-05-03,28.2216
2017-05-04,28.2674
2017-05-05,28.8719
2017-05-08,28.3681
2017-05-09,28.2124
2017-05-10,28.6155
2017-05-11,28.2765
2017-05-12,27.9559
2017-05-15,27.8277
2017-05-16,27.7178
2017-05-17,27.4338
2017-05-18,28.2582
2017-05-19,28.8353
2017-05-22,29.7055
2017-05-23,29.2383
2017-05-24,29.0643
2017-05-25,28.4689
2017-05-26,28.3773
2017-05-30,28.1575
2017-05-31,28.3223
2017-06-01,28.6704
2017-06-02,28.6338
2017-06-05,28.6338
2017-06-06,28.5055
2017-06-07,28.817
2017-06-08,29.5131
2017-06-09,29.8887
2017-06-12,29.6688
2017-06-13,30.1085
2017-06-14,30.0261
2017-06-15,29.8887
2017-06-16,30.6856
2017-06-19,30.6764
2017-06-20,30.7131
2017-06-21,30.4108
2017-06-22,30.31
2017-06-23,30.0536
2017-06-26,30.42
2017-06-27,30.5574
2017-06-28,30.5203
2017-06-29,30.4832
2017-06-30,29.8717
2017-07-03,31.1133
2017-07-05,30.8446
2017-07-06,30.2516
2017-07-07,30.2609
2017-07-10,29.6216
2017-07-11,30.2423
2017-07-12,30.5388
2017-07-13,30.6871
2017-07-14,30.7334
2017-07-17,31.1225
2017-07-18,30.9002
2017-07-19,30.613
2017-07-20,29.881
2017-07-21,29.8717
2017-07-24,29.8532
2017-07-25,29.9736
2017-07-26,29.5845
2017-07-27,30.0292
2017-07-28,30.7519
2017-07-31,31.1967
2017-08-01,30.5203
2017-08-02,30.5203
2017-08-03,30.3165
2017-08-04,30.6315
2017-08-07,30.4554
2017-08-08,30.3257
2017-08-09,29.6123
2017-08-10,29.6123
2017-08-11,29.6123
2017-08-14,30.0663
2017-08-15,29.9644
2017-08-16,30.5296
2017-08-17,29.7698
2017-08-18,29.2602
2017-08-21,29.3899
2017-08-22,29.7327
2017-08-23,29.5752
2017-08-24,29.6493
2017-08-25,29.7142
2017-08-28,29.9736
2017-08-29,29.9922
2017-08-30,30.8724
2017-08-31,31.1225
2017-09-01,31.2708
2017-09-05,30.613
2017-09-06,31.067
2017-09-07,31.0484
2017-09-08,31.7711
2017-09-11,31.9472
2017-09-12,31.6877
2017-09-13,31.9008
2017-09-14,31.6877
2017-09-15,31.7711
2017-09-18,31.6229
2017-09-19,31.5024
2017-09-20,31.8916
2017-09-21,31.9379
2017-09-22,32.1788
2017-09-25,32.8737
2017-09-26,32.9015
2017-09-27,33.3833
2017-09-28,33.786
2017-09-29,33.8422
2017-10-02,33.3552
2017-10-03,32.8215
2017-10-04,32.8402
2017-10-05,33.4676
2017-10-06,33.8234
2017-10-09,33.9171
2017-10-10,34.3853
2017-10-11,34.1605
2017-10-12,34.8629
2017-10-13,34.8254
2017-10-16,34.8441
2017-10-17,34.6194
2017-10-18,34.7411
2017-10-19,34.6381
2017-10-20,33.402
2017-10-23,32.7746
2017-10-24,33.8796
2017-10-25,33.4582
2017-10-26,33.2616
2017-10-27,33.4208
2017-10-30,32.9994
2017-10-31,33.3927
2017-11-01,33.3459
2017-11-02,33.7017
2017-11-03,33.889
2017-11-06,34.2542
2017-11-07,34.2074
2017-11-08,34.5632
2017-11-09,34.3853
2017-11-10,33.992
2017-11-13,33.8796
2017-11-14,34.3197
2017-11-15,34.4321
2017-11-16,34.6756
2017-11-17,34.61
2017-11-20,34.6007
2017-11-21,35.3404
2017-11-22,35.1531
2017-11-24,35.4434
2017-11-27,35.3685
2017-11-28,35.2093
2017-11-29,35.5933
2017-11-30,36.024
2017-12-01,35.3404
2017-12-04,35.715
2017-12-05,35.6401
2017-12-06,35.4434
2017-12-07,35.2936
2017-12-08,35.2093
2017-12-11,35.2187
2017-12-12,35.1157
2017-12-13,35.3123
2017-12-14,35.4715
2017-12-15,35.8648
2017-12-18,36.4173
2017-12-19,35.921
2017-12-20,35.6495
2017-12-21,35.5745
2017-12-22,35.2093
2017-12-26,35.2468
2017-12-27,35.4528
2017-12-28,35.7555
2017-12-29,35.1596
2018-01-02,35.8406
2018-01-03,35.4055
2018-01-04,35.2636
2018-01-05,35.3015
2018-01-08,35.8123
2018-01-09,35.4906
2018-01-10,35.6798
2018-01-11,35.9825
2018-01-12,35.9163
2018-01-16,36.1055
2018-01-17,36.8433
2018-01-18,36.2757
2018-01-19,36.5879
2018-01-22,36.5028
2018-01-23,37.0892
2018-01-24,37.1554
2018-01-25,36.9757
2018-01-26,36.9379
2018-01-29,37.0703
2018-01-30,36.342
2018-01-31,36.8906
2018-02-01,36.4744
2018-02-02,35.5663
2018-02-05,33.9866
2018-02-06,34.4407
2018-02-07,34.4407
2018-02-08,33.1542
2018-02-09,34.5069
2018-02-12,34.7812
2018-02-13,34.9988
2018-02-14,34.8663
2018-02-15,34.8001
2018-02-16,34.7339
2018-02-20,34.3745
2018-02-21,32.6056
2018-02-22,33.0975
2018-02-23,33.5421
2018-02-26,33.0691
2018-02-27,32.2935
2018-02-28,32.1705
2018-03-01,32.0097
2018-03-02,31.9529
2018-03-05,31.9529
2018-03-06,31.9718
2018-03-07,32.5961
2018-03-08,32.4826
2018-03-09,33.2772
2018-03-12,33.3718
2018-03-13,33.6556
2018-03-14,33.6839
2018-03-15,33.9015
2018-03-16,33.8731
2018-03-19,33.7218
2018-03-20,33.4002
2018-03-21,32.8988
2018-03-22,32.0759
2018-03-23,30.9597
2018-03-26,31.8489
2018-03-27,31.7164
2018-03-28,33.1898
2018-03-29,32.8646
2018-04-02,32.2618
2018-04-03,32.4149
2018-04-04,32.5393
2018-04-05,32.6158
2018-04-06,32.3479
2018-04-09,32.0704
2018-04-10,31.7834
2018-04-11,32.1948
2018-04-12,33.6395
2018-04-13,33.9648
2018-04-16,34.1753
2018-04-17,34.2518
2018-04-18,34.2136
2018-04-19,34.2136
2018-04-20,34.1275
2018-04-23,33.9648
2018-04-24,33.7256
2018-04-25,33.5343
2018-04-26,33.2855
2018-04-27,33.5151
2018-04-30,33.4769
2018-05-01,33.1516
2018-05-02,33.3429
2018-05-03,33.5151
2018-05-04,33.9457
2018-05-07,34.7589
2018-05-08,34.9598
2018-05-09,35.7731
2018-05-10,36.261
2018-05-11,36.328
2018-05-14,36.4045
2018-05-15,36.0793
2018-05-16,36.4141
2018-05-17,36.4428
2018-05-18,37.323
2018-05-21,38.0119
2018-05-22,38.0119
2018-05-23,38.6816
2018-05-24,39.2078
2018-05-25,39.0452
2018-05-29,38.8921
2018-05-30,39.3992
2018-05-31,39.0548
2018-06-01,39.4375
2018-06-04,39.6767
2018-06-05,39.6097
2018-06-06,39.3227
2018-06-07,39.1026
2018-06-08,38.6912
2018-06-11,38.2511
2018-06-12,38.2511
2018-06-13,37.9449
2018-06-14,38.2415
2018-06-15,37.8205
2018-06-18,37.4378
2018-06-19,37.0264
2018-06-20,37.0743
2018-06-21,37.8875
2018-06-22,37.9067
2018-06-25,37.1795
2018-06-26,37.7727
2018-06-27,37.3804
2018-06-28,37.3031
2018-06-29,37.4867
2018-07-02,37.4287
2018-07-03,37.6703
2018-07-05,37.5447
2018-07-06,37.6896
2018-07-09,37.5737
2018-07-10,37.7959
2018-07-11,37.3804
2018-07-12,37.5737
2018-07-13,37.7186
2018-07-16,37.7283
2018-07-17,37.8345
2018-07-18,37.8828
2018-07-19,38.3756
2018-07-20,38.3176
2018-07-23,38.279
2018-07-24,37.6993
2018-07-25,37.8442
2018-07-26,37.4287
2018-07-27,37.1969
2018-07-30,37.1292
2018-07-31,37.2452
2018-08-01,37.3901
2018-08-02,38.0664
2018-08-03,37.2548
2018-08-06,37.6993
2018-08-07,37.1389
2018-08-08,36.7331
2018-08-09,36.5979
2018-08-10,36.25
2018-08-13,36.2211
2018-08-14,36.5302
2018-08-15,36.878
2018-08-16,37.3225
2018-08-17,37.622
2018-08-20,37.7089
2018-08-21,37.8442
2018-08-22,37.7283
2018-08-23,37.4191
2018-08-24,37.5447
2018-08-27,35.9505
2018-08-28,37.3128
2018-08-29,37.506
2018-08-30,37.4481
2018-08-31,37.3031
2018-09-04,36.8104
2018-09-05,37.1872
2018-09-06,35.9892
2018-09-07,36.0568
2018-09-10,35.5447
2018-09-11,35.5254
2018-09-12,34.9457
2018-09-13,35.3612
2018-09-14,35.2839
2018-09-17,35.3612
2018-09-18,35.5158
2018-09-19,34.8491
2018-09-20,35.5544
2018-09-21,35.6027
2018-09-24,35.1873
2018-09-25,35.4385
2018-09-26,35.0037
2018-09-27,35.3064
2018-09-28,35.5114
2018-10-01,34.9451
2018-10-02,34.3495
2018-10-03,34.6717
2018-10-04,33.627
2018-10-05,32.8166
2018-10-08,33.4122
2018-10-09,33.1876
2018-10-10,32.4846
2018-10-11,31.5278
2018-10-12,31.0103
2018-10-15,30.981
2018-10-16,31.518
2018-10-17,31.352
2018-10-18,30.5514
2018-10-19,31.186
2018-10-22,31.2251
2018-10-23,31.186
2018-10-24,30.9322
2018-10-25,31.9378
2018-10-26,31.9476
2018-10-29,32.5139
2018-10-30,32.9533
2018-10-31,32.9142
2018-11-01,33.2169
2018-11-02,32.5041
2018-11-05,32.9923
2018-11-06,32.719
2018-11-07,33.3341
2018-11-08,33.295
2018-11-09,33.3731
2018-11-12,33.4903
2018-11-13,33.627
2018-11-14,33.8711
2018-11-15,34.4472
2018-11-16,34.496
2018-11-19,34.662
2018-11-20,34.9451
2018-11-21,34.4081
2018-11-23,34.5058
2018-11-26,35.0916
2018-11-27,35.0916
2018-11-28,34.5291
2018-11-29,34.5881
2018-11-30,34.3324
2018-12-03,35.06
2018-12-04,34.4504
2018-12-06,35.1288
2018-12-07,33.949
2018-12-10,33.1428
2018-12-11,32.5529
2018-12-12,32.8872
2018-12-13,32.6807
2018-12-14,32.3562
2018-12-17,31.7368
2018-12-18,31.2354
2018-12-19,30.4882
2018-12-20,28.4137
2018-12-21,27.0864
2018-12-24,26.2901
2018-12-26,27.9123
2018-12-27,28.0991
2018-12-28,27.8444
2018-12-31,27.963
2019-01-02,27.5481
2019-01-03,27.7062
2019-01-04,28.4272
2019-01-07,28.931
2019-01-08,29.6915
2019-01-09,30.0669
2019-01-10,30.5212
2019-01-11,30.3138
2019-01-14,30.462
2019-01-15,30.7583
2019-01-16,30.7188
2019-01-17,31.0052
2019-01-18,31.0546
2019-01-22,30.0965
2019-01-23,29.6323
2019-01-24,29.5236
2019-01-25,29.9977
2019-01-28,30.6496
2019-01-29,31.0645
2019-01-30,31.5188
2019-01-31,31.6571
2019-02-01,31.2423
2019-02-04,31.5188
2019-02-05,31.2719
2019-02-06,31.2423
2019-02-07,31.4102
2019-02-08,31.1633
2019-02-11,31.6473
2019-02-12,31.588
2019-02-13,32.2992
2019-02-14,31.8152
2019-02-15,32.6943
2019-02-19,32.1115
2019-02-20,33.0894
2019-02-21,33.0894
2019-02-22,33.6919
2019-02-25,32.9214
2019-02-26,32.2992
2019-02-27,31.7954
2019-02-28,31.6176
2019-03-01,31.6275
2019-03-04,32.0522
2019-03-05,32.4967
2019-03-06,32.2201
2019-03-07,31.3904
2019-03-08,31.2324
2019-03-11,31.8152
2019-03-12,31.7263
2019-03-13,31.746
2019-03-14,31.667
2019-03-15,31.9337
2019-03-18,31.7065
2019-03-19,31.509
2019-03-20,31.3213
2019-03-21,31.6769
2019-03-22,30.7287
2019-03-25,30.5015
2019-03-26,30.6299
2019-03-27,30.62
2019-03-28,31.18
2019-03-29,31.06
2019-04-01,31.37
2019-04-02,31.49
2019-04-03,31.54
2019-04-04,31.6
2019-04-05,32.02
2019-04-08,31.93
2019-04-09,30.84
2019-04-10,31.38
2019-04-11,31.03
2019-04-12,31.43
2019-04-15,31
2019-04-16,30.99
2019-04-17,31.03
2019-04-18,31.04
2019-04-22,30.43
2019-04-23,31.67
2019-04-24,31.63
2019-04-25,31.32
2019-04-26,32.86
2019-04-29,32.68
2019-04-30,32.56
2019-05-01,32.47
2019-05-02,32.92
2019-05-03,33.39
2019-05-06,33.36
2019-05-07,32.21
2019-05-08,31.91
2019-05-09,31.73
2019-05-10,31.8
2019-05-13,31.08
2019-05-14,31.26
2019-05-15,31.38
2019-05-16,31.22
2019-05-17,30.95
2019-05-20,30.08
2019-05-21,30.65
2019-05-22,30.21
2019-05-23,29.5
2019-05-24,29.31
2019-05-28,29.03
2019-05-29,28.46
2019-05-30,28.13
2019-05-31,27.83
2019-06-03,27.71
2019-06-04,27.85
2019-06-05,27.74
2019-06-06,27.39
2019-06-07,27.65
2019-06-10,28.3
2019-06-11,28.68
2019-06-12,28.57
2019-06-13,28.83
2019-06-14,28.53
2019-06-17,28.68
2019-06-18,29.055
2019-06-19,28.97
2019-06-20,29.055
2019-06-21,28.38
2019-06-24,27.345
2019-06-25,27.505
2019-06-26,27.18
2019-06-27,27.86
2019-06-28,28.2
2019-07-01,27.85
2019-07-02,28.04
2019-07-03,28.455
2019-07-04,28.455
2019-07-05,28.54
2019-07-08,28.34
2019-07-09,28.08
2019-07-10,28.29
2019-07-11,27.355
2019-07-12,27.68
2019-07-15,27.48
2019-07-16,27.32
2019-07-17,26.95
2019-07-18,26.9
2019-07-19,26.825
2019-07-22,26.605
2019-07-23,27.125
2019-07-24,27.535
2019-07-25,27.405
2019-07-26,27.99
2019-07-29,28.48
2019-07-30,28.42
2019-07-31,27.975
2019-08-01,27.265
2019-08-02,27.11
2019-08-05,26.29
2019-08-06,26.255
2019-08-07,26.36
2019-08-08,27.335
2019-08-09,27.11
2019-08-12,26.74
2019-08-13,27.13
2019-08-14,26.345
2019-08-15,26.145
2019-08-16,26.6
2019-08-19,26.76
2019-08-20,26.62
2019-08-21,26.35
2019-08-22,26.56
2019-08-23,25.97
2019-08-26,26.17
2019-08-27,26.255
2019-08-28,26.51
2019-08-29,26.865
2019-08-30,26.945
2019-09-02,26.96
2019-09-03,26.63
2019-09-04,27.05
2019-09-05,27.635
2019-09-06,27.64
2019-09-09,28.515
2019-09-10,29.01
2019-09-11,29.295
2019-09-12,28.645
2019-09-13,28.735
2019-09-16,28.505
2019-09-17,28.1
2019-09-18,28.215
2019-09-19,27.755
2019-09-20,27.965
2019-09-23,27.835
2019-09-24,27.6
2019-09-25,27.935
2019-09-26,27.545
2019-09-27,27.405
2019-09-30,27.845
2019-10-01,27.345
2019-10-02,26.965
2019-10-03,26.565
2019-10-04,26.88
2019-10-07,26.965
2019-10-08,26.51
2019-10-09,26.33
2019-10-10,26.6
2019-10-11,27.15
2019-10-14,26.6
2019-10-15,26.55
2019-10-16,26.255
2019-10-17,26.15
2019-10-18,26.405
2019-10-21,26.6
2019-10-22,26.775
2019-10-23,26.875
2019-10-24,26.725
2019-10-25,25.97
2019-10-28,26.05
2019-10-29,25.89
2019-10-30,26.105
2019-10-31,25.73
2019-11-01,26.315
2019-11-04,27.085
2019-11-05,27.43
2019-11-06,27.23
2019-11-07,26.715
2019-11-08,26.475
2019-11-11,25.44
2019-11-12,25.02
2019-11-13,24.885
2019-11-14,25.255
2019-11-15,25.54
2019-11-18,25.535
2019-11-19,25.575
2019-11-20,25.225
2019-11-21,25.015
2019-11-22,25.415
2019-11-25,25.825
