date,close
2014-06-13,43.7049
2014-06-16,43.4648
2014-06-17,43.8828
2014-06-18,43.7672
2014-06-19,43.7494
2014-06-20,43.9006
2014-06-23,44.0073
2014-06-24,43.3669
2014-06-25,43.4381
2014-06-26,43.0823
2014-06-27,43.278
2014-06-30,43.4114
2014-07-01,44.2652
2014-07-02,44.114
2014-07-03,44.3186
2014-07-07,43.9895
2014-07-08,43.8472
2014-07-09,44.1496
2014-07-10,43.8205
2014-07-11,43.6515
2014-07-14,43.6515
2014-07-15,43.2246
2014-07-16,43.358
2014-07-17,42.8244
2014-07-18,43.1713
2014-07-21,43.1802
2014-07-22,43.4737
2014-07-23,41.8994
2014-07-24,41.9706
2014-07-25,40.8233
2014-07-28,41.0278
2014-07-29,41.1346
2014-07-30,41.1346
2014-07-31,40.0406
2014-08-01,40.9478
2014-08-04,41.1257
2014-08-05,41.099
2014-08-06,41.4903
2014-08-07,40.5298
2014-08-08,40.8855
2014-08-11,41.1523
2014-08-12,41.4281
2014-08-13,41.8194
2014-08-14,41.8728
2014-08-15,42.1307
2014-08-18,41.8283
2014-08-19,42.1653
2014-08-20,42.6492
2014-08-21,42.8284
2014-08-22,42.806
2014-08-25,42.7567
2014-08-26,42.8553
2014-08-27,42.7119
2014-08-28,43.0346
2014-08-29,43.7605
2014-09-02,43.7112
2014-09-03,43.5275
2014-09-04,43.5723
2014-09-05,43.7784
2014-09-08,43.8859
2014-09-09,43.5633
2014-09-10,43.2765
2014-09-11,43.3572
2014-09-12,42.7209
2014-09-15,42.3983
2014-09-16,43.0704
2014-09-17,43.3841
2014-09-18,44.0786
2014-09-19,43.402
2014-09-22,43.0166
2014-09-23,42.5685
2014-09-24,42.8195
2014-09-25,42.4341
2014-09-26,42.6582
2014-09-29,42.5865
2014-09-30,42.3266
2014-10-01,41.287
2014-10-02,41.4752
2014-10-03,41.3408
2014-10-06,41.2064
2014-10-07,40.2609
2014-10-08,41.4035
2014-10-09,40.812
2014-10-10,35.8069
2014-10-13,34.6732
2014-10-14,34.243
2014-10-15,33.8129
2014-10-16,35.1213
2014-10-17,34.4043
2014-10-20,35.0586
2014-10-21,36.3759
2014-10-22,35.8203
2014-10-23,36.1519
2014-10-24,36.7792
2014-10-27,36.8957
2014-10-28,37.532
2014-10-29,37.8367
2014-10-30,36.824
2014-10-31,38.6343
2014-11-03,38.7239
2014-11-04,38.4282
2014-11-05,39.06
2014-11-06,38.9928
2014-11-07,38.6612
2014-11-10,38.9749
2014-11-11,38.8763
2014-11-12,38.8763
2014-11-13,38.4372
2014-11-14,38.8584
2014-11-17,39.1227
2014-11-18,39.4543
2014-11-19,38.9859
2014-11-20,39.0672
2014-11-21,39.5551
2014-11-24,39.8081
2014-11-25,39.8623
2014-11-26,40.7025
2014-11-28,40.7929
2014-12-01,40.4134
2014-12-02,40.3411
2014-12-03,42.0939
2014-12-04,41.5789
2014-12-05,41.8229
2014-12-08,40.9148
2014-12-09,41.0278
2014-12-10,40.1875
2014-12-11,40.3773
2014-12-12,39.4828
2014-12-15,38.9678
2014-12-16,38.9407
2014-12-17,39.4918
2014-12-18,40.8019
2014-12-19,40.9103
2014-12-22,41.2356
2014-12-23,41.3711
2014-12-24,41.4163
2014-12-26,41.2988
2014-12-29,41.1272
2014-12-30,40.8561
2014-12-31,40.7567
2015-01-02,40.5399
2015-01-05,39.6364
2015-01-06,38.8684
2015-01-07,39.0853
2015-01-08,40.3321
2015-01-09,40.2237
2015-01-12,39.7809
2015-01-13,39.7267
2015-01-14,40.6664
2015-01-15,40.1695
2015-01-16,40.5128
2015-01-20,40.8922
2015-01-21,41.7144
2015-01-22,42.0487
2015-01-23,42.0307
2015-01-26,42.2746
2015-01-27,41.3711
2015-01-28,41.2988
2015-01-29,41.4253
2015-01-30,40.7477
2015-02-02,40.445
2015-02-03,41.1859
2015-02-04,41.859
2015-02-05,44.3075
2015-02-06,43.9461
2015-02-09,43.2594
2015-02-10,44.1629
2015-02-11,44.1494
2015-02-12,45.1568
2015-02-13,45.8163
2015-02-17,45.997
2015-02-18,45.8163
2015-02-19,45.9774
2015-02-20,46.3368
2015-02-23,46.0592
2015-02-24,46.8873
2015-02-25,46.7235
2015-02-26,46.8281
2015-02-27,46.6507
2015-03-02,47.688
2015-03-03,46.7963
2015-03-04,46.8418
2015-03-05,46.2958
2015-03-06,46.1775
2015-03-09,46.7053
2015-03-10,45.0675
2015-03-11,44.5989
2015-03-12,45.213
2015-03-13,45.0584
2015-03-16,45.8864
2015-03-17,45.2494
2015-03-18,45.6862
2015-03-19,45.7681
2015-03-20,46.2867
2015-03-23,45.8363
2015-03-24,45.1493
2015-03-25,43.7572
2015-03-26,43.8664
2015-03-27,44.7717
2015-03-30,45.395
2015-03-31,44.4942
2015-04-01,43.9574
2015-04-02,43.8391
2015-04-06,43.9665
2015-04-07,44.517
2015-04-08,44.5079
2015-04-09,44.9492
2015-04-10,45.4951
2015-04-13,45.0675
2015-04-14,44.4032
2015-04-15,45.5952
2015-04-16,45.7317
2015-04-17,44.7672
2015-04-20,45.1402
2015-04-21,44.7899
2015-04-22,44.8582
2015-04-23,44.1939
2015-04-24,43.0657
2015-04-27,43.0839
2015-04-28,43.6207
2015-04-29,43.3295
2015-04-30,43.3614
2015-05-01,44.2121
2015-05-04,44.4396
2015-05-05,43.2567
2015-05-06,42.8609
2015-05-07,43.1385
2015-05-08,44.5579
2015-05-11,44.9355
2015-05-12,44.6671
2015-05-13,45.1812
2015-05-14,45.3586
2015-05-15,44.8172
2015-05-18,44.567
2015-05-19,44.2897
2015-05-20,44.6197
2015-05-21,44.3539
2015-05-22,44.3631
2015-05-26,43.7765
2015-05-27,44.4547
2015-05-28,44.803
2015-05-29,45.0322
2015-06-01,44.9955
2015-06-02,44.2577
2015-06-03,44.0148
2015-06-04,43.3594
2015-06-05,43.5015
2015-06-08,42.7682
2015-06-09,42.9286
2015-06-10,43.5473
2015-06-11,43.6665
2015-06-12,43.4098
2015-06-15,43.6298
2015-06-16,43.7581
2015-06-17,43.9002
2015-06-18,44.9222
2015-06-19,45.5226
2015-06-22,46.2054
2015-06-23,46.0129
2015-06-24,45.3484
2015-06-25,45.2247
2015-06-26,44.3814
2015-06-29,43.2632
2015-06-30,43.4694
2015-07-01,42.7499
2015-07-02,42.6445
2015-07-06,41.9524
2015-07-07,41.8608
2015-07-08,40.9625
2015-07-09,40.495
2015-07-10,41.1092
2015-07-13,41.2008
2015-07-14,41.4483
2015-07-15,41.2192
2015-07-16,40.7975
2015-07-17,40.6417
2015-07-20,40.3209
2015-07-21,40.1467
2015-07-22,38.5794
2015-07-23,39.111
2015-07-24,38.3777
2015-07-27,38.2952
2015-07-28,39.1018
2015-07-29,39.2027
2015-07-30,39.331
2015-07-31,39.2668
2015-08-03,39.2164
2015-08-04,39.221
2015-08-05,40.1742
2015-08-06,39.6243
2015-08-07,39.9268
2015-08-10,40.715
2015-08-11,40.0734
2015-08-12,40.1926
2015-08-13,39.7709
2015-08-14,39.6793
2015-08-17,39.8901
2015-08-18,39.3493
2015-08-19,39.1202
2015-08-20,38.0661
2015-08-21,37.4336
2015-08-24,36.792
2015-08-25,36.2696
2015-08-26,37.6628
2015-08-27,39.166
2015-08-28,39.6335
2015-08-31,38.9552
2015-09-01,36.9753
2015-09-02,37.6628
2015-09-03,38.2586
2015-09-04,37.5803
2015-09-08,41.1183
2015-09-09,40.9964
2015-09-10,40.8393
2015-09-11,40.5529
2015-09-14,40.5806
2015-09-15,40.6637
2015-09-16,40.5713
2015-09-17,40.0354
2015-09-18,39.5457
2015-09-21,39.4811
2015-09-22,38.7973
2015-09-23,38.206
2015-09-24,38.1413
2015-09-25,38.2337
2015-09-28,37.7532
2015-09-29,38.5016
2015-09-30,39.8137
2015-10-01,38.9821
2015-10-02,40.0816
2015-10-05,41.6524
2015-10-06,41.9111
2015-10-07,42.4839
2015-10-08,43.103
2015-10-09,42.7519
2015-10-12,42.7611
2015-10-13,42.5579
2015-10-14,43.7128
2015-10-15,43.7313
2015-10-16,43.3709
2015-10-19,43.6389
2015-10-20,43.796
2015-10-21,43.5742
2015-10-22,45.145
2015-10-23,45.376
2015-10-26,44.8216
2015-10-27,44.2857
2015-10-28,44.8678
2015-10-29,43.7867
2015-10-30,44.6183
2015-11-02,45.1727
2015-11-03,45.108
2015-11-04,45.2651
2015-11-05,44.2672
2015-11-06,44.2118
2015-11-09,44.1794
2015-11-10,43.5742
2015-11-11,43.5188
2015-11-12,42.8443
2015-11-13,42.1698
2015-11-16,42.4562
2015-11-17,42.5763
2015-11-18,43.7483
2015-11-19,43.9345
2015-11-20,44.1207
2015-11-23,43.3944
2015-11-24,43.9811
2015-11-25,43.9066
2015-11-27,44.4094
2015-11-30,44.9588
2015-12-01,45.1544
2015-12-02,43.4503
2015-12-03,43.2361
2015-12-04,44.1114
2015-12-07,43.4689
2015-12-08,43.0312
2015-12-09,42.3794
2015-12-10,42.2304
2015-12-11,41.5692
2015-12-14,41.5413
2015-12-15,42.9009
2015-12-16,43.8693
2015-12-17,43.2454
2015-12-18,42.9195
2015-12-21,43.6272
2015-12-22,43.9252
2015-12-23,44.0556
2015-12-24,44.009
2015-12-28,44.2604
2015-12-29,44.8098
2015-12-30,44.456
2015-12-31,43.3385
2016-01-04,42.8171
2016-01-05,42.5004
2016-01-06,41.8393
2016-01-07,39.7254
2016-01-08,38.6732
2016-01-11,38.6452
2016-01-12,38.9712
2016-01-13,38.4683
2016-01-14,39.1481
2016-01-15,37.7326
2016-01-19,38.8315
2016-01-20,39.9024
2016-01-21,40.6101
2016-01-22,40.1724
2016-01-25,40.2283
2016-01-26,41.2061
2016-01-27,40.3493
2016-01-28,40.191
2016-01-29,41.7275
2016-02-01,41.3737
2016-02-02,40.2097
2016-02-03,39.4088
2016-02-04,39.7999
2016-02-05,39.3157
2016-02-08,38.3845
2016-02-09,38.4217
2016-02-10,37.4998
2016-02-11,36.9225
2016-02-12,37.6302
2016-02-16,38.7663
2016-02-17,39.7254
2016-02-18,39.4193
2016-02-19,39.7902
2016-02-22,40.4476
2016-02-23,39.6869
2016-02-24,41.0205
2016-02-25,41.1425
2016-02-26,42.1474
2016-02-29,41.7811
2016-03-01,42.4667
2016-03-02,42.955
2016-03-03,43.3119
2016-03-04,43.9787
2016-03-07,44.8145
2016-03-08,43.8284
2016-03-09,44.6173
2016-03-10,44.2322
2016-03-11,45.6503
2016-03-14,45.1713
2016-03-15,45.1619
2016-03-16,45.1056
2016-03-17,45.4812
2016-03-18,46.1198
2016-03-21,45.7818
2016-03-22,45.3686
2016-03-23,45.0399
2016-03-24,45.1901
2016-03-28,45.0868
2016-03-29,45.8381
2016-03-30,45.8663
2016-03-31,45.2652
2016-04-01,45.3404
2016-04-04,45.4343
2016-04-05,45.6879
2016-04-06,45.6785
2016-04-07,44.9647
2016-04-08,45.5
2016-04-11,45.4531
2016-04-12,45.3592
2016-04-13,46.2231
2016-04-14,46.2701
2016-04-15,45.7912
2016-04-18,45.9226
2016-04-19,45.5658
2016-04-20,46.5706
2016-04-21,46.4204
2016-04-22,46.6833
2016-04-25,46.5518
2016-04-26,47.0308
2016-04-27,47.2749
2016-04-28,46.4955
2016-04-29,45.6315
2016-05-02,46.3452
2016-05-03,45.8287
2016-05-04,45.4719
2016-05-05,44.9084
2016-05-06,45.0305
2016-05-09,44.6736
2016-05-10,45.3967
2016-05-11,45.3779
2016-05-12,44.4482
2016-05-13,44.2886
2016-05-16,45.0305
2016-05-17,44.8708
2016-05-18,45.3873
2016-05-19,45.0746
2016-05-20,46.1911
2016-05-23,46.2289
2016-05-24,47.2697
2016-05-25,47.4684
2016-05-26,47.932
2016-05-27,48.2442
2016-05-31,48.8971
2016-06-01,48.9254
2016-06-02,48.9349
2016-06-03,49.0201
2016-06-06,48.9728
2016-06-07,49.9662
2016-06-08,50.1365
2016-06-09,49.9284
2016-06-10,49.4364
2016-06-13,49.1147
2016-06-14,49.3891
2016-06-15,49.2944
2016-06-16,49.2471
2016-06-17,48.4524
2016-06-20,49.0768
2016-06-21,49.1147
2016-06-22,48.8119
2016-06-23,49.9946
2016-06-24,47.7522
2016-06-27,45.5382
2016-06-28,46.702
2016-06-29,47.0237
2016-06-30,48.0266
2016-07-01,47.7049
2016-07-05,47.1561
2016-07-06,46.825
2016-07-07,47.686
2016-07-08,49.0768
2016-07-11,49.531
2016-07-12,50.2406
2016-07-13,50.3825
2016-07-14,50.7231
2016-07-15,50.8745
2016-07-18,51.13
2016-07-19,50.8177
2016-07-20,51.4138
2016-07-21,50.9029
2016-07-22,51.253
2016-07-25,51.3476
2016-07-26,54.2523
2016-07-27,54.0063
2016-07-28,53.6373
2016-07-29,52.6438
2016-08-01,52.8047
2016-08-02,52.0194
2016-08-03,52.3505
2016-08-04,52.7479
2016-08-05,53.5143
2016-08-08,53.5805
2016-08-09,57.3651
2016-08-10,57.1002
2016-08-11,57.4976
2016-08-12,57.2516
2016-08-15,57.9139
2016-08-16,57.5543
2016-08-17,57.6679
2016-08-18,58.277
2016-08-19,58.3436
2016-08-22,58.3151
2016-08-23,58.4388
2016-08-24,58.0771
2016-08-25,58.1818
2016-08-26,58.6101
2016-08-29,58.6291
2016-08-30,58.4673
2016-08-31,58.9242
2016-09-01,59.7713
2016-09-02,59.6666
2016-09-06,59.2668
2016-09-07,57.8487
2016-09-08,57.7345
2016-09-09,55.6977
2016-09-12,56.9731
2016-09-13,56.2783
2016-09-14,56.5448
2016-09-15,57.5251
2016-09-16,57.4013
2016-09-19,57.6678
2016-09-20,57.2967
2016-09-21,58.1723
2016-09-22,58.2294
2016-09-23,57.7154
2016-09-26,57.5536
2016-09-27,58.3626
2016-09-28,58.6767
2016-09-29,58.9813
2016-09-30,59.1431
2016-10-03,58.8385
2016-10-04,58.3626
2016-10-05,59.1241
2016-10-06,59.5619
2016-10-07,59.067
2016-10-10,58.3531
2016-10-11,56.8113
2016-10-12,56.1545
2016-10-13,55.593
2016-10-14,56.1545
2016-10-17,55.869
2016-10-18,56.0213
2016-10-19,57.1158
2016-10-20,56.8303
2016-10-21,56.6304
2016-10-24,57.7154
2016-10-25,57.9724
2016-10-26,57.6298
2016-10-27,57.4489
2016-10-28,57.3918
2016-10-31,57.6298
2016-11-01,57.2776
2016-11-02,56.9731
2016-11-03,56.7541
2016-11-04,57.3157
2016-11-07,59.2288
2016-11-08,60.8753
2016-11-09,61.2084
2016-11-10,59.4286
2016-11-11,60.1044
2016-11-14,60.4661
2016-11-15,62.046
2016-11-16,62.4838
2016-11-17,62.6374
2016-11-18,61.7952
2016-11-21,62.3981
2016-11-22,62.7522
2016-11-23,63.269
2016-11-25,63.2403
2016-11-28,63.0681
2016-11-29,63.1925
2016-11-30,63.336
2016-12-01,58.5987
2016-12-02,59.3835
2016-12-05,60.5128
2016-12-06,60.7616
2016-12-07,61.7282
2016-12-08,62.3886
2016-12-09,61.7569
2016-12-12,60.8765
2016-12-13,62.3024
2016-12-14,62.2546
2016-12-15,63.0011
2016-12-16,61.7569
2016-12-19,62.2163
2016-12-20,62.4938
2016-12-21,62.3694
2016-12-22,62.5704
2016-12-23,62.5895
2016-12-27,62.5895
2016-12-28,61.8909
2016-12-29,61.977
2016-12-30,61.3933
2017-01-03,61.1062
2017-01-04,61.0774
2017-01-05,59.9003
2017-01-06,60.9435
2017-01-09,61.6517
2017-01-10,62.0632
2017-01-11,63.6231
2017-01-12,63.6231
2017-01-13,63.4892
2017-01-17,62.1589
2017-01-18,63.6423
2017-01-19,62.8671
2017-01-20,64.0538
2017-01-23,64.1495
2017-01-24,64.9821
2017-01-25,65.8626
2017-01-26,64.7237
2017-01-27,65.8052
2017-01-30,66.0923
2017-01-31,64.4557
2017-02-01,65.4702
2017-02-02,65.8243
2017-02-03,66.4464
2017-02-06,66.1975
2017-02-07,66.6282
2017-02-08,70.6286
2017-02-09,67.8819
2017-02-10,67.8532
2017-02-13,67.6235
2017-02-14,67.7384
2017-02-15,68.8102
2017-02-16,68.9747
2017-02-17,68.9459
2017-02-21,69.7153
2017-02-22,70.254
2017-02-23,69.9366
2017-02-24,70.052
2017-02-27,70.3405
2017-02-28,69.7538
2017-03-01,70.8311
2017-03-02,70.2251
2017-03-03,70.5041
2017-03-06,71.1004
2017-03-07,71.0235
2017-03-08,70.7253
2017-03-09,70.6772
2017-03-10,71.1293
2017-03-13,71.6583
2017-03-14,71.1677
2017-03-15,71.6775
2017-03-16,71.2928
2017-03-17,71.4467
2017-03-20,71.514
2017-03-21,69.5807
2017-03-22,70.6964
2017-03-23,69.975
2017-03-24,70.3598
2017-03-27,70.0424
2017-03-28,70.6964
2017-03-29,70.8696
2017-03-30,71.0619
2017-03-31,70.9658
2017-04-03,70.4175
2017-04-04,70.6483
2017-04-05,70.2347
2017-04-06,70.7157
2017-04-07,71.2351
2017-04-10,70.6099
2017-04-11,69.8885
2017-04-12,69.3979
2017-04-13,69.4845
2017-04-17,70.2347
2017-04-18,71.3024
2017-04-19,72.0046
2017-04-20,72.7452
2017-04-21,71.591
2017-04-24,73.053
2017-04-25,73.8032
2017-04-26,73.2454
2017-04-27,73.8225
2017-04-28,72.6971
2017-05-01,73.255
2017-05-02,72.8029
2017-05-03,72.3797
2017-05-04,72.1488
2017-05-05,72.3027
2017-05-08,72.5817
2017-05-09,73.5339
2017-05-10,75.5153
2017-05-11,76.0251
2017-05-12,75.9866
2017-05-15,77.0735
2017-05-16,78.5163
2017-05-17,75.3518
2017-05-18,76.3137
2017-05-19,77.4746
2017-05-22,78.3732
2017-05-23,78.6051
2017-05-24,78.9047
2017-05-25,79.011
2017-05-26,78.9433
2017-05-30,79.726
2017-05-31,80.4893
2017-06-01,80.6149
2017-06-02,81.4942
2017-06-05,81.6585
2017-06-06,82.3156
2017-06-07,83.3881
2017-06-08,83.9292
2017-06-09,80.6633
2017-06-12,80.2768
2017-06-13,80.7116
2017-06-14,79.5231
2017-06-15,78.8177
2017-06-16,78.4892
2017-06-19,79.8226
2017-06-20,77.6389
2017-06-21,78.1027
2017-06-22,77.3683
2017-06-23,78.837
2017-06-26,77.5906
2017-06-27,76.0542
2017-06-28,77.1364
2017-06-29,74.7691
2017-06-30,74.5758
2017-07-03,73.2521
2017-07-05,75.3102
2017-07-06,74.5179
2017-07-07,75.716
2017-07-10,76.1025
2017-07-11,76.4407
2017-07-12,77.4553
2017-07-13,76.8079
2017-07-14,78.1123
2017-07-17,78.2959
2017-07-18,78.8177
2017-07-19,79.5327
2017-07-20,80.2381
2017-07-21,78.151
2017-07-24,77.8321
2017-07-25,78.209
2017-07-26,79.8999
2017-07-27,78.1993
2017-07-28,77.9771
2017-07-31,77.3393
2017-08-01,77.6195
2017-08-02,77.1268
2017-08-03,77.9577
2017-08-04,80.6729
2017-08-07,82.1126
2017-08-08,81.7648
2017-08-09,80.7792
2017-08-10,78.4988
2017-08-11,79.4361
2017-08-14,81.185
2017-08-15,81.4459
2017-08-16,81.3203
2017-08-17,79.2358
2017-08-18,79.1679
2017-08-21,79.1193
2017-08-22,80.2645
2017-08-23,80.4488
2017-08-24,80.245
2017-08-25,80.1868
2017-08-28,81.2834
2017-08-29,81.3513
2017-08-30,83.1466
2017-08-31,84.2335
2017-09-01,85.2525
2017-09-05,83.9327
2017-09-06,83.5736
2017-09-07,84.8061
2017-09-08,84.0103
2017-09-11,85.7668
2017-09-12,85.8347
2017-09-13,85.728
2017-09-14,86.6014
2017-09-15,86.9701
2017-09-18,88.319
2017-09-19,88.2899
2017-09-20,85.7086
2017-09-21,85.7668
2017-09-22,87.0381
2017-09-25,85.466
2017-09-26,85.1651
2017-09-27,86.2908
2017-09-28,86.5043
2017-09-29,87.1254
2017-10-02,87.8726
2017-10-03,88.0376
2017-10-04,88.8916
2017-10-05,88.6005
2017-10-06,88.8431
2017-10-09,88.7849
2017-10-10,89.2021
2017-10-11,89.2118
2017-10-12,89.0663
2017-10-13,89.0469
2017-10-16,89.173
2017-10-17,88.9886
2017-10-18,89.3962
2017-10-19,90.2987
2017-10-20,89.9882
2017-10-23,89.8717
2017-10-24,90.551
2017-10-25,89.5903
2017-10-26,90.3667
2017-10-27,91.9193
2017-10-30,92.3949
2017-10-31,91.997
2017-11-01,90.2405
2017-11-02,90.6966
2017-11-03,90.8907
2017-11-06,92.5404
2017-11-07,88.7363
2017-11-08,90.0658
2017-11-09,88.125
2017-11-10,88.8528
2017-11-13,88.3287
2017-11-14,88.319
2017-11-15,86.941
2017-11-16,88.0958
2017-11-17,88.6005
2017-11-20,89.0413
2017-11-21,89.509
2017-11-22,88.0767
2017-11-24,88.6321
2017-11-27,86.6445
2017-11-28,88.2521
2017-11-29,84.3549
2017-11-30,84.7544
2017-12-01,84.7641
2017-12-04,84.0821
2017-12-05,83.9944
2017-12-06,84.0919
2017-12-07,85.1441
2017-12-08,85.1636
2017-12-11,85.1441
2017-12-12,83.6339
2017-12-13,84.1795
2017-12-14,83.2734
2017-12-15,84.5205
2017-12-18,86.6835
2017-12-19,87.2876
2017-12-20,87.9014
2017-12-21,87.1609
2017-12-22,86.6348
2017-12-26,86.3522
2017-12-27,86.1281
2017-12-28,86.3327
2017-12-29,85.6215
2018-01-02,88.0865
2018-01-03,89.4115
2018-01-04,89.6259
2018-01-05,89.8889
2018-01-08,90.2397
2018-01-09,90.1325
2018-01-10,88.6126
2018-01-11,89.7428
2018-01-12,91.0386
2018-01-16,90.9314
2018-01-17,93.5523
2018-01-18,94.7897
2018-01-19,94.9456
2018-01-22,96.1537
2018-01-23,95.9881
2018-01-24,92.9093
2018-01-25,90.1033
2018-01-26,94.4194
2018-01-29,94.3902
2018-01-30,92.5488
2018-01-31,92.7729
2018-02-01,92.1103
2018-02-02,90.912
2018-02-05,87.1999
2018-02-06,89.5577
2018-02-07,80.7792
2018-02-08,77.8466
2018-02-09,78.9573
2018-02-12,80.8864
2018-02-13,78.7332
2018-02-14,80.0972
2018-02-15,80.37
2018-02-16,81.2664
2018-02-20,83.0405
2018-02-21,82.3457
2018-02-22,82.1207
2018-02-23,83.3341
2018-02-26,84.5279
2018-02-27,86.6514
2018-02-28,87.0232
2018-03-01,87.1113
2018-03-02,89.3326
2018-03-05,92.4445
2018-03-06,94.4994
2018-03-07,93.5209
2018-03-08,93.2958
2018-03-09,96.848
2018-03-12,98.0908
2018-03-13,95.9281
2018-03-14,95.1649
2018-03-15,95.4389
2018-03-16,96.0749
2018-03-19,94.8909
2018-03-20,96.4272
2018-03-21,97.0828
2018-03-22,94.4799
2018-03-23,91.9943
2018-03-26,95.889
2018-03-27,92.376
2018-03-28,89.2054
2018-03-29,89.4011
2018-04-02,85.7511
2018-04-03,87.1211
2018-04-04,88.2464
2018-04-05,87.6985
2018-04-06,84.4203
2018-04-09,84.3518
2018-04-10,86.8275
2018-04-11,86.6025
2018-04-12,87.1505
2018-04-13,85.4576
2018-04-16,84.3811
2018-04-17,87.1602
2018-04-18,86.1132
2018-04-19,83.3145
2018-04-20,83.8429
2018-04-23,82.5904
2018-04-24,80.6724
2018-04-25,81.2008
2018-04-26,83.0797
2018-04-27,82.8448
2018-04-30,81.8662
2018-05-01,83.1971
2018-05-02,82.9622
2018-05-03,84.2637
2018-05-04,85.6337
2018-05-07,86.8373
2018-05-08,88.7064
2018-05-09,89.8904
2018-05-10,91.1626
2018-05-11,90.9571
2018-05-14,91.4561
2018-05-15,91.3583
2018-05-16,91.505
2018-05-17,91.368
2018-05-18,91.1652
2018-05-21,92.1574
2018-05-22,92.6682
2018-05-23,92.4226
2018-05-24,93.1791
2018-05-25,94.1222
2018-05-29,93.5524
2018-05-30,95.7922
2018-05-31,95.6645
2018-06-01,99.2698
2018-06-04,99.6235
2018-06-05,100.3406
2018-06-06,101.49
2018-06-07,100.4192
2018-06-08,100.3505
2018-06-11,100.5961
2018-06-12,100.8809
2018-06-13,100.2817
2018-06-14,100.7631
2018-06-15,100.1835
2018-06-18,99.8494
2018-06-19,98.6313
2018-06-20,99.4467
2018-06-21,96.9612
2018-06-22,95.2126
2018-06-25,91.5974
2018-06-26,91.4992
2018-06-27,88.7092
2018-06-28,88.8468
2018-06-29,89.3478
2018-07-02,89.8586
2018-07-03,88.5127
2018-07-05,90.507
2018-07-06,91.7644
2018-07-09,91.735
2018-07-10,92.9335
2018-07-11,90.3891
2018-07-12,92.6191
2018-07-13,92.3735
2018-07-16,92.4521
2018-07-17,93.3755
2018-07-18,94.073
2018-07-19,93.1299
2018-07-20,92.7075
2018-07-23,92.5405
2018-07-24,91.6171
2018-07-25,91.2929
2018-07-26,93.0022
2018-07-27,93.631
2018-07-30,91.568
2018-07-31,91.7841
2018-08-01,91.9413
2018-08-02,92.9433
2018-08-03,93.4148
2018-08-06,93.9159
2018-08-07,95.5466
2018-08-08,96.0378
2018-08-09,96.3522
2018-08-10,85.8701
2018-08-13,85.4968
2018-08-14,82.5988
2018-08-15,80.8894
2018-08-16,80.3491
2018-08-17,81.5476
2018-08-20,81.4036
2018-08-21,83.8901
2018-08-22,84.2848
2018-08-23,84.5315
2018-08-24,85.824
2018-08-27,87.1956
2018-08-28,86.3371
2018-08-29,85.6662
2018-08-30,84.413
2018-08-31,84.8867
2018-09-04,84.9459
2018-09-05,84.0085
2018-09-06,82.785
2018-09-07,81.9463
2018-09-10,82.9034
2018-09-11,82.1239
2018-09-12,82.3607
2018-09-13,82.6567
2018-09-14,82.489
2018-09-17,79.8051
2018-09-18,79.3216
2018-09-19,80.2886
2018-09-20,82.2719
2018-09-21,81.6503
2018-09-24,81.2062
2018-09-25,77.7232
2018-09-26,77.7429
2018-09-27,77.5653
2018-09-28,77.8613
2018-10-01,76.1346
2018-10-02,76.618
2018-10-03,74.1217
2018-10-04,70.4807
2018-10-05,68.3593
2018-10-08,66.8003
2018-10-09,66.4845
2018-10-10,65.557
2018-10-11,66.8003
2018-10-12,67.3528
2018-10-15,67.3134
2018-10-16,68.231
2018-10-17,68.1323
2018-10-18,66.6523
2018-10-19,66.1392
2018-10-22,65.9418
2018-10-23,66.3267
2018-10-24,60.4853
2018-10-25,61.6792
2018-10-26,61.5411
2018-10-29,61.4622
2018-10-30,63.9881
2018-10-31,64.9058
2018-11-01,69.4348
2018-11-02,68.8132
2018-11-05,68.4086
2018-11-06,69.0993
2018-11-07,69.3657
2018-11-08,73.4606
2018-11-09,71.1714
2018-11-12,68.7342
2018-11-13,69.9183
2018-11-14,71.0629
2018-11-15,74.3486
2018-11-16,74.6051
2018-11-19,72.8981
2018-11-20,72.387
2018-11-21,72.387
2018-11-23,73.7058
2018-11-26,75.104
2018-11-27,73.091
2018-11-28,75.2527
2018-11-29,73.7951
2018-11-30,74.3702
2018-12-03,77.107
2018-12-04,73.8546
2018-12-06,72.7836
2018-12-07,69.67
2018-12-10,71.2962
2018-12-11,71.5937
2018-12-12,72.9621
2018-12-13,71.8218
2018-12-14,71.0384
2018-12-17,70.612
2018-12-18,71.5342
2018-12-19,68.0339
2018-12-20,68.133
2018-12-21,67.4191
2018-12-24,65.178
2018-12-26,69.789
2018-12-27,70.8897
2018-12-28,71.0384
2018-12-31,71.3161
2019-01-02,70.7508
2019-01-03,65.7631
2019-01-04,68.4305
2019-01-07,70.4335
2019-01-08,72.3473
2019-01-09,75.2131
2019-01-10,75.9766
2019-01-11,76.4823
2019-01-14,73.6166
2019-01-15,74.3801
2019-01-16,74.4495
2019-01-17,75.5105
2019-01-18,76.988
2019-01-22,74.5487
2019-01-23,73.7356
2019-01-24,77.7813
2019-01-25,79.9529
2019-01-28,79.5761
2019-01-29,78.8225
2019-01-30,79.8141
2019-01-31,79.6951
2019-02-01,81.1825
2019-02-04,81.8865
2019-02-05,82.541
2019-02-06,88.56
2019-02-07,87.3304
2019-02-08,86.676
2019-02-11,88.213
2019-02-12,90.7416
2019-02-13,90.4242
2019-02-14,89.8392
2019-02-15,90.335
2019-02-19,89.9284
2019-02-20,89.2564
2019-02-21,88.6093
2019-02-22,88.6491
2019-02-25,89.4157
2019-02-26,88.669
2019-02-27,86.6878
2019-02-28,86.4886
2019-03-01,88.2509
2019-03-04,88.1812
2019-03-05,86.8869
2019-03-06,86.1004
2019-03-07,84.0793
2019-03-08,84.6766
2019-03-11,86.4189
2019-03-12,85.9211
2019-03-13,84.6866
2019-03-14,83.6312
2019-03-15,85.722
2019-03-18,84.9554
2019-03-19,85.722
2019-03-20,83.91
2019-03-21,86.9964
2019-03-22,85.045
2019-03-25,83.452
2019-03-26,83.8801
2019-03-27,81.0128
2019-03-28,80.7938
2019-03-29,82.5958
2019-04-01,87.0761
2019-04-02,87.3349
2019-04-03,89.9036
2019-04-04,90.8693
2019-04-05,92.5121
2019-04-08,93.6471
2019-04-09,92.4922
2019-04-10,93.8362
2019-04-11,93.5575
2019-04-12,94.9414
2019-04-15,95.1803
2019-04-16,97.3408
2019-04-17,98.8342
2019-04-18,98.2767
2019-04-22,97.1715
2019-04-23,97.7291
2019-04-24,98.4061
2019-04-25,97.0521
2019-04-26,97.978
2019-04-29,98.2866
2019-04-30,99.4515
2019-05-01,98.5256
2019-05-02,99.6805
2019-05-03,100.3077
2019-05-06,96.5543
2019-05-07,93.7367
2019-05-08,91.1381
2019-05-09,88.9876
2019-05-10,88.8482
2019-05-13,83.243
2019-05-14,84.2883
2019-05-15,85.4233
2019-05-16,84.7065
2019-05-17,82.8945
2019-05-20,79.54
2019-05-21,81.95
2019-05-22,81.83
2019-05-23,81.59
2019-05-24,80.42
2019-05-28,79.11
2019-05-29,80.55
2019-05-30,81.34
2019-05-31,80.03
2019-06-03,79.75
2019-06-04,84.26
2019-06-05,82.33
2019-06-06,83.13
2019-06-07,83.67
2019-06-10,85.75
2019-06-11,85.34
2019-06-12,83.81
2019-06-13,83.84
2019-06-14,83.435
2019-06-17,81.335
2019-06-18,85.08
2019-06-19,84.8
2019-06-20,85.465
2019-06-21,85.38
2019-06-24,85.08
2019-06-25,84.49
2019-06-26,87.13
2019-06-27,87.1
2019-06-28,87.475
2019-07-01,90.96
2019-07-02,89.75
2019-07-03,89.75
2019-07-04,89.75
2019-07-05,89.14
2019-07-08,87.99
2019-07-09,88.93
2019-07-10,89.43
2019-07-11,89.25
2019-07-12,91.56
2019-07-15,92.7
2019-07-16,90.84
2019-07-17,90.92
2019-07-18,92.825
2019-07-19,92.35
2019-07-22,93.44
2019-07-23,95.48
2019-07-24,99.885
2019-07-25,98.1
2019-07-26,98.11
2019-07-29,98.33
2019-07-30,96.8
2019-07-31,94.47
2019-08-01,91.65
2019-08-02,88.15
2019-08-05,83.76
2019-08-06,85.14
2019-08-07,88.69
2019-08-08,90.62
2019-08-09,87.77
2019-08-12,87.44
2019-08-13,90.32
2019-08-14,87.03
2019-08-15,87.005
2019-08-16,88.425
2019-08-19,90.11
2019-08-20,89.03
2019-08-21,88.86
2019-08-22,89.76
2019-08-23,84.48
2019-08-26,84.56
2019-08-27,84.56
2019-08-28,85
2019-08-29,86.56
2019-08-30,86.29
2019-09-02,86.31
2019-09-03,85.01
2019-09-04,86.41
2019-09-05,88.77
2019-09-06,90.42
2019-09-09,91.82
2019-09-10,92.32
2019-09-11,95.36
2019-09-12,95.465
2019-09-13,95.05
2019-09-16,94.59
2019-09-17,93.775
2019-09-18,93.54
2019-09-19,92.4
2019-09-20,90.56
2019-09-23,91.905
2019-09-24,90.655
2019-09-25,92.985
2019-09-26,92.2
2019-09-27,91.32
2019-09-30,92.96
2019-10-01,93.07
2019-10-02,90.585
2019-10-03,91.6
2019-10-04,93.665
2019-10-07,92.58
2019-10-08,89.405
2019-10-09,91.045
2019-10-10,92.39
2019-10-11,95.44
2019-10-14,95.69
2019-10-15,97.04
2019-10-16,96.28
2019-10-17,95.64
2019-10-18,95.02
2019-10-21,97.705
2019-10-22,96.37
2019-10-23,92.97
2019-10-24,94.05
2019-10-25,93.77
2019-10-28,95.61
2019-10-29,94.945
2019-10-30,95.36
2019-10-31,94.16
2019-11-01,96.86
2019-11-04,99.71
2019-11-05,100.235
2019-11-06,95.255
2019-11-07,95.08
2019-11-08,95.925
2019-11-11,94.53
2019-11-12,93.59
2019-11-13,94.115
2019-11-14,93.575
2019-11-15,94.545
2019-11-18,92.29
2019-11-19,92.62
2019-11-20,91.145
2019-11-21,91.06
2019-11-22,91.665
2019-11-25,93.545
