date,close
2014-06-13,29.1902
2014-06-16,29.0271
2014-06-17,29.1662
2014-06-18,29.2238
2014-06-19,29.3628
2014-06-20,29.4971
2014-06-23,29.6026
2014-06-24,29.4252
2014-06-25,29.8376
2014-06-26,29.8711
2014-06-27,30.2068
2014-06-30,30.0582
2014-07-01,30.2068
2014-07-02,30.0534
2014-07-03,30.226
2014-07-07,30.1445
2014-07-08,30.226
2014-07-09,30.4226
2014-07-10,30.3747
2014-07-11,30.2452
2014-07-14,30.5617
2014-07-15,30.7583
2014-07-16,30.7823
2014-07-17,30.4418
2014-07-18,30.8542
2014-07-21,30.9789
2014-07-22,30.3123
2014-07-23,30.1924
2014-07-24,30.6097
2014-07-25,30.3843
2014-07-28,30.1685
2014-07-29,29.9479
2014-07-30,29.9671
2014-07-31,29.3772
2014-08-01,29.7081
2014-08-04,29.7081
2014-08-05,29.4491
2014-08-06,29.8424
2014-08-07,29.8568
2014-08-08,29.852
2014-08-11,30.039
2014-08-12,30.1109
2014-08-13,30.0486
2014-08-14,30.1829
2014-08-15,30.2692
2014-08-18,30.6192
2014-08-19,30.7247
2014-08-20,30.3267
2014-08-21,30.4898
2014-08-22,30.3075
2014-08-25,30.2596
2014-08-26,30.4514
2014-08-27,30.5425
2014-08-28,30.5954
2014-08-29,30.802
2014-09-02,31.3546
2014-09-03,31.7438
2014-09-04,31.6477
2014-09-05,31.8736
2014-09-08,31.6718
2014-09-09,31.5564
2014-09-10,31.667
2014-09-11,31.7583
2014-09-12,31.5757
2014-09-15,31.5516
2014-09-16,31.542
2014-09-17,31.0182
2014-09-18,30.8501
2014-09-19,30.9365
2014-09-22,30.9654
2014-09-23,30.7155
2014-09-24,30.7395
2014-09-25,30.5185
2014-09-26,30.4512
2014-09-29,30.8452
2014-09-30,30.4032
2014-10-01,29.8457
2014-10-02,29.9419
2014-10-03,30.3311
2014-10-06,30.3215
2014-10-07,29.9899
2014-10-08,30.6771
2014-10-09,30.3023
2014-10-10,30.0908
2014-10-13,29.7016
2014-10-14,30.3071
2014-10-15,30.7347
2014-10-16,30.7395
2014-10-17,31.2489
2014-10-20,31.7006
2014-10-21,32.6232
2014-10-22,32.1331
2014-10-23,31.9937
2014-10-24,32.0754
2014-10-27,31.4795
2014-10-28,31.9937
2014-10-29,31.9985
2014-10-30,30.4176
2014-10-31,30.9606
2014-11-03,30.4608
2014-11-04,30.7203
2014-11-05,30.9942
2014-11-06,31.0855
2014-11-07,31.2201
2014-11-10,31.667
2014-11-11,31.6622
2014-11-12,31.4988
2014-11-13,31.3114
2014-11-14,30.8693
2014-11-17,30.951
2014-11-18,31.2008
2014-11-19,30.9942
2014-11-20,31.1576
2014-11-21,31.0951
2014-11-24,31.2201
2014-11-25,31.5276
2014-11-26,31.9176
2014-11-28,32.2931
2014-12-01,32.4472
2014-12-02,32.6446
2014-12-03,33.4583
2014-12-04,33.6124
2014-12-05,33.4343
2014-12-08,32.7602
2014-12-09,32.895
2014-12-10,32.582
2014-12-11,32.3991
2014-12-12,31.9994
2014-12-15,31.5228
2014-12-16,31.2772
2014-12-17,31.542
2014-12-18,32.6591
2014-12-19,33.0346
2014-12-22,33.3187
2014-12-23,33.6269
2014-12-24,33.5595
2014-12-26,33.4632
2014-12-29,33.7761
2014-12-30,33.4583
2014-12-31,32.8228
2015-01-02,32.8902
2015-01-05,32.1728
2015-01-06,31.6287
2015-01-07,31.908
2015-01-08,32.4569
2015-01-09,31.8165
2015-01-12,31.6768
2015-01-13,31.5228
2015-01-14,31.5372
2015-01-15,31.2772
2015-01-16,31.2339
2015-01-20,31.1905
2015-01-21,31.4698
2015-01-22,31.8165
2015-01-23,30.7572
2015-01-26,30.892
2015-01-27,30.7428
2015-01-28,30.5213
2015-01-29,30.7524
2015-01-30,30.4924
2015-02-02,30.9931
2015-02-03,31.465
2015-02-04,31.8502
2015-02-05,34.6813
2015-02-06,33.9976
2015-02-09,33.9976
2015-02-10,34.6187
2015-02-11,34.8595
2015-02-12,35.6491
2015-02-13,36.0776
2015-02-17,35.8176
2015-02-18,37.1513
2015-02-19,35.5576
2015-02-20,35.2398
2015-02-23,35.5095
2015-02-24,34.9365
2015-02-25,34.7439
2015-02-26,34.932
2015-02-27,34.5896
2015-03-02,35.0478
2015-03-03,34.8742
2015-03-04,34.3918
2015-03-05,34.2423
2015-03-06,34.1603
2015-03-09,33.9287
2015-03-10,33.7744
2015-03-11,33.2679
2015-03-12,33.7358
2015-03-13,33.3644
2015-03-16,33.9625
2015-03-17,33.6345
2015-03-18,34.223
2015-03-19,34.0397
2015-03-20,34.3436
2015-03-23,34.6089
2015-03-24,34.4931
2015-03-25,33.8323
2015-03-26,33.6442
2015-03-27,33.4416
2015-03-30,34.1989
2015-03-31,34.0734
2015-04-01,33.9094
2015-04-02,33.948
2015-04-06,34.797
2015-04-07,34.3966
2015-04-08,35.0044
2015-04-09,34.7777
2015-04-10,34.932
2015-04-13,34.9996
2015-04-14,35.1684
2015-04-15,34.9803
2015-04-16,34.6089
2015-04-17,34.633
2015-04-20,34.7825
2015-04-21,34.7584
2015-04-22,34.7198
2015-04-23,34.9562
2015-04-24,35.9643
2015-04-27,35.9884
2015-04-28,35.9064
2015-04-29,35.617
2015-04-30,35.4096
2015-05-01,35.9064
2015-05-04,36.1331
2015-05-05,35.2118
2015-05-06,34.8307
2015-05-07,34.5606
2015-05-08,34.8742
2015-05-11,34.7005
2015-05-12,34.3243
2015-05-13,34.4931
2015-05-14,34.715
2015-05-15,35.2166
2015-05-18,35.5398
2015-05-19,35.3131
2015-05-20,35.1829
2015-05-21,34.9754
2015-05-22,35.1491
2015-05-26,34.5703
2015-05-27,34.879
2015-05-28,34.7244
2015-05-29,34.304
2015-06-01,34.5166
2015-06-02,34.304
2015-06-03,34.5214
2015-06-04,34.043
2015-06-05,34.2508
2015-06-08,34.6084
2015-06-09,34.4538
2015-06-10,34.6857
2015-06-11,35.1593
2015-06-12,34.8403
2015-06-15,34.5697
2015-06-16,34.4489
2015-06-17,34.5359
2015-06-18,34.8355
2015-06-19,34.9805
2015-06-22,35.0191
2015-06-23,35.0191
2015-06-24,34.908
2015-06-25,35.0578
2015-06-26,35.0819
2015-06-29,34.3668
2015-06-30,33.898
2015-07-01,34.618
2015-07-02,34.6229
2015-07-06,34.4296
2015-07-07,34.5407
2015-07-08,33.6468
2015-07-09,33.6661
2015-07-10,33.898
2015-07-13,34.0672
2015-07-14,34.13
2015-07-15,34.5891
2015-07-16,34.821
2015-07-17,34.5552
2015-07-20,33.8787
2015-07-21,33.2215
2015-07-22,33.0766
2015-07-23,32.603
2015-07-24,32.3807
2015-07-27,32.2019
2015-07-28,32.69
2015-07-29,33.2167
2015-07-30,33.6033
2015-07-31,32.7818
2015-08-03,32.5209
2015-08-04,32.7576
2015-08-05,32.9848
2015-08-06,33.497
2015-08-07,33.497
2015-08-10,34.2411
2015-08-11,33.898
2015-08-12,33.6758
2015-08-13,33.9995
2015-08-14,34.6519
2015-08-17,34.6277
2015-08-18,34.6035
2015-08-19,34.1397
2015-08-20,33.3037
2015-08-21,32.4532
2015-08-24,31.3128
2015-08-25,30.7281
2015-08-26,30.8537
2015-08-27,31.8347
2015-08-28,32.2075
2015-08-31,31.9121
2015-09-01,31.1762
2015-09-02,31.4231
2015-09-03,32.0574
2015-09-04,30.9922
2015-09-08,32.3818
2015-09-09,32.3431
2015-09-10,32.3673
2015-09-11,32.2511
2015-09-14,31.8879
2015-09-15,32.59
2015-09-16,32.8418
2015-09-17,32.5367
2015-09-18,32.4205
2015-09-21,32.4641
2015-09-22,31.4134
2015-09-23,30.6823
2015-09-24,30.3967
2015-09-25,30.4838
2015-09-28,29.4138
2015-09-29,29.2927
2015-09-30,30.1158
2015-10-01,30.571
2015-10-02,31.0164
2015-10-05,31.3263
2015-10-06,30.7017
2015-10-07,31.2585
2015-10-08,32.0041
2015-10-09,32.2172
2015-10-12,32.3334
2015-10-13,31.9654
2015-10-14,32.0913
2015-10-15,32.2075
2015-10-16,32.4108
2015-10-19,32.2462
2015-10-20,32.4689
2015-10-21,32.0138
2015-10-22,33.1274
2015-10-23,32.8418
2015-10-26,32.7982
2015-10-27,32.6771
2015-10-28,32.9047
2015-10-29,32.5948
2015-10-30,33.1662
2015-11-02,34.0086
2015-11-03,32.8369
2015-11-04,32.6433
2015-11-05,32.8224
2015-11-06,32.8176
2015-11-09,32.1203
2015-11-10,32.8127
2015-11-11,33.0112
2015-11-12,31.6749
2015-11-13,31.917
2015-11-16,32.0913
2015-11-17,32.0187
2015-11-18,33.0984
2015-11-19,33.1226
2015-11-20,33.6213
2015-11-23,33.3017
2015-11-24,33.5632
2015-11-25,33.3114
2015-11-27,33.4764
2015-11-30,33.6753
2015-12-01,33.3939
2015-12-02,32.7439
2015-12-03,32.9379
2015-12-04,33.845
2015-12-07,33.3745
2015-12-08,32.7148
2015-12-09,33.3939
2015-12-10,34.8734
2015-12-11,34.6066
2015-12-14,34.3689
2015-12-15,34.5096
2015-12-16,34.7473
2015-12-17,34.2089
2015-12-18,33.8644
2015-12-21,34.1167
2015-12-22,34.4126
2015-12-23,35.2082
2015-12-24,35.1887
2015-12-28,35.2906
2015-12-29,35.8097
2015-12-30,35.572
2015-12-31,35.2809
2016-01-04,34.9802
2016-01-05,35.3925
2016-01-06,35.0578
2016-01-07,34.1312
2016-01-08,33.8499
2016-01-11,33.5491
2016-01-12,34.2428
2016-01-13,33.2969
2016-01-14,33.3842
2016-01-15,33.457
2016-01-19,33.6364
2016-01-20,33.2775
2016-01-21,32.5304
2016-01-22,33.3551
2016-01-25,32.3218
2016-01-26,32.904
2016-01-27,32.0647
2016-01-28,32.4528
2016-01-29,32.4189
2016-02-01,32.5983
2016-02-02,31.8125
2016-02-03,32.0744
2016-02-04,32.9088
2016-02-05,31.6379
2016-02-08,30.9927
2016-02-09,31.6039
2016-02-10,31.6573
2016-02-11,31.0848
2016-02-12,31.6136
2016-02-16,32.1424
2016-02-17,32.5595
2016-02-18,32.2733
2016-02-19,32.0453
2016-02-22,32.2442
2016-02-23,32.0308
2016-02-24,32.4528
2016-02-25,32.4189
2016-02-26,32.5695
2016-02-29,32.1904
2016-03-01,33.0021
2016-03-02,33.0847
2016-03-03,33.3861
2016-03-04,33.1382
2016-03-07,32.691
2016-03-08,32.7688
2016-03-09,32.8077
2016-03-10,32.6521
2016-03-11,33.5465
2016-03-14,33.425
2016-03-15,33.3326
2016-03-16,33.8624
2016-03-17,34.7956
2016-03-18,34.2026
2016-03-21,33.9693
2016-03-22,34.2755
2016-03-23,34.2561
2016-03-24,34.1394
2016-03-28,34.1978
2016-03-29,34.5137
2016-03-30,34.4602
2016-03-31,34.6498
2016-04-01,34.8053
2016-04-04,34.3144
2016-04-05,34.2707
2016-04-06,34.6498
2016-04-07,34.3338
2016-04-08,34.4116
2016-04-11,34.2512
2016-04-12,34.5817
2016-04-13,34.9317
2016-04-14,34.922
2016-04-15,35.131
2016-04-18,36.2731
2016-04-19,36.4481
2016-04-20,36.6134
2016-04-21,36.5307
2016-04-22,36.8613
2016-04-25,36.3072
2016-04-26,36.4821
2016-04-27,36.3849
2016-04-28,35.4469
2016-04-29,34.6935
2016-05-02,35.0192
2016-05-03,34.7761
2016-05-04,35.0143
2016-05-05,34.9122
2016-05-06,34.7227
2016-05-09,35.0046
2016-05-10,35.0726
2016-05-11,35.0726
2016-05-12,35.4031
2016-05-13,35.0629
2016-05-16,35.5344
2016-05-17,34.8539
2016-05-18,34.8734
2016-05-19,34.713
2016-05-20,34.8831
2016-05-23,34.4845
2016-05-24,34.8782
2016-05-25,35.0386
2016-05-26,34.9075
2016-05-27,35.1899
2016-05-31,35.2045
2016-06-01,35.0195
2016-06-02,35.8765
2016-06-03,36.1491
2016-06-06,36.1783
2016-06-07,36.2855
2016-06-08,36.4997
2016-06-09,36.4608
2016-06-10,35.8765
2016-06-13,35.0682
2016-06-14,35.0243
2016-06-15,35.0633
2016-06-16,34.9903
2016-06-17,34.7955
2016-06-20,35.0876
2016-06-21,35.0536
2016-06-22,35.297
2016-06-23,35.8034
2016-06-24,33.7973
2016-06-27,33.2763
2016-06-28,34.3767
2016-06-29,34.7614
2016-06-30,35.1996
2016-07-01,34.7711
2016-07-05,34.1089
2016-07-06,34.2453
2016-07-07,34.4839
2016-07-08,34.8734
2016-07-11,34.9123
2016-07-12,34.7078
2016-07-13,34.7322
2016-07-14,34.7176
2016-07-15,34.0992
2016-07-18,34.0505
2016-07-19,33.9726
2016-07-20,34.3475
2016-07-21,34.5374
2016-07-22,34.4546
2016-07-25,34.6007
2016-07-26,34.8004
2016-07-27,34.6445
2016-07-28,34.5325
2016-07-29,34.4108
2016-08-01,34.4254
2016-08-02,34.1089
2016-08-03,34.1333
2016-08-04,38.2283
2016-08-05,38.5399
2016-08-08,39.0512
2016-08-09,38.9879
2016-08-10,39.0463
2016-08-11,39.2265
2016-08-12,39.0999
2016-08-15,39.3141
2016-08-16,39.095
2016-08-17,39.0804
2016-08-18,39.0853
2016-08-19,39.2362
2016-08-22,39.2946
2016-08-23,39.2119
2016-08-24,38.8613
2016-08-25,38.8662
2016-08-26,38.3159
2016-08-29,38.4377
2016-08-30,38.506
2016-08-31,38.623
2016-09-01,38.9449
2016-09-02,39.34
2016-09-06,39.496
2016-09-07,39.3351
2016-09-08,39.0668
2016-09-09,37.9451
2016-09-12,38.0475
2016-09-13,37.6329
2016-09-14,37.5988
2016-09-15,38.1889
2016-09-16,38.267
2016-09-19,38.2231
2016-09-20,38.3352
2016-09-21,38.5742
2016-09-22,38.8669
2016-09-23,38.6962
2016-09-26,38.5498
2016-09-27,38.8035
2016-09-28,39.2278
2016-09-29,39.457
2016-09-30,39.9691
2016-10-03,39.4326
2016-10-04,38.7401
2016-10-05,38.7254
2016-10-06,38.7986
2016-10-07,38.1987
2016-10-10,38.6376
2016-10-11,38.2279
2016-10-12,38.3791
2016-10-13,38.3352
2016-10-14,38.6571
2016-10-17,38.784
2016-10-18,39.4668
2016-10-19,40.0033
2016-10-20,39.0717
2016-10-21,38.862
2016-10-24,39.1693
2016-10-25,38.8961
2016-10-26,38.7888
2016-10-27,38.2182
2016-10-28,37.6037
2016-10-31,37.589
2016-11-01,37.4915
2016-11-02,37.5159
2016-11-03,38.1597
2016-11-04,37.3013
2016-11-07,38.345
2016-11-08,38.823
2016-11-09,38.3304
2016-11-10,37.0135
2016-11-11,37.0525
2016-11-14,37.1501
2016-11-15,37.2574
2016-11-16,37.3061
2016-11-17,37.3061
2016-11-18,37.2574
2016-11-21,37.1159
2016-11-22,37.3988
2016-11-23,37.8768
2016-11-25,37.5793
2016-11-28,37.7207
2016-11-29,37.6425
2016-11-30,36.6703
2016-12-01,35.7177
2016-12-02,36.2551
2016-12-05,35.9522
2016-12-06,36.2502
2016-12-07,36.9244
2016-12-08,37.1638
2016-12-09,37.54
2016-12-12,37.281
2016-12-13,37.7549
2016-12-14,36.6313
2016-12-15,37.2761
2016-12-16,37.452
2016-12-19,37.3885
2016-12-20,37.281
2016-12-21,37.281
2016-12-22,37.3494
2016-12-23,37.2371
2016-12-27,37.3592
2016-12-28,37.1345
2016-12-29,36.9781
2016-12-30,36.6752
2017-01-03,37.0074
2017-01-04,37.5693
2017-01-05,37.5497
2017-01-06,37.7158
2017-01-09,37.1198
2017-01-10,36.9439
2017-01-11,37.4764
2017-01-12,37.6425
2017-01-13,37.2126
2017-01-17,37.369
2017-01-18,37.6084
2017-01-19,36.939
2017-01-20,36.6313
2017-01-23,36.8267
2017-01-24,37.3543
2017-01-25,37.496
2017-01-26,37.3055
2017-01-27,37.5888
2017-01-30,37.3641
2017-01-31,37.2566
2017-02-01,37.3885
2017-02-02,35.8203
2017-02-03,36.0743
2017-02-06,35.6346
2017-02-07,35.4783
2017-02-08,36.3772
2017-02-09,36.1916
2017-02-10,36.3137
2017-02-13,36.0792
2017-02-14,36.0255
2017-02-15,35.7226
2017-02-16,35.6542
2017-02-17,35.7958
2017-02-21,36.0059
2017-02-22,35.8789
2017-02-23,36.1671
2017-02-24,35.6981
2017-02-27,35.9722
2017-02-28,35.9869
2017-03-01,36.7063
2017-03-02,35.8596
2017-03-03,36.1239
2017-03-06,35.5954
2017-03-07,35.3751
2017-03-08,35.5709
2017-03-09,35.8988
2017-03-10,36.0897
2017-03-13,36.3735
2017-03-14,36.2414
2017-03-15,36.677
2017-03-16,36.584
2017-03-17,36.7651
2017-03-20,36.858
2017-03-21,36.2071
2017-03-22,36.3931
2017-03-23,36.3686
2017-03-24,36.0848
2017-03-27,36.0848
2017-03-28,36.2169
2017-03-29,36.0065
2017-03-30,36.0309
2017-03-31,36.3442
2017-04-03,35.8988
2017-04-04,35.9184
2017-04-05,35.5562
2017-04-06,35.4338
2017-04-07,35.3506
2017-04-10,35.3457
2017-04-11,35.3604
2017-04-12,35.1108
2017-04-13,35.0081
2017-04-17,35.3849
2017-04-18,35.3751
2017-04-19,35.6296
2017-04-20,35.8596
2017-04-21,36.0603
2017-04-24,36.4078
2017-04-25,36.7748
2017-04-26,36.7895
2017-04-27,37.8565
2017-04-28,37.6313
2017-05-01,37.646
2017-05-02,37.5873
2017-05-03,37.3034
2017-05-04,39.3932
2017-05-05,39.173
2017-05-08,38.9625
2017-05-09,38.9772
2017-05-10,39.2464
2017-05-11,39.1534
2017-05-12,39.3296
2017-05-15,39.5352
2017-05-16,39.5498
2017-05-17,39.1338
2017-05-18,38.9087
2017-05-19,39.1926
2017-05-22,39.3296
2017-05-23,39.2807
2017-05-24,39.4666
2017-05-25,39.8582
2017-05-26,39.8288
2017-05-30,40.0643
2017-05-31,40.133
2017-06-01,40.6433
2017-06-02,40.5844
2017-06-05,40.4274
2017-06-06,40.2213
2017-06-07,39.9662
2017-06-08,39.7503
2017-06-09,39.5246
2017-06-12,39.6718
2017-06-13,40.4372
2017-06-14,40.5059
2017-06-15,40.3783
2017-06-16,40.3881
2017-06-19,41.1045
2017-06-20,41.0063
2017-06-21,40.9965
2017-06-22,40.8886
2017-06-23,41.2811
2017-06-26,41.497
2017-06-27,41.3007
2017-06-28,41.7226
2017-06-29,41.2418
2017-06-30,41.4184
2017-07-03,41.6736
2017-07-05,41.7815
2017-07-06,41.232
2017-07-07,41.5068
2017-07-10,41.3694
2017-07-11,40.8788
2017-07-12,41.1731
2017-07-13,40.9376
2017-07-14,41.3105
2017-07-17,41.6343
2017-07-18,41.6245
2017-07-19,41.7325
2017-07-20,41.6245
2017-07-21,42.1151
2017-07-24,41.8796
2017-07-25,41.7128
2017-07-26,41.6147
2017-07-27,41.497
2017-07-28,41.1045
2017-07-31,41.1143
2017-08-01,39.7994
2017-08-02,41.0946
2017-08-03,39.8485
2017-08-04,39.7994
2017-08-07,40.398
2017-08-08,40.3195
2017-08-09,39.5246
2017-08-10,39.299
2017-08-11,39.4069
2017-08-14,39.8779
2017-08-15,39.5639
2017-08-16,40.0545
2017-08-17,39.5148
2017-08-18,39.3676
2017-08-21,38.8476
2017-08-22,39.0144
2017-08-23,38.6513
2017-08-24,38.4747
2017-08-25,38.563
2017-08-28,38.3471
2017-08-29,38.3275
2017-08-30,38.8686
2017-08-31,39.3408
2017-09-01,39.4982
2017-09-05,39.3408
2017-09-06,39.3506
2017-09-07,39.6064
2017-09-08,39.6261
2017-09-11,40.2754
2017-09-12,40.0589
2017-09-13,39.7048
2017-09-14,39.754
2017-09-15,39.872
2017-09-18,40.118
2017-09-19,39.9507
2017-09-20,40.118
2017-09-21,40.1376
2017-09-22,40.3344
2017-09-25,40.1475
2017-09-26,40.3049
2017-09-27,40.3246
2017-09-28,40.7476
2017-09-29,40.6295
2017-10-02,40.6886
2017-10-03,40.905
2017-10-04,41.0821
2017-10-05,41.3477
2017-10-06,41.3378
2017-10-09,41.3772
2017-10-10,41.81
2017-10-11,41.6133
2017-10-12,41.5641
2017-10-13,41.6625
2017-10-16,41.5051
2017-10-17,41.2985
2017-10-18,41.4264
2017-10-19,41.2591
2017-10-20,41.6133
2017-10-23,42.2134
2017-10-24,42.2232
2017-10-25,41.7707
2017-10-26,42.0363
2017-10-27,42.0757
2017-10-30,41.9478
2017-10-31,42.2331
2017-11-01,42.0068
2017-11-02,41.1214
2017-11-03,41.0722
2017-11-06,40.7771
2017-11-07,40.3836
2017-11-08,40.0786
2017-11-09,39.6654
2017-11-10,39.331
2017-11-13,39.6556
2017-11-14,39.3408
2017-11-15,38.7407
2017-11-16,39.8622
2017-11-17,39.331
2017-11-20,39.0949
2017-11-21,38.9571
2017-11-22,38.8784
2017-11-24,39.2916
2017-11-27,39.39
2017-11-28,38.9375
2017-11-29,38.9178
2017-11-30,39.3616
2017-12-01,39.1939
2017-12-04,40.0914
2017-12-05,40.2295
2017-12-06,40.2394
2017-12-07,40.2492
2017-12-08,39.0559
2017-12-11,39.0559
2017-12-12,38.3556
2017-12-13,38.1091
2017-12-14,37.7639
2017-12-15,38.8586
2017-12-18,38.0006
2017-12-19,37.7343
2017-12-20,37.468
2017-12-21,37.1129
2017-12-22,37.4483
2017-12-26,37.0833
2017-12-27,37.0439
2017-12-28,37.3989
2017-12-29,37.3299
2018-01-02,38.0992
2018-01-03,38.0006
2018-01-04,37.823
2018-01-05,38.0597
2018-01-08,38.0893
2018-01-09,37.971
2018-01-10,37.3299
2018-01-11,37.8526
2018-01-12,37.3792
2018-01-16,37.8625
2018-01-17,38.5036
2018-01-18,38.257
2018-01-19,38.188
2018-01-22,37.2411
2018-01-23,37.8723
2018-01-24,38.3063
2018-01-25,38.6712
2018-01-26,37.5962
2018-01-29,37.1129
2018-01-30,37.0538
2018-01-31,37.754
2018-02-01,37.823
2018-02-02,36.9453
2018-02-05,36.0083
2018-02-06,36.4225
2018-02-07,38.7896
2018-02-08,37.9118
2018-02-09,37.3496
2018-02-12,37.0143
2018-02-13,37.2411
2018-02-14,37.5962
2018-02-15,38.5825
2018-02-16,39.0756
2018-02-20,38.6712
2018-02-21,38.6022
2018-02-22,39.0065
2018-02-23,39.1841
2018-02-26,39.5293
2018-02-27,39.4602
2018-02-28,39.4998
2018-03-01,39.0548
2018-03-02,38.956
2018-03-05,39.48
2018-03-06,40.1029
2018-03-07,40.2809
2018-03-08,40.5577
2018-03-09,41.3388
2018-03-12,41.1806
2018-03-13,41.1509
2018-03-14,40.4786
2018-03-15,40.5083
2018-03-16,40.1424
2018-03-19,39.7766
2018-03-20,39.4404
2018-03-21,39.3712
2018-03-22,38.6989
2018-03-23,38.3331
2018-03-26,38.867
2018-03-27,38.7483
2018-03-28,38.7483
2018-03-29,39.2625
2018-04-02,38.4517
2018-04-03,39.213
2018-04-04,39.6382
2018-04-05,39.826
2018-04-06,38.8175
2018-04-09,38.8571
2018-04-10,39.6876
2018-04-11,39.7964
2018-04-12,40.0534
2018-04-13,40.182
2018-04-16,40.3006
2018-04-17,40.9433
2018-04-18,40.7851
2018-04-19,40.4588
2018-04-20,40.2116
2018-04-23,40.0337
2018-04-24,39.7074
2018-04-25,39.7667
2018-04-26,39.9744
2018-04-27,40.093
2018-04-30,39.6382
2018-05-01,38.8175
2018-05-02,38.0661
2018-05-03,37.4926
2018-05-04,38.1057
2018-05-07,37.7893
2018-05-08,37.6409
2018-05-09,38.1551
2018-05-10,38.3726
2018-05-11,38.1155
2018-05-14,37.9277
2018-05-15,37.3147
2018-05-16,37.72
2018-05-17,37.5618
2018-05-18,37.5322
2018-05-21,37.5915
2018-05-22,37.9277
2018-05-23,37.9178
2018-05-24,37.9178
2018-05-25,37.9376
2018-05-29,37.1664
2018-05-30,37.2455
2018-05-31,36.6308
2018-06-01,36.4425
2018-06-04,36.492
2018-06-05,36.3334
2018-06-06,36.4127
2018-06-07,37.0075
2018-06-08,37.2752
2018-06-11,37.4834
2018-06-12,37.4933
2018-06-13,36.7894
2018-06-14,36.5614
2018-06-15,36.3334
2018-06-18,36.4226
2018-06-19,35.6593
2018-06-20,35.4115
2018-06-21,34.9753
2018-06-22,35.5998
2018-06-25,35.6097
2018-06-26,35.4313
2018-06-27,34.9554
2018-06-28,34.9455
2018-06-29,35.2429
2018-07-02,35.4511
2018-07-03,35.7981
2018-07-05,36.1351
2018-07-06,36.5515
2018-07-09,36.7399
2018-07-10,37.3248
2018-07-11,37.4338
2018-07-12,37.5429
2018-07-13,37.295
2018-07-16,37.0869
2018-07-17,37.9196
2018-07-18,37.7511
2018-07-19,37.9394
2018-07-20,37.2653
2018-07-23,37.5528
2018-07-24,37.8006
2018-07-25,37.7907
2018-07-26,38.217
2018-07-27,38.4351
2018-07-30,38.2467
2018-07-31,38.6334
2018-08-01,38.9903
2018-08-02,40.1799
2018-08-03,41.0622
2018-08-06,41.092
2018-08-07,41.3794
2018-08-08,41.1019
2018-08-09,40.8937
2018-08-10,39.9717
2018-08-13,39.3075
2018-08-14,39.3571
2018-08-15,39.7635
2018-08-16,39.9519
2018-08-17,40.3088
2018-08-20,40.5665
2018-08-21,40.7152
2018-08-22,40.3088
2018-08-23,40.3286
2018-08-24,40.7351
2018-08-27,41.4885
2018-08-28,41.3101
2018-08-29,41.4786
2018-08-30,41.4786
2018-08-31,41.6177
2018-09-04,41.1606
2018-09-05,41.6873
2018-09-06,41.8761
2018-09-07,42.1543
2018-09-10,42.9096
2018-09-11,42.522
2018-09-12,42.9294
2018-09-13,43.5356
2018-09-14,43.8636
2018-09-17,43.8636
2018-09-18,44.6387
2018-09-19,43.953
2018-09-20,44.112
2018-09-21,44.2909
2018-09-24,44.579
2018-09-25,43.943
2018-09-26,44.0225
2018-09-27,43.8636
2018-09-28,43.7145
2018-10-01,43.6052
2018-10-02,44.1716
2018-10-03,45.0362
2018-10-04,45.5231
2018-10-05,45.6423
2018-10-08,46.0597
2018-10-09,45.4337
2018-10-10,43.5853
2018-10-11,43.2375
2018-10-12,43.8834
2018-10-15,44.3207
2018-10-16,45.8113
2018-10-17,45.9107
2018-10-18,45.9107
2018-10-19,45.6423
2018-10-22,44.8474
2018-10-23,44.8275
2018-10-24,43.3766
2018-10-25,43.0487
2018-10-26,43.1182
2018-10-29,43.5952
2018-10-30,44.6884
2018-10-31,44.5194
2018-11-01,47.3218
2018-11-02,47.0634
2018-11-05,47.1131
2018-11-06,47.5603
2018-11-07,48.5341
2018-11-08,48.4149
2018-11-09,48.3751
2018-11-12,47.9876
2018-11-13,48.7925
2018-11-14,48.7527
2018-11-15,50.0645
2018-11-16,50.1837
2018-11-19,49.1999
2018-11-20,48.7428
2018-11-21,49.0012
2018-11-23,48.5639
2018-11-26,48.7925
2018-11-27,48.3552
2018-11-28,49.2794
2018-11-29,49.2595
2018-11-30,48.9011
2018-12-03,49.5782
2018-12-04,48.8214
2018-12-06,48.5127
2018-12-07,48.1841
2018-12-10,48.0945
2018-12-11,47.6265
2018-12-12,47.985
2018-12-13,48.3235
2018-12-14,47.8057
2018-12-17,46.4515
2018-12-18,46.581
2018-12-19,45.6748
2018-12-20,43.9522
2018-12-21,43.4344
2018-12-24,42.1698
2018-12-26,43.305
2018-12-27,44.2609
2018-12-28,44.6094
2018-12-31,45.7844
2019-01-02,44.4799
2019-01-03,44.0717
2019-01-04,45.396
2019-01-07,46.2424
2019-01-08,46.7104
2019-01-09,46.8897
2019-01-10,47.4473
2019-01-11,47.9153
2019-01-14,48.2638
2019-01-15,49.0902
2019-01-16,48.2339
2019-01-17,49.2894
2019-01-18,50.0462
2019-01-22,50.5042
2019-01-23,50.564
2019-01-24,50.6436
2019-01-25,51.5298
2019-01-28,50.5739
2019-01-29,51.1017
2019-01-30,50.9623
2019-01-31,52.0576
2019-02-01,51.8086
2019-02-04,51.7588
2019-02-05,52.7745
2019-02-06,52.9836
2019-02-07,53.0334
2019-02-08,53.6707
2019-02-11,53.6209
2019-02-12,54.6664
2019-02-13,54.9651
2019-02-14,54.7162
2019-02-15,53.8997
2019-02-19,53.83
2019-02-20,54.1686
2019-02-21,54.2482
2019-02-22,55.0249
2019-02-25,54.6465
2019-02-26,54.4374
2019-02-27,55.2639
2019-02-28,54.6454
2019-03-01,55.0743
2019-03-04,55.1143
2019-03-05,55.8225
2019-03-06,55.2838
2019-03-07,54.5457
2019-03-08,54.8748
2019-03-11,55.4634
2019-03-12,56.4909
2019-03-13,56.9697
2019-03-14,57.1293
2019-03-15,57.3587
2019-03-18,57.7378
2019-03-19,57.9173
2019-03-20,57.9772
2019-03-21,58.6954
2019-03-22,57.7976
2019-03-25,57.9672
2019-03-26,58.1069
2019-03-27,58.047
2019-03-28,57.7976
2019-03-29,57.7178
2019-04-01,58.2565
2019-04-02,57.8375
2019-04-03,57.8774
2019-04-04,57.8575
2019-04-05,57.9672
2019-04-08,58.057
2019-04-09,57.4984
2019-04-10,58.1069
2019-04-11,58.476
2019-04-12,57.8874
2019-04-15,58.1967
2019-04-16,57.4186
2019-04-17,56.9098
2019-04-18,58.3662
2019-04-22,58.5658
2019-04-23,59.3538
2019-04-24,58.7553
2019-04-25,58.8151
2019-04-26,59.5533
2019-04-29,59.4835
2019-04-30,59.7927
2019-05-01,58.5258
2019-05-02,59.8526
2019-05-03,61.3888
2019-05-06,61.7978
2019-05-07,61.8177
2019-05-08,61.7978
2019-05-09,62.2168
2019-05-10,64.152
2019-05-13,64.2517
2019-05-14,63.2841
2019-05-15,62.3564
2019-05-16,62.4163
2019-05-17,62.4163
2019-05-20,61.8876
2019-05-21,62.2467
2019-05-22,61.3489
2019-05-23,60.9
2019-05-24,61.1993
2019-05-28,61.0496
2019-05-29,60.3514
2019-05-30,60.89
2019-05-31,61.39
2019-06-03,62.05
2019-06-04,63.09
2019-06-05,64.45
2019-06-06,65.66
2019-06-07,65.9
2019-06-10,66.32
2019-06-11,66.44
2019-06-12,66.6
2019-06-13,64.76
2019-06-14,65.38
2019-06-17,65.445
2019-06-18,66.495
2019-06-19,66.565
2019-06-20,67.17
2019-06-21,67.05
2019-06-24,67.315
2019-06-25,68.1
2019-06-26,67.655
2019-06-27,68.12
2019-06-28,69.87
2019-07-01,69.94
2019-07-02,71.49
2019-07-03,72.29
2019-07-04,72.29
2019-07-05,71.79
2019-07-08,70.7
2019-07-09,70.69
2019-07-10,70.43
2019-07-11,71.245
2019-07-12,69.905
2019-07-15,69.345
2019-07-16,69
2019-07-17,68.53
2019-07-18,70.93
2019-07-19,70.585
2019-07-22,71.09
2019-07-23,71.69
2019-07-24,72.03
2019-07-25,71.195
2019-07-26,72.125
2019-07-29,72.36
2019-07-30,72.72
2019-07-31,71.47
2019-08-01,74.67
2019-08-02,74.765
2019-08-05,73.23
2019-08-06,74.055
2019-08-07,75.3
2019-08-08,76.005
2019-08-09,77.52
2019-08-12,76.87
2019-08-13,79.365
2019-08-14,76.945
2019-08-15,78.09
2019-08-16,79.62
2019-08-19,79.735
2019-08-20,79.27
2019-08-21,79.88
2019-08-22,79.775
2019-08-23,77.95
2019-08-26,78.655
2019-08-27,79.18
2019-08-28,79.27
2019-08-29,80.5
2019-08-30,80.475
2019-09-02,80.42
2019-09-03,79.94
2019-09-04,80.69
2019-09-05,78.73
2019-09-06,78.17
2019-09-09,75.08
2019-09-10,71.95
2019-09-11,71.705
2019-09-12,73.26
2019-09-13,72.66
2019-09-16,72.24
2019-09-17,75.04
2019-09-18,74.625
2019-09-19,74.28
2019-09-20,74.01
2019-09-23,74.495
2019-09-24,74.85
2019-09-25,73.42
2019-09-26,74.37
2019-09-27,72.78
2019-09-30,72.805
2019-10-01,72.105
2019-10-02,70.805
2019-10-03,71.57
2019-10-04,72.7
2019-10-07,72.43
2019-10-08,71.39
2019-10-09,72.27
2019-10-10,72.85
2019-10-11,72.59
2019-10-14,72.99
2019-10-15,72.44
2019-10-16,72.515
2019-10-17,73.81
2019-10-18,74.115
2019-10-21,72.355
2019-10-22,70.99
2019-10-23,70.975
2019-10-24,71.765
2019-10-25,71.88
2019-10-28,71.33
2019-10-29,72.72
2019-10-30,74.12
2019-10-31,70.025
2019-11-01,68.39
2019-11-04,66.38
2019-11-05,64.49
2019-11-06,66.625
2019-11-07,64.955
2019-11-08,64.565
2019-11-11,64.53
2019-11-12,64.34
2019-11-13,65.2
2019-11-14,65.72
2019-11-15,65.59
2019-11-18,67.475
2019-11-19,67.265
2019-11-20,67.485
2019-11-21,66.125
2019-11-22,65.67
2019-11-25,64.835
