date,close
2014-06-13,55.3864
2014-06-16,55.2926
2014-06-17,55.7709
2014-06-18,55.7709
2014-06-19,55.5552
2014-06-20,55.3301
2014-06-23,55.8084
2014-06-24,55.3208
2014-06-25,55.4427
2014-06-26,55.1989
2014-06-27,55.7615
2014-06-30,55.7334
2014-07-01,56.2492
2014-07-02,56.0523
2014-07-03,56.4743
2014-07-07,56.493
2014-07-08,56.2914
2014-07-09,55.9491
2014-07-10,55.5083
2014-07-11,55.9397
2014-07-14,55.9866
2014-07-15,55.724
2014-07-16,55.724
2014-07-17,55.6115
2014-07-18,56.343
2014-07-21,55.9866
2014-07-22,56.3899
2014-07-23,56.3899
2014-07-24,56.5305
2014-07-25,56.0054
2014-07-28,55.8834
2014-07-29,55.4333
2014-07-30,56.0054
2014-07-31,54.7206
2014-08-01,54.73
2014-08-04,55.2551
2014-08-05,54.6456
2014-08-06,54.5424
2014-08-07,53.4733
2014-08-08,54.1485
2014-08-11,54.1907
2014-08-12,54.0829
2014-08-13,54.0266
2014-08-14,53.342
2014-08-15,52.9294
2014-08-18,53.8109
2014-08-19,53.961
2014-08-20,53.7734
2014-08-21,54.0078
2014-08-22,53.6702
2014-08-25,54.1673
2014-08-26,54.3079
2014-08-27,54.2329
2014-08-28,54.1485
2014-08-29,54.2142
2014-09-02,54.5143
2014-09-03,54.6649
2014-09-04,54.6367
2014-09-05,54.6367
2014-09-08,54.5802
2014-09-09,54.4766
2014-09-10,54.9191
2014-09-11,54.7873
2014-09-12,54.5425
2014-09-15,54.1754
2014-09-16,54.4296
2014-09-17,54.1942
2014-09-18,54.4201
2014-09-19,54.1566
2014-09-22,53.2717
2014-09-23,52.8292
2014-09-24,53.4505
2014-09-25,52.2268
2014-09-26,52.2503
2014-09-29,52.7539
2014-09-30,52.3962
2014-10-01,52.1609
2014-10-02,52.4621
2014-10-03,52.8951
2014-10-06,52.7633
2014-10-07,52.1044
2014-10-08,52.8857
2014-10-09,51.5113
2014-10-10,50.4005
2014-10-13,49.6757
2014-10-14,49.6945
2014-10-15,50.843
2014-10-16,51.1254
2014-10-17,51.4454
2014-10-20,51.5914
2014-10-21,52.9328
2014-10-22,53.1493
2014-10-23,53.7518
2014-10-24,54.213
2014-10-27,54.1848
2014-10-28,55.4462
2014-10-29,55.3144
2014-10-30,55.851
2014-10-31,56.3123
2014-11-03,56.4817
2014-11-04,56.557
2014-11-05,57.5361
2014-11-06,57.5078
2014-11-07,56.7641
2014-11-10,57.3195
2014-11-11,57.2725
2014-11-12,57.2631
2014-11-13,56.9524
2014-11-14,56.7265
2014-11-17,56.7641
2014-11-18,57.1124
2014-11-19,57.0701
2014-11-20,57.329
2014-11-21,57.5455
2014-11-24,58.0067
2014-11-25,57.9597
2014-11-26,58.082
2014-11-28,58.0632
2014-12-01,58.2049
2014-12-02,58.1671
2014-12-03,58.4788
2014-12-04,58.6961
2014-12-05,58.6111
2014-12-08,58.5639
2014-12-09,58.6489
2014-12-10,58.1954
2014-12-11,58.4694
2014-12-12,58.1104
2014-12-15,58.3371
2014-12-16,57.997
2014-12-17,58.8095
2014-12-18,59.8865
2014-12-19,59.7448
2014-12-22,59.8676
2014-12-23,60.0565
2014-12-24,59.9904
2014-12-26,59.8865
2014-12-29,60.151
2014-12-30,59.4992
2014-12-31,58.7056
2015-01-02,58.7717
2015-01-05,58.2238
2015-01-06,58.0159
2015-01-07,58.5261
2015-01-08,59.7353
2015-01-09,59.0835
2015-01-12,59.5181
2015-01-13,59.9999
2015-01-14,59.6881
2015-01-15,59.0646
2015-01-16,60.0188
2015-01-20,59.6031
2015-01-21,59.707
2015-01-22,61.1713
2015-01-23,60.5951
2015-01-26,60.4722
2015-01-27,59.6976
2015-01-28,59.1591
2015-01-29,59.1874
2015-01-30,57.9781
2015-02-02,58.5261
2015-02-03,59.6314
2015-02-04,58.989
2015-02-05,60.6045
2015-02-06,60.066
2015-02-09,59.707
2015-02-10,60.7557
2015-02-11,60.9729
2015-02-12,61.6531
2015-02-13,62.1444
2015-02-17,62.4751
2015-02-18,63.0986
2015-02-19,63.0136
2015-02-20,63.5426
2015-02-23,63.1269
2015-02-24,63.5143
2015-02-25,63.1553
2015-02-26,62.7585
2015-02-27,62.1136
2015-03-02,63.5835
2015-03-03,63.1378
2015-03-04,62.7869
2015-03-05,63.5455
2015-03-06,62.9481
2015-03-09,63.3843
2015-03-10,62.5593
2015-03-11,63.0335
2015-03-12,64.0387
2015-03-13,63.1662
2015-03-16,64.1714
2015-03-17,64.1809
2015-03-18,65.2999
2015-03-19,65.7646
2015-03-20,66.3525
2015-03-23,66.3904
2015-03-24,65.793
2015-03-25,64.9301
2015-03-26,65.2809
2015-03-27,65.1292
2015-03-30,66.068
2015-03-31,66.2767
2015-04-01,66.0111
2015-04-02,66.087
2015-04-06,66.4663
2015-04-07,65.7456
2015-04-08,65.499
2015-04-09,64.8826
2015-04-10,64.5128
2015-04-13,64.6266
2015-04-14,64.8732
2015-04-15,64.124
2015-04-16,63.849
2015-04-17,63.2421
2015-04-20,63.6309
2015-04-21,64.1999
2015-04-22,64.5128
2015-04-23,64.6171
2015-04-24,63.9628
2015-04-27,63.7731
2015-04-28,64.4369
2015-04-29,63.9723
2015-04-30,63.0714
2015-05-01,63.4981
2015-05-04,63.7257
2015-05-05,62.8533
2015-05-06,63.6214
2015-05-07,62.5878
2015-05-08,61.7153
2015-05-11,61.7817
2015-05-12,61.6395
2015-05-13,61.6489
2015-05-14,62.2179
2015-05-15,61.6679
2015-05-18,62.2938
2015-05-19,62.2274
2015-05-20,61.9903
2015-05-21,61.8666
2015-05-22,61.9713
2015-05-26,61.1145
2015-05-27,62.0189
2015-05-28,61.9618
2015-05-29,61.9522
2015-06-01,61.9713
2015-06-02,61.9713
2015-06-03,62.5805
2015-06-04,61.857
2015-06-05,62.2378
2015-06-08,61.9142
2015-06-09,61.6762
2015-06-10,62.0855
2015-06-11,62.7614
2015-06-12,62.3806
2015-06-15,61.9237
2015-06-16,62.552
2015-06-17,62.1141
2015-06-18,62.9613
2015-06-19,62.9613
2015-06-22,62.8471
2015-06-23,62.552
2015-06-24,62.6662
2015-06-25,62.9137
2015-06-26,62.8756
2015-06-29,62.2188
2015-06-30,61.5905
2015-07-01,62.5234
2015-07-02,62.4853
2015-07-06,62.6376
2015-07-07,62.7709
2015-07-08,62.5615
2015-07-09,62.7995
2015-07-10,63.6467
2015-07-13,63.9228
2015-07-14,64.3987
2015-07-15,64.7605
2015-07-16,65.6172
2015-07-17,65.1317
2015-07-20,65.7314
2015-07-21,65.5982
2015-07-22,66.3502
2015-07-23,66.0456
2015-07-24,66.0837
2015-07-27,65.4554
2015-07-28,65.779
2015-07-29,66.5882
2015-07-30,66.7215
2015-07-31,66.5025
2015-08-03,66.3597
2015-08-04,66.6072
2015-08-05,67.0642
2015-08-06,66.3692
2015-08-07,66.8642
2015-08-10,67.6924
2015-08-11,66.8547
2015-08-12,67.4259
2015-08-13,67.8828
2015-08-14,67.7971
2015-08-17,68.1874
2015-08-18,68.1494
2015-08-19,67.7971
2015-08-20,66.769
2015-08-21,64.9889
2015-08-24,62.7804
2015-08-25,62.7138
2015-08-26,65.4078
2015-08-27,64.5606
2015-08-28,65.4744
2015-08-31,64.6938
2015-09-01,62.4568
2015-09-02,63.9283
2015-09-03,64.473
2015-09-04,63.4888
2015-09-08,65.3139
2015-09-09,64.6641
2015-09-10,65.0941
2015-09-11,66.0306
2015-09-14,65.5433
2015-09-15,66.4988
2015-09-16,66.9671
2015-09-17,66.8906
2015-09-18,66.4224
2015-09-21,66.8906
2015-09-22,66.4702
2015-09-23,66.7186
2015-09-24,66.518
2015-09-25,66.8237
2015-09-28,65.4095
2015-09-29,65.8299
2015-09-30,66.518
2015-10-01,66.5753
2015-10-02,67.722
2015-10-05,68.8878
2015-10-06,68.7731
2015-10-07,69.3465
2015-10-08,70.2447
2015-10-09,70.6078
2015-10-12,70.7894
2015-10-13,70.2829
2015-10-14,69.786
2015-10-15,70.1396
2015-10-16,70.2734
2015-10-19,70.799
2015-10-20,70.713
2015-10-21,70.1109
2015-10-22,71.8788
2015-10-23,72.7197
2015-10-26,72.9395
2015-10-27,72.0603
2015-10-28,74.0193
2015-10-29,74.2582
2015-10-30,73.9046
2015-11-02,74.1053
2015-11-03,73.7039
2015-11-04,74.1435
2015-11-05,73.7613
2015-11-06,74.411
2015-11-09,75.0131
2015-11-10,74.908
2015-11-11,74.5353
2015-11-12,73.8759
2015-11-13,73.4746
2015-11-16,75.08
2015-11-17,75.2711
2015-11-18,76.0355
2015-11-19,75.5864
2015-11-20,75.6533
2015-11-23,75.338
2015-11-24,75.1468
2015-11-25,75.2042
2015-11-27,75.5206
2015-11-30,76.0957
2015-12-01,76.2875
2015-12-02,75.8657
2015-12-03,75.6739
2015-12-04,75.7315
2015-12-07,75.6068
2015-12-08,74.9837
2015-12-09,74.4661
2015-12-10,74.7057
2015-12-11,74.1977
2015-12-14,74.6099
2015-12-15,74.8975
2015-12-16,74.5236
2015-12-17,74.0251
2015-12-18,74.3223
2015-12-21,74.3031
2015-12-22,74.5428
2015-12-23,74.6961
2015-12-24,74.907
2015-12-28,75.1755
2015-12-29,75.9711
2015-12-30,75.7219
2015-12-31,74.8303
2016-01-04,73.3636
2016-01-05,74.4373
2016-01-06,74.4948
2016-01-07,73.6992
2016-01-08,73.287
2016-01-11,73.5554
2016-01-12,74.677
2016-01-13,72.6447
2016-01-14,73.9292
2016-01-15,71.4464
2016-01-19,72.4913
2016-01-20,72.0312
2016-01-21,73.3828
2016-01-22,75.0796
2016-01-25,74.1785
2016-01-26,74.7537
2016-01-27,74.6961
2016-01-28,74.9166
2016-01-29,77.8213
2016-02-01,77.9746
2016-02-02,77.3707
2016-02-03,76.575
2016-02-04,76.4504
2016-02-05,75.3576
2016-02-08,73.402
2016-02-09,73.4308
2016-02-10,74.1018
2016-02-11,73.8238
2016-02-12,76.0095
2016-02-16,77.6199
2016-02-17,76.7093
2016-02-18,78.7128
2016-02-19,79.5755
2016-02-22,80.8122
2016-02-23,80.1124
2016-02-24,80.4383
2016-02-25,80.9176
2016-02-26,79.796
2016-02-29,79.1035
2016-03-01,79.5941
2016-03-02,78.9688
2016-03-03,78.9881
2016-03-04,79.065
2016-03-07,78.8149
2016-03-08,77.9012
2016-03-09,77.93
2016-03-10,77.9974
2016-03-11,78.2763
2016-03-14,78.132
2016-03-15,78.1032
2016-03-16,78.94
2016-03-17,79.6999
2016-03-18,79.671
2016-03-21,79.6133
2016-03-22,79.7576
2016-03-23,79.8057
2016-03-24,79.8249
2016-03-28,79.8538
2016-03-29,81.2388
2016-03-30,82.6816
2016-03-31,81.3446
2016-04-01,81.8833
2016-04-04,80.8926
2016-04-05,80.3155
2016-04-06,81.1907
2016-04-07,80.5463
2016-04-08,80.3058
2016-04-11,79.5075
2016-04-12,79.0362
2016-04-13,79.4017
2016-04-14,79.1131
2016-04-15,79.267
2016-04-18,79.3247
2016-04-19,80.1519
2016-04-20,79.9211
2016-04-21,78.9688
2016-04-22,78.7572
2016-04-25,78.7669
2016-04-26,79.0939
2016-04-27,78.9977
2016-04-28,78.8149
2016-04-29,77.9397
2016-05-02,79.2093
2016-05-03,78.3436
2016-05-04,79.9115
2016-05-05,79.6518
2016-05-06,80.4116
2016-05-09,80.8926
2016-05-10,81.5178
2016-05-11,80.402
2016-05-12,81.21
2016-05-13,80.4982
2016-05-16,81.4793
2016-05-17,80.6232
2016-05-18,80.3828
2016-05-19,79.6902
2016-05-20,79.8922
2016-05-23,79.3421
2016-05-24,81.0793
2016-05-25,80.7126
2016-05-26,80.5775
2016-05-27,81.3978
2016-05-31,81.4847
2016-06-01,81.6005
2016-06-02,82.2954
2016-06-03,81.8514
2016-06-06,82.0251
2016-06-07,82.0444
2016-06-08,82.4594
2016-06-09,82.7876
2016-06-10,81.5715
2016-06-13,80.8477
2016-06-14,81.7452
2016-06-15,80.9925
2016-06-16,80.9056
2016-06-17,79.6123
2016-06-20,80.7319
2016-06-21,80.5678
2016-06-22,80.4713
2016-06-23,81.4268
2016-06-24,80.3169
2016-06-27,79.1877
2016-06-28,81.5329
2016-06-29,82.4112
2016-06-30,84.2256
2016-07-01,84.187
2016-07-05,84.2063
2016-07-06,84.2739
2016-07-07,83.772
2016-07-08,84.7275
2016-07-11,85.2969
2016-07-12,85.1135
2016-07-13,85.3451
2016-07-14,85.0363
2016-07-15,84.7371
2016-07-18,84.4283
2016-07-19,84.6695
2016-07-20,84.9784
2016-07-21,84.3897
2016-07-22,85.017
2016-07-25,85.4416
2016-07-26,86.2523
2016-07-27,86.455
2016-07-28,86.0207
2016-07-29,86.1365
2016-08-01,86.2813
2016-08-02,85.5864
2016-08-03,84.9591
2016-08-04,85.2486
2016-08-05,85.8759
2016-08-08,85.0073
2016-08-09,85.2583
2016-08-10,85.8373
2016-08-11,85.6443
2016-08-12,85.2486
2016-08-15,85.7601
2016-08-16,85.3162
2016-08-17,82.942
2016-08-18,84.0905
2016-08-19,84.6406
2016-08-22,85.2486
2016-08-23,85.6347
2016-08-24,84.7564
2016-08-25,84.9784
2016-08-26,84.5441
2016-08-29,84.4765
2016-08-30,84.5923
2016-08-31,84.2256
2016-09-01,85.1232
2016-09-02,86.1107
2016-09-06,85.8396
2016-09-07,85.7428
2016-09-08,85.4233
2016-09-09,83.4385
2016-09-12,84.6972
2016-09-13,83.1384
2016-09-14,82.5284
2016-09-15,83.1868
2016-09-16,82.451
2016-09-19,83.0513
2016-09-20,83.1965
2016-09-21,84.1066
2016-09-22,84.9489
2016-09-23,84.4551
2016-09-26,83.6515
2016-09-27,83.8161
2016-09-28,83.9226
2016-09-29,82.906
2016-09-30,82.8286
2016-10-03,82.6834
2016-10-04,81.2795
2016-10-05,81.0762
2016-10-06,81.7248
2016-10-07,80.5243
2016-10-10,80.5533
2016-10-11,78.7138
2016-10-12,80.0596
2016-10-13,79.5948
2016-10-14,80.0499
2016-10-17,79.7885
2016-10-18,79.895
2016-10-19,79.5561
2016-10-20,79.2463
2016-10-21,79.1979
2016-10-24,79.7401
2016-10-25,78.9752
2016-10-26,77.8618
2016-10-27,77.0194
2016-10-28,77.6681
2016-10-31,78.4427
2016-11-01,77.978
2016-11-02,77.9295
2016-11-03,77.7165
2016-11-04,77.8134
2016-11-07,79.1495
2016-11-08,81.202
2016-11-09,81.0277
2016-11-10,80.8632
2016-11-11,81.8894
2016-11-14,81.9959
2016-11-15,81.9863
2016-11-16,82.4703
2016-11-17,83.7968
2016-11-18,83.9517
2016-11-21,85.3943
2016-11-22,85.5976
2016-11-23,86.0914
2016-11-25,85.9558
2016-11-28,85.7816
2016-11-29,85.7912
2016-11-30,83.9556
2016-12-01,82.149
2016-12-02,83.0037
2016-12-05,84.3635
2016-12-06,85.1988
2016-12-07,86.4906
2016-12-08,86.8596
2016-12-09,86.9082
2016-12-12,87.0053
2016-12-13,87.8795
2016-12-14,86.8693
2016-12-15,87.0053
2016-12-16,86.8791
2016-12-19,86.7916
2016-12-20,87.0053
2016-12-21,86.5683
2016-12-22,86.3546
2016-12-23,86.8402
2016-12-27,86.9373
2016-12-28,86.3351
2016-12-29,86.6168
2016-12-30,86.2283
2017-01-03,86.3351
2017-01-04,87.1607
2017-01-05,87.9572
2017-01-06,88.2388
2017-01-09,87.6172
2017-01-10,86.9276
2017-01-11,86.7139
2017-01-12,86.7042
2017-01-13,87.9377
2017-01-17,87.5978
2017-01-18,87.5589
2017-01-19,87.6561
2017-01-20,88.1611
2017-01-23,88.4136
2017-01-24,88.5788
2017-01-25,88.0931
2017-01-26,87.1219
2017-01-27,87.4618
2017-01-30,87.5395
2017-01-31,87.1996
2017-02-01,86.5197
2017-02-02,86.4906
2017-02-03,87.6366
2017-02-06,87.1122
2017-02-07,87.423
2017-02-08,86.9568
2017-02-09,88.2097
2017-02-10,87.996
2017-02-13,88.8507
2017-02-14,88.4331
2017-02-15,89.045
2017-02-16,89.5889
2017-02-17,89.8705
2017-02-21,90.4824
2017-02-22,90.6864
2017-02-23,91.1526
2017-02-24,91.9782
2017-02-27,92.0364
2017-02-28,91.3738
2017-03-01,92.8939
2017-03-02,92.0559
2017-03-03,92.5723
2017-03-06,92.1923
2017-03-07,92.0559
2017-03-08,91.861
2017-03-09,91.6564
2017-03-10,92.0267
2017-03-13,92.6795
2017-03-14,92.4164
2017-03-15,92.9134
2017-03-16,92.3287
2017-03-17,92.6698
2017-03-20,92.0754
2017-03-21,91.4907
2017-03-22,91.3153
2017-03-23,91.0814
2017-03-24,90.945
2017-03-27,91.2276
2017-03-28,91.3543
2017-03-29,91.6174
2017-03-30,91.5199
2017-03-31,90.7209
2017-04-03,90.4383
2017-04-04,90.3603
2017-04-05,90.1265
2017-04-06,89.8049
2017-04-07,89.6198
2017-04-10,89.9219
2017-04-11,91.1789
2017-04-12,91.5102
2017-04-13,90.6527
2017-04-17,91.7636
2017-04-18,92.0072
2017-04-19,92.358
2017-04-20,93.0888
2017-04-21,93.1862
2017-04-24,94.0438
2017-04-25,94.1607
2017-04-26,94.492
2017-04-27,94.8331
2017-04-28,94.4433
2017-05-01,94.4628
2017-05-02,94.872
2017-05-03,94.989
2017-05-04,95.5347
2017-05-05,95.6418
2017-05-08,94.6479
2017-05-09,94.8136
2017-05-10,94.911
2017-05-11,94.1802
2017-05-12,93.537
2017-05-15,94.2971
2017-05-16,95.866
2017-05-17,95.3593
2017-05-18,96.3337
2017-05-19,98.0682
2017-05-22,99.8374
2017-05-23,100.8539
2017-05-24,100.9224
2017-05-25,102.76
2017-05-26,101.9487
2017-05-30,102.7404
2017-05-31,103.8156
2017-06-01,102.7404
2017-06-02,102.8577
2017-06-05,102.6036
2017-06-06,101.2547
2017-06-07,101.6261
2017-06-08,101.5577
2017-06-09,100.9419
2017-06-12,101.2351
2017-06-13,101.8607
2017-06-14,101.5479
2017-06-15,102.0367
2017-06-16,102.4276
2017-06-19,102.3397
2017-06-20,102.3006
2017-06-21,102.5743
2017-06-22,102.5743
2017-06-23,103.2194
2017-06-26,102.9946
2017-06-27,102.3201
2017-06-28,102.9066
2017-06-29,101.3622
2017-06-30,101.5284
2017-07-03,100.8833
2017-07-05,101.3427
2017-07-06,100.3066
2017-07-07,101.2645
2017-07-10,101.4893
2017-07-11,101.5675
2017-07-12,102.8773
2017-07-13,102.5352
2017-07-14,102.8284
2017-07-17,103.1412
2017-07-18,102.8284
2017-07-19,103.757
2017-07-20,104.0502
2017-07-21,103.7961
2017-07-24,103.7961
2017-07-25,104.0795
2017-07-26,104.2848
2017-07-27,104.2848
2017-07-28,104.666
2017-07-31,104.9006
2017-08-01,104.9593
2017-08-02,103.3074
2017-08-03,103.5126
2017-08-04,103.6397
2017-08-07,104.2164
2017-08-08,104.1773
2017-08-09,103.972
2017-08-10,103.6788
2017-08-11,103.3562
2017-08-14,103.9525
2017-08-15,104.1089
2017-08-16,99.2998
2017-08-17,96.4945
2017-08-18,96.2208
2017-08-21,97.0614
2017-08-22,98.1366
2017-08-23,98.0682
2017-08-24,97.3351
2017-08-25,97.8238
2017-08-28,98.2148
2017-08-29,98.8013
2017-08-30,99.2705
2017-08-31,100.7464
2017-09-01,100.2381
2017-09-05,99.5148
2017-09-06,99.202
2017-09-07,99.8099
2017-09-08,99.9765
2017-09-11,100.4962
2017-09-12,100.6334
2017-09-13,100.104
2017-09-14,100.0256
2017-09-15,99.751
2017-09-18,100.4079
2017-09-19,100.2315
2017-09-20,99.5942
2017-09-21,100.0354
2017-09-22,100.2609
2017-09-25,99.5059
2017-09-26,99.202
2017-09-27,99.751
2017-09-28,100.6138
2017-09-29,100.7805
2017-10-02,100.8295
2017-10-03,101.6041
2017-10-04,101.8884
2017-10-05,101.8394
2017-10-06,102.3688
2017-10-09,103.2512
2017-10-10,103.2611
2017-10-11,102.8297
2017-10-12,103.1238
2017-10-13,103.0454
2017-10-16,102.9179
2017-10-17,102.31
2017-10-18,102.1237
2017-10-19,103.4081
2017-10-20,103.7121
2017-10-23,104.3199
2017-10-24,103.967
2017-10-25,104.8298
2017-10-26,106.7122
2017-10-27,108.281
2017-10-30,108.379
2017-10-31,107.977
2017-11-01,107.6143
2017-11-02,108.8006
2017-11-03,109.4281
2017-11-06,109.6144
2017-11-07,110.3595
2017-11-08,111.6341
2017-11-09,111.7321
2017-11-10,111.4674
2017-11-13,110.6438
2017-11-14,110.889
2017-11-15,110.1438
2017-11-16,109.9967
2017-11-17,109.8889
2017-11-20,110.2419
2017-11-21,111.1341
2017-11-22,111.9871
2017-11-24,112.3302
2017-11-27,112.7126
2017-11-28,113.0754
2017-11-29,111.9743
2017-11-30,113.3703
2017-12-01,112.1021
2017-12-04,113.5276
2017-12-05,112.8296
2017-12-06,113.9208
2017-12-07,114.8351
2017-12-08,115.307
2017-12-11,114.9138
2017-12-12,114.3436
2017-12-13,114.3042
2017-12-14,114.0978
2017-12-15,116.2409
2017-12-18,116.2803
2017-12-19,115.8968
2017-12-20,115.828
2017-12-21,115.425
2017-12-22,114.8646
2017-12-26,114.8548
2017-12-27,114.9432
2017-12-28,115.307
2017-12-29,114.9826
2018-01-02,114.2256
2018-01-03,114.3731
2018-01-04,116.6342
2018-01-05,117.7549
2018-01-08,117.7942
2018-01-09,118.9739
2018-01-10,120.2618
2018-01-11,120.6059
2018-01-12,121.294
2018-01-16,121.6381
2018-01-17,122.6802
2018-01-18,122.3263
2018-01-19,123.0341
2018-01-22,123.2012
2018-01-23,123.8697
2018-01-24,123.0341
2018-01-25,123.4273
2018-01-26,124.3908
2018-01-29,124.2728
2018-01-30,123.1324
2018-01-31,122.5524
2018-02-01,122.5524
2018-02-02,120.8811
2018-02-05,115.9755
2018-02-06,115.9755
2018-02-07,115.248
2018-02-08,112.4364
2018-02-09,113.3801
2018-02-12,114.3337
2018-02-13,115.1497
2018-02-14,117.2633
2018-02-15,118.8658
2018-02-16,120.016
2018-02-20,118.9641
2018-02-21,117.4108
2018-02-22,118.1285
2018-02-23,119.8882
2018-02-26,119.3868
2018-02-27,117.5386
2018-02-28,115.6748
2018-03-01,116.0496
2018-03-02,117.44
2018-03-05,119.3334
2018-03-06,120.2111
2018-03-07,120.5168
2018-03-08,120.6943
2018-03-09,122.213
2018-03-12,121.7002
2018-03-13,122.3412
2018-03-14,123.278
2018-03-15,123.278
2018-03-16,123.5147
2018-03-19,123.1695
2018-03-20,123.6232
2018-03-21,123.5936
2018-03-22,120.7929
2018-03-23,117.5485
2018-03-26,119.2052
2018-03-27,118.0613
2018-03-28,117.8838
2018-03-29,119.2743
2018-04-02,117.7063
2018-04-03,118.0317
2018-04-04,118.584
2018-04-05,118.722
2018-04-06,116.7399
2018-04-09,116.8483
2018-04-10,118.8798
2018-04-11,118.5445
2018-04-12,118.4755
2018-04-13,117.8641
2018-04-16,119.6194
2018-04-17,120.7831
2018-04-18,121.3748
2018-04-19,120.5858
2018-04-20,119.7476
2018-04-23,119.9054
2018-04-24,119.008
2018-04-25,117.5978
2018-04-26,120.0237
2018-04-27,118.4459
2018-04-30,117.8246
2018-05-01,119.7476
2018-05-02,116.2961
2018-05-03,119.1855
2018-05-04,121.2071
2018-05-07,120.1125
2018-05-08,120.4379
2018-05-09,121.0296
2018-05-10,121.3353
2018-05-11,122.2721
2018-05-14,120.5464
2018-05-15,119.7772
2018-05-16,120.5858
2018-05-17,120.5563
2018-05-18,120.714
2018-05-21,120.645
2018-05-22,118.9338
2018-05-23,120.4471
2018-05-24,120.8032
2018-05-25,120.3977
2018-05-29,120.7142
2018-05-30,122.4848
2018-05-31,123.7014
2018-06-01,123.464
2018-06-04,125.4522
2018-06-05,125.7489
2018-06-06,127.7272
2018-06-07,127.2029
2018-06-08,128.2415
2018-06-11,127.6481
2018-06-12,128.1525
2018-06-13,128.1822
2018-06-14,129.6659
2018-06-15,129.8637
2018-06-18,130.6748
2018-06-19,131.7035
2018-06-20,129.7153
2018-06-21,129.6065
2018-06-22,129.8835
2018-06-25,128.0635
2018-06-26,128.5185
2018-06-27,127.015
2018-06-28,128.0041
2018-06-29,128.9438
2018-07-02,129.1812
2018-07-03,130.3286
2018-07-05,131.1694
2018-07-06,132.208
2018-07-09,133.1575
2018-07-10,132.7916
2018-07-11,133.8302
2018-07-12,135.4622
2018-07-13,133.9093
2018-07-16,133.7016
2018-07-17,134.7896
2018-07-18,134.3247
2018-07-19,134.3247
2018-07-20,134.4335
2018-07-23,135.4029
2018-07-24,135.9469
2018-07-25,136.8569
2018-07-26,137.2031
2018-07-27,135.8974
2018-07-30,133.6422
2018-07-31,133.2367
2018-08-01,134.572
2018-08-02,136.6789
2018-08-03,137.124
2018-08-06,138.2615
2018-08-07,138.9539
2018-08-08,138.9638
2018-08-09,139.4781
2018-08-10,139.1913
2018-08-13,140.131
2018-08-14,141.5157
2018-08-15,141.3377
2018-08-16,140.9519
2018-08-17,141.6839
2018-08-20,142.9203
2018-08-21,142.5346
2018-08-22,153.603
2018-08-23,154.8988
2018-08-24,156.7484
2018-08-27,155.5021
2018-08-28,155.3043
2018-08-29,155.9176
2018-08-30,156.4418
2018-08-31,156.7188
2018-09-04,157.5496
2018-09-05,156.2638
2018-09-06,157.8365
2018-09-07,158.2618
2018-09-10,158.4303
2018-09-11,159.1342
2018-09-12,160.1554
2018-09-13,160.433
2018-09-14,161.4641
2018-09-17,158.5691
2018-09-18,159.8579
2018-09-19,158.0635
2018-09-20,158.9062
2018-09-21,157.8453
2018-09-24,158.1428
2018-09-25,158.3906
2018-09-26,156.8936
2018-09-27,157.8255
2018-09-28,158.7079
2018-10-01,157.6768
2018-10-02,157.7561
2018-10-03,157.6966
2018-10-04,156.4474
2018-10-05,157.3001
2018-10-08,152.9973
2018-10-09,155.2379
2018-10-10,148.7539
2018-10-11,146.0573
2018-10-12,148.7936
2018-10-15,148.4863
2018-10-16,152.908
2018-10-17,153.493
2018-10-18,151.6291
2018-10-19,151.639
2018-10-22,152.6007
2018-10-23,150.5088
2018-10-24,147.5741
2018-10-25,149.1406
2018-10-26,147.6733
2018-10-29,144.8279
2018-10-30,146.5728
2018-10-31,148.5457
2018-11-01,148.3375
2018-11-02,147.9311
2018-11-05,148.4367
2018-11-06,149.4479
2018-11-07,145.393
2018-11-08,141.8734
2018-11-09,140.2871
2018-11-12,140.0988
2018-11-13,137.5211
2018-11-14,134.5369
2018-11-15,137.4616
2018-11-16,137.7392
2018-11-19,134.1105
2018-11-20,133.6545
2018-11-21,135.0227
2018-11-23,134.5963
2018-11-26,135.9348
2018-11-27,134.8541
2018-11-28,139.5436
2018-11-29,137.9375
2018-11-30,138.8718
2018-12-03,140.4623
2018-12-04,136.3469
2018-12-06,135.1441
2018-12-07,132.9571
2018-12-10,133.9711
2018-12-11,133.6629
2018-12-12,133.9412
2018-12-13,132.9273
2018-12-14,130.5912
2018-12-17,127.9867
2018-12-18,127.6388
2018-12-19,126.4559
2018-12-20,125.263
2018-12-21,122.8176
2018-12-24,120.3523
2018-12-26,124.6168
2018-12-27,125.5214
2018-12-28,124.5373
2018-12-31,125.77
2019-01-02,123.4538
2019-01-03,120.5113
2019-01-04,123.3047
2019-01-07,123.086
2019-01-08,125.1735
2019-01-09,125.591
2019-01-10,125.3823
2019-01-11,125.9787
2019-01-14,125.6904
2019-01-15,128.0364
2019-01-16,129.279
2019-01-17,128.7323
2019-01-18,130.0942
2019-01-22,128.7621
2019-01-23,129.5176
2019-01-24,130.3725
2019-01-25,131.6648
2019-01-28,131.5952
2019-01-29,130.3626
2019-01-30,132.2712
2019-01-31,132.7583
2019-02-01,134.2196
2019-02-04,134.8061
2019-02-05,134.985
2019-02-06,131.2672
2019-02-07,130.9988
2019-02-08,131.8835
2019-02-11,130.6509
2019-02-12,131.9233
2019-02-13,132.7384
2019-02-14,131.5853
2019-02-15,132.9969
2019-02-19,132.0525
2019-02-20,132.0426
2019-02-21,130.8497
2019-02-22,131.7742
2019-02-25,131.5157
2019-02-26,132.1022
2019-02-27,132.0525
2019-02-28,132.2419
2019-03-01,133.3686
2019-03-04,132.5909
2019-03-05,132.6108
2019-03-06,131.4343
2019-03-07,130.6167
2019-03-08,130.9457
2019-03-11,133.0695
2019-03-12,133.917
2019-03-13,135.3029
2019-03-14,135.4425
2019-03-15,136.8384
2019-03-18,137.7258
2019-03-19,136.5792
2019-03-20,134.6648
2019-03-21,137.4666
2019-03-22,135.3727
2019-03-25,134.7845
2019-03-26,136.7587
2019-03-27,137.2074
2019-03-28,137.7657
2019-03-29,138.334
2019-04-01,139.9294
2019-04-02,141.3652
2019-04-03,142.1728
2019-04-04,141.3352
2019-04-05,141.5347
2019-04-08,140.9564
2019-04-09,140.7868
2019-04-10,141.6443
2019-04-11,142.7112
2019-04-12,143.6983
2019-04-15,143.6385
2019-04-16,143.4191
2019-04-17,143.4092
2019-04-18,143.0801
2019-04-22,144.0772
2019-04-23,145.9417
2019-04-24,146.4103
2019-04-25,146.869
2019-04-26,147.7065
2019-04-29,148.1851
2019-04-30,148.6239
2019-05-01,140.2783
2019-05-02,138.4038
2019-05-03,137.1774
2019-05-06,137.5264
2019-05-07,134.615
2019-05-08,134.0167
2019-05-09,133.5182
2019-05-10,134.3757
2019-05-13,132.561
2019-05-14,134.8144
2019-05-15,134.4355
2019-05-16,135.7018
2019-05-17,135.3528
2019-05-20,135.283
2019-05-21,136.29
2019-05-22,135.65
2019-05-23,132.28
2019-05-24,132.49
2019-05-28,130.96
2019-05-29,131.44
2019-05-30,132.22
2019-05-31,131.22
2019-06-03,130.7
2019-06-04,132.67
2019-06-05,133.6
2019-06-06,133.38
2019-06-07,135.39
2019-06-10,136.92
2019-06-11,136.79
2019-06-12,138.59
2019-06-13,137.57
2019-06-14,137.96
2019-06-17,137.14
2019-06-18,136.93
2019-06-19,137.775
2019-06-20,138.68
2019-06-21,137.4
2019-06-24,136.92
2019-06-25,135.85
2019-06-26,134.86
2019-06-27,134.545
2019-06-28,133.79
2019-07-01,136.26
2019-07-02,135.415
2019-07-03,137.48
2019-07-04,137.48
2019-07-05,136.975
2019-07-08,136.36
2019-07-09,136.215
2019-07-10,137.16
2019-07-11,138.465
2019-07-12,139.95
2019-07-15,140.625
2019-07-16,140.57
2019-07-17,141.095
2019-07-18,142.58
2019-07-19,141.62
2019-07-22,138.93
2019-07-23,138.85
2019-07-24,136.49
2019-07-25,137.895
2019-07-26,140.205
2019-07-29,141.01
2019-07-30,139.01
2019-07-31,139.71
2019-08-01,140.61
2019-08-02,138.935
2019-08-05,133.88
2019-08-06,135.86
2019-08-07,137.18
2019-08-08,140.65
2019-08-09,140.59
2019-08-12,138.38
2019-08-13,140.01
2019-08-14,138.275
2019-08-15,142.01
2019-08-16,142.035
2019-08-19,141.68
2019-08-20,140.92
2019-08-21,142.18
2019-08-22,142.87
2019-08-23,138.47
2019-08-26,140.13
2019-08-27,142.77
2019-08-28,142.72
2019-08-29,144.98
2019-08-30,145
2019-09-02,145
2019-09-03,144.64
2019-09-04,145.81
2019-09-05,148.55
2019-09-06,147.755
2019-09-09,147.495
2019-09-10,142.46
2019-09-11,144.89
2019-09-12,146.42
2019-09-13,145.19
2019-09-16,146.09
2019-09-17,147.185
2019-09-18,147.61
2019-09-19,147.78
2019-09-20,147.77
2019-09-23,145.47
2019-09-24,146.87
2019-09-25,146.78
2019-09-26,146.66
2019-09-27,143.63
2019-09-30,146.07
2019-10-01,146.45
2019-10-02,144.56
2019-10-03,144.52
2019-10-04,145.88
2019-10-07,144.93
2019-10-08,142.36
2019-10-09,142.365
2019-10-10,142.79
2019-10-11,142.3
2019-10-14,141.88
2019-10-15,142.96
2019-10-16,143.58
2019-10-17,143.31
2019-10-18,143.58
2019-10-21,141.79
2019-10-22,139.15
2019-10-23,138.495
2019-10-24,138.99
2019-10-25,139.55
2019-10-28,140.8
2019-10-29,141.305
2019-10-30,141.505
2019-10-31,141.445
2019-11-01,141.75
2019-11-04,142.685
2019-11-05,145.475
2019-11-06,147.47
2019-11-07,148.585
2019-11-08,149.4
2019-11-11,148.585
2019-11-12,147.365
2019-11-13,148.37
2019-11-14,147.87
2019-11-15,149.59
2019-11-18,150.545
2019-11-19,151.1
2019-11-20,150.255
2019-11-21,148.72
2019-11-22,149.5
2019-11-25,150.55
