date,close
2014-06-13,11.2272
2014-06-16,11.0154
2014-06-17,11.1743
2014-06-18,11.2424
2014-06-19,11.2499
2014-06-20,11.1818
2014-06-23,11.2348
2014-06-24,11.1894
2014-06-25,11.2575
2014-06-26,11.2271
2014-06-27,11.2423
2014-06-30,11.3334
2014-07-01,11.341
2014-07-02,11.2803
2014-07-03,11.3258
2014-07-07,11.303
2014-07-08,11.2347
2014-07-09,11.2575
2014-07-10,11.2727
2014-07-11,11.2044
2014-07-14,11.2651
2014-07-15,11.2347
2014-07-16,11.4093
2014-07-17,11.2879
2014-07-18,11.5156
2014-07-21,11.4093
2014-07-22,11.5004
2014-07-23,11.3789
2014-07-24,11.2423
2014-07-25,11.1208
2014-07-28,11.2499
2014-07-29,11.1588
2014-07-30,11.0753
2014-07-31,10.7717
2014-08-01,10.7717
2014-08-04,10.9766
2014-08-05,10.7868
2014-08-06,10.802
2014-08-07,10.7641
2014-08-08,10.8096
2014-08-11,10.9614
2014-08-12,10.8931
2014-08-13,10.9842
2014-08-14,10.9842
2014-08-15,10.8855
2014-08-18,11.136
2014-08-19,11.1664
2014-08-20,11.1436
2014-08-21,11.1208
2014-08-22,10.9994
2014-08-25,11.0373
2014-08-26,11.0677
2014-08-27,11.0829
2014-08-28,11.0222
2014-08-29,11.0601
2014-09-02,11.0981
2014-09-03,11.1133
2014-09-04,11.0449
2014-09-05,11.2044
2014-09-08,11.1664
2014-09-09,11.0905
2014-09-10,10.9538
2014-09-11,10.9842
2014-09-12,10.6502
2014-09-15,10.6198
2014-09-16,10.7641
2014-09-17,10.7489
2014-09-18,10.6882
2014-09-19,10.8096
2014-09-22,10.6274
2014-09-23,10.4528
2014-09-24,10.4756
2014-09-25,10.4073
2014-09-26,10.6587
2014-09-29,10.6892
2014-09-30,10.5292
2014-10-01,10.3997
2014-10-02,10.354
2014-10-03,10.453
2014-10-06,10.4301
2014-10-07,10.3082
2014-10-08,10.7044
2014-10-09,10.4987
2014-10-10,10.3692
2014-10-13,10.2244
2014-10-14,10.3235
2014-10-15,10.2778
2014-10-16,10.5673
2014-10-17,10.674
2014-10-20,10.9406
2014-10-21,11.1082
2014-10-22,11.0854
2014-10-23,11.3596
2014-10-24,11.352
2014-10-27,11.4054
2014-10-28,11.5349
2014-10-29,11.4054
2014-10-30,11.7863
2014-10-31,11.6644
2014-11-03,11.8549
2014-11-04,11.8168
2014-11-05,11.733
2014-11-06,11.7558
2014-11-07,11.7025
2014-11-10,11.9387
2014-11-11,11.8701
2014-11-12,11.7863
2014-11-13,11.9158
2014-11-14,11.9539
2014-11-17,11.893
2014-11-18,11.9844
2014-11-19,11.8472
2014-11-20,11.9692
2014-11-21,12.0225
2014-11-24,12.0225
2014-11-25,12.0606
2014-11-26,12.2053
2014-11-28,12.1977
2014-12-01,12.0606
2014-12-02,12.2053
2014-12-03,12.2434
2014-12-04,12.1977
2014-12-05,12.2891
2014-12-08,12.4644
2014-12-09,12.6777
2014-12-10,12.571
2014-12-11,12.6853
2014-12-12,12.6167
2014-12-15,12.3653
2014-12-16,12.3882
2014-12-17,12.8377
2014-12-18,12.8225
2014-12-19,12.7615
2014-12-22,13.0739
2014-12-23,13.0815
2014-12-24,13.0815
2014-12-26,13.0663
2014-12-29,13.1752
2014-12-30,13.0818
2014-12-31,12.8484
2015-01-02,13.074
2015-01-05,13.1908
2015-01-06,13.1674
2015-01-07,13.4009
2015-01-08,13.611
2015-01-09,13.5254
2015-01-12,13.4787
2015-01-13,13.541
2015-01-14,13.5799
2015-01-15,13.541
2015-01-16,13.7744
2015-01-20,13.5877
2015-01-21,13.6344
2015-01-22,13.9612
2015-01-23,13.86
2015-01-26,13.9923
2015-01-27,13.8523
2015-01-28,13.6188
2015-01-29,13.7822
2015-01-30,13.2686
2015-02-02,13.1752
2015-02-03,13.5332
2015-02-04,13.4087
2015-02-05,13.6421
2015-02-06,13.3464
2015-02-09,13.253
2015-02-10,13.362
2015-02-11,13.5021
2015-02-12,13.72
2015-02-13,13.611
2015-02-17,13.5488
2015-02-18,13.72
2015-02-19,13.4943
2015-02-20,13.5565
2015-02-23,13.6655
2015-02-24,13.4398
2015-02-25,13.5332
2015-02-26,13.5021
2015-02-27,13.5799
2015-03-02,13.7667
2015-03-03,13.5877
2015-03-04,13.3386
2015-03-05,13.0585
2015-03-06,12.5915
2015-03-09,12.646
2015-03-10,12.5993
2015-03-11,12.6305
2015-03-12,12.7628
2015-03-13,12.8172
2015-03-16,12.9417
2015-03-17,13.0429
2015-03-18,13.2608
2015-03-19,13.1908
2015-03-20,13.4554
2015-03-23,13.4554
2015-03-24,13.2919
2015-03-25,12.8717
2015-03-26,12.6927
2015-03-27,12.8176
2015-03-30,12.9972
2015-03-31,13.0128
2015-04-01,13.1142
2015-04-02,13.2626
2015-04-06,13.3328
2015-04-07,12.9269
2015-04-08,13.0362
2015-04-09,12.7317
2015-04-10,12.7317
2015-04-13,12.7161
2015-04-14,12.7005
2015-04-15,12.5912
2015-04-16,12.7161
2015-04-17,12.6849
2015-04-20,12.7474
2015-04-21,12.8332
2015-04-22,12.7552
2015-04-23,12.7942
2015-04-24,12.7942
2015-04-27,12.7864
2015-04-28,12.7942
2015-04-29,12.6069
2015-04-30,12.1619
2015-05-01,12.1775
2015-05-04,12.3414
2015-05-05,12.0526
2015-05-06,11.8653
2015-05-07,12.1151
2015-05-08,12.2087
2015-05-11,11.9277
2015-05-12,11.9043
2015-05-13,11.9043
2015-05-14,12.2009
2015-05-15,12.3961
2015-05-18,12.3258
2015-05-19,12.2322
2015-05-20,12.2165
2015-05-21,12.1229
2015-05-22,12.0838
2015-05-26,11.8965
2015-05-27,12.1229
2015-05-28,11.998
2015-05-29,11.9121
2015-06-01,12.0838
2015-06-02,12.0214
2015-06-03,11.9277
2015-06-04,11.9277
2015-06-05,11.8419
2015-06-08,11.7872
2015-06-09,11.7716
2015-06-10,11.8731
2015-06-11,11.8809
2015-06-12,11.834
2015-06-15,11.9043
2015-06-16,12.037
2015-06-17,12.0838
2015-06-18,12.2868
2015-06-19,12.2009
2015-06-22,12.0214
2015-06-23,12.0995
2015-06-24,11.9589
2015-06-25,11.7794
2015-06-26,11.7794
2015-06-29,11.4583
2015-06-30,11.7559
2015-07-01,12.03
2015-07-02,12.1475
2015-07-06,12.2728
2015-07-07,12.3903
2015-07-08,12.2571
2015-07-09,12.1867
2015-07-10,12.2963
2015-07-13,12.2963
2015-07-14,12.3511
2015-07-15,12.3903
2015-07-16,12.5078
2015-07-17,12.3981
2015-07-20,12.406
2015-07-21,12.2337
2015-07-22,12.1867
2015-07-23,11.7716
2015-07-24,11.5366
2015-07-27,11.5209
2015-07-28,11.427
2015-07-29,11.333
2015-07-30,11.1528
2015-07-31,11.0197
2015-08-03,11.2233
2015-08-04,11.2155
2015-08-05,10.9805
2015-08-06,10.9884
2015-08-07,11.1763
2015-08-10,11.2938
2015-08-11,11.4661
2015-08-12,11.4661
2015-08-13,11.4348
2015-08-14,11.4191
2015-08-17,11.6541
2015-08-18,11.5914
2015-08-19,11.3956
2015-08-20,11.2468
2015-08-21,11.0197
2015-08-24,10.6516
2015-08-25,10.3148
2015-08-26,10.7064
2015-08-27,10.9335
2015-08-28,11.0197
2015-08-31,10.8317
2015-09-01,10.6829
2015-09-02,10.7926
2015-09-03,10.6672
2015-09-04,10.4871
2015-09-08,10.7847
2015-09-09,10.8944
2015-09-10,10.8161
2015-09-11,11.0823
2015-09-14,10.9962
2015-09-15,10.7534
2015-09-16,11.1137
2015-09-17,11.2312
2015-09-18,10.5889
2015-09-21,10.7221
2015-09-22,10.3226
2015-09-23,10.5419
2015-09-24,10.4714
2015-09-25,10.4714
2015-09-28,10.2749
2015-09-29,10.1884
2015-09-30,10.4007
2015-10-01,10.5501
2015-10-02,10.6365
2015-10-05,11.0139
2015-10-06,11.1004
2015-10-07,11.4541
2015-10-08,11.7843
2015-10-09,11.6271
2015-10-12,11.5799
2015-10-13,11.3126
2015-10-14,11.3048
2015-10-15,11.6428
2015-10-16,11.6585
2015-10-19,11.7371
2015-10-20,11.7607
2015-10-21,11.3677
2015-10-22,11.6742
2015-10-23,11.2812
2015-10-26,11.1397
2015-10-27,11.0689
2015-10-28,11.1868
2015-10-29,11.3677
2015-10-30,11.3677
2015-11-02,11.6271
2015-11-03,11.4227
2015-11-04,11.5485
2015-11-05,11.5956
2015-11-06,11.4934
2015-11-09,11.2183
2015-11-10,11.4227
2015-11-11,11.4934
2015-11-12,11.3834
2015-11-13,11.1711
2015-11-16,11.2733
2015-11-17,11.0768
2015-11-18,11.006
2015-11-19,10.9353
2015-11-20,11.0296
2015-11-23,11.1554
2015-11-24,11.234
2015-11-25,11.3834
2015-11-27,11.4856
2015-11-30,11.5406
2015-12-01,11.6271
2015-12-02,11.3362
2015-12-03,10.9589
2015-12-04,11.0846
2015-12-07,10.8724
2015-12-08,10.8567
2015-12-09,10.5894
2015-12-10,10.6601
2015-12-11,10.5501
2015-12-14,10.5422
2015-12-15,10.6051
2015-12-16,10.8016
2015-12-17,10.6601
2015-12-18,10.3928
2015-12-21,10.7387
2015-12-22,10.7702
2015-12-23,10.8567
2015-12-24,10.9431
2015-12-28,10.8488
2015-12-29,10.944
2015-12-30,10.9699
2015-12-31,10.8055
2016-01-04,10.4768
2016-01-05,10.7796
2016-01-06,10.4335
2016-01-07,10.1307
2016-01-08,10.0615
2016-01-11,10.1134
2016-01-12,9.9404
2016-01-13,9.2656
2016-01-14,9.3002
2016-01-15,8.9282
2016-01-19,8.7638
2016-01-20,9.0493
2016-01-21,9.3262
2016-01-22,9.7328
2016-01-25,9.5424
2016-01-26,10.0356
2016-01-27,9.8971
2016-01-28,9.9058
2016-01-29,10.2778
2016-02-01,9.9577
2016-02-02,9.6809
2016-02-03,9.7587
2016-02-04,9.9837
2016-02-05,10.0788
2016-02-08,9.9058
2016-02-09,9.9664
2016-02-10,10.1048
2016-02-11,9.9923
2016-02-12,10.3297
2016-02-16,10.3816
2016-02-17,10.6585
2016-02-18,10.6066
2016-02-19,10.5806
2016-02-22,10.7709
2016-02-23,10.7277
2016-02-24,10.8574
2016-02-25,11.1429
2016-02-26,11.0391
2016-02-29,11.1602
2016-03-01,11.5928
2016-03-02,11.7226
2016-03-03,11.7572
2016-03-04,11.8091
2016-03-07,11.8523
2016-03-08,11.5928
2016-03-09,11.5496
2016-03-10,11.4025
2016-03-11,11.7572
2016-03-14,11.7226
2016-03-15,11.489
2016-03-16,11.6707
2016-03-17,11.7485
2016-03-18,11.8956
2016-03-21,11.6188
2016-03-22,11.5236
2016-03-23,11.2814
2016-03-24,11.2208
2016-03-28,11.4719
2016-03-29,11.8626
2016-03-30,11.8366
2016-03-31,12.1579
2016-04-01,11.6108
2016-04-04,11.4458
2016-04-05,11.4197
2016-04-06,11.4024
2016-04-07,11.2721
2016-04-08,11.4719
2016-04-11,11.5153
2016-04-12,11.6542
2016-04-13,11.88
2016-04-14,11.9842
2016-04-15,12.0276
2016-04-18,11.8019
2016-04-19,11.6803
2016-04-20,11.5326
2016-04-21,11.3069
2016-04-22,11.2634
2016-04-25,11.3155
2016-04-26,11.524
2016-04-27,11.5413
2016-04-28,11.3676
2016-04-29,11.1245
2016-05-02,11.2287
2016-05-03,10.9942
2016-05-04,11.029
2016-05-05,11.0116
2016-05-06,11.0724
2016-05-09,11.194
2016-05-10,11.4719
2016-05-11,11.2374
2016-05-12,11.029
2016-05-13,10.9161
2016-05-16,11.0029
2016-05-17,10.7771
2016-05-18,10.56
2016-05-19,10.1605
2016-05-20,10.1953
2016-05-23,10.1692
2016-05-24,10.2734
2016-05-25,10.4297
2016-05-26,10.3255
2016-05-27,10.4645
2016-05-31,10.4558
2016-06-01,10.4819
2016-06-02,10.5947
2016-06-03,10.395
2016-06-06,10.3603
2016-06-07,10.3603
2016-06-08,10.534
2016-06-09,10.2821
2016-06-10,10.1345
2016-06-13,10.0824
2016-06-14,10.0997
2016-06-15,10.23
2016-06-16,10.1692
2016-06-17,10.4211
2016-06-20,10.5253
2016-06-21,10.6295
2016-06-22,10.6121
2016-06-23,10.8032
2016-06-24,10.3082
2016-06-27,9.8742
2016-06-28,10.0835
2016-06-29,10.4324
2016-06-30,10.5284
2016-07-01,10.7639
2016-07-05,10.5894
2016-07-06,10.5545
2016-07-07,10.4935
2016-07-08,10.8249
2016-07-11,11.0081
2016-07-12,11.2
2016-07-13,10.8947
2016-07-14,10.8773
2016-07-15,11.3396
2016-07-18,11.5925
2016-07-19,11.7059
2016-07-20,11.5838
2016-07-21,11.6972
2016-07-22,11.8891
2016-07-25,11.8804
2016-07-26,11.4879
2016-07-27,11.4355
2016-07-28,11.453
2016-07-29,11.6013
2016-08-01,11.6798
2016-08-02,11.4355
2016-08-03,11.5838
2016-08-04,11.4442
2016-08-05,11.7932
2016-08-08,11.9851
2016-08-09,12.0461
2016-08-10,11.9589
2016-08-11,11.828
2016-08-12,11.8542
2016-08-15,12.0199
2016-08-16,11.9851
2016-08-17,11.7583
2016-08-18,11.8106
2016-08-19,11.8891
2016-08-22,11.9938
2016-08-23,11.9414
2016-08-24,11.828
2016-08-25,11.8978
2016-08-26,11.9414
2016-08-29,11.9763
2016-08-30,12.0723
2016-08-31,12.1159
2016-09-01,11.828
2016-09-02,11.828
2016-09-06,11.6187
2016-09-07,11.514
2016-09-08,11.3919
2016-09-09,10.7551
2016-09-12,10.8249
2016-09-13,10.7377
2016-09-14,10.7988
2016-09-15,10.9122
2016-09-16,10.9296
2016-09-19,10.8773
2016-09-20,10.8424
2016-09-21,11.0604
2016-09-22,11.2611
2016-09-23,11.3745
2016-09-26,10.9907
2016-09-27,10.9034
2016-09-28,11.1399
2016-09-29,11.0873
2016-09-30,11.2012
2016-10-03,11.1749
2016-10-04,11.1311
2016-10-05,11.0873
2016-10-06,11.3413
2016-10-07,11.1574
2016-10-10,11.3588
2016-10-11,11.1924
2016-10-12,11.1662
2016-10-13,11.2275
2016-10-14,11.1924
2016-10-17,11.2713
2016-10-18,11.4639
2016-10-19,11.6303
2016-10-20,11.534
2016-10-21,11.4814
2016-10-24,11.4464
2016-10-25,11.3151
2016-10-26,11.0173
2016-10-27,10.8246
2016-10-28,10.8596
2016-10-31,10.9998
2016-11-01,10.7633
2016-11-02,10.7896
2016-11-03,10.6845
2016-11-04,10.8421
2016-11-07,11.1487
2016-11-08,11.3851
2016-11-09,11.6303
2016-11-10,11.7967
2016-11-11,11.9456
2016-11-14,12.2434
2016-11-15,12.2083
2016-11-16,12.4448
2016-11-17,12.0857
2016-11-18,11.8755
2016-11-21,11.9018
2016-11-22,12.1908
2016-11-23,12.3485
2016-11-25,12.4798
2016-11-28,12.5149
2016-11-29,12.69
2016-11-30,12.7338
2016-12-01,13.1104
2016-12-02,12.9965
2016-12-05,13.2505
2016-12-06,13.3994
2016-12-07,13.7585
2016-12-08,13.741
2016-12-09,13.7935
2016-12-12,13.7234
2016-12-13,13.6534
2016-12-14,13.6096
2016-12-15,13.5658
2016-12-16,13.6884
2016-12-19,13.9336
2016-12-20,13.8636
2016-12-21,13.6972
2016-12-22,13.6008
2016-12-23,13.776
2016-12-27,13.6972
2016-12-28,13.7425
2016-12-29,13.7878
2016-12-30,13.8241
2017-01-03,13.9963
2017-01-04,14.1867
2017-01-05,13.6065
2017-01-06,13.398
2017-01-09,13.5612
2017-01-10,13.5431
2017-01-11,13.398
2017-01-12,13.3618
2017-01-13,13.3708
2017-01-17,13.3618
2017-01-18,13.5431
2017-01-19,13.4161
2017-01-20,13.3436
2017-01-23,13.398
2017-01-24,13.4977
2017-01-25,13.6246
2017-01-26,13.8331
2017-01-27,13.7516
2017-01-30,13.3074
2017-01-31,13.3436
2017-02-01,13.3346
2017-02-02,13.4615
2017-02-03,13.7062
2017-02-06,13.6428
2017-02-07,13.4161
2017-02-08,13.5068
2017-02-09,13.7425
2017-02-10,13.8241
2017-02-13,13.9419
2017-02-14,13.9872
2017-02-15,14.1051
2017-02-16,13.9691
2017-02-17,13.7153
2017-02-21,13.7787
2017-02-22,13.5974
2017-02-23,13.3799
2017-02-24,13.3346
2017-02-27,13.534
2017-02-28,13.3708
2017-03-01,13.4705
2017-03-02,13.3708
2017-03-03,13.2711
2017-03-06,13.253
2017-03-07,13.2077
2017-03-08,13.1079
2017-03-09,12.9085
2017-03-10,12.981
2017-03-13,13.0807
2017-03-14,13.0898
2017-03-15,13.389
2017-03-16,13.6428
2017-03-17,13.5431
2017-03-20,13.4615
2017-03-21,13.1714
2017-03-22,13.3164
2017-03-23,13.3255
2017-03-24,13.3618
2017-03-27,13.3346
2017-03-28,13.4071
2017-03-29,13.5799
2017-03-30,13.7618
2017-03-31,13.9437
2017-04-03,13.6981
2017-04-04,13.78
2017-04-05,13.8346
2017-04-06,13.9801
2017-04-07,13.7345
2017-04-10,13.7709
2017-04-11,13.8437
2017-04-12,13.7709
2017-04-13,13.7709
2017-04-17,13.8892
2017-04-18,13.8892
2017-04-19,14.0802
2017-04-20,14.0802
2017-04-21,13.871
2017-04-24,14.1347
2017-04-25,14.3621
2017-04-26,14.4895
2017-04-27,14.353
2017-04-28,13.5435
2017-05-01,13.6981
2017-05-02,13.7982
2017-05-03,14.0529
2017-05-04,14.162
2017-05-05,14.4167
2017-05-08,14.162
2017-05-09,14.0984
2017-05-10,14.1256
2017-05-11,13.9983
2017-05-12,13.78
2017-05-15,13.78
2017-05-16,14.0256
2017-05-17,13.9437
2017-05-18,14.2075
2017-05-19,14.353
2017-05-22,14.444
2017-05-23,14.4713
2017-05-24,14.5531
2017-05-25,14.3348
2017-05-26,14.3348
2017-05-30,14.3076
2017-05-31,14.1984
2017-06-01,14.4258
2017-06-02,14.4531
2017-06-05,14.4986
2017-06-06,14.3985
2017-06-07,14.4349
2017-06-08,14.726
2017-06-09,14.8533
2017-06-12,14.8988
2017-06-13,15.0534
2017-06-14,14.9625
2017-06-15,14.917
2017-06-16,15.0443
2017-06-19,15.208
2017-06-20,15.1171
2017-06-21,14.9716
2017-06-22,14.9352
2017-06-23,15.017
2017-06-26,15.1444
2017-06-27,15.1171
2017-06-28,15.0988
2017-06-29,14.889
2017-06-30,14.7065
2017-07-03,15.1262
2017-07-05,14.7613
2017-07-06,14.5788
2017-07-07,14.6609
2017-07-10,14.2869
2017-07-11,14.4693
2017-07-12,14.6153
2017-07-13,14.6974
2017-07-14,14.7704
2017-07-17,14.9893
2017-07-18,14.962
2017-07-19,15.2083
2017-07-20,14.6974
2017-07-21,14.6792
2017-07-24,14.6153
2017-07-25,14.7795
2017-07-26,14.4967
2017-07-27,14.6427
2017-07-28,14.8069
2017-07-31,14.8525
2017-08-01,14.8343
2017-08-02,14.6883
2017-08-03,14.6609
2017-08-04,14.9529
2017-08-07,14.8434
2017-08-08,14.5058
2017-08-09,14.1956
2017-08-10,14.1409
2017-08-11,14.1409
2017-08-14,14.3599
2017-08-15,14.3599
2017-08-16,14.4967
2017-08-17,14.2869
2017-08-18,14.0588
2017-08-21,14.0679
2017-08-22,14.1135
2017-08-23,14.0132
2017-08-24,14.004
2017-08-25,14.0953
2017-08-28,13.8946
2017-08-29,13.8946
2017-08-30,14.2321
2017-08-31,14.4146
2017-09-01,14.4967
2017-09-05,14.1774
2017-09-06,14.2869
2017-09-07,14.1956
2017-09-08,14.3416
2017-09-11,14.5058
2017-09-12,14.4967
2017-09-13,14.6153
2017-09-14,14.4237
2017-09-15,14.4328
2017-09-18,14.4511
2017-09-19,14.3872
2017-09-20,14.5332
2017-09-21,14.4055
2017-09-22,14.4511
2017-09-25,14.4967
2017-09-26,14.6153
2017-09-27,14.67
2017-09-28,14.7341
2017-09-29,14.7066
2017-10-02,14.6792
2017-10-03,14.5511
2017-10-04,14.5785
2017-10-05,14.6975
2017-10-06,14.8165
2017-10-09,14.8897
2017-10-10,14.9354
2017-10-11,15.0269
2017-10-12,15.3015
2017-10-13,15.2008
2017-10-16,15.2649
2017-10-17,15.3106
2017-10-18,15.4845
2017-10-19,15.5211
2017-10-20,15.1276
2017-10-23,14.8897
2017-10-24,15.0727
2017-10-25,14.908
2017-10-26,14.9171
2017-10-27,15.0544
2017-10-30,14.8348
2017-10-31,14.9354
2017-11-01,14.8988
2017-11-02,15.1734
2017-11-03,15.0819
2017-11-06,15.1093
2017-11-07,14.9263
2017-11-08,15.21
2017-11-09,15.1368
2017-11-10,15.1185
2017-11-13,15.0727
2017-11-14,14.9812
2017-11-15,14.8805
2017-11-16,15.0178
2017-11-17,14.9995
2017-11-20,14.8805
2017-11-21,15.091
2017-11-22,15.0819
2017-11-24,15.2008
2017-11-27,15.1185
2017-11-28,15.0086
2017-11-29,15.1917
2017-11-30,15.2923
2017-12-01,15.091
2017-12-04,15.2466
2017-12-05,15.1185
2017-12-06,15.21
2017-12-07,15.21
2017-12-08,15.2923
2017-12-11,15.2374
2017-12-12,15.2466
2017-12-13,15.4205
2017-12-14,15.329
2017-12-15,15.631
2017-12-18,15.9604
2017-12-19,15.6767
2017-12-20,15.5943
2017-12-21,15.5577
2017-12-22,15.6126
2017-12-26,15.6035
2017-12-27,15.6493
2017-12-28,15.8671
2017-12-29,15.6587
2018-01-02,15.8103
2018-01-03,15.5924
2018-01-04,15.4408
2018-01-05,15.5451
2018-01-08,15.7156
2018-01-09,15.6777
2018-01-10,15.8008
2018-01-11,15.8956
2018-01-12,15.7629
2018-01-16,15.8198
2018-01-17,16.0471
2018-01-18,15.7535
2018-01-19,15.8766
2018-01-22,15.9145
2018-01-23,16.3502
2018-01-24,16.3029
2018-01-25,16.1324
2018-01-26,16.1797
2018-01-29,16.0755
2018-01-30,15.8766
2018-01-31,15.9619
2018-02-01,15.8577
2018-02-02,15.4882
2018-02-05,14.9293
2018-02-06,15.1756
2018-02-07,15.0998
2018-02-08,14.6167
2018-02-09,15.0051
2018-02-12,14.9672
2018-02-13,14.9388
2018-02-14,14.9198
2018-02-15,14.6451
2018-02-16,14.7588
2018-02-20,14.4651
2018-02-21,14.0957
2018-02-22,14.1336
2018-02-23,14.323
2018-02-26,14.1999
2018-02-27,13.7263
2018-02-28,13.6694
2018-03-01,13.6884
2018-03-02,13.7073
2018-03-05,13.7547
2018-03-06,13.7263
2018-03-07,13.982
2018-03-08,13.9062
2018-03-09,14.1336
2018-03-12,14.0768
2018-03-13,14.0104
2018-03-14,14.1146
2018-03-15,14.1431
2018-03-16,14.323
2018-03-19,14.1715
2018-03-20,14.181
2018-03-21,14.1431
2018-03-22,13.8683
2018-03-23,13.5747
2018-03-26,13.8778
2018-03-27,13.8305
2018-03-28,14.4483
2018-03-29,14.4673
2018-04-02,14.1917
2018-04-03,14.4578
2018-04-04,14.4388
2018-04-05,14.2582
2018-04-06,14.0966
2018-04-09,13.8305
2018-04-10,13.7069
2018-04-11,13.973
2018-04-12,14.6574
2018-04-13,14.686
2018-04-16,14.743
2018-04-17,15.0852
2018-04-18,15.0757
2018-04-19,15.0567
2018-04-20,14.9521
2018-04-23,14.8666
2018-04-24,14.8475
2018-04-25,14.9236
2018-04-26,14.8761
2018-04-27,15.0091
2018-04-30,14.8285
2018-05-01,14.8761
2018-05-02,14.819
2018-05-03,15.0662
2018-05-04,15.2943
2018-05-07,15.4464
2018-05-08,15.57
2018-05-09,15.7886
2018-05-10,15.8266
2018-05-11,15.7981
2018-05-14,15.6365
2018-05-15,15.3894
2018-05-16,15.4654
2018-05-17,15.5319
2018-05-18,15.8266
2018-05-21,16.2448
2018-05-22,16.2544
2018-05-23,16.2639
2018-05-24,16.4445
2018-05-25,16.3494
2018-05-29,16.2734
2018-05-30,16.5585
2018-05-31,16.53
2018-06-01,16.6536
2018-06-04,16.6346
2018-06-05,16.4255
2018-06-06,16.3399
2018-06-07,16.2924
2018-06-08,16.1308
2018-06-11,15.8931
2018-06-12,15.8171
2018-06-13,15.5795
2018-06-14,15.7411
2018-06-15,15.627
2018-06-18,15.5985
2018-06-19,15.646
2018-06-20,16.0167
2018-06-21,16.0452
2018-06-22,16.0167
2018-06-25,15.8456
2018-06-26,15.9692
2018-06-27,15.7981
2018-06-28,15.7981
2018-06-29,15.8458
2018-07-02,15.6551
2018-07-03,15.8744
2018-07-05,16.0555
2018-07-06,16.1795
2018-07-09,16.1699
2018-07-10,16.0936
2018-07-11,15.8934
2018-07-12,15.9792
2018-07-13,16.0746
2018-07-16,15.9792
2018-07-17,15.9506
2018-07-18,15.9792
2018-07-19,16.1032
2018-07-20,16.0269
2018-07-23,16.189
2018-07-24,15.8267
2018-07-25,15.7218
2018-07-26,15.6837
2018-07-27,15.4072
2018-07-30,15.2642
2018-07-31,15.5121
2018-08-01,15.7409
2018-08-02,15.9697
2018-08-03,15.5979
2018-08-06,15.7123
2018-08-07,15.4739
2018-08-08,15.2928
2018-08-09,15.2928
2018-08-10,15.1212
2018-08-13,15.0544
2018-08-14,15.1307
2018-08-15,15.35
2018-08-16,15.5311
2018-08-17,15.6265
2018-08-20,15.5216
2018-08-21,15.7313
2018-08-22,15.7886
2018-08-23,15.6741
2018-08-24,15.6455
2018-08-27,15.6455
2018-08-28,15.7981
2018-08-29,15.9125
2018-08-30,15.9792
2018-08-31,15.9983
2018-09-04,15.6741
2018-09-05,15.9125
2018-09-06,15.8648
2018-09-07,15.8934
2018-09-10,15.8362
2018-09-11,15.8648
2018-09-12,15.7409
2018-09-13,15.8839
2018-09-14,15.8458
2018-09-17,15.903
2018-09-18,15.8172
2018-09-19,15.6646
2018-09-20,15.8172
2018-09-21,15.7599
2018-09-24,15.5311
2018-09-25,15.5883
2018-09-26,15.35
2018-09-27,15.4839
2018-09-28,15.6465
2018-10-01,15.4265
2018-10-02,15.2926
2018-10-03,15.4265
2018-10-04,14.9674
2018-10-05,14.8718
2018-10-08,15.0918
2018-10-09,14.8814
2018-10-10,14.6614
2018-10-11,14.1928
2018-10-12,14.1162
2018-10-15,14.0302
2018-10-16,14.3075
2018-10-17,14.1545
2018-10-18,13.9345
2018-10-19,14.0015
2018-10-22,13.8485
2018-10-23,13.858
2018-10-24,13.332
2018-10-25,13.5329
2018-10-26,13.4755
2018-10-29,13.6572
2018-10-30,13.7433
2018-10-31,13.8389
2018-11-01,13.9345
2018-11-02,13.772
2018-11-05,14.2215
2018-11-06,13.9824
2018-11-07,14.5753
2018-11-08,14.5179
2018-11-09,14.384
2018-11-12,14.2406
2018-11-13,14.3458
2018-11-14,14.298
2018-11-15,14.3936
2018-11-16,14.604
2018-11-19,14.5562
2018-11-20,14.6614
2018-11-21,14.6136
2018-11-23,14.5179
2018-11-26,14.6518
2018-11-27,14.6614
2018-11-28,14.8431
2018-11-29,14.8048
2018-11-30,14.5944
2018-12-03,14.5944
2018-12-04,14.1641
2018-12-06,14.3362
2018-12-07,14.0684
2018-12-10,13.8006
2018-12-11,13.6954
2018-12-12,13.7911
2018-12-13,13.7911
2018-12-14,13.7624
2018-12-17,13.4563
2018-12-18,13.485
2018-12-19,13.2746
2018-12-20,12.6625
2018-12-21,12.6912
2018-12-24,12.3469
2018-12-26,12.9303
2018-12-27,12.8251
2018-12-28,12.9547
2018-12-31,12.9646
2019-01-02,12.8749
2019-01-03,12.8152
2019-01-04,13.2636
2019-01-07,13.4529
2019-01-08,13.8017
2019-01-09,13.7718
2019-01-10,13.9811
2019-01-11,14.001
2019-01-14,13.9113
2019-01-15,14.0209
2019-01-16,14.0508
2019-01-17,14.0907
2019-01-18,14.0209
2019-01-22,13.8216
2019-01-23,13.6921
2019-01-24,13.6821
2019-01-25,13.8914
2019-01-28,13.991
2019-01-29,14.1505
2019-01-30,14.3099
2019-01-31,14.2501
2019-02-01,14.1704
2019-02-04,14.2302
2019-02-05,14.3996
2019-02-06,14.3199
2019-02-07,14.4893
2019-02-08,14.28
2019-02-11,14.1605
2019-02-12,13.9512
2019-02-13,14.5391
2019-02-14,14.3598
2019-02-15,14.5989
2019-02-19,14.7185
2019-02-20,15.0772
2019-02-21,15.2367
2019-02-22,15.3862
2019-02-25,15.2466
2019-02-26,15.0075
2019-02-27,14.8181
2019-02-28,14.9975
2019-03-01,14.9278
2019-03-04,15.0374
2019-03-05,15.0872
2019-03-06,14.9577
2019-03-07,14.7783
2019-03-08,14.7982
2019-03-11,14.9676
2019-03-12,14.6487
2019-03-13,14.6487
2019-03-14,14.6089
2019-03-15,14.5989
2019-03-18,14.6388
2019-03-19,14.3996
2019-03-20,14.3996
2019-03-21,14.5092
2019-03-22,14.1903
2019-03-25,14.1903
2019-03-26,14.3
2019-03-27,14.29
2019-03-28,14.5
2019-03-29,14.4
2019-04-01,14.62
2019-04-02,14.75
2019-04-03,14.88
2019-04-04,14.82
2019-04-05,14.94
2019-04-08,14.94
2019-04-09,14.45
2019-04-10,14.74
2019-04-11,14.71
2019-04-12,14.84
2019-04-15,14.75
2019-04-16,14.76
2019-04-17,14.5
2019-04-18,14.66
2019-04-22,14.36
2019-04-23,14.6
2019-04-24,14.54
2019-04-25,14.38
2019-04-26,14.51
2019-04-29,14.46
2019-04-30,14.4
2019-05-01,14.42
2019-05-02,14.41
2019-05-03,14.57
2019-05-06,14.61
2019-05-07,14.23
2019-05-08,13.99
2019-05-09,14.17
2019-05-10,14.3
2019-05-13,14.16
2019-05-14,14.31
2019-05-15,14.54
2019-05-16,14.5
2019-05-17,14.36
2019-05-20,14.16
2019-05-21,14.33
2019-05-22,14.16
2019-05-23,13.94
2019-05-24,13.97
2019-05-28,13.79
2019-05-29,13.58
2019-05-30,13.46
2019-05-31,13.42
2019-06-03,13.52
2019-06-04,13.55
2019-06-05,13.6
2019-06-06,13.42
2019-06-07,13.61
2019-06-10,13.75
2019-06-11,13.8
2019-06-12,13.8
2019-06-13,13.765
2019-06-14,13.665
2019-06-17,13.735
2019-06-18,13.825
2019-06-19,13.845
2019-06-20,13.83
2019-06-21,13.59
2019-06-24,13.37
2019-06-25,13.365
2019-06-26,13.24
2019-06-27,13.595
2019-06-28,13.735
2019-07-01,13.585
2019-07-02,13.645
2019-07-03,13.815
2019-07-04,13.815
2019-07-05,13.805
2019-07-08,13.755
2019-07-09,13.785
2019-07-10,13.835
2019-07-11,13.41
2019-07-12,13.56
2019-07-15,13.515
2019-07-16,13.535
2019-07-17,13.34
2019-07-18,13.21
2019-07-19,13.155
2019-07-22,13.05
2019-07-23,13.27
2019-07-24,13.335
2019-07-25,13.23
2019-07-26,13.28
2019-07-29,13.29
2019-07-30,13.445
2019-07-31,13.225
2019-08-01,12.84
2019-08-02,13.345
2019-08-05,13.01
2019-08-06,13.09
2019-08-07,13.065
2019-08-08,13.495
2019-08-09,13.395
2019-08-12,13.28
2019-08-13,13.385
2019-08-14,12.995
2019-08-15,12.955
2019-08-16,13.155
2019-08-19,13.15
2019-08-20,13.06
2019-08-21,13.165
2019-08-22,13.175
2019-08-23,12.875
2019-08-26,13.01
2019-08-27,13.065
2019-08-28,13.11
2019-08-29,13.16
2019-08-30,13.135
2019-09-02,13.135
2019-09-03,13.085
2019-09-04,13.27
2019-09-05,13.475
2019-09-06,13.265
2019-09-09,13.605
2019-09-10,13.69
2019-09-11,13.74
2019-09-12,13.68
2019-09-13,13.96
2019-09-16,13.92
2019-09-17,13.755
2019-09-18,13.775
2019-09-19,13.83
2019-09-20,13.915
2019-09-23,13.87
2019-09-24,13.655
2019-09-25,13.72
2019-09-26,13.655
2019-09-27,13.635
2019-09-30,13.745
2019-10-01,13.505
2019-10-02,13.44
2019-10-03,13.575
2019-10-04,13.555
2019-10-07,13.545
2019-10-08,13.315
2019-10-09,13.26
2019-10-10,13.375
2019-10-11,13.675
2019-10-14,13.55
2019-10-15,13.625
2019-10-16,13.55
2019-10-17,13.475
2019-10-18,13.52
2019-10-21,13.825
2019-10-22,13.86
2019-10-23,13.875
2019-10-24,13.825
2019-10-25,13.63
2019-10-28,13.745
2019-10-29,13.555
2019-10-30,13.505
2019-10-31,13.49
2019-11-01,13.87
2019-11-04,14.05
2019-11-05,14.36
2019-11-06,14.165
2019-11-07,13.825
2019-11-08,13.975
2019-11-11,13.915
2019-11-12,13.74
2019-11-13,13.805
2019-11-14,14.005
2019-11-15,14.025
2019-11-18,13.96
2019-11-19,13.905
2019-11-20,13.775
2019-11-21,13.695
2019-11-22,13.725
2019-11-25,13.985
