date,close
2014-06-13,26.2161
2014-06-16,26.1924
2014-06-17,26.2633
2014-06-18,26.3894
2014-06-19,26.5469
2014-06-20,26.5548
2014-06-23,26.3657
2014-06-24,26.3657
2014-06-25,26.5732
2014-06-26,26.3405
2014-06-27,26.1561
2014-06-30,26.2684
2014-07-01,26.4047
2014-07-02,26.3085
2014-07-03,26.1641
2014-07-07,26.0117
2014-07-08,26.0598
2014-07-09,26.1561
2014-07-10,26.6694
2014-07-11,26.5411
2014-07-14,26.7015
2014-07-15,26.6854
2014-07-16,26.8699
2014-07-17,26.6453
2014-07-18,26.918
2014-07-21,26.8619
2014-07-22,27.0063
2014-07-23,26.8539
2014-07-24,27.0464
2014-07-25,26.9742
2014-07-28,27.0865
2014-07-29,26.9582
2014-07-30,26.8378
2014-07-31,26.3004
2014-08-01,26.4929
2014-08-04,26.7095
2014-08-05,26.3566
2014-08-06,26.3646
2014-08-07,26.2924
2014-08-08,26.509
2014-08-11,26.533
2014-08-12,26.4929
2014-08-13,26.5812
2014-08-14,26.7175
2014-08-15,26.7255
2014-08-18,26.6854
2014-08-19,26.7576
2014-08-20,26.501
2014-08-21,26.509
2014-08-22,26.3085
2014-08-25,26.3085
2014-08-26,26.4368
2014-08-27,26.3405
2014-08-28,26.3807
2014-08-29,26.2042
2014-09-02,26.3245
2014-09-03,26.4448
2014-09-04,26.5812
2014-09-05,26.5571
2014-09-08,26.4368
2014-09-09,26.14
2014-09-10,26.4208
2014-09-11,26.3566
2014-09-12,26.3165
2014-09-15,26.3245
2014-09-16,26.533
2014-09-17,26.3165
2014-09-18,26.3486
2014-09-19,26.3887
2014-09-22,26.7576
2014-09-23,26.5732
2014-09-24,26.5491
2014-09-25,26.2042
2014-09-26,26.3004
2014-09-29,26.3325
2014-09-30,26.14
2014-10-01,25.9315
2014-10-02,25.8192
2014-10-03,25.7229
2014-10-06,25.8031
2014-10-07,25.6026
2014-10-08,25.8433
2014-10-09,25.2176
2014-10-10,24.9048
2014-10-13,24.6963
2014-10-14,24.4957
2014-10-15,24.4476
2014-10-16,24.4556
2014-10-17,24.3514
2014-10-20,24.5358
2014-10-21,24.608
2014-10-22,24.3434
2014-10-23,24.4236
2014-10-24,24.3434
2014-10-27,24.2872
2014-10-28,23.8862
2014-10-29,23.8781
2014-10-30,24.3835
2014-10-31,24.8807
2014-11-03,24.9369
2014-11-04,24.6401
2014-11-05,24.8888
2014-11-06,24.7364
2014-11-07,24.7685
2014-11-10,24.7685
2014-11-11,24.8567
2014-11-12,24.7925
2014-11-13,24.9048
2014-11-14,25.0813
2014-11-17,24.7043
2014-11-18,24.9048
2014-11-19,24.8647
2014-11-20,24.8888
2014-11-21,25.2176
2014-11-24,25.2417
2014-11-25,25.5304
2014-11-26,25.5385
2014-11-28,25.5946
2014-12-01,26.3486
2014-12-02,26.4288
2014-12-03,26.0839
2014-12-04,26.0839
2014-12-05,26.0037
2014-12-08,25.8593
2014-12-09,25.8834
2014-12-10,25.3861
2014-12-11,25.9956
2014-12-12,26.3566
2014-12-15,25.8272
2014-12-16,25.6909
2014-12-17,26.116
2014-12-18,26.6213
2014-12-19,26.4288
2014-12-22,26.7657
2014-12-23,26.7496
2014-12-24,26.8699
2014-12-26,26.9002
2014-12-29,26.4742
2014-12-30,26.1218
2014-12-31,25.9416
2015-01-02,25.9579
2015-01-05,25.5564
2015-01-06,25.409
2015-01-07,25.4745
2015-01-08,25.7695
2015-01-09,25.4581
2015-01-12,25.4909
2015-01-13,25.9088
2015-01-14,26.0071
2015-01-15,26.3758
2015-01-16,26.4414
2015-01-20,26.7282
2015-01-21,27.269
2015-01-22,27.1624
2015-01-23,27.0805
2015-01-26,27.2608
2015-01-27,27.0395
2015-01-28,26.0399
2015-01-29,26.0563
2015-01-30,25.8186
2015-02-02,26.0563
2015-02-03,25.9088
2015-02-04,25.7941
2015-02-05,25.8678
2015-02-06,25.8842
2015-02-09,25.6712
2015-02-10,26.2529
2015-02-11,26.4496
2015-02-12,26.4578
2015-02-13,26.5233
2015-02-17,26.3594
2015-02-18,26.4168
2015-02-19,26.4168
2015-02-20,26.6298
2015-02-23,26.5725
2015-02-24,26.7773
2015-02-25,26.6298
2015-02-26,26.72
2015-02-27,26.6462
2015-03-02,26.6708
2015-03-03,26.6053
2015-03-04,26.5971
2015-03-05,26.8756
2015-03-06,27.0969
2015-03-09,27.0231
2015-03-10,26.8347
2015-03-11,26.892
2015-03-12,27.1542
2015-03-13,27.0067
2015-03-16,27.0477
2015-03-17,27.3263
2015-03-18,28.1129
2015-03-19,27.8097
2015-03-20,28.5472
2015-03-23,29.2764
2015-03-24,28.8422
2015-03-25,28.6373
2015-03-26,28.7274
2015-03-27,29.1289
2015-03-30,29.2764
2015-03-31,28.9815
2015-04-01,28.9077
2015-04-02,29.5632
2015-04-06,30.6284
2015-04-07,30.4399
2015-04-08,30.5055
2015-04-09,30.7267
2015-04-10,30.6694
2015-04-13,30.5547
2015-04-14,30.9316
2015-04-15,30.8169
2015-04-16,30.694
2015-04-17,30.9807
2015-04-20,30.8087
2015-04-21,31.0709
2015-04-22,30.653
2015-04-23,30.5874
2015-04-24,30.7923
2015-04-27,30.2761
2015-04-28,29.9319
2015-04-29,29.7435
2015-04-30,29.1699
2015-05-01,29.4649
2015-05-04,29.5222
2015-05-05,29.1371
2015-05-06,29.1044
2015-05-07,29.1044
2015-05-08,29.342
2015-05-11,29.0798
2015-05-12,29.0306
2015-05-13,29.1453
2015-05-14,29.301
2015-05-15,29.3666
2015-05-18,29.3829
2015-05-19,29.2027
2015-05-20,29.4567
2015-05-21,29.047
2015-05-22,28.8585
2015-05-26,28.4079
2015-05-27,28.752
2015-05-28,28.6455
2015-05-29,28.2932
2015-06-01,28.3259
2015-06-02,28.0228
2015-06-03,28.244
2015-06-04,27.9818
2015-06-05,27.9245
2015-06-08,27.7852
2015-06-09,27.6049
2015-06-10,27.9654
2015-06-11,27.8343
2015-06-12,27.6541
2015-06-15,27.4492
2015-06-16,27.5393
2015-06-17,27.3755
2015-06-18,27.5066
2015-06-19,27.5475
2015-06-22,27.8753
2015-06-23,27.8753
2015-06-24,27.5393
2015-06-25,27.8133
2015-06-26,27.5461
2015-06-29,26.9616
2015-06-30,27.0618
2015-07-01,26.8697
2015-07-02,26.686
2015-07-06,27.0701
2015-07-07,26.9532
2015-07-08,26.2936
2015-07-09,26.4105
2015-07-10,26.6276
2015-07-13,26.8447
2015-07-14,26.7779
2015-07-15,26.9282
2015-07-16,26.8614
2015-07-17,27.1119
2015-07-20,27.162
2015-07-21,27.0701
2015-07-22,26.7779
2015-07-23,26.6693
2015-07-24,26.3103
2015-07-27,26.4021
2015-07-28,26.4439
2015-07-29,26.8196
2015-07-30,26.4439
2015-07-31,26.6944
2015-08-03,26.8864
2015-08-04,26.9616
2015-08-05,27.2121
2015-08-06,27.02
2015-08-07,27.0367
2015-08-10,27.1202
2015-08-11,26.7194
2015-08-12,26.8864
2015-08-13,26.9783
2015-08-14,26.995
2015-08-17,26.9699
2015-08-18,27.0367
2015-08-19,26.8614
2015-08-20,25.7425
2015-08-21,25.3417
2015-08-24,24.9159
2015-08-25,24.8992
2015-08-26,25.3584
2015-08-27,25.5755
2015-08-28,25.9596
2015-08-31,25.4503
2015-09-01,24.7405
2015-09-02,25.5421
2015-09-03,25.8427
2015-09-04,25.2666
2015-09-08,25.9345
2015-09-09,25.6757
2015-09-10,25.4753
2015-09-11,25.1747
2015-09-14,25.2081
2015-09-15,25.517
2015-09-16,25.9512
2015-09-17,25.5337
2015-09-18,24.799
2015-09-21,24.8908
2015-09-22,24.4399
2015-09-23,24.3648
2015-09-24,24.3648
2015-09-25,24.5485
2015-09-28,24.0224
2015-09-29,23.9723
2015-09-30,24.1894
2015-10-01,24.3898
2015-10-02,24.7405
2015-10-05,24.9159
2015-10-06,24.8741
2015-10-07,25.0745
2015-10-08,25.4586
2015-10-09,25.7174
2015-10-12,25.7926
2015-10-13,25.6339
2015-10-14,25.4503
2015-10-15,25.8761
2015-10-16,26.2017
2015-10-19,26.0431
2015-10-20,25.9178
2015-10-21,26.4606
2015-10-22,26.5858
2015-10-23,26.5023
2015-10-26,26.1683
2015-10-27,24.298
2015-10-28,25.2499
2015-10-29,25.1497
2015-10-30,24.8658
2015-11-02,25.0411
2015-11-03,25.0077
2015-11-04,24.9159
2015-11-05,25.1831
2015-11-06,25.4336
2015-11-09,25.3
2015-11-10,25.3083
2015-11-11,25.2749
2015-11-12,25.2081
2015-11-13,25.0578
2015-11-16,25.2666
2015-11-17,25.2749
2015-11-18,25.325
2015-11-19,25.4753
2015-11-20,25.4836
2015-11-23,25.4503
2015-11-24,25.2415
2015-11-25,25.2415
2015-11-27,25.3584
2015-11-30,25.2332
2015-12-01,25.4002
2015-12-02,25.3584
2015-12-03,25.2332
2015-12-04,25.5504
2015-12-07,25.4503
2015-12-08,25.1914
2015-12-09,24.8825
2015-12-10,25.1664
2015-12-11,24.9743
2015-12-14,25.1747
2015-12-15,25.2165
2015-12-16,25.6172
2015-12-17,25.158
2015-12-18,25.0495
2015-12-21,25.5003
2015-12-22,25.9262
2015-12-23,26.185
2015-12-24,26.1099
2015-12-28,26.0469
2015-12-29,26.2688
2015-12-30,25.9531
2015-12-31,25.7057
2016-01-04,25.4753
2016-01-05,25.5094
2016-01-06,25.0317
2016-01-07,24.2724
2016-01-08,23.9226
2016-01-11,24.1273
2016-01-12,23.9396
2016-01-13,23.8031
2016-01-14,24.1444
2016-01-15,23.5898
2016-01-19,23.9226
2016-01-20,23.4704
2016-01-21,23.3936
2016-01-22,24.0932
2016-01-25,23.6325
2016-01-26,23.897
2016-01-27,23.7434
2016-01-28,23.8287
2016-01-29,23.897
2016-02-01,23.769
2016-02-02,23.5642
2016-02-03,23.513
2016-02-04,23.8628
2016-02-05,24.0079
2016-02-08,24.0079
2016-02-09,23.6751
2016-02-10,23.1888
2016-02-11,22.8817
2016-02-12,23.1291
2016-02-16,24.0335
2016-02-17,24.4003
2016-02-18,24.8269
2016-02-19,24.588
2016-02-22,25.0999
2016-02-23,24.8525
2016-02-24,24.8866
2016-02-25,24.8696
2016-02-26,24.844
2016-02-29,24.0591
2016-03-01,24.4771
2016-03-02,24.7331
2016-03-03,24.8269
2016-03-04,25.2791
2016-03-07,25.0829
2016-03-08,24.861
2016-03-09,25.3217
2016-03-10,24.8269
2016-03-11,25.518
2016-03-14,25.518
2016-03-15,25.3217
2016-03-16,25.535
2016-03-17,25.39
2016-03-18,25.6971
2016-03-21,25.8507
2016-03-22,25.5521
2016-03-23,25.3303
2016-03-24,25.0487
2016-03-28,25.3644
2016-03-29,25.5265
2016-03-30,25.4838
2016-03-31,25.4412
2016-04-01,24.9037
2016-04-04,24.6648
2016-04-05,24.3491
2016-04-06,24.588
2016-04-07,24.2382
2016-04-08,24.7245
2016-04-11,24.7416
2016-04-12,25.0402
2016-04-13,25.5521
2016-04-14,25.6545
2016-04-15,25.5009
2016-04-18,25.7825
2016-04-19,26.2688
2016-04-20,26.2688
2016-04-21,25.9531
2016-04-22,26.1408
2016-04-25,26.0213
2016-04-26,24.7928
2016-04-27,24.7075
2016-04-28,23.9396
2016-04-29,23.8287
2016-05-02,24.187
2016-05-03,23.8884
2016-05-04,23.7178
2016-05-05,23.8287
2016-05-06,23.897
2016-05-09,23.6496
2016-05-10,24.2041
2016-05-11,23.9226
2016-05-12,23.9652
2016-05-13,23.7519
2016-05-16,24.1956
2016-05-17,23.9226
2016-05-18,24.0079
2016-05-19,23.7434
2016-05-20,23.9738
2016-05-23,24.0335
2016-05-24,24.2809
2016-05-25,24.4089
2016-05-26,24.3662
2016-05-27,24.3747
2016-05-31,24.6136
2016-06-01,24.6819
2016-06-02,24.6136
2016-06-03,24.5795
2016-06-06,24.8866
2016-06-07,24.8696
2016-06-08,24.8696
2016-06-09,24.6733
2016-06-10,24.3577
2016-06-13,24.1614
2016-06-14,23.9823
2016-06-15,24.2382
2016-06-16,24.4856
2016-06-17,24.6477
2016-06-20,24.7757
2016-06-21,25.2876
2016-06-22,25.1682
2016-06-23,25.5862
2016-06-24,24.8952
2016-06-27,24.5053
2016-06-28,24.9167
2016-06-29,25.0831
2016-06-30,25.0481
2016-07-01,24.8292
2016-07-05,24.7942
2016-07-06,24.7066
2016-07-07,24.5578
2016-07-08,24.6804
2016-07-11,25.0743
2016-07-12,25.2582
2016-07-13,24.9955
2016-07-14,25.2057
2016-07-15,24.6716
2016-07-18,24.6541
2016-07-19,24.6453
2016-07-20,24.4965
2016-07-21,24.444
2016-07-22,24.5665
2016-07-25,24.7154
2016-07-26,23.9012
2016-07-27,24.3126
2016-07-28,24.2426
2016-07-29,24.7504
2016-08-01,24.6716
2016-08-02,24.4177
2016-08-03,24.409
2016-08-04,24.7416
2016-08-05,24.9605
2016-08-08,24.9955
2016-08-09,25.0481
2016-08-10,25.1794
2016-08-11,25.3457
2016-08-12,25.1094
2016-08-15,25.1881
2016-08-16,25.1181
2016-08-17,25.2494
2016-08-18,25.3195
2016-08-19,25.2932
2016-08-22,25.1269
2016-08-23,25.0568
2016-08-24,25.0481
2016-08-25,25.0481
2016-08-26,24.873
2016-08-29,24.8555
2016-08-30,24.908
2016-08-31,25.0656
2016-09-01,25.1531
2016-09-02,25.2932
2016-09-06,25.8798
2016-09-07,25.9498
2016-09-08,25.8623
2016-09-09,25.4245
2016-09-12,25.0656
2016-09-13,24.8379
2016-09-14,24.6716
2016-09-15,24.8905
2016-09-16,24.7416
2016-09-19,24.8379
2016-09-20,24.978
2016-09-21,25.4333
2016-09-22,25.6434
2016-09-23,25.302
2016-09-26,25.372
2016-09-27,25.4858
2016-09-28,25.5383
2016-09-29,25.5208
2016-09-30,25.4158
2016-10-03,25.3895
2016-10-04,25.2232
2016-10-05,25.3983
2016-10-06,25.2582
2016-10-07,25.407
2016-10-10,25.442
2016-10-11,25.3545
2016-10-12,25.2669
2016-10-13,25.1619
2016-10-14,25.2232
2016-10-17,25.3457
2016-10-18,25.5996
2016-10-19,25.5559
2016-10-20,25.5471
2016-10-21,25.6872
2016-10-24,25.8098
2016-10-25,25.7222
2016-10-26,24.479
2016-10-27,24.6366
2016-10-28,24.873
2016-10-31,25.1444
2016-11-01,25.0481
2016-11-02,25.1269
2016-11-03,25.0656
2016-11-04,25.0218
2016-11-07,24.8292
2016-11-08,24.8905
2016-11-09,24.9518
2016-11-10,24.4527
2016-11-11,24.4002
2016-11-14,24.5403
2016-11-15,24.5841
2016-11-16,24.5403
2016-11-17,24.908
2016-11-18,24.6804
2016-11-21,24.6453
2016-11-22,24.6979
2016-11-23,24.5841
2016-11-25,24.7329
2016-11-28,25.0656
2016-11-29,25.1706
2016-11-30,25.3107
2016-12-01,25.0743
2016-12-02,25.2757
2016-12-05,25.3895
2016-12-06,25.4771
2016-12-07,26.1162
2016-12-08,26.2125
2016-12-09,26.0812
2016-12-12,25.9323
2016-12-13,25.9586
2016-12-14,25.5208
2016-12-15,25.4683
2016-12-16,25.3545
2016-12-19,25.4858
2016-12-20,25.5033
2016-12-21,25.4333
2016-12-22,25.5121
2016-12-23,25.5121
2016-12-27,25.7913
2016-12-28,25.2088
2016-12-29,24.8952
2016-12-30,25.2178
2017-01-03,25.4687
2017-01-04,25.7196
2017-01-05,25.8899
2017-01-06,25.5942
2017-01-09,25.5852
2017-01-10,25.6659
2017-01-11,25.8361
2017-01-12,25.9616
2017-01-13,26.0154
2017-01-17,25.9795
2017-01-18,25.8361
2017-01-19,25.8541
2017-01-20,25.9168
2017-01-23,26.1229
2017-01-24,26.1319
2017-01-25,26.6517
2017-01-26,26.6696
2017-01-27,26.5889
2017-01-30,26.6606
2017-01-31,26.4993
2017-02-01,26.1767
2017-02-02,26.0154
2017-02-03,25.9885
2017-02-06,25.9347
2017-02-07,25.9975
2017-02-08,26.0512
2017-02-09,25.9526
2017-02-10,25.9078
2017-02-13,26.0512
2017-02-14,26.0871
2017-02-15,26.1408
2017-02-16,26.2573
2017-02-17,26.1946
2017-02-21,26.0602
2017-02-22,26.2753
2017-02-23,26.1946
2017-02-24,26.3738
2017-02-27,26.2842
2017-02-28,26.2036
2017-03-01,26.1767
2017-03-02,26.1408
2017-03-03,26.2036
2017-03-06,26.4545
2017-03-07,26.6517
2017-03-08,26.6785
2017-03-09,26.7323
2017-03-10,27.0101
2017-03-13,27.2073
2017-03-14,27.1266
2017-03-15,27.4761
2017-03-16,27.7987
2017-03-17,27.9332
2017-03-20,27.9242
2017-03-21,27.8794
2017-03-22,28.0228
2017-03-23,28.0048
2017-03-24,28.0407
2017-03-27,28.1034
2017-03-28,28.2199
2017-03-29,28.0586
2017-03-30,28.3633
2017-03-31,28.0228
2017-04-03,28.2558
2017-04-04,28.3454
2017-04-05,28.2378
2017-04-06,28.0497
2017-04-07,28.0676
2017-04-10,27.96
2017-04-11,27.8525
2017-04-12,27.8256
2017-04-13,27.6016
2017-04-17,27.8794
2017-04-18,27.8256
2017-04-19,28.5694
2017-04-20,28.5694
2017-04-21,28.4798
2017-04-24,28.5515
2017-04-25,28.8024
2017-04-26,28.7218
2017-04-27,29.8957
2017-04-28,29.7613
2017-05-01,29.9316
2017-05-02,29.8868
2017-05-03,29.8778
2017-05-04,30.0122
2017-05-05,30.2452
2017-05-08,30.1735
2017-05-09,30.4603
2017-05-10,30.3528
2017-05-11,30.0929
2017-05-12,30.1198
2017-05-15,30.2183
2017-05-16,30.29
2017-05-17,30.2542
2017-05-18,30.5141
2017-05-19,30.4245
2017-05-22,30.4603
2017-05-23,30.3976
2017-05-24,30.4065
2017-05-25,30.5678
2017-05-26,30.6754
2017-05-30,30.7381
2017-05-31,31.2041
2017-06-01,31.473
2017-06-02,31.8583
2017-06-05,31.9031
2017-06-06,32.1003
2017-06-07,31.8404
2017-06-08,31.7866
2017-06-09,31.3744
2017-06-12,31.8493
2017-06-13,31.5626
2017-06-14,31.6701
2017-06-15,31.5715
2017-06-16,31.5805
2017-06-19,31.8225
2017-06-20,31.5895
2017-06-21,31.4102
2017-06-22,31.2668
2017-06-23,31.3027
2017-06-26,31.3117
2017-06-27,31.4903
2017-06-28,31.335
2017-06-29,30.9693
2017-06-30,31.0973
2017-07-03,30.8231
2017-07-05,30.9145
2017-07-06,30.4574
2017-07-07,29.5982
2017-07-10,30.1284
2017-07-11,30.3112
2017-07-12,30.7956
2017-07-13,30.7317
2017-07-14,30.7865
2017-07-17,30.7408
2017-07-18,30.9693
2017-07-19,31.1156
2017-07-20,31.6366
2017-07-21,31.5818
2017-07-24,31.3989
2017-07-25,31.3075
2017-07-26,31.3898
2017-07-27,32.0571
2017-07-28,31.8011
2017-07-31,31.9291
2017-08-01,32.0297
2017-08-02,32.1211
2017-08-03,32.1211
2017-08-04,32.0754
2017-08-07,31.9383
2017-08-08,32.0205
2017-08-09,32.1394
2017-08-10,31.8103
2017-08-11,31.8468
2017-08-14,31.8377
2017-08-15,32.0205
2017-08-16,32.1759
2017-08-17,32.1211
2017-08-18,32.0022
2017-08-21,31.8103
2017-08-22,31.7737
2017-08-23,31.8925
2017-08-24,31.7463
2017-08-25,31.856
2017-08-28,31.8103
2017-08-29,31.9383
2017-08-30,31.8011
2017-08-31,32.0936
2017-09-01,31.8743
2017-09-05,31.6275
2017-09-06,31.9291
2017-09-07,31.7829
2017-09-08,31.5178
2017-09-11,31.5909
2017-09-12,31.4721
2017-09-13,31.4081
2017-09-14,31.4355
2017-09-15,31.6
2017-09-18,31.5361
2017-09-19,31.5178
2017-09-20,31.1887
2017-09-21,30.9145
2017-09-22,30.887
2017-09-25,31.0333
2017-09-26,31.1247
2017-09-27,31.2344
2017-09-28,31.2527
2017-09-29,31.3715
2017-10-02,31.2161
2017-10-03,31.4264
2017-10-04,31.5086
2017-10-05,31.6457
2017-10-06,31.5818
2017-10-09,31.7189
2017-10-10,32.0845
2017-10-11,32.2308
2017-10-12,32.3496
2017-10-13,32.6878
2017-10-16,32.6969
2017-10-17,32.6147
2017-10-18,32.7975
2017-10-19,32.7701
2017-10-20,32.7061
2017-10-23,32.8158
2017-10-24,33.6842
2017-10-25,33.2637
2017-10-26,33.7116
2017-10-27,34.3057
2017-10-30,34.2692
2017-10-31,34.5068
2017-11-01,34.452
2017-11-02,34.4886
2017-11-03,34.5343
2017-11-06,34.4611
2017-11-07,34.909
2017-11-08,35.4301
2017-11-09,35.229
2017-11-10,35.4301
2017-11-13,35.0827
2017-11-14,35.0644
2017-11-15,34.644
2017-11-16,35.1741
2017-11-17,34.9913
2017-11-20,35.0553
2017-11-21,35.1741
2017-11-22,35.2015
2017-11-24,35.4209
2017-11-27,35.4026
2017-11-28,35.5215
2017-11-29,35.0187
2017-11-30,35.0736
2017-12-01,34.6988
2017-12-04,34.5343
2017-12-05,34.6257
2017-12-06,34.7811
2017-12-07,34.9182
2017-12-08,35.0553
2017-12-11,35.1741
2017-12-12,35.3295
2017-12-13,35.3478
2017-12-14,35.1376
2017-12-15,35.1467
2017-12-18,35.3478
2017-12-19,35.1376
2017-12-20,35.037
2017-12-21,35.1558
2017-12-22,35.1558
2017-12-26,36.0211
2017-12-27,35.8458
2017-12-28,35.6458
2017-12-29,35.6172
2018-01-02,35.7886
2018-01-03,36.141
2018-01-04,36.3886
2018-01-05,36.1981
2018-01-08,36.3791
2018-01-09,36.8267
2018-01-10,36.8648
2018-01-11,37.2457
2018-01-12,37.0457
2018-01-16,37.1124
2018-01-17,37.579
2018-01-18,37.16
2018-01-19,37.4552
2018-01-22,37.6838
2018-01-23,37.6266
2018-01-24,37.6171
2018-01-25,37.5028
2018-01-26,37.798
2018-01-29,37.3504
2018-01-30,38.2266
2018-01-31,38.3028
2018-02-01,37.9123
2018-02-02,37.5695
2018-02-05,35.6648
2018-02-06,36.3886
2018-02-07,35.7315
2018-02-08,34.6744
2018-02-09,34.7125
2018-02-12,35.3315
2018-02-13,34.9506
2018-02-14,35.3791
2018-02-15,35.7124
2018-02-16,35.9029
2018-02-20,35.1791
2018-02-21,35.322
2018-02-22,35.1696
2018-02-23,35.7601
2018-02-26,36.2267
2018-02-27,36.36
2018-02-28,36.3029
2018-03-01,35.3125
2018-03-02,35.4077
2018-03-05,35.5791
2018-03-06,35.3696
2018-03-07,35.122
2018-03-08,35.1125
2018-03-09,35.2839
2018-03-12,35.5029
2018-03-13,35.3696
2018-03-14,35.4363
2018-03-15,35.4553
2018-03-16,35.2648
2018-03-19,34.7601
2018-03-20,34.9696
2018-03-21,35.0648
2018-03-22,35.2934
2018-03-23,34.2458
2018-03-26,34.6458
2018-03-27,34.1887
2018-03-28,34.5506
2018-03-29,34.7125
2018-04-02,34.1887
2018-04-03,34.4649
2018-04-04,34.3982
2018-04-05,34.7411
2018-04-06,33.8268
2018-04-09,34.0935
2018-04-10,34.9696
2018-04-11,34.7601
2018-04-12,34.6458
2018-04-13,34.2744
2018-04-16,34.4173
2018-04-17,34.703
2018-04-18,34.5506
2018-04-19,34.2935
2018-04-20,34.322
2018-04-23,34.0078
2018-04-24,33.7982
2018-04-25,32.8364
2018-04-26,33.0364
2018-04-27,32.7888
2018-04-30,32.6745
2018-05-01,32.7602
2018-05-02,32.5602
2018-05-03,32.5507
2018-05-04,32.7983
2018-05-07,33.0554
2018-05-08,33.065
2018-05-09,32.9221
2018-05-10,33.0554
2018-05-11,33.0554
2018-05-14,32.9507
2018-05-15,32.6459
2018-05-16,32.665
2018-05-17,32.5888
2018-05-18,32.6174
2018-05-21,32.6078
2018-05-22,32.5126
2018-05-23,32.6174
2018-05-24,32.4555
2018-05-25,32.7126
2018-05-29,32.4364
2018-05-30,32.5316
2018-05-31,32.4174
2018-06-01,32.3507
2018-06-04,32.6364
2018-06-05,32.4459
2018-06-06,32.4364
2018-06-07,32.3888
2018-06-08,32.484
2018-06-11,32.5983
2018-06-12,32.3221
2018-06-13,32.3031
2018-06-14,32.284
2018-06-15,32.1221
2018-06-18,31.7603
2018-06-19,31.7507
2018-06-20,31.665
2018-06-21,31.446
2018-06-22,31.9222
2018-06-25,31.6745
2018-06-26,31.9888
2018-06-27,31.5897
2018-06-28,31.4826
2018-06-29,31.8135
2018-07-02,31.1226
2018-07-03,30.8306
2018-07-05,30.8501
2018-07-06,30.6554
2018-07-09,31.0155
2018-07-10,31.1226
2018-07-11,30.7235
2018-07-12,30.5192
2018-07-13,30.7625
2018-07-16,30.6165
2018-07-17,30.9474
2018-07-18,30.8501
2018-07-19,30.8403
2018-07-20,30.8793
2018-07-23,31.0252
2018-07-24,30.9182
2018-07-25,31.1615
2018-07-26,30.8598
2018-07-27,31.2101
2018-07-30,31.3464
2018-07-31,31.5216
2018-08-01,31.2004
2018-08-02,31.2491
2018-08-03,31.4242
2018-08-06,30.9863
2018-08-07,31.6091
2018-08-08,31.5605
2018-08-09,31.3853
2018-08-10,31.2199
2018-08-13,30.8403
2018-08-14,31.0836
2018-08-15,30.6165
2018-08-16,30.6749
2018-08-17,30.9766
2018-08-20,30.8793
2018-08-21,30.7041
2018-08-22,30.8111
2018-08-23,30.6846
2018-08-24,30.6749
2018-08-27,31.1128
2018-08-28,31.2296
2018-08-29,31.4048
2018-08-30,31.1517
2018-08-31,31.2296
2018-09-04,30.6068
2018-09-05,30.2564
2018-09-06,30.1786
2018-09-07,29.7796
2018-09-10,29.8185
2018-09-11,29.8671
2018-09-12,29.653
2018-09-13,29.5265
2018-09-14,30.1396
2018-09-17,30.3051
2018-09-18,31.0058
2018-09-19,30.8306
2018-09-20,30.8209
2018-09-21,30.8306
2018-09-24,30.6846
2018-09-25,30.8987
2018-09-26,31.1128
2018-09-27,30.7625
2018-09-28,30.8014
2018-10-01,31.1323
2018-10-02,31.2101
2018-10-03,30.8209
2018-10-04,30.636
2018-10-05,30.6165
2018-10-08,30.7041
2018-10-09,30.4705
2018-10-10,29.8866
2018-10-11,29.7114
2018-10-12,30.0326
2018-10-15,30.1786
2018-10-16,30.7819
2018-10-17,30.6749
2018-10-18,30.6068
2018-10-19,30.6262
2018-10-22,30.5386
2018-10-23,30.1007
2018-10-24,29.5557
2018-10-25,28.3003
2018-10-26,27.6483
2018-10-29,27.2395
2018-10-30,27.9402
2018-10-31,27.4244
2018-11-01,28.1446
2018-11-02,27.9305
2018-11-05,27.8429
2018-11-06,27.9694
2018-11-07,27.9694
2018-11-08,27.8526
2018-11-09,27.9013
2018-11-12,27.7261
2018-11-13,27.6191
2018-11-14,27.8137
2018-11-15,27.658
2018-11-16,27.8234
2018-11-19,27.6872
2018-11-20,27.2395
2018-11-21,27.4244
2018-11-23,27.259
2018-11-26,27.5899
2018-11-27,27.5218
2018-11-28,28.0959
2018-11-29,27.6385
2018-11-30,27.5315
2018-12-03,27.9694
2018-12-04,27.2687
2018-12-06,27.2103
2018-12-07,26.9768
2018-12-10,26.7919
2018-12-11,26.7043
2018-12-12,26.9476
2018-12-13,27.0449
2018-12-14,26.8405
2018-12-17,26.7529
2018-12-18,26.9768
2018-12-19,26.5972
2018-12-20,26.3637
2018-12-21,25.916
2018-12-24,25.7019
2018-12-26,26.1788
2018-12-27,27.12
2018-12-28,27.35
2018-12-31,27.6
2019-01-02,27.54
2019-01-03,27.24
2019-01-04,27.54
2019-01-07,27.88
2019-01-08,27.98
2019-01-09,28.06
2019-01-10,28.17
2019-01-11,28.17
2019-01-14,28.06
2019-01-15,27.92
2019-01-16,28.04
2019-01-17,27.99
2019-01-18,28.17
2019-01-22,27.84
2019-01-23,27.94
2019-01-24,28.2
2019-01-25,28.63
2019-01-28,28.56
2019-01-29,28.52
2019-01-30,28.99
2019-01-31,28.83
2019-02-01,28.88
2019-02-04,28.97
2019-02-05,29.1
2019-02-06,29.15
2019-02-07,28.87
2019-02-08,28.69
2019-02-11,28.76
2019-02-12,28.91
2019-02-13,29
2019-02-14,28.89
2019-02-15,29.29
2019-02-19,29.1
2019-02-20,29.12
2019-02-21,29.03
2019-02-22,29.33
2019-02-25,29.43
2019-02-26,29.55
2019-02-27,29.12
2019-02-28,28.8
2019-03-01,28.51
2019-03-04,28.38
2019-03-05,28.58
2019-03-06,28.65
2019-03-07,28.39
2019-03-08,28.35
2019-03-11,28.66
2019-03-12,28.86
2019-03-13,28.85
2019-03-14,28.6
2019-03-15,28.91
2019-03-18,29
2019-03-19,28.84
2019-03-20,28.83
2019-03-21,29.01
2019-03-22,28.67
2019-03-25,28.53
2019-03-26,29.09
2019-03-27,29.26
2019-03-28,29.24
2019-03-29,29.04
2019-04-01,29.4
2019-04-02,29.29
2019-04-03,29.11
2019-04-04,29.35
2019-04-05,29.42
2019-04-08,29.46
2019-04-09,29.31
2019-04-10,29.14
2019-04-11,28.92
2019-04-12,28.97
2019-04-15,29.02
2019-04-16,29.42
2019-04-17,29.02
2019-04-18,28.74
2019-04-22,28.29
2019-04-23,28.47
2019-04-24,27.79
2019-04-25,27.5
2019-04-26,27.79
2019-04-29,27.7
2019-04-30,27.68
2019-05-01,27.47
2019-05-02,27.49
2019-05-03,27.66
2019-05-06,27.54
2019-05-07,27.46
2019-05-08,27.3
2019-05-09,27.75
2019-05-10,27.71
2019-05-13,27.49
2019-05-14,27.69
2019-05-15,28.05
2019-05-16,28.26
2019-05-17,28.59
2019-05-20,28.72
2019-05-21,29.37
2019-05-22,28.7
2019-05-23,28.74
2019-05-24,28.11
2019-05-28,28.15
2019-05-29,28.01
2019-05-30,28.14
2019-05-31,28.02
2019-06-03,28.19
2019-06-04,28.43
2019-06-05,28.47
2019-06-06,28.67
2019-06-07,28.94
2019-06-10,28.78
2019-06-11,28.98
2019-06-12,28.91
2019-06-13,28.915
2019-06-14,28.85
2019-06-17,28.935
2019-06-18,29.23
2019-06-19,29.425
2019-06-20,29.78
2019-06-21,29.92
2019-06-24,30.01
2019-06-25,29.96
2019-06-26,29.41
2019-06-27,29.405
2019-06-28,29.27
2019-07-01,29.485
2019-07-02,29.64
2019-07-03,29.74
2019-07-04,29.74
2019-07-05,29.485
2019-07-08,29.39
2019-07-09,29.075
2019-07-10,29.495
2019-07-11,29.62
2019-07-12,29.75
2019-07-15,29.715
2019-07-16,29.31
2019-07-17,28.17
2019-07-18,28.43
2019-07-19,28.56
2019-07-22,28.4
2019-07-23,28.835
2019-07-24,28.47
2019-07-25,27.85
2019-07-26,28.11
2019-07-29,27.83
2019-07-30,27.49
2019-07-31,27.09
2019-08-01,27.22
2019-08-02,27.195
2019-08-05,26.56
2019-08-06,26.77
2019-08-07,26.985
2019-08-08,27.025
2019-08-09,26.855
2019-08-12,26.67
2019-08-13,26.285
2019-08-14,25.78
2019-08-15,25.625
2019-08-16,25.91
2019-08-19,25.865
2019-08-20,25.7
2019-08-21,25.735
2019-08-22,25.755
2019-08-23,25.5
2019-08-26,25.59
2019-08-27,25.875
2019-08-28,25.82
2019-08-29,25.88
2019-08-30,25.905
2019-09-02,25.895
2019-09-03,25.91
2019-09-04,25.935
2019-09-05,26.11
2019-09-06,26.12
2019-09-09,26.165
2019-09-10,26.555
2019-09-11,26.93
2019-09-12,27.085
2019-09-13,27.21
2019-09-16,27.135
2019-09-17,27.185
2019-09-18,27.06
2019-09-19,27.13
2019-09-20,26.845
2019-09-23,26.765
2019-09-24,26.325
2019-09-25,26.685
2019-09-26,26.75
2019-09-27,27.025
2019-09-30,26.695
2019-10-01,26.845
2019-10-02,26.955
2019-10-03,26.715
2019-10-04,26.895
2019-10-07,26.455
2019-10-08,26.245
2019-10-09,26.345
2019-10-10,26.305
2019-10-11,26.775
2019-10-14,26.625
2019-10-15,26.87
2019-10-16,26.855
2019-10-17,26.825
2019-10-18,26.475
2019-10-21,27.12
2019-10-22,27.125
2019-10-23,27.305
2019-10-24,27.385
2019-10-25,27.285
2019-10-28,25.915
2019-10-29,26.68
2019-10-30,27.335
2019-10-31,27.055
2019-11-01,27.63
2019-11-04,27.665
2019-11-05,27.55
2019-11-06,27.36
2019-11-07,27.55
2019-11-08,27.6
2019-11-11,27.645
2019-11-12,27.715
2019-11-13,27.815
2019-11-14,27.615
2019-11-15,27.795
2019-11-18,27.82
2019-11-19,27.75
2019-11-20,27.355
2019-11-21,27.475
2019-11-22,27.455
2019-11-25,27.66
