date,close
2014-06-13,20.05
2014-06-16,20.32
2014-06-17,21.11
2014-06-18,20.83
2014-06-19,20.53
2014-06-20,20.42
2014-06-23,20.32
2014-06-24,19.93
2014-06-25,19.72
2014-06-26,20.02
2014-06-27,20.32
2014-06-30,20.17
2014-07-01,20.27
2014-07-02,21.03
2014-07-03,20.76
2014-07-07,20.11
2014-07-08,19.29
2014-07-09,19.15
2014-07-10,18.8
2014-07-11,19.01
2014-07-14,19.46
2014-07-15,19.04
2014-07-16,19.11
2014-07-17,18.95
2014-07-18,19.33
2014-07-21,19.24
2014-07-22,19.66
2014-07-23,19.48
2014-07-24,19.34
2014-07-25,19.31
2014-07-28,19.13
2014-07-29,19.06
2014-07-30,19.29
2014-07-31,18.99
2014-08-01,20.09
2014-08-04,20.55
2014-08-05,20.23
2014-08-06,21.8
2014-08-07,21.8
2014-08-08,21.84
2014-08-11,22.47
2014-08-12,22.54
2014-08-13,23.01
2014-08-14,22.89
2014-08-15,23.52
2014-08-18,24.45
2014-08-19,25.4
2014-08-20,26.29
2014-08-21,26.37
2014-08-22,27.52
2014-08-25,27.17
2014-08-26,28.07
2014-08-27,28.16
2014-08-28,27.27
2014-08-29,28.01
2014-09-02,29.12
2014-09-03,28.39
2014-09-04,28.52
2014-09-05,29.31
2014-09-08,29.39
2014-09-09,28.74
2014-09-10,28.68
2014-09-11,29.72
2014-09-12,29.69
2014-09-15,28.73
2014-09-16,29.3
2014-09-17,29.73
2014-09-18,30.45
2014-09-19,29.33
2014-09-22,27.82
2014-09-23,27.27
2014-09-24,27.86
2014-09-25,26.48
2014-09-26,27.12
2014-09-29,27.62
2014-09-30,26.74
2014-10-01,25.59
2014-10-02,25.77
2014-10-03,26.49
2014-10-06,25.96
2014-10-07,25.13
2014-10-08,25.86
2014-10-09,24.86
2014-10-10,24.06
2014-10-13,22.81
2014-10-14,23.71
2014-10-15,24.49
2014-10-16,25.41
2014-10-17,25.69
2014-10-20,26.13
2014-10-21,26.79
2014-10-22,25.81
2014-10-23,26.53
2014-10-24,26.57
2014-10-27,26.5
2014-10-28,26.83
2014-10-29,26.74
2014-10-30,26.7
2014-10-31,27.38
2014-11-03,27.73
2014-11-04,27.82
2014-11-05,26.54
2014-11-06,33.6
2014-11-07,33.9
2014-11-10,35.8
2014-11-11,36.09
2014-11-12,37.3
2014-11-13,38.96
2014-11-14,38.31
2014-11-17,38.65
2014-11-18,39.32
2014-11-19,37.29
2014-11-20,38.12
2014-11-21,36.62
2014-11-24,37.37
2014-11-25,37.57
2014-11-26,37.14
2014-11-28,36.99
2014-12-01,36.4
2014-12-02,38.825
2014-12-03,39.31
2014-12-04,39.98
2014-12-05,41.82
2014-12-08,39.05
2014-12-09,40.45
2014-12-10,38.82
2014-12-11,40.17
2014-12-12,40.14
2014-12-15,39.82
2014-12-16,41.36
2014-12-17,40.73
2014-12-18,42.02
2014-12-19,42.18
2014-12-22,45.4
2014-12-23,47.16
2014-12-24,47.29
2014-12-26,47.89
2014-12-29,48.38
2014-12-30,47.83
2014-12-31,47.39
2015-01-02,47.95
2015-01-05,46.98
2015-01-06,44.77
2015-01-07,43.83
2015-01-08,45.3
2015-01-09,45.25
2015-01-12,44
2015-01-13,43.78
2015-01-14,43.83
2015-01-15,40.59
2015-01-16,40.07
2015-01-20,39.85
2015-01-21,38.42
2015-01-22,38.77
2015-01-23,38.48
2015-01-26,38.54
2015-01-27,37.95
2015-01-28,36.82
2015-01-29,38.13
2015-01-30,36.11
2015-02-02,36.88
2015-02-03,38.42
2015-02-04,39.46
2015-02-05,37.39
2015-02-06,32.88
2015-02-09,32.29
2015-02-10,34.11
2015-02-11,34.88
2015-02-12,37.33
2015-02-13,37.45
2015-02-17,38.27
2015-02-18,37.61
2015-02-19,37.47
2015-02-20,37.77
2015-02-23,37.84
2015-02-24,38.17
2015-02-25,38.42
2015-02-26,39.14
2015-02-27,37.56
2015-03-02,37.87
2015-03-03,36.34
2015-03-04,36.87
2015-03-05,36.38
2015-03-06,35.24
2015-03-09,34.73
2015-03-10,34.04
2015-03-11,34.48
2015-03-12,33.84
2015-03-13,32.91
2015-03-16,32.83
2015-03-17,34.07
2015-03-18,34.58
2015-03-19,34.46
2015-03-20,34.8
2015-03-23,34.26
2015-03-24,34.8
2015-03-25,32.91
2015-03-26,33.07
2015-03-27,33.46
2015-03-30,32.96
2015-03-31,33.09
2015-04-01,33.01
2015-04-02,33.22
2015-04-06,33.97
2015-04-07,34.71
2015-04-08,35.12
2015-04-09,36.81
2015-04-10,37.58
2015-04-13,37.75
2015-04-14,36.48
2015-04-15,37.93
2015-04-16,39.07
2015-04-17,37.35
2015-04-20,36.79
2015-04-21,36.3
2015-04-22,37.15
2015-04-23,37.78
2015-04-24,37.32
2015-04-27,36.91
2015-04-28,36.74
2015-04-29,36.62
2015-04-30,35.14
2015-05-01,36.08
2015-05-04,37.35
2015-05-05,36.68
2015-05-06,36.27
2015-05-07,36.81
2015-05-08,34
2015-05-11,33.6
2015-05-12,33.46
2015-05-13,33.49
2015-05-14,33.39
2015-05-15,32.94
2015-05-18,33.28
2015-05-19,33.21
2015-05-20,32.21
2015-05-21,31.73
2015-05-22,31.56
2015-05-26,30.82
2015-05-27,29.58
2015-05-28,29.56
2015-05-29,30.56
2015-06-01,30.27
2015-06-02,29.95
2015-06-03,30.43
2015-06-04,29.06
2015-06-05,28.63
2015-06-08,27.32
2015-06-09,27.12
2015-06-10,27.78
2015-06-11,27.38
2015-06-12,27.42
2015-06-15,28.29
2015-06-16,28.09
2015-06-17,27.86
2015-06-18,28.01
2015-06-19,27.3
2015-06-22,27.37
2015-06-23,27.26
2015-06-24,26.46
2015-06-25,26.13
2015-06-26,25.59
2015-06-29,24.44
2015-06-30,24.86
2015-07-01,25.71
2015-07-02,25.88
2015-07-06,24.63
2015-07-07,24.53
2015-07-08,23.51
2015-07-09,23.68
2015-07-10,23.13
2015-07-13,24.73
2015-07-14,25.33
2015-07-15,25.48
2015-07-16,26.1
2015-07-17,25.42
2015-07-20,25.15
2015-07-21,25.76
2015-07-22,24.33
2015-07-23,24.34
2015-07-24,24.33
2015-07-27,23.23
2015-07-28,24.73
2015-07-29,24.49
2015-07-30,24.55
2015-07-31,24.59
2015-08-03,23.94
2015-08-04,24.58
2015-08-05,24.33
2015-08-06,24.41
2015-08-07,22.19
2015-08-10,23.2
2015-08-11,22.6
2015-08-12,24.47
2015-08-13,24.68
2015-08-14,25.73
2015-08-17,24.05
2015-08-18,23.57
2015-08-19,22.73
2015-08-20,21.45
2015-08-21,20.77
2015-08-24,20.38
2015-08-25,20.9
2015-08-26,20.97
2015-08-27,22.7
2015-08-28,22.94
2015-08-31,22.44
2015-09-01,21.46
2015-09-02,22.03
2015-09-03,21.81
2015-09-04,20.9
2015-09-08,21.55
2015-09-09,21.45
2015-09-10,21.98
2015-09-11,21.87
2015-09-14,21.58
2015-09-15,21.96
2015-09-16,22.43
2015-09-17,23.04
2015-09-18,22.79
2015-09-21,22.77
2015-09-22,22.17
2015-09-23,21.72
2015-09-24,20.97
2015-09-25,20.97
2015-09-28,20.69
2015-09-29,20.8
2015-09-30,21.16
2015-10-01,21.54
2015-10-02,21.76
2015-10-05,22.61
2015-10-06,22.5
2015-10-07,23.7
2015-10-08,24.18
2015-10-09,24.17
2015-10-12,23.15
2015-10-13,22.82
2015-10-14,23.04
2015-10-15,24
2015-10-16,23.48
2015-10-19,23.04
2015-10-20,23.62
2015-10-21,22.58
2015-10-22,23.08
2015-10-23,24.48
2015-10-26,25.03
2015-10-27,24.55
2015-10-28,25.29
2015-10-29,25.46
2015-10-30,24.92
2015-11-02,25.41
2015-11-03,25.39
2015-11-04,25.23
2015-11-05,25.08
2015-11-06,19.2
2015-11-09,17.69
2015-11-10,16.73
2015-11-11,15.81
2015-11-12,15.05
2015-11-13,14.21
2015-11-16,16.57
2015-11-17,16.28
2015-11-18,16.3
2015-11-19,16.21
2015-11-20,16.53
2015-11-23,16.63
2015-11-24,17.69
2015-11-25,17.85
2015-11-27,17.48
2015-11-30,17.33
2015-12-01,17.12
2015-12-02,17.05
2015-12-03,17.08
2015-12-04,17.35
2015-12-07,16.91
2015-12-08,16.3
2015-12-09,16.03
2015-12-10,16.16
2015-12-11,15.76
2015-12-14,15.15
2015-12-15,15.45
2015-12-16,16.26
2015-12-17,16.28
2015-12-18,15.68
2015-12-21,15.57
2015-12-22,15.66
2015-12-23,16.53
2015-12-24,16.6
2015-12-28,16.16
2015-12-29,16.43
2015-12-30,15.64
2015-12-31,15.74
2016-01-04,15.84
2016-01-05,15.53
2016-01-06,15.16
2016-01-07,14.22
2016-01-08,14.62
2016-01-11,13.55
2016-01-12,13.82
2016-01-13,13.33
2016-01-14,14.26
2016-01-15,14.01
2016-01-19,13.99
2016-01-20,14.41
2016-01-21,14.43
2016-01-22,14.69
2016-01-25,14.15
2016-01-26,14.95
2016-01-27,14.8
2016-01-28,14.6
2016-01-29,14.94
2016-02-01,14.39
2016-02-02,13.8
2016-02-03,14.16
2016-02-04,14.69
2016-02-05,10.93
2016-02-08,10.26
2016-02-09,10.41
2016-02-10,10.02
2016-02-11,9.95
2016-02-12,10.35
2016-02-16,11.28
2016-02-17,11.95
2016-02-18,11.9
2016-02-19,11.88
2016-02-22,12.18
2016-02-23,11.89
2016-02-24,12.05
2016-02-25,12.28
2016-02-26,12.9
2016-02-29,13.22
2016-03-01,13.44
2016-03-02,13.48
2016-03-03,14.14
2016-03-04,13.9
2016-03-07,14.47
2016-03-08,13.67
2016-03-09,13.75
2016-03-10,13.43
2016-03-11,14.04
2016-03-14,14
2016-03-15,13.37
2016-03-16,14.16
2016-03-17,14.32
2016-03-18,14.15
2016-03-21,13.75
2016-03-22,13.92
2016-03-23,13.25
2016-03-24,13.49
2016-03-28,13.29
2016-03-29,14
2016-03-30,14.5
2016-03-31,14.54
2016-04-01,14.29
2016-04-04,14.01
2016-04-05,14.24
2016-04-06,14.48
2016-04-07,14.3
2016-04-08,14.9
2016-04-11,15.19
2016-04-12,14.92
2016-04-13,15.57
2016-04-14,15.83
2016-04-15,15.53
2016-04-18,15.49
2016-04-19,15.95
2016-04-20,16.09
2016-04-21,15.71
2016-04-22,16.17
2016-04-25,15.97
2016-04-26,16.05
2016-04-27,16.06
2016-04-28,16.11
2016-04-29,16.13
2016-05-02,16.26
2016-05-03,15.33
2016-05-04,14.97
2016-05-05,14.59
2016-05-06,17.78
2016-05-09,17.8
2016-05-10,18.17
2016-05-11,18.38
2016-05-12,18.36
2016-05-13,18.27
2016-05-16,19.18
2016-05-17,19.06
2016-05-18,18.94
2016-05-19,18.86
2016-05-20,19.26
2016-05-23,19.22
2016-05-24,19.7
2016-05-25,19.83
2016-05-26,19.92
2016-05-27,19.89
2016-05-31,19.77
2016-06-01,19.81
2016-06-02,19.84
2016-06-03,19.84
2016-06-06,19.91
2016-06-07,19.84
2016-06-08,20.1
2016-06-09,19.66
2016-06-10,18.66
2016-06-13,18.18
2016-06-14,17.7
2016-06-15,18.24
2016-06-16,17.45
2016-06-17,17.67
2016-06-20,17.41
2016-06-21,17.07
2016-06-22,17.22
2016-06-23,17.57
2016-06-24,16.74
2016-06-27,15.59
2016-06-28,16.33
2016-06-29,16.71
2016-06-30,16.96
2016-07-01,17.12
2016-07-05,16.3
2016-07-06,16.37
2016-07-07,17.06
2016-07-08,17.39
2016-07-11,17.48
2016-07-12,17.49
2016-07-13,17.31
2016-07-14,18.08
2016-07-15,17.44
2016-07-18,17.37
2016-07-19,17.12
2016-07-20,17.36
2016-07-21,17.37
2016-07-22,17.47
2016-07-25,17.61
2016-07-26,17.9
2016-07-27,18
2016-07-28,18.02
2016-07-29,17.77
2016-08-01,17.73
2016-08-02,16.95
2016-08-03,17.13
2016-08-04,17.17
2016-08-05,13.94
2016-08-08,14.4
2016-08-09,14.64
2016-08-10,14.74
2016-08-11,14.5
2016-08-12,14.33
2016-08-15,14.54
2016-08-16,14.5
2016-08-17,14.51
2016-08-18,14.62
2016-08-19,14.55
2016-08-22,14.53
2016-08-23,14.63
2016-08-24,14.37
2016-08-25,14.39
2016-08-26,14.39
2016-08-29,14.26
2016-08-30,14.2
2016-08-31,14.02
2016-09-01,14.12
2016-09-02,14.35
2016-09-06,14.41
2016-09-07,14.49
2016-09-08,14.37
2016-09-09,13.98
2016-09-12,14.2
2016-09-13,14.04
2016-09-14,13.61
2016-09-15,13.98
2016-09-16,13.79
2016-09-19,13.92
2016-09-20,13.83
2016-09-21,14.08
2016-09-22,14.26
2016-09-23,14.15
2016-09-26,13.85
2016-09-27,13.93
2016-09-28,14.05
2016-09-29,14.24
2016-09-30,14.41
2016-10-03,13.93
2016-10-04,14.06
2016-10-05,14.18
2016-10-06,13.99
2016-10-07,13.95
2016-10-10,14.01
2016-10-11,13.6
2016-10-12,13.57
2016-10-13,13.55
2016-10-14,13.56
2016-10-17,13.35
2016-10-18,13.45
2016-10-19,13.6
2016-10-20,13.45
2016-10-21,13.65
2016-10-24,13.9
2016-10-25,13.8
2016-10-26,13.55
2016-10-27,13.5
2016-10-28,13.55
2016-10-31,13.65
2016-11-01,13.25
2016-11-02,12.8
2016-11-03,12.55
2016-11-04,14.4
2016-11-07,14.65
2016-11-08,15.25
2016-11-09,14.8
2016-11-10,15.05
2016-11-11,15.4
2016-11-14,15.25
2016-11-15,15.65
2016-11-16,15.85
2016-11-17,15.5
2016-11-18,15.95
2016-11-21,15.95
2016-11-22,15.8
2016-11-23,15.75
2016-11-25,15.65
2016-11-28,15.1
2016-11-29,15.35
2016-11-30,15.35
2016-12-01,14.85
2016-12-02,15.25
2016-12-05,15.1
2016-12-06,15.45
2016-12-07,15.9
2016-12-08,16.2
2016-12-09,16.3
2016-12-12,16.3
2016-12-13,16.45
2016-12-14,16.25
2016-12-15,16.2
2016-12-16,16.1
2016-12-19,16.3
2016-12-20,16.25
2016-12-21,16.3
2016-12-22,16.4
2016-12-23,16.05
2016-12-27,16.15
2016-12-28,16.2
2016-12-29,16.05
2016-12-30,15.7
2017-01-03,15.8
2017-01-04,16.3
2017-01-05,16.35
2017-01-06,16
2017-01-09,16.25
2017-01-10,16.35
2017-01-11,16.65
2017-01-12,16.5
2017-01-13,16.6
2017-01-17,16.5
2017-01-18,16.2
2017-01-19,15.9
2017-01-20,15.8
2017-01-23,17.2
2017-01-24,17.5
2017-01-25,17.95
2017-01-26,17.8
2017-01-27,17.8
2017-01-30,17.5
2017-01-31,17.55
2017-02-01,17.85
2017-02-02,17.9
2017-02-03,17.85
2017-02-06,18
2017-02-07,18.3
2017-02-08,18.15
2017-02-09,18.65
2017-02-10,24.45
2017-02-13,25.1
2017-02-14,25.25
2017-02-15,25.65
2017-02-16,26.225
2017-02-17,27.8
2017-02-21,27.75
2017-02-22,27.15
2017-02-23,26.6
2017-02-24,27.15
2017-02-27,28.9
2017-02-28,28.25
2017-03-01,29
2017-03-02,29.1
2017-03-03,28.8
2017-03-06,28.55
2017-03-07,28.6
2017-03-08,28.6
2017-03-09,28.75
2017-03-10,27.5
2017-03-13,27.25
2017-03-14,27.55
2017-03-15,28
2017-03-16,28.25
2017-03-17,27.9
2017-03-20,28.05
2017-03-21,28.1
2017-03-22,28.45
2017-03-23,30.05
2017-03-24,29.7
2017-03-27,27.7
2017-03-28,27.5
2017-03-29,27.25
2017-03-30,26.35
2017-03-31,26.55
2017-04-03,26.3
2017-04-04,26.5
2017-04-05,26.5
2017-04-06,26.5
2017-04-07,26.1
2017-04-10,26.1
2017-04-11,26
2017-04-12,25.5
2017-04-13,25
2017-04-17,25.3
2017-04-18,24.95
2017-04-19,25.35
2017-04-20,25.3
2017-04-21,25.05
2017-04-24,25.4
2017-04-25,25.65
2017-04-26,25.2
2017-04-27,25.3
2017-04-28,25.3
2017-05-01,25.35
2017-05-02,25.05
2017-05-03,24.7
2017-05-04,24.8
2017-05-05,28.45
2017-05-08,28.4
2017-05-09,28.15
2017-05-10,28.25
2017-05-11,27.8
2017-05-12,28.1
2017-05-15,28.9
2017-05-16,28.3
2017-05-17,26.3
2017-05-18,26.25
2017-05-19,26.8
2017-05-22,26.95
2017-05-23,26.85
2017-05-24,27
2017-05-25,27.15
2017-05-26,26.75
2017-05-30,27.35
2017-05-31,27.05
2017-06-01,28.85
2017-06-02,28.75
2017-06-05,28.45
2017-06-06,28.4
2017-06-07,28.5
2017-06-08,31.8
2017-06-09,29.6
2017-06-12,28.55
2017-06-13,30.55
2017-06-14,29.5
2017-06-15,29.2
2017-06-16,29.25
2017-06-19,30.1
2017-06-20,29
2017-06-21,28.85
2017-06-22,28.9
2017-06-23,29.15
2017-06-26,29.3
2017-06-27,27.95
2017-06-28,28.95
2017-06-29,28.3
2017-06-30,28.1
2017-07-03,27.7
2017-07-05,28.15
2017-07-06,27.6
2017-07-07,28.3
2017-07-10,28.55
2017-07-11,28.7
2017-07-12,29.4
2017-07-13,29
2017-07-14,29.4
2017-07-17,29.1
2017-07-18,29
2017-07-19,30.8
2017-07-20,30.25
2017-07-21,29.75
2017-07-24,30.9
2017-07-25,31.15
2017-07-26,30.7
2017-07-27,30.2
2017-07-28,29.85
2017-07-31,29.5
2017-08-01,29.65
2017-08-02,29.4
2017-08-03,23.4
2017-08-04,25.2
2017-08-07,24.85
2017-08-08,25.1
2017-08-09,23.65
2017-08-10,22.75
2017-08-11,23
2017-08-14,22.9
2017-08-15,22.55
2017-08-16,22.55
2017-08-17,21.85
2017-08-18,21.75
2017-08-21,21.15
2017-08-22,21.5
2017-08-23,21.7
2017-08-24,21.8
2017-08-25,21.65
2017-08-28,21.55
2017-08-29,21.5
2017-08-30,21.4
2017-08-31,22.15
2017-09-01,21.9
2017-09-05,21.6
2017-09-06,21.65
2017-09-07,21.85
2017-09-08,21.45
2017-09-11,21.95
2017-09-12,22.25
2017-09-13,21.95
2017-09-14,21.75
2017-09-15,22.15
2017-09-18,22.2
2017-09-19,21.9
2017-09-20,21.5
2017-09-21,21.75
2017-09-22,21.7
2017-09-25,21.15
2017-09-26,21.15
2017-09-27,21.45
2017-09-28,21.55
2017-09-29,21.5
2017-10-02,22.7
2017-10-03,22.45
2017-10-04,22.2
2017-10-05,22.7
2017-10-06,22.45
2017-10-09,22.3
2017-10-10,22.55
2017-10-11,22.65
2017-10-12,22.3
2017-10-13,22.4
2017-10-16,22.1
2017-10-17,22.3
2017-10-18,22.15
2017-10-19,21.85
2017-10-20,21.95
2017-10-23,21.85
2017-10-24,22.1
2017-10-25,21.8
2017-10-26,22
2017-10-27,22.2
2017-10-30,22.15
2017-10-31,22.45
2017-11-01,22.35
2017-11-02,23
2017-11-03,21.9
2017-11-06,20.35
2017-11-07,19.6
2017-11-08,19.5
2017-11-09,19.5
2017-11-10,19.65
2017-11-13,19.45
2017-11-14,19.15
2017-11-15,19.1
2017-11-16,19.05
2017-11-17,19.1
2017-11-20,19.45
2017-11-21,20.6
2017-11-22,20.7
2017-11-24,20.75
2017-11-27,23.15
2017-11-28,22.6
2017-11-29,22.1
2017-11-30,22.55
2017-12-01,21.95
2017-12-04,21.55
2017-12-05,21.65
2017-12-06,21.25
2017-12-07,21.6
2017-12-08,21.45
2017-12-11,21.3
2017-12-12,21.15
2017-12-13,20.8
2017-12-14,20.6
2017-12-15,20.5
2017-12-18,20.95
2017-12-19,20.8
2017-12-20,20.65
2017-12-21,20.8
2017-12-22,20.6
2017-12-26,20.4
2017-12-27,20.5
2017-12-28,20.75
2017-12-29,20.45
2018-01-02,21.05
2018-01-03,21.45
2018-01-04,21.3
2018-01-05,21
2018-01-08,20.7
2018-01-09,20.25
2018-01-10,19.55
2018-01-11,20.05
2018-01-12,19.95
2018-01-16,19.65
2018-01-17,19.85
2018-01-18,19.7
2018-01-19,19.9
2018-01-22,19.75
2018-01-23,19.9
2018-01-24,19.8
2018-01-25,19.55
2018-01-26,19.65
2018-01-29,19.5
2018-01-30,19.3
2018-01-31,19.35
2018-02-01,19.55
2018-02-02,18.6
2018-02-05,17.9
2018-02-06,18.65
2018-02-07,18.95
2018-02-08,18.3
2018-02-09,15.75
2018-02-12,16.25
2018-02-13,16.25
2018-02-14,16.2
2018-02-15,16.3
2018-02-16,16.2
2018-02-20,15.95
2018-02-21,16.3
2018-02-22,15.85
2018-02-23,16.05
2018-02-26,16.35
2018-02-27,16.2
2018-02-28,15.95
2018-03-01,15.95
2018-03-02,16.2
2018-03-05,16.4
2018-03-06,16.4
2018-03-07,16.35
2018-03-08,16.55
2018-03-09,16.75
2018-03-12,17.05
2018-03-13,16.95
2018-03-14,16.775
2018-03-15,16.6
2018-03-16,16.5
2018-03-19,16.35
2018-03-20,16.4
2018-03-21,16.5
2018-03-22,16.2
2018-03-23,15.55
2018-03-26,15.8
2018-03-27,16.9
2018-03-28,16.25
2018-03-29,16.5
2018-04-02,16.4
2018-04-03,16.4
2018-04-04,16.35
2018-04-05,16.5
2018-04-06,16.2
2018-04-09,16.25
2018-04-10,16.75
2018-04-11,16.575
2018-04-12,16.8
2018-04-13,16.6
2018-04-16,16.65
2018-04-17,16.95
2018-04-18,17.35
2018-04-19,17.15
2018-04-20,17.1
2018-04-23,17.1
2018-04-24,17.75
2018-04-25,17.5
2018-04-26,17.5
2018-04-27,17.45
2018-04-30,17.35
2018-05-01,17.75
2018-05-02,17.75
2018-05-03,17.85
2018-05-04,17.15
2018-05-07,17.5
2018-05-08,17.65
2018-05-09,17.675
2018-05-10,18.15
2018-05-11,18.05
2018-05-14,18.3
2018-05-15,18
2018-05-16,18.25
2018-05-17,17.95
2018-05-18,17.8
2018-05-21,17.7
2018-05-22,17.55
2018-05-23,17.65
2018-05-24,17.7
2018-05-25,17.85
2018-05-29,17.7
2018-05-30,17.8
2018-05-31,16.4
2018-06-01,16.2
2018-06-04,16.45
2018-06-05,16.6
2018-06-06,16.65
2018-06-07,16.5
2018-06-08,16.35
2018-06-11,16.3
2018-06-12,16.6
2018-06-13,16.35
2018-06-14,16.25
2018-06-15,16.15
2018-06-18,16.05
2018-06-19,16.25
2018-06-20,16.2
2018-06-21,16.275
2018-06-22,16.3
2018-06-25,16
2018-06-26,16.05
2018-06-27,15.9
2018-06-28,15.95
2018-06-29,16
2018-07-02,16.15
2018-07-03,15.9
2018-07-05,15.9
2018-07-06,16.05
2018-07-09,16.1
2018-07-10,16.2
2018-07-11,16.25
2018-07-12,16.55
2018-07-13,16.6
2018-07-16,16.95
2018-07-17,16.9
2018-07-18,17
2018-07-19,16.7
2018-07-20,16.9
2018-07-23,16.55
2018-07-24,16.5
2018-07-25,16.5
2018-07-26,16.6
2018-07-27,16.65
2018-07-30,16.1
2018-07-31,16.25
2018-08-01,15.7
2018-08-02,16.2
2018-08-03,19.3
2018-08-06,19.45
2018-08-07,19.4
2018-08-08,19.55
2018-08-09,19.75
2018-08-10,19.4
2018-08-13,19.8
2018-08-14,19.4
2018-08-15,19
2018-08-16,19.15
2018-08-17,19.3
2018-08-20,19.275
2018-08-21,19.4
2018-08-22,19.4
2018-08-23,19.1
2018-08-24,19.2
2018-08-27,19.4
2018-08-28,19.3
2018-08-29,19.175
2018-08-30,19
2018-08-31,18.85
2018-09-04,18.45
2018-09-05,18.4
2018-09-06,18.85
2018-09-07,19.65
2018-09-10,19.8
2018-09-11,21.4
2018-09-12,21.3
2018-09-13,21.55
2018-09-14,21.65
2018-09-17,21.45
2018-09-18,21.45
2018-09-19,21.35
2018-09-20,21.25
2018-09-21,21
2018-09-24,20.75
2018-09-25,20.5
2018-09-26,20.15
2018-09-27,20.05
2018-09-28,20.1
2018-10-01,19.72
2018-10-02,19.32
2018-10-03,19.84
2018-10-04,19.37
2018-10-05,19.07
2018-10-08,18.66
2018-10-09,18.62
2018-10-10,18.04
2018-10-11,18.03
2018-10-12,18.29
2018-10-15,18.34
2018-10-16,18.86
2018-10-17,18.76
2018-10-18,18.55
2018-10-19,18.22
2018-10-22,18.59
2018-10-23,18.64
2018-10-24,18.33
2018-10-25,17.87
2018-10-26,17.62
2018-10-29,17.34
2018-10-30,17.57
2018-10-31,17.97
2018-11-01,18.5
2018-11-02,18.3
2018-11-05,18.46
2018-11-06,19
2018-11-07,19.76
2018-11-08,19.72
2018-11-09,16.02
2018-11-12,15.925
2018-11-13,16.2
2018-11-14,16.14
2018-11-15,16.42
2018-11-16,16.43
2018-11-19,16.01
2018-11-20,15.83
2018-11-21,16.04
2018-11-23,16.05
2018-11-26,16.09
2018-11-27,15.99
2018-11-28,16.11
2018-11-29,16.08
2018-11-30,16.06
2018-12-03,16.53
2018-12-04,16.01
2018-12-06,15.97
2018-12-07,15.59
2018-12-10,15.37
2018-12-11,15.03
2018-12-12,15
2018-12-13,14.26
2018-12-14,13.85
2018-12-17,13.36
2018-12-18,13.48
2018-12-19,13.47
2018-12-20,13.4
2018-12-21,13.14
2018-12-24,13.07
2018-12-26,13.22
2018-12-27,13.65
2018-12-28,13.6
2018-12-31,13.43
2019-01-02,13.82
2019-01-03,13.58
2019-01-04,14.06
2019-01-07,14.24
2019-01-08,14.15
2019-01-09,14.37
2019-01-10,14.74
2019-01-11,15.15
2019-01-14,14.78
2019-01-15,14.93
2019-01-16,14.99
2019-01-17,15.17
2019-01-18,15.18
2019-01-22,14.47
2019-01-23,14.72
2019-01-24,14.93
2019-01-25,15.11
2019-01-28,14.84
2019-01-29,14.75
2019-01-30,15.11
2019-01-31,15.54
2019-02-01,15.16
2019-02-04,15.35
2019-02-05,15.53
2019-02-06,15.38
2019-02-07,15.22
2019-02-08,15.25
2019-02-11,15.61
2019-02-12,15.69
2019-02-13,15.5
2019-02-14,11.33
2019-02-15,12.5
2019-02-19,12.53
2019-02-20,12.63
2019-02-21,12.62
2019-02-22,12.98
2019-02-25,12.83
2019-02-26,12.86
2019-02-27,12.84
2019-02-28,12.58
2019-03-01,12.58
2019-03-04,12.81
2019-03-05,12.68
2019-03-06,12.64
2019-03-07,12.58
2019-03-08,12.61
2019-03-11,12.8
2019-03-12,12.79
2019-03-13,12.77
2019-03-14,12.76
2019-03-15,12.72
2019-03-18,12.65
2019-03-19,12.67
2019-03-20,12.6
2019-03-21,12.69
2019-03-22,12.28
2019-03-25,12.33
2019-03-26,12.34
2019-03-27,12.24
2019-03-28,12.18
2019-03-29,12.37
2019-04-01,12.36
2019-04-02,12.49
2019-04-03,12.61
2019-04-04,12.56
2019-04-05,12.54
2019-04-08,12.57
2019-04-09,12.56
2019-04-10,12.66
2019-04-11,12.55
2019-04-12,12.71
2019-04-15,12.54
2019-04-16,12.61
2019-04-17,12.69
2019-04-18,12.64
2019-04-22,12.88
2019-04-23,12.82
2019-04-24,12.81
2019-04-25,13.17
2019-04-26,13.53
2019-04-29,13.3
2019-04-30,13.4
2019-05-01,13.33
2019-05-02,13.16
2019-05-03,13.38
2019-05-06,13.25
2019-05-07,13.17
2019-05-08,13.26
2019-05-09,13.07
2019-05-10,14.15
2019-05-13,13.16
2019-05-14,13.31
2019-05-15,13.31
2019-05-16,13.39
2019-05-17,13.23
2019-05-20,13.16
2019-05-21,13.22
2019-05-22,13.05
2019-05-23,12.61
2019-05-24,12.74
2019-05-28,12.89
2019-05-29,12.27
2019-05-30,12.35
2019-05-31,12.05
2019-06-03,11.94
2019-06-04,12.26
2019-06-05,12.32
2019-06-06,12.22
2019-06-07,12.43
2019-06-10,12.46
2019-06-11,12.33
2019-06-12,12.04
2019-06-13,12.07
2019-06-14,11.905
2019-06-17,11.59
2019-06-18,11.87
2019-06-19,11.95
2019-06-20,11.96
2019-06-21,11.905
2019-06-24,11.86
2019-06-25,11.65
2019-06-26,11.64
2019-06-27,11.73
2019-06-28,12.09
2019-07-01,12.22
2019-07-02,12.16
2019-07-03,12.24
2019-07-04,12.24
2019-07-05,12.09
2019-07-08,11.88
2019-07-09,11.86
2019-07-10,11.76
2019-07-11,11.77
2019-07-12,11.79
2019-07-15,11.66
2019-07-16,11.82
2019-07-17,11.96
2019-07-18,11.86
2019-07-19,11.765
2019-07-22,11.94
2019-07-23,11.95
2019-07-24,11.985
2019-07-25,11.725
2019-07-26,11.96
2019-07-29,11.95
2019-07-30,11.93
2019-07-31,11.78
2019-08-01,11.975
2019-08-02,12.09
2019-08-05,11.63
2019-08-06,11.675
2019-08-07,11.68
2019-08-08,11.88
2019-08-09,11.81
2019-08-12,11.595
2019-08-13,11.55
2019-08-14,10.92
2019-08-15,10.61
2019-08-16,10.87
2019-08-19,11.31
2019-08-20,11.2
2019-08-21,11.41
2019-08-22,11.21
2019-08-23,10.69
2019-08-26,10.49
2019-08-27,10.22
2019-08-28,10.105
2019-08-29,10.68
2019-08-30,10.79
2019-09-02,10.79
2019-09-03,10.805
2019-09-04,10.515
2019-09-05,10.795
2019-09-06,10.73
2019-09-09,10.76
2019-09-10,11.3
2019-09-11,11.5
2019-09-12,11.475
2019-09-13,11.295
2019-09-16,11.39
2019-09-17,11.205
2019-09-18,11.115
2019-09-19,11.325
2019-09-20,11.31
2019-09-23,11.13
2019-09-24,10.87
2019-09-25,11
2019-09-26,10.89
2019-09-27,10.735
2019-09-30,10.695
2019-10-01,10.375
2019-10-02,10.195
2019-10-03,10.31
2019-10-04,10.36
2019-10-07,10.52
2019-10-08,10.335
2019-10-09,10.5
2019-10-10,10.58
2019-10-11,10.67
2019-10-14,10.59
2019-10-15,10.575
2019-10-16,10.635
2019-10-17,11.235
2019-10-18,11.14
2019-10-21,11.06
2019-10-22,11.045
2019-10-23,11.015
2019-10-24,10.875
2019-10-25,10.985
2019-10-28,11.05
2019-10-29,11.135
2019-10-30,10.98
2019-10-31,11.03
2019-11-01,11.385
2019-11-04,11.715
2019-11-05,11.31
2019-11-06,8.925
2019-11-07,8.775
2019-11-08,8.475
2019-11-11,8.165
2019-11-12,8.015
2019-11-13,8.01
2019-11-14,7.735
2019-11-15,8.03
2019-11-18,8.105
2019-11-19,8.53
2019-11-20,8.6
2019-11-21,8.6
2019-11-22,8.915
2019-11-25,8.785
