date,close
2014-06-13,5.4659
2014-06-16,5.4888
2014-06-17,5.4888
2014-06-18,5.4888
2014-06-19,5.506
2014-06-20,5.4716
2014-06-23,5.4544
2014-06-24,5.4831
2014-06-25,5.5288
2014-06-26,5.5117
2014-06-27,5.5288
2014-06-30,5.5517
2014-07-01,5.5725
2014-07-02,5.509
2014-07-03,5.5148
2014-07-07,5.4975
2014-07-08,5.5264
2014-07-09,5.5321
2014-07-10,5.5379
2014-07-11,5.561
2014-07-14,5.584
2014-07-15,5.5667
2014-07-16,5.5898
2014-07-17,5.5494
2014-07-18,5.5956
2014-07-21,5.5725
2014-07-22,5.5956
2014-07-23,5.6244
2014-07-24,5.636
2014-07-25,5.6158
2014-07-28,5.5956
2014-07-29,5.6302
2014-07-30,5.6302
2014-07-31,5.509
2014-08-01,5.4369
2014-08-04,5.4369
2014-08-05,5.3962
2014-08-06,5.3265
2014-08-07,5.3614
2014-08-08,5.3788
2014-08-11,5.4486
2014-08-12,5.4486
2014-08-13,5.5358
2014-08-14,5.5184
2014-08-15,5.4835
2014-08-18,5.5067
2014-08-19,5.5765
2014-08-20,5.6172
2014-08-21,5.6114
2014-08-22,5.6114
2014-08-25,5.6463
2014-08-26,5.6695
2014-08-27,5.687
2014-08-28,5.6695
2014-08-29,5.6754
2014-09-02,5.6261
2014-09-03,5.6261
2014-09-04,5.632
2014-09-05,5.6085
2014-09-08,5.5792
2014-09-09,5.5792
2014-09-10,5.5734
2014-09-11,5.5617
2014-09-12,5.5382
2014-09-15,5.5324
2014-09-16,5.5851
2014-09-17,5.591
2014-09-18,5.6261
2014-09-19,5.6379
2014-09-22,5.5968
2014-09-23,5.5734
2014-09-24,5.6085
2014-09-25,5.5675
2014-09-26,5.5968
2014-09-29,5.5968
2014-09-30,5.4913
2014-10-01,5.4358
2014-10-02,5.3944
2014-10-03,5.4358
2014-10-06,5.4122
2014-10-07,5.4122
2014-10-08,5.4299
2014-10-09,5.359
2014-10-10,5.2526
2014-10-13,5.0636
2014-10-14,5.0695
2014-10-15,4.9513
2014-10-16,5.0754
2014-10-17,5.1699
2014-10-20,5.1995
2014-10-21,5.3413
2014-10-22,5.3294
2014-10-23,5.359
2014-10-24,5.3767
2014-10-27,5.4122
2014-10-28,5.4594
2014-10-29,5.4831
2014-10-30,5.3675
2014-10-31,5.4831
2014-11-03,5.5045
2014-11-04,5.4509
2014-11-05,5.4449
2014-11-06,5.4866
2014-11-07,5.439
2014-11-10,5.3854
2014-11-11,5.433
2014-11-12,5.433
2014-11-13,5.3675
2014-11-14,5.3556
2014-11-17,5.3139
2014-11-18,5.3615
2014-11-19,5.3735
2014-11-20,5.3973
2014-11-21,5.433
2014-11-24,5.4211
2014-11-25,5.433
2014-11-26,5.4628
2014-11-28,5.4628
2014-12-01,5.3703
2014-12-02,5.4003
2014-12-03,5.4124
2014-12-04,5.3703
2014-12-05,5.3403
2014-12-08,5.3283
2014-12-09,5.2742
2014-12-10,5.2021
2014-12-11,5.2141
2014-12-12,5.1
2014-12-15,5.0219
2014-12-16,4.9498
2014-12-17,5.0339
2014-12-18,5.148
2014-12-19,5.142
2014-12-22,5.13
2014-12-23,5.136
2014-12-24,5.148
2014-12-26,5.148
2014-12-29,5.1214
2014-12-30,5.0911
2014-12-31,5.0426
2015-01-02,5.0486
2015-01-05,4.9699
2015-01-06,4.9396
2015-01-07,4.9638
2015-01-08,5.0426
2015-01-09,5.0365
2015-01-12,4.988
2015-01-13,4.9577
2015-01-14,4.8911
2015-01-15,4.8971
2015-01-16,4.9577
2015-01-20,4.988
2015-01-21,5.0062
2015-01-22,5.0547
2015-01-23,5.0608
2015-01-26,5.0244
2015-01-27,4.9941
2015-01-28,4.9396
2015-01-29,4.9699
2015-01-30,4.9335
2015-02-02,4.98
2015-02-03,5.0351
2015-02-04,5.0167
2015-02-05,5.0595
2015-02-06,5.0412
2015-02-09,4.9983
2015-02-10,5.0412
2015-02-11,5.0412
2015-02-12,5.1023
2015-02-13,5.1329
2015-02-17,5.1085
2015-02-18,5.1207
2015-02-19,5.1268
2015-02-20,5.1574
2015-02-23,5.1696
2015-02-24,5.1941
2015-02-25,5.2063
2015-02-26,5.1941
2015-02-27,5.2186
2015-03-02,5.2285
2015-03-03,5.2038
2015-03-04,5.1914
2015-03-05,5.2099
2015-03-06,5.1606
2015-03-09,5.1667
2015-03-10,5.0988
2015-03-11,5.0865
2015-03-12,5.1112
2015-03-13,5.0618
2015-03-16,5.0927
2015-03-17,5.0865
2015-03-18,5.1482
2015-03-19,5.1482
2015-03-20,5.1606
2015-03-23,5.1544
2015-03-24,5.1729
2015-03-25,5.1544
2015-03-26,5.1667
2015-03-27,5.1606
2015-03-30,5.1667
2015-03-31,5.1359
2015-04-01,5.1334
2015-04-02,5.1458
2015-04-06,5.1645
2015-04-07,5.177
2015-04-08,5.2144
2015-04-09,5.2206
2015-04-10,5.2144
2015-04-13,5.177
2015-04-14,5.2019
2015-04-15,5.2393
2015-04-16,5.258
2015-04-17,5.2331
2015-04-20,5.258
2015-04-21,5.2517
2015-04-22,5.2954
2015-04-23,5.3016
2015-04-24,5.3265
2015-04-27,5.3327
2015-04-28,5.3577
2015-04-29,5.3639
2015-04-30,5.3327
2015-05-01,5.3428
2015-05-04,5.3302
2015-05-05,5.3114
2015-05-06,5.2485
2015-05-07,5.2674
2015-05-08,5.3051
2015-05-11,5.2737
2015-05-12,5.2862
2015-05-13,5.2925
2015-05-14,5.3617
2015-05-15,5.3428
2015-05-18,5.3679
2015-05-19,5.3679
2015-05-20,5.3868
2015-05-21,5.3994
2015-05-22,5.3805
2015-05-26,5.3365
2015-05-27,5.3679
2015-05-28,5.3491
2015-05-29,5.3177
2015-06-01,5.3215
2015-06-02,5.3278
2015-06-03,5.3215
2015-06-04,5.2961
2015-06-05,5.2961
2015-06-08,5.2707
2015-06-09,5.2644
2015-06-10,5.3024
2015-06-11,5.3215
2015-06-12,5.2897
2015-06-15,5.2897
2015-06-16,5.3088
2015-06-17,5.3024
2015-06-18,5.3151
2015-06-19,5.2961
2015-06-22,5.3151
2015-06-23,5.3341
2015-06-24,5.3215
2015-06-25,5.2961
2015-06-26,5.2961
2015-06-29,5.1946
2015-06-30,5.1819
2015-07-01,5.2114
2015-07-02,5.1858
2015-07-06,5.1537
2015-07-07,5.1473
2015-07-08,5.0641
2015-07-09,5.0769
2015-07-10,5.1409
2015-07-13,5.1794
2015-07-14,5.205
2015-07-15,5.1986
2015-07-16,5.2178
2015-07-17,5.2178
2015-07-20,5.1986
2015-07-21,5.1858
2015-07-22,5.1473
2015-07-23,5.1473
2015-07-24,5.0769
2015-07-27,5.0513
2015-07-28,5.0897
2015-07-29,5.1537
2015-07-30,5.1537
2015-07-31,5.173
2015-08-03,5.1381
2015-08-04,5.1187
2015-08-05,5.151
2015-08-06,5.1122
2015-08-07,5.0734
2015-08-10,5.1187
2015-08-11,5.0928
2015-08-12,5.0993
2015-08-13,5.067
2015-08-14,5.0993
2015-08-17,5.0799
2015-08-18,5.0605
2015-08-19,5.0153
2015-08-20,4.9248
2015-08-21,4.802
2015-08-24,4.5435
2015-08-25,4.5693
2015-08-26,4.6533
2015-08-27,4.7374
2015-08-28,4.6986
2015-08-31,4.6339
2015-09-01,4.6248
2015-09-02,4.664
2015-09-03,4.6771
2015-09-04,4.6248
2015-09-08,4.6967
2015-09-09,4.6901
2015-09-10,4.6967
2015-09-11,4.6836
2015-09-14,4.6771
2015-09-15,4.7032
2015-09-16,4.7816
2015-09-17,4.7881
2015-09-18,4.7489
2015-09-21,4.7163
2015-09-22,4.6705
2015-09-23,4.6379
2015-09-24,4.6575
2015-09-25,4.6313
2015-09-28,4.5595
2015-09-29,4.4876
2015-09-30,4.5399
2015-10-01,4.5438
2015-10-02,4.5967
2015-10-05,4.709
2015-10-06,4.7882
2015-10-07,4.841
2015-10-08,4.9005
2015-10-09,4.8939
2015-10-12,4.9269
2015-10-13,4.8741
2015-10-14,4.8675
2015-10-15,4.9401
2015-10-16,4.9797
2015-10-19,5.0128
2015-10-20,5.0061
2015-10-21,4.9863
2015-10-22,5.0392
2015-10-23,5.0788
2015-10-26,5.0458
2015-10-27,4.9665
2015-10-28,5.0061
2015-10-29,4.9599
2015-10-30,4.9995
2015-11-02,5.0236
2015-11-03,5.0502
2015-11-04,5.0769
2015-11-05,5.0502
2015-11-06,5.0302
2015-11-09,4.9302
2015-11-10,4.9302
2015-11-11,4.9569
2015-11-12,4.8901
2015-11-13,4.8368
2015-11-16,4.8434
2015-11-17,4.8701
2015-11-18,4.9035
2015-11-19,4.9168
2015-11-20,4.9102
2015-11-23,4.8968
2015-11-24,4.8968
2015-11-25,4.8701
2015-11-27,4.8768
2015-11-30,4.8501
2015-12-01,4.9081
2015-12-02,4.8609
2015-12-03,4.8204
2015-12-04,4.8474
2015-12-07,4.7935
2015-12-08,4.753
2015-12-09,4.7328
2015-12-10,4.7395
2015-12-11,4.6317
2015-12-14,4.6114
2015-12-15,4.6586
2015-12-16,4.7395
2015-12-17,4.7261
2015-12-18,4.6924
2015-12-21,4.6924
2015-12-22,4.7395
2015-12-23,4.8407
2015-12-24,4.8542
2015-12-28,4.8137
2015-12-29,4.8519
2015-12-30,4.8246
2015-12-31,4.7701
2016-01-04,4.7565
2016-01-05,4.7565
2016-01-06,4.7224
2016-01-07,4.5929
2016-01-08,4.5111
2016-01-11,4.4294
2016-01-12,4.4226
2016-01-13,4.334
2016-01-14,4.4089
2016-01-15,4.2999
2016-01-19,4.2658
2016-01-20,4.1364
2016-01-21,4.1977
2016-01-22,4.2999
2016-01-25,4.2522
2016-01-26,4.334
2016-01-27,4.334
2016-01-28,4.3885
2016-01-29,4.4634
2016-02-01,4.4814
2016-02-02,4.4055
2016-02-03,4.4055
2016-02-04,4.44
2016-02-05,4.3642
2016-02-08,4.2607
2016-02-09,4.2401
2016-02-10,4.2125
2016-02-11,4.1642
2016-02-12,4.2194
2016-02-16,4.2814
2016-02-17,4.4262
2016-02-18,4.4193
2016-02-19,4.3917
2016-02-22,4.4814
2016-02-23,4.4193
2016-02-24,4.4124
2016-02-25,4.4676
2016-02-26,4.4952
2016-02-29,4.4883
2016-03-01,4.5971
2016-03-02,4.6041
2016-03-03,4.6389
2016-03-04,4.6668
2016-03-07,4.7226
2016-03-08,4.7226
2016-03-09,4.7296
2016-03-10,4.7436
2016-03-11,4.7785
2016-03-14,4.7785
2016-03-15,4.7854
2016-03-16,4.8343
2016-03-17,4.8482
2016-03-18,4.897
2016-03-21,4.8901
2016-03-22,4.8622
2016-03-23,4.8203
2016-03-24,4.7226
2016-03-28,4.7226
2016-03-29,4.8133
2016-03-30,4.8761
2016-03-31,4.9465
2016-04-01,4.8872
2016-04-04,4.8237
2016-04-05,4.7603
2016-04-06,4.7673
2016-04-07,4.718
2016-04-08,4.7321
2016-04-11,4.7603
2016-04-12,4.8379
2016-04-13,4.8802
2016-04-14,4.9013
2016-04-15,4.8943
2016-04-18,4.9436
2016-04-19,4.9436
2016-04-20,4.9789
2016-04-21,4.9718
2016-04-22,4.9789
2016-04-25,4.9859
2016-04-26,5.0353
2016-04-27,5.0917
2016-04-28,5.0494
2016-04-29,5.0494
2016-05-02,5.0181
2016-05-03,4.9682
2016-05-04,4.9254
2016-05-05,4.8541
2016-05-06,4.8755
2016-05-09,4.8399
2016-05-10,4.9325
2016-05-11,4.9254
2016-05-12,4.9111
2016-05-13,4.8826
2016-05-16,4.9183
2016-05-17,4.9111
2016-05-18,4.904
2016-05-19,4.8898
2016-05-20,4.8898
2016-05-23,4.904
2016-05-24,4.9183
2016-05-25,4.9753
2016-05-26,5.0038
2016-05-27,4.9895
2016-05-31,4.9688
2016-06-01,4.9803
2016-06-02,4.9803
2016-06-03,5.0163
2016-06-06,5.0163
2016-06-07,5.0452
2016-06-08,5.0596
2016-06-09,5.0668
2016-06-10,4.9875
2016-06-13,4.9443
2016-06-14,4.8361
2016-06-15,4.8361
2016-06-16,4.8289
2016-06-17,4.8866
2016-06-20,4.9443
2016-06-21,5.0091
2016-06-22,5.0091
2016-06-23,5.0452
2016-06-24,4.9443
2016-06-27,4.692
2016-06-28,4.8361
2016-06-29,4.9371
2016-06-30,4.9953
2016-07-01,4.9705
2016-07-05,4.9341
2016-07-06,4.9195
2016-07-07,4.8977
2016-07-08,4.9122
2016-07-11,4.9268
2016-07-12,4.9778
2016-07-13,5.0361
2016-07-14,5.1236
2016-07-15,5.0872
2016-07-18,5.109
2016-07-19,5.109
2016-07-20,5.1455
2016-07-21,5.1236
2016-07-22,5.1819
2016-07-25,5.1746
2016-07-26,5.2256
2016-07-27,5.2548
2016-07-28,5.2839
2016-07-29,5.335
2016-08-01,5.2952
2016-08-02,5.2068
2016-08-03,5.1847
2016-08-04,5.17
2016-08-05,5.1921
2016-08-08,5.1994
2016-08-09,5.2289
2016-08-10,5.2657
2016-08-11,5.2436
2016-08-12,5.2215
2016-08-15,5.2436
2016-08-16,5.2805
2016-08-17,5.2657
2016-08-18,5.2805
2016-08-19,5.3099
2016-08-22,5.3394
2016-08-23,5.3762
2016-08-24,5.3467
2016-08-25,5.3173
2016-08-26,5.3246
2016-08-29,5.3541
2016-08-30,5.3615
2016-08-31,5.3547
2016-09-01,5.3592
2016-09-02,5.3815
2016-09-06,5.3964
2016-09-07,5.4038
2016-09-08,5.4262
2016-09-09,5.3592
2016-09-12,5.3889
2016-09-13,5.2996
2016-09-14,5.2773
2016-09-15,5.3071
2016-09-16,5.3071
2016-09-19,5.2847
2016-09-20,5.2922
2016-09-21,5.3517
2016-09-22,5.4187
2016-09-23,5.4113
2016-09-26,5.3666
2016-09-27,5.3889
2016-09-28,5.4113
2016-09-29,5.3666
2016-09-30,5.4038
2016-10-03,5.3933
2016-10-04,5.3707
2016-10-05,5.3782
2016-10-06,5.4083
2016-10-07,5.3858
2016-10-10,5.3858
2016-10-11,5.3632
2016-10-12,5.3406
2016-10-13,5.288
2016-10-14,5.2805
2016-10-17,5.1902
2016-10-18,5.3106
2016-10-19,5.3406
2016-10-20,5.3331
2016-10-21,5.3256
2016-10-24,5.3331
2016-10-25,5.3557
2016-10-26,5.3557
2016-10-27,5.3482
2016-10-28,5.3181
2016-10-31,5.3106
2016-11-01,5.2543
2016-11-02,5.1706
2016-11-03,5.1326
2016-11-04,5.087
2016-11-07,5.163
2016-11-08,5.2087
2016-11-09,5.2087
2016-11-10,5.2619
2016-11-11,5.2239
2016-11-14,5.1174
2016-11-15,5.2543
2016-11-16,5.2543
2016-11-17,5.2999
2016-11-18,5.2619
2016-11-21,5.2695
2016-11-22,5.3303
2016-11-23,5.3303
2016-11-25,5.3531
2016-11-28,5.3455
2016-11-29,5.3227
2016-11-30,5.2087
2016-12-01,5.1979
2016-12-02,5.221
2016-12-05,5.2363
2016-12-06,5.2979
2016-12-07,5.3671
2016-12-08,5.3747
2016-12-09,5.3978
2016-12-12,5.3824
2016-12-13,5.4363
2016-12-14,5.3901
2016-12-15,5.3978
2016-12-16,5.3978
2016-12-19,5.3363
2016-12-20,5.3286
2016-12-21,5.344
2016-12-22,5.3363
2016-12-23,5.2979
2016-12-27,5.3055
2016-12-28,5.2598
2016-12-29,5.252
2016-12-30,5.2598
2017-01-03,5.2753
2017-01-04,5.3296
2017-01-05,5.3684
2017-01-06,5.3994
2017-01-09,5.3761
2017-01-10,5.3839
2017-01-11,5.4072
2017-01-12,5.3839
2017-01-13,5.3839
2017-01-17,5.3994
2017-01-18,5.3917
2017-01-19,5.3606
2017-01-20,5.4304
2017-01-23,5.4227
2017-01-24,5.446
2017-01-25,5.4847
2017-01-26,5.4925
2017-01-27,5.4847
2017-01-30,5.4925
2017-01-31,5.477
2017-02-01,5.5013
2017-02-02,5.4856
2017-02-03,5.5091
2017-02-06,5.5091
2017-02-07,5.5091
2017-02-08,5.5326
2017-02-09,5.5482
2017-02-10,5.5717
2017-02-13,5.5873
2017-02-14,5.6186
2017-02-15,5.6578
2017-02-16,5.6578
2017-02-17,5.6499
2017-02-21,5.6186
2017-02-22,5.6578
2017-02-23,5.6578
2017-02-24,5.6656
2017-02-27,5.6812
2017-02-28,5.7047
2017-03-01,5.7213
2017-03-02,5.6266
2017-03-03,5.6739
2017-03-06,5.666
2017-03-07,5.6266
2017-03-08,5.595
2017-03-09,5.5792
2017-03-10,5.6582
2017-03-13,5.6739
2017-03-14,5.6187
2017-03-15,5.6818
2017-03-16,5.7055
2017-03-17,5.7134
2017-03-20,5.6818
2017-03-21,5.6818
2017-03-22,5.6818
2017-03-23,5.7134
2017-03-24,5.7213
2017-03-27,5.7213
2017-03-28,5.7607
2017-03-29,5.7844
2017-03-30,5.7844
2017-03-31,5.7923
2017-04-03,5.7374
2017-04-04,5.7533
2017-04-05,5.7613
2017-04-06,5.8011
2017-04-07,5.7851
2017-04-10,5.809
2017-04-11,5.8249
2017-04-12,5.7931
2017-04-13,5.809
2017-04-17,5.7931
2017-04-18,5.7931
2017-04-19,5.7772
2017-04-20,5.809
2017-04-21,5.8011
2017-04-24,5.8568
2017-04-25,5.9363
2017-04-26,5.9204
2017-04-27,5.9363
2017-04-28,5.9682
2017-05-01,5.977
2017-05-02,5.9369
2017-05-03,5.9369
2017-05-04,5.9208
2017-05-05,5.9449
2017-05-08,5.961
2017-05-09,5.961
2017-05-10,5.961
2017-05-11,5.9369
2017-05-12,5.9048
2017-05-15,5.9369
2017-05-16,5.969
2017-05-17,5.8807
2017-05-18,5.8887
2017-05-19,5.993
2017-05-22,6.0412
2017-05-23,6.0492
2017-05-24,6.0733
2017-05-25,6.1375
2017-05-26,6.1134
2017-05-30,6.0733
2017-05-31,6.0813
2017-06-01,6.0497
2017-06-02,6.0255
2017-06-05,6.0336
2017-06-06,6.0012
2017-06-07,6.0174
2017-06-08,6.0174
2017-06-09,6.0174
2017-06-12,6.0174
2017-06-13,6.0497
2017-06-14,6.074
2017-06-15,6.0255
2017-06-16,6.074
2017-06-19,6.1144
2017-06-20,6.0821
2017-06-21,6.0497
2017-06-22,6.0012
2017-06-23,6.0578
2017-06-26,6.1225
2017-06-27,6.1144
2017-06-28,6.1306
2017-06-29,6.0902
2017-06-30,6.1144
2017-07-03,6.156
2017-07-05,6.1316
2017-07-06,6.1071
2017-07-07,6.1479
2017-07-10,6.1397
2017-07-11,6.1234
2017-07-12,6.1805
2017-07-13,6.205
2017-07-14,6.205
2017-07-17,6.1723
2017-07-18,6.1805
2017-07-19,6.2213
2017-07-20,6.2131
2017-07-21,6.2213
2017-07-24,6.2376
2017-07-25,6.311
2017-07-26,6.3191
2017-07-27,6.2783
2017-07-28,6.311
2017-07-31,6.3028
2017-08-01,6.3036
2017-08-02,6.3283
2017-08-03,6.279
2017-08-04,6.3036
2017-08-07,6.3283
2017-08-08,6.3529
2017-08-09,6.3036
2017-08-10,6.1228
2017-08-11,6.1639
2017-08-14,6.2132
2017-08-15,6.205
2017-08-16,6.2707
2017-08-17,6.1803
2017-08-18,6.1886
2017-08-21,6.1803
2017-08-22,6.2297
2017-08-23,6.3036
2017-08-24,6.3365
2017-08-25,6.4187
2017-08-28,6.4105
2017-08-29,6.394
2017-08-30,6.4516
2017-08-31,6.4433
2017-09-01,6.469
2017-09-05,6.4193
2017-09-06,6.4442
2017-09-07,6.4607
2017-09-08,6.4276
2017-09-11,6.4607
2017-09-12,6.527
2017-09-13,6.5104
2017-09-14,6.5684
2017-09-15,6.5601
2017-09-18,6.5601
2017-09-19,6.6015
2017-09-20,6.6512
2017-09-21,6.6678
2017-09-22,6.6678
2017-09-25,6.643
2017-09-26,6.6595
2017-09-27,6.7009
2017-09-28,6.6678
2017-09-29,6.7175
2017-10-02,6.7175
2017-10-03,6.7267
2017-10-04,6.71
2017-10-05,6.7016
2017-10-06,6.685
2017-10-09,6.7016
2017-10-10,6.6683
2017-10-11,6.6683
2017-10-12,6.7016
2017-10-13,6.7267
2017-10-16,6.735
2017-10-17,6.7183
2017-10-18,6.735
2017-10-19,6.735
2017-10-20,6.7684
2017-10-23,6.7851
2017-10-24,6.7851
2017-10-25,6.7267
2017-10-26,6.71
2017-10-27,6.7183
2017-10-30,6.7267
2017-10-31,6.7434
2017-11-01,6.7526
2017-11-02,6.7274
2017-11-03,6.7274
2017-11-06,6.6938
2017-11-07,6.6938
2017-11-08,6.6938
2017-11-09,6.6517
2017-11-10,6.6181
2017-11-13,6.5592
2017-11-14,6.4499
2017-11-15,6.4993
2017-11-16,6.5088
2017-11-17,6.5172
2017-11-20,6.5676
2017-11-21,6.6013
2017-11-22,6.6181
2017-11-24,6.6265
2017-11-27,6.6265
2017-11-28,6.6349
2017-11-29,6.6433
2017-11-30,6.6517
2017-12-01,6.6787
2017-12-04,6.6787
2017-12-05,6.6445
2017-12-06,6.6274
2017-12-07,6.5932
2017-12-08,6.5762
2017-12-11,6.6616
2017-12-12,6.6957
2017-12-13,6.7128
2017-12-14,6.7641
2017-12-15,6.7214
2017-12-18,6.6957
2017-12-19,6.7214
2017-12-20,6.7128
2017-12-21,6.7128
2017-12-22,6.7555
2017-12-26,6.6872
2017-12-27,6.6957
2017-12-28,6.688
2017-12-29,6.6708
2018-01-02,6.7138
2018-01-03,6.7224
2018-01-04,6.7913
2018-01-05,6.7999
2018-01-08,6.8085
2018-01-09,6.8257
2018-01-10,6.8343
2018-01-11,6.8774
2018-01-12,6.886
2018-01-16,6.886
2018-01-17,6.8774
2018-01-18,6.8429
2018-01-19,6.886
2018-01-22,6.929
2018-01-23,6.9634
2018-01-24,6.9893
2018-01-25,6.972
2018-01-26,6.9548
2018-01-29,6.9548
2018-01-30,6.8171
2018-01-31,6.8085
2018-02-01,6.7833
2018-02-02,6.6272
2018-02-05,6.3236
2018-02-06,6.4711
2018-02-07,6.5231
2018-02-08,6.3496
2018-02-09,6.3583
2018-02-12,6.4277
2018-02-13,6.4537
2018-02-14,6.5578
2018-02-15,6.6272
2018-02-16,6.6532
2018-02-20,6.5405
2018-02-21,6.5578
2018-02-22,6.5405
2018-02-23,6.6012
2018-02-26,6.6359
2018-02-27,6.6099
2018-02-28,6.5578
2018-03-01,6.4188
2018-03-02,6.445
2018-03-05,6.48
2018-03-06,6.4975
2018-03-07,6.48
2018-03-08,6.5324
2018-03-09,6.5587
2018-03-12,6.5762
2018-03-13,6.5324
2018-03-14,6.4712
2018-03-15,6.4975
2018-03-16,6.4712
2018-03-19,6.4537
2018-03-20,6.445
2018-03-21,6.4275
2018-03-22,6.3575
2018-03-23,6.2351
2018-03-26,6.2876
2018-03-27,6.2701
2018-03-28,6.3226
2018-03-29,6.3838
2018-04-02,6.2788
2018-04-03,6.2788
2018-04-04,6.3229
2018-04-05,6.367
2018-04-06,6.2788
2018-04-09,6.2877
2018-04-10,6.3758
2018-04-11,6.3758
2018-04-12,6.4023
2018-04-13,6.4023
2018-04-16,6.4464
2018-04-17,6.4729
2018-04-18,6.4729
2018-04-19,6.464
2018-04-20,6.4199
2018-04-23,6.4288
2018-04-24,6.4376
2018-04-25,6.4552
2018-04-26,6.4993
2018-04-27,6.4993
2018-04-30,6.5081
2018-05-01,6.4557
2018-05-02,6.4379
2018-05-03,6.3845
2018-05-04,6.429
2018-05-07,6.429
2018-05-08,6.4201
2018-05-09,6.4379
2018-05-10,6.5001
2018-05-11,6.509
2018-05-14,6.5179
2018-05-15,6.5357
2018-05-16,6.509
2018-05-17,6.4734
2018-05-18,6.4646
2018-05-21,6.5001
2018-05-22,6.5179
2018-05-23,6.509
2018-05-24,6.5446
2018-05-25,6.5001
2018-05-29,6.4023
2018-05-30,6.4734
2018-05-31,6.4379
2018-06-01,6.4836
2018-06-04,6.4477
2018-06-05,6.4836
2018-06-06,6.5195
2018-06-07,6.5285
2018-06-08,6.5195
2018-06-11,6.5374
2018-06-12,6.6092
2018-06-13,6.5733
2018-06-14,6.5374
2018-06-15,6.5643
2018-06-18,6.5643
2018-06-19,6.5374
2018-06-20,6.5464
2018-06-21,6.5643
2018-06-22,6.5912
2018-06-25,6.5643
2018-06-26,6.5643
2018-06-27,6.5464
2018-06-28,6.5643
2018-06-29,6.5912
2018-07-02,6.5831
2018-07-03,6.5921
2018-07-05,6.6012
2018-07-06,6.6373
2018-07-09,6.6373
2018-07-10,6.6554
2018-07-11,6.6464
2018-07-12,6.6464
2018-07-13,6.6464
2018-07-16,6.6464
2018-07-17,6.7097
2018-07-18,6.7278
2018-07-19,6.7459
2018-07-20,6.773
2018-07-23,6.8001
2018-07-24,6.8363
2018-07-25,6.8544
2018-07-26,6.8815
2018-07-27,6.8905
2018-07-30,6.9629
2018-07-31,6.9629
2018-08-01,6.9547
2018-08-02,6.9273
2018-08-03,6.8271
2018-08-06,6.8271
2018-08-07,6.818
2018-08-08,6.8453
2018-08-09,6.8726
2018-08-10,6.8088
2018-08-13,6.7724
2018-08-14,6.7541
2018-08-15,6.7359
2018-08-16,6.7541
2018-08-17,6.8544
2018-08-20,6.8635
2018-08-21,6.8635
2018-08-22,6.8818
2018-08-23,6.8544
2018-08-24,6.8818
2018-08-27,6.7359
2018-08-28,6.7541
2018-08-29,6.7815
2018-08-30,6.7724
2018-08-31,6.7633
2018-09-04,6.709
2018-09-05,6.6998
2018-09-06,6.5988
2018-09-07,6.5988
2018-09-10,6.5896
2018-09-11,6.6171
2018-09-12,6.6079
2018-09-13,6.6723
2018-09-14,6.6355
2018-09-17,6.6263
2018-09-18,6.6723
2018-09-19,6.6723
2018-09-20,6.755
2018-09-21,6.8101
2018-09-24,6.7918
2018-09-25,6.8009
2018-09-26,6.7182
2018-09-27,6.755
2018-09-28,6.7274
2018-10-01,6.7283
2018-10-02,6.7376
2018-10-03,6.7005
2018-10-04,6.5801
2018-10-05,6.5152
2018-10-08,6.5245
2018-10-09,6.5152
2018-10-10,6.3298
2018-10-11,6.2094
2018-10-12,6.2742
2018-10-15,6.302
2018-10-16,6.3947
2018-10-17,6.3762
2018-10-18,6.3391
2018-10-19,6.3669
2018-10-22,6.3298
2018-10-23,6.2372
2018-10-24,6.1167
2018-10-25,6.1259
2018-10-26,6.0703
2018-10-29,6.024
2018-10-30,6.0333
2018-10-31,6.1074
2018-11-01,6.1551
2018-11-02,6.1177
2018-11-05,6.127
2018-11-06,6.2112
2018-11-07,6.3048
2018-11-08,6.2767
2018-11-09,6.258
2018-11-12,6.1551
2018-11-13,6.1551
2018-11-14,6.127
2018-11-15,6.1083
2018-11-16,6.099
2018-11-19,6.0616
2018-11-20,6.0054
2018-11-21,6.0242
2018-11-23,6.043
2018-11-26,6.1177
2018-11-27,6.127
2018-11-28,6.2674
2018-11-29,6.2674
2018-11-30,6.2393
2018-12-03,6.2969
2018-12-04,6.1836
2018-12-06,6.042
2018-12-07,5.9948
2018-12-10,5.9004
2018-12-11,5.8909
2018-12-12,5.8815
2018-12-13,5.8815
2018-12-14,5.8437
2018-12-17,5.6644
2018-12-18,5.6644
2018-12-19,5.6266
2018-12-20,5.4378
2018-12-21,5.3528
2018-12-24,5.2679
2018-12-26,5.5039
2018-12-27,5.5039
2018-12-28,5.5621
2018-12-31,5.5907
2019-01-02,5.667
2019-01-03,5.6098
2019-01-04,5.7243
2019-01-07,5.8006
2019-01-08,5.8578
2019-01-09,5.9055
2019-01-10,5.9055
2019-01-11,5.9151
2019-01-14,5.8769
2019-01-15,5.9437
2019-01-16,6.0009
2019-01-17,6.0391
2019-01-18,6.1536
2019-01-22,6.0295
2019-01-23,6.0963
2019-01-24,6.0582
2019-01-25,6.0773
2019-01-28,6.0963
2019-01-29,6.125
2019-01-30,6.1917
2019-01-31,6.2394
2019-02-01,6.1537
2019-02-04,6.1634
2019-02-05,6.173
2019-02-06,6.1537
2019-02-07,6.1056
2019-02-08,6.1056
2019-02-11,6.1345
2019-02-12,6.1922
2019-02-13,6.1922
2019-02-14,6.1922
2019-02-15,6.2211
2019-02-19,6.25
2019-02-20,6.2886
2019-02-21,6.2789
2019-02-22,6.2789
2019-02-25,6.2886
2019-02-26,6.3078
2019-02-27,6.3271
2019-02-28,6.3174
2019-03-01,6.299
2019-03-04,6.299
2019-03-05,6.299
2019-03-06,6.2601
2019-03-07,6.2115
2019-03-08,6.1143
2019-03-11,6.192
2019-03-12,6.2018
2019-03-13,6.2407
2019-03-14,6.299
2019-03-15,6.3184
2019-03-18,6.3281
2019-03-19,6.367
2019-03-20,6.3184
2019-03-21,6.3184
2019-03-22,6.2698
2019-03-25,6.2601
2019-03-26,6.2698
2019-03-27,6.2504
2019-03-28,6.2893
2019-03-29,6.3184
2019-04-01,6.339
2019-04-02,6.3194
2019-04-03,6.2998
2019-04-04,6.3096
2019-04-05,6.3096
2019-04-08,6.3292
2019-04-09,6.339
2019-04-10,6.3685
2019-04-11,6.4175
2019-04-12,6.3685
2019-04-15,6.3979
2019-04-16,6.4372
2019-04-17,6.4764
2019-04-18,6.4568
2019-04-22,6.4666
2019-04-23,6.496
2019-04-24,6.4764
2019-04-25,6.4862
2019-04-26,6.5157
2019-04-29,6.5353
2019-04-30,6.5549
2019-05-01,6.5955
2019-05-02,6.5262
2019-05-03,6.5559
2019-05-06,6.5658
2019-05-07,6.4965
2019-05-08,6.4866
2019-05-09,6.4272
2019-05-10,6.4371
2019-05-13,6.3479
2019-05-14,6.4272
2019-05-15,6.4173
2019-05-16,6.4866
2019-05-17,6.4767
2019-05-20,6.447
2019-05-21,6.4965
2019-05-22,6.4569
2019-05-23,6.3677
2019-05-24,6.3974
2019-05-28,6.3776
2019-05-29,6.3281
2019-05-30,6.3281
2019-05-31,6.239
2019-06-03,6.21
2019-06-04,6.29
2019-06-05,6.28
2019-06-06,6.29
2019-06-07,6.34
2019-06-10,6.35
2019-06-11,6.37
2019-06-12,6.37
2019-06-13,6.36
2019-06-14,6.365
2019-06-17,6.415
2019-06-18,6.48
2019-06-19,6.385
2019-06-20,6.43
2019-06-21,6.44
2019-06-24,6.42
2019-06-25,6.39
2019-06-26,6.46
2019-06-27,6.485
2019-06-28,6.49
2019-07-01,6.425
2019-07-02,6.43
2019-07-03,6.455
2019-07-04,6.455
2019-07-05,6.435
2019-07-08,6.4
2019-07-09,6.445
2019-07-10,6.47
2019-07-11,6.485
2019-07-12,6.485
2019-07-15,6.545
2019-07-16,6.625
2019-07-17,6.605
2019-07-18,6.65
2019-07-19,6.675
2019-07-22,6.645
2019-07-23,6.66
2019-07-24,6.655
2019-07-25,6.645
2019-07-26,6.625
2019-07-29,6.665
2019-07-30,6.68
2019-07-31,6.675
2019-08-01,6.565
2019-08-02,6.545
2019-08-05,6.38
2019-08-06,6.455
2019-08-07,6.39
2019-08-08,6.475
2019-08-09,6.42
2019-08-12,6.395
2019-08-13,6.44
2019-08-14,6.37
2019-08-15,6.34
2019-08-16,6.345
2019-08-19,6.41
2019-08-20,6.435
2019-08-21,6.395
2019-08-22,6.46
2019-08-23,6.355
2019-08-26,6.32
2019-08-27,6.295
2019-08-28,6.305
2019-08-29,6.345
2019-08-30,6.375
2019-09-02,6.375
2019-09-03,6.265
2019-09-04,6.3
2019-09-05,6.335
2019-09-06,6.315
2019-09-09,6.315
2019-09-10,6.355
2019-09-11,6.385
2019-09-12,6.345
2019-09-13,6.355
2019-09-16,6.35
2019-09-17,6.36
2019-09-18,6.355
2019-09-19,6.4
2019-09-20,6.41
2019-09-23,6.35
2019-09-24,5.995
2019-09-25,5.925
2019-09-26,6.005
2019-09-27,5.99
2019-09-30,6.025
2019-10-01,5.915
2019-10-02,5.875
2019-10-03,5.915
2019-10-04,5.965
2019-10-07,5.99
2019-10-08,6.025
2019-10-09,6.045
2019-10-10,6.045
2019-10-11,6.075
2019-10-14,6.01
2019-10-15,6.065
2019-10-16,6.035
2019-10-17,6.015
2019-10-18,5.96
2019-10-21,6.025
2019-10-22,6.045
2019-10-23,6.075
2019-10-24,6.065
2019-10-25,6.065
2019-10-28,6.065
2019-10-29,6.095
2019-10-30,6.105
2019-10-31,6.105
2019-11-01,6.085
2019-11-04,6.095
2019-11-05,6.085
2019-11-06,6.085
2019-11-07,6.09
2019-11-08,6.065
2019-11-11,6.055
2019-11-12,6.075
2019-11-13,6.08
2019-11-14,6.095
2019-11-15,6.105
2019-11-18,6.095
2019-11-19,6.085
2019-11-20,6.075
2019-11-21,6.105
2019-11-22,6.115
2019-11-25,6.125
