date,close
2014-06-13,20.4204
2014-06-16,20.3694
2014-06-17,20.6967
2014-06-18,20.871
2014-06-19,20.8285
2014-06-20,20.8455
2014-06-23,20.7265
2014-06-24,20.4459
2014-06-25,20.769
2014-06-26,20.6415
2014-06-27,20.769
2014-06-30,20.99
2014-07-01,21.1005
2014-07-02,20.837
2014-07-03,21.16
2014-07-07,20.8795
2014-07-08,20.599
2014-07-09,20.5649
2014-07-10,20.4204
2014-07-11,20.2844
2014-07-14,20.2334
2014-07-15,20.4289
2014-07-16,20.0464
2014-07-17,19.5788
2014-07-18,19.8253
2014-07-21,19.6978
2014-07-22,19.6468
2014-07-23,19.9443
2014-07-24,19.9869
2014-07-25,19.8508
2014-07-28,19.6723
2014-07-29,19.6808
2014-07-30,19.7998
2014-07-31,19.5788
2014-08-01,19.2727
2014-08-04,19.3492
2014-08-05,19.3833
2014-08-06,19.5278
2014-08-07,19.4428
2014-08-08,19.5788
2014-08-11,19.6978
2014-08-12,19.617
2014-08-13,19.7786
2014-08-14,19.9528
2014-08-15,19.8423
2014-08-18,20.2079
2014-08-19,20.1909
2014-08-20,20.1994
2014-08-21,20.3354
2014-08-22,20.2759
2014-08-25,20.3269
2014-08-26,20.5437
2014-08-27,20.5308
2014-08-28,20.3248
2014-08-29,20.372
2014-09-02,20.5394
2014-09-03,20.5222
2014-09-04,20.5222
2014-09-05,20.5523
2014-09-08,20.7025
2014-09-09,20.5222
2014-09-10,20.8227
2014-09-11,20.9085
2014-09-12,20.9771
2014-09-15,20.7197
2014-09-16,20.548
2014-09-17,20.5995
2014-09-18,21.0286
2014-09-19,20.8055
2014-09-22,20.5823
2014-09-23,20.2991
2014-09-24,20.3077
2014-09-25,20.0588
2014-09-26,20.136
2014-09-29,19.9858
2014-09-30,19.7712
2014-10-01,19.5566
2014-10-02,19.7068
2014-10-03,20.0115
2014-10-06,19.8013
2014-10-07,19.5137
2014-10-08,19.93
2014-10-09,19.5094
2014-10-10,19.5266
2014-10-13,19.7154
2014-10-14,20.0073
2014-10-15,19.621
2014-10-16,20.1103
2014-10-17,19.8957
2014-10-20,19.9128
2014-10-21,20.3248
2014-10-22,20.033
2014-10-23,20.1403
2014-10-24,20.1789
2014-10-27,20.3506
2014-10-28,20.9771
2014-10-29,20.857
2014-10-30,20.5995
2014-10-31,20.8827
2014-11-03,20.9085
2014-11-04,20.857
2014-11-05,20.8827
2014-11-06,21.0716
2014-11-07,21.063
2014-11-10,21.2132
2014-11-11,21.1231
2014-11-12,21.3376
2014-11-13,21.0887
2014-11-14,20.8999
2014-11-17,20.7712
2014-11-18,20.8184
2014-11-19,20.651
2014-11-20,20.8227
2014-11-21,20.548
2014-11-24,20.857
2014-11-25,20.8227
2014-11-26,20.7967
2014-11-28,20.2248
2014-12-01,20.0255
2014-12-02,20.2681
2014-12-03,20.4847
2014-12-04,20.4154
2014-12-05,20.6667
2014-12-08,20.5974
2014-12-09,20.9353
2014-12-10,20.2681
2014-12-11,20.4327
2014-12-12,20.2507
2014-12-15,19.9475
2014-12-16,20.1034
2014-12-17,20.6407
2014-12-18,20.97
2014-12-19,21.3339
2014-12-22,21.2386
2014-12-23,21.4032
2014-12-24,21.2646
2014-12-26,21.3339
2014-12-29,21.6025
2014-12-30,21.4985
2014-12-31,21.2646
2015-01-02,21.0393
2015-01-05,20.4674
2015-01-06,19.9821
2015-01-07,20.1034
2015-01-08,20.3981
2015-01-09,19.7482
2015-01-12,19.6528
2015-01-13,19.6615
2015-01-14,19.3062
2015-01-15,19.0723
2015-01-16,19.4709
2015-01-20,19.3062
2015-01-21,19.3062
2015-01-22,20.2421
2015-01-23,19.8348
2015-01-26,20.0168
2015-01-27,19.6788
2015-01-28,18.561
2015-01-29,18.7517
2015-01-30,18.509
2015-02-02,19.0463
2015-02-03,19.3669
2015-02-04,18.9943
2015-02-05,19.4362
2015-02-06,19.6875
2015-02-09,19.4882
2015-02-10,19.6875
2015-02-11,19.5835
2015-02-12,20.0558
2015-02-13,20.2681
2015-02-17,20.502
2015-02-18,20.0688
2015-02-19,19.9995
2015-02-20,20.2161
2015-02-23,20.0948
2015-02-24,20.2681
2015-02-25,20.2593
2015-02-26,20.3556
2015-02-27,20.1718
2015-03-02,20.5306
2015-03-03,20.5044
2015-03-04,20.3993
2015-03-05,20.5481
2015-03-06,20.6706
2015-03-09,20.8807
2015-03-10,20.5656
2015-03-11,20.8894
2015-03-12,21.5283
2015-03-13,21.3532
2015-03-16,21.117
2015-03-17,21.152
2015-03-18,20.9157
2015-03-19,21.0032
2015-03-20,21.4758
2015-03-23,21.3357
2015-03-24,21.1782
2015-03-25,20.7932
2015-03-26,20.9507
2015-03-27,20.8544
2015-03-30,21.2657
2015-03-31,21.2482
2015-04-01,21.0294
2015-04-02,21.257
2015-04-06,21.257
2015-04-07,21.2482
2015-04-08,21.2482
2015-04-09,21.2045
2015-04-10,21.2307
2015-04-13,21.222
2015-04-14,21.0207
2015-04-15,21.3095
2015-04-16,21.187
2015-04-17,20.7494
2015-04-20,21.0294
2015-04-21,20.9157
2015-04-22,21.0907
2015-04-23,21.0207
2015-04-24,20.7056
2015-04-27,20.6181
2015-04-28,20.9857
2015-04-29,21.0207
2015-04-30,20.8282
2015-05-01,20.6269
2015-05-04,20.9507
2015-05-05,20.8282
2015-05-06,21.0557
2015-05-07,20.8982
2015-05-08,21.0032
2015-05-11,21.0819
2015-05-12,21.2307
2015-05-13,21.2745
2015-05-14,21.292
2015-05-15,20.9594
2015-05-18,21.3095
2015-05-19,21.5633
2015-05-20,21.4232
2015-05-21,21.397
2015-05-22,21.2832
2015-05-26,21.117
2015-05-27,21.3007
2015-05-28,21.3272
2015-05-29,21.071
2015-06-01,21.1329
2015-06-02,21.2477
2015-06-03,21.6895
2015-06-04,21.4156
2015-06-05,21.9015
2015-06-08,21.875
2015-06-09,22.034
2015-06-10,22.3256
2015-06-11,22.4051
2015-06-12,22.277
2015-06-15,22.2726
2015-06-16,22.3874
2015-06-17,21.8661
2015-06-18,22.1489
2015-06-19,22.0428
2015-06-22,22.2637
2015-06-23,22.5464
2015-06-24,22.2902
2015-06-25,22.2902
2015-06-26,22.5288
2015-06-29,21.9987
2015-06-30,22.0694
2015-07-01,22.2814
2015-07-02,21.8396
2015-07-06,21.981
2015-07-07,21.5923
2015-07-08,21.5304
2015-07-09,21.7601
2015-07-10,22.0605
2015-07-13,22.14
2015-07-14,22.1047
2015-07-15,22.2107
2015-07-16,22.2107
2015-07-17,21.875
2015-07-20,21.8927
2015-07-21,21.7336
2015-07-22,21.9898
2015-07-23,21.5834
2015-07-24,21.3096
2015-07-27,21.177
2015-07-28,21.1947
2015-07-29,21.1859
2015-07-30,21.2565
2015-07-31,21.2389
2015-08-03,21.3537
2015-08-04,21.5393
2015-08-05,21.6364
2015-08-06,21.4686
2015-08-07,21.2565
2015-08-10,21.6718
2015-08-11,21.3361
2015-08-12,20.8943
2015-08-13,20.965
2015-08-14,21.2389
2015-08-17,21.2742
2015-08-18,21.2212
2015-08-19,20.912
2015-08-20,20.5321
2015-08-21,20.3996
2015-08-24,19.6221
2015-08-25,19.3924
2015-08-26,19.9843
2015-08-27,20.3289
2015-08-28,20.3467
2015-08-31,20.552
2015-09-01,19.7935
2015-09-02,20.0166
2015-09-03,20.1326
2015-09-04,20.079
2015-09-08,20.5163
2015-09-09,20.4806
2015-09-10,20.6145
2015-09-11,20.5698
2015-09-14,20.5966
2015-09-15,20.8554
2015-09-16,20.8733
2015-09-17,20.3646
2015-09-18,20.0701
2015-09-21,20.4003
2015-09-22,20.2486
2015-09-23,20.3111
2015-09-24,20.4181
2015-09-25,20.5609
2015-09-28,20.3467
2015-09-29,20.4628
2015-09-30,20.6769
2015-10-01,20.6234
2015-10-02,20.195
2015-10-05,20.7305
2015-10-06,20.5877
2015-10-07,21.025
2015-10-08,21.257
2015-10-09,21.0428
2015-10-12,21.3552
2015-10-13,21.3284
2015-10-14,20.7483
2015-10-15,21.257
2015-10-16,21.2927
2015-10-19,21.373
2015-10-20,21.6407
2015-10-21,21.3284
2015-10-22,21.489
2015-10-23,21.9084
2015-10-26,21.7121
2015-10-27,21.5515
2015-10-28,22.194
2015-10-29,22.0155
2015-10-30,21.4444
2015-11-02,22.0423
2015-11-03,22.1672
2015-11-04,22.2208
2015-11-05,22.5867
2015-11-06,23.1266
2015-11-09,22.8455
2015-11-10,22.8722
2015-11-11,22.5064
2015-11-12,21.9977
2015-11-13,21.9441
2015-11-16,22.1672
2015-11-17,22.1226
2015-11-18,22.3636
2015-11-19,22.2654
2015-11-20,22.3814
2015-11-23,22.4974
2015-11-24,22.6045
2015-11-25,22.6402
2015-11-27,22.7123
2015-11-30,22.7393
2015-12-01,22.7573
2015-12-02,22.28
2015-12-03,22.0278
2015-12-04,22.298
2015-12-07,21.7847
2015-12-08,21.2984
2015-12-09,21.2083
2015-12-10,21.2083
2015-12-11,20.8211
2015-12-14,20.9111
2015-12-15,21.4155
2015-12-16,21.5325
2015-12-17,21.2263
2015-12-18,20.632
2015-12-21,20.9742
2015-12-22,21.0102
2015-12-23,21.0913
2015-12-24,21.1813
2015-12-28,21.1543
2015-12-29,21.4335
2015-12-30,21.1093
2015-12-31,20.749
2016-01-04,20.3798
2016-01-05,20.4068
2016-01-06,20.1006
2016-01-07,19.6053
2016-01-08,19.2721
2016-01-11,19.3622
2016-01-12,19.4072
2016-01-13,18.7228
2016-01-14,18.8218
2016-01-15,18.6057
2016-01-19,18.4886
2016-01-20,18.3896
2016-01-21,18.1374
2016-01-22,18.6957
2016-01-25,17.9483
2016-01-26,18.5066
2016-01-27,18.7678
2016-01-28,19.137
2016-01-29,19.4882
2016-02-01,19.3622
2016-02-02,18.8398
2016-02-03,19.038
2016-02-04,19.2721
2016-02-05,19.0109
2016-02-08,19.2811
2016-02-09,19.5243
2016-02-10,19.1911
2016-02-11,18.8578
2016-02-12,19.3532
2016-02-16,19.9475
2016-02-17,19.8485
2016-02-18,20.0016
2016-02-19,20.1006
2016-02-22,20.2447
2016-02-23,19.8124
2016-02-24,19.9025
2016-02-25,19.9836
2016-02-26,20.3658
2016-02-29,19.9108
2016-03-01,20.6115
2016-03-02,20.8572
2016-03-03,21.2394
2016-03-04,21.4032
2016-03-07,21.3667
2016-03-08,20.8753
2016-03-09,20.7298
2016-03-10,20.9118
2016-03-11,21.2849
2016-03-14,21.112
2016-03-15,20.8481
2016-03-16,20.5933
2016-03-17,20.9391
2016-03-18,21.2666
2016-03-21,21.2303
2016-03-22,21.0574
2016-03-23,20.7662
2016-03-24,20.748
2016-03-28,20.7115
2016-03-29,21.0028
2016-03-30,21.0756
2016-03-31,20.9573
2016-04-01,20.9482
2016-04-04,20.7843
2016-04-05,20.3476
2016-04-06,20.4932
2016-04-07,20.0746
2016-04-08,20.2293
2016-04-11,20.4295
2016-04-12,20.8663
2016-04-13,21.5032
2016-04-14,21.5305
2016-04-15,21.576
2016-04-18,21.6579
2016-04-19,21.9673
2016-04-20,22.1402
2016-04-21,22.0311
2016-04-22,22.2221
2016-04-25,22.0401
2016-04-26,22.2312
2016-04-27,22.1675
2016-04-28,22.304
2016-04-29,22.304
2016-05-02,22.3677
2016-05-03,21.9491
2016-05-04,21.7035
2016-05-05,21.5851
2016-05-06,21.6852
2016-05-09,21.6397
2016-05-10,21.94
2016-05-11,21.9036
2016-05-12,21.9218
2016-05-13,21.5851
2016-05-16,21.9036
2016-05-17,21.5396
2016-05-18,22.2585
2016-05-19,21.9855
2016-05-20,22.3131
2016-05-23,22.2403
2016-05-24,22.668
2016-05-25,22.7499
2016-05-26,22.486
2016-05-27,22.7892
2016-05-31,22.7616
2016-06-01,22.8351
2016-06-02,22.8259
2016-06-03,22.4263
2016-06-06,22.7432
2016-06-07,22.6789
2016-06-08,22.7157
2016-06-09,22.6146
2016-06-10,22.4217
2016-06-13,22.3023
2016-06-14,22.0084
2016-06-15,22.0543
2016-06-16,21.9165
2016-06-17,22.0268
2016-06-20,22.5779
2016-06-21,22.532
2016-06-22,22.5503
2016-06-23,23.2209
2016-06-24,22.0268
2016-06-27,21.2828
2016-06-28,21.7604
2016-06-29,22.2289
2016-06-30,22.8259
2016-07-01,22.633
2016-07-05,21.99
2016-07-06,22.1646
2016-07-07,22.3023
2016-07-08,22.6789
2016-07-11,23.1107
2016-07-12,23.5791
2016-07-13,23.5975
2016-07-14,23.7904
2016-07-15,23.772
2016-07-18,23.5975
2016-07-19,23.7353
2016-07-20,23.5607
2016-07-21,23.3679
2016-07-22,23.625
2016-07-25,23.4689
2016-07-26,23.5975
2016-07-27,23.9098
2016-07-28,24.1302
2016-07-29,23.9741
2016-08-01,23.8547
2016-08-02,23.5975
2016-08-03,23.9006
2016-08-04,23.9282
2016-08-05,24.7365
2016-08-08,24.6722
2016-08-09,24.8008
2016-08-10,24.5712
2016-08-11,24.5895
2016-08-12,24.5803
2016-08-15,24.7916
2016-08-16,24.6997
2016-08-17,24.8192
2016-08-18,25.1315
2016-08-19,25.1039
2016-08-22,25.306
2016-08-23,25.4346
2016-08-24,25.5724
2016-08-25,25.7101
2016-08-26,25.7928
2016-08-29,25.9673
2016-08-30,26.2915
2016-08-31,26.2637
2016-09-01,26.0507
2016-09-02,26.3378
2016-09-06,26.0692
2016-09-07,26.3748
2016-09-08,26.5508
2016-09-09,26.2822
2016-09-12,26.4026
2016-09-13,25.847
2016-09-14,25.4117
2016-09-15,25.5414
2016-09-16,25.3006
2016-09-19,25.4487
2016-09-20,25.3932
2016-09-21,25.5043
2016-09-22,25.9025
2016-09-23,25.8192
2016-09-26,25.245
2016-09-27,25.4117
2016-09-28,25.6154
2016-09-29,25.1709
2016-09-30,25.5228
2016-10-03,25.2543
2016-10-04,25.1894
2016-10-05,25.5691
2016-10-06,25.7729
2016-10-07,25.671
2016-10-10,25.9396
2016-10-11,25.6895
2016-10-12,25.6988
2016-10-13,25.1339
2016-10-14,25.1709
2016-10-17,24.995
2016-10-18,25.2635
2016-10-19,25.671
2016-10-20,25.5877
2016-10-21,25.5784
2016-10-24,25.8007
2016-10-25,25.708
2016-10-26,25.8007
2016-10-27,25.8562
2016-10-28,25.458
2016-10-31,25.634
2016-11-01,25.2913
2016-11-02,24.8653
2016-11-03,24.9301
2016-11-04,24.9672
2016-11-07,25.9951
2016-11-08,25.8099
2016-11-09,27.375
2016-11-10,28.3844
2016-11-11,28.9308
2016-11-14,29.5328
2016-11-15,29.8013
2016-11-16,29.7643
2016-11-17,30.4496
2016-11-18,30.8663
2016-11-21,31.0238
2016-11-22,31.3849
2016-11-23,31.848
2016-11-25,31.9313
2016-11-28,31.2275
2016-11-29,31.4886
2016-11-30,31.4326
2016-12-01,31.9175
2016-12-02,31.3114
2016-12-05,31.8895
2016-12-06,32.7101
2016-12-07,33.2136
2016-12-08,34.0248
2016-12-09,34.1927
2016-12-12,33.5586
2016-12-13,33.4281
2016-12-14,32.6448
2016-12-15,33.1763
2016-12-16,32.822
2016-12-19,33.0271
2016-12-20,33.7451
2016-12-21,33.3814
2016-12-22,33.3348
2016-12-23,33.3814
2016-12-27,33.7544
2016-12-28,33.5959
2016-12-29,33.3162
2016-12-30,33.2416
2017-01-03,33.2882
2017-01-04,33.6425
2017-01-05,32.8127
2017-01-06,32.5516
2017-01-09,31.9735
2017-01-10,32.3744
2017-01-11,32.7567
2017-01-12,31.9268
2017-01-13,31.9455
2017-01-17,30.9384
2017-01-18,31.0503
2017-01-19,30.6774
2017-01-20,30.9571
2017-01-23,30.7706
2017-01-24,31.083
2017-01-25,31.5445
2017-01-26,31.6564
2017-01-27,31.4047
2017-01-30,30.8638
2017-01-31,31.3487
2017-02-01,31.1249
2017-02-02,30.8172
2017-02-03,31.386
2017-02-06,30.9851
2017-02-07,30.6867
2017-02-08,30.4256
2017-02-09,31.0317
2017-02-10,31.2648
2017-02-13,31.358
2017-02-14,31.6471
2017-02-15,31.6937
2017-02-16,31.9268
2017-02-17,31.9268
2017-02-21,31.7497
2017-02-22,31.5818
2017-02-23,31.7497
2017-02-24,31.4513
2017-02-27,31.5358
2017-02-28,31.0194
2017-03-01,31.9395
2017-03-02,30.7941
2017-03-03,30.8598
2017-03-06,30.7378
2017-03-07,30.6345
2017-03-08,30.3341
2017-03-09,30.1838
2017-03-10,30.0712
2017-03-13,30.0618
2017-03-14,30.0149
2017-03-15,29.9961
2017-03-16,30.5218
2017-03-17,30.8317
2017-03-20,30.3622
2017-03-21,28.8695
2017-03-22,28.6911
2017-03-23,29.1511
2017-03-24,29.1605
2017-03-27,28.9821
2017-03-28,29.3201
2017-03-29,29.1605
2017-03-30,30.1087
2017-03-31,29.8459
2017-04-03,29.6487
2017-04-04,29.5924
2017-04-05,29.0572
2017-04-06,29.4985
2017-04-07,29.3201
2017-04-10,29.1887
2017-04-11,29.6487
2017-04-12,29.2168
2017-04-13,28.5878
2017-04-17,29.1887
2017-04-18,29.2356
2017-04-19,29.5736
2017-04-20,30.3059
2017-04-21,30.2308
2017-04-24,30.8223
2017-04-25,30.9537
2017-04-26,31.7423
2017-04-27,31.6672
2017-04-28,31.1884
2017-05-01,31.5452
2017-05-02,31.1321
2017-05-03,31.4137
2017-05-04,31.4231
2017-05-05,31.3574
2017-05-08,31.2635
2017-05-09,31.057
2017-05-10,31.01
2017-05-11,30.3247
2017-05-12,30.1463
2017-05-15,30.55
2017-05-16,30.5876
2017-05-17,29.0291
2017-05-18,28.9821
2017-05-19,29.1981
2017-05-22,29.3295
2017-05-23,29.7801
2017-05-24,29.4891
2017-05-25,29.5079
2017-05-26,29.3952
2017-05-30,29.0642
2017-05-31,28.7615
2017-06-01,29.452
2017-06-02,29.3101
2017-06-05,29.3196
2017-06-06,29.1493
2017-06-07,29.3763
2017-06-08,30.4072
2017-06-09,31.6084
2017-06-12,31.5895
2017-06-13,31.5422
2017-06-14,31.2963
2017-06-15,31.3436
2017-06-16,31.2395
2017-06-19,31.2111
2017-06-20,30.7099
2017-06-21,30.4545
2017-06-22,29.9532
2017-06-23,29.7168
2017-06-26,29.6128
2017-06-27,29.7263
2017-06-28,30.1991
2017-06-29,30.7193
2017-06-30,30.4167
2017-07-03,30.9369
2017-07-05,30.9463
2017-07-06,30.4923
2017-07-07,30.691
2017-07-10,30.7288
2017-07-11,30.6058
2017-07-12,30.5964
2017-07-13,30.6626
2017-07-14,30.4545
2017-07-17,30.4072
2017-07-18,30.3694
2017-07-19,30.341
2017-07-20,30.2748
2017-07-21,30.2086
2017-07-24,30.3694
2017-07-25,31.3057
2017-07-26,30.3978
2017-07-27,30.5207
2017-07-28,30.0384
2017-07-31,30.2275
2017-08-01,30.3221
2017-08-02,30.2275
2017-08-03,29.9343
2017-08-04,29.9816
2017-08-07,29.783
2017-08-08,29.8492
2017-08-09,29.4236
2017-08-10,28.6764
2017-08-11,28.317
2017-08-14,29.0547
2017-08-15,28.7615
2017-08-16,28.6953
2017-08-17,27.759
2017-08-18,27.9292
2017-08-21,28.0144
2017-08-22,28.2224
2017-08-23,28.317
2017-08-24,28.3643
2017-08-25,28.4589
2017-08-28,28.2792
2017-08-29,28.1941
2017-08-30,28.3085
2017-08-31,28.2322
2017-09-01,28.4324
2017-09-05,27.5841
2017-09-06,27.7175
2017-09-07,27.0312
2017-09-08,27.3362
2017-09-11,28.0225
2017-09-12,28.6897
2017-09-13,28.9375
2017-09-14,28.6039
2017-09-15,28.7183
2017-09-18,29.1377
2017-09-19,29.3379
2017-09-20,29.7382
2017-09-21,29.8907
2017-09-22,29.9574
2017-09-25,30.1194
2017-09-26,30.3005
2017-09-27,31.2727
2017-09-28,31.5587
2017-09-29,31.5682
2017-10-02,31.9685
2017-10-03,31.7779
2017-10-04,31.3776
2017-10-05,31.6635
2017-10-06,31.6445
2017-10-09,31.7398
2017-10-10,32.2545
2017-10-11,32.0829
2017-10-12,31.9209
2017-10-13,31.7303
2017-10-16,32.0543
2017-10-17,31.654
2017-10-18,32.102
2017-10-19,32.1496
2017-10-20,32.1878
2017-10-23,31.7398
2017-10-24,32.0067
2017-10-25,31.8446
2017-10-26,32.0067
2017-10-27,32.102
2017-10-30,31.2346
2017-10-31,31.3967
2017-11-01,31.1965
2017-11-02,31.5778
2017-11-03,31.4729
2017-11-06,31.4062
2017-11-07,30.5865
2017-11-08,30.3673
2017-11-09,30.1194
2017-11-10,30.0622
2017-11-13,30.7104
2017-11-14,30.8248
2017-11-15,30.7199
2017-11-16,30.8248
2017-11-17,30.9391
2017-11-20,31.3204
2017-11-21,31.3967
2017-11-22,31.3204
2017-11-24,31.0726
2017-11-27,31.1107
2017-11-28,32.1878
2017-11-29,33.2172
2017-11-30,32.5647
2017-12-01,32.4592
2017-12-04,32.6127
2017-12-05,31.8931
2017-12-06,31.6628
2017-12-07,31.7971
2017-12-08,31.5957
2017-12-11,31.0296
2017-12-12,31.3078
2017-12-13,31.2311
2017-12-14,30.8473
2017-12-15,31.7204
2017-12-18,32.2577
2017-12-19,32.1138
2017-12-20,31.9123
2017-12-21,32.1617
2017-12-22,31.9411
2017-12-26,31.5957
2017-12-27,31.1063
2017-12-28,31.1639
2017-12-29,30.569
2018-01-02,30.521
2018-01-03,30.3291
2018-01-04,30.6266
2018-01-05,30.7129
2018-01-08,30.8569
2018-01-09,31.2215
2018-01-10,31.7108
2018-01-11,32.2865
2018-01-12,32.4016
2018-01-16,31.778
2018-01-17,32.2097
2018-01-18,31.7875
2018-01-19,32.2001
2018-01-22,32.2001
2018-01-23,32.1713
2018-01-24,31.7204
2018-01-25,30.924
2018-01-26,31.0488
2018-01-29,30.7513
2018-01-30,30.7417
2018-01-31,30.5018
2018-02-01,30.9048
2018-02-02,30.5978
2018-02-05,29.4848
2018-02-06,29.6959
2018-02-07,29.8686
2018-02-08,29.1922
2018-02-09,29.7343
2018-02-12,29.6863
2018-02-13,29.7535
2018-02-14,30.5306
2018-02-15,30.617
2018-02-16,31.0296
2018-02-20,30.665
2018-02-21,31.1831
2018-02-22,30.7225
2018-02-23,31.2215
2018-02-26,31.279
2018-02-27,30.7417
2018-02-28,30.1909
2018-03-01,30.1812
2018-03-02,30.819
2018-03-05,31.1959
2018-03-06,31.7758
2018-03-07,32.1237
2018-03-08,31.5825
2018-03-09,32.3943
2018-03-12,32.317
2018-03-13,31.9111
2018-03-14,31.2636
2018-03-15,31.4182
2018-03-16,31.9498
2018-03-19,31.6888
2018-03-20,31.3119
2018-03-21,31.5342
2018-03-22,30.5098
2018-03-23,29.582
2018-03-26,30.5291
2018-03-27,29.756
2018-03-28,30.0846
2018-03-29,30.1136
2018-04-02,29.4274
2018-04-03,29.8043
2018-04-04,29.9783
2018-04-05,30.2392
2018-04-06,29.4661
2018-04-09,29.4274
2018-04-10,30.1232
2018-04-11,29.901
2018-04-12,30.3938
2018-04-13,29.9976
2018-04-16,30.3358
2018-04-17,29.8526
2018-04-18,29.6883
2018-04-19,29.901
2018-04-20,29.9879
2018-04-23,30.5678
2018-04-24,30.935
2018-04-25,31.0703
2018-04-26,30.9543
2018-04-27,31.0027
2018-04-30,30.2585
2018-05-01,30.5098
2018-05-02,30.5678
2018-05-03,30.2199
2018-05-04,30.6451
2018-05-07,30.7997
2018-05-08,31.0993
2018-05-09,31.2636
2018-05-10,31.2346
2018-05-11,31.138
2018-05-14,30.9447
2018-05-15,31.2636
2018-05-16,31.4086
2018-05-17,31.5439
2018-05-18,31.3119
2018-05-21,31.8531
2018-05-22,31.8531
2018-05-23,31.8048
2018-05-24,31.6405
2018-05-25,31.4569
2018-05-29,30.8964
2018-05-30,31.6212
2018-05-31,31.3097
2018-06-01,31.6504
2018-06-04,32.1857
2018-06-05,32.0299
2018-06-06,32.4776
2018-06-07,32.3998
2018-06-08,32.5166
2018-06-11,32.0591
2018-06-12,31.6504
2018-06-13,31.699
2018-06-14,31.7574
2018-06-15,32.1565
2018-06-18,32.4192
2018-06-19,33.0227
2018-06-20,33.0713
2018-06-21,32.9643
2018-06-22,32.9156
2018-06-25,32.828
2018-06-26,32.4095
2018-06-27,31.8742
2018-06-28,31.9423
2018-06-29,31.7574
2018-07-02,32.0786
2018-07-03,31.9326
2018-07-05,32.1565
2018-07-06,32.4874
2018-07-09,32.9545
2018-07-10,32.575
2018-07-11,32.6042
2018-07-12,32.3803
2018-07-13,32.1273
2018-07-16,32.5068
2018-07-17,32.4874
2018-07-18,32.8377
2018-07-19,33.4022
2018-07-20,33.8402
2018-07-23,34.1906
2018-07-24,34.1127
2018-07-25,34.1906
2018-07-26,34.3755
2018-07-27,34.3852
2018-07-30,34.4047
2018-07-31,34.249
2018-08-01,34.2879
2018-08-02,34.4241
2018-08-03,33.9181
2018-08-06,33.9181
2018-08-07,34.2198
2018-08-08,34.3268
2018-08-09,34.1614
2018-08-10,34.1322
2018-08-13,33.9764
2018-08-14,34.3268
2018-08-15,34.0738
2018-08-16,34.4436
2018-08-17,34.4436
2018-08-20,34.5896
2018-08-21,35.2514
2018-08-22,35.086
2018-08-23,34.9789
2018-08-24,34.9302
2018-08-27,34.8426
2018-08-28,34.7259
2018-08-29,34.6577
2018-08-30,34.6577
2018-08-31,34.7557
2018-09-04,35.0398
2018-09-05,34.9124
2018-09-06,34.9124
2018-09-07,34.932
2018-09-10,34.8145
2018-09-11,34.8243
2018-09-12,34.4128
2018-09-13,34.1483
2018-09-14,34.6088
2018-09-17,34.3247
2018-09-18,33.8937
2018-09-19,34.1777
2018-09-20,34.4324
2018-09-21,34.2757
2018-09-24,33.8349
2018-09-25,33.9622
2018-09-26,33.1492
2018-09-27,33.061
2018-09-28,32.963
2018-10-01,32.5222
2018-10-02,32.4047
2018-10-03,33.3059
2018-10-04,33.3745
2018-10-05,33.3059
2018-10-08,33.5116
2018-10-09,33.59
2018-10-10,33.2275
2018-10-11,31.9835
2018-10-12,31.1214
2018-10-15,31.5329
2018-10-16,31.9835
2018-10-17,32.199
2018-10-18,31.4741
2018-10-19,30.8276
2018-10-22,29.8871
2018-10-23,29.7108
2018-10-24,28.1631
2018-10-25,28.9467
2018-10-26,28.7704
2018-10-29,29.5149
2018-10-30,30.0341
2018-10-31,30.1712
2018-11-01,30.4161
2018-11-02,30.759
2018-11-05,31.0529
2018-11-06,31.2978
2018-11-07,31.0724
2018-11-08,30.8765
2018-11-09,30.5827
2018-11-12,30.2594
2018-11-13,30.3965
2018-11-14,29.8578
2018-11-15,30.7198
2018-11-16,31.0333
2018-11-19,30.8276
2018-11-20,30.3378
2018-11-21,30.4357
2018-11-23,30.3378
2018-11-26,30.808
2018-11-27,31.0333
2018-11-28,31.5524
2018-11-29,31.3946
2018-11-30,31.9076
2018-12-03,31.878
2018-12-04,30.2896
2018-12-06,30.3882
2018-12-07,30.4178
2018-12-10,29.7568
2018-12-11,29.8061
2018-12-12,29.9048
2018-12-13,28.9576
2018-12-14,28.6419
2018-12-17,28.7208
2018-12-18,28.3952
2018-12-19,27.6849
2018-12-20,27.7737
2018-12-21,27.2014
2018-12-24,26.5996
2018-12-26,27.7934
2018-12-27,27.8033
2018-12-28,27.9907
2018-12-31,28.0499
2019-01-02,28.3854
2019-01-03,28.2472
2019-01-04,29.0365
2019-01-07,28.9182
2019-01-08,28.8491
2019-01-09,28.7899
2019-01-10,28.859
2019-01-11,28.9083
2019-01-14,28.7998
2019-01-15,29.0464
2019-01-16,29.5792
2019-01-17,29.7173
2019-01-18,29.9738
2019-01-22,29.8752
2019-01-23,30.0725
2019-01-24,30.3488
2019-01-25,30.921
2019-01-28,31.0887
2019-01-29,30.8519
2019-01-30,30.8914
2019-01-31,31.1085
2019-02-01,31.069
2019-02-04,31.4735
2019-02-05,31.5919
2019-02-06,31.6906
2019-02-07,32.2135
2019-02-08,32.3418
2019-02-11,32.8745
2019-02-12,33.1311
2019-02-13,33.2396
2019-02-14,33.0028
2019-02-15,33.5455
2019-02-19,34.2164
2019-02-20,35.0057
2019-02-21,35.055
2019-02-22,35.3214
2019-02-25,35.4398
2019-02-26,34.907
2019-02-27,35.0649
2019-02-28,35.2337
2019-03-01,35.3926
2019-03-04,35.194
2019-03-05,35.2536
2019-03-06,34.7173
2019-03-07,34.3399
2019-03-08,34.7471
2019-03-11,34.5386
2019-03-12,34.33
2019-03-13,34.0718
2019-03-14,34.2605
2019-03-15,34.33
2019-03-18,34.8563
2019-03-19,34.2009
2019-03-20,33.5654
2019-03-21,32.761
2019-03-22,31.7282
2019-03-25,32.0063
2019-03-26,33.1086
2019-03-27,33.1681
2019-03-28,33.615
2019-03-29,33.3965
2019-04-01,34.2903
2019-04-02,34.1215
2019-04-03,34.1115
2019-04-04,34.6081
2019-04-05,34.767
2019-04-08,34.6776
2019-04-09,33.9427
2019-04-10,34.0818
2019-04-11,34.1612
2019-04-12,34.6478
2019-04-15,34.2108
2019-04-16,34.5783
2019-04-17,34.3995
2019-04-18,33.8434
2019-04-22,33.5256
2019-04-23,34.2605
2019-04-24,34.7868
2019-04-25,35.0351
2019-04-26,35.3827
2019-04-29,35.8693
2019-04-30,35.7104
2019-05-01,35.2933
2019-05-02,35.7997
2019-05-03,36.187
2019-05-06,36.197
2019-05-07,35.3131
2019-05-08,34.8365
2019-05-09,34.7968
2019-05-10,34.767
2019-05-13,33.3667
2019-05-14,33.5753
2019-05-15,33.3171
2019-05-16,33.8633
2019-05-17,33.1979
2019-05-20,33.3072
2019-05-21,33.5554
2019-05-22,33.0688
2019-05-23,32.5624
2019-05-24,33.049
2019-05-28,32.7808
2019-05-29,32.9
2019-05-30,32.28
2019-05-31,31.77
2019-06-03,32.15
2019-06-04,33.16
2019-06-05,32.87
2019-06-06,32.61
2019-06-07,32.19
2019-06-10,32.53
2019-06-11,32.4
2019-06-12,32.38
2019-06-13,32.48
2019-06-14,32.51
2019-06-17,31.81
2019-06-18,32.4
2019-06-19,32.25
2019-06-20,32.11
2019-06-21,32.13
2019-06-24,32.055
2019-06-25,32.54
2019-06-26,32.23
2019-06-27,32.63
2019-06-28,33.2
2019-07-01,33.14
2019-07-02,32.76
2019-07-03,33.08
2019-07-04,33.08
2019-07-05,33.42
2019-07-08,33.14
2019-07-09,33.17
2019-07-10,32.87
2019-07-11,32.855
2019-07-12,33.28
2019-07-15,32.43
2019-07-16,32.43
2019-07-17,32.225
2019-07-18,32.45
2019-07-19,32.38
2019-07-22,32.14
2019-07-23,32.49
2019-07-24,34.985
2019-07-25,35.06
2019-07-26,35.615
2019-07-29,34.985
2019-07-30,35.655
2019-07-31,35.52
2019-08-01,34.89
2019-08-02,34.74
2019-08-05,34.17
2019-08-06,34.26
2019-08-07,33.96
2019-08-08,34.545
2019-08-09,34.43
2019-08-12,34.125
2019-08-13,34.64
2019-08-14,33.505
2019-08-15,33.33
2019-08-16,34.125
2019-08-19,34.49
2019-08-20,33.85
2019-08-21,33.835
2019-08-22,33.935
2019-08-23,32.61
2019-08-26,32.94
2019-08-27,32.465
2019-08-28,32.61
2019-08-29,32.93
2019-08-30,32.71
2019-09-02,32.66
2019-09-03,31.87
2019-09-04,31.96
2019-09-05,32.645
2019-09-06,32.255
2019-09-09,33.025
2019-09-10,33.455
2019-09-11,34.295
2019-09-12,34.75
2019-09-13,35.145
2019-09-16,34.995
2019-09-17,34.27
2019-09-18,34.405
2019-09-19,34.145
2019-09-20,34.18
2019-09-23,34.06
2019-09-24,33.54
2019-09-25,34.365
2019-09-26,34.04
2019-09-27,34.32
2019-09-30,34.04
2019-10-01,33.55
2019-10-02,33.325
2019-10-03,33.37
2019-10-04,33.88
2019-10-07,33.75
2019-10-08,33.525
2019-10-09,33.74
2019-10-10,34.09
2019-10-11,34.24
2019-10-14,34.08
2019-10-15,34.39
2019-10-16,34.145
2019-10-17,34.36
2019-10-18,34.575
2019-10-21,35.015
2019-10-22,35.05
2019-10-23,34.27
2019-10-24,34.19
2019-10-25,34.335
2019-10-28,34.79
2019-10-29,35.045
2019-10-30,34.79
2019-10-31,34.305
2019-11-01,34.76
2019-11-04,35.13
2019-11-05,35.17
2019-11-06,35.295
2019-11-07,35.07
2019-11-08,35.135
2019-11-11,34.87
2019-11-12,34.94
2019-11-13,34.6
2019-11-14,34.66
2019-11-15,34.78
2019-11-18,34.72
2019-11-19,34.71
2019-11-20,34.28
2019-11-21,34.19
2019-11-22,34.25
2019-11-25,34.53
