date,close
2014-06-13,12.4203
2014-06-16,12.5147
2014-06-17,12.4743
2014-06-18,12.4001
2014-06-19,12.5687
2014-06-20,12.5147
2014-06-23,12.6227
2014-06-24,12.6632
2014-06-25,12.7171
2014-06-26,12.7306
2014-06-27,12.7644
2014-06-30,12.8183
2014-07-01,12.8521
2014-07-02,12.7981
2014-07-03,12.7037
2014-07-07,12.5957
2014-07-08,12.5417
2014-07-09,12.6564
2014-07-10,12.6227
2014-07-11,12.6632
2014-07-14,12.6632
2014-07-15,12.6767
2014-07-16,12.7576
2014-07-17,12.7644
2014-07-18,12.7779
2014-07-21,12.7846
2014-07-22,12.8386
2014-07-23,12.8521
2014-07-24,12.8048
2014-07-25,12.7779
2014-07-28,12.7846
2014-07-29,12.7441
2014-07-30,12.6429
2014-07-31,12.4675
2014-08-01,12.4068
2014-08-04,12.589
2014-08-05,12.2381
2014-08-06,12.3917
2014-08-07,12.4122
2014-08-08,12.4465
2014-08-11,12.8166
2014-08-12,12.7481
2014-08-13,12.8235
2014-08-14,12.9057
2014-08-15,12.9879
2014-08-18,12.9742
2014-08-19,13.0085
2014-08-20,13.077
2014-08-21,13.0565
2014-08-22,13.0085
2014-08-25,13.0839
2014-08-26,13.2141
2014-08-27,13.1319
2014-08-28,13.1593
2014-08-29,13.2347
2014-09-02,13.2004
2014-09-03,13.2141
2014-09-04,13.1524
2014-09-05,13.1867
2014-09-08,13.2004
2014-09-09,13.2004
2014-09-10,13.1867
2014-09-11,13.1799
2014-09-12,13.0565
2014-09-15,12.9537
2014-09-16,13.0565
2014-09-17,13.0976
2014-09-18,13.1456
2014-09-19,13.1936
2014-09-22,13.0565
2014-09-23,12.94
2014-09-24,12.9811
2014-09-25,12.9331
2014-09-26,13.0291
2014-09-29,13.0702
2014-09-30,13.1387
2014-10-01,13.0085
2014-10-02,13.0496
2014-10-03,13.0565
2014-10-06,12.9811
2014-10-07,12.8988
2014-10-08,12.844
2014-10-09,12.5425
2014-10-10,12.4259
2014-10-13,11.8639
2014-10-14,11.8776
2014-10-15,12.2203
2014-10-16,12.611
2014-10-17,12.611
2014-10-20,12.6727
2014-10-21,12.8166
2014-10-22,12.7069
2014-10-23,12.8097
2014-10-24,12.8577
2014-10-27,12.8235
2014-10-28,12.8509
2014-10-29,12.8646
2014-10-30,12.7206
2014-10-31,12.7344
2014-11-03,12.7206
2014-11-04,12.5699
2014-11-05,12.6658
2014-11-06,12.6651
2014-11-07,12.8392
2014-11-10,12.7905
2014-11-11,12.7696
2014-11-12,12.8113
2014-11-13,12.7069
2014-11-14,12.8601
2014-11-17,12.9576
2014-11-18,13.0202
2014-11-19,13.1038
2014-11-20,13.1316
2014-11-21,13.0481
2014-11-24,12.9645
2014-11-25,12.9297
2014-11-26,13.0481
2014-11-28,12.6025
2014-12-01,12.2265
2014-12-02,12.4284
2014-12-03,12.5607
2014-12-04,12.6234
2014-12-05,12.512
2014-12-08,12.0524
2014-12-09,12.1429
2014-12-10,11.7739
2014-12-11,11.7948
2014-12-12,11.7043
2014-12-15,11.4884
2014-12-16,11.6416
2014-12-17,12.0037
2014-12-18,12.122
2014-12-19,12.1151
2014-12-22,12.122
2014-12-23,12.2126
2014-12-24,12.2195
2014-12-26,12.1986
2014-12-29,12.2752
2014-12-30,12.2752
2014-12-31,12.1986
2015-01-02,12.2961
2015-01-05,11.9619
2015-01-06,11.8018
2015-01-07,11.76
2015-01-08,11.8644
2015-01-09,11.8714
2015-01-12,11.5929
2015-01-13,11.4118
2015-01-14,11.4745
2015-01-15,11.5372
2015-01-16,11.8087
2015-01-20,11.8226
2015-01-21,12.0315
2015-01-22,12.0385
2015-01-23,12.0454
2015-01-26,12.0803
2015-01-27,12.0315
2015-01-28,11.8505
2015-01-29,11.8346
2015-01-30,11.9062
2015-02-02,12.0176
2015-02-03,12.136
2015-02-04,12.0594
2015-02-05,12.1847
2015-02-06,12.1569
2015-02-09,12.0106
2015-02-10,12.0524
2015-02-11,11.8913
2015-02-12,12.0259
2015-02-13,12.1038
2015-02-17,12.1392
2015-02-18,12.1038
2015-02-19,12.0825
2015-02-20,12.1888
2015-02-23,12.0825
2015-02-24,12.0684
2015-02-25,12.1746
2015-02-26,11.9904
2015-02-27,12.0825
2015-03-02,11.9338
2015-03-03,12.0188
2015-03-04,11.9692
2015-03-05,12.0117
2015-03-06,11.8559
2015-03-09,11.7284
2015-03-10,11.7567
2015-03-11,11.5868
2015-03-12,11.523
2015-03-13,11.4947
2015-03-16,11.4876
2015-03-17,11.5088
2015-03-18,11.6717
2015-03-19,11.5938
2015-03-20,11.6292
2015-03-23,11.7992
2015-03-24,11.6647
2015-03-25,11.693
2015-03-26,11.693
2015-03-27,11.6717
2015-03-30,11.7638
2015-03-31,11.7355
2015-04-01,11.7213
2015-04-02,11.7638
2015-04-06,11.7921
2015-04-07,11.8205
2015-04-08,11.8205
2015-04-09,11.8417
2015-04-10,11.8984
2015-04-13,11.8488
2015-04-14,11.9409
2015-04-15,12.0259
2015-04-16,12.0542
2015-04-17,11.9763
2015-04-20,12.0329
2015-04-21,11.9763
2015-04-22,11.9621
2015-04-23,12.0542
2015-04-24,12.0967
2015-04-27,12.1038
2015-04-28,12.0754
2015-04-29,12.1746
2015-04-30,12.1817
2015-05-01,12.21
2015-05-04,12.1675
2015-05-05,12.21
2015-05-06,12.0967
2015-05-07,11.9692
2015-05-08,12.0329
2015-05-11,11.955
2015-05-12,11.9904
2015-05-13,12.1386
2015-05-14,12.1746
2015-05-15,12.1674
2015-05-18,12.2323
2015-05-19,12.1746
2015-05-20,12.1386
2015-05-21,12.153
2015-05-22,12.1746
2015-05-26,12.0737
2015-05-27,12.0881
2015-05-28,11.98
2015-05-29,11.9295
2015-06-01,11.9367
2015-06-02,11.98
2015-06-03,11.8142
2015-06-04,11.6556
2015-06-05,11.7205
2015-06-08,11.67
2015-06-09,11.6556
2015-06-10,11.634
2015-06-11,11.6412
2015-06-12,11.6124
2015-06-15,11.7277
2015-06-16,11.7061
2015-06-17,11.6989
2015-06-18,11.6989
2015-06-19,11.6124
2015-06-22,11.6196
2015-06-23,11.6052
2015-06-24,11.5907
2015-06-25,11.4754
2015-06-26,11.425
2015-06-29,11.2664
2015-06-30,11.2159
2015-07-01,11.115
2015-07-02,11.2375
2015-07-06,11.1438
2015-07-07,11.3745
2015-07-08,11.1727
2015-07-09,11.2087
2015-07-10,11.324
2015-07-13,11.425
2015-07-14,11.5043
2015-07-15,11.3457
2015-07-16,11.2448
2015-07-17,11.151
2015-07-20,10.9853
2015-07-21,10.9853
2015-07-22,10.769
2015-07-23,10.7762
2015-07-24,10.8627
2015-07-27,10.9204
2015-07-28,11.1078
2015-07-29,11.2448
2015-07-30,11.1655
2015-07-31,11.1078
2015-08-03,10.9204
2015-08-04,10.8339
2015-08-05,10.4591
2015-08-06,10.4086
2015-08-07,10.4014
2015-08-10,10.6321
2015-08-11,10.6537
2015-08-12,10.8001
2015-08-13,10.675
2015-08-14,10.7412
2015-08-17,10.8589
2015-08-18,10.8001
2015-08-19,10.675
2015-08-20,10.5426
2015-08-21,10.3513
2015-08-24,10.6309
2015-08-25,10.1453
2015-08-26,10.3219
2015-08-27,10.6235
2015-08-28,10.6971
2015-08-31,10.6235
2015-09-01,10.4837
2015-09-02,10.572
2015-09-03,10.5573
2015-09-04,10.5132
2015-09-08,10.5279
2015-09-09,10.4175
2015-09-10,10.4102
2015-09-11,10.2042
2015-09-14,10.1012
2015-09-15,10.0865
2015-09-16,10.2042
2015-09-17,10.2189
2015-09-18,10.1895
2015-09-21,10.2557
2015-09-22,10.0791
2015-09-23,9.6818
2015-09-24,9.5862
2015-09-25,9.5568
2015-09-28,9.0418
2015-09-29,8.4679
2015-09-30,9.1815
2015-10-01,9.5715
2015-10-02,9.8731
2015-10-05,10.1747
2015-10-06,10.1747
2015-10-07,10.3145
2015-10-08,10.3807
2015-10-09,10.4028
2015-10-12,10.263
2015-10-13,10.1012
2015-10-14,10.1232
2015-10-15,10.2704
2015-10-16,10.3292
2015-10-19,10.2189
2015-10-20,10.1895
2015-10-21,10.0202
2015-10-22,9.7775
2015-10-23,9.6965
2015-10-26,9.4611
2015-10-27,9.314
2015-10-28,9.7039
2015-10-29,9.8952
2015-10-30,9.9982
2015-11-02,10.1232
2015-11-03,10.366
2015-11-04,10.1821
2015-11-05,10.0938
2015-11-06,9.9246
2015-11-09,9.8069
2015-11-10,9.8137
2015-11-11,9.6481
2015-11-12,9.3696
2015-11-13,9.3478
2015-11-16,9.7083
2015-11-17,9.5427
2015-11-18,9.6255
2015-11-19,9.4675
2015-11-20,9.2342
2015-11-23,9.1664
2015-11-24,9.3094
2015-11-25,9.2718
2015-11-27,9.2267
2015-11-30,9.2267
2015-12-01,9.0912
2015-12-02,8.8504
2015-12-03,8.5192
2015-12-04,8.2107
2015-12-07,7.6387
2015-12-08,7.8645
2015-12-09,8.5493
2015-12-10,8.316
2015-12-11,7.7516
2015-12-14,7.5108
2015-12-15,7.6613
2015-12-16,7.9924
2015-12-17,7.7968
2015-12-18,7.857
2015-12-21,8.1956
2015-12-22,8.5343
2015-12-23,9.0235
2015-12-24,8.9858
2015-12-28,8.8203
2015-12-29,8.73
2015-12-30,8.6697
2015-12-31,9.0686
2016-01-04,9.1476
2016-01-05,9.0912
2016-01-06,8.5719
2016-01-07,8.1128
2016-01-08,8.2709
2016-01-11,7.8269
2016-01-12,7.7968
2016-01-13,7.3076
2016-01-14,7.7968
2016-01-15,7.3828
2016-01-19,6.9463
2016-01-20,6.4421
2016-01-21,6.856
2016-01-22,7.4656
2016-01-25,7.2022
2016-01-26,7.4656
2016-01-27,7.3904
2016-01-28,7.7441
2016-01-29,7.8269
2016-02-01,7.6839
2016-02-02,7.5409
2016-02-03,7.5559
2016-02-04,7.7064
2016-02-05,7.5032
2016-02-08,6.7657
2016-02-09,6.5317
2016-02-10,6.5473
2016-02-11,6.2121
2016-02-12,6.6486
2016-02-16,7.0773
2016-02-17,7.4826
2016-02-18,7.5917
2016-02-19,7.428
2016-02-22,7.8723
2016-02-23,7.5293
2016-02-24,7.7086
2016-02-25,7.654
2016-02-26,7.7476
2016-02-29,7.8879
2016-03-01,7.8801
2016-03-02,8.1763
2016-03-03,8.3867
2016-03-04,8.3322
2016-03-07,8.6439
2016-03-08,8.0671
2016-03-09,8.1685
2016-03-10,8.0827
2016-03-11,8.2464
2016-03-14,8.2386
2016-03-15,8.1139
2016-03-16,8.5114
2016-03-17,8.7141
2016-03-18,8.6673
2016-03-21,8.4491
2016-03-22,8.566
2016-03-23,8.262
2016-03-24,8.1607
2016-03-28,8.1061
2016-03-29,8.1607
2016-03-30,8.3477
2016-03-31,8.5114
2016-04-01,8.262
2016-04-04,8.0983
2016-04-05,8.0048
2016-04-06,8.223
2016-04-07,8.2698
2016-04-08,8.488
2016-04-11,8.488
2016-04-12,8.8076
2016-04-13,8.7998
2016-04-14,8.7764
2016-04-15,8.605
2016-04-18,8.8933
2016-04-19,9.2519
2016-04-20,9.4234
2016-04-21,9.4312
2016-04-22,9.5169
2016-04-25,9.3766
2016-04-26,9.322
2016-04-27,9.5247
2016-04-28,9.3766
2016-04-29,9.5169
2016-05-02,9.4467
2016-05-03,9.2129
2016-05-04,9.2831
2016-05-05,9.4312
2016-05-06,9.4078
2016-05-09,9.2831
2016-05-10,9.2714
2016-05-11,9.3669
2016-05-12,9.5261
2016-05-13,9.4704
2016-05-16,9.7569
2016-05-17,9.8364
2016-05-18,9.5897
2016-05-19,9.7513
2016-05-20,9.8842
2016-05-23,9.8364
2016-05-24,9.7648
2016-05-25,9.8444
2016-05-26,9.733
2016-05-27,9.725
2016-05-31,9.7171
2016-06-01,9.9797
2016-06-02,10.0354
2016-06-03,10.0195
2016-06-06,10.1627
2016-06-07,10.2184
2016-06-08,10.1866
2016-06-09,10.1787
2016-06-10,9.9956
2016-06-13,9.8762
2016-06-14,9.7807
2016-06-15,9.9081
2016-06-16,9.9319
2016-06-17,9.9399
2016-06-20,9.9877
2016-06-21,10.1389
2016-06-22,10.1309
2016-06-23,10.2742
2016-06-24,10.0513
2016-06-27,9.7091
2016-06-28,10.0672
2016-06-29,10.1389
2016-06-30,10.1229
2016-07-01,10.1548
2016-07-05,10.0991
2016-07-06,10.0434
2016-07-07,9.9877
2016-07-08,10.1229
2016-07-11,10.115
2016-07-12,10.2821
2016-07-13,10.1866
2016-07-14,10.2662
2016-07-15,10.2503
2016-07-18,10.2423
2016-07-19,10.2344
2016-07-20,10.306
2016-07-21,10.2622
2016-07-22,10.2742
2016-07-25,10.2344
2016-07-26,10.1548
2016-07-27,10.1229
2016-07-28,10.115
2016-07-29,10.2105
2016-08-01,10.0274
2016-08-02,10.0274
2016-08-03,10.2184
2016-08-04,10.2184
2016-08-05,10.2145
2016-08-08,10.298
2016-08-09,10.2699
2016-08-10,10.1807
2016-08-11,10.2212
2016-08-12,10.2942
2016-08-15,10.3064
2016-08-16,10.3267
2016-08-17,10.2861
2016-08-18,10.3916
2016-08-19,10.3104
2016-08-22,10.2293
2016-08-23,10.2455
2016-08-24,10.1807
2016-08-25,10.1807
2016-08-26,10.1725
2016-08-29,10.2293
2016-08-30,10.2131
2016-08-31,10.1644
2016-09-01,10.1969
2016-09-02,10.2293
2016-09-06,10.3023
2016-09-07,10.3267
2016-09-08,10.3348
2016-09-09,10.1644
2016-09-12,10.132
2016-09-13,9.7913
2016-09-14,9.8481
2016-09-15,9.7994
2016-09-16,9.8318
2016-09-19,9.9697
2016-09-20,9.9211
2016-09-21,10.132
2016-09-22,10.2293
2016-09-23,10.205
2016-09-26,10.1888
2016-09-27,10.059
2016-09-28,10.3104
2016-09-29,10.2455
2016-09-30,10.2942
2016-10-03,10.2374
2016-10-04,10.132
2016-10-05,10.2212
2016-10-06,10.1239
2016-10-07,10.132
2016-10-10,10.2618
2016-10-11,10.2131
2016-10-12,10.205
2016-10-13,10.1888
2016-10-14,10.1482
2016-10-17,10.1807
2016-10-18,10.2293
2016-10-19,10.2942
2016-10-20,10.2861
2016-10-21,10.2699
2016-10-24,10.2537
2016-10-25,10.1644
2016-10-26,10.1482
2016-10-27,10.1239
2016-10-28,10.0914
2016-10-31,9.9211
2016-11-01,9.8643
2016-11-02,9.775
2016-11-03,9.6939
2016-11-04,9.6209
2016-11-07,9.6858
2016-11-08,9.7183
2016-11-09,9.9997
2016-11-10,10.1073
2016-11-11,9.9666
2016-11-14,10.0908
2016-11-15,10.1818
2016-11-16,10.0328
2016-11-17,10.1322
2016-11-18,10.1653
2016-11-21,10.1653
2016-11-22,10.1653
2016-11-23,10.1901
2016-11-25,10.1239
2016-11-28,9.9583
2016-11-29,9.8838
2016-11-30,10.2315
2016-12-01,10.0328
2016-12-02,10.099
2016-12-05,10.0494
2016-12-06,10.0245
2016-12-07,10.0908
2016-12-08,10.157
2016-12-09,10.1239
2016-12-12,10.1984
2016-12-13,10.1984
2016-12-14,10.0659
2016-12-15,10.1487
2016-12-16,10.2729
2016-12-19,10.2232
2016-12-20,10.306
2016-12-21,10.3474
2016-12-22,10.4716
2016-12-23,10.5295
2016-12-27,10.5212
2016-12-28,10.4716
2016-12-29,10.4384
2016-12-30,10.4302
2017-01-03,10.5461
2017-01-04,10.5792
2017-01-05,10.5957
2017-01-06,10.604
2017-01-09,10.5461
2017-01-10,10.455
2017-01-11,10.5461
2017-01-12,10.5129
2017-01-13,10.5543
2017-01-17,10.5792
2017-01-18,10.5212
2017-01-19,10.4881
2017-01-20,10.5129
2017-01-23,10.5047
2017-01-24,10.6619
2017-01-25,10.8109
2017-01-26,10.9351
2017-01-27,10.8937
2017-01-30,10.753
2017-01-31,10.7696
2017-02-01,10.9186
2017-02-02,10.9351
2017-02-03,11.0013
2017-02-06,11.0013
2017-02-07,10.9434
2017-02-08,10.9308
2017-02-09,10.9308
2017-02-10,10.9813
2017-02-13,10.9729
2017-02-14,11.0318
2017-02-15,11.0318
2017-02-16,10.9897
2017-02-17,10.9308
2017-02-21,10.9981
2017-02-22,10.9139
2017-02-23,10.8802
2017-02-24,10.796
2017-02-27,10.7708
2017-02-28,10.8297
2017-03-01,10.9223
2017-03-02,10.9139
2017-03-03,10.9223
2017-03-06,10.9223
2017-03-07,10.8971
2017-03-08,10.7539
2017-03-09,10.6781
2017-03-10,10.6781
2017-03-13,10.7118
2017-03-14,10.5939
2017-03-15,10.7202
2017-03-16,10.6865
2017-03-17,10.6108
2017-03-20,10.6162
2017-03-21,10.535
2017-03-22,10.5097
2017-03-23,10.5602
2017-03-24,10.5686
2017-03-27,10.5181
2017-03-28,10.5771
2017-03-29,10.6444
2017-03-30,10.6276
2017-03-31,10.7034
2017-04-03,10.7034
2017-04-04,10.7455
2017-04-05,10.7034
2017-04-06,10.7792
2017-04-07,10.7623
2017-04-10,10.7455
2017-04-11,10.7202
2017-04-12,10.6697
2017-04-13,10.6276
2017-04-17,10.6276
2017-04-18,10.636
2017-04-19,10.5939
2017-04-20,10.6192
2017-04-21,10.5771
2017-04-24,10.636
2017-04-25,10.7202
2017-04-26,10.6865
2017-04-27,10.5686
2017-04-28,10.6108
2017-05-01,10.6276
2017-05-02,10.5939
2017-05-03,10.535
2017-05-04,10.3076
2017-05-05,10.476
2017-05-08,10.476
2017-05-09,10.4086
2017-05-10,10.5329
2017-05-11,10.4901
2017-05-12,10.4901
2017-05-15,10.5415
2017-05-16,10.5158
2017-05-17,10.3958
2017-05-18,10.3872
2017-05-19,10.4986
2017-05-22,10.5329
2017-05-23,10.5843
2017-05-24,10.5501
2017-05-25,10.4558
2017-05-26,10.4472
2017-05-30,10.3015
2017-05-31,10.2844
2017-06-01,10.2929
2017-06-02,10.233
2017-06-05,10.2415
2017-06-06,10.2758
2017-06-07,10.1301
2017-06-08,10.053
2017-06-09,10.1473
2017-06-12,10.1473
2017-06-13,10.1473
2017-06-14,9.933
2017-06-15,9.7873
2017-06-16,9.9244
2017-06-19,9.8473
2017-06-20,9.573
2017-06-21,9.4788
2017-06-22,9.5988
2017-06-23,9.8301
2017-06-26,10.0187
2017-06-27,9.933
2017-06-28,10.0873
2017-06-29,10.1215
2017-06-30,10.2501
2017-07-03,10.3272
2017-07-05,10.1987
2017-07-06,10.2072
2017-07-07,10.2244
2017-07-10,10.173
2017-07-11,10.1901
2017-07-12,10.2415
2017-07-13,10.2415
2017-07-14,10.3272
2017-07-17,10.3444
2017-07-18,10.3529
2017-07-19,10.3701
2017-07-20,10.2415
2017-07-21,10.1987
2017-07-24,10.2501
2017-07-25,10.2758
2017-07-26,10.2844
2017-07-27,10.2587
2017-07-28,10.2672
2017-07-31,10.2844
2017-08-01,10.1301
2017-08-02,10.3101
2017-08-03,10.1815
2017-08-04,10.1301
2017-08-07,10.0958
2017-08-08,9.7616
2017-08-09,9.8533
2017-08-10,9.7397
2017-08-11,9.6786
2017-08-14,9.6786
2017-08-15,9.4602
2017-08-16,9.3991
2017-08-17,9.3729
2017-08-18,9.3467
2017-08-21,9.2069
2017-08-22,9.3467
2017-08-23,9.4952
2017-08-24,9.4952
2017-08-25,9.5301
2017-08-28,9.4864
2017-08-29,9.4952
2017-08-30,9.565
2017-08-31,9.7834
2017-09-01,9.8271
2017-09-05,9.766
2017-09-06,9.8009
2017-09-07,9.766
2017-09-08,9.7048
2017-09-11,9.7922
2017-09-12,9.7922
2017-09-13,9.8882
2017-09-14,9.9232
2017-09-15,9.8446
2017-09-18,9.8795
2017-09-19,9.8009
2017-09-20,9.7834
2017-09-21,9.7135
2017-09-22,9.7048
2017-09-25,9.9145
2017-09-26,9.9057
2017-09-27,9.8184
2017-09-28,9.7834
2017-09-29,9.8009
2017-10-02,9.862
2017-10-03,9.8795
2017-10-04,9.897
2017-10-05,9.9843
2017-10-06,9.9581
2017-10-09,9.9057
2017-10-10,9.9145
2017-10-11,9.9669
2017-10-12,9.8708
2017-10-13,9.766
2017-10-16,9.7048
2017-10-17,9.6175
2017-10-18,9.469
2017-10-19,9.5388
2017-10-20,9.434
2017-10-23,9.2855
2017-10-24,9.2418
2017-10-25,9.0147
2017-10-26,9.1632
2017-10-27,9.303
2017-10-30,9.3816
2017-10-31,9.3641
2017-11-01,9.5214
2017-11-02,9.3292
2017-11-03,9.4078
2017-11-06,9.5388
2017-11-07,9.6087
2017-11-08,9.469
2017-11-09,9.4647
2017-11-10,9.4024
2017-11-13,9.1976
2017-11-14,9.0373
2017-11-15,9.1174
2017-11-16,9.1085
2017-11-17,9.1441
2017-11-20,9.1263
2017-11-21,9.0017
2017-11-22,9.0729
2017-11-24,9.0462
2017-11-27,8.9127
2017-11-28,8.8859
2017-11-29,8.8147
2017-11-30,9.2332
2017-12-01,9.3667
2017-12-04,9.3222
2017-12-05,9.2599
2017-12-06,9.0818
2017-12-07,9.2599
2017-12-08,9.2599
2017-12-11,9.4736
2017-12-12,9.5537
2017-12-13,9.625
2017-12-14,9.6784
2017-12-15,9.5804
2017-12-18,9.6606
2017-12-19,9.5715
2017-12-20,9.5626
2017-12-21,9.5359
2017-12-22,9.6517
2017-12-26,9.6695
2017-12-27,9.6071
2017-12-28,9.6517
2017-12-29,9.6071
2018-01-02,9.8475
2018-01-03,10.0879
2018-01-04,10.177
2018-01-05,10.1058
2018-01-08,10.1325
2018-01-09,10.1592
2018-01-10,10.2126
2018-01-11,10.3551
2018-01-12,10.4708
2018-01-16,10.3996
2018-01-17,10.3373
2018-01-18,10.2749
2018-01-19,10.3194
2018-01-22,10.5064
2018-01-23,10.5064
2018-01-24,10.4708
2018-01-25,10.4797
2018-01-26,10.5331
2018-01-29,10.2838
2018-01-30,10.2037
2018-01-31,10.1503
2018-02-01,10.2215
2018-02-02,9.9455
2018-02-05,9.803
2018-02-06,9.9989
2018-02-07,9.9188
2018-02-08,9.5619
2018-02-09,9.5165
2018-02-12,9.707
2018-02-13,9.8431
2018-02-14,9.834
2018-02-15,9.7343
2018-02-16,9.6254
2018-02-20,9.6254
2018-02-21,9.453
2018-02-22,9.3442
2018-02-23,9.4077
2018-02-26,9.4349
2018-02-27,9.3714
2018-02-28,9.1627
2018-03-01,9.2262
2018-03-02,9.2081
2018-03-05,9.2625
2018-03-06,9.2081
2018-03-07,9.1536
2018-03-08,9.0901
2018-03-09,9.2625
2018-03-12,9.4712
2018-03-13,9.4621
2018-03-14,9.3079
2018-03-15,8.8361
2018-03-16,8.9722
2018-03-19,8.6365
2018-03-20,8.573
2018-03-21,8.7363
2018-03-22,8.5095
2018-03-23,8.446
2018-03-26,8.4732
2018-03-27,8.3825
2018-03-28,8.3916
2018-03-29,8.5005
2018-04-02,8.437
2018-04-03,8.5005
2018-04-04,8.4823
2018-04-05,8.6093
2018-04-06,8.4823
2018-04-09,8.5005
2018-04-10,8.7273
2018-04-11,8.8543
2018-04-12,8.7908
2018-04-13,8.7908
2018-04-16,9.1627
2018-04-17,9.2988
2018-04-18,9.2534
2018-04-19,9.0992
2018-04-20,9.0901
2018-04-23,9.2988
2018-04-24,9.1174
2018-04-25,9.1899
2018-04-26,9.1536
2018-04-27,9.1536
2018-04-30,9.1627
2018-05-01,9.2262
2018-05-02,9.1174
2018-05-03,9.0176
2018-05-04,9.1174
2018-05-07,9.1809
2018-05-08,9.2534
2018-05-09,9.3079
2018-05-10,9.3232
2018-05-11,9.314
2018-05-14,9.5362
2018-05-15,9.4529
2018-05-16,9.564
2018-05-17,9.6473
2018-05-18,9.6195
2018-05-21,9.6751
2018-05-22,9.6751
2018-05-23,9.6195
2018-05-24,9.4251
2018-05-25,9.3695
2018-05-29,9.3788
2018-05-30,9.5454
2018-05-31,9.5825
2018-06-01,9.6288
2018-06-04,9.7306
2018-06-05,9.7584
2018-06-06,9.6936
2018-06-07,9.7584
2018-06-08,9.6936
2018-06-11,9.8417
2018-06-12,9.8695
2018-06-13,9.7306
2018-06-14,9.6843
2018-06-15,9.4343
2018-06-18,9.564
2018-06-19,9.5177
2018-06-20,9.5825
2018-06-21,9.5084
2018-06-22,9.601
2018-06-25,9.351
2018-06-26,9.5547
2018-06-27,9.351
2018-06-28,9.351
2018-06-29,9.351
2018-07-02,9.3232
2018-07-03,9.3695
2018-07-05,9.4251
2018-07-06,9.4529
2018-07-09,9.4899
2018-07-10,9.4806
2018-07-11,9.4066
2018-07-12,9.5084
2018-07-13,9.564
2018-07-16,9.4899
2018-07-17,9.4529
2018-07-18,9.5917
2018-07-19,9.8139
2018-07-20,9.7121
2018-07-23,9.7676
2018-07-24,9.7769
2018-07-25,9.9621
2018-07-26,10.0732
2018-07-27,9.8602
2018-07-30,10.0176
2018-07-31,10.1287
2018-08-01,10.1009
2018-08-02,10.3324
2018-08-03,10.3694
2018-08-06,10.4435
2018-08-07,10.4157
2018-08-08,10.5083
2018-08-09,10.5617
2018-08-10,10.4957
2018-08-13,10.4674
2018-08-14,10.4108
2018-08-15,10.2788
2018-08-16,10.3637
2018-08-17,10.4674
2018-08-20,10.5711
2018-08-21,10.458
2018-08-22,10.5523
2018-08-23,10.4957
2018-08-24,10.524
2018-08-27,10.4957
2018-08-28,10.3637
2018-08-29,10.3071
2018-08-30,10.2788
2018-08-31,10.2316
2018-09-04,10.2882
2018-09-05,10.3542
2018-09-06,10.2505
2018-09-07,10.2505
2018-09-10,10.2694
2018-09-11,10.3448
2018-09-12,10.3448
2018-09-13,10.3071
2018-09-14,10.2788
2018-09-17,10.2222
2018-09-18,10.2411
2018-09-19,10.1656
2018-09-20,10.2128
2018-09-21,10.2128
2018-09-24,10.0808
2018-09-25,10.0147
2018-09-26,9.9299
2018-09-27,9.9959
2018-09-28,10.0713
2018-10-01,10.2411
2018-10-02,10.2033
2018-10-03,10.2599
2018-10-04,10.2222
2018-10-05,10.2033
2018-10-08,10.1845
2018-10-09,10.3071
2018-10-10,10.109
2018-10-11,9.9393
2018-10-12,9.9582
2018-10-15,9.9487
2018-10-16,10.0713
2018-10-17,9.9487
2018-10-18,9.9204
2018-10-19,9.9016
2018-10-22,9.8544
2018-10-23,9.713
2018-10-24,9.3924
2018-10-25,9.4584
2018-10-26,9.2415
2018-10-29,9.1849
2018-10-30,9.3263
2018-10-31,9.2603
2018-11-01,9.3358
2018-11-02,9.2509
2018-11-05,9.4772
2018-11-06,9.4867
2018-11-07,9.6187
2018-11-08,9.6295
2018-11-09,9.543
2018-11-12,9.3797
2018-11-13,9.2163
2018-11-14,9.1779
2018-11-15,9.2932
2018-11-16,9.3316
2018-11-19,9.2932
2018-11-20,9.0241
2018-11-21,9.2163
2018-11-23,9.0337
2018-11-26,9.1106
2018-11-27,9.0433
2018-11-28,9.1586
2018-11-29,9.2644
2018-11-30,9.1779
2018-12-03,9.4662
2018-12-04,9.1875
2018-12-06,9.1106
2018-12-07,9.0914
2018-12-10,8.9472
2018-12-11,8.9857
2018-12-12,9.0721
2018-12-13,9.2644
2018-12-14,9.1298
2018-12-17,8.8895
2018-12-18,8.6397
2018-12-19,8.7454
2018-12-20,8.5051
2018-12-21,8.3802
2018-12-24,7.9958
2018-12-26,8.4283
2018-12-27,8.3321
2018-12-28,8.3033
2018-12-31,8.3898
2019-01-02,8.5436
2019-01-03,8.5916
2019-01-04,9.0721
2019-01-07,9.1875
2019-01-08,9.4181
2019-01-09,9.5238
2019-01-10,9.3701
2019-01-11,9.2451
2019-01-14,9.1682
2019-01-15,9.3316
2019-01-16,9.3508
2019-01-17,9.3508
2019-01-18,9.4758
2019-01-22,9.2163
2019-01-23,9.2451
2019-01-24,9.2932
2019-01-25,9.3989
2019-01-28,9.3124
2019-01-29,9.4277
2019-01-30,9.5719
2019-01-31,9.4566
2019-02-01,9.5527
2019-02-04,9.6199
2019-02-05,9.6392
2019-02-06,9.5238
2019-02-07,9.322
2019-02-08,9.274
2019-02-11,9.274
2019-02-12,9.4277
2019-02-13,9.5527
2019-02-14,9.6654
2019-02-15,9.7144
2019-02-19,9.8811
2019-02-20,9.783
2019-02-21,9.6654
2019-02-22,9.6458
2019-02-25,9.7144
2019-02-26,9.587
2019-02-27,9.5674
2019-02-28,9.4987
2019-03-01,9.5576
2019-03-04,9.5772
2019-03-05,9.5772
2019-03-06,9.4595
2019-03-07,9.6262
2019-03-08,9.5674
2019-03-11,9.7046
2019-03-12,9.6948
2019-03-13,9.6948
2019-03-14,9.6948
2019-03-15,9.6948
2019-03-18,9.8124
2019-03-19,9.8712
2019-03-20,9.9007
2019-03-21,9.9987
2019-03-22,9.8614
2019-03-25,9.7634
2019-03-26,9.8222
2019-03-27,9.7438
2019-03-28,9.7928
2019-03-29,9.832
2019-04-01,9.9497
2019-04-02,9.9595
2019-04-03,9.9399
2019-04-04,9.9105
2019-04-05,9.9497
2019-04-08,9.9301
2019-04-09,9.8614
2019-04-10,9.8222
2019-04-11,9.8712
2019-04-12,9.9399
2019-04-15,9.9399
2019-04-16,9.8614
2019-04-17,9.783
2019-04-18,9.7438
2019-04-22,9.8712
2019-04-23,9.8909
2019-04-24,9.7928
2019-04-25,9.7634
2019-04-26,9.7634
2019-04-29,9.8026
2019-04-30,9.7438
2019-05-01,9.7536
2019-05-02,9.587
2019-05-03,9.7046
2019-05-06,9.6654
2019-05-07,9.6948
2019-05-08,9.685
2019-05-09,9.57
2019-05-10,9.91
2019-05-13,9.79
2019-05-14,9.86
2019-05-15,9.99
2019-05-16,10
2019-05-17,10
2019-05-20,9.97
2019-05-21,10.07
2019-05-22,10.03
2019-05-23,9.88
2019-05-24,9.87
2019-05-28,9.78
2019-05-29,9.76
2019-05-30,9.66
2019-05-31,9.64
2019-06-03,9.68
2019-06-04,9.8
2019-06-05,9.73
2019-06-06,9.75
2019-06-07,9.75
2019-06-10,9.76
2019-06-11,9.78
2019-06-12,9.74
2019-06-13,9.835
2019-06-14,9.73
2019-06-17,9.695
2019-06-18,9.715
2019-06-19,9.705
2019-06-20,9.74
2019-06-21,9.825
2019-06-24,9.765
2019-06-25,9.71
2019-06-26,9.78
2019-06-27,9.735
2019-06-28,9.83
2019-07-01,9.89
2019-07-02,9.885
2019-07-03,9.995
2019-07-04,9.995
2019-07-05,10.055
2019-07-08,10.015
2019-07-09,9.965
2019-07-10,10.105
2019-07-11,10.12
2019-07-12,10.13
2019-07-15,10.11
2019-07-16,10.095
2019-07-17,10.05
2019-07-18,9.97
2019-07-19,10.005
2019-07-22,10.115
2019-07-23,10.1
2019-07-24,10.115
2019-07-25,10.05
2019-07-26,9.975
2019-07-29,9.845
2019-07-30,9.835
2019-07-31,9.815
2019-08-01,9.68
2019-08-02,9.645
2019-08-05,9.385
2019-08-06,9.335
2019-08-07,9.195
2019-08-08,9.085
2019-08-09,9.055
2019-08-12,8.955
2019-08-13,9.01
2019-08-14,8.865
2019-08-15,8.845
2019-08-16,8.985
2019-08-19,9.105
2019-08-20,9.145
2019-08-21,9.155
2019-08-22,9.055
2019-08-23,8.83
2019-08-26,8.815
2019-08-27,8.76
2019-08-28,8.985
2019-08-29,9.085
2019-08-30,9.105
2019-09-02,9.095
2019-09-03,9.025
2019-09-04,9.07
2019-09-05,9.105
2019-09-06,9.025
2019-09-09,9.145
2019-09-10,9.185
2019-09-11,9.225
2019-09-12,9.175
2019-09-13,9.34
2019-09-16,9.445
2019-09-17,9.46
2019-09-18,9.465
2019-09-19,9.455
2019-09-20,9.46
2019-09-23,9.415
2019-09-24,9.31
2019-09-25,9.245
2019-09-26,9.165
2019-09-27,9.125
2019-09-30,9.17
2019-10-01,9.095
2019-10-02,8.985
2019-10-03,9.03
2019-10-04,9.045
2019-10-07,8.945
2019-10-08,8.845
2019-10-09,8.755
2019-10-10,8.77
2019-10-11,8.795
2019-10-14,8.725
2019-10-15,8.815
2019-10-16,8.71
2019-10-17,8.685
2019-10-18,8.725
2019-10-21,8.715
2019-10-22,8.705
2019-10-23,8.68
2019-10-24,8.665
2019-10-25,8.715
2019-10-28,8.58
2019-10-29,8.56
2019-10-30,8.545
2019-10-31,8.515
2019-11-01,8.615
2019-11-04,8.72
