date,close
2014-06-13,25.6244
2014-06-16,25.7942
2014-06-17,25.7612
2014-06-18,26.2093
2014-06-19,27.082
2014-06-20,27.3368
2014-06-23,26.8981
2014-06-24,26.799
2014-06-25,26.6811
2014-06-26,27.4028
2014-06-27,27.6717
2014-06-30,27.7755
2014-07-01,28.1529
2014-07-02,28.1151
2014-07-03,28.5161
2014-07-07,28.384
2014-07-08,28.1953
2014-07-09,28.3227
2014-07-10,27.7189
2014-07-11,27.6151
2014-07-14,27.7896
2014-07-15,27.8368
2014-07-16,28.0774
2014-07-17,28.2897
2014-07-18,28.2897
2014-07-21,28.1293
2014-07-22,28.5774
2014-07-23,28.3321
2014-07-24,28.7425
2014-07-25,28.9501
2014-07-28,28.8557
2014-07-29,28.6057
2014-07-30,28.6057
2014-07-31,27.6245
2014-08-01,27.7519
2014-08-04,27.8227
2014-08-05,27.5396
2014-08-06,27.6623
2014-08-07,27.4028
2014-08-08,27.4123
2014-08-11,27.5679
2014-08-12,27.1227
2014-08-13,27.0424
2014-08-14,27.1936
2014-08-15,26.9148
2014-08-18,27.1322
2014-08-19,27.463
2014-08-20,27.2976
2014-08-21,27.2929
2014-08-22,27.2503
2014-08-25,27.359
2014-08-26,27.3449
2014-08-27,27.3307
2014-08-28,27.2645
2014-08-29,27.0849
2014-09-02,26.6879
2014-09-03,26.5745
2014-09-04,26.8864
2014-09-05,26.8675
2014-09-08,26.7541
2014-09-09,26.6501
2014-09-10,26.6312
2014-09-11,26.3524
2014-09-12,26.2201
2014-09-15,25.7427
2014-09-16,25.8892
2014-09-17,25.8183
2014-09-18,26.2673
2014-09-19,25.8751
2014-09-22,25.9459
2014-09-23,25.7711
2014-09-24,25.9932
2014-09-25,25.686
2014-09-26,25.9081
2014-09-29,25.8467
2014-09-30,25.8609
2014-10-01,25.3268
2014-10-02,25.4024
2014-10-03,25.5726
2014-10-06,25.6955
2014-10-07,25.6104
2014-10-08,26.135
2014-10-09,26.4375
2014-10-10,26.4564
2014-10-13,26.4611
2014-10-14,26.1681
2014-10-15,25.7333
2014-10-16,26.0641
2014-10-17,26.0688
2014-10-20,26.3051
2014-10-21,27.3543
2014-10-22,27.411
2014-10-23,27.3354
2014-10-24,27.4394
2014-10-27,27.4914
2014-10-28,27.9309
2014-10-29,27.6946
2014-10-30,27.3496
2014-10-31,28.1814
2014-11-03,27.7607
2014-11-04,27.6473
2014-11-05,27.6331
2014-11-06,27.4394
2014-11-07,27.7985
2014-11-10,27.5055
2014-11-11,27.6331
2014-11-12,27.5481
2014-11-13,27.3496
2014-11-14,27.9356
2014-11-17,28.1057
2014-11-18,27.6001
2014-11-19,27.5386
2014-11-20,27.3165
2014-11-21,27.3543
2014-11-24,27.4016
2014-11-25,27.4583
2014-11-26,27.3543
2014-11-28,27.5528
2014-12-01,27.652
2014-12-02,27.9687
2014-12-03,27.5386
2014-12-04,25.0244
2014-12-05,25.8703
2014-12-08,25.3363
2014-12-09,25.4781
2014-12-10,25.842
2014-12-11,26.3618
2014-12-12,26.6643
2014-12-15,26.2295
2014-12-16,26.6843
2014-12-17,26.798
2014-12-18,27.3332
2014-12-19,26.779
2014-12-22,27.0253
2014-12-23,27.0727
2014-12-24,27.1722
2014-12-26,27.1911
2014-12-29,27.0253
2014-12-30,26.779
2014-12-31,26.7885
2015-01-02,26.49
2015-01-05,25.8032
2015-01-06,25.5237
2015-01-07,25.9074
2015-01-08,26.7222
2015-01-09,26.3006
2015-01-12,26.3337
2015-01-13,26.3242
2015-01-14,25.9026
2015-01-15,25.7416
2015-01-16,26.1111
2015-01-20,26.7506
2015-01-21,26.5279
2015-01-22,27.4233
2015-01-23,27.4185
2015-01-26,27.7454
2015-01-27,27.788
2015-01-28,27.7454
2015-01-29,27.7454
2015-01-30,27.6506
2015-02-02,28.4465
2015-02-03,28.0201
2015-02-04,27.627
2015-02-05,27.7738
2015-02-06,27.5748
2015-02-09,27.8875
2015-02-10,27.5985
2015-02-11,27.5512
2015-02-12,28.0675
2015-02-13,28.1765
2015-02-17,27.9891
2015-02-18,27.8089
2015-02-19,27.8089
2015-02-20,28.1931
2015-02-23,28.6056
2015-02-24,28.6009
2015-02-25,28.857
2015-02-26,28.8949
2015-02-27,28.8428
2015-03-02,28.7289
2015-03-03,28.4871
2015-03-04,28.3828
2015-03-05,28.5487
2015-03-06,28.1883
2015-03-09,28.1978
2015-03-10,27.6619
2015-03-11,27.6524
2015-03-12,27.9085
2015-03-13,27.6904
2015-03-16,27.899
2015-03-17,28.046
2015-03-18,28.5108
2015-03-19,28.2595
2015-03-20,28.3164
2015-03-23,28.5013
2015-03-24,28.9044
2015-03-25,28.7337
2015-03-26,28.563
2015-03-27,28.3258
2015-03-30,28.1409
2015-03-31,27.9986
2015-04-01,28.3211
2015-04-02,28.7858
2015-04-06,29.1083
2015-04-07,29.2032
2015-04-08,29.1747
2015-04-09,29.2506
2015-04-10,29.592
2015-04-13,29.4782
2015-04-14,30.3888
2015-04-15,30.4362
2015-04-16,30.4077
2015-04-17,30.1137
2015-04-20,30.0473
2015-04-21,29.7723
2015-04-22,30.256
2015-04-23,30.1801
2015-04-24,30.256
2015-04-27,30.2939
2015-04-28,30.237
2015-04-29,30.218
2015-04-30,30.0758
2015-05-01,30.0283
2015-05-04,30.4741
2015-05-05,29.6964
2015-05-06,29.6774
2015-05-07,29.7533
2015-05-08,29.8292
2015-05-11,29.7438
2015-05-12,29.63
2015-05-13,29.3929
2015-05-14,31.1191
2015-05-15,30.825
2015-05-18,30.8725
2015-05-19,30.9199
2015-05-20,30.6164
2015-05-21,30.3034
2015-05-22,30.3081
2015-05-26,29.7854
2015-05-27,30.2606
2015-05-28,30.2511
2015-05-29,30.0895
2015-06-01,30.2321
2015-06-02,30.6598
2015-06-03,31.3726
2015-06-04,30.9449
2015-06-05,31.0399
2015-06-08,30.6408
2015-06-09,30.8594
2015-06-10,30.9924
2015-06-11,30.7643
2015-06-12,30.5647
2015-06-15,31.173
2015-06-16,31.6862
2015-06-17,31.7432
2015-06-18,31.6862
2015-06-19,31.3441
2015-06-22,31.6672
2015-06-23,31.8668
2015-06-24,31.9808
2015-06-25,32.0854
2015-06-26,32.3325
2015-06-29,31.6577
2015-06-30,31.5912
2015-07-01,31.9523
2015-07-02,32.2089
2015-07-06,31.9238
2015-07-07,31.9523
2015-07-08,31.0494
2015-07-09,31.3536
2015-07-10,31.8478
2015-07-13,32.4845
2015-07-14,32.9217
2015-07-15,31.8478
2015-07-16,31.7432
2015-07-17,31.9238
2015-07-20,32.4845
2015-07-21,32.456
2015-07-22,32.3895
2015-07-23,32.399
2015-07-24,31.9808
2015-07-27,31.7242
2015-07-28,32.5891
2015-07-29,32.2754
2015-07-30,33.3494
2015-07-31,30.6788
2015-08-03,30.6218
2015-08-04,31.116
2015-08-05,31.3155
2015-08-06,31.1255
2015-08-07,31.1635
2015-08-10,30.6408
2015-08-11,30.5647
2015-08-12,30.4362
2015-08-13,30.4647
2015-08-14,30.76
2015-08-17,30.379
2015-08-18,30.2838
2015-08-19,30.2648
2015-08-20,30.0076
2015-08-21,29.0934
2015-08-24,28.1887
2015-08-25,28.103
2015-08-26,28.941
2015-08-27,29.2743
2015-08-28,29.2172
2015-08-31,29.8838
2015-09-01,29.1124
2015-09-02,29.1029
2015-09-03,29.1505
2015-09-04,28.7791
2015-09-08,29.1791
2015-09-09,28.9696
2015-09-10,29.1029
2015-09-11,28.941
2015-09-14,28.522
2015-09-15,28.5601
2015-09-16,29.8267
2015-09-17,29.7124
2015-09-18,29.341
2015-09-21,29.4648
2015-09-22,28.722
2015-09-23,28.741
2015-09-24,28.9029
2015-09-25,28.8267
2015-09-28,28.4077
2015-09-29,28.2744
2015-09-30,28.722
2015-10-01,28.6649
2015-10-02,28.7029
2015-10-05,29.2553
2015-10-06,28.3125
2015-10-07,28.2363
2015-10-08,29.0648
2015-10-09,28.8172
2015-10-12,29.5315
2015-10-13,29.76
2015-10-14,29.3315
2015-10-15,29.0458
2015-10-16,28.9696
2015-10-19,28.5696
2015-10-20,28.7315
2015-10-21,27.9792
2015-10-22,28.303
2015-10-23,27.5506
2015-10-26,25.7793
2015-10-27,25.8269
2015-10-28,26.3412
2015-10-29,27.484
2015-10-30,27.3602
2015-11-02,27.4268
2015-11-03,27.7887
2015-11-04,27.7221
2015-11-05,27.4745
2015-11-06,27.1411
2015-11-09,26.6364
2015-11-10,26.5888
2015-11-11,26.2364
2015-11-12,27.4649
2015-11-13,27.1697
2015-11-16,28.0744
2015-11-17,28.0173
2015-11-18,28.9315
2015-11-19,28.5411
2015-11-20,28.9315
2015-11-23,28.9506
2015-11-24,29.4802
2015-11-25,29.7856
2015-11-27,29.6425
2015-11-30,29.5757
2015-12-01,29.881
2015-12-02,29.8142
2015-12-03,29.6806
2015-12-04,30.0815
2015-12-07,29.757
2015-12-08,29.2989
2015-12-09,28.5449
2015-12-10,28.4018
2015-12-11,27.9628
2015-12-14,27.7433
2015-12-15,27.8483
2015-12-16,28.02
2015-12-17,27.5524
2015-12-18,27.5238
2015-12-21,27.1039
2015-12-22,27.3615
2015-12-23,27.7146
2015-12-24,27.6765
2015-12-28,27.4093
2015-12-29,27.7719
2015-12-30,27.4856
2015-12-31,27.1229
2016-01-04,26.808
2016-01-05,26.6935
2016-01-06,26.5694
2016-01-07,25.8632
2016-01-08,25.4242
2016-01-11,25.0902
2016-01-12,25.3765
2016-01-13,24.6798
2016-01-14,24.9756
2016-01-15,24.3839
2016-01-19,24.5271
2016-01-20,24.298
2016-01-21,24.7943
2016-01-22,25.5101
2016-01-25,24.5462
2016-01-26,24.0404
2016-01-27,23.9736
2016-01-28,24.0499
2016-01-29,24.0499
2016-02-01,24.2599
2016-02-02,23.5345
2016-02-03,24.0594
2016-02-04,23.8877
2016-02-05,22.9142
2016-02-08,21.8262
2016-02-09,21.6735
2016-02-10,22.1603
2016-02-11,21.9503
2016-02-12,22.4847
2016-02-16,22.752
2016-02-17,23.6109
2016-02-18,23.6109
2016-02-19,23.315
2016-02-22,23.7922
2016-02-23,23.4009
2016-02-24,24.2503
2016-02-25,24.1167
2016-02-26,24.8993
2016-02-29,24.6798
2016-03-01,25.596
2016-03-02,25.052
2016-03-03,25.1283
2016-03-04,25.4051
2016-03-07,26.0731
2016-03-08,26.0808
2016-03-09,26.4924
2016-03-10,26.7603
2016-03-11,27.8036
2016-03-14,27.8897
2016-03-15,27.6791
2016-03-16,27.861
2016-03-17,28.3778
2016-03-18,28.5788
2016-03-21,28.9425
2016-03-22,28.6171
2016-03-23,28.5022
2016-03-24,28.1577
2016-03-28,28.33
2016-03-29,28.6745
2016-03-30,28.8181
2016-03-31,29.2009
2016-04-01,29.5933
2016-04-04,29.0669
2016-04-05,28.6745
2016-04-06,29.1244
2016-04-07,28.7128
2016-04-08,28.3395
2016-04-11,28.665
2016-04-12,28.732
2016-04-13,28.9617
2016-04-14,29.0669
2016-04-15,29.2105
2016-04-18,29.1818
2016-04-19,29.3445
2016-04-20,29.1914
2016-04-21,29.3253
2016-04-22,29.2966
2016-04-25,29.6508
2016-04-26,30.2059
2016-04-27,30.1293
2016-04-28,29.6316
2016-04-29,29.7273
2016-05-02,29.9283
2016-05-03,29.622
2016-05-04,28.8947
2016-05-05,29.5646
2016-05-06,28.8659
2016-05-09,28.6267
2016-05-10,29.2679
2016-05-11,28.3874
2016-05-12,28.4735
2016-05-13,28.0716
2016-05-16,27.9376
2016-05-17,27.8877
2016-05-18,27.9548
2016-05-19,27.5902
2016-05-20,27.926
2016-05-23,27.8109
2016-05-24,28.166
2016-05-25,28.4251
2016-05-26,28.569
2016-05-27,29.0584
2016-05-31,28.6266
2016-06-01,28.7897
2016-06-02,28.7801
2016-06-03,28.8857
2016-06-06,28.9913
2016-06-07,29.2984
2016-06-08,29.1352
2016-06-09,29.0201
2016-06-10,28.4922
2016-06-13,27.8685
2016-06-14,27.7629
2016-06-15,27.7245
2016-06-16,27.4846
2016-06-17,27.6477
2016-06-20,27.9164
2016-06-21,27.6573
2016-06-22,27.5134
2016-06-23,27.7917
2016-06-24,26.429
2016-06-27,26.0355
2016-06-28,26.88
2016-06-29,27.619
2016-06-30,28.1468
2016-07-01,28.7609
2016-07-05,28.2619
2016-07-06,28.4443
2016-07-07,28.2907
2016-07-08,28.7897
2016-07-11,28.8953
2016-07-12,29.6726
2016-07-13,29.8646
2016-07-14,30.3444
2016-07-15,30.258
2016-07-18,30.1333
2016-07-19,30.1524
2016-07-20,30.1908
2016-07-21,30.0949
2016-07-22,30.1237
2016-07-25,29.8358
2016-07-26,29.759
2016-07-27,28.0124
2016-07-28,28.2715
2016-07-29,28.1276
2016-08-01,28.0124
2016-08-02,27.9548
2016-08-03,28.0508
2016-08-04,28.1468
2016-08-05,27.9452
2016-08-08,28.1563
2016-08-09,28.0774
2016-08-10,28.0678
2016-08-11,28.9338
2016-08-12,28.5778
2016-08-15,28.5874
2016-08-16,28.241
2016-08-17,28.1352
2016-08-18,28.751
2016-08-19,29.1166
2016-08-22,28.8472
2016-08-23,28.8761
2016-08-24,28.9531
2016-08-25,28.6644
2016-08-26,28.6644
2016-08-29,28.7606
2016-08-30,28.4431
2016-08-31,28.3661
2016-09-01,28.2699
2016-09-02,28.597
2016-09-06,28.8761
2016-09-07,28.9434
2016-09-08,28.8087
2016-09-09,28.0582
2016-09-12,28.2122
2016-09-13,27.1633
2016-09-14,26.9132
2016-09-15,26.8939
2016-09-16,26.4417
2016-09-19,26.5475
2016-09-20,26.2877
2016-09-21,26.7977
2016-09-22,27.3173
2016-09-23,27.2403
2016-09-26,26.8747
2016-09-27,27.1056
2016-09-28,27.2499
2016-09-29,26.7015
2016-09-30,26.8939
2016-10-03,26.7303
2016-10-04,26.2107
2016-10-05,26.509
2016-10-06,26.663
2016-10-07,26.4417
2016-10-10,26.4321
2016-10-11,26.3455
2016-10-12,26.509
2016-10-13,26.2492
2016-10-14,26.0857
2016-10-17,25.9125
2016-10-18,26.1338
2016-10-19,26.0472
2016-10-20,25.21
2016-10-21,25.3736
2016-10-24,25.4025
2016-10-25,24.777
2016-10-26,24.7193
2016-10-27,24.6808
2016-10-28,24.7482
2016-10-31,24.7001
2016-11-01,24.4306
2016-11-02,24.1901
2016-11-03,24.0458
2016-11-04,23.6897
2016-11-07,24.4403
2016-11-08,24.8733
2016-11-09,24.421
2016-11-10,24.2863
2016-11-11,24.2286
2016-11-14,25.4506
2016-11-15,25.7296
2016-11-16,25.4768
2016-11-17,25.5444
2016-11-18,25.3899
2016-11-21,25.7856
2016-11-22,26.1909
2016-11-23,26.3936
2016-11-25,26.4225
2016-11-28,26.7603
2016-11-29,26.7699
2016-11-30,26.2392
2016-12-01,26.3067
2016-12-02,26.5094
2016-12-05,26.0365
2016-12-06,26.3357
2016-12-07,26.6927
2016-12-08,26.712
2016-12-09,26.9436
2016-12-12,26.9822
2016-12-13,26.9629
2016-12-14,26.6541
2016-12-15,26.5962
2016-12-16,26.8568
2016-12-19,25.3803
2016-12-20,25.361
2016-12-21,25.5251
2016-12-22,25.0136
2016-12-23,24.6565
2016-12-27,24.7241
2016-12-28,24.56
2016-12-29,24.6469
2016-12-30,24.4828
2017-01-03,24.4732
2017-01-04,24.8978
2017-01-05,24.782
2017-01-06,24.5214
2017-01-09,24.3767
2017-01-10,24.7434
2017-01-11,24.1258
2017-01-12,24.0389
2017-01-13,23.9328
2017-01-17,24.2319
2017-01-18,24.3863
2017-01-19,24.0486
2017-01-20,24.203
2017-01-23,24.174
2017-01-24,24.2223
2017-01-25,24.975
2017-01-26,24.7434
2017-01-27,24.6469
2017-01-30,24.8592
2017-01-31,25.2548
2017-02-01,25.1583
2017-02-02,24.5118
2017-02-03,23.0739
2017-02-06,23.0642
2017-02-07,22.9484
2017-02-08,23.2283
2017-02-09,23.8073
2017-02-10,24.174
2017-02-13,24.1258
2017-02-14,24.2512
2017-02-15,24.1547
2017-02-16,23.9714
2017-02-17,24.1547
2017-02-21,24.2512
2017-02-22,23.8942
2017-02-23,24.3091
2017-02-24,24.6855
2017-02-27,24.3477
2017-02-28,24.4925
2017-03-01,25.139
2017-03-02,24.8688
2017-03-03,24.9557
2017-03-06,24.9074
2017-03-07,24.8237
2017-03-08,24.63
2017-03-09,24.6978
2017-03-10,24.8721
2017-03-13,24.7559
2017-03-14,25.0852
2017-03-15,25.5888
2017-03-16,25.5307
2017-03-17,25.5598
2017-03-20,25.4435
2017-03-21,24.9399
2017-03-22,24.7849
2017-03-23,25.0077
2017-03-24,25.337
2017-03-27,25.521
2017-03-28,25.7244
2017-03-29,25.9569
2017-03-30,25.9859
2017-03-31,26.1893
2017-04-03,25.676
2017-04-04,25.3176
2017-04-05,25.5598
2017-04-06,25.6469
2017-04-07,25.6179
2017-04-10,25.9278
2017-04-11,26.2377
2017-04-12,26.0925
2017-04-13,26.1409
2017-04-17,26.6251
2017-04-18,26.6929
2017-04-19,26.6445
2017-04-20,26.8867
2017-04-21,26.7995
2017-04-24,27.1191
2017-04-25,26.9738
2017-04-26,26.8576
2017-04-27,27.2063
2017-04-28,27.1578
2017-05-01,27.245
2017-05-02,27.3225
2017-05-03,26.7026
2017-05-04,27.6227
2017-05-05,27.8068
2017-05-08,27.6809
2017-05-09,27.6518
2017-05-10,28.0586
2017-05-11,27.6324
2017-05-12,27.0707
2017-05-15,27.4968
2017-05-16,26.9755
2017-05-17,26.4702
2017-05-18,26.5479
2017-05-19,26.9852
2017-05-22,27.2184
2017-05-23,27.2184
2017-05-24,27.1893
2017-05-25,27.5682
2017-05-26,27.7723
2017-05-30,27.7917
2017-05-31,28.1221
2017-06-01,28.54
2017-06-02,28.8024
2017-06-05,29.0064
2017-06-06,29.0939
2017-06-07,29.0356
2017-06-08,29.2494
2017-06-09,29.502
2017-06-12,29.6478
2017-06-13,29.813
2017-06-14,29.8907
2017-06-15,29.9004
2017-06-16,29.6866
2017-06-19,30.0267
2017-06-20,29.8032
2017-06-21,30.2114
2017-06-22,30.4349
2017-06-23,30.5126
2017-06-26,30.843
2017-06-27,30.5515
2017-06-28,29.8324
2017-06-29,29.8227
2017-06-30,29.8616
2017-07-03,29.9684
2017-07-05,29.9587
2017-07-06,29.434
2017-07-07,29.9587
2017-07-10,30.0267
2017-07-11,29.3951
2017-07-12,29.6575
2017-07-13,29.0356
2017-07-14,29.3368
2017-07-17,29.191
2017-07-18,29.1716
2017-07-19,29.3465
2017-07-20,29.4923
2017-07-21,29.4826
2017-07-24,29.3562
2017-07-25,29.5895
2017-07-26,29.8518
2017-07-27,29.3271
2017-07-28,29.2979
2017-07-31,29.2785
2017-08-01,29.1619
2017-08-02,29.1813
2017-08-03,29.191
2017-08-04,29.1425
2017-08-07,29.4145
2017-08-08,30.1239
2017-08-09,29.7255
2017-08-10,29.3174
2017-08-11,29.2785
2017-08-14,29.5992
2017-08-15,29.6318
2017-08-16,29.8268
2017-08-17,29.5051
2017-08-18,29.1152
2017-08-21,29.242
2017-08-22,29.5539
2017-08-23,29.5539
2017-08-24,29.8268
2017-08-25,30.0607
2017-08-28,30.1387
2017-08-29,30.051
2017-08-30,30.1679
2017-08-31,30.5091
2017-09-01,30.743
2017-09-05,30.2947
2017-09-06,30.7235
2017-09-07,30.6748
2017-09-08,30.6066
2017-09-11,30.8015
2017-09-12,30.5578
2017-09-13,30.2069
2017-09-14,29.6221
2017-09-15,29.973
2017-09-18,29.973
2017-09-19,30.1582
2017-09-20,30.0217
2017-09-21,30.2069
2017-09-22,29.9535
2017-09-25,29.7781
2017-09-26,30.012
2017-09-27,29.9827
2017-09-28,30.3434
2017-09-29,30.4896
2017-10-02,30.6456
2017-10-03,30.743
2017-10-04,30.9087
2017-10-05,30.6163
2017-10-06,30.7235
2017-10-09,29.8463
2017-10-10,29.9925
2017-10-11,30.3142
2017-10-12,30.2264
2017-10-13,30.2264
2017-10-16,30.1874
2017-10-17,30.2264
2017-10-18,30.5968
2017-10-19,30.5871
2017-10-20,30.8795
2017-10-23,30.6651
2017-10-24,30.6943
2017-10-25,30.4214
2017-10-26,30.1679
2017-10-27,30.2849
2017-10-30,30.2654
2017-10-31,29.8268
2017-11-01,28.5596
2017-11-02,28.4524
2017-11-03,28.2185
2017-11-06,28.6376
2017-11-07,28.8618
2017-11-08,28.9593
2017-11-09,29.2127
2017-11-10,29.4759
2017-11-13,29.4077
2017-11-14,29.3297
2017-11-15,29.2646
2017-11-16,29.7046
2017-11-17,29.9295
2017-11-20,30.4673
2017-11-21,30.6042
2017-11-22,30.6726
2017-11-24,30.7313
2017-11-27,30.7215
2017-11-28,31.1713
2017-11-29,31.0637
2017-11-30,31.0344
2017-12-01,31.2593
2017-12-04,30.4869
2017-12-05,30.6629
2017-12-06,30.79
2017-12-07,30.9073
2017-12-08,31.3962
2017-12-11,31.3082
2017-12-12,31.0931
2017-12-13,31.3864
2017-12-14,31.318
2017-12-15,30.8975
2017-12-18,31.1811
2017-12-19,31.4353
2017-12-20,31.4646
2017-12-21,31.4549
2017-12-22,31.6113
2017-12-26,31.67
2017-12-27,31.7384
2017-12-28,31.7482
2017-12-29,31.582
2018-01-02,31.5722
2018-01-03,31.3766
2018-01-04,31.6602
2018-01-05,31.7677
2018-01-08,31.9926
2018-01-09,31.758
2018-01-10,31.4646
2018-01-11,31.6504
2018-01-12,31.846
2018-01-16,31.3962
2018-01-17,31.5722
2018-01-18,32.0806
2018-01-19,32.7064
2018-01-22,32.814
2018-01-23,33.1171
2018-01-24,32.9704
2018-01-25,32.6086
2018-01-26,33.1366
2018-01-29,33.1171
2018-01-30,32.9313
2018-01-31,33.2148
2018-02-01,32.8433
2018-02-02,31.8655
2018-02-05,30.9953
2018-02-06,30.966
2018-02-07,31.7775
2018-02-08,30.614
2018-02-09,30.1446
2018-02-12,29.8709
2018-02-13,29.7926
2018-02-14,30.3989
2018-02-15,30.3402
2018-02-16,30.1642
2018-02-20,29.8709
2018-02-21,29.6655
2018-02-22,28.7464
2018-02-23,29.0984
2018-02-26,29.1962
2018-02-27,28.5802
2018-02-28,28.3064
2018-03-01,28.1109
2018-03-02,28.1402
2018-03-05,28.0131
2018-03-06,28.4335
2018-03-07,28.4159
2018-03-08,28.514
2018-03-09,28.8281
2018-03-12,28.4944
2018-03-13,28.3766
2018-03-14,28.357
2018-03-15,28.4159
2018-03-16,28.9852
2018-03-19,28.7496
2018-03-20,28.9557
2018-03-21,28.9557
2018-03-22,28.3962
2018-03-23,28.3962
2018-03-26,28.3472
2018-03-27,27.7091
2018-03-28,28.0723
2018-03-29,28.357
2018-04-02,27.9643
2018-04-03,28.5042
2018-04-04,28.8576
2018-04-05,28.9459
2018-04-06,28.5925
2018-04-09,28.7201
2018-04-10,28.9557
2018-04-11,28.8576
2018-04-12,29.0244
2018-04-13,28.73
2018-04-16,29.0048
2018-04-17,29.2011
2018-04-18,28.9459
2018-04-19,28.7005
2018-04-20,28.5631
2018-04-23,28.8379
2018-04-24,28.7594
2018-04-25,28.3668
2018-04-26,28.8281
2018-04-27,28.9459
2018-04-30,28.5925
2018-05-01,28.7496
2018-05-02,28.357
2018-05-03,29.5446
2018-05-04,28.0723
2018-05-07,28.3962
2018-05-08,28.7889
2018-05-09,28.249
2018-05-10,28.3275
2018-05-11,28.2097
2018-05-14,28.1999
2018-05-15,28.1999
2018-05-16,28.3398
2018-05-17,28.399
2018-05-18,28.5074
2018-05-21,28.5862
2018-05-22,28.5074
2018-05-23,28.8522
2018-05-24,28.8325
2018-05-25,28.9606
2018-05-29,28.5862
2018-05-30,28.8621
2018-05-31,28.5074
2018-06-01,28.4876
2018-06-04,28.9902
2018-06-05,28.4876
2018-06-06,28.4876
2018-06-07,28.2512
2018-06-08,28.5074
2018-06-11,28.4187
2018-06-12,28.4088
2018-06-13,28.4975
2018-06-14,28.4778
2018-06-15,29.0887
2018-06-18,28.9409
2018-06-19,28.3398
2018-06-20,28.4778
2018-06-21,28.3103
2018-06-22,27.9654
2018-06-25,27.6008
2018-06-26,27.6106
2018-06-27,27.3446
2018-06-28,27.4234
2018-06-29,27.7486
2018-07-02,27.3446
2018-07-03,27.0588
2018-07-05,27.1475
2018-07-06,27.1672
2018-07-09,27.1475
2018-07-10,27.7289
2018-07-11,27.6599
2018-07-12,27.7782
2018-07-13,27.9752
2018-07-16,27.9555
2018-07-17,28.3103
2018-07-18,27.8274
2018-07-19,28.0935
2018-07-20,28.3004
2018-07-23,27.7683
2018-07-24,26.034
2018-07-25,25.8468
2018-07-26,25.8961
2018-07-27,25.4921
2018-07-30,25.0191
2018-07-31,25.2753
2018-08-01,25.6004
2018-08-02,31.0891
2018-08-03,30.7048
2018-08-06,30.7343
2018-08-07,30.1135
2018-08-08,30.2022
2018-08-09,30.2811
2018-08-10,29.7489
2018-08-13,29.3844
2018-08-14,29.3646
2018-08-15,29.2182
2018-08-16,29.149
2018-08-17,29.5051
2018-08-20,29.4754
2018-08-21,29.604
2018-08-22,29.3369
2018-08-23,28.9215
2018-08-24,28.9314
2018-08-27,29.0897
2018-08-28,29.1787
2018-08-29,29.693
2018-08-30,29.5941
2018-08-31,29.1292
2018-09-04,28.6742
2018-09-05,28.7237
2018-09-06,28.6446
2018-09-07,28.5753
2018-09-10,29.1094
2018-09-11,29.2875
2018-09-12,29.6831
2018-09-13,29.9403
2018-09-14,29.7128
2018-09-17,30.1777
2018-09-18,29.6633
2018-09-19,29.6139
2018-09-20,29.8711
2018-09-21,30.0293
2018-09-24,29.4655
2018-09-25,29.3666
2018-09-26,29.7721
2018-09-27,29.9106
2018-09-28,30.0985
2018-10-01,30.2469
2018-10-02,29.6436
2018-10-03,29.693
2018-10-04,29.0699
2018-10-05,28.971
2018-10-08,29.2974
2018-10-09,29.0204
2018-10-10,28.0412
2018-10-11,28.4962
2018-10-12,28.8325
2018-10-15,29.1193
2018-10-16,29.6534
2018-10-17,29.5446
2018-10-18,29.2084
2018-10-19,29.0501
2018-10-22,29.3864
2018-10-23,29.5348
2018-10-24,29.1094
2018-10-25,29.6238
2018-10-26,29.3369
2018-10-29,29.4062
2018-10-30,29.4358
2018-10-31,29.5842
2018-11-01,30.1678
2018-11-02,30.7909
2018-11-05,31.1767
2018-11-06,30.7613
2018-11-07,31.3349
2018-11-08,31.7405
2018-11-09,31.2954
2018-11-12,31.3547
2018-11-13,31.4833
2018-11-14,31.6342
2018-11-15,31.2173
2018-11-16,31.2074
2018-11-19,31.0287
2018-11-20,30.7607
2018-11-21,31.0982
2018-11-23,31.3166
2018-11-26,31.5349
2018-11-27,31.5151
2018-11-28,31.7831
2018-11-29,32.0809
2018-11-30,32.597
2018-12-03,33.4705
2018-12-04,33.7286
2018-12-06,33.1628
2018-12-07,32.1503
2018-12-10,32.19
2018-12-11,31.6044
2018-12-12,32.3489
2018-12-13,32.458
2018-12-14,32.1702
2018-12-17,31.2272
2018-12-18,31.1478
2018-12-19,30.5423
2018-12-20,30.0262
2018-12-21,29.6688
2018-12-24,29.6192
2018-12-26,30.6416
2018-12-27,30.3736
2018-12-28,30.0162
2018-12-31,30.1354
2019-01-02,30.1155
2019-01-03,29.5795
2019-01-04,30.1651
2019-01-07,30.8401
2019-01-08,31.2669
2019-01-09,31.7731
2019-01-10,31.6243
2019-01-11,31.1776
2019-01-14,31.1478
2019-01-15,31.6441
2019-01-16,32.0809
2019-01-17,32.3687
2019-01-18,32.5275
2019-01-22,32.4183
2019-01-23,32.8948
2019-01-24,32.3389
2019-01-25,32.9742
2019-01-28,33.3315
2019-01-29,33.4606
2019-01-30,33.272
2019-01-31,33.6293
2019-02-01,33.7286
2019-02-04,33.7683
2019-02-05,33.9569
2019-02-06,34.0958
2019-02-07,34.2447
2019-02-08,34.1653
2019-02-11,33.9569
2019-02-12,33.9866
2019-02-13,34.0065
2019-02-14,34.2348
2019-02-15,34.2348
2019-02-19,34.0958
2019-02-20,33.9172
2019-02-21,33.7186
2019-02-22,34.8204
2019-02-25,35.0984
2019-02-26,35.5252
2019-02-27,35.545
2019-02-28,35.4061
2019-03-01,35.684
2019-03-04,35.3961
2019-03-05,35.2671
2019-03-06,35.2213
2019-03-07,35.1515
2019-03-08,35.2213
2019-03-11,35.3109
2019-03-12,35.1814
2019-03-13,35.4106
2019-03-14,35.7991
2019-03-15,35.6796
2019-03-18,36.0781
2019-03-19,36.4268
2019-03-20,36.0482
2019-03-21,36.3571
2019-03-22,36.3471
2019-03-25,36.5962
2019-03-26,36.0981
2019-03-27,35.6995
2019-03-28,35.7194
2019-03-29,35.839
2019-04-01,36.4667
2019-04-02,36.656
2019-04-03,36.387
2019-04-04,36.666
2019-04-05,36.4268
2019-04-08,36.4966
2019-04-09,36.5265
2019-04-10,36.7158
2019-04-11,36.6361
2019-04-12,36.9151
2019-04-15,36.8652
2019-04-16,36.9549
2019-04-17,36.9649
2019-04-18,37.0546
2019-04-22,37.1243
2019-04-23,37.3335
2019-04-24,37.4033
2019-04-25,37.6026
2019-04-26,36.945
2019-04-29,36.8752
2019-04-30,36.7357
2019-05-01,36.1678
2019-05-02,38.0011
2019-05-03,37.483
2019-05-06,37.8118
2019-05-07,37.6424
2019-05-08,37.194
2019-05-09,37.3734
2019-05-10,37.493
2019-05-13,36.4567
2019-05-14,36.656
2019-05-15,37.24
2019-05-16,37.47
2019-05-17,37.61
2019-05-20,37.5
2019-05-21,37.39
2019-05-22,37.35
2019-05-23,36.7
2019-05-24,36.74
2019-05-28,36.52
2019-05-29,36.31
2019-05-30,36.49
2019-05-31,36.06
2019-06-03,35.81
2019-06-04,36.34
2019-06-05,36.58
2019-06-06,36.55
2019-06-07,36.83
2019-06-10,37.27
2019-06-11,37.27
2019-06-12,37.43
2019-06-13,38.005
2019-06-14,38.8
2019-06-17,39.05
2019-06-18,39.33
2019-06-19,39.12
2019-06-20,39.14
2019-06-21,39.1
2019-06-24,38.98
2019-06-25,38.295
2019-06-26,38.095
2019-06-27,38.435
2019-06-28,38.54
2019-07-01,38.83
2019-07-02,38.92
2019-07-03,39.2
2019-07-04,39.2
2019-07-05,38.755
2019-07-08,38.84
2019-07-09,39.06
2019-07-10,38.72
2019-07-11,38.96
2019-07-12,39.565
2019-07-15,39.97
2019-07-16,40.305
2019-07-17,40.175
2019-07-18,40.195
2019-07-19,39.435
2019-07-22,39.15
2019-07-23,39.745
2019-07-24,39.34
2019-07-25,39.545
2019-07-26,39.39
2019-07-29,39.765
2019-07-30,39.39
2019-07-31,39.31
2019-08-01,39.215
2019-08-02,38.63
2019-08-05,38.325
2019-08-06,37.33
2019-08-07,37.415
2019-08-08,37.85
2019-08-09,37.38
2019-08-12,36.8
2019-08-13,37.44
2019-08-14,35.82
2019-08-15,35.955
2019-08-16,36.19
2019-08-19,36.335
2019-08-20,36.52
2019-08-21,36.555
2019-08-22,36.455
2019-08-23,35.545
2019-08-26,35.89
2019-08-27,36.25
2019-08-28,36.185
2019-08-29,36.89
2019-08-30,36.705
2019-09-02,36.69
2019-09-03,36.43
2019-09-04,37.22
2019-09-05,37.45
2019-09-06,37.23
2019-09-09,37.235
2019-09-10,37.245
2019-09-11,37.335
2019-09-12,37.335
2019-09-13,37.47
2019-09-16,36.32
2019-09-17,36.9
2019-09-18,36.175
2019-09-19,35.895
2019-09-20,35.545
2019-09-23,35.275
2019-09-24,35.185
2019-09-25,35
2019-09-26,35.455
2019-09-27,35.285
2019-09-30,35.505
2019-10-01,34.885
2019-10-02,34.86
2019-10-03,35.005
2019-10-04,35.06
2019-10-07,34.955
2019-10-08,34.495
2019-10-09,34.755
2019-10-10,34.865
2019-10-11,34.85
2019-10-14,34.43
2019-10-15,35.275
2019-10-16,35.295
2019-10-17,35.345
2019-10-18,26.24
2019-10-21,26.995
2019-10-22,27.78
2019-10-23,26.775
2019-10-24,26.435
2019-10-25,25.965
2019-10-28,26.2
2019-10-29,25.855
2019-10-30,25.76
2019-10-31,25.525
2019-11-01,25.875
2019-11-04,26.795
2019-11-05,26.825
2019-11-06,26.87
2019-11-07,26.715
2019-11-08,27.21
2019-11-11,26.925
2019-11-12,27.105
2019-11-13,27.17
2019-11-14,27.36
2019-11-15,27.125
2019-11-18,26.69
2019-11-19,27.015
2019-11-20,26.765
2019-11-21,27.455
2019-11-22,27.07
2019-11-25,27.915
