date,close
2014-05-27,17.48
2014-05-28,17.12
2014-05-29,16.82
2014-05-30,16.75
2014-06-02,16.65
2014-06-03,16.48
2014-06-04,16.5
2014-06-05,17.35
2014-06-06,17.99
2014-06-09,17.9
2014-06-10,17.65
2014-06-11,18.31
2014-06-12,17.89
2014-06-13,17.5
2014-06-16,17.85
2014-06-17,18.69
2014-06-18,18.85
2014-06-19,18.72
2014-06-20,18.76
2014-06-23,18.54
2014-06-24,18.51
2014-06-25,18.98
2014-06-26,18.86
2014-06-27,19.05
2014-06-30,19.43
2014-07-01,19.76
2014-07-02,19.55
2014-07-03,19.56
2014-07-07,19.2
2014-07-08,18.63
2014-07-09,18.49
2014-07-10,18.59
2014-07-11,18.99
2014-07-14,18.75
2014-07-15,19
2014-07-16,19.1
2014-07-17,18.63
2014-07-18,18.66
2014-07-21,18.44
2014-07-22,18.65
2014-07-23,18.86
2014-07-24,18.19
2014-07-25,17.99
2014-07-28,17.61
2014-07-29,17.53
2014-07-30,17.33
2014-07-31,16.76
2014-08-01,16.9
2014-08-04,17.07
2014-08-05,17.38
2014-08-06,17.9
2014-08-07,17.77
2014-08-08,18.07
2014-08-11,18.65
2014-08-12,18.6
2014-08-13,18.81
2014-08-14,19.12
2014-08-15,18.9
2014-08-18,19.4
2014-08-19,19.43
2014-08-20,19.25
2014-08-21,19.58
2014-08-22,19.44
2014-08-25,19.56
2014-08-26,19.69
2014-08-27,19.8
2014-08-28,20.1
2014-08-29,19.96
2014-09-02,19.74
2014-09-03,20.43
2014-09-04,20.19
2014-09-05,20.2
2014-09-08,20.09
2014-09-09,21.14
2014-09-10,20.14
2014-09-11,20.21
2014-09-12,19.99
2014-09-15,19.71
2014-09-16,19.86
2014-09-17,19.97
2014-09-18,20.54
2014-09-19,20.51
2014-09-22,20.29
2014-09-23,20.14
2014-09-24,20.1
2014-09-25,19.65
2014-09-26,19.67
2014-09-29,19.81
2014-09-30,19.4
2014-10-01,18.74
2014-10-02,19.04
2014-10-03,19.09
2014-10-06,18.98
2014-10-07,18.36
2014-10-08,18.65
2014-10-09,18.42
2014-10-10,17.82
2014-10-13,17.9
2014-10-14,17.76
2014-10-15,17.93
2014-10-16,18.31
2014-10-17,18.72
2014-10-20,18.59
2014-10-21,19.13
2014-10-22,18.74
2014-10-23,19.26
2014-10-24,19.19
2014-10-27,19.36
2014-10-28,19.53
2014-10-29,19.43
2014-10-30,18.89
2014-10-31,19.87
2014-11-03,19.82
2014-11-04,19.35
2014-11-05,19.25
2014-11-06,19.33
2014-11-07,19.49
2014-11-10,19.8
2014-11-11,19.37
2014-11-12,19.3
2014-11-13,18.89
2014-11-14,19
2014-11-17,18.45
2014-11-18,19.3
2014-11-19,18.85
2014-11-20,19.24
2014-11-21,19.16
2014-11-24,19.29
2014-11-25,18.88
2014-11-26,19
2014-11-28,18.66
2014-12-01,18.24
2014-12-02,18.8
2014-12-03,19.02
2014-12-04,18.71
2014-12-05,18.85
2014-12-08,18.14
2014-12-09,18.15
2014-12-10,19.31
2014-12-11,19.17
2014-12-12,18.01
2014-12-15,17.07
2014-12-16,17.38
2014-12-17,17.87
2014-12-18,17.82
2014-12-19,17.46
2014-12-22,17.64
2014-12-23,17.67
2014-12-24,17.78
2014-12-26,18.01
2014-12-29,18.65
2014-12-30,18.56
2014-12-31,18.52
2015-01-02,18.26
2015-01-05,17.53
2015-01-06,16.55
2015-01-07,15.78
2015-01-08,16.22
2015-01-09,16.45
2015-01-12,16.63
2015-01-13,16.66
2015-01-14,16.49
2015-01-15,15.76
2015-01-16,16.05
2015-01-20,15.78
2015-01-21,16.04
2015-01-22,16.24
2015-01-23,16.13
2015-01-26,16.41
2015-01-27,16.3
2015-01-28,15.76
2015-01-29,15.79
2015-01-30,15.43
2015-02-02,15.61
2015-02-03,16.28
2015-02-04,16.06
2015-02-05,16.3
2015-02-06,16.56
2015-02-09,16.56
2015-02-10,16.84
2015-02-11,16.72
2015-02-12,17.1
2015-02-13,17.42
2015-02-17,17.2
2015-02-18,17.23
2015-02-19,17.5
2015-02-20,17.25
2015-02-23,16.86
2015-02-24,16.76
2015-02-25,16.74
2015-02-26,16.9
2015-02-27,16.84
2015-03-02,17.02
2015-03-03,17
2015-03-04,16.76
2015-03-05,16.75
2015-03-06,16.33
2015-03-09,16.25
2015-03-10,15.81
2015-03-11,16.89
2015-03-12,16.92
2015-03-13,16.7
2015-03-16,16.61
2015-03-17,16.91
2015-03-18,17.02
2015-03-19,17.1
2015-03-20,17.44
2015-03-23,17.59
2015-03-24,17.3
2015-03-25,17.26
2015-03-26,17.26
2015-03-27,17.13
2015-03-30,17.15
2015-03-31,17.28
2015-04-01,17.5
2015-04-02,17.31
2015-04-06,17.05
2015-04-07,16.77
2015-04-08,16.77
2015-04-09,16.48
2015-04-10,16.71
2015-04-13,16.93
2015-04-14,17.27
2015-04-15,17.24
2015-04-16,17.08
2015-04-17,16.93
2015-04-20,16.77
2015-04-21,16.52
2015-04-22,16.51
2015-04-23,16.17
2015-04-24,16.35
2015-04-27,16.08
2015-04-28,16.24
2015-04-29,15.94
2015-04-30,15.48
2015-05-01,15.56
2015-05-04,15.52
2015-05-05,15.51
2015-05-06,15.32
2015-05-07,15.22
2015-05-08,15.2
2015-05-11,15.2
2015-05-12,14.81
2015-05-13,14.88
2015-05-14,15.4
2015-05-15,15.36
2015-05-18,15.39
2015-05-19,15.48
2015-05-20,15.31
2015-05-21,15.57
2015-05-22,15.3
2015-05-26,15.15
2015-05-27,15.16
2015-05-28,15.24
2015-05-29,14.98
2015-06-01,14.67
2015-06-02,14.56
2015-06-03,15.07
2015-06-04,14.96
2015-06-05,15.02
2015-06-08,15.09
2015-06-09,14.78
2015-06-10,15.01
2015-06-11,14.99
2015-06-12,15.03
2015-06-15,14.91
2015-06-16,15.14
2015-06-17,15.28
2015-06-18,15.59
2015-06-19,15.72
2015-06-22,15.63
2015-06-23,16
2015-06-24,15.9
2015-06-25,15.59
2015-06-26,15.59
2015-06-29,14.98
2015-06-30,15.07
2015-07-01,14.91
2015-07-02,14.73
2015-07-06,14.45
2015-07-07,14.28
2015-07-08,13.9
2015-07-09,14.19
2015-07-10,14.49
2015-07-13,14.53
2015-07-14,14.41
2015-07-15,14.12
2015-07-16,13.97
2015-07-17,14.03
2015-07-20,13.85
2015-07-21,13.73
2015-07-22,13.61
2015-07-23,13.41
2015-07-24,12.88
2015-07-27,12.45
2015-07-28,12.88
2015-07-29,13.02
2015-07-30,13.09
2015-07-31,12.95
2015-08-03,12.82
2015-08-04,12.91
2015-08-05,12.73
2015-08-06,12.68
2015-08-07,12.26
2015-08-10,12.65
2015-08-11,12.37
2015-08-12,11.98
2015-08-13,11.36
2015-08-14,11.5
2015-08-17,11.68
2015-08-18,11.55
2015-08-19,11.49
2015-08-20,11.2
2015-08-21,10.88
2015-08-24,10.04
2015-08-25,9.96
2015-08-26,9.94
2015-08-27,10.21
2015-08-28,10.38
2015-08-31,10.43
2015-09-01,9.99
2015-09-02,9.95
2015-09-03,11.88
2015-09-04,11.79
2015-09-08,12.01
2015-09-09,12.19
2015-09-10,12.26
2015-09-11,12.06
2015-09-14,11.8
2015-09-15,12.03
2015-09-16,12.35
2015-09-17,12.28
2015-09-18,11.5
2015-09-21,11.47
2015-09-22,11.26
2015-09-23,10.79
2015-09-24,10.92
2015-09-25,10.71
2015-09-28,10.39
2015-09-29,10.15
2015-09-30,10.57
2015-10-01,10.34
2015-10-02,10.34
2015-10-05,10.91
2015-10-06,11
2015-10-07,11.22
2015-10-08,11.28
2015-10-09,11.51
2015-10-12,11.07
2015-10-13,10.91
2015-10-14,10.8
2015-10-15,10.9
2015-10-16,10.65
2015-10-19,10.52
2015-10-20,10.46
2015-10-21,10.25
2015-10-22,10.43
2015-10-23,10.76
2015-10-26,10.91
2015-10-27,10.6
2015-10-28,10.98
2015-10-29,10.83
2015-10-30,10.46
2015-11-02,10.9
2015-11-03,11.11
2015-11-04,11.06
2015-11-05,11.24
2015-11-06,11.53
2015-11-09,11.18
2015-11-10,11.16
2015-11-11,11.64
2015-11-12,11.55
2015-11-13,11.48
2015-11-16,11.67
2015-11-17,11.51
2015-11-18,11.76
2015-11-19,11.56
2015-11-20,11.46
2015-11-23,11.78
2015-11-24,11.97
2015-11-25,11.97
2015-11-27,12
2015-11-30,11.86
2015-12-01,11.92
2015-12-02,11.61
2015-12-03,11.33
2015-12-04,11.35
2015-12-07,11.1
2015-12-08,10.97
2015-12-09,10.93
2015-12-10,11.43
2015-12-11,12.23
2015-12-14,12.23
2015-12-15,12.76
2015-12-16,12.91
2015-12-17,12.5
2015-12-18,12.07
2015-12-21,11.96
2015-12-22,12.02
2015-12-23,12.12
2015-12-24,12.33
2015-12-28,12.11
2015-12-29,12.42
2015-12-30,12.25
2015-12-31,12.41
2016-01-04,11.99
2016-01-05,11.8
2016-01-06,11.55
2016-01-07,11.14
2016-01-08,10.74
2016-01-11,10.78
2016-01-12,10.22
2016-01-13,9.94
2016-01-14,10.02
2016-01-15,9.62
2016-01-19,9.44
2016-01-20,10.05
2016-01-21,9.8
2016-01-22,10.05
2016-01-25,9.84
2016-01-26,10.24
2016-01-27,10.12
2016-01-28,10.06
2016-01-29,10.38
2016-02-01,10.24
2016-02-02,10.02
2016-02-03,10.34
2016-02-04,10.37
2016-02-05,10.28
2016-02-08,9.43
2016-02-09,9.46
2016-02-10,9.52
2016-02-11,9.17
2016-02-12,9.59
2016-02-16,9.86
2016-02-17,10.33
2016-02-18,10.14
2016-02-19,10.09
2016-02-22,10.37
2016-02-23,10.29
2016-02-24,10.83
2016-02-25,10.64
2016-02-26,10.84
2016-02-29,10.94
2016-03-01,11.13
2016-03-02,11.36
2016-03-03,11.36
2016-03-04,11.77
2016-03-07,11.88
2016-03-08,11.47
2016-03-09,12.68
2016-03-10,12.45
2016-03-11,12.88
2016-03-14,12.88
2016-03-15,12.53
2016-03-16,12.84
2016-03-17,13.14
2016-03-18,13.27
2016-03-21,13.34
2016-03-22,13.23
2016-03-23,13.16
2016-03-24,13.71
2016-03-28,13.52
2016-03-29,14.12
2016-03-30,13.71
2016-03-31,14.2
2016-04-01,14.32
2016-04-04,14.2
2016-04-05,14.36
2016-04-06,14.44
2016-04-07,14.84
2016-04-08,14.95
2016-04-11,15.09
2016-04-12,14.98
2016-04-13,15.35
2016-04-14,15.3
2016-04-15,15.33
2016-04-18,14.95
2016-04-19,14.85
2016-04-20,14.96
2016-04-21,15.08
2016-04-22,15.04
2016-04-25,14.75
2016-04-26,14.9
2016-04-27,15.09
2016-04-28,14.66
2016-04-29,14.74
2016-05-02,14.95
2016-05-03,14.65
2016-05-04,14.69
2016-05-05,14.78
2016-05-06,14.89
2016-05-09,14.79
2016-05-10,14.97
2016-05-11,14.79
2016-05-12,14.96
2016-05-13,15.3
2016-05-16,15.82
2016-05-17,16
2016-05-18,15.98
2016-05-19,14.52
2016-05-20,15.2
2016-05-23,15.09
2016-05-24,15.34
2016-05-25,15.69
2016-05-26,15.53
2016-05-27,15.71
2016-05-31,16.1
2016-06-01,15.95
2016-06-02,16.31
2016-06-03,15.99
2016-06-06,16.34
2016-06-07,16.31
2016-06-08,16.58
2016-06-09,16.54
2016-06-10,16.09
2016-06-13,16.03
2016-06-14,15.89
2016-06-15,16.05
2016-06-16,15.94
2016-06-17,15.9
2016-06-20,16.04
2016-06-21,15.96
2016-06-22,15.95
2016-06-23,16.18
2016-06-24,15.54
2016-06-27,14.97
2016-06-28,15.19
2016-06-29,15.68
2016-06-30,15.99
2016-07-01,16.28
2016-07-05,16
2016-07-06,16.04
2016-07-07,16.1
2016-07-08,16.39
2016-07-11,16.98
2016-07-12,17.03
2016-07-13,17.14
2016-07-14,16.97
2016-07-15,17.17
2016-07-18,17.11
2016-07-19,16.82
2016-07-20,16.25
2016-07-21,16.27
2016-07-22,16.44
2016-07-25,16.96
2016-07-26,17.14
2016-07-27,17.1
2016-07-28,17.24
2016-07-29,16.22
2016-08-01,16.15
2016-08-02,16.42
2016-08-03,16.7
2016-08-04,16.68
2016-08-05,17.13
2016-08-08,17.48
2016-08-09,17.68
2016-08-10,17.19
2016-08-11,17.41
2016-08-12,17.2
2016-08-15,17.33
2016-08-16,16.99
2016-08-17,16.88
2016-08-18,17
2016-08-19,17.01
2016-08-22,17.35
2016-08-23,17.45
2016-08-24,17.17
2016-08-25,17.21
2016-08-26,17.18
2016-08-29,17.5
2016-08-30,17.81
2016-08-31,15.14
2016-09-01,15.18
2016-09-02,15.02
2016-09-06,14.59
2016-09-07,15.02
2016-09-08,15.22
2016-09-09,14.57
2016-09-12,14.76
2016-09-13,14.28
2016-09-14,14.35
2016-09-15,14.66
2016-09-16,14.69
2016-09-19,14.68
2016-09-20,14.14
2016-09-21,14.03
2016-09-22,14.29
2016-09-23,14.51
2016-09-26,14.52
2016-09-27,14.43
2016-09-28,14.59
2016-09-29,14.39
2016-09-30,14.59
2016-10-03,14.46
2016-10-04,14.51
2016-10-05,14.92
2016-10-06,14.86
2016-10-07,14.54
2016-10-10,14.79
2016-10-11,14.63
2016-10-12,14.55
2016-10-13,14.3
2016-10-14,14.58
2016-10-17,14.6
2016-10-18,14.35
2016-10-19,14.4
2016-10-20,14.25
2016-10-21,14.45
2016-10-24,14.45
2016-10-25,14.4
2016-10-26,14.4
2016-10-27,14.15
2016-10-28,14.4
2016-10-31,14.4
2016-11-01,14.2
2016-11-02,14.15
2016-11-03,13.9
2016-11-04,14
2016-11-07,14.35
2016-11-08,14.55
2016-11-09,15.45
2016-11-10,16
2016-11-11,16.4
2016-11-14,16.4
2016-11-15,16.8
2016-11-16,17
2016-11-17,17.5
2016-11-18,17.05
2016-11-21,17.3
2016-11-22,17.35
2016-11-23,17.4
2016-11-25,17.35
2016-11-28,16.95
2016-11-29,17.05
2016-11-30,16.7
2016-12-01,16.65
2016-12-02,16.85
2016-12-05,17.2
2016-12-06,17.35
2016-12-07,17.25
2016-12-08,17.85
2016-12-09,16.05
2016-12-12,15.7
2016-12-13,15.8
2016-12-14,15.55
2016-12-15,15.7
2016-12-16,16.1
2016-12-19,16.1
2016-12-20,16.3
2016-12-21,16.25
2016-12-22,15.9
2016-12-23,15.95
2016-12-27,16.35
2016-12-28,15.95
2016-12-29,16
2016-12-30,15.65
2017-01-03,16.05
2017-01-04,16.1
2017-01-05,15.65
2017-01-06,15.9
2017-01-09,15.5
2017-01-10,15.95
2017-01-11,16.2
2017-01-12,16.15
2017-01-13,16.2
2017-01-17,16.1
2017-01-18,16.3
2017-01-19,15.85
2017-01-20,15.85
2017-01-23,15.8
2017-01-24,16.25
2017-01-25,16.55
2017-01-26,16.05
2017-01-27,16.15
2017-01-30,15.95
2017-01-31,16
2017-02-01,15.8
2017-02-02,15.8
2017-02-03,16.05
2017-02-06,15.9
2017-02-07,15.9
2017-02-08,15.8
2017-02-09,15.85
2017-02-10,15.95
2017-02-13,15.95
2017-02-14,16.05
2017-02-15,16.25
2017-02-16,16.05
2017-02-17,15.85
2017-02-21,15.95
2017-02-22,15.85
2017-02-23,15.55
2017-02-24,15.55
2017-02-27,16
2017-02-28,16
2017-03-01,16.45
2017-03-02,16
2017-03-03,16.4
2017-03-06,16.15
2017-03-07,16.05
2017-03-08,16.3
2017-03-09,16
2017-03-10,16.2
2017-03-13,16.25
2017-03-14,16.1
2017-03-15,16.1
2017-03-16,16.3
2017-03-17,16.4
2017-03-20,16.15
2017-03-21,16.05
2017-03-22,16.05
2017-03-23,16.2
2017-03-24,16.2
2017-03-27,16.1
2017-03-28,16.15
2017-03-29,16.35
2017-03-30,17.3
2017-03-31,17.15
2017-04-03,16.65
2017-04-04,16.35
2017-04-05,16.2
2017-04-06,16.5
2017-04-07,16.6
2017-04-10,16.45
2017-04-11,16.55
2017-04-12,16.35
2017-04-13,16.1
2017-04-17,16.25
2017-04-18,16.1
2017-04-19,16.55
2017-04-20,16.9
2017-04-21,16.8
2017-04-24,16.8
2017-04-25,17.7
2017-04-26,17.7
2017-04-27,17.45
2017-04-28,17.5
2017-05-01,17.6
2017-05-02,17.65
2017-05-03,17.65
2017-05-04,17.5
2017-05-05,17.4
2017-05-08,17.1
2017-05-09,17.35
2017-05-10,17.25
2017-05-11,17.25
2017-05-12,16.9
2017-05-15,17.1
2017-05-16,16.95
2017-05-17,16.75
2017-05-18,16.65
2017-05-19,17
2017-05-22,16.7
2017-05-23,16.9
2017-05-24,16.5
2017-05-25,16.6
2017-05-26,16.75
2017-05-30,16.65
2017-05-31,16.65
2017-06-01,16.95
2017-06-02,17.25
2017-06-05,17.25
2017-06-06,17.3
2017-06-07,16.55
2017-06-08,17.25
2017-06-09,17.4
2017-06-12,17.2
2017-06-13,17.6
2017-06-14,17.45
2017-06-15,17.25
2017-06-16,17
2017-06-19,17.2
2017-06-20,17
2017-06-21,16.65
2017-06-22,16.65
2017-06-23,17.05
2017-06-26,17
2017-06-27,16.65
2017-06-28,16.9
2017-06-29,16.5
2017-06-30,16.7
2017-07-03,17.35
2017-07-05,17.2
2017-07-06,16.9
2017-07-07,17
2017-07-10,17.2
2017-07-11,17.35
2017-07-12,17.6
2017-07-13,17.45
2017-07-14,17.5
2017-07-17,17.65
2017-07-18,17.6
2017-07-19,17.9
2017-07-20,17.9
2017-07-21,17.55
2017-07-24,17.55
2017-07-25,17.7
2017-07-26,17.95
2017-07-27,18.15
2017-07-28,17.85
2017-07-31,18
2017-08-01,18
2017-08-02,17.75
2017-08-03,17.7
2017-08-04,17.75
2017-08-07,17.75
2017-08-08,17.75
2017-08-09,17.65
2017-08-10,17.4
2017-08-11,17.55
2017-08-14,17.5
2017-08-15,17.15
2017-08-16,16.9
2017-08-17,16.6
2017-08-18,16.4
2017-08-21,16.4
2017-08-22,16.65
2017-08-23,16.65
2017-08-24,16.7
2017-08-25,16.65
2017-08-28,16.65
2017-08-29,16.55
2017-08-30,16.8
2017-08-31,16.8
2017-09-01,16.75
2017-09-05,16.65
2017-09-06,16.8
2017-09-07,13.35
2017-09-08,13.85
2017-09-11,13.25
2017-09-12,13.7
2017-09-13,14.45
2017-09-14,14.45
2017-09-15,14.25
2017-09-18,14.2
2017-09-19,14
2017-09-20,14.4
2017-09-21,14.85
2017-09-22,15.05
2017-09-25,15
2017-09-26,15.25
2017-09-27,15.45
2017-09-28,15.6
2017-09-29,15.6
2017-10-02,15.6
2017-10-03,15.85
2017-10-04,15.9
2017-10-05,15.55
2017-10-06,15.85
2017-10-09,15.5
2017-10-10,15.6
2017-10-11,15.8
2017-10-12,15.75
2017-10-13,15.75
2017-10-16,15.7
2017-10-17,15.3
2017-10-18,15.6
2017-10-19,15.55
2017-10-20,15.65
2017-10-23,15.6
2017-10-24,15.7
2017-10-25,15.4
2017-10-26,15.8
2017-10-27,15.55
2017-10-30,15.65
2017-10-31,15.95
2017-11-01,15.85
2017-11-02,15.8
2017-11-03,15.8
2017-11-06,15.95
2017-11-07,15.75
2017-11-08,16
2017-11-09,15.85
2017-11-10,15.85
2017-11-13,15.7
2017-11-14,15.85
2017-11-15,15.7
2017-11-16,15.9
2017-11-17,16.05
2017-11-20,16.3
2017-11-21,16.45
2017-11-22,16.45
2017-11-24,16.6
2017-11-27,16.45
2017-11-28,16.45
2017-11-29,16.45
2017-11-30,16.7
2017-12-01,16.45
2017-12-04,16.4
2017-12-05,16.15
2017-12-06,16.6
2017-12-07,19.05
2017-12-08,20
2017-12-11,20.6
2017-12-12,18.9
2017-12-13,19.3
2017-12-14,19.3
2017-12-15,19.65
2017-12-18,19.45
2017-12-19,19.45
2017-12-20,19.6
2017-12-21,19.6
2017-12-22,19.1
2017-12-26,19.6
2017-12-27,19.25
2017-12-28,19.4
2017-12-29,19.3
2018-01-02,19.55
2018-01-03,19.3
2018-01-04,19.5
2018-01-05,19.45
2018-01-08,19.4
2018-01-09,19.15
2018-01-10,18.8
2018-01-11,19.1
2018-01-12,18.9
2018-01-16,18.55
2018-01-17,18.45
2018-01-18,18.6
2018-01-19,18.55
2018-01-22,18.35
2018-01-23,18.3
2018-01-24,18.1
2018-01-25,18.5
2018-01-26,18.55
2018-01-29,18.7
2018-01-30,18.6
2018-01-31,18.45
2018-02-01,18.5
2018-02-02,18.05
2018-02-05,17.25
2018-02-06,17
2018-02-07,17.1
2018-02-08,16.4
2018-02-09,16.35
2018-02-12,16.5
2018-02-13,16.4
2018-02-14,16.8
2018-02-15,17.05
2018-02-16,17
2018-02-20,16.85
2018-02-21,16.9
2018-02-22,16.75
2018-02-23,16.85
2018-02-26,16.9
2018-02-27,16.4
2018-02-28,16.3
2018-03-01,15.8
2018-03-02,15.9
2018-03-05,15.85
2018-03-06,16.1
2018-03-07,16.15
2018-03-08,16.4
2018-03-09,17.2
2018-03-12,17.75
2018-03-13,18
2018-03-14,17.9
2018-03-15,17.75
2018-03-16,17.7
2018-03-19,17.7
2018-03-20,17.65
2018-03-21,17.75
2018-03-22,17.4
2018-03-23,17.1
2018-03-26,17.65
2018-03-27,17.3
2018-03-28,17.4
2018-03-29,17.7
2018-04-02,17.3
2018-04-03,17.45
2018-04-04,17.7
2018-04-05,17.85
2018-04-06,17.35
2018-04-09,17.2
2018-04-10,17.45
2018-04-11,17.25
2018-04-12,17.5
2018-04-13,17.3
2018-04-16,17.95
2018-04-17,18.1
2018-04-18,18.25
2018-04-19,17.9
2018-04-20,17.8
2018-04-23,17.75
2018-04-24,17.4
2018-04-25,17.7
2018-04-26,17.8
2018-04-27,17.65
2018-04-30,17.5
2018-05-01,17.85
2018-05-02,17.65
2018-05-03,17.55
2018-05-04,17.8
2018-05-07,18.15
2018-05-08,18.35
2018-05-09,18.5
2018-05-10,18.55
2018-05-11,18.5
2018-05-14,18.2
2018-05-15,18.2
2018-05-16,18.4
2018-05-17,18.55
2018-05-18,18.7
2018-05-21,19
2018-05-22,18.85
2018-05-23,18.8
2018-05-24,19.05
2018-05-25,19.15
2018-05-29,18.95
2018-05-30,19.4
2018-05-31,19.15
2018-06-01,18.75
2018-06-04,19.1
2018-06-05,19.4
2018-06-06,21.45
2018-06-07,22.65
2018-06-08,23
2018-06-11,22.5
2018-06-12,22.1
2018-06-13,22
2018-06-14,22.15
2018-06-15,21.85
2018-06-18,21.95
2018-06-19,21.85
2018-06-20,21.85
2018-06-21,21.35
2018-06-22,21.05
2018-06-25,20.6
2018-06-26,21.05
2018-06-27,20.85
2018-06-28,21.1
2018-06-29,21
2018-07-02,21.3
2018-07-03,21.05
2018-07-05,21.5
2018-07-06,21.25
2018-07-09,21.5
2018-07-10,21.05
2018-07-11,21.05
2018-07-12,20.7
2018-07-13,20.85
2018-07-16,20.55
2018-07-17,20.7
2018-07-18,18.15
2018-07-19,17.5
2018-07-20,16.6
2018-07-23,16.05
2018-07-24,15.75
2018-07-25,15.6
2018-07-26,15.7
2018-07-27,15.45
2018-07-30,15.45
2018-07-31,15.95
2018-08-01,15.9
2018-08-02,15.85
2018-08-03,15.55
2018-08-06,15.15
2018-08-07,15.15
2018-08-08,15.15
2018-08-09,14.95
2018-08-10,14.75
2018-08-13,14.45
2018-08-14,14.6
2018-08-15,14.15
2018-08-16,14.6
2018-08-17,14.55
2018-08-20,14.85
2018-08-21,15.3
2018-08-22,15.2
2018-08-23,15.15
2018-08-24,15.3
2018-08-27,15.6
2018-08-28,15.65
2018-08-29,15.85
2018-08-30,17.1
2018-08-31,16.9
2018-09-04,16.95
2018-09-05,16.9
2018-09-06,16.6
2018-09-07,16.5
2018-09-10,16.45
2018-09-11,16.4
2018-09-12,16.55
2018-09-13,16.35
2018-09-14,16.2
2018-09-17,15.75
2018-09-18,15.55
2018-09-19,15.7
2018-09-20,16.05
2018-09-21,15.8
2018-09-24,15.5
2018-09-25,15.65
2018-09-26,15.3
2018-09-27,15.3
2018-09-28,15.15
2018-10-01,15.63
2018-10-02,15.58
2018-10-03,15.69
2018-10-04,15.64
2018-10-05,15.24
2018-10-08,15.28
2018-10-09,15.25
2018-10-10,14.9
2018-10-11,14.88
2018-10-12,14.69
2018-10-15,14.59
2018-10-16,14.93
2018-10-17,14.49
2018-10-18,14.17
2018-10-19,14.11
2018-10-22,14.21
2018-10-23,14.04
2018-10-24,12.85
2018-10-25,13.1
2018-10-26,12.45
2018-10-29,12.18
2018-10-30,12.57
2018-10-31,12.25
2018-11-01,12.73
2018-11-02,13.01
2018-11-05,12.94
2018-11-06,13.6
2018-11-07,13.74
2018-11-08,13.16
2018-11-09,12.53
2018-11-12,11.98
2018-11-13,12.23
2018-11-14,12.35
2018-11-15,12.25
2018-11-16,12.16
2018-11-19,11.38
2018-11-20,11.02
2018-11-21,11.19
2018-11-23,11.06
2018-11-26,10.93
2018-11-27,10.59
2018-11-28,10.99
2018-11-29,11.11
2018-11-30,11.35
2018-12-03,11.71
2018-12-04,10.55
2018-12-06,10.81
2018-12-07,10.49
2018-12-10,10.82
2018-12-11,10.44
2018-12-12,10.7
2018-12-13,10.36
2018-12-14,9.82
2018-12-17,9.68
2018-12-18,9.73
2018-12-19,8.34
2018-12-20,7.34
2018-12-21,7.21
2018-12-24,6.98
2018-12-26,7.26
2018-12-27,7.32
2018-12-28,7.41
2018-12-31,7.25
2019-01-02,7.55
2019-01-03,7.6
2019-01-04,7.82
2019-01-07,8.05
2019-01-08,7.87
2019-01-09,7.98
2019-01-10,7.8
2019-01-11,7.8
2019-01-14,7.76
2019-01-15,7.7
2019-01-16,7.68
2019-01-17,7.53
2019-01-18,7.86
2019-01-22,8.04
2019-01-23,7.88
2019-01-24,7.91
2019-01-25,8.03
2019-01-28,7.93
2019-01-29,7.92
2019-01-30,8.09
2019-01-31,8.16
2019-02-01,8.28
2019-02-04,8.35
2019-02-05,8.42
2019-02-06,8.47
2019-02-07,8.29
2019-02-08,8.14
2019-02-11,8.09
2019-02-12,8.18
2019-02-13,8.14
2019-02-14,7.77
2019-02-15,7.67
2019-02-19,7.07
2019-02-20,7.17
2019-02-21,7.07
2019-02-22,7.15
2019-02-25,7.26
2019-02-26,7.34
2019-02-27,7.27
2019-02-28,7.02
2019-03-01,7.12
2019-03-04,7.3
2019-03-05,7.07
2019-03-06,6.68
2019-03-07,6.38
2019-03-08,6.32
2019-03-11,6.38
2019-03-12,6.22
2019-03-13,6.62
2019-03-14,6.55
2019-03-15,6.68
2019-03-18,6.65
2019-03-19,6.52
2019-03-20,6.31
2019-03-21,6.45
2019-03-22,6.05
2019-03-25,6.04
2019-03-26,6.02
2019-03-27,6.02
2019-03-28,5.96
2019-03-29,6.16
2019-04-01,6.37
2019-04-02,6.19
2019-04-03,6.22
2019-04-04,6.6
2019-04-05,6.64
2019-04-08,6.54
2019-04-09,6.17
2019-04-10,6.22
2019-04-11,6.16
2019-04-12,6.08
2019-04-15,5.89
2019-04-16,5.82
2019-04-17,5.79
2019-04-18,5.74
2019-04-22,5.55
2019-04-23,5.7
2019-04-24,5.89
2019-04-25,5.5
2019-04-26,5.54
2019-04-29,5.73
2019-04-30,5.72
2019-05-01,5.6
2019-05-02,5.55
2019-05-03,5.94
2019-05-06,5.93
2019-05-07,5.97
2019-05-08,5.95
2019-05-09,6.22
2019-05-10,6.01
2019-05-13,5.98
2019-05-14,6.09
2019-05-15,6.32
2019-05-16,6.27
2019-05-17,6.08
2019-05-20,6.02
2019-05-21,6.1
2019-05-22,5.9
2019-05-23,5.71
