date,close
2017-10-26,27.83
2017-10-27,28.15
2017-10-30,28.04
2017-10-31,28.8
2017-11-01,30.37
2017-11-02,29.99
2017-11-03,29.7
2017-11-06,30.07
2017-11-07,30.05
2017-11-08,30.21
2017-11-09,30.21
2017-11-10,30.14
2017-11-13,29.99
2017-11-14,30.12
2017-11-15,29.96
2017-11-16,30.13
2017-11-17,29.98
2017-11-20,30.19
2017-11-21,30.1
2017-11-22,29.98
2017-11-24,29.99
2017-11-27,31.82
2017-11-28,31.53
2017-11-29,31.8
2017-11-30,32.59
2017-12-01,32.84
2017-12-04,32.64
2017-12-05,32.85
2017-12-06,32.58
2017-12-07,32.9
2017-12-08,33.18
2017-12-11,35
2017-12-12,35.16
2017-12-13,34.95
2017-12-14,35.58
2017-12-15,35.75
2017-12-18,37.42
2017-12-19,37.31
2017-12-20,38.75
2017-12-21,38.5
2017-12-22,39.25
2017-12-26,39.68
2017-12-27,39.69
2017-12-28,40.47
2017-12-29,40.61
2018-01-02,40.27
2018-01-03,39.91
2018-01-04,39.59
2018-01-05,38.9
2018-01-08,38.91
2018-01-09,37.96
2018-01-10,38.07
2018-01-11,39.82
2018-01-12,40.92
2018-01-16,41.2
2018-01-17,41.04
2018-01-18,42.01
2018-01-19,43.13
2018-01-22,42.32
2018-01-23,40.98
2018-01-24,39.59
2018-01-25,38.15
2018-01-26,38.86
2018-01-29,38.35
2018-01-30,37.27
2018-01-31,39.12
2018-02-01,39.34
2018-02-02,38
2018-02-05,38.16
2018-02-06,38.08
2018-02-07,37.8
2018-02-08,35.62
2018-02-09,35.79
2018-02-12,35.09
2018-02-13,34.57
2018-02-14,35.3
2018-02-15,35.04
2018-02-16,35.97
2018-02-20,35.88
2018-02-21,36.12
2018-02-22,35.66
2018-02-23,35.51
2018-02-26,34.91
2018-02-27,34.95
2018-02-28,34.56
2018-03-01,33.86
2018-03-02,35.73
2018-03-05,36.43
2018-03-06,35.45
2018-03-07,34.89
2018-03-08,34.19
2018-03-09,34.11
2018-03-12,34.4
2018-03-13,33.8
2018-03-14,33.57
2018-03-15,32.06
2018-03-16,31.57
2018-03-19,32.58
2018-03-20,33.09
2018-03-21,33.61
2018-03-22,32.52
2018-03-23,31.96
2018-03-26,32.78
2018-03-27,32.02
2018-03-28,32.4
2018-03-29,32.31
2018-04-02,31.76
2018-04-03,32.36
2018-04-04,33.06
2018-04-05,33.01
2018-04-06,32.49
2018-04-09,33.04
2018-04-10,33.15
2018-04-11,33.17
2018-04-12,33.18
2018-04-13,32.6
2018-04-16,32.34
2018-04-17,32.41
2018-04-18,32.01
2018-04-19,31.63
2018-04-20,31.61
2018-04-23,31.54
2018-04-24,31.94
2018-04-25,31.95
2018-04-26,32.68
2018-04-27,32.89
2018-04-30,33.28
2018-05-01,33.44
2018-05-02,33.64
2018-05-03,33.15
2018-05-04,32.81
2018-05-07,32.33
2018-05-08,32.97
2018-05-09,32.93
2018-05-10,33.37
2018-05-11,33.05
2018-05-14,33
2018-05-15,31.97
2018-05-16,33.76
2018-05-17,34.61
2018-05-18,35.1
2018-05-21,35.89
2018-05-22,35.72
2018-05-23,35.98
2018-05-24,36.15
2018-05-25,36.3
2018-05-29,36.08
2018-05-30,36.12
2018-05-31,36.4
2018-06-01,36.57
2018-06-04,37.39
2018-06-05,38.09
2018-06-06,37.87
2018-06-07,37.98
2018-06-08,37.74
2018-06-11,38.97
2018-06-12,38.45
2018-06-13,37.2
2018-06-14,36.42
2018-06-15,36.98
2018-06-18,38
2018-06-19,38.92
2018-06-20,38.83
2018-06-21,38.86
2018-06-22,38.28
2018-06-25,38.55
2018-06-26,38.94
2018-06-27,37.73
2018-06-28,36.66
2018-06-29,36.57
2018-07-02,37.45
2018-07-03,38.46
2018-07-05,38.51
2018-07-06,38.84
2018-07-09,38.96
2018-07-10,39.78
2018-07-11,39.56
2018-07-12,39.3
2018-07-13,39.92
2018-07-16,40.26
2018-07-17,40.3
2018-07-18,40.68
2018-07-19,40.47
2018-07-20,40.49
2018-07-23,40.92
2018-07-24,39.82
2018-07-25,40.59
2018-07-26,39.49
2018-07-27,39.3
2018-07-30,40.14
2018-07-31,40.66
2018-08-01,40.65
2018-08-02,40.6
2018-08-03,41.03
2018-08-06,42.07
2018-08-07,42.8
2018-08-08,43.23
2018-08-09,44.79
2018-08-10,44.9
2018-08-13,43.75
2018-08-14,43.63
2018-08-15,40.08
2018-08-16,39.675
2018-08-17,40.46
2018-08-20,41.81
2018-08-21,42.63
2018-08-22,42.95
2018-08-23,43.32
2018-08-24,42.54
2018-08-27,42.97
2018-08-28,42.96
2018-08-29,43.1
2018-08-30,43.33
2018-08-31,44.25
2018-09-04,44.88
2018-09-05,45.54
2018-09-06,45.05
2018-09-07,45.72
2018-09-10,45.53
2018-09-11,45.12
2018-09-12,44.87
2018-09-13,44.89
2018-09-14,44.68
2018-09-17,43.41
2018-09-18,43.55
2018-09-19,43.16
2018-09-20,43.69
2018-09-21,43.34
2018-09-24,43.27
2018-09-25,44
2018-09-26,44.15
2018-09-27,45.1
2018-09-28,45.14
2018-10-01,44.51
2018-10-02,43.68
2018-10-03,44.84
2018-10-04,44
2018-10-05,43.85
2018-10-08,42.73
2018-10-09,42.44
2018-10-10,40.16
2018-10-11,39.93
2018-10-12,42.22
2018-10-15,42.18
2018-10-16,42.5
2018-10-17,42.41
2018-10-18,41.76
2018-10-19,41.57
2018-10-22,42.33
2018-10-23,42.2
2018-10-24,41.58
2018-10-25,41.03
2018-10-26,41.16
2018-10-29,41.32
2018-10-30,42.29
2018-10-31,41.43
2018-11-01,42.79
2018-11-02,43.22
2018-11-05,44.2
2018-11-06,44.53
2018-11-07,44.77
2018-11-08,45
2018-11-09,43.85
2018-11-12,42.49
2018-11-13,41.09
2018-11-14,41.78
2018-11-15,40
2018-11-16,39.19
2018-11-19,37.21
2018-11-20,36.06
2018-11-21,36.96
2018-11-23,36.78
2018-11-26,36.19
2018-11-27,36.69
2018-11-28,37.75
2018-11-29,37.47
2018-11-30,36.77
2018-12-03,38.33
2018-12-04,36.34
2018-12-06,35.52
2018-12-07,32.36
2018-12-10,31.9
2018-12-11,32.36
2018-12-12,31.86
2018-12-13,30.69
2018-12-14,29.84
2018-12-17,29.23
2018-12-18,29.07
2018-12-19,29.08
2018-12-20,27.02
2018-12-21,26.41
2018-12-24,26.48
2018-12-26,28.26
2018-12-27,29.06
2018-12-28,28.98
2018-12-31,28.17
2019-01-02,27.94
2019-01-03,27.19
2019-01-04,27.73
2019-01-07,28.63
2019-01-08,29.13
2019-01-09,29.57
2019-01-10,29.35
2019-01-11,30.92
2019-01-14,30.42
2019-01-15,30.6
2019-01-16,31.91
2019-01-17,32.54
2019-01-18,33.25
2019-01-22,31.97
2019-01-23,31.87
2019-01-24,32.45
2019-01-25,32.85
2019-01-28,31.74
2019-01-29,31.59
2019-01-30,31.37
2019-01-31,31.76
2019-02-01,31.86
2019-02-04,31.55
2019-02-05,32.51
2019-02-06,31.38
2019-02-07,31.72
2019-02-08,31.77
2019-02-11,31.78
2019-02-12,32.94
2019-02-13,33.42
2019-02-14,33.31
2019-02-15,34
2019-02-19,33.48
2019-02-20,34.18
2019-02-21,33.41
2019-02-22,33.69
2019-02-25,32.97
2019-02-26,34.06
2019-02-27,32.95
2019-02-28,33.6
2019-03-01,35.19
2019-03-04,33.01
2019-03-05,32.1
2019-03-06,31.41
2019-03-07,31.18
2019-03-08,30.44
2019-03-11,31.3
2019-03-12,30.72
2019-03-13,31.62
2019-03-14,31.09
2019-03-15,30.5
2019-03-18,30.17
2019-03-19,29.83
2019-03-20,28.93
2019-03-21,29.75
2019-03-22,29.07
2019-03-25,29.38
2019-03-26,30.05
2019-03-27,31.28
2019-03-28,31.24
2019-03-29,31.43
2019-04-01,31.98
2019-04-02,30.45
2019-04-03,30.17
2019-04-04,30.51
2019-04-05,30.4
2019-04-08,29.93
2019-04-09,29.49
2019-04-10,29.58
2019-04-11,29.56
2019-04-12,29.12
2019-04-15,29.25
2019-04-16,29.2
2019-04-17,28.63
2019-04-18,28.38
2019-04-22,28.55
2019-04-23,29.1
2019-04-24,29.21
2019-04-25,29.16
2019-04-26,28.14
2019-04-29,27.78
2019-04-30,27
2019-05-01,26.8
2019-05-02,27.05
2019-05-03,27.72
2019-05-06,27.45
2019-05-07,26.24
2019-05-08,26.59
2019-05-09,27.49
2019-05-10,27.46
2019-05-13,26.5
2019-05-14,27.2
2019-05-15,27.7
2019-05-16,27.56
2019-05-17,27.11
2019-05-20,26.63
2019-05-21,27.46
2019-05-22,27.84
2019-05-23,28.34
2019-05-24,28.86
2019-05-28,27.36
2019-05-29,27.71
2019-05-30,27.5
2019-05-31,27.23
2019-06-03,25.76
2019-06-04,27.1
2019-06-05,27.28
2019-06-06,26.42
2019-06-07,26.19
2019-06-10,27.56
2019-06-11,28.48
2019-06-12,28.32
2019-06-13,30.15
2019-06-14,30.03
2019-06-17,30.64
2019-06-18,30.83
2019-06-19,31
2019-06-20,31.565
2019-06-21,31.69
2019-06-24,31.23
2019-06-25,30.87
2019-06-26,31.105
2019-06-27,31.4
2019-06-28,31
2019-07-01,29.81
2019-07-02,29.78
2019-07-03,29.96
2019-07-04,29.96
2019-07-05,29.995
2019-07-08,30.725
2019-07-09,30.43
2019-07-10,30.81
2019-07-11,31.065
2019-07-12,31.55
2019-07-15,30.925
2019-07-16,31.5
2019-07-17,31.71
2019-07-18,32.05
2019-07-19,31.66
2019-07-22,31.18
2019-07-23,31.025
2019-07-24,32.035
2019-07-25,32.205
2019-07-26,32.37
2019-07-29,31.705
2019-07-30,31.2
2019-07-31,31.655
2019-08-01,30.36
2019-08-02,29.78
2019-08-05,28.925
2019-08-06,29.79
2019-08-07,31.4
2019-08-08,31.73
2019-08-09,31.295
2019-08-12,30.75
2019-08-13,30.01
2019-08-14,28.75
2019-08-15,28.84
2019-08-16,27.795
2019-08-19,27.525
2019-08-20,27.81
2019-08-21,28.285
2019-08-22,28.75
2019-08-23,26.88
2019-08-26,27.2
2019-08-27,27.005
2019-08-28,27.73
2019-08-29,28.82
2019-08-30,28.34
2019-09-02,28.36
2019-09-03,27.61
2019-09-04,27.87
2019-09-05,27.59
2019-09-06,27.25
2019-09-09,27.94
2019-09-10,30.415
2019-09-11,32.18
2019-09-12,31.4
2019-09-13,30.68
2019-09-16,27.75
2019-09-17,26.95
2019-09-18,26.57
2019-09-19,25.65
2019-09-20,24.925
2019-09-23,24.81
2019-09-24,24.73
2019-09-25,24.96
2019-09-26,24.175
2019-09-27,23.875
2019-09-30,24.06
2019-10-01,25.06
2019-10-02,24.555
2019-10-03,23.045
2019-10-04,23.935
2019-10-07,22.995
2019-10-08,22.79
2019-10-09,22.825
2019-10-10,23.3
2019-10-11,23.94
2019-10-14,23.83
2019-10-15,24.57
2019-10-16,23.9
2019-10-17,23.91
2019-10-18,22.995
2019-10-21,23.125
2019-10-22,23.325
2019-10-23,23.64
2019-10-24,23.815
2019-10-25,23.85
2019-10-28,24.065
2019-10-29,24.08
2019-10-30,23.99
2019-10-31,23.765
2019-11-01,23.565
2019-11-04,24.01
2019-11-05,25.14
2019-11-06,24.79
2019-11-07,29.61
2019-11-08,27.69
2019-11-11,26.735
2019-11-12,27.025
2019-11-13,26.7
2019-11-14,27.015
2019-11-15,27.61
2019-11-18,27.345
2019-11-19,27.25
2019-11-20,28
2019-11-21,28.405
2019-11-22,28.87
2019-11-25,29.885
