date,close
2013-09-10,11.0875
2013-09-11,11.1761
2013-09-12,11.1484
2013-09-13,11.4585
2013-09-16,11.3644
2013-09-17,11.3034
2013-09-18,11.6136
2013-09-19,11.4031
2013-09-20,11.381
2013-09-23,11.5084
2013-09-24,11.608
2013-09-25,11.6911
2013-09-26,11.4906
2013-09-27,11.399
2013-09-30,11.3245
2013-10-01,11.6109
2013-10-02,11.7713
2013-10-03,11.6281
2013-10-04,11.6396
2013-10-07,11.5307
2013-10-08,11.4276
2013-10-09,11.3131
2013-10-10,11.3016
2013-10-11,11.4047
2013-10-14,11.2329
2013-10-15,11.0668
2013-10-16,11.0811
2013-10-17,11.399
2013-10-18,11.6968
2013-10-21,11.651
2013-10-22,11.8973
2013-10-23,11.9603
2013-10-24,11.9718
2013-10-25,11.8801
2013-10-28,11.8973
2013-10-29,11.2672
2013-10-30,11.1298
2013-10-31,10.9465
2013-11-01,11.1699
2013-11-04,11.2443
2013-11-05,11.2615
2013-11-06,11.3302
2013-11-07,11.3302
2013-11-08,11.0897
2013-11-11,10.9178
2013-11-12,11.0123
2013-11-13,11.0725
2013-11-14,11.273
2013-11-15,11.1355
2013-11-18,11.1412
2013-11-19,11.0209
2013-11-20,11.061
2013-11-21,10.9694
2013-11-22,10.9293
2013-11-25,10.9407
2013-11-26,10.8777
2013-11-27,10.9235
2013-11-29,10.8204
2013-12-02,10.5111
2013-12-03,10.4939
2013-12-04,10.5684
2013-12-05,10.4137
2013-12-06,10.3966
2013-12-09,10.5168
2013-12-10,10.6543
2013-12-11,10.4596
2013-12-12,10.4137
2013-12-13,10.4023
2013-12-16,10.2419
2013-12-17,10.282
2013-12-18,10.3335
2013-12-19,10.3221
2013-12-20,10.4252
2013-12-23,10.4252
2013-12-24,10.4309
2013-12-26,10.3679
2013-12-27,10.4273
2013-12-30,10.356
2013-12-31,10.3739
2014-01-02,10.4927
2014-01-03,10.6412
2014-01-06,10.7363
2014-01-07,10.8195
2014-01-08,10.8611
2014-01-09,10.8432
2014-01-10,11.0155
2014-01-13,11.17
2014-01-14,10.968
2014-01-15,10.9918
2014-01-16,11.0571
2014-01-17,11.0393
2014-01-21,11.1878
2014-01-22,11.2235
2014-01-23,11.3542
2014-01-24,11.3245
2014-01-27,11.277
2014-01-28,11.3542
2014-01-29,11.271
2014-01-30,11.372
2014-01-31,11.6156
2014-02-03,11.58
2014-02-04,11.6691
2014-02-05,11.6929
2014-02-06,11.3839
2014-02-07,11.6156
2014-02-10,11.7048
2014-02-11,11.6216
2014-02-12,11.6988
2014-02-13,11.7939
2014-02-14,11.7879
2014-02-18,11.9602
2014-02-19,11.8355
2014-02-20,11.7166
2014-02-21,11.7642
2014-02-24,11.7701
2014-02-25,11.8176
2014-02-26,11.9246
2014-02-27,11.9246
2014-02-28,11.984
2014-03-03,12.0197
2014-03-04,11.987
2014-03-05,12.0672
2014-03-06,12.0256
2014-03-07,11.681
2014-03-10,11.7226
2014-03-11,11.6156
2014-03-12,11.7998
2014-03-13,11.9721
2014-03-14,11.9721
2014-03-17,11.9365
2014-03-18,11.9602
2014-03-19,11.6988
2014-03-20,11.7166
2014-03-21,11.8414
2014-03-24,11.7761
2014-03-25,11.6394
2014-03-26,11.5027
2014-03-27,11.5396
2014-03-28,11.5089
2014-03-31,11.5396
2014-04-01,11.5704
2014-04-02,11.638
2014-04-03,11.6011
2014-04-04,11.6319
2014-04-07,11.7548
2014-04-08,11.7978
2014-04-09,11.7978
2014-04-10,11.8224
2014-04-11,11.8224
2014-04-14,11.7855
2014-04-15,11.8347
2014-04-16,11.9024
2014-04-17,11.8532
2014-04-21,11.9454
2014-04-22,11.9946
2014-04-23,12.0499
2014-04-24,12.0806
2014-04-25,12.1237
2014-04-28,12.1114
2014-04-29,12.013
2014-04-30,12.1729
2014-05-01,12.3819
2014-05-02,12.2651
2014-05-05,12.2159
2014-05-06,12.179
2014-05-07,12.3757
2014-05-08,12.2282
2014-05-09,12.2835
2014-05-12,12.2897
2014-05-13,12.1852
2014-05-14,12.2466
2014-05-15,12.1852
2014-05-16,12.2343
2014-05-19,12.388
2014-05-20,12.3266
2014-05-21,12.3327
2014-05-22,12.4372
2014-05-23,12.5479
2014-05-27,12.6278
2014-05-28,12.5356
2014-05-29,12.5172
2014-05-30,12.5602
2014-06-02,12.468
2014-06-03,12.388
2014-06-04,12.3819
2014-06-05,12.5479
2014-06-06,12.6155
2014-06-09,12.5602
2014-06-10,12.511
2014-06-11,12.5356
2014-06-12,12.6463
2014-06-13,12.634
2014-06-16,12.6155
2014-06-17,12.4987
2014-06-18,12.5663
2014-06-19,12.511
2014-06-20,12.511
2014-06-23,12.5417
2014-06-24,12.4803
2014-06-25,12.4557
2014-06-26,12.6653
2014-06-27,12.7161
2014-06-30,12.7161
2014-07-01,12.5954
2014-07-02,12.57
2014-07-03,12.4303
2014-07-07,12.4239
2014-07-08,12.4684
2014-07-09,12.4938
2014-07-10,12.4874
2014-07-11,12.443
2014-07-14,12.5446
2014-07-15,12.5065
2014-07-16,12.4747
2014-07-17,12.443
2014-07-18,12.4811
2014-07-21,12.5192
2014-07-22,12.6145
2014-07-23,12.6526
2014-07-24,12.6335
2014-07-25,12.6526
2014-07-28,12.7351
2014-07-29,12.7161
2014-07-30,12.6081
2014-07-31,12.6589
2014-08-01,12.7161
2014-08-04,12.7479
2014-08-05,12.7479
2014-08-06,12.8368
2014-08-07,12.7923
2014-08-08,12.8558
2014-08-11,12.913
2014-08-12,12.9003
2014-08-13,12.9003
2014-08-14,12.9003
2014-08-15,12.9702
2014-08-18,12.9829
2014-08-19,12.9892
2014-08-20,13.0019
2014-08-21,12.9829
2014-08-22,12.9321
2014-08-25,12.9702
2014-08-26,13.0083
2014-08-27,13.0083
2014-08-28,12.9892
2014-08-29,13.0718
2014-09-02,12.9638
2014-09-03,12.9257
2014-09-04,12.8622
2014-09-05,12.9765
2014-09-08,12.9892
2014-09-09,12.9384
2014-09-10,12.8558
2014-09-11,13.021
2014-09-12,12.6462
2014-09-15,12.6208
2014-09-16,12.7034
2014-09-17,12.7351
2014-09-18,12.6526
2014-09-19,12.7669
2014-09-22,12.6145
2014-09-23,12.5255
2014-09-24,12.5065
2014-09-25,12.5764
2014-09-26,12.6158
2014-09-29,12.5369
2014-09-30,12.3596
2014-10-01,12.491
2014-10-02,12.399
2014-10-03,12.3925
2014-10-06,12.491
2014-10-07,12.5566
2014-10-08,12.7931
2014-10-09,12.7537
2014-10-10,12.6946
2014-10-13,12.885
2014-10-14,12.8784
2014-10-15,12.9343
2014-10-16,12.954
2014-10-17,12.8719
2014-10-20,13.0558
2014-10-21,13.0689
2014-10-22,13.0295
2014-10-23,13.0295
2014-10-24,13.0295
2014-10-27,13.0295
2014-10-28,13.1543
2014-10-29,12.9704
2014-10-30,12.9376
2014-10-31,12.8653
2014-11-03,12.9376
2014-11-04,12.8784
2014-11-05,12.8522
2014-11-06,12.8456
2014-11-07,12.931
2014-11-10,12.9507
2014-11-11,12.9113
2014-11-12,12.9178
2014-11-13,12.8916
2014-11-14,12.9638
2014-11-17,12.9573
2014-11-18,12.9704
2014-11-19,12.977
2014-11-20,13.0558
2014-11-21,12.9835
2014-11-24,13.082
2014-11-25,13.0952
2014-11-26,13.1805
2014-11-28,13.1805
2014-12-01,13.1083
2014-12-02,13.2002
2014-12-03,13.2396
2014-12-04,13.2199
2014-12-05,13.0952
2014-12-08,12.8128
2014-12-09,13.0361
2014-12-10,12.7405
2014-12-11,12.9113
2014-12-12,12.7668
2014-12-15,12.6158
2014-12-16,12.5172
2014-12-17,12.7143
2014-12-18,12.7931
2014-12-19,13.0164
2014-12-22,13.0361
2014-12-23,13.0164
2014-12-24,12.9047
2014-12-26,12.9934
2014-12-29,13.085
2014-12-30,13.0443
2014-12-31,12.7931
2015-01-02,13.0171
2015-01-05,13.0443
2015-01-06,13.0375
2015-01-07,13.1054
2015-01-08,13.0918
2015-01-09,12.956
2015-01-12,12.8881
2015-01-13,12.7387
2015-01-14,12.7387
2015-01-15,12.6912
2015-01-16,12.7387
2015-01-20,12.5554
2015-01-21,12.6097
2015-01-22,12.8134
2015-01-23,12.7659
2015-01-26,12.9017
2015-01-27,12.8134
2015-01-28,12.7285
2015-01-29,12.7591
2015-01-30,12.6572
2015-02-02,12.6029
2015-02-03,12.827
2015-02-04,12.6505
2015-02-05,12.7455
2015-02-06,12.5418
2015-02-09,12.4603
2015-02-10,12.44
2015-02-11,12.3856
2015-02-12,12.44
2015-02-13,12.4467
2015-02-17,12.3856
2015-02-18,12.4196
2015-02-19,12.3585
2015-02-20,12.406
2015-02-23,12.4128
2015-02-24,12.4264
2015-02-25,12.4332
2015-02-26,12.3924
2015-02-27,12.5282
2015-03-02,12.4807
2015-03-03,12.4467
2015-03-04,12.5079
2015-03-05,12.5079
2015-03-06,12.277
2015-03-09,12.1819
2015-03-10,12.3381
2015-03-11,12.277
2015-03-12,12.3381
2015-03-13,12.3313
2015-03-16,12.2974
2015-03-17,12.3788
2015-03-18,12.569
2015-03-19,12.5146
2015-03-20,12.3517
2015-03-23,12.5282
2015-03-24,12.4943
2015-03-25,12.3924
2015-03-26,12.4875
2015-03-27,12.4945
2015-03-30,12.4735
2015-03-31,12.5364
2015-04-01,12.6201
2015-04-02,12.5782
2015-04-06,12.676
2015-04-07,12.6201
2015-04-08,12.6201
2015-04-09,12.5782
2015-04-10,12.6829
2015-04-13,12.6062
2015-04-14,12.6829
2015-04-15,12.6969
2015-04-16,12.7039
2015-04-17,12.6829
2015-04-20,12.7178
2015-04-21,12.6271
2015-04-22,12.6411
2015-04-23,12.6411
2015-04-24,12.6271
2015-04-27,12.6341
2015-04-28,12.4631
2015-04-29,12.3619
2015-04-30,12.2432
2015-05-01,12.299
2015-05-04,12.2781
2015-05-05,12.1524
2015-05-06,12.1036
2015-05-07,12.1315
2015-05-08,12.1873
2015-05-11,12.0966
2015-05-12,12.1141
2015-05-13,12.0826
2015-05-14,12.1315
2015-05-15,12.1943
2015-05-18,12.1873
2015-05-19,12.1734
2015-05-20,12.2013
2015-05-21,12.1873
2015-05-22,12.1385
2015-05-26,12.0966
2015-05-27,12.1315
2015-05-28,12.1664
2015-05-29,12.1943
2015-06-01,12.299
2015-06-02,12.1594
2015-06-03,12.0687
2015-06-04,12.0617
2015-06-05,11.9012
2015-06-08,11.8663
2015-06-09,11.8244
2015-06-10,11.8872
2015-06-11,12.0268
2015-06-12,12.0338
2015-06-15,12.0198
2015-06-16,12.0408
2015-06-17,12.1524
2015-06-18,12.2222
2015-06-19,12.2502
2015-06-22,12.2153
2015-06-23,12.2083
2015-06-24,12.0966
2015-06-25,11.9779
2015-06-26,11.6976
2015-06-29,11.5034
2015-06-30,11.4962
2015-07-01,11.6185
2015-07-02,11.6976
2015-07-06,11.791
2015-07-07,12.0642
2015-07-08,12.0283
2015-07-09,11.8557
2015-07-10,11.8485
2015-07-13,11.827
2015-07-14,11.8485
2015-07-15,11.8413
2015-07-16,11.8773
2015-07-17,11.8917
2015-07-20,11.8413
2015-07-21,11.7766
2015-07-22,11.7694
2015-07-23,11.6041
2015-07-24,11.4891
2015-07-27,11.4747
2015-07-28,11.525
2015-07-29,11.5753
2015-07-30,11.5538
2015-07-31,11.6041
2015-08-03,11.5681
2015-08-04,11.4819
2015-08-05,11.3884
2015-08-06,11.3596
2015-08-07,11.2949
2015-08-10,11.1799
2015-08-11,11.3596
2015-08-12,11.3884
2015-08-13,11.3381
2015-08-14,11.374
2015-08-17,11.4962
2015-08-18,11.4891
2015-08-19,11.4387
2015-08-20,11.4675
2015-08-21,11.2877
2015-08-24,10.993
2015-08-25,10.9283
2015-08-26,11.0649
2015-08-27,11.1871
2015-08-28,10.993
2015-08-31,10.9786
2015-09-01,10.9354
2015-09-02,10.9498
2015-09-03,10.9426
2015-09-04,10.8564
2015-09-08,10.9354
2015-09-09,10.8707
2015-09-10,10.957
2015-09-11,11.1008
2015-09-14,10.993
2015-09-15,10.993
2015-09-16,10.9858
2015-09-17,11.1943
2015-09-18,11.0433
2015-09-21,11.1296
2015-09-22,11.0217
2015-09-23,11.1008
2015-09-24,11.0864
2015-09-25,10.9283
2015-09-28,10.8175
2015-09-29,10.6994
2015-09-30,10.884
2015-10-01,10.9652
2015-10-02,11.0243
2015-10-05,11.0981
2015-10-06,11.0612
2015-10-07,11.2089
2015-10-08,11.1867
2015-10-09,11.1793
2015-10-12,11.1424
2015-10-13,11.0243
2015-10-14,11.0021
2015-10-15,11.0316
2015-10-16,10.9726
2015-10-19,10.884
2015-10-20,10.8913
2015-10-21,10.8913
2015-10-22,10.9283
2015-10-23,10.9726
2015-10-26,10.9652
2015-10-27,10.6181
2015-10-28,10.8101
2015-10-29,10.692
2015-10-30,10.7141
2015-11-02,10.9726
2015-11-03,11.0464
2015-11-04,10.9726
2015-11-05,10.8397
2015-11-06,10.8397
2015-11-09,10.7954
2015-11-10,11.0021
2015-11-11,11.0021
2015-11-12,10.9356
2015-11-13,10.9356
2015-11-16,10.98
2015-11-17,10.9135
2015-11-18,11.1055
2015-11-19,11.1129
2015-11-20,10.9947
2015-11-23,10.9947
2015-11-24,10.8913
2015-11-25,10.9652
2015-11-27,11.0833
2015-11-30,11.0686
2015-12-01,10.8692
2015-12-02,10.8027
2015-12-03,10.7141
2015-12-04,10.7215
2015-12-07,10.5812
2015-12-08,10.5369
2015-12-09,10.5074
2015-12-10,10.5738
2015-12-11,10.4409
2015-12-14,10.1677
2015-12-15,10.2563
2015-12-16,10.4705
2015-12-17,10.5148
2015-12-18,10.5369
2015-12-21,10.7363
2015-12-22,10.9283
2015-12-23,10.9726
2015-12-24,10.8544
2015-12-28,10.7954
2015-12-29,10.7498
2015-12-30,10.6511
2015-12-31,10.598
2016-01-04,10.6891
2016-01-05,10.9396
2016-01-06,10.9016
2016-01-07,10.8485
2016-01-08,10.727
2016-01-11,10.7118
2016-01-12,10.4385
2016-01-13,10.2032
2016-01-14,10.188
2016-01-15,9.8919
2016-01-19,9.7173
2016-01-20,9.5655
2016-01-21,9.3605
2016-01-22,9.6718
2016-01-25,9.3074
2016-01-26,9.5579
2016-01-27,9.444
2016-01-28,9.5351
2016-01-29,9.8919
2016-02-01,9.8616
2016-02-02,9.8844
2016-02-03,10.1804
2016-02-04,10.2715
2016-02-05,10.2336
2016-02-08,9.983
2016-02-09,9.8312
2016-02-10,9.8008
2016-02-11,9.5807
2016-02-12,9.7249
2016-02-16,9.9223
2016-02-17,10.0893
2016-02-18,10.1652
2016-02-19,10.1273
2016-02-22,10.2032
2016-02-23,10.2791
2016-02-24,10.3019
2016-02-25,10.3247
2016-02-26,10.4537
2016-02-29,10.4917
2016-03-01,10.393
2016-03-02,10.6056
2016-03-03,10.8067
2016-03-04,10.9016
2016-03-07,11.0079
2016-03-08,10.9092
2016-03-09,10.7422
2016-03-10,10.6587
2016-03-11,10.7726
2016-03-14,10.6739
2016-03-15,10.5752
2016-03-16,10.6739
2016-03-17,10.9776
2016-03-18,10.9624
2016-03-21,11.1446
2016-03-22,11.2129
2016-03-23,11.0079
2016-03-24,11.0687
2016-03-28,11.0383
2016-03-29,11.2725
2016-03-30,11.2022
2016-03-31,11.4598
2016-04-01,11.4286
2016-04-04,11.3505
2016-04-05,11.3505
2016-04-06,11.2334
2016-04-07,11.2803
2016-04-08,11.2959
2016-04-11,11.5457
2016-04-12,11.5925
2016-04-13,11.655
2016-04-14,11.6706
2016-04-15,11.6082
2016-04-18,11.6394
2016-04-19,11.6862
2016-04-20,11.6628
2016-04-21,11.6003
2016-04-22,11.616
2016-04-25,11.655
2016-04-26,11.6472
2016-04-27,11.6316
2016-04-28,11.4911
2016-04-29,11.5769
2016-05-02,11.4989
2016-05-03,11.4989
2016-05-04,11.7565
2016-05-05,11.8345
2016-05-06,11.9751
2016-05-09,12.0063
2016-05-10,12.0219
2016-05-11,11.9907
2016-05-12,12.0063
2016-05-13,12.0063
2016-05-16,12.0219
2016-05-17,11.9282
2016-05-18,11.7409
2016-05-19,11.7252
2016-05-20,11.858
2016-05-23,12.1234
2016-05-24,12.2249
2016-05-25,12.1936
2016-05-26,12.2327
2016-05-27,12.342
2016-05-31,12.3576
2016-06-01,12.3732
2016-06-02,12.3654
2016-06-03,12.4044
2016-06-06,12.4356
2016-06-07,12.4747
2016-06-08,12.5059
2016-06-09,12.5371
2016-06-10,12.4825
2016-06-13,12.3341
2016-06-14,12.2014
2016-06-15,12.2288
2016-06-16,12.3498
2016-06-17,12.3263
2016-06-20,12.3654
2016-06-21,12.3185
2016-06-22,12.2951
2016-06-23,12.3263
2016-06-24,12.2873
2016-06-27,12.1936
2016-06-28,12.4019
2016-06-29,12.4901
2016-06-30,12.6503
2016-07-01,12.6903
2016-07-05,12.45
2016-07-06,12.6102
2016-07-07,12.5862
2016-07-08,12.5141
2016-07-11,12.6263
2016-07-12,12.5782
2016-07-13,12.5862
2016-07-14,12.5381
2016-07-15,12.5862
2016-07-18,12.6663
2016-07-19,12.8185
2016-07-20,12.8986
2016-07-21,13.0669
2016-07-22,13.0909
2016-07-25,12.9788
2016-07-26,13.0028
2016-07-27,13.0749
2016-07-28,13.147
2016-07-29,13.107
2016-08-01,13.1951
2016-08-02,13.4434
2016-08-03,13.6037
2016-08-04,13.6197
2016-08-05,13.9241
2016-08-08,13.8921
2016-08-09,14.0603
2016-08-10,14.0603
2016-08-11,13.9882
2016-08-12,13.9482
2016-08-15,13.8761
2016-08-16,13.7399
2016-08-17,13.7399
2016-08-18,13.804
2016-08-19,13.7719
2016-08-22,13.7799
2016-08-23,13.8761
2016-08-24,13.836
2016-08-25,13.844
2016-08-26,13.5716
2016-08-29,13.5796
2016-08-30,13.6197
2016-08-31,13.6638
2016-09-01,13.6277
2016-09-02,13.8921
2016-09-06,14.0203
2016-09-07,14.1805
2016-09-08,14.1805
2016-09-09,13.6037
2016-09-12,13.7719
2016-09-13,13.6277
2016-09-14,13.7319
2016-09-15,13.8841
2016-09-16,13.7959
2016-09-19,13.9081
2016-09-20,13.9001
2016-09-21,13.9962
2016-09-22,14.1885
2016-09-23,14.1084
2016-09-26,14.0523
2016-09-27,14.1565
2016-09-28,14.1401
2016-09-29,14.0745
2016-09-30,14.0909
2016-10-03,13.845
2016-10-04,13.6155
2016-10-05,13.5253
2016-10-06,13.4433
2016-10-07,13.4925
2016-10-10,13.5499
2016-10-11,13.5417
2016-10-12,13.7384
2016-10-13,13.845
2016-10-14,13.7712
2016-10-17,13.7302
2016-10-18,13.7712
2016-10-19,13.9351
2016-10-20,14.0171
2016-10-21,13.9351
2016-10-24,14.0991
2016-10-25,14.263
2016-10-26,14.1401
2016-10-27,13.9966
2016-10-28,13.9351
2016-10-31,13.9761
2016-11-01,13.7302
2016-11-02,13.7302
2016-11-03,13.8532
2016-11-04,13.9351
2016-11-07,14.0171
2016-11-08,14.0171
2016-11-09,13.9761
2016-11-10,13.6073
2016-11-11,13.7712
2016-11-14,13.5253
2016-11-15,13.4023
2016-11-16,13.4843
2016-11-17,13.4433
2016-11-18,13.5663
2016-11-21,13.6482
2016-11-22,13.6892
2016-11-23,13.5663
2016-11-25,13.7712
2016-11-28,13.8122
2016-11-29,13.8942
2016-11-30,13.6892
2016-12-01,13.4843
2016-12-02,13.2384
2016-12-05,13.4023
2016-12-06,13.5663
2016-12-07,13.7712
2016-12-08,13.9351
2016-12-09,13.8942
2016-12-12,13.6073
2016-12-13,13.2384
2016-12-14,13.2794
2016-12-15,12.7466
2016-12-16,13.0744
2016-12-19,13.1154
2016-12-20,13.1154
2016-12-21,13.0744
2016-12-22,13.1154
2016-12-23,13.1564
2016-12-27,13.0335
2016-12-28,13.2016
2016-12-29,13.3278
2016-12-30,13.2016
2017-01-03,13.8743
2017-01-04,14.0425
2017-01-05,14.0845
2017-01-06,14.0425
2017-01-09,14.0845
2017-01-10,14.2107
2017-01-11,14.2107
2017-01-12,13.9164
2017-01-13,14.0425
2017-01-17,13.9164
2017-01-18,13.7482
2017-01-19,13.8743
2017-01-20,13.7902
2017-01-23,13.8323
2017-01-24,13.7482
2017-01-25,13.7482
2017-01-26,13.7061
2017-01-27,13.6221
2017-01-30,13.3698
2017-01-31,13.3698
2017-02-01,13.4118
2017-02-02,13.4118
2017-02-03,13.4539
2017-02-06,13.58
2017-02-07,13.4959
2017-02-08,13.58
2017-02-09,13.4539
2017-02-10,13.538
2017-02-13,13.4118
2017-02-14,13.4118
2017-02-15,13.2857
2017-02-16,13.6641
2017-02-17,13.4539
2017-02-21,13.4959
2017-02-22,13.6221
2017-02-23,13.6641
2017-02-24,13.7482
2017-02-27,13.7482
2017-02-28,13.9164
2017-03-01,14.0425
2017-03-02,14.0845
2017-03-03,13.9164
2017-03-06,13.7482
2017-03-07,13.58
2017-03-08,13.3698
2017-03-09,13.2016
2017-03-10,13.4539
2017-03-13,13.3698
2017-03-14,13.2857
2017-03-15,13.7061
2017-03-16,13.6641
2017-03-17,14.0845
2017-03-20,14.0005
2017-03-21,14.0005
2017-03-22,14.0845
2017-03-23,14.0845
2017-03-24,14.0005
2017-03-27,14.0425
2017-03-28,14.1266
2017-03-29,14.429
2017-03-30,14.4722
2017-03-31,14.4722
2017-04-03,14.429
2017-04-04,14.4722
2017-04-05,14.2562
2017-04-06,14.3426
2017-04-07,14.429
2017-04-10,14.429
2017-04-11,14.645
2017-04-12,14.5154
2017-04-13,14.645
2017-04-17,14.9474
2017-04-18,15.0338
2017-04-19,14.9906
2017-04-20,14.9906
2017-04-21,15.2066
2017-04-24,15.1634
2017-04-25,15.293
2017-04-26,15.4226
2017-04-27,15.8546
2017-04-28,15.5522
2017-05-01,15.8114
2017-05-02,15.5954
2017-05-03,15.4658
2017-05-04,15.2498
2017-05-05,15.5954
2017-05-08,15.6386
2017-05-09,15.4226
2017-05-10,15.4658
2017-05-11,15.3362
2017-05-12,15.2498
2017-05-15,15.3362
2017-05-16,15.4226
2017-05-17,15.293
2017-05-18,15.3362
2017-05-19,15.4658
2017-05-22,15.5954
2017-05-23,15.6818
2017-05-24,15.7682
2017-05-25,15.6386
2017-05-26,15.5954
2017-05-30,15.6386
2017-05-31,15.7682
2017-06-01,15.941
2017-06-02,16.0706
2017-06-05,16.0274
2017-06-06,15.8978
2017-06-07,15.941
2017-06-08,16.1138
2017-06-09,16.2866
2017-06-12,16.2434
2017-06-13,16.2434
2017-06-14,16.5458
2017-06-15,16.5026
2017-06-16,16.7618
2017-06-19,16.8914
2017-06-20,16.8482
2017-06-21,16.589
2017-06-22,16.6754
2017-06-23,16.805
2017-06-26,16.7618
2017-06-27,16.5026
2017-06-28,16.6353
2017-06-29,16.5911
2017-06-30,16.6353
2017-07-03,16.7681
2017-07-05,16.8123
2017-07-06,16.6353
2017-07-07,16.6353
2017-07-10,16.5469
2017-07-11,16.7681
2017-07-12,16.8123
2017-07-13,16.7238
2017-07-14,16.8123
2017-07-17,16.6796
2017-07-18,16.4141
2017-07-19,16.5911
2017-07-20,16.5911
2017-07-21,16.7238
2017-07-24,16.5469
2017-07-25,16.4141
2017-07-26,16.4584
2017-07-27,16.5469
2017-07-28,16.4141
2017-07-31,16.4584
2017-08-01,16.5911
2017-08-02,16.5911
2017-08-03,16.7681
2017-08-04,16.9893
2017-08-07,17.0778
2017-08-08,17.122
2017-08-09,16.9893
2017-08-10,16.945
2017-08-11,16.945
2017-08-14,17.0335
2017-08-15,17.122
2017-08-16,17.0778
2017-08-17,16.9008
2017-08-18,17.0778
2017-08-21,17.0335
2017-08-22,17.0778
2017-08-23,17.0335
2017-08-24,17.122
2017-08-25,17.122
2017-08-28,17.0778
2017-08-29,16.945
2017-08-30,16.8566
2017-08-31,16.9893
2017-09-01,17.0778
2017-09-05,16.8123
2017-09-06,16.6796
2017-09-07,16.7238
2017-09-08,16.6796
2017-09-11,16.9893
2017-09-12,16.945
2017-09-13,16.6796
2017-09-14,16.7238
2017-09-15,16.945
2017-09-18,17.122
2017-09-19,17.299
2017-09-20,17.299
2017-09-21,17.3875
2017-09-22,17.5202
2017-09-25,17.5644
2017-09-26,17.5644
2017-09-27,17.476
2017-09-28,17.7023
2017-09-29,17.5665
2017-10-02,17.6118
2017-10-03,17.6571
2017-10-04,17.7023
2017-10-05,17.7929
2017-10-06,17.5212
2017-10-09,17.5665
2017-10-10,17.5665
2017-10-11,17.5665
2017-10-12,17.6118
2017-10-13,17.7476
2017-10-16,17.7929
2017-10-17,17.8382
2017-10-18,17.8834
2017-10-19,17.8834
2017-10-20,17.8834
2017-10-23,17.6571
2017-10-24,17.6118
2017-10-25,17.3401
2017-10-26,17.0459
2017-10-27,17.159
2017-10-30,16.8421
2017-10-31,16.3894
2017-11-01,16.7063
2017-11-02,16.4346
2017-11-03,16.4799
2017-11-06,16.0725
2017-11-07,16.2083
2017-11-08,16.3441
2017-11-09,16.3441
2017-11-10,16.0725
2017-11-13,16.3441
2017-11-14,16.5252
2017-11-15,16.2083
2017-11-16,16.4346
2017-11-17,16.3894
2017-11-20,16.7968
2017-11-21,16.7063
2017-11-22,16.8421
2017-11-24,16.7063
2017-11-27,16.7063
2017-11-28,16.7516
2017-11-29,16.8421
2017-11-30,16.7968
2017-12-01,16.8421
2017-12-04,16.9779
2017-12-05,16.8421
2017-12-06,16.8648
2017-12-07,16.8874
2017-12-08,16.9327
2017-12-11,16.8421
2017-12-12,16.7968
2017-12-13,16.8874
2017-12-14,16.7968
2017-12-15,16.9327
2017-12-18,17.0232
2017-12-19,16.7063
2017-12-20,16.7968
2017-12-21,16.9779
2017-12-22,16.7968
2017-12-26,16.9327
2017-12-27,17.0459
2017-12-28,17.3947
2017-12-29,17.2086
2018-01-02,16.9761
2018-01-03,16.6505
2018-01-04,16.8366
2018-01-05,16.9761
2018-01-08,16.9296
2018-01-09,16.9761
2018-01-10,16.8366
2018-01-11,17.0691
2018-01-12,17.0226
2018-01-16,16.79
2018-01-17,16.9296
2018-01-18,16.7435
2018-01-19,16.8366
2018-01-22,16.8831
2018-01-23,17.0226
2018-01-24,16.9761
2018-01-25,16.79
2018-01-26,16.5575
2018-01-29,16.0459
2018-01-30,16.0924
2018-01-31,15.8133
2018-02-01,15.9064
2018-02-02,15.7203
2018-02-05,15.2552
2018-02-06,15.7203
2018-02-07,15.7668
2018-02-08,15.6738
2018-02-09,15.5808
2018-02-12,15.8133
2018-02-13,16.0459
2018-02-14,16.1854
2018-02-15,16.511
2018-02-16,16.6505
2018-02-20,16.3249
2018-02-21,16.3249
2018-02-22,16.2319
2018-02-23,16.511
2018-02-26,16.6505
2018-02-27,16.3249
2018-02-28,15.8133
2018-03-01,15.9064
2018-03-02,16.0459
2018-03-05,16.2319
2018-03-06,16.2319
2018-03-07,16.3249
2018-03-08,16.2784
2018-03-09,16.418
2018-03-12,16.697
2018-03-13,16.697
2018-03-14,16.697
2018-03-15,16.604
2018-03-16,16.697
2018-03-19,16.604
2018-03-20,16.511
2018-03-21,16.5575
2018-03-22,16.5575
2018-03-23,16.4645
2018-03-26,16.7435
2018-03-27,16.8366
2018-03-28,16.9322
2018-03-29,17.1235
2018-04-02,16.8844
2018-04-03,17.0279
2018-04-04,17.0757
2018-04-05,17.1235
2018-04-06,17.0279
2018-04-09,17.1714
2018-04-10,17.0279
2018-04-11,17.0757
2018-04-12,17.0279
2018-04-13,16.8365
2018-04-16,16.9322
2018-04-17,17.0757
2018-04-18,16.98
2018-04-19,16.9322
2018-04-20,17.0279
2018-04-23,17.0279
2018-04-24,17.1235
2018-04-25,17.1714
2018-04-26,17.4584
2018-04-27,17.5062
2018-04-30,17.3627
2018-05-01,17.3627
2018-05-02,17.1714
2018-05-03,18.6541
2018-05-04,18.7498
2018-05-07,18.8933
2018-05-08,18.6063
2018-05-09,18.6063
2018-05-10,18.7976
2018-05-11,18.8933
2018-05-14,18.8933
2018-05-15,18.7976
2018-05-16,18.8933
2018-05-17,18.8933
2018-05-18,18.9889
2018-05-21,19.1803
2018-05-22,19.0368
2018-05-23,19.1324
2018-05-24,19.0368
2018-05-25,19.0368
2018-05-29,19.0846
2018-05-30,19.2759
2018-05-31,19.0846
2018-06-01,19.0368
2018-06-04,18.9889
2018-06-05,18.9889
2018-06-06,18.9411
2018-06-07,19.0368
2018-06-08,19.0368
2018-06-11,19.0846
2018-06-12,18.9889
2018-06-13,18.8933
2018-06-14,19.0368
2018-06-15,18.9411
2018-06-18,19.0368
2018-06-19,19.1324
2018-06-20,19.1803
2018-06-21,19.1324
2018-06-22,19.1324
2018-06-25,19.252
2018-06-26,19.2281
2018-06-27,19.081
2018-06-28,19.3262
2018-06-29,19.2281
2018-07-02,19.1791
2018-07-03,19.3262
2018-07-05,19.4734
2018-07-06,19.4734
2018-07-09,19.3753
2018-07-10,19.3753
2018-07-11,19.4734
2018-07-12,19.3753
2018-07-13,19.3262
2018-07-16,19.3262
2018-07-17,19.3262
2018-07-18,19.3753
2018-07-19,19.3753
2018-07-20,19.4243
2018-07-23,19.3262
2018-07-24,19.3262
2018-07-25,19.3262
2018-07-26,19.3753
2018-07-27,19.4734
2018-07-30,19.5715
2018-07-31,19.6696
2018-08-01,19.4243
2018-08-02,19.4734
2018-08-03,19.5224
2018-08-06,19.4734
2018-08-07,19.3262
2018-08-08,19.4243
2018-08-09,19.4243
2018-08-10,19.4243
2018-08-13,19.3753
2018-08-14,19.4243
2018-08-15,19.4734
2018-08-16,19.5715
2018-08-17,19.5715
2018-08-20,19.5715
2018-08-21,19.5715
2018-08-22,19.7186
2018-08-23,19.7186
2018-08-24,19.7186
2018-08-27,19.6205
2018-08-28,19.7186
2018-08-29,19.6696
2018-08-30,19.65
2018-08-31,19.6
2018-09-04,19.75
2018-09-05,19.85
2018-09-06,19.8
