date,close
2017-11-17,12.0939
2017-11-20,12.4918
2017-11-21,12.5415
2017-11-22,12.7304
2017-11-24,12.7503
2017-11-27,12.7901
2017-11-28,12.631
2017-11-29,12.6012
2017-11-30,12.3326
2017-12-01,12.6807
2017-12-04,12.6509
2017-12-05,12.3923
2017-12-06,12.7106
2017-12-07,12.9294
2017-12-08,13.2476
2017-12-11,13.3769
2017-12-12,13.357
2017-12-13,13.1681
2017-12-14,12.9393
2017-12-15,12.8299
2017-12-18,12.6111
2017-12-19,12.5116
2017-12-20,12.5415
2017-12-21,12.6012
2017-12-22,12.5514
2017-12-26,12.81
2017-12-27,12.6509
2017-12-28,12.5017
2017-12-29,12.631
2018-01-02,12.7901
2018-01-03,12.82
2018-01-04,12.9393
2018-01-05,13.0885
2018-01-08,13.2675
2018-01-09,13.8543
2018-01-10,13.6852
2018-01-11,13.7549
2018-01-12,13.536
2018-01-16,13.4068
2018-01-17,13.4963
2018-01-18,13.1382
2018-01-19,13.5261
2018-01-22,13.3968
2018-01-23,12.9691
2018-01-24,13.3471
2018-01-25,13.3172
2018-01-26,13.2377
2018-01-29,12.9493
2018-01-30,12.7304
2018-01-31,12.621
2018-02-01,12.4221
2018-02-02,12.263
2018-02-05,12.1735
2018-02-06,12.4818
2018-02-07,12.8896
2018-02-08,12.9095
2018-02-09,12.9592
2018-02-12,12.989
2018-02-13,12.7004
2018-02-14,12.989
2018-02-15,13.1881
2018-02-16,13.7753
2018-02-20,13.4767
2018-02-21,13.8848
2018-02-22,13.8848
2018-02-23,13.9545
2018-02-26,13.8152
2018-02-27,13.9147
2018-02-28,13.9346
2018-03-01,14.0043
2018-03-02,14.1536
2018-03-05,13.9545
2018-03-06,13.8152
2018-03-07,14.0341
2018-03-08,14.5816
2018-03-09,14.4721
2018-03-12,14.5019
2018-03-13,14.0142
2018-03-14,13.7554
2018-03-15,13.1383
2018-03-16,13.1981
2018-03-19,13.4071
2018-03-20,13.3772
2018-03-21,13.6659
2018-03-22,13.1483
2018-03-23,13.0189
2018-03-26,13.3772
2018-03-27,13.3075
2018-03-28,13.5962
2018-03-29,13.4469
2018-04-02,13.4568
2018-04-03,13.4568
2018-04-04,13.218
2018-04-05,13.2478
2018-04-06,13.208
2018-04-09,13.208
2018-04-10,13.3573
2018-04-11,13.3075
2018-04-12,13.2777
2018-04-13,13.0886
2018-04-16,13.2976
2018-04-17,13.1085
2018-04-18,13.0886
2018-04-19,13.0488
2018-04-20,13.0886
2018-04-23,13.2677
2018-04-24,13.1582
2018-04-25,12.7701
2018-04-26,12.8995
2018-04-27,12.9393
2018-04-30,12.6805
2018-05-01,13.3772
2018-05-02,13.2976
2018-05-03,13.1682
2018-05-04,13.1881
2018-05-07,13.2578
2018-05-08,13.3275
2018-05-09,13.3971
2018-05-10,13.4767
2018-05-11,13.5862
2018-05-14,13.3474
2018-05-15,13.6161
2018-05-16,13.8848
2018-05-17,13.8351
2018-05-18,13.7256
2018-05-21,13.7355
2018-05-22,13.6858
2018-05-23,13.7554
2018-05-24,13.8451
2018-05-25,13.7156
2018-05-29,13.8152
2018-05-30,13.875
2018-05-31,13.5662
2018-06-01,13.8451
2018-06-04,14.2136
2018-06-05,13.9945
2018-06-06,13.9248
2018-06-07,13.7853
2018-06-08,13.7754
2018-06-11,13.6857
2018-06-12,13.6459
2018-06-13,13.4068
2018-06-14,13.4367
2018-06-15,13.5662
2018-06-18,13.6459
2018-06-19,13.8252
2018-06-20,13.875
2018-06-21,13.5264
2018-06-22,13.9447
2018-06-25,13.865
2018-06-26,13.5264
2018-06-27,13.4268
2018-06-28,13.2773
2018-06-29,13.3072
2018-07-02,13.5363
2018-07-03,13.5363
2018-07-05,13.8252
2018-07-06,13.7455
2018-07-09,13.8451
2018-07-10,13.616
2018-07-11,13.6658
2018-07-12,13.5662
2018-07-13,13.4068
2018-07-16,13.3869
2018-07-17,13.357
2018-07-18,13.2176
2018-07-19,12.9486
2018-07-20,13.1977
2018-07-23,13.3072
2018-07-24,13.5762
2018-07-25,13.4467
2018-07-26,13.3072
2018-07-27,13.3371
2018-07-30,12.9785
2018-07-31,12.7694
2018-08-01,12.7594
2018-08-02,12.6698
2018-08-03,12.3112
2018-08-06,12.0024
2018-08-07,11.6637
2018-08-08,11.9327
2018-08-09,11.8132
2018-08-10,11.6737
2018-08-13,11.3151
2018-08-14,11.3052
2018-08-15,11.106
2018-08-16,11.3052
2018-08-17,11.2056
2018-08-20,11.355
2018-08-21,11.4446
2018-08-22,11.4147
2018-08-23,11.4845
2018-08-24,11.963
2018-08-27,11.4746
2018-08-28,11.8235
2018-08-29,11.993
2018-08-30,12.2322
2018-08-31,12.2123
2018-09-04,12.8503
2018-09-05,12.4416
2018-09-06,12.6509
2018-09-07,12.6509
2018-09-10,12.631
2018-09-11,12.621
2018-09-12,12.4316
2018-09-13,12.4615
2018-09-14,12.6509
2018-09-17,12.7506
2018-09-18,12.5213
2018-09-19,13.0198
2018-09-20,13.0597
2018-09-21,12.3718
2018-09-24,11.9132
2018-09-25,11.6341
2018-09-26,11.5244
2018-09-27,10.9661
2018-09-28,11.2752
2018-10-01,11.5045
2018-10-02,11.4147
2018-10-03,11.644
2018-10-04,11.6042
2018-10-05,11.4845
2018-10-08,11.6839
2018-10-09,11.5443
2018-10-10,11.2154
2018-10-11,11.1655
2018-10-12,10.8664
2018-10-15,10.9462
2018-10-16,11.2253
2018-10-17,11.0957
2018-10-18,10.8365
2018-10-19,10.667
2018-10-22,10.5175
2018-10-23,10.1486
2018-10-24,9.5405
2018-10-25,9.9792
2018-10-26,9.8695
2018-10-29,10.0091
2018-10-30,10.0091
2018-10-31,10.3181
2018-11-01,10.1586
2018-11-02,9.9194
2018-11-05,9.4508
2018-11-06,9.3112
2018-11-07,9.5206
2018-11-08,9.2714
2018-11-09,9.4309
2018-11-12,9.3013
2018-11-13,9.5256
2018-11-14,9.2115
2018-11-15,9.4408
2018-11-16,9.4209
2018-11-19,9.2714
2018-11-20,8.9324
2018-11-21,8.9025
2018-11-23,8.8326
2018-11-26,8.6829
2018-11-27,8.6929
2018-11-28,8.6829
2018-11-29,8.653
2018-11-30,8.4134
2018-12-03,8.4533
2018-12-04,7.6749
2018-12-06,7.9344
2018-12-07,7.9044
2018-12-10,8.0841
2018-12-11,8.2038
2018-12-12,8.5731
2018-12-13,8.6829
2018-12-14,8.3735
2018-12-17,8.0841
2018-12-18,7.8745
2018-12-19,7.6449
2018-12-20,7.5751
2018-12-21,7.2357
2018-12-24,7.106
2018-12-26,7.1359
2018-12-27,7.0761
2018-12-28,7.086
2018-12-31,6.9363
2019-01-02,7.1659
2019-01-03,7.2258
2019-01-04,7.7946
2019-01-07,7.3855
2019-01-08,7.5451
2019-01-09,7.625
2019-01-10,7.4054
2019-01-11,8.1939
2019-01-14,8.4034
2019-01-15,8.3835
2019-01-16,8.4334
2019-01-17,8.3436
2019-01-18,8.3535
2019-01-22,7.9543
2019-01-23,7.8745
2019-01-24,7.9843
2019-01-25,8.2837
2019-01-28,8.0841
2019-01-29,8.7827
2019-01-30,8.8326
2019-01-31,8.5831
2019-02-01,8.7428
2019-02-04,9.1819
2019-02-05,8.9723
2019-02-06,9.0422
2019-02-07,9.3616
2019-02-08,9.651
2019-02-11,9.8007
2019-02-12,9.9304
2019-02-13,10.0801
2019-02-14,9.9304
2019-02-15,10.17
2019-02-19,10.2099
2019-02-20,10.3197
2019-02-21,10.2997
2019-02-22,10.2897
2019-02-25,10.1099
2019-02-26,10.1398
2019-02-27,9.8202
2019-02-28,10.0799
2019-03-01,10.1099
2019-03-04,9.9001
2019-03-05,9.8901
2019-03-06,9.6104
2019-03-07,9.5904
2019-03-08,9.5404
2019-03-11,9.99
2019-03-12,9.9101
2019-03-13,9.6903
2019-03-14,9.97
2019-03-15,10.01
2019-03-18,10.5095
2019-03-19,10.0399
2019-03-20,10.1498
2019-03-21,10.01
2019-03-22,9.6004
2019-03-25,9.3906
2019-03-26,9.96
2019-03-27,9.94
2019-03-28,10.01
2019-03-29,10.1299
2019-04-01,10.1598
2019-04-02,9.98
2019-04-03,9.98
2019-04-04,10.1598
2019-04-05,10.03
2019-04-08,9.97
2019-04-09,9.9101
2019-04-10,9.8302
2019-04-11,9.99
2019-04-12,10.0599
2019-04-15,9.8701
2019-04-16,9.9201
2019-04-17,9.8501
2019-04-18,9.7303
2019-04-22,9.5305
2019-04-23,9.7502
2019-04-24,9.7702
2019-04-25,9.5804
2019-04-26,9.6204
2019-04-29,9.95
2019-04-30,9.7802
2019-05-01,9.5404
2019-05-02,9.8002
2019-05-03,9.8601
2019-05-06,9.8601
2019-05-07,9.9101
2019-05-08,9.95
2019-05-09,10.03
2019-05-10,10.0599
2019-05-13,9.7303
2019-05-14,9.8601
2019-05-15,9.8002
2019-05-16,9.8501
2019-05-17,9.8501
2019-05-20,9.95
2019-05-21,10.0599
2019-05-22,9.99
2019-05-23,9.56
2019-05-24,9.68
2019-05-28,9.53
2019-05-29,9.37
2019-05-30,9.17
2019-05-31,8.89
2019-06-03,9.18
2019-06-04,9.49
2019-06-05,9.44
2019-06-06,9.41
2019-06-07,9.58
2019-06-10,9.67
2019-06-11,9.77
2019-06-12,9.8
2019-06-13,9.86
2019-06-14,9.82
2019-06-17,10.19
2019-06-18,10.335
2019-06-19,10.015
2019-06-20,9.87
2019-06-21,9.985
2019-06-24,9.915
2019-06-25,9.74
2019-06-26,9.835
2019-06-27,10.02
2019-06-28,9.7
2019-07-01,10.01
2019-07-02,10.005
2019-07-03,10.01
2019-07-04,10.01
2019-07-05,10.11
2019-07-08,10.085
2019-07-09,10.23
2019-07-10,10.11
2019-07-11,9.97
2019-07-12,9.99
2019-07-15,10.06
2019-07-16,9.95
2019-07-17,10.055
2019-07-18,10.06
2019-07-19,9.87
2019-07-22,9.985
2019-07-23,10
2019-07-24,10.23
2019-07-25,10.255
2019-07-26,9.98
2019-07-29,9.935
2019-07-30,9.89
2019-07-31,9.885
2019-08-01,9.74
2019-08-02,9.685
2019-08-05,9.37
2019-08-06,9.4
2019-08-07,9.255
2019-08-08,9.15
2019-08-09,9.38
2019-08-12,9.15
2019-08-13,9.12
2019-08-14,8.97
2019-08-15,9.06
2019-08-16,9.44
2019-08-19,9.62
2019-08-20,9.64
2019-08-21,9.58
2019-08-22,9.76
2019-08-23,9.49
2019-08-26,9.64
2019-08-27,9.31
2019-08-28,9.42
2019-08-29,9.415
2019-08-30,9.305
2019-09-02,9.305
2019-09-03,9.2
2019-09-04,9.205
2019-09-05,9.05
2019-09-06,9.29
2019-09-09,9.66
2019-09-10,9.835
2019-09-11,9.96
2019-09-12,10.09
2019-09-13,10.18
2019-09-16,10.06
2019-09-17,10.03
2019-09-18,10.01
2019-09-19,9.9
2019-09-20,10.09
2019-09-23,10.09
2019-09-24,9.99
2019-09-25,9.99
2019-09-26,9.98
2019-09-27,9.74
2019-09-30,9.8
2019-10-01,9.78
2019-10-02,9.76
2019-10-03,9.76
2019-10-04,9.86
2019-10-07,9.89
2019-10-08,9.835
2019-10-09,9.975
2019-10-10,9.895
2019-10-11,9.9
2019-10-14,9.95
2019-10-15,9.95
2019-10-16,9.95
2019-10-17,9.94
2019-10-18,9.97
2019-10-21,10
2019-10-22,9.98
2019-10-23,9.99
2019-10-24,9.97
2019-10-25,9.99
2019-10-28,9.99
2019-10-29,9.72
2019-10-30,9.715
2019-10-31,9.7
2019-11-01,9.755
2019-11-04,9.84
2019-11-05,10
2019-11-06,9.98
2019-11-07,10
2019-11-08,9.98
2019-11-11,10
2019-11-12,9.99
2019-11-13,9.955
2019-11-14,9.96
2019-11-15,9.96
2019-11-18,9.94
2019-11-19,9.93
2019-11-20,9.94
2019-11-21,9.885
2019-11-22,9.85
2019-11-25,9.71
