date,close
2014-06-13,68.4547
2014-06-16,68.2385
2014-06-17,68.1935
2014-06-18,68.0854
2014-06-19,68.0133
2014-06-20,68.2656
2014-06-23,68.1124
2014-06-24,67.5989
2014-06-25,67.5809
2014-06-26,68.0223
2014-06-27,68.4457
2014-06-30,68.2385
2014-07-01,68.4637
2014-07-02,68.1304
2014-07-03,68.6259
2014-07-07,66.4008
2014-07-08,66.1216
2014-07-09,66.0765
2014-07-10,65.9684
2014-07-11,65.7973
2014-07-14,65.8783
2014-07-15,65.9054
2014-07-16,66.2387
2014-07-17,65.6621
2014-07-18,66.4188
2014-07-21,66.4459
2014-07-22,66.1306
2014-07-23,65.8513
2014-07-24,66.0855
2014-07-25,65.482
2014-07-28,65.1937
2014-07-29,61.3922
2014-07-30,62.5632
2014-07-31,61.5003
2014-08-01,62.2299
2014-08-04,62.2299
2014-08-05,62.2389
2014-08-06,62.1399
2014-08-07,61.4552
2014-08-08,62.284
2014-08-11,61.8966
2014-08-12,61.9146
2014-08-13,62.5813
2014-08-14,62.1489
2014-08-15,62.1759
2014-08-18,62.7254
2014-08-19,63.1668
2014-08-20,63.4641
2014-08-21,64.0046
2014-08-22,63.9776
2014-08-25,63.8064
2014-08-26,64.0767
2014-08-27,63.7163
2014-08-28,63.8875
2014-08-29,64.3109
2014-09-02,63.9595
2014-09-03,63.9866
2014-09-04,63.2569
2014-09-05,64.1094
2014-09-08,63.9824
2014-09-09,63.2478
2014-09-10,63.3385
2014-09-11,63.8826
2014-09-12,63.275
2014-09-15,62.5313
2014-09-16,63.1934
2014-09-17,63.2478
2014-09-18,63.7103
2014-09-19,63.3657
2014-09-22,61.9419
2014-09-23,61.561
2014-09-24,61.8874
2014-09-25,61.0168
2014-09-26,61.4159
2014-09-29,60.908
2014-09-30,60.2187
2014-10-01,60.2187
2014-10-02,59.9104
2014-10-03,59.4569
2014-10-06,59.6837
2014-10-07,58.677
2014-10-08,59.3481
2014-10-09,57.6885
2014-10-10,56.1376
2014-10-13,55.793
2014-10-14,56.0651
2014-10-15,56.9357
2014-10-16,57.1262
2014-10-17,58.2507
2014-10-20,58.7133
2014-10-21,60.4092
2014-10-22,59.865
2014-10-23,60.5543
2014-10-24,61.0622
2014-10-27,61.6607
2014-10-28,61.9872
2014-10-29,64.1366
2014-10-30,63.9461
2014-10-31,63.1208
2014-11-03,63.5834
2014-11-04,63.9098
2014-11-05,64.1366
2014-11-06,64.0822
2014-11-07,64.2091
2014-11-10,64.5356
2014-11-11,64.6898
2014-11-12,64.4268
2014-11-13,63.9461
2014-11-14,64.0459
2014-11-17,63.8282
2014-11-18,64.6591
2014-11-19,64.7138
2014-11-20,65.2708
2014-11-21,65.6908
2014-11-24,64.8691
2014-11-25,65.5995
2014-11-26,65.3438
2014-11-28,65.4351
2014-12-01,65.4808
2014-12-02,64.4308
2014-12-03,64.2391
2014-12-04,64.5769
2014-12-05,65.0973
2014-12-08,64.7047
2014-12-09,64.7047
2014-12-10,63.6091
2014-12-11,64.4673
2014-12-12,63.107
2014-12-15,62.7783
2014-12-16,62.3857
2014-12-17,63.8647
2014-12-18,65.2708
2014-12-19,66.5125
2014-12-22,67.2794
2014-12-23,67.1698
2014-12-24,67.1881
2014-12-26,67.3616
2014-12-29,66.9507
2014-12-30,66.4577
2014-12-31,65.5721
2015-01-02,65.3895
2015-01-05,63.6274
2015-01-06,62.3492
2015-01-07,62.5135
2015-01-08,63.9469
2015-01-09,63.8556
2015-01-12,62.8878
2015-01-13,62.477
2015-01-14,62.4678
2015-01-15,61.4544
2015-01-16,61.7557
2015-01-20,61.7466
2015-01-21,62.2852
2015-01-22,63.0796
2015-01-23,63.6365
2015-01-26,63.7187
2015-01-27,63.3443
2015-01-28,62.3126
2015-01-29,62.0387
2015-01-30,61.2901
2015-02-02,62.1392
2015-02-03,63.1526
2015-02-04,62.7052
2015-02-05,63.4448
2015-02-06,69.5528
2015-02-09,69.0597
2015-02-10,69.4432
2015-02-11,69.918
2015-02-12,70.5845
2015-02-13,70.9679
2015-02-17,71.324
2015-02-18,71.6344
2015-02-19,71.8718
2015-02-20,71.5249
2015-02-23,71.2601
2015-02-24,71.7166
2015-02-25,71.3879
2015-02-26,70.9771
2015-02-27,70.9223
2015-03-02,71.9175
2015-03-03,70.7032
2015-03-04,70.0641
2015-03-05,69.7901
2015-03-06,69.0828
2015-03-09,68.9726
2015-03-10,66.9424
2015-03-11,66.6024
2015-03-12,66.6024
2015-03-13,66.0421
2015-03-16,66.8137
2015-03-17,66.235
2015-03-18,66.4463
2015-03-19,66.3085
2015-03-20,66.8321
2015-03-23,66.9607
2015-03-24,66.0237
2015-03-25,64.8937
2015-03-26,67.319
2015-03-27,70.5067
2015-03-30,71.3151
2015-03-31,72.3532
2015-04-01,72.1971
2015-04-02,72.2981
2015-04-06,74.1446
2015-04-07,73.2903
2015-04-08,73.6118
2015-04-09,74.117
2015-04-10,74.411
2015-04-13,73.8139
2015-04-14,73.9517
2015-04-15,74.5121
2015-04-16,73.8139
2015-04-17,72.1603
2015-04-20,72.8493
2015-04-21,75.2654
2015-04-22,75.7522
2015-04-23,75.3297
2015-04-24,74.5029
2015-04-27,74.1722
2015-04-28,74.4937
2015-04-29,72.8126
2015-04-30,73.7128
2015-05-01,73.9057
2015-05-04,73.9241
2015-05-05,72.8217
2015-05-06,72.1144
2015-05-07,71.8388
2015-05-08,72.4543
2015-05-11,71.8939
2015-05-12,71.4438
2015-05-13,71.0579
2015-05-14,72.344
2015-05-15,72.2705
2015-05-18,72.7666
2015-05-19,72.9412
2015-05-20,73.3847
2015-05-21,73.3015
2015-05-22,74.1702
2015-05-26,73.089
2015-05-27,74.1055
2015-05-28,73.2369
2015-05-29,73.2091
2015-06-01,73.6527
2015-06-02,72.8302
2015-06-03,72.59
2015-06-04,71.8969
2015-06-05,72.5345
2015-06-08,72.0817
2015-06-09,72.0909
2015-06-10,72.9227
2015-06-11,72.6731
2015-06-12,72.3127
2015-06-15,72.1002
2015-06-16,72.6362
2015-06-17,72.6362
2015-06-18,73.0335
2015-06-19,73.1629
2015-06-22,74.0963
2015-06-23,73.6065
2015-06-24,72.9781
2015-06-25,72.4514
2015-06-26,72.3312
2015-06-29,71.2592
2015-06-30,71.0744
2015-07-01,71.5087
2015-07-02,71.8414
2015-07-06,70.8526
2015-07-07,71.5365
2015-07-08,71.0097
2015-07-09,72.5345
2015-07-10,73.3293
2015-07-13,74.1702
2015-07-14,74.66
2015-07-15,75.8706
2015-07-16,76.0739
2015-07-17,75.9353
2015-07-20,75.3623
2015-07-21,75.1221
2015-07-22,75.4178
2015-07-23,75.8614
2015-07-24,74.891
2015-07-27,73.8468
2015-07-28,74.392
2015-07-29,75.5749
2015-07-30,76.0924
2015-07-31,76.6469
2015-08-03,76.0462
2015-08-04,76.037
2015-08-05,76.7578
2015-08-06,76.6469
2015-08-07,75.3808
2015-08-10,78.1717
2015-08-11,76.6376
2015-08-12,77.0812
2015-08-13,76.3142
2015-08-14,76.5822
2015-08-17,76.7208
2015-08-18,76.3604
2015-08-19,75.769
2015-08-20,74.124
2015-08-21,72.4698
2015-08-24,69.4757
2015-08-25,68.1634
2015-08-26,70.0856
2015-08-27,71.213
2015-08-28,71.6566
2015-08-31,70.9912
2015-09-01,68.9766
2015-09-02,69.6235
2015-09-03,70.0024
2015-09-04,68.3482
2015-09-08,71.1391
2015-09-09,70.2554
2015-09-10,69.8275
2015-09-11,68.916
2015-09-14,68.7392
2015-09-15,68.7672
2015-09-16,69.3346
2015-09-17,69.4369
2015-09-18,68.0602
2015-09-21,68.3579
2015-09-22,67.2324
2015-09-23,67.3905
2015-09-24,66.5534
2015-09-25,67.1766
2015-09-28,65.3721
2015-09-29,66.1069
2015-09-30,68.0416
2015-10-01,68.1253
2015-10-02,68.7951
2015-10-05,69.5206
2015-10-06,69.2415
2015-10-07,69.5113
2015-10-08,70.2275
2015-10-09,70.4415
2015-10-12,71.6228
2015-10-13,70.2926
2015-10-14,70.7205
2015-10-15,71.1019
2015-10-16,71.2321
2015-10-19,70.0694
2015-10-20,70.9716
2015-10-21,69.7345
2015-10-22,70.6926
2015-10-23,71.1484
2015-10-26,70.2275
2015-10-27,69.6787
2015-10-28,73.1761
2015-10-29,73.8273
2015-10-30,73.604
2015-11-02,74.1435
2015-11-03,75.3434
2015-11-04,74.2365
2015-11-05,73.9389
2015-11-06,74.0226
2015-11-09,73.9389
2015-11-10,73.5296
2015-11-11,73.9017
2015-11-12,73.2133
2015-11-13,72.7669
2015-11-16,74.9807
2015-11-17,75.9915
2015-11-18,76.8246
2015-11-19,77.8822
2015-11-20,77.4797
2015-11-23,77.4329
2015-11-24,77.1709
2015-11-25,77.6108
2015-11-27,77.7792
2015-11-30,77.8073
2015-12-01,78.6123
2015-12-02,78.3783
2015-12-03,77.6108
2015-12-04,78.8743
2015-12-07,78.4719
2015-12-08,78.8743
2015-12-09,78.0039
2015-12-10,77.8635
2015-12-11,77.1147
2015-12-14,76.6654
2015-12-15,77.592
2015-12-16,78.2098
2015-12-17,77.798
2015-12-18,77.4142
2015-12-21,78.9492
2015-12-22,81.1019
2015-12-23,82.197
2015-12-24,83.7507
2015-12-28,81.5138
2015-12-29,82.6463
2015-12-30,81.832
2015-12-31,81.3359
2016-01-04,82.0379
2016-01-05,82.5246
2016-01-06,81.7758
2016-01-07,80.7182
2016-01-08,80.3438
2016-01-11,81.3734
2016-01-12,83.2172
2016-01-13,79.932
2016-01-14,79.0802
2016-01-15,78.8556
2016-01-19,78.9398
2016-01-20,78.2285
2016-01-21,77.5452
2016-01-22,78.6778
2016-01-25,78.7433
2016-01-26,80.1379
2016-01-27,79.4078
2016-01-28,79.361
2016-01-29,81.4015
2016-02-01,81.1675
2016-02-02,73.2304
2016-02-03,72.9028
2016-02-04,73.792
2016-02-05,70.8343
2016-02-08,68.3446
2016-02-09,68.0732
2016-02-10,68.0639
2016-02-11,67.1185
2016-02-12,67.4461
2016-02-16,68.7565
2016-02-17,69.5053
2016-02-18,69.5895
2016-02-19,70.3663
2016-02-22,71.5457
2016-02-23,70.5723
2016-02-24,70.6284
2016-02-25,71.2649
2016-02-26,71.6393
2016-02-29,73.0245
2016-03-01,74.3161
2016-03-02,75.0181
2016-03-03,75.3176
2016-03-04,75.9541
2016-03-07,74.2506
2016-03-08,73.629
2016-03-09,75.1266
2016-03-10,75.0136
2016-03-11,75.7483
2016-03-14,74.9665
2016-03-15,73.1486
2016-03-16,73.8079
2016-03-17,73.9587
2016-03-18,74.3166
2016-03-21,73.9963
2016-03-22,74.9948
2016-03-23,74.4484
2016-03-24,73.6196
2016-03-28,73.3182
2016-03-29,73.921
2016-03-30,74.1376
2016-03-31,73.337
2016-04-01,73.2805
2016-04-04,72.5175
2016-04-05,70.6996
2016-04-06,72.0466
2016-04-07,71.8959
2016-04-08,72.2538
2016-04-11,72.0089
2016-04-12,72.2632
2016-04-13,73.7891
2016-04-14,73.1392
2016-04-15,72.8943
2016-04-18,73.1769
2016-04-19,74.213
2016-04-20,74.6933
2016-04-21,74.3637
2016-04-22,75.1926
2016-04-25,74.1941
2016-04-26,74.8535
2016-04-27,76.0685
2016-04-28,75.3998
2016-04-29,75.3621
2016-05-02,76.1627
2016-05-03,71.9901
2016-05-04,70.078
2016-05-05,70.4359
2016-05-06,70.257
2016-05-09,71.2742
2016-05-10,72.1502
2016-05-11,71.6321
2016-05-12,71.6887
2016-05-13,71.5097
2016-05-16,72.5929
2016-05-17,72.9885
2016-05-18,72.9791
2016-05-19,73.0073
2016-05-20,74.1659
2016-05-23,73.7797
2016-05-24,74.3919
2016-05-25,74.7499
2016-05-26,75.1296
2016-05-27,75.2907
2016-05-31,74.6651
2016-06-01,75.4139
2016-06-02,75.613
2016-06-03,75.8215
2016-06-06,76.7126
2016-06-07,77.1107
2016-06-08,77.6036
2016-06-09,76.9874
2016-06-10,76.7789
2016-06-13,76.4092
2016-06-14,76.7599
2016-06-15,76.978
2016-06-16,77.7173
2016-06-17,77.6415
2016-06-20,78.8358
2016-06-21,79.1486
2016-06-22,79.0444
2016-06-23,79.7553
2016-06-24,76.7599
2016-06-27,74.3997
2016-06-28,76.1154
2016-06-29,77.8121
2016-06-30,79.0918
2016-07-01,78.286
2016-07-05,77.2908
2016-07-06,78.1439
2016-07-07,77.9827
2016-07-08,79.8121
2016-07-11,80.0112
2016-07-12,80.5325
2016-07-13,80.8833
2016-07-14,81.1013
2016-07-15,80.8264
2016-07-18,80.6179
2016-07-19,80.8738
2016-07-20,81.5468
2016-07-21,81.452
2016-07-22,82.0492
2016-07-25,81.0444
2016-07-26,81.8217
2016-07-27,81.5468
2016-07-28,82.0207
2016-07-29,82.106
2016-08-01,81.1866
2016-08-02,83.3857
2016-08-03,83.4805
2016-08-04,83.6511
2016-08-05,84.1156
2016-08-08,84.3336
2016-08-09,85.1108
2016-08-10,85.2909
2016-08-11,85.1962
2016-08-12,85.1488
2016-08-15,86.0208
2016-08-16,85.3099
2016-08-17,85.2341
2016-08-18,85.9165
2016-08-19,86.2009
2016-08-22,86.4853
2016-08-23,86.5801
2016-08-24,86.2767
2016-08-25,86.5137
2016-08-26,86.1061
2016-08-29,87.7934
2016-08-30,87.8976
2016-08-31,88.1346
2016-09-01,88.0114
2016-09-02,88.8076
2016-09-06,88.4095
2016-09-07,88.9433
2016-09-08,88.4667
2016-09-09,86.6172
2016-09-12,87.6277
2016-09-13,85.6544
2016-09-14,85.3684
2016-09-15,86.112
2016-09-16,85.1873
2016-09-19,85.3398
2016-09-20,85.1396
2016-09-21,85.7021
2016-09-22,86.5696
2016-09-23,86.6363
2016-09-26,85.9213
2016-09-27,87.3036
2016-09-28,87.6563
2016-09-29,86.3789
2016-09-30,87.3322
2016-10-03,87.2274
2016-10-04,86.9986
2016-10-05,87.5038
2016-10-06,87.9709
2016-10-07,88.2951
2016-10-10,88.133
2016-10-11,86.9128
2016-10-12,86.8079
2016-10-13,85.5877
2016-10-14,85.4828
2016-10-17,85.397
2016-10-18,86.1692
2016-10-19,87.3608
2016-10-20,86.7984
2016-10-21,86.3122
2016-10-24,87.0176
2016-10-25,86.4742
2016-10-26,87.113
2016-10-27,84.825
2016-10-28,85.2159
2016-10-31,85.0443
2016-11-01,88.3999
2016-11-02,88.8098
2016-11-03,88.4667
2016-11-04,89.8489
2016-11-07,92.4515
2016-11-08,92.909
2016-11-09,96.4744
2016-11-10,98.0092
2016-11-11,98.5907
2016-11-14,100.1637
2016-11-15,99.973
2016-11-16,99.6473
2016-11-17,99.4461
2016-11-18,99.2353
2016-11-21,99.5515
2016-11-22,99.6952
2016-11-23,99.8102
2016-11-25,100.4042
2016-11-28,99.6569
2016-11-29,100.2988
2016-11-30,99.2257
2016-12-01,99.973
2016-12-02,100.5671
2016-12-05,101.5061
2016-12-06,102.0235
2016-12-07,102.6463
2016-12-08,101.4773
2016-12-09,101.0941
2016-12-12,100.6246
2016-12-13,101.0366
2016-12-14,100.7491
2016-12-15,100.6054
2016-12-16,99.6473
2016-12-19,99.9826
2016-12-20,99.8485
2016-12-21,99.4461
2016-12-22,99.3598
2016-12-23,99.379
2016-12-27,99.1011
2016-12-28,99.0149
2016-12-29,98.7945
2016-12-30,98.1813
2017-01-03,98.4208
2017-01-04,98.9574
2017-01-05,99.082
2017-01-06,100.1743
2017-01-09,97.8651
2017-01-10,97.4531
2017-01-11,97.5298
2017-01-12,97.5298
2017-01-13,97.501
2017-01-17,95.9872
2017-01-18,96.6291
2017-01-19,95.8051
2017-01-20,95.9967
2017-01-23,96.495
2017-01-24,97.7981
2017-01-25,96.8878
2017-01-26,96.9932
2017-01-27,98.2388
2017-01-30,98.0951
2017-01-31,98.4113
2017-02-01,97.5681
2017-02-02,100.5863
2017-02-03,99.9347
2017-02-06,100.73
2017-02-07,100.9312
2017-02-08,100.5192
2017-02-09,100.1168
2017-02-10,101.3145
2017-02-13,102.5313
2017-02-14,103.4224
2017-02-15,102.8283
2017-02-16,104.1027
2017-02-17,104.8788
2017-02-21,106.3735
2017-02-22,105.8177
2017-02-23,105.2429
2017-02-24,106.4501
2017-02-27,106.7088
2017-02-28,105.3003
2017-03-01,106.2681
2017-03-02,105.6836
2017-03-03,105.8369
2017-03-06,105.3003
2017-03-07,105.1375
2017-03-08,105.4249
2017-03-09,105.3866
2017-03-10,106.5034
2017-03-13,106.6671
2017-03-14,106.4457
2017-03-15,107.5914
2017-03-16,107.4951
2017-03-17,108.1306
2017-03-20,108.3616
2017-03-21,106.773
2017-03-22,106.8597
2017-03-23,107.2737
2017-03-24,106.7634
2017-03-27,106.6671
2017-03-28,107.5336
2017-03-29,106.9945
2017-03-30,107.6299
2017-03-31,107.1293
2017-04-03,106.1665
2017-04-04,106.0124
2017-04-05,104.9919
2017-04-06,105.4155
2017-04-07,106.0702
2017-04-10,105.9643
2017-04-11,105.8488
2017-04-12,106.1857
2017-04-13,105.9258
2017-04-17,106.1087
2017-04-18,105.4829
2017-04-19,105.3481
2017-04-20,105.8584
2017-04-21,106.1665
2017-04-24,107.5336
2017-04-25,107.0715
2017-04-26,106.9945
2017-04-27,109.0741
2017-04-28,107.7262
2017-05-01,105.6273
2017-05-02,105.4636
2017-05-03,105.1844
2017-05-04,105.9065
2017-05-05,106.5997
2017-05-08,103.9809
2017-05-09,104.4623
2017-05-10,104.9052
2017-05-11,104.9149
2017-05-12,103.7499
2017-05-15,104.5875
2017-05-16,104.5971
2017-05-17,103.1915
2017-05-18,103.4418
2017-05-19,103.798
2017-05-22,104.5105
2017-05-23,104.886
2017-05-24,105.791
2017-05-25,106.9174
2017-05-26,106.4457
2017-05-30,106.4168
2017-05-31,108.5064
2017-06-01,109.6673
2017-06-02,110.1124
2017-06-05,109.0675
2017-06-06,107.2778
2017-06-07,106.8521
2017-06-08,107.5874
2017-06-09,105.5074
2017-06-12,104.9947
2017-06-13,105.7493
2017-06-14,105.8073
2017-06-15,105.9331
2017-06-16,106.9392
2017-06-19,108.6225
2017-06-20,108.2259
2017-06-21,108.0711
2017-06-22,107.3745
2017-06-23,107.7615
2017-06-26,107.2971
2017-06-27,105.788
2017-06-28,106.8231
2017-06-29,105.4397
2017-06-30,105.5268
2017-07-03,106.0975
2017-07-05,107.2198
2017-07-06,106.6877
2017-07-07,109.1353
2017-07-10,110.1897
2017-07-11,110.983
2017-07-12,111.8247
2017-07-13,111.3894
2017-07-14,111.4281
2017-07-17,109.7931
2017-07-18,110.0737
2017-07-19,110.7025
2017-07-20,110.509
2017-07-21,110.2284
2017-07-24,110.2284
2017-07-25,111.2249
2017-07-26,111.4764
2017-07-27,110.1704
2017-07-28,110.6831
2017-07-31,110.7412
2017-08-01,112.8889
2017-08-02,112.4632
2017-08-03,113.1017
2017-08-04,112.8889
2017-08-07,113.5564
2017-08-08,113.0824
2017-08-09,114.6883
2017-08-10,114.3787
2017-08-11,114.5141
2017-08-14,115.9363
2017-08-15,115.8879
2017-08-16,116.3329
2017-08-17,115.23
2017-08-18,114.8431
2017-08-21,114.698
2017-08-22,116.0814
2017-08-23,115.201
2017-08-24,114.9688
2017-08-25,115.7621
2017-08-28,117.3777
2017-08-29,117.5519
2017-08-30,118.3548
2017-08-31,118.8966
2017-09-01,119.1384
2017-09-05,118.8869
2017-09-06,118.7224
2017-09-07,119.0141
2017-09-08,119.0724
2017-09-11,119.811
2017-09-12,120.1998
2017-09-13,119.8305
2017-09-14,120.7635
2017-09-15,123.31
2017-09-18,125.3608
2017-09-19,127.2367
2017-09-20,127.9073
2017-09-21,127.3825
2017-09-22,128.1017
2017-09-25,127.0812
2017-09-26,127.8296
2017-09-27,127.674
2017-09-28,127.2755
2017-09-29,127.9851
2017-10-02,129.0834
2017-10-03,129.5693
2017-10-04,130.24
2017-10-05,131.0078
2017-10-06,131.8534
2017-10-09,132.0672
2017-10-10,132.2519
2017-10-11,132.1838
2017-10-12,132.7864
2017-10-13,132.7281
2017-10-16,132.0866
2017-10-17,132.2713
2017-10-18,131.0564
2017-10-19,131.8048
2017-10-20,132.8934
2017-10-23,132.9808
2017-10-24,133.1169
2017-10-25,132.9031
2017-10-26,132.0478
2017-10-27,132.699
2017-10-30,131.8339
2017-10-31,135.4107
2017-11-01,133.3016
2017-11-02,133.253
2017-11-03,135.4982
2017-11-06,135.0899
2017-11-07,135.4593
2017-11-08,137.3254
2017-11-09,133.7001
2017-11-10,134.8664
2017-11-13,135.0705
2017-11-14,135.4301
2017-11-15,135.0705
2017-11-16,136.9736
2017-11-17,136.4759
2017-11-20,138.5059
2017-11-21,140.5358
2017-11-22,139.0914
2017-11-24,140.4773
2017-11-27,140.0479
2017-11-28,140.731
2017-11-29,139.7746
2017-11-30,141.0238
2017-12-01,139.4233
2017-12-04,138.2814
2017-12-05,139.15
2017-12-06,139.0914
2017-12-07,139.7551
2017-12-08,139.8039
2017-12-11,139.2086
2017-12-12,138.0179
2017-12-13,138.5254
2017-12-14,137.8715
2017-12-15,140.6237
2017-12-18,139.2378
2017-12-19,139.1402
2017-12-20,138.9158
2017-12-21,139.3549
2017-12-22,139.3452
2017-12-26,138.7791
2017-12-27,139.7746
2017-12-28,139.7746
2017-12-29,138.2424
2018-01-02,138.6523
2018-01-03,139.3842
2018-01-04,139.0036
2018-01-05,140.2821
2018-01-08,142.8781
2018-01-09,142.1169
2018-01-10,141.6582
2018-01-11,141.8046
2018-01-12,143.6686
2018-01-16,142.2633
2018-01-17,144.059
2018-01-18,142.234
2018-01-19,142.3804
2018-01-22,139.7453
2018-01-23,138.9841
2018-01-24,139.6575
2018-01-25,140.9945
2018-01-26,142.6341
2018-01-29,143.6491
2018-01-30,152.5497
2018-01-31,155.5459
2018-02-01,153.8867
2018-02-02,152.1496
2018-02-05,144.6348
2018-02-06,145.0642
2018-02-07,149.1144
2018-02-08,146.2354
2018-02-09,149.3389
2018-02-12,149.1144
2018-02-13,149.3389
2018-02-14,151.2419
2018-02-15,152.4716
2018-02-16,152.8913
2018-02-20,153.2329
2018-02-21,154.365
2018-02-22,154.1893
2018-02-23,154.9798
2018-02-26,155.702
2018-02-27,155.1945
2018-02-28,152.3936
2018-03-01,149.1925
2018-03-02,150.1586
2018-03-05,150.549
2018-03-06,150.9492
2018-03-07,152.5752
2018-03-08,152.5556
2018-03-09,154.4951
2018-03-12,154.789
2018-03-13,154.8673
2018-03-14,154.358
2018-03-15,154.9457
2018-03-16,153.3098
2018-03-19,153.2315
2018-03-20,155.5726
2018-03-21,156.5424
2018-03-22,151.4095
2018-03-23,153.9759
2018-03-26,158.7562
2018-03-27,157.0713
2018-03-28,156.513
2018-03-29,157.9823
2018-04-02,156.366
2018-04-03,156.4346
2018-04-04,158.9717
2018-04-05,160.9699
2018-04-06,157.7472
2018-04-09,159.5006
2018-04-10,159.0696
2018-04-11,158.5504
2018-04-12,159.432
2018-04-13,158.3839
2018-04-16,161.8026
2018-04-17,163.5462
2018-04-18,164.8392
2018-04-19,165.4073
2018-04-20,164.5649
2018-04-23,165.5445
2018-04-24,161.4499
2018-04-25,157.8648
2018-04-26,156.4836
2018-04-27,154.9163
2018-04-30,153.2217
2018-05-01,148.6766
2018-05-02,143.7592
2018-05-03,144.2882
2018-05-04,146.7762
2018-05-07,146.8154
2018-05-08,150.7924
2018-05-09,152.2127
2018-05-10,153.5058
2018-05-11,153.447
2018-05-14,151.9972
2018-05-15,151.7132
2018-05-16,150.5573
2018-05-17,149.7149
2018-05-18,150.7532
2018-05-21,151.3116
2018-05-22,147.648
2018-05-23,150.7826
2018-05-24,150.763
2018-05-25,149.7737
2018-05-29,147.7754
2018-05-30,149.6267
2018-05-31,147.9455
2018-06-01,150.1282
2018-06-04,150.3347
2018-06-05,150.3839
2018-06-06,150.905
2018-06-07,150.4134
2018-06-08,152.0553
2018-06-11,151.6424
2018-06-12,149.8038
2018-06-13,149.6858
2018-06-14,147.4342
2018-06-15,146.7263
2018-06-18,146.7656
2018-06-19,143.0097
2018-06-20,142.7934
2018-06-21,140.7483
2018-06-22,141.2891
2018-06-25,141.702
2018-06-26,141.8692
2018-06-27,141.407
2018-06-28,142.3313
2018-06-29,142.115
2018-07-02,143.521
2018-07-03,143.3145
2018-07-05,141.5545
2018-07-06,141.879
2018-07-09,143.5013
2018-07-10,143.9831
2018-07-11,142.3411
2018-07-12,145.0646
2018-07-13,146.392
2018-07-16,147.0606
2018-07-17,149.0958
2018-07-18,149.5973
2018-07-19,148.0045
2018-07-20,148.3683
2018-07-23,147.6603
2018-07-24,148.4469
2018-07-25,148.8205
2018-07-26,150.6788
2018-07-27,151.2983
2018-07-30,147.8668
2018-07-31,162.1825
2018-08-01,161.1796
2018-08-02,160.6979
2018-08-03,159.6556
2018-08-06,159.9113
2018-08-07,161.3763
2018-08-08,161.7204
2018-08-09,161.8089
2018-08-10,160.5209
2018-08-13,159.8228
2018-08-14,162.1334
2018-08-15,160.0686
2018-08-16,161.1108
2018-08-17,161.8974
2018-08-20,162.4382
2018-08-21,163.3624
2018-08-22,160.9535
2018-08-23,159.3607
2018-08-24,160.4914
2018-08-27,161.7204
2018-08-28,161.8974
2018-08-29,161.8974
2018-08-30,159.7441
2018-08-31,159.7835
2018-09-04,159.6458
2018-09-05,159.9506
2018-09-06,159.4817
2018-09-07,158.1586
2018-09-10,159.1459
2018-09-11,159.2842
2018-09-12,159.6396
2018-09-13,161.407
2018-09-14,162.6413
2018-09-17,164.3494
2018-09-18,165.9095
2018-09-19,163.4312
2018-09-20,160.6073
2018-09-21,162.2068
2018-09-24,160.2123
2018-09-25,162.7301
2018-09-26,163.1646
2018-09-27,165.09
2018-09-28,167.0746
2018-10-01,166.4427
2018-10-02,166.3736
2018-10-03,166.9561
2018-10-04,166.4921
2018-10-05,165.4454
2018-10-08,165.2282
2018-10-09,164.1915
2018-10-10,158.6226
2018-10-11,152.2738
2018-10-12,152.9156
2018-10-15,171.0636
2018-10-16,171.3401
2018-10-17,169.4048
2018-10-18,168.5458
2018-10-19,166.7981
2018-10-22,169.5233
2018-10-23,166.9759
2018-10-24,160.1531
2018-10-25,158.9978
2018-10-26,158.8102
2018-10-29,144.8388
2018-10-30,148.9463
2018-10-31,146.8333
2018-11-01,148.1169
2018-11-02,145.1745
2018-11-05,147.6627
2018-11-06,148.66
2018-11-07,151.158
2018-11-08,149.598
2018-11-09,151.2074
2018-11-12,146.8234
2018-11-13,148.5316
2018-11-14,147.5245
2018-11-15,149.124
2018-11-16,149.0056
2018-11-19,146.231
2018-11-20,144.6413
2018-11-21,143.6344
2018-11-23,144.0114
2018-11-26,144.5967
2018-11-27,139.6564
2018-11-28,142.4539
2018-11-29,141.9877
2018-11-30,141.8091
2018-12-03,141.6603
2018-12-04,137.9303
2018-12-06,138.6346
2018-12-07,138.2874
2018-12-10,142.3051
2018-12-11,143.8229
2018-12-12,145.8466
2018-12-13,147.2553
2018-12-14,147.285
2018-12-17,144.7455
2018-12-18,141.8091
2018-12-19,137.3549
2018-12-20,133.4662
2018-12-21,127.5836
2018-12-24,126.2443
2018-12-26,127.2066
2018-12-27,130.5894
2018-12-28,130.133
2018-12-31,133.5753
2019-01-02,132.0774
2019-01-03,129.0121
2019-01-04,131.8592
2019-01-07,132.7222
2019-01-08,132.6726
2019-01-09,132.2956
2019-01-10,133.8134
2019-01-11,135.8173
2019-01-14,136.9383
2019-01-15,137.6823
2019-01-16,135.48
2019-01-17,137.5434
2019-01-18,141.6405
2019-01-22,138.1386
2019-01-23,140.9857
2019-01-24,140.7972
2019-01-25,142.3349
2019-01-28,141.5512
2019-01-29,153.9812
2019-01-30,153.6637
2019-01-31,151.9575
2019-02-01,152.5427
2019-02-04,155.9751
2019-02-05,156.5406
2019-02-06,156.3819
2019-02-07,156.1735
2019-02-08,158.8818
2019-02-11,159.3778
2019-02-12,160.7864
2019-02-13,160.6674
2019-02-14,160.9451
2019-02-15,163.4847
2019-02-19,163.2764
2019-02-20,163.8815
2019-02-21,163.2566
2019-02-22,164.5561
2019-02-25,162.5721
2019-02-26,161.0444
2019-02-27,160.7567
2019-02-28,163.6137
2019-03-01,163.4748
2019-03-04,162.0265
2019-03-05,161.1237
2019-03-06,159.3381
2019-03-07,160.6283
2019-03-08,161.1762
2019-03-11,162.6208
2019-03-12,160.7379
2019-03-13,161.1663
2019-03-14,159.8412
2019-03-15,160.0803
2019-03-18,162.6906
2019-03-19,162.3518
2019-03-20,160.3892
2019-03-21,161.5648
2019-03-22,158.6856
2019-03-25,159.1438
2019-03-26,159.1339
2019-03-27,158.3169
2019-03-28,159.3331
2019-03-29,159.114
2019-04-01,162.6906
2019-04-02,161.2958
2019-04-03,159.4029
2019-04-04,161.7043
2019-04-05,163.8861
2019-04-08,163.3979
2019-04-09,162.571
2019-04-10,162.0828
2019-04-11,164.6034
2019-04-12,167.2136
2019-04-15,165.0916
2019-04-16,165.5
2019-04-17,165.5399
2019-04-18,165.0318
2019-04-22,164.2447
2019-04-23,166.8948
2019-04-24,165.789
2019-04-25,164.1352
2019-04-26,165.8288
2019-04-29,164.5536
2019-04-30,167.8712
2019-05-01,178.9995
2019-05-02,177.1165
2019-05-03,177.2261
2019-05-06,177.8338
2019-05-07,176.0306
2019-05-08,178.7106
2019-05-09,180.5038
2019-05-10,181.0219
2019-05-13,180.7928
2019-05-14,181.4403
2019-05-15,182.8451
2019-05-16,184.38
2019-05-17,183.65
2019-05-20,183.02
2019-05-21,187.77
2019-05-22,188.34
2019-05-23,188.54
2019-05-24,187.08
2019-05-28,186.48
2019-05-29,186.08
2019-05-30,186.73
2019-05-31,187.19
2019-06-03,189.86
2019-06-04,192.1
2019-06-05,197.7
2019-06-06,197.69
2019-06-07,198.21
2019-06-10,196.58
2019-06-11,188.17
2019-06-12,188.73
2019-06-13,189.3
2019-06-14,190.54
2019-06-17,192.17
2019-06-18,196.03
2019-06-19,198.39
2019-06-20,199.41
2019-06-21,198.6
2019-06-24,197.36
2019-06-25,195.79
2019-06-26,192.06
2019-06-27,190.07
2019-06-28,190.47
2019-07-01,189.185
2019-07-02,189.185
2019-07-03,189.185
2019-07-04,189.185
2019-07-05,189.185
2019-07-08,189.185
2019-07-09,189.185
2019-07-10,189.185
2019-07-11,189.185
2019-07-12,189.185
2019-07-15,189.185
2019-07-16,189.185
2019-07-17,189.185
2019-07-18,189.185
2019-07-19,189.185
2019-07-22,189.185
2019-07-23,189.185
2019-07-24,189.185
2019-07-25,189.185
2019-07-26,189.185
2019-07-29,189.185
2019-07-30,189.185
2019-07-31,189.185
2019-08-01,189.185
2019-08-02,189.185
2019-08-05,189.185
2019-08-06,189.185
2019-08-07,189.185
2019-08-08,189.185
2019-08-09,189.185
2019-08-12,189.185
2019-08-13,189.185
2019-08-14,189.185
2019-08-15,189.185
2019-08-16,189.185
2019-08-19,189.185
2019-08-20,189.185
2019-08-21,189.185
2019-08-22,189.185
2019-08-23,189.185
2019-08-26,189.185
2019-08-27,189.185
2019-08-28,189.185
2019-08-29,189.185
2019-08-30,189.185
2019-09-02,189.185
2019-09-03,189.185
2019-09-04,189.185
2019-09-05,189.185
2019-09-06,189.185
2019-09-09,189.185
2019-09-10,189.185
2019-09-11,189.185
2019-09-12,189.185
2019-09-13,189.185
2019-09-16,189.185
2019-09-17,189.185
2019-09-18,189.185
2019-09-19,189.185
2019-09-20,189.185
2019-09-23,189.185
2019-09-24,189.185
2019-09-25,189.185
2019-09-26,189.185
2019-09-27,189.185
2019-09-30,189.185
2019-10-01,189.185
2019-10-02,189.185
2019-10-03,189.185
2019-10-04,189.185
2019-10-07,189.185
2019-10-08,189.185
2019-10-09,189.185
2019-10-10,189.185
2019-10-11,189.185
2019-10-14,189.185
2019-10-15,189.185
2019-10-16,189.185
2019-10-17,189.185
2019-10-18,189.185
2019-10-21,189.185
2019-10-22,189.185
2019-10-23,189.185
2019-10-24,189.185
2019-10-25,189.185
2019-10-28,189.185
2019-10-29,189.185
2019-10-30,189.185
2019-10-31,189.185
2019-11-01,189.185
2019-11-04,189.185
2019-11-05,189.185
2019-11-06,189.185
2019-11-07,189.185
2019-11-08,189.185
2019-11-11,189.185
2019-11-12,189.185
2019-11-13,189.185
2019-11-14,189.185
2019-11-15,189.185
2019-11-18,189.185
2019-11-19,189.185
2019-11-20,189.185
2019-11-21,189.185
2019-11-22,189.185
2019-11-25,189.185
