date,close
2014-06-13,18.2629
2014-06-16,18.112
2014-06-17,18.112
2014-06-18,18.444
2014-06-19,18.5648
2014-06-20,18.7936
2014-06-23,18.8241
2014-06-24,18.5495
2014-06-25,18.519
2014-06-26,18.519
2014-06-27,18.5495
2014-06-30,18.7326
2014-07-01,19.0682
2014-07-02,19.5258
2014-07-03,19.4648
2014-07-07,19.6478
2014-07-08,19.8309
2014-07-09,19.7089
2014-07-10,19.6173
2014-07-11,19.9834
2014-07-14,19.6783
2014-07-15,19.5868
2014-07-16,19.4648
2014-07-17,19.4038
2014-07-18,19.4038
2014-07-21,19.2207
2014-07-22,19.1902
2014-07-23,19.5563
2014-07-24,19.4343
2014-07-25,19.1902
2014-07-28,19.3428
2014-07-29,19.0682
2014-07-30,18.9156
2014-07-31,18.6105
2014-08-01,18.4885
2014-08-04,18.397
2014-08-05,18.4885
2014-08-06,18.4885
2014-08-07,18.6105
2014-08-08,18.7021
2014-08-11,18.6716
2014-08-12,19.1749
2014-08-13,19.2741
2014-08-14,19.4877
2014-08-15,19.4419
2014-08-18,19.747
2014-08-19,19.8919
2014-08-20,19.93
2014-08-21,19.8309
2014-08-22,19.7928
2014-08-25,19.8156
2014-08-26,19.93
2014-08-27,19.6402
2014-08-28,19.7089
2014-08-29,19.6173
2014-09-02,19.8767
2014-09-03,19.7394
2014-09-04,19.6783
2014-09-05,19.8995
2014-09-08,20.0902
2014-09-09,19.7851
2014-09-10,19.7775
2014-09-11,19.6555
2014-09-12,19.1444
2014-09-15,18.969
2014-09-16,19.0911
2014-09-17,19.1978
2014-09-18,19.0911
2014-09-19,19.297
2014-09-22,18.9995
2014-09-23,18.8012
2014-09-24,18.7249
2014-09-25,18.4885
2014-09-26,18.7478
2014-09-29,18.6639
2014-09-30,18.4885
2014-10-01,18.458
2014-10-02,18.458
2014-10-03,18.5505
2014-10-06,18.5582
2014-10-07,18.5891
2014-10-08,18.9514
2014-10-09,19.0594
2014-10-10,18.9129
2014-10-13,18.9514
2014-10-14,19.2367
2014-10-15,19.1673
2014-10-16,19.0825
2014-10-17,19.0054
2014-10-20,19.2753
2014-10-21,19.4834
2014-10-22,19.4063
2014-10-23,19.4989
2014-10-24,19.5451
2014-10-27,19.7147
2014-10-28,19.8767
2014-10-29,19.6916
2014-10-30,20.6631
2014-10-31,19.9615
2014-11-03,20.4395
2014-11-04,20.6168
2014-11-05,20.6399
2014-11-06,20.5706
2014-11-07,20.6322
2014-11-10,20.771
2014-11-11,20.8096
2014-11-12,20.6631
2014-11-13,20.6168
2014-11-14,20.2005
2014-11-17,20.1851
2014-11-18,20.1696
2014-11-19,20.0848
2014-11-20,20.1619
2014-11-21,20.2313
2014-11-24,20.4935
2014-11-25,20.5474
2014-11-26,20.8404
2014-11-28,21.0332
2014-12-01,20.6399
2014-12-02,20.825
2014-12-03,20.8327
2014-12-04,20.9946
2014-12-05,21.0794
2014-12-08,21.2722
2014-12-09,21.4881
2014-12-10,21.3184
2014-12-11,21.4187
2014-12-12,21.4187
2014-12-15,21.1642
2014-12-16,21.1642
2014-12-17,21.7194
2014-12-18,21.7425
2014-12-19,21.4804
2014-12-22,21.8581
2014-12-23,22.1434
2014-12-24,22.1203
2014-12-26,22.3053
2014-12-29,22.6369
2014-12-30,22.6677
2014-12-31,22.1588
2015-01-02,22.4467
2015-01-05,22.649
2015-01-06,22.7579
2015-01-07,23.1625
2015-01-08,23.1081
2015-01-09,23.0692
2015-01-12,23.1548
2015-01-13,23.038
2015-01-14,23.2092
2015-01-15,23.287
2015-01-16,23.6138
2015-01-20,23.4582
2015-01-21,23.3648
2015-01-22,23.8706
2015-01-23,23.9406
2015-01-26,24.4619
2015-01-27,24.3063
2015-01-28,24.2362
2015-01-29,24.244
2015-01-30,23.7772
2015-02-02,23.3648
2015-02-03,23.606
2015-02-04,23.536
2015-02-05,23.7772
2015-02-06,23.0458
2015-02-09,22.7035
2015-02-10,22.7346
2015-02-11,22.4467
2015-02-12,22.5168
2015-02-13,22.6957
2015-02-17,22.6257
2015-02-18,22.7735
2015-02-19,22.1822
2015-02-20,22.2756
2015-02-23,22.5479
2015-02-24,22.0421
2015-02-25,22.0032
2015-02-26,21.8865
2015-02-27,22.0344
2015-03-02,22.2444
2015-03-03,22.1666
2015-03-04,21.9877
2015-03-05,21.9021
2015-03-06,21.1085
2015-03-09,20.984
2015-03-10,20.6883
2015-03-11,20.5327
2015-03-12,20.8906
2015-03-13,20.9762
2015-03-16,21.2252
2015-03-17,21.2174
2015-03-18,21.8243
2015-03-19,21.8398
2015-03-20,22.4623
2015-03-23,22.5323
2015-03-24,22.3222
2015-03-25,21.9877
2015-03-26,21.692
2015-03-27,21.8632
2015-03-30,22.1978
2015-03-31,21.9177
2015-04-01,21.9353
2015-04-02,22.1396
2015-04-06,22.2574
2015-04-07,21.9589
2015-04-08,22.006
2015-04-09,21.4404
2015-04-10,21.896
2015-04-13,21.896
2015-04-14,21.9589
2015-04-15,21.8332
2015-04-16,21.8253
2015-04-17,21.5346
2015-04-20,21.5111
2015-04-21,21.6682
2015-04-22,21.5189
2015-04-23,21.3697
2015-04-24,21.4875
2015-04-27,21.5425
2015-04-28,21.5896
2015-04-29,21.134
2015-04-30,20.584
2015-05-01,21.1104
2015-05-04,21.1732
2015-05-05,20.6704
2015-05-06,20.7019
2015-05-07,20.9611
2015-05-08,21.2911
2015-05-11,20.9533
2015-05-12,21.134
2015-05-13,20.804
2015-05-14,21.0947
2015-05-15,21.3539
2015-05-18,21.2675
2015-05-19,21.2832
2015-05-20,21.4247
2015-05-21,21.4325
2015-05-22,21.4325
2015-05-26,21.3461
2015-05-27,21.5896
2015-05-28,21.6682
2015-05-29,21.2518
2015-06-01,21.5582
2015-06-02,21.4796
2015-06-03,21.2518
2015-06-04,21.2911
2015-06-05,21.1575
2015-06-08,21.0318
2015-06-09,20.6547
2015-06-10,20.8826
2015-06-11,20.8983
2015-06-12,20.6783
2015-06-15,20.6233
2015-06-16,20.639
2015-06-17,20.8276
2015-06-18,21.1261
2015-06-19,21.1497
2015-06-22,21.0004
2015-06-23,20.7961
2015-06-24,20.3955
2015-06-25,20.1676
2015-06-26,20.0262
2015-06-29,19.437
2015-06-30,19.2248
2015-07-01,19.492
2015-07-02,19.5813
2015-07-06,19.8752
2015-07-07,20.2406
2015-07-08,20.2565
2015-07-09,20.2565
2015-07-10,20.3836
2015-07-13,20.5028
2015-07-14,20.614
2015-07-15,20.7649
2015-07-16,21.0191
2015-07-17,21.0668
2015-07-20,21.035
2015-07-21,20.9079
2015-07-22,20.8682
2015-07-23,20.3677
2015-07-24,20.3757
2015-07-27,20.4551
2015-07-28,20.479
2015-07-29,20.8126
2015-07-30,20.749
2015-07-31,20.9715
2015-08-03,21.0827
2015-08-04,20.8603
2015-08-05,20.5822
2015-08-06,20.5822
2015-08-07,20.5187
2015-08-10,20.3995
2015-08-11,20.7967
2015-08-12,20.8444
2015-08-13,20.9635
2015-08-14,21.043
2015-08-17,21.1621
2015-08-18,21.035
2015-08-19,20.8603
2015-08-20,20.6537
2015-08-21,20.3121
2015-08-24,19.1603
2015-08-25,18.5645
2015-08-26,19.0173
2015-08-27,19.1921
2015-08-28,19.057
2015-08-31,18.6757
2015-09-01,18.3262
2015-09-02,18.501
2015-09-03,18.6678
2015-09-04,18.2944
2015-09-08,18.5089
2015-09-09,18.215
2015-09-10,18.3024
2015-09-11,18.6757
2015-09-14,18.5963
2015-09-15,18.7393
2015-09-16,19.0809
2015-09-17,19.2
2015-09-18,19.1285
2015-09-21,19.3033
2015-09-22,19.0094
2015-09-23,19.0729
2015-09-24,18.7869
2015-09-25,19.0967
2015-09-28,18.8108
2015-09-29,18.8187
2015-09-30,18.914
2015-10-01,18.9855
2015-10-02,19.1643
2015-10-05,19.6063
2015-10-06,19.6545
2015-10-07,20.1125
2015-10-08,20.3696
2015-10-09,20.3536
2015-10-12,20.5866
2015-10-13,20.4018
2015-10-14,20.2571
2015-10-15,20.5544
2015-10-16,20.7473
2015-10-19,20.9642
2015-10-20,21.0044
2015-10-21,20.8919
2015-10-22,21.2053
2015-10-23,21.141
2015-10-26,21.125
2015-10-27,21.1008
2015-10-28,21.3178
2015-10-29,21.1812
2015-10-30,21.2214
2015-11-02,21.4705
2015-11-03,21.1812
2015-11-04,21.1008
2015-11-05,21.4865
2015-11-06,21.2214
2015-11-09,20.6589
2015-11-10,20.9482
2015-11-11,20.9723
2015-11-12,20.7955
2015-11-13,20.4018
2015-11-16,20.7553
2015-11-17,20.7794
2015-11-18,20.9964
2015-11-19,21.0366
2015-11-20,21.3499
2015-11-23,21.3821
2015-11-24,21.4946
2015-11-25,21.6071
2015-11-27,21.7517
2015-11-30,21.6231
2015-12-01,21.8321
2015-12-02,21.2455
2015-12-03,20.7875
2015-12-04,21.0205
2015-12-07,20.9401
2015-12-08,21.0205
2015-12-09,20.8839
2015-12-10,20.675
2015-12-11,20.5785
2015-12-14,20.5544
2015-12-15,20.8517
2015-12-16,21.125
2015-12-17,20.8919
2015-12-18,20.45
2015-12-21,20.4982
2015-12-22,20.4982
2015-12-23,20.6509
2015-12-24,20.683
2015-12-28,20.7794
2015-12-29,21.2133
2015-12-30,21.1008
2015-12-31,20.8357
2016-01-04,20.1881
2016-01-05,21.0164
2016-01-06,21.195
2016-01-07,20.8458
2016-01-08,20.3667
2016-01-11,20.4642
2016-01-12,20.2368
2016-01-13,19.9607
2016-01-14,19.8064
2016-01-15,19.7252
2016-01-19,20.0825
2016-01-20,20.0013
2016-01-21,20.05
2016-01-22,20.6509
2016-01-25,20.4966
2016-01-26,20.9758
2016-01-27,20.789
2016-01-28,20.6915
2016-01-29,21.5198
2016-02-01,21.6904
2016-02-02,21.6498
2016-02-03,22.0071
2016-02-04,22.0964
2016-02-05,21.9178
2016-02-08,21.5442
2016-02-09,21.398
2016-02-10,21.2356
2016-02-11,21.0082
2016-02-12,21.3168
2016-02-16,21.4711
2016-02-17,21.5036
2016-02-18,21.6335
2016-02-19,21.7066
2016-02-22,21.9096
2016-02-23,21.869
2016-02-24,22.0152
2016-02-25,22.3482
2016-02-26,21.9584
2016-02-29,21.8609
2016-03-01,22.3644
2016-03-02,22.4781
2016-03-03,22.3157
2016-03-04,22.4375
2016-03-07,22.5593
2016-03-08,22.1776
2016-03-09,22.3319
2016-03-10,22.1127
2016-03-11,22.5593
2016-03-14,22.5349
2016-03-15,22.47
2016-03-16,22.6567
2016-03-17,22.8273
2016-03-18,22.5593
2016-03-21,22.0396
2016-03-22,22.0883
2016-03-23,21.9178
2016-03-24,21.6985
2016-03-28,21.9665
2016-03-29,22.3319
2016-03-30,22.47
2016-03-31,22.5024
2016-04-01,22.6649
2016-04-04,22.7531
2016-04-05,22.4659
2016-04-06,22.6054
2016-04-07,22.4085
2016-04-08,22.4987
2016-04-11,22.5479
2016-04-12,23.0238
2016-04-13,23.0895
2016-04-14,22.9664
2016-04-15,23.1797
2016-04-18,23.0731
2016-04-19,23.0977
2016-04-20,22.4659
2016-04-21,22.3346
2016-04-22,22.2197
2016-04-25,22.392
2016-04-26,22.5479
2016-04-27,22.6054
2016-04-28,22.5397
2016-04-29,22.3428
2016-05-02,22.589
2016-05-03,22.4659
2016-05-04,22.9336
2016-05-05,23.0074
2016-05-06,23.1551
2016-05-09,23.2454
2016-05-10,23.2536
2016-05-11,22.7859
2016-05-12,22.9582
2016-05-13,22.1869
2016-05-16,22.5151
2016-05-17,21.8669
2016-05-18,21.5387
2016-05-19,21.5961
2016-05-20,21.8833
2016-05-23,21.99
2016-05-24,22.269
2016-05-25,21.9982
2016-05-26,22.1213
2016-05-27,22.2608
2016-05-31,22.0474
2016-06-01,22.3264
2016-06-02,22.5561
2016-06-03,22.8351
2016-06-06,22.6628
2016-06-07,22.8351
2016-06-08,22.4741
2016-06-09,21.4649
2016-06-10,21.1038
2016-06-13,21.6618
2016-06-14,22.0556
2016-06-15,22.1787
2016-06-16,22.2115
2016-06-17,22.1869
2016-06-20,22.2854
2016-06-21,22.1951
2016-06-22,21.9818
2016-06-23,22.0474
2016-06-24,22.0146
2016-06-27,22.1623
2016-06-28,22.63
2016-06-29,22.8515
2016-06-30,22.9992
2016-07-01,23.032
2016-07-05,23.2621
2016-07-06,23.1875
2016-07-07,22.9968
2016-07-08,23.3533
2016-07-11,23.5605
2016-07-12,23.5025
2016-07-13,23.801
2016-07-14,23.6186
2016-07-15,23.5108
2016-07-18,23.5522
2016-07-19,23.7015
2016-07-20,23.859
2016-07-21,24.0248
2016-07-22,24.5636
2016-07-25,24.7875
2016-07-26,24.7792
2016-07-27,24.7792
2016-07-28,25.1025
2016-07-29,25.2103
2016-08-01,24.8041
2016-08-02,24.4724
2016-08-03,24.4642
2016-08-04,24.489
2016-08-05,24.4642
2016-08-08,24.5305
2016-08-09,24.5222
2016-08-10,24.431
2016-08-11,24.1243
2016-08-12,24.2818
2016-08-15,24.1077
2016-08-16,23.5357
2016-08-17,23.7098
2016-08-18,23.6186
2016-08-19,23.287
2016-08-22,23.8424
2016-08-23,23.8258
2016-08-24,23.7844
2016-08-25,24.1574
2016-08-26,23.8839
2016-08-29,24.1326
2016-08-30,24.0497
2016-08-31,23.9419
2016-09-01,23.8258
2016-09-02,24.0082
2016-09-06,24.4144
2016-09-07,24.5139
2016-09-08,24.2569
2016-09-09,23.1792
2016-09-12,23.3367
2016-09-13,22.889
2016-09-14,22.6238
2016-09-15,22.6735
2016-09-16,22.6652
2016-09-19,22.7067
2016-09-20,22.6486
2016-09-21,22.9139
2016-09-22,23.6103
2016-09-23,23.6932
2016-09-26,23.718
2016-09-27,23.5191
2016-09-28,23.6683
2016-09-29,23.2953
2016-09-30,22.9802
2016-10-03,22.6818
2016-10-04,22.3697
2016-10-05,21.867
2016-10-06,21.7832
2016-10-07,21.7246
2016-10-10,21.8586
2016-10-11,21.7748
2016-10-12,22.0262
2016-10-13,22.1267
2016-10-14,21.9592
2016-10-17,21.9508
2016-10-18,22.0262
2016-10-19,22.0262
2016-10-20,21.9508
2016-10-21,22.0262
2016-10-24,22.1854
2016-10-25,21.9592
2016-10-26,21.4397
2016-10-27,20.7024
2016-10-28,20.5349
2016-10-31,20.8868
2016-11-01,20.3757
2016-11-02,20.0741
2016-11-03,19.9819
2016-11-04,19.9819
2016-11-07,20.3673
2016-11-08,20.4176
2016-11-09,20.4176
2016-11-10,20.4679
2016-11-11,20.7443
2016-11-14,21.0459
2016-11-15,20.9119
2016-11-16,20.7611
2016-11-17,20.4511
2016-11-18,20.4008
2016-11-21,20.1076
2016-11-22,20.5935
2016-11-23,20.3924
2016-11-25,20.3924
2016-11-28,20.4679
2016-11-29,20.5097
2016-11-30,20.1495
2016-12-01,19.8227
2016-12-02,19.8562
2016-12-05,20.1579
2016-12-06,20.317
2016-12-07,20.6438
2016-12-08,20.7862
2016-12-09,20.7778
2016-12-12,20.7108
2016-12-13,20.5768
2016-12-14,19.7641
2016-12-15,19.6049
2016-12-16,19.8562
2016-12-19,19.9987
2016-12-20,20.0071
2016-12-21,19.6384
2016-12-22,19.4373
2016-12-23,19.2949
2016-12-27,19.2698
2016-12-28,19.0017
2016-12-29,19.2698
2016-12-30,19.6719
2017-01-03,19.563
2017-01-04,20.032
2017-01-05,20.1763
2017-01-06,20.4224
2017-01-09,20.1593
2017-01-10,19.9556
2017-01-11,20.1254
2017-01-12,20.2187
2017-01-13,20.2017
2017-01-17,20.4139
2017-01-18,20.4055
2017-01-19,20.1084
2017-01-20,20.1933
2017-01-23,20.2017
2017-01-24,20.2951
2017-01-25,20.3206
2017-01-26,20.3206
2017-01-27,20.0065
2017-01-30,19.9047
2017-01-31,20.3885
2017-02-01,20.1169
2017-02-02,20.3206
2017-02-03,20.3291
2017-02-06,20.0914
2017-02-07,20.032
2017-02-08,19.9811
2017-02-09,20.2527
2017-02-10,20.5498
2017-02-13,20.2866
2017-02-14,20.2017
2017-02-15,19.7094
2017-02-16,19.6415
2017-02-17,19.8198
2017-02-21,19.9556
2017-02-22,19.7009
2017-02-23,19.7688
2017-02-24,19.4378
2017-02-27,19.4633
2017-02-28,19.2256
2017-03-01,18.8606
2017-03-02,18.9031
2017-03-03,18.5805
2017-03-06,18.3768
2017-03-07,18.1476
2017-03-08,17.6214
2017-03-09,17.2648
2017-03-10,17.0017
2017-03-13,17.2224
2017-03-14,17.6044
2017-03-15,18.1901
2017-03-16,18.241
2017-03-17,18.3344
2017-03-20,18.0712
2017-03-21,18.0373
2017-03-22,17.511
2017-03-23,17.8505
2017-03-24,17.9863
2017-03-27,17.7062
2017-03-28,17.893
2017-03-29,17.893
2017-03-30,18.1222
2017-03-31,18.2495
2017-04-03,18.3683
2017-04-04,18.293
2017-04-05,18.0606
2017-04-06,17.8626
2017-04-07,17.8195
2017-04-10,18.0433
2017-04-11,18.3188
2017-04-12,18.3016
2017-04-13,18.2844
2017-04-17,18.5254
2017-04-18,18.9472
2017-04-19,19.1366
2017-04-20,19.0505
2017-04-21,18.8267
2017-04-24,18.2844
2017-04-25,18.3791
2017-04-26,18.2069
2017-04-27,18.2241
2017-04-28,17.5268
2017-05-01,17.7765
2017-05-02,17.9917
2017-05-03,17.2428
2017-05-04,16.8726
2017-05-05,17.1825
2017-05-08,16.6488
2017-05-09,16.6918
2017-05-10,16.8984
2017-05-11,16.5799
2017-05-12,16.0978
2017-05-15,16.029
2017-05-16,15.4178
2017-05-17,15.7793
2017-05-18,16.0462
2017-05-19,16.425
2017-05-22,16.0892
2017-05-23,16.0806
2017-05-24,16.5885
2017-05-25,16.3819
2017-05-26,16.0548
2017-05-30,15.6244
2017-05-31,15.4694
2017-06-01,15.7449
2017-06-02,15.8826
2017-06-05,15.633
2017-06-06,15.7018
2017-06-07,16.0204
2017-06-08,15.8051
2017-06-09,16.2356
2017-06-12,16.7865
2017-06-13,16.8037
2017-06-14,16.3475
2017-06-15,16.666
2017-06-16,16.2011
2017-06-19,15.7535
2017-06-20,15.6158
2017-06-21,15.2628
2017-06-22,15.4436
2017-06-23,15.7879
2017-06-26,16.2183
2017-06-27,16.5024
2017-06-28,16.4852
2017-06-29,16.6057
2017-06-30,16.2958
2017-07-03,16.8754
2017-07-05,16.2805
2017-07-06,16.0093
2017-07-07,16.403
2017-07-10,16.0093
2017-07-11,16.0793
2017-07-12,16.263
2017-07-13,16.5167
2017-07-14,16.9016
2017-07-17,16.9891
2017-07-18,16.9366
2017-07-19,17.1641
2017-07-20,17.1728
2017-07-21,17.1816
2017-07-24,17.1291
2017-07-25,17.4528
2017-07-26,17.689
2017-07-27,18.7038
2017-07-28,17.7415
2017-07-31,17.9602
2017-08-01,18.2664
2017-08-02,17.9252
2017-08-03,17.9427
2017-08-04,18.2051
2017-08-07,18.4676
2017-08-08,18.2926
2017-08-09,18.3801
2017-08-10,18.0214
2017-08-11,17.6977
2017-08-14,18.1439
2017-08-15,17.7065
2017-08-16,17.8027
2017-08-17,17.6277
2017-08-18,17.444
2017-08-21,17.8027
2017-08-22,17.514
2017-08-23,17.6365
2017-08-24,17.5928
2017-08-25,17.8727
2017-08-28,17.5753
2017-08-29,17.4703
2017-08-30,17.5928
2017-08-31,17.6015
2017-09-01,17.8814
2017-09-05,17.654
2017-09-06,17.8902
2017-09-07,17.8902
2017-09-08,17.794
2017-09-11,17.9689
2017-09-12,17.8377
2017-09-13,17.7852
2017-09-14,18.1351
2017-09-15,18.1177
2017-09-18,17.8115
2017-09-19,17.6365
2017-09-20,17.4178
2017-09-21,17.1991
2017-09-22,17.1466
2017-09-25,17.689
2017-09-26,17.9864
2017-09-27,17.5928
2017-09-28,17.829
2017-09-29,17.7152
2017-10-02,17.6715
2017-10-03,17.689
2017-10-04,17.7677
2017-10-05,18.0452
2017-10-06,17.7433
2017-10-09,17.8587
2017-10-10,17.9298
2017-10-11,18.0097
2017-10-12,17.9475
2017-10-13,18.2051
2017-10-16,17.9475
2017-10-17,17.9653
2017-10-18,17.841
2017-10-19,17.7611
2017-10-20,17.539
2017-10-23,17.539
2017-10-24,17.1661
2017-10-25,16.9973
2017-10-26,16.8197
2017-10-27,16.7931
2017-10-30,16.7842
2017-10-31,16.5977
2017-11-01,16.6776
2017-11-02,16.9529
2017-11-03,16.4823
2017-11-06,16.5178
2017-11-07,16.8996
2017-11-08,16.8375
2017-11-09,17.0417
2017-11-10,17.1749
2017-11-13,16.9352
2017-11-14,16.9263
2017-11-15,16.9618
2017-11-16,17.2282
2017-11-17,17.095
2017-11-20,16.9707
2017-11-21,17.1128
2017-11-22,17.2549
2017-11-24,17.1927
2017-11-27,16.8552
2017-11-28,17.1217
2017-11-29,17.4858
2017-11-30,17.0773
2017-12-01,17.1394
2017-12-04,17.6101
2017-12-05,17.397
2017-12-06,16.7664
2017-12-07,16.8197
2017-12-08,16.8108
2017-12-11,16.8375
2017-12-12,17.1572
2017-12-13,17.3259
2017-12-14,17.3437
2017-12-15,17.6811
2017-12-18,17.7611
2017-12-19,17.3082
2017-12-20,16.9529
2017-12-21,16.9352
2017-12-22,17.1217
2017-12-26,17.3526
2017-12-27,17.2993
2017-12-28,17.3881
2017-12-29,17.4058
2018-01-02,17.7255
2018-01-03,17.5124
2018-01-04,17.095
2018-01-05,17.0498
2018-01-08,17.1672
2018-01-09,16.5624
2018-01-10,16.4722
2018-01-11,16.3909
2018-01-12,16.1563
2018-01-16,15.9577
2018-01-17,16.075
2018-01-18,15.9938
2018-01-19,16.2014
2018-01-22,16.3819
2018-01-23,16.4541
2018-01-24,16.2826
2018-01-25,16.2375
2018-01-26,15.8313
2018-01-29,15.5606
2018-01-30,15.019
2018-01-31,15.2176
2018-02-01,14.8656
2018-02-02,13.963
2018-02-05,13.5839
2018-02-06,13.5839
2018-02-07,13.5749
2018-02-08,13.0875
2018-02-09,13.0694
2018-02-12,13.259
2018-02-13,13.3131
2018-02-14,13.2138
2018-02-15,13.4756
2018-02-16,13.972
2018-02-20,13.7012
2018-02-21,13.3582
2018-02-22,13.5568
2018-02-23,13.5749
2018-02-26,13.954
2018-02-27,13.5478
2018-02-28,13.6651
2018-03-01,13.963
2018-03-02,14.0081
2018-03-05,14.2518
2018-03-06,14.1345
2018-03-07,14.2428
2018-03-08,14.0623
2018-03-09,13.8817
2018-03-12,14.0532
2018-03-13,14.0081
2018-03-14,13.8366
2018-03-15,13.7012
2018-03-16,13.6832
2018-03-19,13.4846
2018-03-20,13.2409
2018-03-21,13.2499
2018-03-22,13.4034
2018-03-23,13.2229
2018-03-26,13.3763
2018-03-27,13.4485
2018-03-28,13.8908
2018-03-29,13.7464
2018-04-02,13.5839
2018-04-03,13.9359
2018-04-04,14.1074
2018-04-05,14.2064
2018-04-06,14.0222
2018-04-09,14.013
2018-04-10,14.1327
2018-04-11,14.0498
2018-04-12,13.7366
2018-04-13,13.6997
2018-04-16,13.8195
2018-04-17,13.8748
2018-04-18,13.7458
2018-04-19,13.5247
2018-04-20,13.193
2018-04-23,13.193
2018-04-24,13.193
2018-04-25,13.064
2018-04-26,13.4602
2018-04-27,13.6997
2018-04-30,13.5615
2018-05-01,13.6076
2018-05-02,13.322
2018-05-03,13.3312
2018-05-04,13.5247
2018-05-07,13.7366
2018-05-08,13.6813
2018-05-09,13.884
2018-05-10,13.884
2018-05-11,13.7181
2018-05-14,13.5799
2018-05-15,13.3496
2018-05-16,13.3773
2018-05-17,13.451
2018-05-18,13.5799
2018-05-21,13.9024
2018-05-22,13.884
2018-05-23,13.9577
2018-05-24,13.8195
2018-05-25,13.9208
2018-05-29,14.059
2018-05-30,14.3999
2018-05-31,14.4552
2018-06-01,14.4552
2018-06-04,14.5934
2018-06-05,14.7961
2018-06-06,15.1646
2018-06-07,15.1277
2018-06-08,15.1001
2018-06-11,15.3949
2018-06-12,15.6805
2018-06-13,15.0909
2018-06-14,15.0909
2018-06-15,15.2475
2018-06-18,15.2936
2018-06-19,15.2936
2018-06-20,15.6989
2018-06-21,16.0306
2018-06-22,16.1412
2018-06-25,15.9385
2018-06-26,15.9477
2018-06-27,15.9108
2018-06-28,15.9293
2018-06-29,15.7358
2018-07-02,15.4318
2018-07-03,15.8279
2018-07-05,16.079
2018-07-06,16.1259
2018-07-09,15.957
2018-07-10,15.835
2018-07-11,15.7599
2018-07-12,15.8162
2018-07-13,15.7411
2018-07-16,15.6942
2018-07-17,15.6285
2018-07-18,15.5534
2018-07-19,15.8443
2018-07-20,15.6097
2018-07-23,15.7411
2018-07-24,15.6472
2018-07-25,15.6848
2018-07-26,15.7505
2018-07-27,15.1873
2018-07-30,15.5627
2018-07-31,15.835
2018-08-01,15.9758
2018-08-02,15.8256
2018-08-03,15.9664
2018-08-06,15.7035
2018-08-07,15.544
2018-08-08,15.5346
2018-08-09,15.6754
2018-08-10,15.6191
2018-08-13,15.4689
2018-08-14,15.8256
2018-08-15,15.9758
2018-08-16,16.2761
2018-08-17,16.3794
2018-08-20,16.3888
2018-08-21,16.3981
2018-08-22,16.3324
2018-08-23,16.3606
2018-08-24,16.4357
2018-08-27,16.1823
2018-08-28,16.5296
2018-08-29,16.5765
2018-08-30,16.5483
2018-08-31,16.4075
2018-09-04,16.1729
2018-09-05,16.3324
2018-09-06,16.4075
2018-09-07,16.1823
2018-09-10,16.3231
2018-09-11,16.079
2018-09-12,15.957
2018-09-13,16.0227
2018-09-14,15.6097
2018-09-17,15.6378
2018-09-18,15.7505
2018-09-19,15.4313
2018-09-20,15.6472
2018-09-21,15.6848
2018-09-24,15.2718
2018-09-25,15.422
2018-09-26,15.2436
2018-09-27,15.2999
2018-09-28,15.6285
2018-10-01,15.5346
2018-10-02,15.3375
2018-10-03,14.9996
2018-10-04,14.8248
2018-10-05,14.8344
2018-10-08,15.2653
2018-10-09,15.1696
2018-10-10,14.978
2018-10-11,14.6716
2018-10-12,14.4513
2018-10-15,14.5279
2018-10-16,14.9493
2018-10-17,15.0068
2018-10-18,14.9206
2018-10-19,15.0068
2018-10-22,14.8344
2018-10-23,14.8056
2018-10-24,14.4417
2018-10-25,15.0451
2018-10-26,14.8727
2018-10-29,15.1791
2018-10-30,15.409
2018-10-31,15.1696
2018-11-01,15.3994
2018-11-02,15.0929
2018-11-05,15.4186
2018-11-06,15.4664
2018-11-07,15.6197
2018-11-08,15.7154
2018-11-09,15.5622
2018-11-12,15.5239
2018-11-13,15.5814
2018-11-14,15.3132
2018-11-15,15.1696
2018-11-16,15.4186
2018-11-19,15.3611
2018-11-20,15.1312
2018-11-21,15.1217
2018-11-23,15.1121
2018-11-26,15.1408
2018-11-27,15.1887
2018-11-28,15.5143
2018-11-29,15.4664
2018-11-30,15.8112
2018-12-03,15.7729
2018-12-04,15.3707
2018-12-06,16.0123
2018-12-07,15.9261
2018-12-10,15.8591
2018-12-11,15.725
2018-12-12,15.3324
2018-12-13,15.6675
2018-12-14,15.9165
2018-12-17,14.8248
2018-12-18,14.729
2018-12-19,14.2023
2018-12-20,13.7618
2018-12-21,13.6947
2018-12-24,13.2063
2018-12-26,13.8384
2018-12-27,13.7043
2018-12-28,13.6181
2018-12-31,13.4936
2019-01-02,13.417
2019-01-03,13.5615
2019-01-04,14.0907
2019-01-07,14.5512
2019-01-08,15.1685
2019-01-09,15.1391
2019-01-10,15.1391
2019-01-11,15.1881
2019-01-14,15.1
2019-01-15,15.2273
2019-01-16,15.5017
2019-01-17,15.5605
2019-01-18,15.6291
2019-01-22,15.2763
2019-01-23,15.1293
2019-01-24,15.2469
2019-01-25,15.5409
2019-01-28,15.7369
2019-01-29,15.8937
2019-01-30,16.1484
2019-01-31,16.2954
2019-02-01,16.2464
2019-02-04,16.3934
2019-02-05,16.4914
2019-02-06,16.3346
2019-02-07,16.5796
2019-02-08,16.5894
2019-02-11,16.8147
2019-02-12,16.6188
2019-02-13,16.5698
2019-02-14,16.5306
2019-02-15,16.56
2019-02-19,16.5894
2019-02-20,15.7957
2019-02-21,15.6781
2019-02-22,15.7173
2019-02-25,15.6781
2019-02-26,15.3645
2019-02-27,15.4919
2019-02-28,15.4233
2019-03-01,15.1587
2019-03-04,14.9726
2019-03-05,15.0314
2019-03-06,14.8452
2019-03-07,14.757
2019-03-08,14.8158
2019-03-11,15.1685
2019-03-12,15.2273
2019-03-13,15.3547
2019-03-14,15.4527
2019-03-15,15.3841
2019-03-18,15.3351
2019-03-19,15.4331
2019-03-20,15.4625
2019-03-21,15.79
2019-03-22,15.49
2019-03-25,15.5
2019-03-26,15.92
2019-03-27,15.82
2019-03-28,16.1
2019-03-29,15.99
2019-04-01,16.14
2019-04-02,16.12
2019-04-03,16.01
2019-04-04,16.01
2019-04-05,16.29
2019-04-08,16.17
2019-04-09,15.8
2019-04-10,16.02
2019-04-11,15.89
2019-04-12,15.94
2019-04-15,15.82
2019-04-16,15.43
2019-04-17,15.54
2019-04-18,15.64
2019-04-22,15.25
2019-04-23,15.48
2019-04-24,15.72
2019-04-25,15.63
2019-04-26,15.87
2019-04-29,15.7
2019-04-30,15.79
2019-05-01,15.97
2019-05-02,16.13
2019-05-03,16.49
2019-05-06,16.54
2019-05-07,16.21
2019-05-08,16.22
2019-05-09,16.18
2019-05-10,16.53
2019-05-13,16.34
2019-05-14,16.23
2019-05-15,16.29
2019-05-16,16.22
2019-05-17,16.29
2019-05-20,15.99
2019-05-21,16.17
2019-05-22,16.14
2019-05-23,15.97
2019-05-24,15.97
2019-05-28,15.58
2019-05-29,15.2
2019-05-30,15.22
2019-05-31,15.2
2019-06-03,15.15
2019-06-04,15.23
2019-06-05,15.46
2019-06-06,15.38
2019-06-07,15.36
2019-06-10,15.41
2019-06-11,15.62
2019-06-12,15.58
2019-06-13,15.78
2019-06-14,16.055
2019-06-17,16.05
2019-06-18,16.105
2019-06-19,16.285
2019-06-20,15.785
2019-06-21,15.555
2019-06-24,15.16
2019-06-25,15.135
2019-06-26,14.735
2019-06-27,15.04
2019-06-28,15.14
2019-07-01,14.885
2019-07-02,15.03
2019-07-03,15.24
2019-07-04,15.24
2019-07-05,15.24
2019-07-08,15.315
2019-07-09,15.545
2019-07-10,15.47
2019-07-11,15.31
2019-07-12,15.4
2019-07-15,15.435
2019-07-16,15.455
2019-07-17,15.485
2019-07-18,15.485
2019-07-19,15.18
2019-07-22,15.095
2019-07-23,15.425
2019-07-24,15.68
2019-07-25,15.645
2019-07-26,15.675
2019-07-29,15.765
2019-07-30,15.945
2019-07-31,15.935
2019-08-01,15.67
2019-08-02,15.63
2019-08-05,15.07
2019-08-06,15.13
2019-08-07,15.35
2019-08-08,15.605
2019-08-09,15.64
2019-08-12,15.37
2019-08-13,15.215
2019-08-14,14.855
2019-08-15,14.57
2019-08-16,14.65
2019-08-19,14.93
2019-08-20,14.58
2019-08-21,14.465
2019-08-22,14.74
2019-08-23,14.395
2019-08-26,14.315
2019-08-27,14.105
2019-08-28,14.18
2019-08-29,14.23
2019-08-30,14.315
2019-09-02,14.315
2019-09-03,14.44
2019-09-04,14.73
2019-09-05,14.865
2019-09-06,15.135
2019-09-09,15.435
2019-09-10,15.715
2019-09-11,16.055
2019-09-12,15.935
2019-09-13,15.825
2019-09-16,15.815
2019-09-17,15.855
2019-09-18,15.965
2019-09-19,15.785
2019-09-20,15.955
2019-09-23,15.805
2019-09-24,15.905
2019-09-25,16.28
2019-09-26,16.395
2019-09-27,16.325
2019-09-30,16.155
2019-10-01,15.955
2019-10-02,15.995
2019-10-03,15.94
2019-10-04,16.065
2019-10-07,16.095
2019-10-08,16.035
2019-10-09,16.075
2019-10-10,16.165
2019-10-11,16.48
2019-10-14,16.495
2019-10-15,16.535
2019-10-16,16.505
2019-10-17,16.625
2019-10-18,16.685
2019-10-21,17.135
2019-10-22,17.355
2019-10-23,17.405
2019-10-24,17.375
2019-10-25,17.445
2019-10-28,17.52
2019-10-29,17.535
2019-10-30,17.855
2019-10-31,17.79
2019-11-01,17.975
2019-11-04,18.125
2019-11-05,18.13
2019-11-06,18.06
2019-11-07,17.98
2019-11-08,18.005
2019-11-11,18.045
2019-11-12,17.905
2019-11-13,18.285
2019-11-14,18.76
2019-11-15,18.865
2019-11-18,19.395
2019-11-19,19.69
2019-11-20,19.64
2019-11-21,18.955
2019-11-22,18.925
2019-11-25,19.195
