date,close
2013-05-17,18.2436
2013-05-20,18.325
2013-05-21,18.2843
2013-05-22,18.3983
2013-05-23,18.2599
2013-05-24,18.5285
2013-05-28,18.4308
2013-05-29,18.5367
2013-05-30,18.6018
2013-05-31,18.3331
2013-06-03,18.5204
2013-06-04,18.5448
2013-06-05,18.3331
2013-06-06,18.4797
2013-06-07,18.2192
2013-06-10,18.2761
2013-06-11,17.8935
2013-06-12,17.8365
2013-06-13,17.9912
2013-06-14,17.9668
2013-06-17,18.1133
2013-06-18,18.1296
2013-06-19,17.7877
2013-06-20,17.1039
2013-06-21,17.0713
2013-06-24,16.3956
2013-06-25,16.7213
2013-06-26,16.7131
2013-06-27,16.9329
2013-06-28,16.8434
2013-07-01,16.9818
2013-07-02,16.8759
2013-07-03,16.8841
2013-07-05,16.6317
2013-07-08,16.9003
2013-07-09,16.9492
2013-07-10,17.1202
2013-07-11,17.5923
2013-07-12,17.4458
2013-07-15,17.5353
2013-07-16,17.7144
2013-07-17,18.0238
2013-07-18,18.0563
2013-07-19,18.1215
2013-07-22,18.1947
2013-07-23,18.3576
2013-07-24,18.2029
2013-07-25,17.9994
2013-07-26,17.7389
2013-07-29,17.633
2013-07-30,17.4865
2013-07-31,17.576
2013-08-01,17.3562
2013-08-02,17.4621
2013-08-05,17.34
2013-08-06,17.3074
2013-08-07,17.3237
2013-08-08,17.5028
2013-08-09,17.747
2013-08-12,17.5272
2013-08-13,17.5516
2013-08-14,17.8365
2013-08-15,17.6819
2013-08-16,17.6656
2013-08-19,17.747
2013-08-20,17.5435
2013-08-21,17.169
2013-08-22,17.1934
2013-08-23,17.5679
2013-08-26,17.4458
2013-08-27,17.7551
2013-08-28,18.439
2013-08-29,18.0726
2013-08-30,17.8691
2013-09-03,18.1133
2013-09-04,18.154
2013-09-05,18.0238
2013-09-06,18.2354
2013-09-09,18.2761
2013-09-10,18.1459
2013-09-11,18.4552
2013-09-12,18.4308
2013-09-13,18.5204
2013-09-16,18.4634
2013-09-17,18.3901
2013-09-18,18.6832
2013-09-19,18.7972
2013-09-20,18.4634
2013-09-23,18.5448
2013-09-24,18.5611
2013-09-25,18.4552
2013-09-26,18.7239
2013-09-27,18.6669
2013-09-30,18.4634
2013-10-01,18.4145
2013-10-02,18.3901
2013-10-03,18.3901
2013-10-04,18.4878
2013-10-07,18.3087
2013-10-08,18.0971
2013-10-09,18.0971
2013-10-10,18.3169
2013-10-11,18.382
2013-10-14,18.4797
2013-10-15,18.5041
2013-10-16,18.4959
2013-10-17,18.7727
2013-10-18,18.9763
2013-10-21,19.1391
2013-10-22,19.1961
2013-10-23,19.0414
2013-10-24,19.2449
2013-10-25,19.6845
2013-10-28,19.4647
2013-10-29,19.6275
2013-10-30,19.3996
2013-10-31,19.2368
2013-11-01,19.2205
2013-11-04,19.3263
2013-11-05,19.1391
2013-11-06,19.3507
2013-11-07,18.9111
2013-11-08,18.6669
2013-11-11,18.6669
2013-11-12,18.268
2013-11-13,18.3657
2013-11-14,18.6018
2013-11-15,18.8867
2013-11-18,18.7483
2013-11-19,18.8053
2013-11-20,18.5611
2013-11-21,18.6506
2013-11-22,18.732
2013-11-25,18.4634
2013-11-26,18.4064
2013-11-27,18.3576
2013-11-29,18.3494
2013-12-02,18.3169
2013-12-03,18.5774
2013-12-04,18.3657
2013-12-05,18.382
2013-12-06,18.4471
2013-12-09,18.6181
2013-12-10,18.8216
2013-12-11,18.5285
2013-12-12,18.3087
2013-12-13,18.3413
2013-12-16,18.5448
2013-12-17,18.7158
2013-12-18,18.9437
2013-12-19,19.017
2013-12-20,18.9681
2013-12-23,19.2938
2013-12-24,19.3345
2013-12-26,19.4403
2013-12-27,19.5298
2013-12-30,19.4973
2013-12-31,19.6438
2014-01-02,19.2856
2014-01-03,19.31
2014-01-06,19.2693
2014-01-07,19.4321
2014-01-08,19.4484
2014-01-09,19.3996
2014-01-10,20.0834
2014-01-13,19.9939
2014-01-14,20.2788
2014-01-15,20.3032
2014-01-16,20.3602
2014-01-17,20.0834
2014-01-21,20.3521
2014-01-22,20.3032
2014-01-23,20.2625
2014-01-24,19.595
2014-01-27,19.6357
2014-01-28,19.9043
2014-01-29,19.6031
2014-01-30,19.6927
2014-01-31,19.3019
2014-02-03,19.0251
2014-02-04,19.2286
2014-02-05,19.2286
2014-02-06,19.4891
2014-02-07,20.6777
2014-02-10,20.4905
2014-02-11,20.8975
2014-02-12,21.1661
2014-02-13,21.0033
2014-02-14,21.2638
2014-02-18,21.5569
2014-02-19,21.4999
2014-02-20,21.4185
2014-02-21,21.4673
2014-02-24,21.5895
2014-02-25,21.4755
2014-02-26,21.3778
2014-02-27,21.3615
2014-02-28,21.4429
2014-03-03,21.9884
2014-03-04,21.907
2014-03-05,21.8744
2014-03-06,22.1186
2014-03-07,21.8744
2014-03-10,22.1268
2014-03-11,22.0861
2014-03-12,22.0779
2014-03-13,22.0942
2014-03-14,22.428
2014-03-17,22.6641
2014-03-18,22.4605
2014-03-19,22.143
2014-03-20,22.0616
2014-03-21,22.3547
2014-03-24,22.7048
2014-03-25,22.7617
2014-03-26,22.5989
2014-03-27,23.2095
2014-03-28,22.9978
2014-03-31,22.9734
2014-04-01,22.8757
2014-04-02,22.8594
2014-04-03,22.7617
2014-04-04,22.8839
2014-04-07,22.4687
2014-04-08,22.5419
2014-04-09,22.8594
2014-04-10,22.6722
2014-04-11,22.6315
2014-04-14,23.0711
2014-04-15,23.413
2014-04-16,23.5433
2014-04-17,23.7549
2014-04-21,23.7712
2014-04-22,23.5595
2014-04-23,23.1932
2014-04-24,23.3642
2014-04-25,23.3235
2014-04-28,23.4537
2014-04-29,24.398
2014-04-30,24.8051
2014-05-01,24.8132
2014-05-02,24.9598
2014-05-05,24.8946
2014-05-06,25.3424
2014-05-07,25.5785
2014-05-08,25.4645
2014-05-09,25.4401
2014-05-12,25.3505
2014-05-13,25.3749
2014-05-14,25.4319
2014-05-15,25.1431
2014-05-16,25.3533
2014-05-19,25.3029
2014-05-20,25.059
2014-05-21,25.5131
2014-05-22,25.4374
2014-05-23,25.4627
2014-05-27,25.757
2014-05-28,25.7738
2014-05-29,25.8158
2014-05-30,25.6477
2014-06-02,25.7233
2014-06-03,25.8158
2014-06-04,25.429
2014-06-05,26.0261
2014-06-06,26.0008
2014-06-09,26.0092
2014-06-10,25.8663
2014-06-11,25.6729
2014-06-12,26.1606
2014-06-13,26.7408
2014-06-16,26.7829
2014-06-17,26.3792
2014-06-18,26.7661
2014-06-19,26.5979
2014-06-20,26.7408
2014-06-23,26.8333
2014-06-24,26.3624
2014-06-25,26.127
2014-06-26,26.0261
2014-06-27,26.1186
2014-06-30,25.9252
2014-07-01,26.0765
2014-07-02,25.8831
2014-07-03,25.9167
2014-07-07,25.6561
2014-07-08,25.5131
2014-07-09,25.6645
2014-07-10,25.3113
2014-07-11,25.2608
2014-07-14,25.4206
2014-07-15,25.387
2014-07-16,25.7065
2014-07-17,25.4206
2014-07-18,25.614
2014-07-21,25.5383
2014-07-22,25.7906
2014-07-23,25.7317
2014-07-24,25.6392
2014-07-25,24.7647
2014-07-28,24.5713
2014-07-29,24.4872
2014-07-30,24.2265
2014-07-31,23.9154
2014-08-01,24.092
2014-08-04,24.6217
2014-08-05,24.1004
2014-08-06,24.1677
2014-08-07,23.8986
2014-08-08,24.134
2014-08-11,24.4452
2014-08-12,23.907
2014-08-13,23.6625
2014-08-14,23.8396
2014-08-15,23.899
2014-08-18,23.7546
2014-08-19,23.8141
2014-08-20,23.95
2014-08-21,24.035
2014-08-22,23.9755
2014-08-25,24.1114
2014-08-26,24.1624
2014-08-27,24.3408
2014-08-28,24.1794
2014-08-29,24.1199
2014-09-02,24.7146
2014-09-03,24.7656
2014-09-04,24.2983
2014-09-05,24.4767
2014-09-08,23.9925
2014-09-09,23.6611
2014-09-10,23.7631
2014-09-11,23.4402
2014-09-12,23.4233
2014-09-15,23.6272
2014-09-16,23.9415
2014-09-17,23.7376
2014-09-18,24.1794
2014-09-19,24.1284
2014-09-22,24.1284
2014-09-23,23.5337
2014-09-24,23.7886
2014-09-25,22.8795
2014-09-26,23.0664
2014-09-29,23.1599
2014-09-30,23.0749
2014-10-01,22.7606
2014-10-02,22.3613
2014-10-03,21.86
2014-10-06,21.826
2014-10-07,21.4352
2014-10-08,21.9874
2014-10-09,21.1294
2014-10-10,20.6876
2014-10-13,20.7046
2014-10-14,20.3902
2014-10-15,19.8974
2014-10-16,19.1498
2014-10-17,19.685
2014-10-20,19.3962
2014-10-21,20.3732
2014-10-22,19.8635
2014-10-23,20.1183
2014-10-24,20.1438
2014-10-27,19.6086
2014-10-28,20.0929
2014-10-29,20.0504
2014-10-30,19.6766
2014-10-31,19.4981
2014-11-03,19.0394
2014-11-04,18.2407
2014-11-05,18.844
2014-11-06,18.6655
2014-11-07,19.0818
2014-11-10,18.9969
2014-11-11,19.0139
2014-11-12,18.759
2014-11-13,18.5405
2014-11-14,18.996
2014-11-17,18.7554
2014-11-18,18.9187
2014-11-19,18.9702
2014-11-20,19.1593
2014-11-21,19.4344
2014-11-24,19.4344
2014-11-25,19.0906
2014-11-26,18.764
2014-11-28,16.426
2014-12-01,16.7698
2014-12-02,16.6924
2014-12-03,15.9274
2014-12-04,15.9274
2014-12-05,15.5578
2014-12-08,15.0249
2014-12-09,15.0163
2014-12-10,14.6553
2014-12-11,14.3631
2014-12-12,13.9505
2014-12-15,13.5981
2014-12-16,14.0021
2014-12-17,14.8444
2014-12-18,15.4805
2014-12-19,15.7727
2014-12-22,15.6008
2014-12-23,15.6868
2014-12-24,15.4891
2014-12-26,15.4719
2014-12-29,15.3258
2014-12-30,15.2742
2014-12-31,15.1367
2015-01-02,14.9733
2015-01-05,14.174
2015-01-06,14.0364
2015-01-07,14.3888
2015-01-08,14.6811
2015-01-09,14.6983
2015-01-12,14.045
2015-01-13,14.2169
2015-01-14,14.449
2015-01-15,14.5608
2015-01-16,15.1281
2015-01-20,14.6897
2015-01-21,15.3515
2015-01-22,15.5149
2015-01-23,15.1281
2015-01-26,15.1281
2015-01-27,14.9476
2015-01-28,14.3287
2015-01-29,14.2513
2015-01-30,14.4404
2015-02-02,15.4375
2015-02-03,16.2369
2015-02-04,15.4547
2015-02-05,15.8587
2015-02-06,15.9274
2015-02-09,16.7096
2015-02-10,16.2885
2015-02-11,15.8587
2015-02-12,16.1682
2015-02-13,16.9779
2015-02-17,17.0824
2015-02-18,16.917
2015-02-19,16.2727
2015-02-20,16.4555
2015-02-23,16.1682
2015-02-24,16.5948
2015-02-25,16.7777
2015-02-26,16.4729
2015-02-27,16.3772
2015-03-02,16.1247
2015-03-03,16.2117
2015-03-04,16.1508
2015-03-05,16.2727
2015-03-06,15.9505
2015-03-09,15.6458
2015-03-10,14.8796
2015-03-11,14.6446
2015-03-12,14.5923
2015-03-13,14.3921
2015-03-16,14.1483
2015-03-17,14.2615
2015-03-18,14.7316
2015-03-19,14.8883
2015-03-20,15.4282
2015-03-23,15.5936
2015-03-24,15.611
2015-03-25,15.6284
2015-03-26,15.8374
2015-03-27,15.5762
2015-03-30,15.5413
2015-03-31,15.315
2015-04-01,15.55
2015-04-02,15.6893
2015-04-06,16.0289
2015-04-07,16.3772
2015-04-08,16.2466
2015-04-09,16.4033
2015-04-10,16.56
2015-04-13,16.3685
2015-04-14,17.0215
2015-04-15,17.57
2015-04-16,17.6745
2015-04-17,17.3523
2015-04-20,17.1172
2015-04-21,16.8735
2015-04-22,16.8386
2015-04-23,17.2914
2015-04-24,17.3088
2015-04-27,17.509
2015-04-28,17.7441
2015-04-29,17.8225
2015-04-30,18.4842
2015-05-01,18.3013
2015-05-04,18.1272
2015-05-05,18.1533
2015-05-06,18.4842
2015-05-07,17.927
2015-05-08,18.31
2015-05-11,17.9705
2015-05-12,18.3971
2015-05-13,18.5538
2015-05-14,18.5364
2015-05-15,18.4145
2015-05-18,17.9008
2015-05-19,17.2764
2015-05-20,17.3381
2015-05-21,17.5846
2015-05-22,17.2764
2015-05-26,16.572
2015-05-27,16.5456
2015-05-28,16.3959
2015-05-29,16.3607
2015-06-01,15.9908
2015-06-02,16.6072
2015-06-03,16.4223
2015-06-04,16.1493
2015-06-05,16.0173
2015-06-08,16.1053
2015-06-09,16.1493
2015-06-10,16.6248
2015-06-11,16.2902
2015-06-12,16.2374
2015-06-15,15.9468
2015-06-16,15.9908
2015-06-17,16.3166
2015-06-18,16.0701
2015-06-19,16.2286
2015-06-22,16.3166
2015-06-23,16.1758
2015-06-24,16.299
2015-06-25,16.1229
2015-06-26,16.2374
2015-06-29,15.7531
2015-06-30,15.7619
2015-07-01,15.1895
2015-07-02,15.4625
2015-07-06,14.7404
2015-07-07,14.8813
2015-07-08,14.5731
2015-07-09,14.8549
2015-07-10,15.1719
2015-07-13,14.8901
2015-07-14,15.2424
2015-07-15,14.9606
2015-07-16,15.1895
2015-07-17,15.0046
2015-07-20,14.7316
2015-07-21,15.0486
2015-07-22,14.714
2015-07-23,14.6964
2015-07-24,14.3002
2015-07-27,13.948
2015-07-28,14.5115
2015-07-29,15.0751
2015-07-30,15.2071
2015-07-31,14.8901
2015-08-03,14.4146
2015-08-04,14.5027
2015-08-05,14.5467
2015-08-06,14.67
2015-08-07,14.6172
2015-08-10,14.943
2015-08-11,14.5291
2015-08-12,14.9342
2015-08-13,14.5289
2015-08-14,14.2524
2015-08-17,14.2435
2015-08-18,14.074
2015-08-19,13.5389
2015-08-20,13.4229
2015-08-21,13.1375
2015-08-24,12.4775
2015-08-25,12.3883
2015-08-26,12.8878
2015-08-27,13.5121
2015-08-28,13.6905
2015-08-31,13.8154
2015-09-01,13.1732
2015-09-02,13.3962
2015-09-03,13.4764
2015-09-04,13.0216
2015-09-08,13.2624
2015-09-09,12.9859
2015-09-10,13.1286
2015-09-11,12.8521
2015-09-14,12.7273
2015-09-15,13.0127
2015-09-16,13.6548
2015-09-17,13.6281
2015-09-18,13.1643
2015-09-21,13.2535
2015-09-22,13.0216
2015-09-23,12.7094
2015-09-24,12.6648
2015-09-25,12.7897
2015-09-28,12.3527
2015-09-29,12.6381
2015-09-30,12.9859
2015-10-01,13.2267
2015-10-02,13.9492
2015-10-05,14.1721
2015-10-06,14.9391
2015-10-07,15.4921
2015-10-08,15.724
2015-10-09,15.6794
2015-10-12,15.2602
2015-10-13,14.9391
2015-10-14,15.3673
2015-10-15,15.6348
2015-10-16,15.8221
2015-10-19,15.287
2015-10-20,15.287
2015-10-21,15.1086
2015-10-22,15.4475
2015-10-23,15.2781
2015-10-26,15.0016
2015-10-27,14.4932
2015-10-28,14.5378
2015-10-29,14.2435
2015-10-30,14.4129
2015-11-02,14.52
2015-11-03,15.2156
2015-11-04,14.8054
2015-11-05,14.7073
2015-11-06,14.4754
2015-11-09,14.404
2015-11-10,14.3951
2015-11-11,14.0383
2015-11-12,13.43
2015-11-13,13.5201
2015-11-16,13.8987
2015-11-17,13.6914
2015-11-18,14.1421
2015-11-19,13.9979
2015-11-20,13.8086
2015-11-23,13.8086
2015-11-24,14.2592
2015-11-25,14.0249
2015-11-27,13.8446
2015-11-30,13.8536
2015-12-01,14.1511
2015-12-02,13.8266
2015-12-03,13.9888
2015-12-04,13.4751
2015-12-07,12.8081
2015-12-08,12.6999
2015-12-09,12.8982
2015-12-10,12.8622
2015-12-11,12.5197
2015-12-14,12.6729
2015-12-15,13.0244
2015-12-16,12.9703
2015-12-17,12.3574
2015-12-18,12.2492
2015-12-21,12.096
2015-12-22,12.2943
2015-12-23,12.9523
2015-12-24,12.8982
2015-12-28,12.6368
2015-12-29,12.7991
2015-12-30,12.5106
2015-12-31,12.5827
2016-01-04,12.4926
2016-01-05,12.2492
2016-01-06,11.7715
2016-01-07,11.5011
2016-01-08,11.1857
2016-01-11,10.771
2016-01-12,10.6358
2016-01-13,10.4195
2016-01-14,10.9603
2016-01-15,10.6629
2016-01-19,10.6268
2016-01-20,10.2573
2016-01-21,10.6989
2016-01-22,11.2758
2016-01-25,10.726
2016-01-26,11.3028
2016-01-27,11.2758
2016-01-28,11.9969
2016-01-29,12.2583
2016-02-01,11.8617
2016-02-02,11.2578
2016-02-03,11.8887
2016-02-04,12.4746
2016-02-05,12.6188
2016-02-08,12.5827
2016-02-09,12.1231
2016-02-10,11.8346
2016-02-11,11.7986
2016-02-12,12.2853
2016-02-16,12.1806
2016-02-17,12.8821
2016-02-18,12.7546
2016-02-19,12.6999
2016-02-22,13.0916
2016-02-23,12.6817
2016-02-24,12.6088
2016-02-25,12.7363
2016-02-26,13.0188
2016-02-29,13.2647
2016-03-01,13.4652
2016-03-02,13.7931
2016-03-03,14.0118
2016-03-04,14.4582
2016-03-07,14.522
2016-03-08,13.8478
2016-03-09,14.1393
2016-03-10,13.9207
2016-03-11,14.1029
2016-03-14,14.0391
2016-03-15,13.7749
2016-03-16,14.1484
2016-03-17,14.5311
2016-03-18,14.5857
2016-03-21,14.4309
2016-03-22,14.4127
2016-03-23,13.6838
2016-03-24,13.8114
2016-03-28,13.8842
2016-03-29,13.8023
2016-03-30,14.2851
2016-03-31,14.1758
2016-04-01,13.8296
2016-04-04,13.4834
2016-04-05,13.3558
2016-04-06,13.6474
2016-04-07,13.5472
2016-04-08,14.0027
2016-04-11,14.194
2016-04-12,14.686
2016-04-13,14.6677
2016-04-14,14.6951
2016-04-15,14.4127
2016-04-18,14.5129
2016-04-19,15.0504
2016-04-20,15.3055
2016-04-21,15.3055
2016-04-22,15.3601
2016-04-25,15.0959
2016-04-26,15.3601
2016-04-27,16.1072
2016-04-28,16.0434
2016-04-29,16.0252
2016-05-02,15.8521
2016-05-03,15.3692
2016-05-04,15.0959
2016-05-05,15.2326
2016-05-06,15.1142
2016-05-09,14.8226
2016-05-10,15.0531
2016-05-11,15.1905
2016-05-12,15.4297
2016-05-13,15.0248
2016-05-16,15.3561
2016-05-17,15.3561
2016-05-18,15.1352
2016-05-19,14.85
2016-05-20,14.9696
2016-05-23,14.7764
2016-05-24,14.8776
2016-05-25,15.3561
2016-05-26,15.2089
2016-05-27,14.942
2016-05-31,14.5004
2016-06-01,14.666
2016-06-02,14.62
2016-06-03,14.8132
2016-06-06,15.2825
2016-06-07,15.6597
2016-06-08,15.7885
2016-06-09,15.5585
2016-06-10,15.0616
2016-06-13,14.8868
2016-06-14,14.6476
2016-06-15,14.7672
2016-06-16,14.5096
2016-06-17,15.0156
2016-06-20,15.3101
2016-06-21,15.3837
2016-06-22,15.2641
2016-06-23,16.0093
2016-06-24,14.8684
2016-06-27,14.4452
2016-06-28,14.9972
2016-06-29,15.5217
2016-06-30,15.9265
2016-07-01,16.0093
2016-07-05,15.8069
2016-07-06,15.7609
2016-07-07,15.6781
2016-07-08,15.7149
2016-07-11,15.8621
2016-07-12,16.2485
2016-07-13,16.0737
2016-07-14,16.3129
2016-07-15,16.3221
2016-07-18,16.1933
2016-07-19,15.9081
2016-07-20,15.9725
2016-07-21,15.9357
2016-07-22,15.5125
2016-07-25,15.1721
2016-07-26,15.3285
2016-07-27,14.8224
2016-07-28,14.574
2016-07-29,14.6384
2016-08-01,14.0128
2016-08-02,14.1692
2016-08-03,14.5188
2016-08-04,14.6568
2016-08-05,14.6936
2016-08-08,14.6936
2016-08-09,14.7488
2016-08-10,14.7582
2016-08-11,15.1221
2016-08-12,15.206
2016-08-15,15.1874
2016-08-16,15.3273
2016-08-17,15.178
2016-08-18,15.4393
2016-08-19,15.2993
2016-08-22,15.0288
2016-08-23,15.0848
2016-08-24,14.9448
2016-08-25,14.9448
2016-08-26,14.8888
2016-08-29,15.0195
2016-08-30,14.9635
2016-08-31,14.5997
2016-09-01,14.4131
2016-09-02,14.8515
2016-09-06,15.2527
2016-09-07,15.3273
2016-09-08,15.4206
2016-09-09,14.5437
2016-09-12,14.7209
2016-09-13,14.1705
2016-09-14,14.0959
2016-09-15,14.1612
2016-09-16,14.0959
2016-09-19,14.0866
2016-09-20,14.0586
2016-09-21,14.3758
2016-09-22,14.7676
2016-09-23,14.6183
2016-09-26,14.497
2016-09-27,14.3105
2016-09-28,15.0008
2016-09-29,15.3646
2016-09-30,15.6725
2016-10-03,15.7098
2016-10-04,15.6538
2016-10-05,15.9057
2016-10-06,15.9244
2016-10-07,15.7471
2016-10-10,16.1389
2016-10-11,15.7191
2016-10-12,15.7378
2016-10-13,15.6258
2016-10-14,15.5792
2016-10-17,15.5232
2016-10-18,15.3086
2016-10-19,15.5699
2016-10-20,15.3926
2016-10-21,15.4113
2016-10-24,15.4299
2016-10-25,15.2154
2016-10-26,15.234
2016-10-27,15.4859
2016-10-28,15.4206
2016-10-31,15.1501
2016-11-01,15.1972
2016-11-02,15.0748
2016-11-03,15.103
2016-11-04,15.2067
2016-11-07,15.8191
2016-11-08,15.7814
2016-11-09,15.6495
2016-11-10,15.5553
2016-11-11,15.1972
2016-11-14,14.9429
2016-11-15,15.4893
2016-11-16,15.4045
2016-11-17,15.3668
2016-11-18,15.3291
2016-11-21,16.0264
2016-11-22,16.064
2016-11-23,15.9227
2016-11-25,15.8662
2016-11-28,15.6683
2016-11-29,15.4045
2016-11-30,16.3938
2016-12-01,16.7612
2016-12-02,16.6859
2016-12-05,16.6953
2016-12-06,16.6576
2016-12-07,16.8178
2016-12-08,16.912
2016-12-09,17.0156
2016-12-12,17.2418
2016-12-13,17.4396
2016-12-14,16.8555
2016-12-15,16.9779
2016-12-16,17.1664
2016-12-19,17.0251
2016-12-20,16.9685
2016-12-21,17.1193
2016-12-22,17.0722
2016-12-23,17.0439
2016-12-27,17.1381
2016-12-28,17.1287
2016-12-29,17.3077
2016-12-30,17.1852
2017-01-03,17.5338
2017-01-04,17.4867
2017-01-05,17.873
2017-01-06,17.7505
2017-01-09,17.449
2017-01-10,17.4585
2017-01-11,17.7788
2017-01-12,17.8824
2017-01-13,18.0332
2017-01-17,17.8824
2017-01-18,17.6846
2017-01-19,17.7128
2017-01-20,17.8447
2017-01-23,17.7599
2017-01-24,18.0991
2017-01-25,18.0332
2017-01-26,17.9201
2017-01-27,17.7411
2017-01-30,17.4019
2017-01-31,17.5904
2017-02-01,17.6563
2017-02-02,17.5715
2017-02-03,17.7223
2017-02-06,17.694
2017-02-07,16.7801
2017-02-08,16.8555
2017-02-09,16.8272
2017-02-10,16.8649
2017-02-13,16.8555
2017-02-14,16.8178
2017-02-15,16.6388
2017-02-16,16.6764
2017-02-17,16.554
2017-02-21,16.9059
2017-02-22,16.6396
2017-02-23,16.7918
2017-02-24,16.554
2017-02-27,16.7347
2017-02-28,16.7347
2017-03-01,16.8678
2017-03-02,16.6016
2017-03-03,16.7157
2017-03-06,16.5826
2017-03-07,16.5636
2017-03-08,16.0121
2017-03-09,16.0976
2017-03-10,16.2973
2017-03-13,16.4209
2017-03-14,16.0026
2017-03-15,16.6016
2017-03-16,16.5921
2017-03-17,16.6396
2017-03-20,16.6396
2017-03-21,16.535
2017-03-22,16.4495
2017-03-23,16.1737
2017-03-24,16.1452
2017-03-27,16.0121
2017-03-28,16.1167
2017-03-29,16.478
2017-03-30,16.4019
2017-03-31,16.3354
2017-04-03,16.459
2017-04-04,16.5826
2017-04-05,16.3068
2017-04-06,16.3924
2017-04-07,16.3544
2017-04-10,16.4495
2017-04-11,16.478
2017-04-12,16.4399
2017-04-13,16.0691
2017-04-17,16.2783
2017-04-18,15.9455
2017-04-19,15.5652
2017-04-20,15.6603
2017-04-21,15.5366
2017-04-24,15.8124
2017-04-25,15.879
2017-04-26,15.6888
2017-04-27,15.6127
2017-04-28,15.6222
2017-05-01,15.5747
2017-05-02,15.5176
2017-05-03,15.6317
2017-05-04,15.5366
2017-05-05,16.3544
2017-05-08,16.459
2017-05-09,16.3449
2017-05-10,16.7822
2017-05-11,16.9171
2017-05-12,16.9171
2017-05-15,17.2349
2017-05-16,17.3312
2017-05-17,17.2349
2017-05-18,17.2541
2017-05-19,17.5526
2017-05-22,17.6008
2017-05-23,17.543
2017-05-24,17.466
2017-05-25,17.0519
2017-05-26,17.2252
2017-05-30,16.9171
2017-05-31,16.7631
2017-06-01,16.792
2017-06-02,16.6861
2017-06-05,16.6764
2017-06-06,16.9268
2017-06-07,16.7823
2017-06-08,16.6379
2017-06-09,16.8786
2017-06-12,16.9075
2017-06-13,17.0904
2017-06-14,16.6668
2017-06-15,16.2913
2017-06-16,16.5224
2017-06-19,16.4742
2017-06-20,16.0217
2017-06-21,15.6847
2017-06-22,15.7714
2017-06-23,15.9928
2017-06-26,15.8388
2017-06-27,15.9543
2017-06-28,16.0698
2017-06-29,15.9832
2017-06-30,15.9158
2017-07-03,16.1083
2017-07-05,15.7521
2017-07-06,15.7521
2017-07-07,15.7136
2017-07-10,15.8773
2017-07-11,16.0602
2017-07-12,16.2624
2017-07-13,16.3298
2017-07-14,16.532
2017-07-17,16.5416
2017-07-18,16.5224
2017-07-19,16.7342
2017-07-20,16.8401
2017-07-21,16.6187
2017-07-24,16.7535
2017-07-25,17.0519
2017-07-26,17.206
2017-07-27,17.7644
2017-07-28,17.9185
2017-07-31,18.0629
2017-08-01,17.9377
2017-08-02,18.3133
2017-08-03,18.1496
2017-08-04,18.2555
2017-08-07,18.2073
2017-08-08,18.1295
2017-08-09,18.1295
2017-08-10,17.9834
2017-08-11,17.8762
2017-08-14,17.7691
2017-08-15,17.9249
2017-08-16,17.8567
2017-08-17,17.6327
2017-08-18,17.9347
2017-08-21,17.7983
2017-08-22,18.0223
2017-08-23,18.1587
2017-08-24,18.1392
2017-08-25,18.2464
2017-08-28,18.1685
2017-08-29,18.1977
2017-08-30,18.0808
2017-08-31,18.3633
2017-09-01,18.4802
2017-09-05,18.6166
2017-09-06,18.7043
2017-09-07,18.7335
2017-09-08,18.4705
2017-09-11,18.5387
2017-09-12,18.5971
2017-09-13,18.8699
2017-09-14,18.977
2017-09-15,19.0257
2017-09-18,19.055
2017-09-19,19.1232
2017-09-20,19.2498
2017-09-21,19.3472
2017-09-22,19.4836
2017-09-25,19.8441
2017-09-26,19.6005
2017-09-27,19.4446
2017-09-28,19.5908
2017-09-29,19.5713
2017-10-02,19.5323
2017-10-03,19.581
2017-10-04,19.4349
2017-10-05,19.5031
2017-10-06,19.3667
2017-10-09,19.4252
2017-10-10,19.6784
2017-10-11,19.7759
2017-10-12,19.6784
2017-10-13,19.7856
2017-10-16,19.9999
2017-10-17,19.8733
2017-10-18,19.6492
2017-10-19,19.7369
2017-10-20,19.9025
2017-10-23,19.8928
2017-10-24,19.9902
2017-10-25,19.9205
2017-10-26,19.3765
2017-10-27,19.581
2017-10-30,20.0097
2017-10-31,19.7856
2017-11-01,20.0508
2017-11-02,19.9723
2017-11-03,19.9526
2017-11-06,20.473
2017-11-07,20.3847
2017-11-08,20.473
2017-11-09,20.6301
2017-11-10,20.5123
2017-11-13,20.3159
2017-11-14,19.8741
2017-11-15,19.5893
2017-11-16,19.6384
2017-11-17,19.5795
2017-11-20,19.4518
2017-11-21,19.7464
2017-11-22,19.9723
2017-11-24,20.0312
2017-11-27,19.8053
2017-11-28,19.8642
2017-11-29,19.766
2017-11-30,19.717
2017-12-01,19.8839
2017-12-04,20.0213
2017-12-05,19.9821
2017-12-06,19.658
2017-12-07,19.5893
2017-12-08,19.766
2017-12-11,19.8446
2017-12-12,20.3945
2017-12-13,20.1785
2017-12-14,20.0606
2017-12-15,19.7857
2017-12-18,19.9428
2017-12-19,19.825
2017-12-20,20.0999
2017-12-21,20.6694
2017-12-22,20.6498
2017-12-26,20.9051
2017-12-27,20.964
2017-12-28,21.0229
2017-12-29,21.0327
2018-01-02,21.6022
2018-01-03,22.0048
2018-01-04,22.2699
2018-01-05,22.2307
2018-01-08,22.3485
2018-01-09,22.3289
2018-01-10,22.4467
2018-01-11,22.7805
2018-01-12,23.0948
2018-01-16,22.81
2018-01-17,23.0457
2018-01-18,22.9377
2018-01-19,22.7707
2018-01-22,23.2519
2018-01-23,23.1733
2018-01-24,23.7821
2018-01-25,23.8214
2018-01-26,23.6839
2018-01-29,23.3108
2018-01-30,22.7805
2018-01-31,23.0162
2018-02-01,23.3992
2018-02-02,22.2994
2018-02-05,21.5728
2018-02-06,22.0736
2018-02-07,22.1816
2018-02-08,21.5272
2018-02-09,21.3289
2018-02-12,21.7454
2018-02-13,21.9437
2018-02-14,22.1618
2018-02-15,22.2709
2018-02-16,22.3403
2018-02-20,22.2709
2018-02-21,22.142
2018-02-22,22.3998
2018-02-23,22.9848
2018-02-26,23.0543
2018-02-27,22.6477
2018-02-28,22.4395
2018-03-01,22.4494
2018-03-02,22.499
2018-03-05,22.5981
2018-03-06,23.0047
2018-03-07,22.5684
2018-03-08,22.4196
2018-03-09,22.7171
2018-03-12,22.7171
2018-03-13,22.8361
2018-03-14,22.8659
2018-03-15,22.8163
2018-03-16,23.0443
2018-03-19,22.5287
2018-03-20,22.8758
2018-03-21,23.5005
2018-03-22,23.0047
2018-03-23,23.1336
2018-03-26,23.6294
2018-03-27,23.3914
2018-03-28,23.0741
2018-03-29,23.4509
2018-04-02,23.0642
2018-04-03,23.5996
2018-04-04,23.7484
2018-04-05,24.2442
2018-04-06,24.0657
2018-04-09,24.4425
2018-04-10,25.2655
2018-04-11,25.6819
2018-04-12,25.3646
2018-04-13,25.2952
2018-04-16,25.2952
2018-04-17,25.3448
2018-04-18,25.9596
2018-04-19,25.791
2018-04-20,25.3845
2018-04-23,25.4043
2018-04-24,25.1366
2018-04-25,24.7499
2018-04-26,25.7613
2018-04-27,25.5927
2018-04-30,25.3845
2018-05-01,24.9184
2018-05-02,25.1663
2018-05-03,25.4142
2018-05-04,25.4638
2018-05-07,25.4241
2018-05-08,25.5828
2018-05-09,26.4256
2018-05-10,26.8123
2018-05-11,26.9016
2018-05-14,27.0008
2018-05-15,27.09
2018-05-16,27.14
