date,close
2016-10-05,60.3979
2016-10-06,58.7777
2016-10-07,59.1516
2016-10-10,62.6891
2016-10-11,63.7437
2016-10-12,64.9037
2016-10-13,64.2039
2016-10-14,64.3669
2016-10-17,66.2076
2016-10-18,66.9841
2016-10-19,68.2208
2016-10-20,68.8344
2016-10-21,72.8609
2016-10-24,72.3816
2016-10-25,72.5541
2016-10-26,72.1419
2016-10-27,70.3875
2016-10-28,70.1286
2016-10-31,70.3491
2016-11-01,70.3683
2016-11-02,69.8794
2016-11-03,68.3359
2016-11-04,65.1913
2016-11-07,65.1913
2016-11-08,68.566
2016-11-09,75.7274
2016-11-10,81.6426
2016-11-11,81.2878
2016-11-14,81.1824
2016-11-15,79.3417
2016-11-16,75.9863
2016-11-17,70.8956
2016-11-18,69.6685
2016-11-21,68.7865
2016-11-22,74.1264
2016-11-23,75.3535
2016-11-25,72.3432
2016-11-28,73.0239
2016-11-29,72.6979
2016-11-30,74.8071
2016-12-01,74.5099
2016-12-02,76.0438
2016-12-05,79.0924
2016-12-06,80.0799
2016-12-07,81.1057
2016-12-08,79.3705
2016-12-09,76.7436
2016-12-12,80.2333
2016-12-13,78.4118
2016-12-14,75.9575
2016-12-15,76.9545
2016-12-16,75.737
2016-12-19,76.5327
2016-12-20,79.6197
2016-12-21,77.5585
2016-12-22,74.251
2016-12-23,75.1522
2016-12-27,75.9
2016-12-28,75.8329
2016-12-29,74.9029
2016-12-30,74.8262
2017-01-03,71.8926
2017-01-04,72.0364
2017-01-05,71.6817
2017-01-06,69.2754
2017-01-09,67.7702
2017-01-10,69.0165
2017-01-11,72.1419
2017-01-12,72.9088
2017-01-13,71.883
2017-01-17,70.0232
2017-01-18,69.9848
2017-01-19,69.2275
2017-01-20,70.4642
2017-01-23,70.8285
2017-01-24,71.7776
2017-01-25,71.3749
2017-01-26,70.6847
2017-01-27,70.608
2017-01-30,69.3137
2017-01-31,69.0165
2017-02-01,69.4863
2017-02-02,70.5121
2017-02-03,68.9303
2017-02-06,67.9907
2017-02-07,67.8086
2017-02-08,65.9871
2017-02-09,68.0291
2017-02-10,66.7157
2017-02-13,66.0254
2017-02-14,65.8145
2017-02-15,66.9362
2017-02-16,69.1316
2017-02-17,72.9472
2017-02-21,70.9435
2017-02-22,70.7422
2017-02-23,70.0903
2017-02-24,69.0165
2017-02-27,69.5055
2017-02-28,68.8919
2017-03-01,71.605
2017-03-02,68.5468
2017-03-03,68.7577
2017-03-06,69.4671
2017-03-07,66.2459
2017-03-08,64.0984
2017-03-09,63.5807
2017-03-10,61.9797
2017-03-13,64.1272
2017-03-14,62.9288
2017-03-15,65.4214
2017-03-16,65.1051
2017-03-17,64.2806
2017-03-20,63.3123
2017-03-21,62.7467
2017-03-22,64.1464
2017-03-23,62.2194
2017-03-24,62.0948
2017-03-27,64.9517
2017-03-28,66.15
2017-03-29,66.4664
2017-03-30,66.0638
2017-03-31,66.0925
2017-04-03,68.6139
2017-04-04,69.841
2017-04-05,69.2083
2017-04-06,71.605
2017-04-07,71.6625
2017-04-10,72.7267
2017-04-11,70.9531
2017-04-12,68.4413
2017-04-13,67.8373
2017-04-17,68.6618
2017-04-18,68.1058
2017-04-19,67.358
2017-04-20,68.2975
2017-04-21,67.6648
2017-04-24,68.7193
2017-04-25,67.962
2017-04-26,68.1633
2017-04-27,67.0608
2017-04-28,67.3388
2017-05-01,67.1087
2017-05-02,71.653
2017-05-03,69.5822
2017-05-04,67.1087
2017-05-05,68.0003
2017-05-08,68.6906
2017-05-09,68.9303
2017-05-10,69.2083
2017-05-11,69.726
2017-05-12,70.3779
2017-05-15,69.5342
2017-05-16,71.0969
2017-05-17,70.0328
2017-05-18,69.9177
2017-05-19,69.8698
2017-05-22,68.8919
2017-05-23,69.9752
2017-05-24,69.9369
2017-05-25,68.8536
2017-05-26,69.6243
2017-05-30,67.8131
2017-05-31,68.1792
2017-06-01,68.7668
2017-06-02,67.1291
2017-06-05,67.4952
2017-06-06,67.4566
2017-06-07,65.3564
2017-06-08,66.6474
2017-06-09,67.4759
2017-06-12,67.9769
2017-06-13,67.7938
2017-06-14,66.6185
2017-06-15,62.5915
2017-06-16,61.368
2017-06-19,60.5009
2017-06-20,58.6898
2017-06-21,60.0192
2017-06-22,60.2119
2017-06-23,62.0809
2017-06-26,62.6204
2017-06-27,62.4085
2017-06-28,64.2967
2017-06-29,65.4142
2017-06-30,65.7996
2017-07-03,66.262
2017-07-05,67.341
2017-07-06,66.2331
2017-07-07,67.0905
2017-07-10,67.8131
2017-07-11,70.289
2017-07-12,70.79
2017-07-13,71.3295
2017-07-14,71.8208
2017-07-17,71.4643
2017-07-18,71.946
2017-07-19,72.3217
2017-07-20,73.1214
2017-07-21,72.7553
2017-07-24,72.447
2017-07-25,73.4489
2017-07-26,73.3237
2017-07-27,69.7591
2017-07-28,70.6358
2017-07-31,73.2851
2017-08-01,72.842
2017-08-02,74.4219
2017-08-03,71.8401
2017-08-04,72.842
2017-08-07,73.709
2017-08-08,74.1618
2017-08-09,73.7379
2017-08-10,73.2659
2017-08-11,72.4566
2017-08-14,72.4759
2017-08-15,71.8497
2017-08-16,71.5607
2017-08-17,71.0982
2017-08-18,71.9557
2017-08-21,72.948
2017-08-22,73.8343
2017-08-23,74.8169
2017-08-24,72.6975
2017-08-25,73.7668
2017-08-28,73.8246
2017-08-29,74.5892
2017-08-30,74.0859
2017-08-31,77.299
2017-09-01,77.5313
2017-09-05,74.2504
2017-09-06,75.7022
2017-09-07,75.5957
2017-09-08,74.0375
2017-09-11,73.0213
2017-09-12,72.6342
2017-09-13,73.5923
2017-09-14,74.4924
2017-09-15,72.8762
2017-09-18,71.8503
2017-09-19,70.1953
2017-09-20,70.5437
2017-09-21,69.2469
2017-09-22,68.8597
2017-09-25,70.8244
2017-09-26,71.4631
2017-09-27,71.2502
2017-09-28,69.8566
2017-09-29,69.4307
2017-10-02,70.8341
2017-10-03,70.4566
2017-10-04,69.7888
2017-10-05,70.6405
2017-10-06,68.8501
2017-10-09,68.0952
2017-10-10,68.8984
2017-10-11,68.3468
2017-10-12,68.4049
2017-10-13,67.1564
2017-10-16,68.9468
2017-10-17,70.5244
2017-10-18,70.5631
2017-10-19,72.5955
2017-10-20,73.002
2017-10-23,71.8019
2017-10-24,72.4987
2017-10-25,71.618
2017-10-26,69.6921
2017-10-27,69.9727
2017-10-30,69.4888
2017-10-31,73.9601
2017-11-01,76.4087
2017-11-02,76.1474
2017-11-03,76.8248
2017-11-06,77.4539
2017-11-07,77.1152
2017-11-08,77.2119
2017-11-09,76.1377
2017-11-10,76.2054
2017-11-13,76.3119
2017-11-14,75.9248
2017-11-15,75.5376
2017-11-16,76.6603
2017-11-17,76.2538
2017-11-20,76.9797
2017-11-21,77.8991
2017-11-22,78.0733
2017-11-24,78.383
2017-11-27,76.3022
2017-11-28,76.4474
2017-11-29,76.3016
2017-11-30,80.2581
2017-12-01,81.9107
2017-12-04,81.969
2017-12-05,82.1051
2017-12-06,80.8802
2017-12-07,82.7564
2017-12-08,82.5717
2017-12-11,84.4382
2017-12-12,83.3689
2017-12-13,83.5438
2017-12-14,82.9995
2017-12-15,84.4382
2017-12-18,85.5367
2017-12-19,85.6047
2017-12-20,86.3144
2017-12-21,88.2003
2017-12-22,88.5891
2017-12-26,89.7848
2017-12-27,89.1335
2017-12-28,90.6209
2017-12-29,90.5625
2018-01-02,92.7692
2018-01-03,91.1555
2018-01-04,89.8237
2018-01-05,90.1348
2018-01-08,92.7012
2018-01-09,92.779
2018-01-10,93.858
2018-01-11,95.9286
2018-01-12,94.1302
2018-01-16,91.8457
2018-01-17,92.5457
2018-01-18,90.3973
2018-01-19,91.4666
2018-01-22,91.35
2018-01-23,89.6099
2018-01-24,90.1056
2018-01-25,88.1322
2018-01-26,90.4362
2018-01-29,90.6111
2018-01-30,87.3934
2018-01-31,87.5004
2018-02-01,89.9793
2018-02-02,85.109
2018-02-05,83.6216
2018-02-06,85.8575
2018-02-07,84.8368
2018-02-08,83.6022
2018-02-09,83.2716
2018-02-12,86.1102
2018-02-13,87.617
2018-02-14,90.4653
2018-02-15,91.5444
2018-02-16,89.8918
2018-02-20,89.5904
2018-02-21,91.2139
2018-02-22,93.7122
2018-02-23,95.0634
2018-02-26,96.4536
2018-02-27,95.9092
2018-02-28,93.0414
2018-03-01,94.1497
2018-03-02,96.6779
2018-03-05,94.8525
2018-03-06,98.308
2018-03-07,97.3514
2018-03-08,93.9935
2018-03-09,91.475
2018-03-12,90.9869
2018-03-13,92.129
2018-03-14,91.6702
2018-03-15,93.4468
2018-03-16,94.2473
2018-03-19,91.4945
2018-03-20,93.1833
2018-03-21,95.4479
2018-03-22,89.3567
2018-03-23,89.0541
2018-03-26,91.0748
2018-03-27,88.1658
2018-03-28,87.7363
2018-03-29,89.6886
2018-04-02,89.386
2018-04-03,91.8752
2018-04-04,91.3871
2018-04-05,92.4902
2018-04-06,90.206
2018-04-09,91.514
2018-04-10,95.5065
2018-04-11,93.4663
2018-04-12,94.8427
2018-04-13,94.9013
2018-04-16,93.5932
2018-04-17,94.1887
2018-04-18,95.1453
2018-04-19,98.1714
2018-04-20,97.8981
2018-04-23,96.4924
2018-04-24,95.8091
2018-04-25,93.7397
2018-04-26,80.1517
2018-04-27,77.4477
2018-04-30,78.9022
2018-05-01,76.1494
2018-05-02,75.9249
2018-05-03,77.0573
2018-05-04,79.0388
2018-05-07,79.156
2018-05-08,77.3403
2018-05-09,75.2026
2018-05-10,74.695
2018-05-11,75.593
2018-05-14,75.8078
2018-05-15,77.4868
2018-05-16,78.4336
2018-05-17,78.3653
2018-05-18,77.2623
2018-05-21,77.9065
2018-05-22,78.2774
2018-05-23,79.1657
2018-05-24,77.5844
2018-05-25,78.6874
2018-05-29,80.9326
2018-05-30,82.6393
2018-05-31,80.5893
2018-06-01,82.2078
2018-06-04,82.2568
2018-06-05,83.836
2018-06-06,83.9832
2018-06-07,85.0033
2018-06-08,83.5418
2018-06-11,83.4731
2018-06-12,83.12
2018-06-13,81.7369
2018-06-14,81.5211
2018-06-15,77.4211
2018-06-18,78.1077
2018-06-19,77.8919
2018-06-20,78.8139
2018-06-21,78.5883
2018-06-22,80.8051
2018-06-25,76.705
2018-06-26,77.7938
2018-06-27,78.961
2018-06-28,76.862
2018-06-29,76.9306
2018-07-02,75.6849
2018-07-03,77.0974
2018-07-05,78.0684
2018-07-06,78.2156
2018-07-09,79.1082
2018-07-10,79.3534
2018-07-11,75.7634
2018-07-12,76.5873
2018-07-13,75.5181
2018-07-16,74.3999
2018-07-17,77.4014
2018-07-18,78.8531
2018-07-19,77.5976
2018-07-20,78.0488
2018-07-23,78.657
2018-07-24,80.0694
2018-07-25,81.7664
2018-07-26,83.375
2018-07-27,79.7556
2018-07-30,79.4319
2018-07-31,82.9728
2018-08-01,85.3466
2018-08-02,86.6512
2018-08-03,87.5634
2018-08-06,87.5045
2018-08-07,86.916
2018-08-08,87.5536
2018-08-09,87.7988
2018-08-10,87.1514
2018-08-13,86.455
2018-08-14,86.4844
2018-08-15,85.6605
2018-08-16,87.4457
2018-08-17,88.0832
2018-08-20,88.4658
2018-08-21,89.2015
2018-08-22,89.1818
2018-08-23,86.9945
2018-08-24,86.2
2018-08-27,87.3476
2018-08-28,86.3863
2018-08-29,87.8576
2018-08-30,86.6162
2018-08-31,87.365
2018-09-04,87.3059
2018-09-05,89.3947
2018-09-06,88.9907
2018-09-07,89.5524
2018-09-10,88.8134
2018-09-11,88.9021
2018-09-12,89.9169
2018-09-13,88.1434
2018-09-14,87.6803
2018-09-17,88.5178
2018-09-18,89.2666
2018-09-19,89.4144
2018-09-20,89.2469
2018-09-21,89.1779
2018-09-24,91.2667
2018-09-25,93.1289
2018-09-26,89.1878
2018-09-27,88.6459
2018-09-28,88.0843
2018-10-01,91.6017
2018-10-02,91.2667
2018-10-03,91.8776
2018-10-04,90.3406
2018-10-05,90.045
2018-10-08,91.1485
2018-10-09,90.114
2018-10-10,88.7937
2018-10-11,89.444
2018-10-12,90.3012
2018-10-15,92.4786
2018-10-16,95.6315
2018-10-17,95.9271
2018-10-18,91.6707
2018-10-19,91.8481
2018-10-22,93.4541
2018-10-23,94.1142
2018-10-24,88.6065
2018-10-25,88.5966
2018-10-26,91.2667
2018-10-29,91.7397
2018-10-30,91.7101
2018-10-31,94.4886
2018-11-01,92.7151
2018-11-02,93.2964
2018-11-05,93.6511
2018-11-06,92.5181
2018-11-07,93.858
2018-11-08,92.5082
2018-11-09,92.8925
2018-11-12,93.2275
2018-11-13,93.592
2018-11-14,92.2717
2018-11-15,93.3063
2018-11-16,94.7743
2018-11-19,91.0303
2018-11-20,84.0939
2018-11-21,82.6652
2018-11-23,80.9114
2018-11-26,77.7388
2018-11-27,78.6256
2018-11-28,81.1183
2018-11-29,81.7916
2018-11-30,80.4648
2018-12-03,84.0985
2018-12-04,83.9104
2018-12-06,82.247
2018-12-07,83.8509
2018-12-10,85.0193
2018-12-11,85.1678
2018-12-12,84.841
2018-12-13,85.2569
2018-12-14,82.9104
2018-12-17,82.049
2018-12-18,82.1084
2018-12-19,79.7718
2018-12-20,79.4153
2018-12-21,79.148
2018-12-24,78.0886
2018-12-26,80.9698
2018-12-27,81.7618
2018-12-28,81.9995
2018-12-31,82.1678
2019-01-02,84.0787
2019-01-03,80.8213
2019-01-04,83.3955
2019-01-07,81.7817
2019-01-08,82.049
2019-01-09,84.643
2019-01-10,85.2074
2019-01-11,85.1678
2019-01-14,84.7123
2019-01-15,79.8906
2019-01-16,80.4846
2019-01-17,85.0886
2019-01-18,85.5737
2019-01-22,85.2074
2019-01-23,85.6133
2019-01-24,84.6727
2019-01-25,86.1084
2019-01-28,85.3559
2019-01-29,84.8014
2019-01-30,85.7717
2019-01-31,87.2569
2019-02-01,87.346
2019-02-04,87.1579
2019-02-05,87.3856
2019-02-06,86.5143
2019-02-07,85.0688
2019-02-08,80.8312
2019-02-11,80.0094
2019-02-12,81.2371
2019-02-13,82.4252
2019-02-14,88.4945
2019-02-15,87.4945
2019-02-19,88.9598
2019-02-20,90.0291
2019-02-21,90.8014
2019-02-22,89.9598
2019-02-25,90.0588
2019-02-26,91.0192
2019-02-27,92.6232
2019-02-28,92.237
2019-03-01,92.7123
2019-03-04,90.2152
2019-03-05,91.409
2019-03-06,88.6035
2019-03-07,88.7328
2019-03-08,88.116
2019-03-11,90.2948
2019-03-12,91.0907
2019-03-13,92.0159
2019-03-14,92.0059
2019-03-15,90.3545
2019-03-18,90.832
2019-03-19,91.2001
2019-03-20,89.3397
2019-03-21,91.3692
2019-03-22,90.1157
2019-03-25,89.2601
2019-03-26,90.5236
2019-03-27,88.9616
2019-03-28,91.8766
2019-03-29,90.8021
2019-04-01,91.2896
2019-04-02,90.8021
2019-04-03,90.0261
2019-04-04,90.2749
2019-04-05,91.2697
2019-04-08,89.9864
2019-04-09,88.1956
2019-04-10,88.5239
2019-04-11,86.8724
2019-04-12,86.763
2019-04-15,86.2655
2019-04-16,88.4045
2019-04-17,89.4093
2019-04-18,89.081
2019-04-22,91.1603
2019-04-23,99.4476
2019-04-24,99.2387
2019-04-25,98.0249
2019-04-26,99.2287
2019-04-29,99.1591
2019-04-30,96.4829
2019-05-01,96.4132
2019-05-02,94.4931
2019-05-03,97.229
2019-05-06,96.453
2019-05-07,96.0252
2019-05-08,95.1299
2019-05-09,95.2293
2019-05-10,96.8211
2019-05-13,91.1802
2019-05-14,91.9861
2019-05-15,92.2149
2019-05-16,92.3343
2019-05-17,89.8172
2019-05-20,88.9616
2019-05-21,89.7476
2019-05-22,89.5088
2019-05-23,87.8772
2019-05-24,88.1558
2019-05-28,87.3997
2019-05-29,87.34
2019-05-30,87.62
2019-05-31,88.15
2019-06-03,87.5
2019-06-04,89.27
2019-06-05,88.04
2019-06-06,87.69
2019-06-07,88.75
2019-06-10,88.84
2019-06-11,89.53
2019-06-12,87.97
2019-06-13,88.08
2019-06-14,88.7
2019-06-17,89.43
2019-06-18,90.52
2019-06-19,94.59
2019-06-20,94.69
2019-06-21,94.21
2019-06-24,92.255
2019-06-25,89.305
2019-06-26,90.24
2019-06-27,91.28
2019-06-28,93.49
2019-07-01,93.7
2019-07-02,89.905
2019-07-03,90.575
2019-07-04,90.575
2019-07-05,90.745
2019-07-08,91.215
2019-07-09,89.845
2019-07-10,89.46
2019-07-11,89.24
2019-07-12,90.45
2019-07-15,88.8
2019-07-16,89.565
2019-07-17,88.08
2019-07-18,85.815
2019-07-19,86.935
2019-07-22,88.675
2019-07-23,90.6
2019-07-24,91.055
2019-07-25,89.235
2019-07-26,91.29
2019-07-29,90.185
2019-07-30,91.34
2019-07-31,89.39
2019-08-01,78.51
2019-08-02,78.525
2019-08-05,77.09
2019-08-06,76.08
2019-08-07,75.74
2019-08-08,78.65
2019-08-09,76.16
2019-08-12,75.41
2019-08-13,77.44
2019-08-14,75.465
2019-08-15,75.6
2019-08-16,76.77
2019-08-19,77.8
2019-08-20,76.76
2019-08-21,78
2019-08-22,75.06
2019-08-23,72.3
2019-08-26,74.64
2019-08-27,76.66
2019-08-28,74.06
2019-08-29,75.23
2019-08-30,76.49
2019-09-02,76.48
2019-09-03,76.74
2019-09-04,77.72
2019-09-05,76.01
2019-09-06,76.6
2019-09-09,81.045
2019-09-10,82.25
2019-09-11,82.5
2019-09-12,80.4
2019-09-13,80.73
2019-09-16,81.97
2019-09-17,80.46
2019-09-18,77.665
2019-09-19,76.21
2019-09-20,71.95
2019-09-23,73.31
2019-09-24,69.32
2019-09-25,72.41
2019-09-26,72.76
2019-09-27,74.445
2019-09-30,74.41
2019-10-01,73.585
2019-10-02,74.6
2019-10-03,76.115
2019-10-04,76.85
2019-10-07,75.6
2019-10-08,74.24
2019-10-09,75.85
2019-10-10,77.74
2019-10-11,79.275
2019-10-14,79.38
2019-10-15,79.815
2019-10-16,78.81
2019-10-17,79.45
2019-10-18,79.035
2019-10-21,78.885
2019-10-22,83.065
2019-10-23,85.97
2019-10-24,84.965
2019-10-25,83.61
2019-10-28,83.895
2019-10-29,82.37
2019-10-30,81.98
2019-10-31,78.78
2019-11-01,79.11
2019-11-04,77.865
2019-11-05,79.475
2019-11-06,80
2019-11-07,78.89
2019-11-08,80.24
2019-11-11,77.59
2019-11-12,76.035
2019-11-13,75.945
2019-11-14,76.83
2019-11-15,76.5
2019-11-18,75.33
2019-11-19,75.46
2019-11-20,75.2
2019-11-21,75.2
2019-11-22,74.94
2019-11-25,75.555
