date,close
2014-06-13,15.54
2014-06-16,16.2
2014-06-17,16.56
2014-06-18,16.6
2014-06-19,17.27
2014-06-20,17.06
2014-06-23,16.95
2014-06-24,16.31
2014-06-25,16.63
2014-06-26,16.66
2014-06-27,16.63
2014-06-30,17.03
2014-07-01,17.23
2014-07-02,17.12
2014-07-03,17.47
2014-07-07,16.74
2014-07-08,15.77
2014-07-09,16.34
2014-07-10,16.06
2014-07-11,16.45
2014-07-14,16.26
2014-07-15,17.22
2014-07-16,16.95
2014-07-17,16.34
2014-07-18,16.31
2014-07-21,16.66
2014-07-22,16.49
2014-07-23,16.84
2014-07-24,16.52
2014-07-25,15.99
2014-07-28,15.58
2014-07-29,15.74
2014-07-30,16.16
2014-07-31,15.61
2014-08-01,15.51
2014-08-04,15.71
2014-08-05,15.86
2014-08-06,15.95
2014-08-07,16.04
2014-08-08,16.67
2014-08-11,17.09
2014-08-12,17.46
2014-08-13,17.55
2014-08-14,17.29
2014-08-15,17.49
2014-08-18,17.67
2014-08-19,18.34
2014-08-20,19.52
2014-08-21,19.65
2014-08-22,20.22
2014-08-25,21.04
2014-08-26,21.43
2014-08-27,22.19
2014-08-28,21.43
2014-08-29,20.85
2014-09-02,21.23
2014-09-03,22.57
2014-09-04,21.82
2014-09-05,21.76
2014-09-08,22.14
2014-09-09,21.54
2014-09-10,21.86
2014-09-11,21.43
2014-09-12,21.05
2014-09-15,19.61
2014-09-16,19.77
2014-09-17,19.05
2014-09-18,19.16
2014-09-19,19.165
2014-09-22,18.85
2014-09-23,19
2014-09-24,19.94
2014-09-25,18.81
2014-09-26,19.13
2014-09-29,19.37
2014-09-30,19.38
2014-10-01,18.76
2014-10-02,19.15
2014-10-03,19.35
2014-10-06,18.49
2014-10-07,17.5
2014-10-08,18.8
2014-10-09,18.12
2014-10-10,24.6
2014-10-13,23.48
2014-10-14,23.54
2014-10-15,23.63
2014-10-16,23.52
2014-10-17,23.77
2014-10-20,23.86
2014-10-21,24.22
2014-10-22,23.43
2014-10-23,24
2014-10-24,23.56
2014-10-27,23.61
2014-10-28,25
2014-10-29,24.66
2014-10-30,24.81
2014-10-31,24.07
2014-11-03,24.27
2014-11-04,24.71
2014-11-05,23.23
2014-11-06,23.34
2014-11-07,22.82
2014-11-10,22.6
2014-11-11,22.45
2014-11-12,22.5
2014-11-13,23.11
2014-11-14,23
2014-11-17,22.96
2014-11-18,22.8
2014-11-19,22.61
2014-11-20,22.49
2014-11-21,23.98
2014-11-24,24.28
2014-11-25,24.9
2014-11-26,24.71
2014-11-28,24.82
2014-12-01,23.73
2014-12-02,24.06
2014-12-03,25.12
2014-12-04,26
2014-12-05,28.06
2014-12-08,28.63
2014-12-09,29.65
2014-12-10,29.17
2014-12-11,28.2
2014-12-12,27.96
2014-12-15,26.94
2014-12-16,25.14
2014-12-17,26.02
2014-12-18,27.38
2014-12-19,25.97
2014-12-22,27.72
2014-12-23,27.21
2014-12-24,27.6
2014-12-26,28.52
2014-12-29,28.91
2014-12-30,28.53
2014-12-31,27.44
2015-01-02,26.79
2015-01-05,26.62
2015-01-06,25.94
2015-01-07,26.57
2015-01-08,28.59
2015-01-09,29.16
2015-01-12,27.19
2015-01-13,27.57
2015-01-14,28.07
2015-01-15,26.84
2015-01-16,27.6
2015-01-20,27.19
2015-01-21,26.37
2015-01-22,26.88
2015-01-23,27.16
2015-01-26,27.65
2015-01-27,28.23
2015-01-28,27.155
2015-01-29,28.025
2015-01-30,27.21
2015-02-02,27.4
2015-02-03,27.73
2015-02-04,27.78
2015-02-05,28.22
2015-02-06,27.81
2015-02-09,26.98
2015-02-10,26.36
2015-02-11,25.78
2015-02-12,26.1
2015-02-13,25.56
2015-02-17,25.75
2015-02-18,25.57
2015-02-19,25.75
2015-02-20,25.655
2015-02-23,24.22
2015-02-24,22.9
2015-02-25,24.02
2015-02-26,23.36
2015-02-27,22.47
2015-03-02,21.6
2015-03-03,21.06
2015-03-04,21.9
2015-03-05,22.43
2015-03-06,24.5
2015-03-09,23.38
2015-03-10,23.69
2015-03-11,23.66
2015-03-12,24.1
2015-03-13,24.04
2015-03-16,24.22
2015-03-17,24.71
2015-03-18,24.05
2015-03-19,24.38
2015-03-20,24.18
2015-03-23,24.13
2015-03-24,23.29
2015-03-25,23.06
2015-03-26,21.33
2015-03-27,22.49
2015-03-30,23.03
2015-03-31,22.02
2015-04-01,21.72
2015-04-02,21.63
2015-04-06,21.23
2015-04-07,21.9
2015-04-08,21.97
2015-04-09,22.86
2015-04-10,22.76
2015-04-13,22.98
2015-04-14,23.25
2015-04-15,24.24
2015-04-16,24.09
2015-04-17,23.89
2015-04-20,22.99
2015-04-21,22.04
2015-04-22,22.28
2015-04-23,23.055
2015-04-24,21.98
2015-04-27,20.94
2015-04-28,21.155
2015-04-29,21.25
2015-04-30,20.9
2015-05-01,22.02
2015-05-04,24.44
2015-05-05,23.375
2015-05-06,22.68
2015-05-07,22.57
2015-05-08,23.025
2015-05-11,22.88
2015-05-12,22.92
2015-05-13,22.89
2015-05-14,23.01
2015-05-15,22.97
2015-05-18,24.3
2015-05-19,25.44
2015-05-20,26.57
2015-05-21,25.11
2015-05-22,26.2
2015-05-26,26.55
2015-05-27,27.31
2015-05-28,27.13
2015-05-29,27.01
2015-06-01,26.83
2015-06-02,27.07
2015-06-03,27.45
2015-06-04,27.83
2015-06-05,28.47
2015-06-08,28.11
2015-06-09,27.81
2015-06-10,28.13
2015-06-11,28.45
2015-06-12,26.55
2015-06-15,26.24
2015-06-16,26.6
2015-06-17,27.13
2015-06-18,28.12
2015-06-19,29.29
2015-06-22,30.69
2015-06-23,31
2015-06-24,31.16
2015-06-25,29.45
2015-06-26,30.03
2015-06-29,28.96
2015-06-30,29.74
2015-07-01,28.32
2015-07-02,28.17
2015-07-06,28.2
2015-07-07,28.14
2015-07-08,27.25
2015-07-09,27.33
2015-07-10,27.35
2015-07-13,27.56
2015-07-14,29.04
2015-07-15,28.7
2015-07-16,28.1
2015-07-17,27.61
2015-07-20,27.03
2015-07-21,25.15
2015-07-22,25.29
2015-07-23,25.05
2015-07-24,24.14
2015-07-27,24.15
2015-07-28,24.9
2015-07-29,24.51
2015-07-30,24.22
2015-07-31,24.07
2015-08-03,23.71
2015-08-04,23.45
2015-08-05,23.64
2015-08-06,23.35
2015-08-07,22.91
2015-08-10,23.57
2015-08-11,23.37
2015-08-12,23.57
2015-08-13,23.77
2015-08-14,22.94
2015-08-17,23.73
2015-08-18,23.04
2015-08-19,22.56
2015-08-20,21.16
2015-08-21,20.31
2015-08-24,19.545
2015-08-25,19.72
2015-08-26,21.06
2015-08-27,22.19
2015-08-28,22.34
2015-08-31,22.11
2015-09-01,21.83
2015-09-02,22.07
2015-09-03,20.9
2015-09-04,20.91
2015-09-08,21.03
2015-09-09,20.12
2015-09-10,20
2015-09-11,19.64
2015-09-14,19.52
2015-09-15,19.79
2015-09-16,19.76
2015-09-17,19.84
2015-09-18,19.26
2015-09-21,18.53
2015-09-22,19
2015-09-23,19.19
2015-09-24,19.22
2015-09-25,18.9
2015-09-28,18.22
2015-09-29,18.06
2015-09-30,17.99
2015-10-01,18.21
2015-10-02,18.12
2015-10-05,18.53
2015-10-06,9.98
2015-10-07,10.02
2015-10-08,7.8
2015-10-09,8.51
2015-10-12,8.24
2015-10-13,7.63
2015-10-14,7.13
2015-10-15,7.43
2015-10-16,7.99
2015-10-19,8.28
2015-10-20,7.76
2015-10-21,8.02
2015-10-22,8.36
2015-10-23,7.92
2015-10-26,8.07
2015-10-27,8.11
2015-10-28,8.25
2015-10-29,7.15
2015-10-30,8.33
2015-11-02,9.93
2015-11-03,9.89
2015-11-04,9.73
2015-11-05,10
2015-11-06,9.655
2015-11-09,9.39
2015-11-10,9.78
2015-11-11,9.6
2015-11-12,9.27
2015-11-13,9.39
2015-11-16,9.46
2015-11-17,9.46
2015-11-18,9.64
2015-11-19,9.66
2015-11-20,9.5
2015-11-23,9.69
2015-11-24,9.09
2015-11-25,8.89
2015-11-27,9.23
2015-11-30,9.09
2015-12-01,9.11
2015-12-02,8.85
2015-12-03,8.48
2015-12-04,8.59
2015-12-07,8.22
2015-12-08,8.41
2015-12-09,8.06
2015-12-10,8.18
2015-12-11,8.01
2015-12-14,8
2015-12-15,8.34
2015-12-16,8.87
2015-12-17,8.94
2015-12-18,8.97
2015-12-21,9.3
2015-12-22,9.4
2015-12-23,9.7
2015-12-24,9.51
2015-12-28,9.55
2015-12-29,9.82
2015-12-30,9.36
2015-12-31,9.23
2016-01-04,9
2016-01-05,8.5
2016-01-06,8.12
2016-01-07,8.15
2016-01-08,7.98
2016-01-11,6.99
2016-01-12,7.34
2016-01-13,6.7
2016-01-14,6.99
2016-01-15,6.62
2016-01-19,6.26
2016-01-20,6.255
2016-01-21,6.36
2016-01-22,6.37
2016-01-25,6.3
2016-01-26,6.67
2016-01-27,6.6
2016-01-28,6.23
2016-01-29,6.57
2016-02-01,6.48
2016-02-02,6.23
2016-02-03,6.44
2016-02-04,6.63
2016-02-05,6.28
2016-02-08,6
2016-02-09,5.59
2016-02-10,5.57
2016-02-11,5.84
2016-02-12,5.87
2016-02-16,6.14
2016-02-17,6.61
2016-02-18,6.04
2016-02-19,6.25
2016-02-22,6.47
2016-02-23,6.41
2016-02-24,5.87
2016-02-25,5.8
2016-02-26,5.7
2016-02-29,5.03
2016-03-01,4.94
2016-03-02,5.4
2016-03-03,5.53
2016-03-04,5.95
2016-03-07,6.71
2016-03-08,6.35
2016-03-09,6.19
2016-03-10,5.93
2016-03-11,6.35
2016-03-14,6.46
2016-03-15,6.16
2016-03-16,6.01
2016-03-17,6.2
2016-03-18,6.28
2016-03-21,6.3
2016-03-22,6.23
2016-03-23,6.09
2016-03-24,6.16
2016-03-28,6.18
2016-03-29,6.37
2016-03-30,6.47
2016-03-31,6.74
2016-04-01,6.96
2016-04-04,7.08
2016-04-05,7.16
2016-04-06,7.39
2016-04-07,7.25
2016-04-08,6.98
2016-04-11,6.8
2016-04-12,7.12
2016-04-13,7.46
2016-04-14,7.46
2016-04-15,7.36
2016-04-18,7.8
2016-04-19,7.49
2016-04-20,7.6
2016-04-21,7.82
2016-04-22,7.86
2016-04-25,7.41
2016-04-26,7.3
2016-04-27,7.38
2016-04-28,7.13
2016-04-29,7.02
2016-05-02,6.99
2016-05-03,6.35
2016-05-04,5.81
2016-05-05,5.88
2016-05-06,5.92
2016-05-09,5.93
2016-05-10,5.96
2016-05-11,5.69
2016-05-12,5.46
2016-05-13,5.68
2016-05-16,5.56
2016-05-17,5.52
2016-05-18,5.48
2016-05-19,5.46
2016-05-20,5.57
2016-05-23,5.64
2016-05-24,6.22
2016-05-25,6.12
2016-05-26,5.95
2016-05-27,6.5
2016-05-31,6.64
2016-06-01,6.68
2016-06-02,6.88
2016-06-03,6.89
2016-06-06,7.43
2016-06-07,7.16
2016-06-08,7.4
2016-06-09,7.16
2016-06-10,6.99
2016-06-13,7.04
2016-06-14,9.39
2016-06-15,9.33
2016-06-16,11.25
2016-06-17,10.97
2016-06-20,10.84
2016-06-21,9.99
2016-06-22,10.35
2016-06-23,11.09
2016-06-24,11.54
2016-06-27,10.76
2016-06-28,11.2
2016-06-29,11.29
2016-06-30,12.25
2016-07-01,12.31
2016-07-05,11.86
2016-07-06,12.39
2016-07-07,12.2
2016-07-08,12.43
2016-07-11,12.6
2016-07-12,13.45
2016-07-13,13.1
2016-07-14,12.81
2016-07-15,13.02
2016-07-18,12.79
2016-07-19,12.73
2016-07-20,12.61
2016-07-21,12.145
2016-07-22,12.48
2016-07-25,12.46
2016-07-26,16.21
2016-07-27,16.82
2016-07-28,17.32
2016-07-29,17.38
2016-08-01,18.11
2016-08-02,17.75
2016-08-03,18.29
2016-08-04,19
2016-08-05,19.25
2016-08-08,19.39
2016-08-09,19.31
2016-08-10,19.45
2016-08-11,20.84
2016-08-12,21.19
2016-08-15,21.49
2016-08-16,20.23
2016-08-17,20.14
2016-08-18,20.89
2016-08-19,20.66
2016-08-22,20.8
2016-08-23,20.43
2016-08-24,18.97
2016-08-25,19.05
2016-08-26,19.19
2016-08-29,19.5
2016-08-30,18.93
2016-08-31,18.47
2016-09-01,18.195
2016-09-02,18.64
2016-09-06,19.02
2016-09-07,19.43
2016-09-08,19.74
2016-09-09,18.83
2016-09-12,19.07
2016-09-13,18.71
2016-09-14,18.83
2016-09-15,19.26
2016-09-16,19.4
2016-09-19,20.31
2016-09-20,20.9
2016-09-21,21.46
2016-09-22,21.45
2016-09-23,20.16
2016-09-26,19.44
2016-09-27,19.34
2016-09-28,18.9
2016-09-29,17.68
2016-09-30,18.57
2016-10-03,18.85
2016-10-04,18.81
2016-10-05,18.83
2016-10-06,19.22
2016-10-07,19.28
2016-10-10,19.83
2016-10-11,19.24
2016-10-12,18.48
2016-10-13,18.54
2016-10-14,18.33
2016-10-17,19.73
2016-10-18,19.75
2016-10-19,19.44
2016-10-20,20.145
2016-10-21,19.82
2016-10-24,20.12
2016-10-25,19.59
2016-10-26,16.73
2016-10-27,15.27
2016-10-28,15.48
2016-10-31,15.58
2016-11-01,15.81
2016-11-02,15.7
2016-11-03,15.55
2016-11-04,15.53
2016-11-07,16.41
2016-11-08,17.1
2016-11-09,16.94
2016-11-10,17.2
2016-11-11,17.68
2016-11-14,17.6
2016-11-15,17.41
2016-11-16,14.63
2016-11-17,14.62
2016-11-18,14.51
2016-11-21,15.05
2016-11-22,14.79
2016-11-23,15.36
2016-11-25,15.81
2016-11-28,15.19
2016-11-29,15.16
2016-11-30,14.77
2016-12-01,13.64
2016-12-02,13.98
2016-12-05,13.9
2016-12-06,14.62
2016-12-07,14.31
2016-12-08,14.54
2016-12-09,14.39
2016-12-12,13.88
2016-12-13,13.88
2016-12-14,13.63
2016-12-15,14.13
2016-12-16,14.34
2016-12-19,14.01
2016-12-20,13.96
2016-12-21,13.8
2016-12-22,13.38
2016-12-23,14.17
2016-12-27,13.99
2016-12-28,13.75
2016-12-29,13.53
2016-12-30,13.36
2017-01-03,13.41
2017-01-04,14.95
2017-01-05,15.18
2017-01-06,15.1
2017-01-09,17.98
2017-01-10,17.57
2017-01-11,18.66
2017-01-12,19.07
2017-01-13,19.04
2017-01-17,18.57
2017-01-18,18.92
2017-01-19,18.42
2017-01-20,18.09
2017-01-23,17.5
2017-01-24,17.535
2017-01-25,17.18
2017-01-26,17.68
2017-01-27,18.35
2017-01-30,18.08
2017-01-31,18.95
2017-02-01,19.01
2017-02-02,19.21
2017-02-03,19.16
2017-02-06,18.88
2017-02-07,18.47
2017-02-08,18.47
2017-02-09,18.58
2017-02-10,18.55
2017-02-13,18.63
2017-02-14,18.9
2017-02-15,19.69
2017-02-16,20.17
2017-02-17,19.91
2017-02-21,22.41
2017-02-22,22.69
2017-02-23,21.68
2017-02-24,21.42
2017-02-27,22.17
2017-02-28,21.52
2017-03-01,22.15
2017-03-02,22.47
2017-03-03,22.11
2017-03-06,22.02
2017-03-07,21.56
2017-03-08,21.94
2017-03-09,21.08
2017-03-10,21.37
2017-03-13,21.16
2017-03-14,21.04
2017-03-15,20.94
2017-03-16,20.44
2017-03-17,20.93
2017-03-20,21.225
2017-03-21,20.14
2017-03-22,20.4
2017-03-23,20.49
2017-03-24,21.08
2017-03-27,22.99
2017-03-28,22.75
2017-03-29,23.34
2017-03-30,23.56
2017-03-31,23.62
2017-04-03,22.94
2017-04-04,22.69
2017-04-05,22.54
2017-04-06,22.47
2017-04-07,22.79
2017-04-10,22.82
2017-04-11,22.87
2017-04-12,23.18
2017-04-13,23.27
2017-04-17,23.8
2017-04-18,23.99
2017-04-19,24.58
2017-04-20,24.24
2017-04-21,23.93
2017-04-24,24.49
2017-04-25,24.89
2017-04-26,23.8
2017-04-27,30.14
2017-04-28,30.01
2017-05-01,31.42
2017-05-02,30.97
2017-05-03,31.31
2017-05-04,31.96
2017-05-05,35.43
2017-05-08,34.29
2017-05-09,34.87
2017-05-10,34.47
2017-05-11,34.42
2017-05-12,33.77
2017-05-15,32.43
2017-05-16,31.95
2017-05-17,30.33
2017-05-18,31.03
2017-05-19,30.48
2017-05-22,31.8
2017-05-23,31.9
2017-05-24,32.96
2017-05-25,33.19
2017-05-26,33.32
2017-05-30,32.65
2017-05-31,36.47
2017-06-01,38.24
2017-06-02,38.31
2017-06-05,37.07
2017-06-06,36.59
2017-06-07,34.7
2017-06-08,34.99
2017-06-09,33.43
2017-06-12,32.35
2017-06-13,32.33
2017-06-14,32.09
2017-06-15,32.23
2017-06-16,32.27
2017-06-19,33.99
2017-06-20,33.27
2017-06-21,34.99
2017-06-22,34.71
2017-06-23,35.51
2017-06-26,34.94
2017-06-27,34.09
2017-06-28,36.6
2017-06-29,35.65
2017-06-30,35.37
2017-07-03,34.43
2017-07-05,36.07
2017-07-06,36.02
2017-07-07,37.03
2017-07-10,37.3
2017-07-11,37.93
2017-07-12,38.81
2017-07-13,38.78
2017-07-14,38.59
2017-07-17,38.64
2017-07-18,38.23
2017-07-19,39.14
2017-07-20,39.04
2017-07-21,39.17
2017-07-24,39.44
2017-07-25,37.33
2017-07-26,39.65
2017-07-27,37.93
2017-07-28,39.47
2017-07-31,38.8
2017-08-01,38
2017-08-02,37.89
2017-08-03,38.8
2017-08-04,38.69
2017-08-07,39.2
2017-08-08,38.26
2017-08-09,37.25
2017-08-10,37.05
2017-08-11,37.76
2017-08-14,38.74
2017-08-15,39.04
2017-08-16,38.66
2017-08-17,37.46
2017-08-18,37.87
2017-08-21,38.69
2017-08-22,40.52
2017-08-23,40.39
2017-08-24,41.09
2017-08-25,39.96
2017-08-28,41.18
2017-08-29,40.28
2017-08-30,40.76
2017-08-31,41.89
2017-09-01,41.62
2017-09-05,41.3
2017-09-06,42.35
2017-09-07,42.99
2017-09-08,42.46
2017-09-11,42.79
2017-09-12,42.78
2017-09-13,42.11
2017-09-14,41.65
2017-09-15,42.75
2017-09-18,42.49
2017-09-19,42.79
2017-09-20,43.4
2017-09-21,45
2017-09-22,45.96
2017-09-25,45.8
2017-09-26,45.82
2017-09-27,47.08
2017-09-28,46.41
2017-09-29,47.12
2017-10-02,47.94
2017-10-03,49.12
2017-10-04,47.99
2017-10-05,48.13
2017-10-06,48.63
2017-10-09,47.99
2017-10-10,48.6
2017-10-11,48.91
2017-10-12,48.07
2017-10-13,47.41
2017-10-16,47.2
2017-10-17,46.49
2017-10-18,46.62
2017-10-19,47.53
2017-10-20,49.15
2017-10-23,48.98
2017-10-24,49.59
2017-10-25,49.09
2017-10-26,49.33
2017-10-27,51.16
2017-10-30,50.1
2017-10-31,54.99
2017-11-01,53.01
2017-11-02,54.98
2017-11-03,56.71
2017-11-06,58.28
2017-11-07,60.5
2017-11-08,60.51
2017-11-09,59.18
2017-11-10,60.37
2017-11-13,58.22
2017-11-14,58.33
2017-11-15,57.42
2017-11-16,58.5
2017-11-17,58.87
2017-11-20,58.86
2017-11-21,59.745
2017-11-22,59.17
2017-11-24,59.27
2017-11-27,58.42
2017-11-28,58.79
2017-11-29,57.79
2017-11-30,59.48
2017-12-01,57.95
2017-12-04,55.18
2017-12-05,53.5
2017-12-06,53.73
2017-12-07,54.44
2017-12-08,53.83
2017-12-11,51.96
2017-12-12,50.22
2017-12-13,51.88
2017-12-14,51.22
2017-12-15,51.56
2017-12-18,52.82
2017-12-19,53.54
2017-12-20,53.73
2017-12-21,54.23
2017-12-22,52.02
2017-12-26,52.34
2017-12-27,53.12
2017-12-28,54.63
2017-12-29,52.54
2018-01-02,51.79
2018-01-03,55.83
2018-01-04,56.14
2018-01-05,57.53
2018-01-08,49.905
2018-01-09,52.47
2018-01-10,53.96
2018-01-11,55.06
2018-01-12,52.62
2018-01-16,52.95
2018-01-17,47.68
2018-01-18,48.79
2018-01-19,47.82
2018-01-22,48.49
2018-01-23,52.15
2018-01-24,51.63
2018-01-25,50.26
2018-01-26,50.07
2018-01-29,49.84
2018-01-30,49.5
2018-01-31,49.71
2018-02-01,49.6
2018-02-02,49
2018-02-05,47.13
2018-02-06,48.56
2018-02-07,48.17
2018-02-08,44.56
2018-02-09,45.9
2018-02-12,47.53
2018-02-13,47.57
2018-02-14,49.08
2018-02-15,49.14
2018-02-16,48.86
2018-02-20,48.01
2018-02-21,46.64
2018-02-22,44.99
2018-02-23,42.37
2018-02-26,42.56
2018-02-27,44.37
2018-02-28,44.61
2018-03-01,43.76
2018-03-02,45.42
2018-03-05,46.84
2018-03-06,47.76
2018-03-07,49.21
2018-03-08,50.88
2018-03-09,52.15
2018-03-12,53.19
2018-03-13,52.55
2018-03-14,52.76
2018-03-15,52.09
2018-03-16,52.57
2018-03-19,48.46
2018-03-20,49.04
2018-03-21,49.06
2018-03-22,45.99
2018-03-23,44.12
2018-03-26,45.1
2018-03-27,41.71
2018-03-28,39.82
2018-03-29,40.33
2018-04-02,38.8
2018-04-03,40.4
2018-04-04,40.67
2018-04-05,40.5
2018-04-06,37.84
2018-04-09,40.35
2018-04-10,41.16
2018-04-11,42.36
2018-04-12,45.64
2018-04-13,44.96
2018-04-16,44.88
2018-04-17,47.68
2018-04-18,47.8
2018-04-19,46.8
2018-04-20,47.52
2018-04-23,48.7
2018-04-24,46.93
2018-04-25,45.27
2018-04-26,46.6
2018-04-27,52.02
2018-04-30,50.01
2018-05-01,50.02
2018-05-02,49.86
2018-05-03,49.08
2018-05-04,49.61
2018-05-07,50.59
2018-05-08,50.94
2018-05-09,51.54
2018-05-10,51.69
2018-05-11,52.39
2018-05-14,52.03
2018-05-15,50.77
2018-05-16,50.96
2018-05-17,51.12
2018-05-18,52.36
2018-05-21,52.29
2018-05-22,52.99
2018-05-23,51.35
2018-05-24,52.85
2018-05-25,51.82
2018-05-29,52.72
2018-05-30,58.58
2018-05-31,59.54
2018-06-01,59.54
2018-06-04,60.56
2018-06-05,62.46
2018-06-06,65.36
2018-06-07,63.2
2018-06-08,63.26
2018-06-11,64.85
2018-06-12,66.72
2018-06-13,67.78
2018-06-14,67.5
2018-06-15,68.53
2018-06-18,69.96
2018-06-19,69.49
2018-06-20,69.33
2018-06-21,68.82
2018-06-22,66.33
2018-06-25,63.87
2018-06-26,63.99
2018-06-27,60.44
2018-06-28,60.48
2018-06-29,59.79
2018-07-02,60.5
2018-07-03,61.82
2018-07-05,62.22
2018-07-06,62.46
2018-07-09,62.16
2018-07-10,62.39
2018-07-11,62.5
2018-07-12,64.18
2018-07-13,63.76
2018-07-16,64.66
2018-07-17,66.73
2018-07-18,66.74
2018-07-19,67.61
2018-07-20,67.62
2018-07-23,65.96
2018-07-24,63.07
2018-07-25,62.58
2018-07-26,61.91
2018-07-27,58.86
2018-07-30,57.4
2018-07-31,58.45
2018-08-01,59.12
2018-08-02,51.63
2018-08-03,50.43
2018-08-06,50.91
2018-08-07,50.8
2018-08-08,50
2018-08-09,50.31
2018-08-10,49.93
2018-08-13,49.29
2018-08-14,49.82
2018-08-15,48.29
2018-08-16,48.68
2018-08-17,48.84
2018-08-20,49.21
2018-08-21,50.05
2018-08-22,65.32
2018-08-23,67.98
2018-08-24,70.51
2018-08-27,72.16
2018-08-28,75.09
2018-08-29,74.32
2018-08-30,75.43
2018-08-31,74.89
2018-09-04,77.6
2018-09-05,75.8
2018-09-06,75
2018-09-07,77.22
2018-09-10,75.99
2018-09-11,75.91
2018-09-12,75.46
2018-09-13,76.76
2018-09-14,76.27
2018-09-17,73.33
2018-09-18,72.76
2018-09-19,74.14
2018-09-20,74.99
2018-09-21,76.28
2018-09-24,78.74
2018-09-25,80.6
2018-09-26,79.19
2018-09-27,76.69
2018-09-28,78.92
2018-10-01,79.2
2018-10-02,77.8
2018-10-03,76.83
2018-10-04,72.45
2018-10-05,71.12
2018-10-08,68.45
2018-10-09,70.04
2018-10-10,67.35
2018-10-11,66.41
2018-10-12,67.22
2018-10-15,65.77
2018-10-16,67.44
2018-10-17,66.05
2018-10-18,63.47
2018-10-19,61.64
2018-10-22,62.25
2018-10-23,63.04
2018-10-24,60.41
2018-10-25,63.63
2018-10-26,64.73
2018-10-29,61.5
2018-10-30,64.4
2018-10-31,71.05
2018-11-01,73.31
2018-11-02,74.2
2018-11-05,74.25
2018-11-06,74.22
2018-11-07,75.48
2018-11-08,76.08
2018-11-09,74.62
2018-11-12,68.25
2018-11-13,69.41
2018-11-14,68.45
2018-11-15,68.87
2018-11-16,71.38
2018-11-19,67.28
2018-11-20,64.73
2018-11-21,66.57
2018-11-23,67.06
2018-11-26,70.24
2018-11-27,69.76
2018-11-28,76.37
2018-11-29,75.84
2018-11-30,77.98
2018-12-03,82.66
2018-12-04,75.94
2018-12-06,74.92
2018-12-07,71.7
2018-12-10,69.55
2018-12-11,69.52
2018-12-12,71.79
2018-12-13,67.85
2018-12-14,68.31
2018-12-17,67.11
2018-12-18,67.8
2018-12-19,64.35
2018-12-20,58.76
2018-12-21,56.33
2018-12-24,56.04
2018-12-26,59.46
2018-12-27,60.7
2018-12-28,61.19
2018-12-31,63.1
2019-01-02,64.14
2019-01-03,61.98
2019-01-04,65.65
2019-01-07,75.36
2019-01-08,76.16
2019-01-09,77.8
2019-01-10,78.05
2019-01-11,76.38
2019-01-14,73.58
2019-01-15,77.09
2019-01-16,74.97
2019-01-17,75.63
2019-01-18,78.8
2019-01-22,76.07
2019-01-23,79.71
2019-01-24,78.78
2019-01-25,81.98
2019-01-28,83.81
2019-01-29,85.62
2019-01-30,87.91
2019-01-31,90.08
2019-02-01,89.4
2019-02-04,88.66
2019-02-05,87.1
2019-02-06,88.35
2019-02-07,86.8
2019-02-08,88.71
2019-02-11,87.99
2019-02-12,90.15
2019-02-13,89.27
2019-02-14,88.12
2019-02-15,88.55
2019-02-19,85.57
2019-02-20,83.63
2019-02-21,83.28
2019-02-22,92.04
2019-02-25,91.76
2019-02-26,92.62
2019-02-27,96.5
2019-02-28,91
2019-03-01,92.3
2019-03-04,88.88
2019-03-05,87.58
2019-03-06,85.57
2019-03-07,84.5
2019-03-08,85.37
2019-03-11,90.85
2019-03-12,93.64
2019-03-13,94.79
2019-03-14,96.15
2019-03-15,95.2
2019-03-18,91.93
2019-03-19,91.15
2019-03-20,90.48
2019-03-21,92.02
2019-03-22,89
2019-03-25,89.06
2019-03-26,90.96
2019-03-27,82.56
2019-03-28,84.57
2019-03-29,86.62
2019-04-01,90.25
2019-04-02,91.86
2019-04-03,92.59
2019-04-04,90.1
2019-04-05,91.33
2019-04-08,92.91
2019-04-09,91.61
2019-04-10,95.15
2019-04-11,93.72
2019-04-12,94.9
2019-04-15,95
2019-04-16,95.21
2019-04-17,91.81
2019-04-18,92.21
2019-04-22,90.67
2019-04-23,93.94
2019-04-24,95.13
2019-04-25,95.39
2019-04-26,97.69
2019-04-29,98.15
2019-04-30,98.69
2019-05-01,97.22
2019-05-02,101.65
2019-05-03,104.72
2019-05-06,104.71
2019-05-07,102.78
2019-05-08,101.52
2019-05-09,102.24
2019-05-10,92.38
2019-05-13,89.51
2019-05-14,92
2019-05-15,95.37
2019-05-16,97.74
2019-05-17,96.19
2019-05-20,96.04
2019-05-21,96.95
2019-05-22,94.91
2019-05-23,94
2019-05-24,96.88
2019-05-28,98
2019-05-29,97.72
2019-05-30,101.55
2019-05-31,103.63
2019-06-03,100.95
2019-06-04,102.61
2019-06-05,105.34
2019-06-06,104.06
2019-06-07,108.05
2019-06-10,110.31
2019-06-11,110.2
2019-06-12,112.28
2019-06-13,112.19
2019-06-14,110.04
2019-06-17,111.8
2019-06-18,115.41
2019-06-19,116.27
2019-06-20,115.465
2019-06-21,115.52
2019-06-24,113.945
2019-06-25,111.4
2019-06-26,112.795
2019-06-27,115.11
2019-06-28,117.56
2019-07-01,115.85
2019-07-02,116.75
2019-07-03,117.94
2019-07-04,117.94
2019-07-05,118.04
2019-07-08,117.765
2019-07-09,120.94
2019-07-10,119.99
2019-07-11,115.19
2019-07-12,115.135
2019-07-15,116.255
2019-07-16,115.045
2019-07-17,116.37
2019-07-18,116.89
2019-07-19,114.89
2019-07-22,116.02
2019-07-23,117.14
2019-07-24,117.5
2019-07-25,116.09
2019-07-26,117.93
2019-07-29,118.44
2019-07-30,118.04
2019-07-31,114.945
2019-08-01,114.99
2019-08-02,115.17
2019-08-05,108.49
2019-08-06,112.91
2019-08-07,114.685
2019-08-08,119.86
2019-08-09,118.41
2019-08-12,116.84
2019-08-13,121.21
2019-08-14,118.52
2019-08-15,118.45
2019-08-16,119.785
2019-08-19,118.11
2019-08-20,119.57
2019-08-21,119.31
2019-08-22,118.03
2019-08-23,116.53
2019-08-26,120.085
2019-08-27,119.03
2019-08-28,120.205
2019-08-29,122.31
2019-08-30,119.49
2019-09-02,119.24
2019-09-03,118.01
2019-09-04,120.65
2019-09-05,122.42
2019-09-06,120.555
2019-09-09,108.515
2019-09-10,108.535
2019-09-11,108.37
2019-09-12,108.7
2019-09-13,106.615
2019-09-16,104.12
2019-09-17,106.905
2019-09-18,105.97
2019-09-19,103.69
2019-09-20,104.27
2019-09-23,104.07
2019-09-24,99.61
2019-09-25,97.24
2019-09-26,97.5
2019-09-27,92.04
2019-09-30,90.35
2019-10-01,89.185
2019-10-02,87.465
2019-10-03,92.92
2019-10-04,93.17
2019-10-07,92.94
2019-10-08,90.195
2019-10-09,91.155
2019-10-10,90.44
2019-10-11,92.35
2019-10-14,94.9
2019-10-15,99.57
2019-10-16,97.74
2019-10-17,97.4
2019-10-18,96.585
2019-10-21,92.9
2019-10-22,88.77
2019-10-23,87.58
2019-10-24,88.93
2019-10-25,89.88
2019-10-28,92.74
2019-10-29,90.645
2019-10-30,84.01
2019-10-31,86.87
2019-11-01,89.88
2019-11-04,88.58
2019-11-05,84.11
2019-11-06,80.8
2019-11-07,79.97
2019-11-08,83.6
2019-11-11,80.495
2019-11-12,79.9
2019-11-13,78.135
2019-11-14,79.23
2019-11-15,82.12
2019-11-18,82.025
2019-11-19,83.82
2019-11-20,83.95
2019-11-21,78.85
2019-11-22,77.69
2019-11-25,81.66
