date,close
2014-06-13,20.2622
2014-06-16,20.6516
2014-06-17,20.5585
2014-06-18,20.4738
2014-06-19,20.7871
2014-06-20,20.8972
2014-06-23,20.9141
2014-06-24,20.7786
2014-06-25,20.4908
2014-06-26,20.0759
2014-06-27,20.2444
2014-06-30,20.6178
2014-07-01,20.6178
2014-07-02,20.7024
2014-07-03,20.6855
2014-07-07,20.2791
2014-07-08,19.8388
2014-07-09,20.1351
2014-07-10,20.2113
2014-07-11,20.2433
2014-07-14,20.2706
2014-07-15,20.6008
2014-07-16,20.6262
2014-07-17,20.4061
2014-07-18,20.4061
2014-07-21,20.4315
2014-07-22,20.1436
2014-07-23,19.9489
2014-07-24,20.313
2014-07-25,20.2198
2014-07-28,20.2029
2014-07-29,20.1944
2014-07-30,19.9404
2014-07-31,19.5424
2014-08-01,19.4832
2014-08-04,19.136
2014-08-05,19.0513
2014-08-06,18.3824
2014-08-07,18.1369
2014-08-08,18.1792
2014-08-11,18.2554
2014-08-12,18.1199
2014-08-13,18.2977
2014-08-14,18.1284
2014-08-15,18.1792
2014-08-18,18.0776
2014-08-19,18.0183
2014-08-20,18.0607
2014-08-21,18.3231
2014-08-22,18.4925
2014-08-25,18.0776
2014-08-26,18.3401
2014-08-27,18.484
2014-08-28,18.484
2014-08-29,18.5433
2014-09-02,18.5856
2014-09-03,18.6026
2014-09-04,18.611
2014-09-05,18.3993
2014-09-08,18.5094
2014-09-09,18.4163
2014-09-10,18.628
2014-09-11,18.4163
2014-09-12,18.4163
2014-09-15,17.8659
2014-09-16,17.849
2014-09-17,17.8404
2014-09-18,18.0712
2014-09-19,18.1139
2014-09-22,18.2592
2014-09-23,18.1139
2014-09-24,18.1481
2014-09-25,18.1225
2014-09-26,18.1139
2014-09-29,18.0712
2014-09-30,18.0712
2014-10-01,18.0669
2014-10-02,18.0712
2014-10-03,18.0968
2014-10-06,18.2763
2014-10-07,18.037
2014-10-08,18.1823
2014-10-09,18.1139
2014-10-10,18.131
2014-10-13,17.9174
2014-10-14,17.8875
2014-10-15,17.9601
2014-10-16,18.1652
2014-10-17,18.1481
2014-10-20,17.9217
2014-10-21,17.9174
2014-10-22,17.7807
2014-10-23,17.5415
2014-10-24,17.5842
2014-10-27,17.5842
2014-10-28,17.7551
2014-10-29,17.5586
2014-10-30,17.4817
2014-10-31,17.5073
2014-11-03,17.5329
2014-11-04,17.2766
2014-11-05,17.3535
2014-11-06,17.1997
2014-11-07,17.4133
2014-11-10,17.5073
2014-11-11,17.3449
2014-11-12,17.3108
2014-11-13,17.3364
2014-11-14,17.2595
2014-11-17,17.4987
2014-11-18,18.1396
2014-11-19,18.1737
2014-11-20,18.1994
2014-11-21,18.1539
2014-11-24,18.1139
2014-11-25,18.225
2014-11-26,18.4044
2014-11-28,18.5412
2014-12-01,18.584
2014-12-02,18.413
2014-12-03,18.6351
2014-12-04,18.822
2014-12-05,18.5164
2014-12-08,18.5412
2014-12-09,18.5497
2014-12-10,18.5582
2014-12-11,18.6864
2014-12-12,18.5711
2014-12-15,18.4472
2014-12-16,18.3019
2014-12-17,18.4472
2014-12-18,18.5326
2014-12-19,19.3785
2014-12-22,19.3354
2014-12-23,19.5598
2014-12-24,19.0799
2014-12-26,19.0678
2014-12-29,18.9901
2014-12-30,19.0428
2014-12-31,19.0246
2015-01-02,18.7225
2015-01-05,18.4118
2015-01-06,18.4204
2015-01-07,18.3427
2015-01-08,18.6448
2015-01-09,18.6448
2015-01-12,18.593
2015-01-13,18.4031
2015-01-14,18.1873
2015-01-15,18.1701
2015-01-16,18.2305
2015-01-20,18.2132
2015-01-21,18.1528
2015-01-22,18.5585
2015-01-23,18.1528
2015-01-26,18.196
2015-01-27,18.36
2015-01-28,18.1269
2015-01-29,18.1183
2015-01-30,17.9125
2015-02-02,18.1873
2015-02-03,18.4506
2015-02-04,18.5844
2015-02-05,18.7484
2015-02-06,18.7139
2015-02-09,18.8951
2015-02-10,19.0434
2015-02-11,19.3785
2015-02-12,18.9685
2015-02-13,18.9513
2015-02-17,19.4131
2015-02-18,19.6806
2015-02-19,19.8533
2015-02-20,19.931
2015-02-23,20.0173
2015-02-24,19.9223
2015-02-25,20.1036
2015-02-26,19.9915
2015-02-27,19.8878
2015-03-02,19.9741
2015-03-03,19.6634
2015-03-04,19.7756
2015-03-05,19.7583
2015-03-06,19.4562
2015-03-09,19.767
2015-03-10,19.4735
2015-03-11,19.2749
2015-03-12,19.672
2015-03-13,19.2749
2015-03-16,19.4217
2015-03-17,19.2922
2015-03-18,19.7411
2015-03-19,19.4303
2015-03-20,19.3953
2015-03-23,19.5617
2015-03-24,19.9209
2015-03-25,19.8596
2015-03-26,20.0085
2015-03-27,20.0085
2015-03-30,19.7194
2015-03-31,19.2726
2015-04-01,19.7019
2015-04-02,19.7807
2015-04-06,20.4465
2015-04-07,20.4027
2015-04-08,20.1749
2015-04-09,20.245
2015-04-10,20.1388
2015-04-13,20.0693
2015-04-14,20.1399
2015-04-15,20.0961
2015-04-16,20.2187
2015-04-17,20.0611
2015-04-20,19.9997
2015-04-21,20.2012
2015-04-22,20.4202
2015-04-23,20.429
2015-04-24,20.5341
2015-04-27,20.613
2015-04-28,20.3852
2015-04-29,20.3238
2015-04-30,19.9822
2015-05-01,20.026
2015-05-04,20.4553
2015-05-05,20.4816
2015-05-06,20.4115
2015-05-07,20.3063
2015-05-08,20.4553
2015-05-11,20.5604
2015-05-12,20.2954
2015-05-13,20.4378
2015-05-14,20.6392
2015-05-15,20.6305
2015-05-18,21.7518
2015-05-19,21.305
2015-05-20,21.019
2015-05-21,21.3663
2015-05-22,21.3663
2015-05-26,21.1123
2015-05-27,20.9984
2015-05-28,20.8057
2015-05-29,20.3677
2015-06-01,21.5415
2015-06-02,21.8131
2015-06-03,21.6989
2015-06-04,21.4627
2015-06-05,21.4189
2015-06-08,21.0744
2015-06-09,20.9458
2015-06-10,21.5153
2015-06-11,21.4452
2015-06-12,21.086
2015-06-15,21.7651
2015-06-16,21.8092
2015-06-17,21.6063
2015-06-18,21.7474
2015-06-19,21.8242
2015-06-22,22.0473
2015-06-23,21.474
2015-06-24,21.6063
2015-06-25,22.0473
2015-06-26,21.6063
2015-06-29,21.3903
2015-06-30,21.9855
2015-07-01,22.1266
2015-07-02,22.0914
2015-07-06,22.1355
2015-07-07,21.8709
2015-07-08,21.6945
2015-07-09,21.5622
2015-07-10,21.9591
2015-07-13,22.2942
2015-07-14,22.4353
2015-07-15,22.3118
2015-07-16,22.303
2015-07-17,22.1531
2015-07-20,22.4441
2015-07-21,22.2025
2015-07-22,21.9326
2015-07-23,22.012
2015-07-24,21.7827
2015-07-27,22.2501
2015-07-28,22.6602
2015-07-29,22.8762
2015-07-30,22.2677
2015-07-31,22.6205
2015-08-03,22.0208
2015-08-04,22.5411
2015-08-05,22.5323
2015-08-06,22.8145
2015-08-07,22.7263
2015-08-10,22.2854
2015-08-11,22.4
2015-08-12,22.6822
2015-08-13,22.6734
2015-08-14,22.1443
2015-08-17,22.8145
2015-08-18,22.4088
2015-08-19,22.2148
2015-08-20,21.8709
2015-08-21,21.7827
2015-08-24,20.9273
2015-08-25,21.0155
2015-08-26,20.9361
2015-08-27,21.2536
2015-08-28,21.3594
2015-08-31,21.3153
2015-09-01,20.9449
2015-09-02,21.0066
2015-09-03,20.8567
2015-09-04,20.989
2015-09-08,21.0155
2015-09-09,21.2977
2015-09-10,20.9978
2015-09-11,21.3681
2015-09-14,20.7244
2015-09-15,21.0948
2015-09-16,20.3479
2015-09-17,20.6362
2015-09-18,20.593
2015-09-21,20.0321
2015-09-22,19.8502
2015-09-23,19.8502
2015-09-24,18.5369
2015-09-25,18.7765
2015-09-28,18.3595
2015-09-29,18.2264
2015-09-30,18.2264
2015-10-01,18.5281
2015-10-02,18.6523
2015-10-05,18.954
2015-10-06,19.0871
2015-10-07,19.6106
2015-10-08,19.7792
2015-10-09,19.8414
2015-10-12,19.4687
2015-10-13,18.8919
2015-10-14,19.2025
2015-10-15,18.9717
2015-10-16,18.9363
2015-10-19,18.5636
2015-10-20,18.5281
2015-10-21,18.9096
2015-10-22,18.6168
2015-10-23,18.4748
2015-10-26,17.9451
2015-10-27,18.2175
2015-10-28,18.1909
2015-10-29,18.67
2015-10-30,18.6434
2015-11-02,18.9008
2015-11-03,18.7943
2015-11-04,19.3178
2015-11-05,19.8766
2015-11-06,19.4775
2015-11-09,19.167
2015-11-10,19.3888
2015-11-11,19.4316
2015-11-12,19.7437
2015-11-13,19.655
2015-11-16,19.5485
2015-11-17,20.1874
2015-11-18,19.7437
2015-11-19,19.655
2015-11-20,19.5219
2015-11-23,18.6346
2015-11-24,18.5902
2015-11-25,18.5813
2015-11-27,18.2264
2015-11-30,17.9247
2015-12-01,17.969
2015-12-02,17.8625
2015-12-03,17.9068
2015-12-04,17.9602
2015-12-07,17.7472
2015-12-08,17.7472
2015-12-09,17.6496
2015-12-10,17.7472
2015-12-11,17.5697
2015-12-14,17.126
2015-12-15,16.8776
2015-12-16,16.7533
2015-12-17,16.5138
2015-12-18,16.4162
2015-12-21,15.9957
2015-12-22,16.0583
2015-12-23,16.3446
2015-12-24,16.5056
2015-12-28,17.1229
2015-12-29,16.944
2015-12-30,17.0245
2015-12-31,16.935
2016-01-04,17.2392
2016-01-05,17.0513
2016-01-06,16.9708
2016-01-07,16.5503
2016-01-08,16.282
2016-01-11,15.9599
2016-01-12,15.6101
2016-01-13,14.9946
2016-01-14,15.4321
2016-01-15,15.3873
2016-01-19,15.5572
2016-01-20,15.3784
2016-01-21,15.4142
2016-01-22,15.4142
2016-01-25,15.3605
2016-01-26,15.5663
2016-01-27,15.6021
2016-01-28,15.8704
2016-01-29,16.2551
2016-02-01,16.5772
2016-02-02,16.1478
2016-02-03,16.282
2016-02-04,15.8704
2016-02-05,15.611
2016-02-08,15.3873
2016-02-09,15.2889
2016-02-10,15.2889
2016-02-11,14.94
2016-02-12,14.8685
2016-02-16,16.0941
2016-02-17,16.0762
2016-02-18,16.2372
2016-02-19,16.3804
2016-02-22,16.2193
2016-02-23,16.6309
2016-02-24,15.5484
2016-02-25,15.9062
2016-02-26,15.7362
2016-02-29,15.1369
2016-03-01,15.4589
2016-03-02,15.3605
2016-03-03,15.45
2016-03-04,15.45
2016-03-07,15.6468
2016-03-08,15.4768
2016-03-09,15.611
2016-03-10,15.4231
2016-03-11,15.3873
2016-03-14,16.3446
2016-03-15,16.1388
2016-03-16,16.3714
2016-03-17,16.3535
2016-03-18,16.5146
2016-03-21,16.5964
2016-03-22,16.5692
2016-03-23,16.369
2016-03-24,16.4873
2016-03-28,16.7602
2016-03-29,16.9786
2016-03-30,17.3426
2016-03-31,17.8794
2016-04-01,18.207
2016-04-04,18.0887
2016-04-05,17.9158
2016-04-06,18.0068
2016-04-07,17.9795
2016-04-08,17.9431
2016-04-11,18.025
2016-04-12,18.0705
2016-04-13,18.2525
2016-04-14,18.3525
2016-04-15,18.4071
2016-04-18,18.6437
2016-04-19,18.7165
2016-04-20,19.0259
2016-04-21,19.3898
2016-04-22,19.2987
2016-04-25,19.1532
2016-04-26,19.3716
2016-04-27,19.226
2016-04-28,18.9076
2016-04-29,18.9258
2016-05-02,18.9895
2016-05-03,19.1532
2016-05-04,19.135
2016-05-05,19.1078
2016-05-06,19.2078
2016-05-09,19.0805
2016-05-10,19.1078
2016-05-11,19.0714
2016-05-12,19.1078
2016-05-13,19.0441
2016-05-16,18.9986
2016-05-17,18.8348
2016-05-18,18.6346
2016-05-19,18.4617
2016-05-20,18.4617
2016-05-23,18.2888
2016-05-24,18.2615
2016-05-25,18.5436
2016-05-26,18.9076
2016-05-27,19.2806
2016-05-31,19.8721
2016-06-01,20.0085
2016-06-02,20.0267
2016-06-03,20.2178
2016-06-06,20.2633
2016-06-07,20.0449
2016-06-08,20.2269
2016-06-09,20.0358
2016-06-10,19.9176
2016-06-13,20.0176
2016-06-14,19.9994
2016-06-15,19.9858
2016-06-16,20.0176
2016-06-17,20.3816
2016-06-20,20.2349
2016-06-21,20.1249
2016-06-22,20.2807
2016-06-23,20.3541
2016-06-24,20.1707
2016-06-27,20.079
2016-06-28,20.1799
2016-06-29,20.2716
2016-06-30,20.8033
2016-07-01,21.1793
2016-07-05,21.2709
2016-07-06,21.2526
2016-07-07,21.1701
2016-07-08,21.3901
2016-07-11,21.326
2016-07-12,21.3443
2016-07-13,21.4726
2016-07-14,22.3162
2016-07-15,22.4262
2016-07-18,21.6102
2016-07-19,21.2984
2016-07-20,21.5002
2016-07-21,21.2618
2016-07-22,21.4085
2016-07-25,21.4085
2016-07-26,21.5918
2016-07-27,21.8027
2016-07-28,21.7752
2016-07-29,21.9677
2016-08-01,22.582
2016-08-02,22.4262
2016-08-03,22.1328
2016-08-04,22.3895
2016-08-05,22.4353
2016-08-08,22.362
2016-08-09,22.6095
2016-08-10,22.3437
2016-08-11,21.7981
2016-08-12,22.8938
2016-08-15,22.8296
2016-08-16,22.472
2016-08-17,22.6462
2016-08-18,22.8113
2016-08-19,22.7058
2016-08-22,22.8204
2016-08-23,22.9855
2016-08-24,22.9213
2016-08-25,22.9396
2016-08-26,22.9579
2016-08-29,23.0771
2016-08-30,23.0496
2016-08-31,22.7379
2016-09-01,22.7562
2016-09-02,22.8113
2016-09-06,22.8571
2016-09-07,22.8846
2016-09-08,23.0313
2016-09-09,22.9029
2016-09-12,22.8663
2016-09-13,23.1046
2016-09-14,23.1138
2016-09-15,23.1551
2016-09-16,23.1046
2016-09-19,23.2062
2016-09-20,23.4925
2016-09-21,24.4344
2016-09-22,24.6653
2016-09-23,24.5729
2016-09-26,25.1085
2016-09-27,24.5914
2016-09-28,24.5545
2016-09-29,24.2774
2016-09-30,24.4344
2016-10-03,24.3882
2016-10-04,24.2405
2016-10-05,24.379
2016-10-06,24.2867
2016-10-07,24.2774
2016-10-10,24.7391
2016-10-11,24.6191
2016-10-12,24.4344
2016-10-13,24.4159
2016-10-14,24.6283
2016-10-17,24.4713
2016-10-18,24.7022
2016-10-19,24.4252
2016-10-20,24.7022
2016-10-21,24.6099
2016-10-24,24.7484
2016-10-25,24.656
2016-10-26,24.656
2016-10-27,24.7022
2016-10-28,24.7022
2016-10-31,24.5637
2016-11-01,24.5175
2016-11-02,24.5637
2016-11-03,24.4252
2016-11-04,23.9173
2016-11-07,24.3328
2016-11-08,24.102
2016-11-09,24.1943
2016-11-10,24.0096
2016-11-11,24.1481
2016-11-14,23.5479
2016-11-15,22.763
2016-11-16,22.7168
2016-11-17,22.5783
2016-11-18,22.4859
2016-11-21,22.8553
2016-11-22,22.4398
2016-11-23,22.5321
2016-11-25,22.5321
2016-11-28,22.6706
2016-11-29,22.5783
2016-11-30,23.04
2016-12-01,23.1323
2016-12-02,23.1323
2016-12-05,22.9938
2016-12-06,23.2709
2016-12-07,23.1323
2016-12-08,23.3632
2016-12-09,23.8249
2016-12-12,24.2867
2016-12-13,24.102
2016-12-14,24.0558
2016-12-15,23.9173
2016-12-16,24.0558
2016-12-19,24.4713
2016-12-20,24.2867
2016-12-21,24.379
2016-12-22,23.6864
2016-12-23,24.2448
2016-12-27,24.2914
2016-12-28,24.524
2016-12-29,24.2914
2016-12-30,24.6636
2017-01-03,25.0359
2017-01-04,26.6181
2017-01-05,25.5013
2017-01-06,25.5013
2017-01-09,25.6874
2017-01-10,26.0597
2017-01-11,25.827
2017-01-12,25.5478
2017-01-13,25.3617
2017-01-17,25.129
2017-01-18,24.9429
2017-01-19,24.9894
2017-01-20,24.9894
2017-01-23,24.8033
2017-01-24,24.9894
2017-01-25,25.3151
2017-01-26,25.2221
2017-01-27,25.6874
2017-01-30,25.5013
2017-01-31,25.6409
2017-02-01,25.6874
2017-02-02,25.8736
2017-02-03,26.2924
2017-02-06,26.8043
2017-02-07,26.432
2017-02-08,26.5251
2017-02-09,26.3855
2017-02-10,26.2924
2017-02-13,26.1993
2017-02-14,26.3389
2017-02-15,26.1993
2017-02-16,25.827
2017-02-17,25.6409
2017-02-21,25.6409
2017-02-22,25.5013
2017-02-23,25.3617
2017-02-24,25.9201
2017-02-27,26.1528
2017-02-28,26.0597
2017-03-01,26.8043
2017-03-02,26.8508
2017-03-03,26.8043
2017-03-06,26.5716
2017-03-07,26.5716
2017-03-08,26.7577
2017-03-09,26.6647
2017-03-10,26.6181
2017-03-13,26.7112
2017-03-14,26.7112
2017-03-15,27.13
2017-03-16,26.9904
2017-03-17,27.4092
2017-03-20,27.8338
2017-03-21,27.5036
2017-03-22,27.2205
2017-03-23,27.6451
2017-03-24,27.9282
2017-03-27,27.7394
2017-03-28,27.6451
2017-03-29,27.6923
2017-03-30,28.1169
2017-03-31,29.1075
2017-04-03,29.9567
2017-04-04,29.485
2017-04-05,28.2584
2017-04-06,29.0132
2017-04-07,29.5793
2017-04-10,29.0132
2017-04-11,29.3906
2017-04-12,28.5886
2017-04-13,28.0697
2017-04-17,28.3056
2017-04-18,28.2584
2017-04-19,28.9188
2017-04-20,28.8717
2017-04-21,28.7301
2017-04-24,28.9188
2017-04-25,29.3906
2017-04-26,29.1075
2017-04-27,28.966
2017-04-28,29.5321
2017-05-01,29.4378
2017-05-02,29.2963
2017-05-03,28.8245
2017-05-04,28.5414
2017-05-05,29.1547
2017-05-08,30.0982
2017-05-09,30.9474
2017-05-10,31.372
2017-05-11,31.6551
2017-05-12,31.6079
2017-05-15,31.6079
2017-05-16,31.8909
2017-05-17,30.3813
2017-05-18,29.6265
2017-05-19,29.4378
2017-05-22,29.485
2017-05-23,29.0604
2017-05-24,29.4378
2017-05-25,30.1926
2017-05-26,30.3341
2017-05-30,30.5228
2017-05-31,30.3813
2017-06-01,30.7587
2017-06-02,30.57
2017-06-05,30.4285
2017-06-06,30.4285
2017-06-07,31.0418
2017-06-08,31.1361
2017-06-09,30.9474
2017-06-12,30.0039
2017-06-13,29.9095
2017-06-14,30.2398
2017-06-15,29.2491
2017-06-16,29.3906
2017-06-19,29.8152
2017-06-20,29.6265
2017-06-21,29.3434
2017-06-22,29.2019
2017-06-23,29.2399
2017-06-26,28.7169
2017-06-27,29.2875
2017-06-28,29.6678
2017-06-29,29.6678
2017-06-30,29.7629
2017-07-03,29.6678
2017-07-05,29.9531
2017-07-06,29.858
2017-07-07,30.1908
2017-07-10,30.0006
2017-07-11,30.0006
2017-07-12,29.9056
2017-07-13,29.9531
2017-07-14,29.858
2017-07-17,29.6203
2017-07-18,29.2875
2017-07-19,29.7154
2017-07-20,29.4776
2017-07-21,29.335
2017-07-24,29.4301
2017-07-25,29.2875
2017-07-26,29.2875
2017-07-27,29.4776
2017-07-28,29.2399
2017-07-31,29.0022
2017-08-01,28.9071
2017-08-02,29.2399
2017-08-03,29.335
2017-08-04,29.1924
2017-08-07,28.9071
2017-08-08,28.6218
2017-08-09,28.4792
2017-08-10,28.7169
2017-08-11,28.812
2017-08-14,29.3826
2017-08-15,29.0973
2017-08-16,29.9056
2017-08-17,30.2384
2017-08-18,31.427
2017-08-21,31.3319
2017-08-22,31.5221
2017-08-23,31.7122
2017-08-24,31.6172
2017-08-25,31.9024
2017-08-28,31.9024
2017-08-29,31.8549
2017-08-30,31.8549
2017-08-31,31.7598
2017-09-01,31.8549
2017-09-05,31.5696
2017-09-06,31.8549
2017-09-07,31.9024
2017-09-08,31.8549
2017-09-11,32.2352
2017-09-12,32.3303
2017-09-13,32.3303
2017-09-14,32.2828
2017-09-15,32.3779
2017-09-18,34.4272
2017-09-19,34.8581
2017-09-20,34.523
2017-09-21,34.5709
2017-09-22,34.5709
2017-09-25,34.4272
2017-09-26,34.3793
2017-09-27,33.9484
2017-09-28,33.8526
2017-09-29,34.523
2017-10-02,34.7624
2017-10-03,35.1933
2017-10-04,35.2412
2017-10-05,34.9539
2017-10-06,35.4806
2017-10-09,35.72
2017-10-10,36.1031
2017-10-11,35.5764
2017-10-12,35.7679
2017-10-13,35.2891
2017-10-16,35.1933
2017-10-17,35.0497
2017-10-18,35.6243
2017-10-19,35.8637
2017-10-20,36.0073
2017-10-23,36.0073
2017-10-24,36.1988
2017-10-25,35.4806
2017-10-26,35.0497
2017-10-27,34.7145
2017-10-30,34.4751
2017-10-31,33.9963
2017-11-01,33.7569
2017-11-02,33.9484
2017-11-03,33.7569
2017-11-06,33.8047
2017-11-07,33.6132
2017-11-08,33.6611
2017-11-09,33.8047
2017-11-10,33.6611
2017-11-13,33.3259
2017-11-14,34.3314
2017-11-15,34.4751
2017-11-16,34.5709
2017-11-17,34.4272
2017-11-20,33.9005
2017-11-21,33.5174
2017-11-22,33.7569
2017-11-24,34.4751
2017-11-27,34.4751
2017-11-28,34.2836
2017-11-29,34.1399
2017-11-30,34.092
2017-12-01,34.1878
2017-12-04,33.4217
2017-12-05,33.5174
2017-12-06,33.5174
2017-12-07,33.5653
2017-12-08,33.4217
2017-12-11,33.4696
2017-12-12,33.4217
2017-12-13,33.5174
2017-12-14,33.3259
2017-12-15,33.3259
2017-12-18,33.8526
2017-12-19,32.3683
2017-12-20,32.7035
2017-12-21,33.278
2017-12-22,33.4217
2017-12-26,34.0388
2017-12-27,33.2192
2017-12-28,33.0746
2017-12-29,32.9781
2018-01-02,32.9781
2018-01-03,32.8817
2018-01-04,32.5442
2018-01-05,33.7978
2018-01-08,33.9906
2018-01-09,33.2674
2018-01-10,32.5442
2018-01-11,32.8335
2018-01-12,34.0388
2018-01-16,33.4603
2018-01-17,33.2192
2018-01-18,32.8817
2018-01-19,33.9906
2018-01-22,34.1835
2018-01-23,34.2799
2018-01-24,33.7013
2018-01-25,33.4603
2018-01-26,33.6531
2018-01-29,34.0388
2018-01-30,34.0388
2018-01-31,33.6531
2018-02-01,33.7495
2018-02-02,33.5567
2018-02-05,33.2674
2018-02-06,32.9781
2018-02-07,32.7371
2018-02-08,32.3031
2018-02-09,32.2549
2018-02-12,32.8335
2018-02-13,32.8335
2018-02-14,32.4478
2018-02-15,32.6888
2018-02-16,32.5924
2018-02-20,32.2549
2018-02-21,32.2067
2018-02-22,32.3513
2018-02-23,32.4478
2018-02-26,32.2549
2018-02-27,32.7371
2018-02-28,33.3156
2018-03-01,33.3638
2018-03-02,34.6174
2018-03-05,33.7978
2018-03-06,33.412
2018-03-07,33.9906
2018-03-08,34.1835
2018-03-09,34.1835
2018-03-12,34.6174
2018-03-13,34.4727
2018-03-14,34.1353
2018-03-15,34.6174
2018-03-16,34.521
2018-03-19,34.2799
2018-03-20,33.7495
2018-03-21,34.4245
2018-03-22,31.9174
2018-03-23,32.2549
2018-03-26,31.8567
2018-03-27,30.6912
2018-03-28,30.0114
2018-03-29,30.2056
2018-04-02,30.0599
2018-04-03,31.4682
2018-04-04,31.0312
2018-04-05,31.1283
2018-04-06,31.1283
2018-04-09,30.9826
2018-04-10,31.0797
2018-04-11,31.3225
2018-04-12,31.1283
2018-04-13,31.4197
2018-04-16,31.4682
2018-04-17,31.711
2018-04-18,31.711
2018-04-19,31.4682
2018-04-20,31.1768
2018-04-23,30.7398
2018-04-24,30.7883
2018-04-25,30.5941
2018-04-26,30.5455
2018-04-27,30.5941
2018-04-30,30.4484
2018-05-01,30.5941
2018-05-02,30.3027
2018-05-03,30.2056
2018-05-04,30.2542
2018-05-07,30.3027
2018-05-08,30.2056
2018-05-09,30.3027
2018-05-10,30.3027
2018-05-11,30.2056
2018-05-14,30.3027
2018-05-15,30.3513
2018-05-16,30.4484
2018-05-17,30.3027
2018-05-18,30.3513
2018-05-21,30.3513
2018-05-22,30.3513
2018-05-23,30.7398
2018-05-24,30.7883
2018-05-25,31.4682
2018-05-29,31.3711
2018-05-30,31.6625
2018-05-31,32.051
2018-06-01,32.7308
2018-06-04,32.2452
2018-06-05,31.9538
2018-06-06,31.5653
2018-06-07,30.2542
2018-06-08,30.2542
2018-06-11,30.3999
2018-06-12,30.5941
2018-06-13,30.3027
2018-06-14,30.4484
2018-06-15,30.2056
2018-06-18,30.2056
2018-06-19,30.1085
2018-06-20,30.3513
2018-06-21,30.157
2018-06-22,30.3513
2018-06-25,30.4883
2018-06-26,30.1457
2018-06-27,29.3138
2018-06-28,29.95
2018-06-29,29.7053
2018-07-02,30.0968
2018-07-03,29.7542
2018-07-05,30.2436
2018-07-06,29.9989
2018-07-09,30.0968
2018-07-10,29.7542
2018-07-11,29.8521
2018-07-12,29.7053
2018-07-13,29.7542
2018-07-16,28.8734
2018-07-17,28.9223
2018-07-18,29.167
2018-07-19,29.2159
2018-07-20,30.0479
2018-07-23,30.0968
2018-07-24,32.348
2018-07-25,33.914
2018-07-26,33.2778
2018-07-27,33.7672
2018-07-30,33.4735
2018-07-31,33.3267
2018-08-01,33.4246
2018-08-02,33.5714
2018-08-03,33.7672
2018-08-06,33.4735
2018-08-07,33.3757
2018-08-08,32.9352
2018-08-09,32.8863
2018-08-10,32.6905
2018-08-13,32.8863
2018-08-14,33.2288
2018-08-15,32.5926
2018-08-16,32.4948
2018-08-17,32.5926
2018-08-20,32.4458
2018-08-21,32.6905
2018-08-22,32.7395
2018-08-23,32.7884
2018-08-24,32.7884
2018-08-27,32.9352
2018-08-28,33.3267
2018-08-29,33.5714
2018-08-30,33.6693
2018-08-31,33.3757
2018-09-04,33.6693
2018-09-05,33.2778
2018-09-06,33.9629
2018-09-07,33.5714
2018-09-10,34.2076
2018-09-11,32.9352
2018-09-12,33.4246
2018-09-13,32.8373
2018-09-14,32.299
2018-09-17,32.2501
2018-09-18,32.5437
2018-09-19,32.348
2018-09-20,32.6905
2018-09-21,32.7395
2018-09-24,33.082
2018-09-25,33.7129
2018-09-26,33.7622
2018-09-27,34.0579
2018-09-28,33.9101
2018-10-01,33.9002
2018-10-02,34.3635
2018-10-03,34.0087
2018-10-04,33.5355
2018-10-05,33.4172
2018-10-08,33.1313
2018-10-09,33.013
2018-10-10,32.806
2018-10-11,32.1357
2018-10-12,32.3329
2018-10-15,32.5793
2018-10-16,33.3679
2018-10-17,33.9101
2018-10-18,33.6439
2018-10-19,33.8805
2018-10-22,33.4172
2018-10-23,33.0426
2018-10-24,32.9539
2018-10-25,33.1806
2018-10-26,33.3186
2018-10-29,33.0328
2018-10-30,33.0229
2018-10-31,33.6341
2018-11-01,34.541
2018-11-02,35.5169
2018-11-05,34.6593
2018-11-06,35.2803
2018-11-07,35.9309
2018-11-08,35.0437
2018-11-09,35.5859
2018-11-12,34.5902
2018-11-13,34.3537
2018-11-14,33.7819
2018-11-15,34.6987
2018-11-16,35.0043
2018-11-19,33.4665
2018-11-20,32.599
2018-11-21,32.116
2018-11-23,32.3329
2018-11-26,33.5158
2018-11-27,32.6976
2018-11-28,33.4763
2018-11-29,33.5158
2018-11-30,32.6384
2018-12-03,33.6143
2018-12-04,33.0229
2018-12-06,32.8455
2018-12-07,32.3723
2018-12-10,31.8104
2018-12-11,32.0371
2018-12-12,33.4172
2018-12-13,33.2496
2018-12-14,32.6877
2018-12-17,32.2047
2018-12-18,32.599
2018-12-19,31.9583
2018-12-20,31.1795
2018-12-21,30.6866
2018-12-24,30.7859
2018-12-26,31.9578
2018-12-27,31.4116
2018-12-28,32.0571
2018-12-31,31.8386
2019-01-02,32.6132
2019-01-03,33.656
2019-01-04,34.5696
2019-01-07,33.8844
2019-01-08,34.1724
2019-01-09,33.2985
2019-01-10,33.3779
2019-01-11,32.792
2019-01-14,32.0968
2019-01-15,31.5705
2019-01-16,31.5308
2019-01-17,30.7959
2019-01-18,30.9746
2019-01-22,32.2855
2019-01-23,32.1763
2019-01-24,32.1763
2019-01-25,32.5735
2019-01-28,31.928
2019-01-29,32.4543
2019-01-30,32.4345
2019-01-31,32.7225
2019-02-01,33.3581
2019-02-04,33.507
2019-02-05,33.219
2019-02-06,33.0999
2019-02-07,32.7821
2019-02-08,32.8615
2019-02-11,33.1992
2019-02-12,33.4574
2019-02-13,33.9539
2019-02-14,33.368
2019-02-15,34.1823
2019-02-19,33.795
2019-02-20,35.1655
2019-02-21,34.9768
2019-02-22,35.7911
2019-02-25,36.8041
2019-02-26,37.5986
2019-02-27,36.7346
2019-02-28,36.6452
2019-03-01,36.7544
2019-03-04,37.112
2019-03-05,36.9431
2019-03-06,36.6353
2019-03-07,36.3671
2019-03-08,36.3969
2019-03-11,35.3343
2019-03-12,34.7087
2019-03-13,33.6957
2019-03-14,33.9837
2019-03-15,33.8943
2019-03-18,34.2618
2019-03-19,34.4505
2019-03-20,33.805
2019-03-21,33.7255
2019-03-22,33.08
2019-03-25,33.79
2019-03-26,34.56
2019-03-27,34.56
2019-03-28,34.23
2019-03-29,34.15
2019-04-01,35.27
2019-04-02,34.72
2019-04-03,35.46
2019-04-04,35.37
2019-04-05,35.08
2019-04-08,35.96
2019-04-09,36.23
2019-04-10,36.46
2019-04-11,36.69
2019-04-12,36.5
2019-04-15,36.2
2019-04-16,36.77
2019-04-17,36.93
2019-04-18,36.94
2019-04-22,36.8
2019-04-23,36.83
2019-04-24,36.81
2019-04-25,36.4
2019-04-26,36.51
2019-04-29,36.92
2019-04-30,36.77
2019-05-01,36.2
2019-05-02,35.21
2019-05-03,35.05
2019-05-06,34.72
2019-05-07,33.88
2019-05-08,33.36
2019-05-09,32.42
2019-05-10,32.47
2019-05-13,32.38
2019-05-14,32.9
2019-05-15,32.68
2019-05-16,33.75
2019-05-17,33.82
2019-05-20,33.87
2019-05-21,33.86
2019-05-22,33.72
2019-05-23,32.95
2019-05-24,32.98
2019-05-28,32.5
2019-05-29,32.47
2019-05-30,31.88
2019-05-31,31.11
2019-06-03,31.52
2019-06-04,31.35
2019-06-05,32.01
2019-06-06,32.03
2019-06-07,31.75
2019-06-10,31.77
2019-06-11,31.74
2019-06-12,31
2019-06-13,31.48
2019-06-14,31.59
2019-06-17,31.5
2019-06-18,32.85
2019-06-19,32.025
2019-06-20,31.665
2019-06-21,31.565
2019-06-24,31.51
2019-06-25,30.585
2019-06-26,30.245
2019-06-27,30.225
2019-06-28,30.18
2019-07-01,30.31
2019-07-02,30.205
2019-07-03,30.015
2019-07-04,30.015
2019-07-05,30.3
2019-07-08,30.7
2019-07-09,30.57
2019-07-10,30.81
2019-07-11,30.39
2019-07-12,30.54
2019-07-15,30.18
2019-07-16,30.77
2019-07-17,30.315
2019-07-18,30.18
2019-07-19,29.88
2019-07-22,29.985
2019-07-23,29.93
2019-07-24,29.855
2019-07-25,29.65
2019-07-26,29.575
2019-07-29,29.975
2019-07-30,28.97
2019-07-31,29.42
2019-08-01,29.455
2019-08-02,29.195
2019-08-05,28.715
2019-08-06,28.24
2019-08-07,28.245
2019-08-08,28.76
2019-08-09,28.45
2019-08-12,28.32
2019-08-13,28.78
2019-08-14,28.42
2019-08-15,28.29
2019-08-16,28.47
2019-08-19,28.02
2019-08-20,27.645
2019-08-21,27.395
2019-08-22,27.29
2019-08-23,26.84
2019-08-26,26.865
2019-08-27,25.975
2019-08-28,26.2
2019-08-29,26.005
2019-08-30,25.905
2019-09-02,25.75
2019-09-03,26.51
2019-09-04,26.87
2019-09-05,27.55
2019-09-06,27.37
2019-09-09,27.72
2019-09-10,28.485
2019-09-11,27.6
2019-09-12,28.15
2019-09-13,28.49
2019-09-16,28.47
2019-09-17,28.05
2019-09-18,27.33
2019-09-19,27.04
2019-09-20,27.07
2019-09-23,26.97
2019-09-24,26.665
2019-09-25,26.18
2019-09-26,25.515
2019-09-27,25
2019-09-30,24.74
2019-10-01,24.32
2019-10-02,24.685
2019-10-03,24.86
2019-10-04,24.91
2019-10-07,24.8
2019-10-08,24.8
2019-10-09,24.345
2019-10-10,24.04
2019-10-11,24.315
2019-10-14,24.21
2019-10-15,24.29
2019-10-16,24.61
2019-10-17,24.94
2019-10-18,25
2019-10-21,25.14
2019-10-22,25.82
2019-10-23,26.21
2019-10-24,26.075
2019-10-25,24.865
2019-10-28,24.82
2019-10-29,24.84
2019-10-30,24.77
2019-10-31,24.28
2019-11-01,25.37
2019-11-04,24.98
2019-11-05,24.79
2019-11-06,24.65
2019-11-07,24.32
2019-11-08,24.37
2019-11-11,24.35
2019-11-12,24.5
2019-11-13,25.025
2019-11-14,24.89
2019-11-15,24.69
2019-11-18,24.555
2019-11-19,24.74
2019-11-20,24.37
2019-11-21,23.79
2019-11-22,23.49
2019-11-25,24
