date,close
2014-06-13,101.2861
2014-06-16,100.7105
2014-06-17,100.4707
2014-06-18,101.7178
2014-06-19,101.3341
2014-06-20,101.2861
2014-06-23,100.6626
2014-06-24,99.9239
2014-06-25,101.2986
2014-06-26,101.0583
2014-06-27,100.318
2014-06-30,99.847
2014-07-01,100.8372
2014-07-02,100.8083
2014-07-03,101.0679
2014-07-07,100.443
2014-07-08,99.3663
2014-07-09,99.7797
2014-07-10,99.6643
2014-07-11,99.7797
2014-07-14,99.2702
2014-07-15,98.7702
2014-07-16,98.8183
2014-07-17,96.8187
2014-07-18,98.4818
2014-07-21,97.5012
2014-07-22,98.2223
2014-07-23,99.174
2014-07-24,95.9631
2014-07-25,96.9148
2014-07-28,96.6841
2014-07-29,97.0302
2014-07-30,98.2703
2014-07-31,96.2034
2014-08-01,96.2707
2014-08-04,96.2707
2014-08-05,94.5595
2014-08-06,92.6271
2014-08-07,91.6273
2014-08-08,92.3676
2014-08-11,92.5983
2014-08-12,92.9732
2014-08-13,93.9058
2014-08-14,94.05
2014-08-15,93.7135
2014-08-18,95.4728
2014-08-19,96.0784
2014-08-20,95.9535
2014-08-21,96.7322
2014-08-22,95.6458
2014-08-25,96.5783
2014-08-26,96.8668
2014-08-27,95.9246
2014-08-28,95.6074
2014-08-29,95.4728
2014-09-02,95.4536
2014-09-03,96.4438
2014-09-04,96.761
2014-09-05,97.1648
2014-09-08,97.0206
2014-09-09,98.4818
2014-09-10,100.7026
2014-09-11,101.164
2014-09-12,100.8852
2014-09-15,100.4526
2014-09-16,100.8852
2014-09-17,99.9527
2014-09-18,100.2219
2014-09-19,99.9719
2014-09-22,99.6932
2014-09-23,98.4626
2014-09-24,99.8403
2014-09-25,97.5474
2014-09-26,97.9424
2014-09-29,97.7497
2014-09-30,96.873
2014-10-01,97.0753
2014-10-02,98.4626
2014-10-03,98.8383
2014-10-06,99.2237
2014-10-07,97.6919
2014-10-08,99.7536
2014-10-09,98.0098
2014-10-10,97.3836
2014-10-13,95.1195
2014-10-14,93.973
2014-10-15,94.1464
2014-10-16,92.4412
2014-10-17,93.9538
2014-10-20,95.5627
2014-10-21,97.6148
2014-10-22,96.5357
2014-10-23,100.7459
2014-10-24,101.4396
2014-10-27,101.1409
2014-10-28,104.1469
2014-10-29,104.195
2014-10-30,105.2837
2014-10-31,107.172
2014-11-03,106.3724
2014-11-04,105.2163
2014-11-05,106.9312
2014-11-06,106.1604
2014-11-07,104.2336
2014-11-10,106.382
2014-11-11,107.0082
2014-11-12,106.8156
2014-11-13,106.5651
2014-11-14,106.093
2014-11-17,106.6325
2014-11-18,107.4225
2014-11-19,106.5073
2014-11-20,106.093
2014-11-21,106.4398
2014-11-24,106.0544
2014-11-25,107.0179
2014-11-26,107.5478
2014-11-28,108.1836
2014-12-01,107.3936
2014-12-02,110.2454
2014-12-03,109.4939
2014-12-04,109.7926
2014-12-05,110.756
2014-12-08,110.65
2014-12-09,109.571
2014-12-10,107.4321
2014-12-11,109.0989
2014-12-12,107.2684
2014-12-15,106.2279
2014-12-16,104.8116
2014-12-17,107.8272
2014-12-18,110.7367
2014-12-19,110.7078
2014-12-22,110.8427
2014-12-23,109.3205
2014-12-24,110.1506
2014-12-26,110.2086
2014-12-29,109.5618
2014-12-30,110.5947
2014-12-31,109.4846
2015-01-02,108.6834
2015-01-05,112.7377
2015-01-06,111.782
2015-01-07,114.5621
2015-01-08,115.7784
2015-01-09,114.1084
2015-01-12,114.3787
2015-01-13,114.6297
2015-01-14,113.1141
2015-01-15,110.9905
2015-01-16,112.9404
2015-01-20,111.8689
2015-01-21,111.8592
2015-01-22,114.2435
2015-01-23,112.9211
2015-01-26,113.0079
2015-01-27,112.1971
2015-01-28,110.5271
2015-01-29,108.6158
2015-01-30,108.2104
2015-02-02,110.0252
2015-02-03,112.6122
2015-02-04,111.5117
2015-02-05,113.0369
2015-02-06,112.1199
2015-02-09,110.7877
2015-02-10,113.0079
2015-02-11,112.8438
2015-02-12,114.0505
2015-02-13,115.1895
2015-02-17,116.2127
2015-02-18,116.1259
2015-02-19,116.0293
2015-02-20,117.3711
2015-02-23,117.1008
2015-02-24,117.5352
2015-02-25,116.3382
2015-02-26,117.1201
2015-02-27,116.2127
2015-03-02,117.1781
2015-03-03,115.1316
2015-03-04,114.8512
2015-03-05,115.2574
2015-03-06,112.5205
2015-03-09,113.1008
2015-03-10,111.7082
2015-03-11,112.4045
2015-03-12,113.3426
2015-03-13,112.4238
2015-03-16,114.1356
2015-03-17,111.4857
2015-03-18,115.2864
2015-03-19,114.6578
2015-03-20,114.8512
2015-03-23,114.5708
2015-03-24,113.4489
2015-03-25,111.5148
2015-03-26,111.8436
2015-03-27,113.6327
2015-03-30,114.6675
2015-03-31,113.652
2015-04-01,112.3658
2015-04-02,113.0718
2015-04-06,113.4973
2015-04-07,112.1917
2015-04-08,112.2981
2015-04-09,113.3426
2015-04-10,113.5843
2015-04-13,112.3851
2015-04-14,112.1434
2015-04-15,111.8146
2015-04-16,111.5631
2015-04-17,110.8378
2015-04-20,112.1047
2015-04-21,113.507
2015-04-22,113.623
2015-04-23,114.6675
2015-04-24,114.8512
2015-04-27,112.772
2015-04-28,112.888
2015-04-29,111.5438
2015-04-30,106.2248
2015-05-01,106.7954
2015-05-04,107.0371
2015-05-05,106.8727
2015-05-06,106.4762
2015-05-07,107.3853
2015-05-08,109.2324
2015-05-11,109.4549
2015-05-12,108.5458
2015-05-13,108.3714
2015-05-14,110.0477
2015-05-15,109.6698
2015-05-18,110.7357
2015-05-19,110.7938
2015-05-20,110.7938
2015-05-21,110.9101
2015-05-22,110.2415
2015-05-26,109.5826
2015-05-27,110.726
2015-05-28,109.8733
2015-05-29,110.5516
2015-06-01,111.2105
2015-06-02,110.6194
2015-06-03,110.3675
2015-06-04,109.5632
2015-06-05,109.7376
2015-06-08,109.6311
2015-06-09,109.1466
2015-06-10,110.1349
2015-06-11,110.571
2015-06-12,108.7202
2015-06-15,108.2066
2015-06-16,109.0594
2015-06-17,109.0109
2015-06-18,109.7861
2015-06-19,109.1659
2015-06-22,109.883
2015-06-23,109.1853
2015-06-24,109.9993
2015-06-25,109.757
2015-06-26,110.038
2015-06-29,105.9005
2015-06-30,105.8423
2015-07-01,105.8229
2015-07-02,104.8346
2015-07-06,105.416
2015-07-07,106.3656
2015-07-08,104.5923
2015-07-09,103.5264
2015-07-10,103.4974
2015-07-13,104.2919
2015-07-14,104.0691
2015-07-15,103.8075
2015-07-16,104.4276
2015-07-17,104.166
2015-07-20,104.6795
2015-07-21,104.9024
2015-07-22,105.1737
2015-07-23,104.5051
2015-07-24,103.352
2015-07-27,102.4993
2015-07-28,103.197
2015-07-29,103.6815
2015-07-30,101.5982
2015-07-31,100.8424
2015-08-03,101.0943
2015-08-04,99.9315
2015-08-05,100.6582
2015-08-06,98.5362
2015-08-07,98.5749
2015-08-10,100.2222
2015-08-11,100.9393
2015-08-12,100.4645
2015-08-13,101.1234
2015-08-14,102.2571
2015-08-17,103.0904
2015-08-18,102.6834
2015-08-19,102.8482
2015-08-20,101.6272
2015-08-21,101.1234
2015-08-24,96.4819
2015-08-25,94.9897
2015-08-26,97.8869
2015-08-27,100.2028
2015-08-28,101.1331
2015-08-31,100.3482
2015-09-01,97.5284
2015-09-02,98.478
2015-09-03,98.9238
2015-09-04,97.3443
2015-09-08,99.5052
2015-09-09,98.0904
2015-09-10,96.9955
2015-09-11,97.0924
2015-09-14,95.9684
2015-09-15,96.8695
2015-09-16,97.6156
2015-09-17,97.761
2015-09-18,96.1234
2015-09-21,95.1447
2015-09-22,94.5536
2015-09-23,94.3308
2015-09-24,92.6544
2015-09-25,91.511
2015-09-28,89.7531
2015-09-29,91.0934
2015-09-30,91.2294
2015-10-01,91.2585
2015-10-02,92.5309
2015-10-05,92.7543
2015-10-06,91.2877
2015-10-07,92.1618
2015-10-08,92.696
2015-10-09,93.677
2015-10-12,93.7352
2015-10-13,93.3273
2015-10-14,92.4532
2015-10-15,95.1047
2015-10-16,95.7069
2015-10-19,95.3669
2015-10-20,94.9007
2015-10-21,94.114
2015-10-22,91.6762
2015-10-23,91.8413
2015-10-26,91.9481
2015-10-27,92.4532
2015-10-28,95.0561
2015-10-29,101.8549
2015-10-30,101.5635
2015-11-02,103.8751
2015-11-03,103.3409
2015-11-04,104.6909
2015-11-05,104.7492
2015-11-06,104.1956
2015-11-09,103.8459
2015-11-10,104.1762
2015-11-11,103.5643
2015-11-12,101.6412
2015-11-13,101.2915
2015-11-16,102.5542
2015-11-17,101.7383
2015-11-18,101.952
2015-11-19,101.0779
2015-11-20,100.7574
2015-11-23,99.8929
2015-11-24,98.9897
2015-11-25,98.3778
2015-11-27,98.0961
2015-11-30,98.1058
2015-12-01,99.7667
2015-12-02,99.3199
2015-12-03,96.5033
2015-12-04,97.6591
2015-12-07,97.5231
2015-12-08,96.9112
2015-12-09,97.1249
2015-12-10,97.0957
2015-12-11,96.1148
2015-12-14,96.6295
2015-12-15,98.1544
2015-12-16,98.9994
2015-12-17,97.8145
2015-12-18,96.1148
2015-12-21,97.3483
2015-12-22,98.8051
2015-12-23,99.8152
2015-12-24,99.9512
2015-12-28,99.3102
2015-12-29,100.0305
2015-12-30,99.7385
2015-12-31,99.8553
2016-01-04,99.0961
2016-01-05,101.1596
2016-01-06,101.5976
2016-01-07,99.2616
2016-01-08,98.843
2016-01-11,97.1397
2016-01-12,100.1278
2016-01-13,98.5024
2016-01-14,99.9624
2016-01-15,98.3856
2016-01-19,96.5946
2016-01-20,95.6602
2016-01-21,95.5629
2016-01-22,96.507
2016-01-25,96.4194
2016-01-26,99.028
2016-01-27,98.9306
2016-01-28,94.9497
2016-01-29,96.6141
2016-02-01,96.3902
2016-02-02,95.4266
2016-02-03,94.6674
2016-02-04,94.9497
2016-02-05,92.4774
2016-02-08,89.5768
2016-02-09,89.4503
2016-02-10,90.4333
2016-02-11,89.2361
2016-02-12,89.3335
2016-02-16,91.1244
2016-02-17,92.8278
2016-02-18,92.5552
2016-02-19,92.2632
2016-02-22,92.6039
2016-02-23,91.066
2016-02-24,91.835
2016-02-25,94.3072
2016-02-26,94.9302
2016-02-29,94.2294
2016-03-01,94.7939
2016-03-02,94.8426
2016-03-03,96.2539
2016-03-04,96.6433
2016-03-07,97.9962
2016-03-08,97.8697
2016-03-09,97.7042
2016-03-10,98.1714
2016-03-11,101.8117
2016-03-14,102.2497
2016-03-15,101.5295
2016-03-16,101.4808
2016-03-17,100.8287
2016-03-18,101.7241
2016-03-21,101.5976
2016-03-22,101.6268
2016-03-23,101.6463
2016-03-24,100.9747
2016-03-28,101.5591
2016-03-29,103.2567
2016-03-30,104.0957
2016-03-31,104.0274
2016-04-01,104.7493
2016-04-04,104.2518
2016-04-05,103.3933
2016-04-06,105.4518
2016-04-07,105.5103
2016-04-08,106.3005
2016-04-11,106.6322
2016-04-12,108.8468
2016-04-13,111.6565
2016-04-14,112.6126
2016-04-15,111.2468
2016-04-18,110.837
2016-04-19,111.0614
2016-04-20,112.037
2016-04-21,111.6077
2016-04-22,111.959
2016-04-25,111.8614
2016-04-26,112.398
2016-04-27,113.0614
2016-04-28,112.1931
2016-04-29,112.9443
2016-05-02,113.1004
2016-05-03,112.0955
2016-05-04,111.8907
2016-05-05,113.1102
2016-05-06,112.5833
2016-05-09,113.5882
2016-05-10,114.515
2016-05-11,114.076
2016-05-12,114.5736
2016-05-13,114.5736
2016-05-16,116.6808
2016-05-17,115.6077
2016-05-18,115.9199
2016-05-19,115.3052
2016-05-20,116.4174
2016-05-23,116.515
2016-05-24,117.8125
2016-05-25,118.954
2016-05-26,119.5003
2016-05-27,120.0661
2016-05-31,119.1296
2016-06-01,119.1686
2016-06-02,119.91
2016-06-03,118.8466
2016-06-06,118.5735
2016-06-07,116.515
2016-06-08,116.8369
2016-06-09,116.4857
2016-06-10,116.3199
2016-06-13,115.354
2016-06-14,113.9687
2016-06-15,113.5784
2016-06-16,113.8614
2016-06-17,113.637
2016-06-20,114.7784
2016-06-21,115.6955
2016-06-22,115.9692
2016-06-23,118.2079
2016-06-24,114.0727
2016-06-27,112.753
2016-06-28,114.6886
2016-06-29,116.4776
2016-06-30,117.68
2016-07-01,117.9732
2016-07-05,117.2596
2016-07-06,119.0486
2016-07-07,119.2832
2016-07-08,122.0888
2016-07-11,122.2746
2016-07-12,122.646
2016-07-13,122.7536
2016-07-14,123.4574
2016-07-15,122.6069
2016-07-18,122.0204
2016-07-19,121.7271
2016-07-20,123.6529
2016-07-21,122.4798
2016-07-22,121.688
2016-07-25,120.5834
2016-07-26,120.8473
2016-07-27,119.9284
2016-07-28,124.611
2016-07-29,128.1986
2016-08-01,128.1204
2016-08-02,127.661
2016-08-03,127.5046
2016-08-04,127.9738
2016-08-05,128.4528
2016-08-08,128.707
2016-08-09,130.1049
2016-08-10,126.0284
2016-08-11,126.5954
2016-08-12,126.439
2016-08-15,126.9962
2016-08-16,125.4223
2016-08-17,124.914
2016-08-18,125.1486
2016-08-19,124.914
2016-08-22,125.3832
2016-08-23,126.8594
2016-08-24,124.9336
2016-08-25,125.2855
2016-08-26,126.6052
2016-08-29,127.661
2016-08-30,126.9571
2016-08-31,126.703
2016-09-01,125.4712
2016-09-02,126.4977
2016-09-06,127.0256
2016-09-07,127.0549
2016-09-08,127.0842
2016-09-09,122.4798
2016-09-12,123.7116
2016-09-13,120.7495
2016-09-14,120.642
2016-09-15,122.0888
2016-09-16,121.5121
2016-09-19,122.167
2016-09-20,121.9911
2016-09-21,124.5768
2016-09-22,126.2223
2016-09-23,125.6934
2016-09-26,124.2732
2016-09-27,125.3799
2016-09-28,125.9676
2016-09-29,125.2134
2016-09-30,127.3486
2016-10-03,127.2115
2016-10-04,126.5749
2016-10-05,127.8678
2016-10-06,128.1028
2016-10-07,128.3085
2016-10-10,130.0128
2016-10-11,124.0185
2016-10-12,124.4299
2016-10-13,124.3025
2016-10-14,124.5376
2016-10-17,124.0185
2016-10-18,126.4476
2016-10-19,125.4485
2016-10-20,125.5758
2016-10-21,124.9
2016-10-24,125.3604
2016-10-25,123.0097
2016-10-26,118.5923
2016-10-27,118.5042
2016-10-28,120.0321
2016-10-31,103.2345
2016-11-01,101.6282
2016-11-02,99.9239
2016-11-03,100.4332
2016-11-04,100.8936
2016-11-07,102.304
2016-11-08,99.7378
2016-11-09,99.5321
2016-11-10,98.6115
2016-11-11,96.0159
2016-11-14,95.9767
2016-11-15,99.3656
2016-11-16,98.8073
2016-11-17,98.729
2016-11-18,98.5723
2016-11-21,99.9925
2016-11-22,98.7388
2016-11-23,98.9249
2016-11-25,100.2569
2016-11-28,99.8847
2016-11-29,101.2756
2016-11-30,99.7672
2016-12-01,97.7397
2016-12-02,98.1413
2016-12-05,99.3461
2016-12-06,102.4607
2016-12-07,102.2746
2016-12-08,102.304
2016-12-09,103.0582
2016-12-12,103.6361
2016-12-13,104.5372
2016-12-14,102.7154
2016-12-15,100.541
2016-12-16,101.3735
2016-12-19,100.7467
2016-12-20,99.7574
2016-12-21,99.5713
2016-12-22,99.4832
2016-12-23,100.2178
2016-12-27,101.0209
2016-12-28,101.178
2016-12-29,101.61
2016-12-30,101.3154
2017-01-03,101.4431
2017-01-04,102.3757
2017-01-05,103.0335
2017-01-06,103.0433
2017-01-09,105.0461
2017-01-10,111.5943
2017-01-11,112.6545
2017-01-12,112.3404
2017-01-13,113.0963
2017-01-17,113.3417
2017-01-18,113.3614
2017-01-19,112.4876
2017-01-20,111.5746
2017-01-23,112.0753
2017-01-24,112.468
2017-01-25,113.8228
2017-01-26,113.2436
2017-01-27,114.8242
2017-01-30,113.2828
2017-01-31,116.1692
2017-02-01,116.3459
2017-02-02,115.4721
2017-02-03,115.9826
2017-02-06,115.0991
2017-02-07,115.9532
2017-02-08,115.0107
2017-02-09,115.4525
2017-02-10,115.1874
2017-02-13,115.5997
2017-02-14,115.0402
2017-02-15,115.1678
2017-02-16,114.1959
2017-02-17,114.7358
2017-02-21,115.0303
2017-02-22,114.7653
2017-02-23,114.2548
2017-02-24,114.7849
2017-02-27,114.8242
2017-02-28,114.942
2017-03-01,116.7189
2017-03-02,115.8648
2017-03-03,116.1201
2017-03-06,115.0794
2017-03-07,114.9322
2017-03-08,115.4525
2017-03-09,117.0036
2017-03-10,117.8872
2017-03-13,117.6025
2017-03-14,116.5128
2017-03-15,117.4651
2017-03-16,117.2294
2017-03-17,119.4482
2017-03-20,119.4285
2017-03-21,118.7708
2017-03-22,119.1635
2017-03-23,118.2014
2017-03-24,118.4566
2017-03-27,118.0934
2017-03-28,118.9769
2017-03-29,119.39
2017-03-30,119.3802
2017-03-31,120.118
2017-04-03,119.3704
2017-04-04,118.7998
2017-04-05,118.2194
2017-04-06,118.2391
2017-04-07,117.9243
2017-04-10,118.0719
2017-04-11,117.6292
2017-04-12,117.2259
2017-04-13,117.58
2017-04-17,119.1835
2017-04-18,117.6194
2017-04-19,118.2981
2017-04-20,119.8622
2017-04-21,119.213
2017-04-24,121.259
2017-04-25,122.4591
2017-04-26,123.2756
2017-04-27,116.1734
2017-04-28,117.6981
2017-05-01,118.849
2017-05-02,118.6621
2017-05-03,117.4817
2017-05-04,114.9438
2017-05-05,114.6388
2017-05-08,115.0028
2017-05-09,116.7242
2017-05-10,117.5407
2017-05-11,119.0457
2017-05-12,119.2818
2017-05-15,120.3344
2017-05-16,117.826
2017-05-17,115.7996
2017-05-18,115.3471
2017-05-19,115.7504
2017-05-22,115.8684
2017-05-23,115.8881
2017-05-24,117.1571
2017-05-25,117.3538
2017-05-26,117.2849
2017-05-30,116.498
2017-05-31,117.2653
2017-06-01,120.6688
2017-06-02,121.9181
2017-06-05,121.9083
2017-06-06,122.1444
2017-06-07,122.3214
2017-06-08,123.128
2017-06-09,122.9707
2017-06-12,122.9608
2017-06-13,123.4231
2017-06-14,123.551
2017-06-15,123.7871
2017-06-16,123.8658
2017-06-19,125.0167
2017-06-20,125.1446
2017-06-21,126.6623
2017-06-22,127.5197
2017-06-23,127.224
2017-06-26,127.1945
2017-06-27,126.3962
2017-06-28,126.6524
2017-06-29,126.0414
2017-06-30,126.544
2017-07-03,126.5243
2017-07-05,125.9231
2017-07-06,123.8141
2017-07-07,125.2727
2017-07-10,125.5585
2017-07-11,124.6616
2017-07-12,124.5335
2017-07-13,127.1156
2017-07-14,130.5749
2017-07-17,130.6932
2017-07-18,129.2838
2017-07-19,129.1754
2017-07-20,127.5985
2017-07-21,127.7365
2017-07-24,126.9284
2017-07-25,126.9087
2017-07-26,126.8397
2017-07-27,123.6268
2017-07-28,121.9908
2017-07-31,119.5663
2017-08-01,116.2254
2017-08-02,115.9888
2017-08-03,115.4665
2017-08-04,116.2254
2017-08-07,115.496
2017-08-08,113.3771
2017-08-09,111.2286
2017-08-10,108.5381
2017-08-11,110.0854
2017-08-14,110.8837
2017-08-15,111.337
2017-08-16,111.4455
2017-08-17,110.795
2017-08-18,109.77
2017-08-21,111.1399
2017-08-22,112.3127
2017-08-23,110.657
2017-08-24,111.2188
2017-08-25,111.5539
2017-08-28,111.2582
2017-08-29,111.1892
2017-08-30,111.3765
2017-08-31,112.6183
2017-09-01,112.6774
2017-09-05,112.5887
2017-09-06,113.9586
2017-09-07,113.998
2017-09-08,114.0276
2017-09-11,114.1261
2017-09-12,114.747
2017-09-13,114.2148
2017-09-14,114.3134
2017-09-15,113.8009
2017-09-18,114.6189
2017-09-19,113.8108
2017-09-20,114.5401
2017-09-21,111.6563
2017-09-22,112.9797
2017-09-25,112.9501
2017-09-26,113.3253
2017-09-27,114.8067
2017-09-28,114.224
2017-09-29,115.6363
2017-10-02,116.2387
2017-10-03,114.708
2017-10-04,116.0708
2017-10-05,117.6806
2017-10-06,117.7892
2017-10-09,116.0609
2017-10-10,116.9399
2017-10-11,117.167
2017-10-12,119.1323
2017-10-13,118.2139
2017-10-16,118.0262
2017-10-17,118.441
2017-10-18,119.1916
2017-10-19,120.3668
2017-10-20,120.831
2017-10-23,120.189
2017-10-24,119.7051
2017-10-25,119.9915
2017-10-26,119.4977
2017-10-27,122.9148
2017-10-30,119.8434
2017-10-31,120.11
2017-11-01,113.6611
2017-11-02,110.9255
2017-11-03,107.8936
2017-11-06,107.9825
2017-11-07,107.3702
2017-11-08,111.9822
2017-11-09,110.4515
2017-11-10,109.375
2017-11-13,109.6811
2017-11-14,110.8169
2017-11-15,109.7009
2017-11-16,110.8465
2017-11-17,110.2243
2017-11-20,110.7872
2017-11-21,112.1501
2017-11-22,111.6662
2017-11-24,111.6662
2017-11-27,111.9822
2017-11-28,113.7796
2017-11-29,115.0734
2017-11-30,115.6462
2017-12-01,113.1476
2017-12-04,113.3945
2017-12-05,114.0561
2017-12-06,114.3425
2017-12-07,113.355
2017-12-08,111.9723
2017-12-11,112.1007
2017-12-12,112.1304
2017-12-13,112.1106
2017-12-14,111.4193
2017-12-15,113.8093
2017-12-18,113.0093
2017-12-19,119.873
2017-12-20,119.6755
2017-12-21,118.4608
2017-12-22,118.6287
2017-12-26,118.4707
2017-12-27,118.6484
2017-12-28,120.4791
2017-12-29,119.4104
2018-01-02,122.765
2018-01-03,123.6161
2018-01-04,123.4379
2018-01-05,124.665
2018-01-08,124.9025
2018-01-09,122.8937
2018-01-10,121.251
2018-01-11,121.0135
2018-01-12,120.8255
2018-01-16,120.4099
2018-01-17,121.2114
2018-01-18,120.9146
2018-01-19,122.1911
2018-01-22,124.8827
2018-01-23,123.2103
2018-01-24,123.715
2018-01-25,123.4379
2018-01-26,124.9124
2018-01-29,126.0603
2018-01-30,124.6254
2018-01-31,125.7931
2018-02-01,126.8519
2018-02-02,124.477
2018-02-05,121.8942
2018-02-06,121.0234
2018-02-07,119.5193
2018-02-08,114.3241
2018-02-09,115.1751
2018-02-12,115.3037
2018-02-13,114.7199
2018-02-14,116.4714
2018-02-15,118.5396
2018-02-16,119.2224
2018-02-20,117.4808
2018-02-21,117.4412
2018-02-22,116.3527
2018-02-23,117.6094
2018-02-26,118.6287
2018-02-27,116.9068
2018-02-28,115.0366
2018-03-01,112.3647
2018-03-02,115.8282
2018-03-05,116.8969
2018-03-06,116.8573
2018-03-07,119.737
2018-03-08,118.9552
2018-03-09,119.5984
2018-03-12,117.0256
2018-03-13,116.6891
2018-03-14,115.0267
2018-03-15,114.71
2018-03-16,115.6105
2018-03-19,113.5522
2018-03-20,113.2059
2018-03-21,113.1861
2018-03-22,110.2174
2018-03-23,106.3185
2018-03-26,108.6143
2018-03-27,107.3477
2018-03-28,107.2683
2018-03-29,108.141
2018-04-02,105.5228
2018-04-03,106.2567
2018-04-04,106.4749
2018-04-05,107.4567
2018-04-06,104.3128
2018-04-09,105.3244
2018-04-10,106.4055
2018-04-11,105.1558
2018-04-12,105.5426
2018-04-13,104.6996
2018-04-16,106.3559
2018-04-17,107.9228
2018-04-18,109.1724
2018-04-19,109.827
2018-04-20,109.4105
2018-04-23,110.3229
2018-04-24,108.5377
2018-04-25,109.6782
2018-04-26,114.1511
2018-04-27,115.9561
2018-04-30,114.2205
2018-05-01,115.9858
2018-05-02,116.4916
2018-05-03,114.2304
2018-05-04,115.2618
2018-05-07,116.0255
2018-05-08,115.0337
2018-05-09,115.2519
2018-05-10,116.3329
2018-05-11,115.48
2018-05-14,114.2502
2018-05-15,112.2568
2018-05-16,113.5957
2018-05-17,114.1015
2018-05-18,113.556
2018-05-21,113.3676
2018-05-22,112.0188
2018-05-23,111.7808
2018-05-24,110.8188
2018-05-25,110.1642
2018-05-29,108.3691
2018-05-30,109.7377
2018-05-31,110.5907
2018-06-01,111.6816
2018-06-04,112.7229
2018-06-05,112.2072
2018-06-06,113.2386
2018-06-07,112.7329
2018-06-08,113.556
2018-06-11,113.2684
2018-06-12,113.2089
2018-06-13,113.0403
2018-06-14,113.9329
2018-06-15,112.4452
2018-06-18,110.9179
2018-06-19,110.8882
2018-06-20,111.1659
2018-06-21,110.5907
2018-06-22,110.8386
2018-06-25,109.8171
2018-06-26,111.632
2018-06-27,109.1526
2018-06-28,110.5938
2018-06-29,110.7628
2018-07-02,111.1405
2018-07-03,111.2498
2018-07-05,112.1742
2018-07-06,113.3073
2018-07-09,113.9632
2018-07-10,114.1024
2018-07-11,113.4663
2018-07-12,113.347
2018-07-13,114.1918
2018-07-16,111.9456
2018-07-17,113.0687
2018-07-18,111.6971
2018-07-19,111.5579
2018-07-20,110.9815
2018-07-23,112.2139
2018-07-24,113.9135
2018-07-25,116.4282
2018-07-26,116.3984
2018-07-27,125.4331
2018-07-30,125.7412
2018-07-31,124.7572
2018-08-01,124.6579
2018-08-02,123.6441
2018-08-03,125.1449
2018-08-06,125.2542
2018-08-07,124.6777
2018-08-08,123.2266
2018-08-09,122.9881
2018-08-10,121.8252
2018-08-13,121.7059
2018-08-14,121.6363
2018-08-15,121.9643
2018-08-16,122.014
2018-08-17,123.1073
2018-08-20,123.9124
2018-08-21,123.5148
2018-08-22,124.0814
2018-08-23,123.7236
2018-08-24,124.638
2018-08-27,124.5386
2018-08-28,125.2145
2018-08-29,125.7412
2018-08-30,123.0179
2018-08-31,122.8787
2018-09-04,121.2288
2018-09-05,121.7755
2018-09-06,122.8092
2018-09-07,123.0278
2018-09-10,122.4414
2018-09-11,122.5209
2018-09-12,125.4232
2018-09-13,128.8721
2018-09-14,129.2796
2018-09-17,128.7628
2018-09-18,129.6573
2018-09-19,129.051
2018-09-20,129.9256
2018-09-21,130.6313
2018-09-24,130.4425
2018-09-25,129.7169
2018-09-26,129.2398
2018-09-27,129.1602
2018-09-28,130.9128
2018-10-01,130.0066
2018-10-02,129.3793
2018-10-03,128.8714
2018-10-04,128.4234
2018-10-05,128.045
2018-10-08,126.8301
2018-10-09,126.3721
2018-10-10,123.0761
2018-10-11,120.6365
2018-10-12,122.7774
2018-10-15,122.9765
2018-10-16,127.1388
2018-10-17,127.7761
2018-10-18,125.7846
2018-10-19,123.8727
2018-10-22,123.5939
2018-10-23,123.5441
2018-10-24,120.5867
2018-10-25,121.6323
2018-10-26,114.642
2018-10-29,114.8013
2018-10-30,114.0943
2018-10-31,113.1085
2018-11-01,116.2253
2018-11-02,114.652
2018-11-05,114.5424
2018-11-06,114.5524
2018-11-07,117.6592
2018-11-08,118.7147
2018-11-09,117.1215
2018-11-12,113.9549
2018-11-13,112.4314
2018-11-14,111.8539
2018-11-15,114.1242
2018-11-16,116.5539
2018-11-19,113.0189
2018-11-20,111.9236
2018-11-21,112.2124
2018-11-23,112.2223
2018-11-26,112.77
2018-11-27,112.6405
2018-11-28,114.2138
2018-11-29,114.4727
2018-11-30,116.524
2018-12-03,115.9465
2018-12-04,111.5153
2018-12-06,112.4314
2018-12-07,109.4541
2018-12-10,110.6291
2018-12-11,111.5352
2018-12-12,112.4713
2018-12-13,111.8838
2018-12-14,108.528
2018-12-17,106.7954
2018-12-18,105.3316
2018-12-19,104.1168
2018-12-20,101.3386
2018-12-21,98.9588
2018-12-24,96.8179
2018-12-26,101.5876
2018-12-27,101.5177
2018-12-28,102.4559
2018-12-31,103.5239
2019-01-02,102.0866
2019-01-03,100.2401
2019-01-04,103.6636
2019-01-07,103.7035
2019-01-08,101.3779
2019-01-09,102.2064
2019-01-10,103.5239
2019-01-11,104.0828
2019-01-14,102.4958
2019-01-15,103.973
2019-01-16,104.8014
2019-01-17,106.0191
2019-01-18,105.1408
2019-01-22,103.7235
2019-01-23,104.5819
2019-01-24,105.041
2019-01-25,107.2069
2019-01-28,105.6399
2019-01-29,105.4602
2019-01-30,108.2549
2019-01-31,109.3528
2019-02-01,116.3795
2019-02-04,117.8567
2019-02-05,118.0963
2019-02-06,117.9565
2019-02-07,118.0663
2019-02-08,120.352
2019-02-11,121.9989
2019-02-12,123.7156
2019-02-13,123.3263
2019-02-14,122.2584
2019-02-15,123.4162
2019-02-19,123.3263
2019-02-20,123.7456
2019-02-21,123.2465
2019-02-22,124.2047
2019-02-25,123.6657
2019-02-26,123.1267
2019-02-27,124.2546
2019-02-28,123.8853
2019-03-01,125.1728
2019-03-04,124.1947
2019-03-05,123.8753
2019-03-06,123.007
2019-03-07,121.1605
2019-03-08,121.38
2019-03-11,121.1804
2019-03-12,122.448
2019-03-13,122.8972
2019-03-14,122.7075
2019-03-15,125.6819
2019-03-18,125.083
2019-03-19,125.4823
2019-03-20,127.189
2019-03-21,129.315
2019-03-22,126.4404
2019-03-25,126.3506
2019-03-26,126.68
2019-03-27,126.6501
2019-03-28,126.96
2019-03-29,127.7
2019-04-01,127.76
2019-04-02,127.5
2019-04-03,126.48
2019-04-04,126.56
2019-04-05,127.21
2019-04-08,128.76
2019-04-09,128.66
2019-04-10,128.84
2019-04-11,128.54
2019-04-12,127.92
2019-04-15,127.9
2019-04-16,125.52
2019-04-17,119.69
2019-04-18,120
2019-04-22,121.2
2019-04-23,122.76
2019-04-24,124.45
2019-04-25,124.72
2019-04-26,123.86
2019-04-29,120.83
2019-04-30,123.16
2019-05-01,121.22
2019-05-02,123.21
2019-05-03,124.31
2019-05-06,125.55
2019-05-07,123.39
2019-05-08,122.56
2019-05-09,121.91
2019-05-10,121.97
2019-05-13,118.66
2019-05-14,118.75
2019-05-15,118.55
2019-05-16,118.08
2019-05-17,116.42
2019-05-20,115.92
2019-05-21,116.11
2019-05-22,115.15
2019-05-23,113.96
2019-05-24,114.52
2019-05-28,112.14
2019-05-29,112.22
2019-05-30,112.89
2019-05-31,113.93
2019-06-03,114.3
2019-06-04,117.41
2019-06-05,118.54
2019-06-06,120.31
2019-06-07,120.73
2019-06-10,121.71
2019-06-11,120.48
2019-06-12,120.69
2019-06-13,119.69
2019-06-14,117.595
2019-06-17,117.82
2019-06-18,118.24
2019-06-19,119.5
2019-06-20,119.66
2019-06-21,119.26
2019-06-24,117.33
2019-06-25,116.76
2019-06-26,114.745
2019-06-27,115.41
2019-06-28,117.075
2019-07-01,117.2
2019-07-02,116.65
2019-07-03,117.68
2019-07-04,117.68
2019-07-05,117.52
2019-07-08,120.405
2019-07-09,120.7
2019-07-10,120.81
2019-07-11,120.65
2019-07-12,120.715
2019-07-15,122.08
2019-07-16,122.15
2019-07-17,123.015
2019-07-18,124.015
2019-07-19,123.67
2019-07-22,122.73
2019-07-23,124.63
2019-07-24,125.78
2019-07-25,123.785
2019-07-26,133.95
2019-07-29,134.525
2019-07-30,136.5
2019-07-31,135.26
2019-08-01,137.3
2019-08-02,137.95
2019-08-05,134.87
2019-08-06,135.09
2019-08-07,136.58
2019-08-08,138.8
2019-08-09,138.395
2019-08-12,138.375
2019-08-13,138.13
2019-08-14,134.11
2019-08-15,135.33
2019-08-16,137.045
2019-08-19,138.7
2019-08-20,138
2019-08-21,137.51
2019-08-22,137.3
2019-08-23,133.23
2019-08-26,134.545
2019-08-27,134.6
2019-08-28,137.23
2019-08-29,138.23
2019-08-30,139.44
2019-09-02,139.32
2019-09-03,139.42
2019-09-04,137.825
2019-09-05,139.52
2019-09-06,139.7
2019-09-09,137.035
2019-09-10,138.145
2019-09-11,140.14
2019-09-12,142.84
2019-09-13,138.7
2019-09-16,137.58
2019-09-17,138.845
2019-09-18,139.47
2019-09-19,139.72
2019-09-20,142.15
2019-09-23,141.61
2019-09-24,140.02
2019-09-25,137.41
2019-09-26,136.69
2019-09-27,133.98
2019-09-30,137.4
2019-10-01,133.57
2019-10-02,131.93
2019-10-03,132.705
2019-10-04,134.415
2019-10-07,134.795
2019-10-08,131.32
2019-10-09,133.5
2019-10-10,134.1
2019-10-11,136.795
2019-10-14,135.355
2019-10-15,138.06
2019-10-16,136.71
2019-10-17,138.755
2019-10-18,137.755
2019-10-21,137.56
2019-10-22,134.815
2019-10-23,135.13
2019-10-24,134.925
2019-10-25,134.05
2019-10-28,136.12
2019-10-29,138.27
2019-10-30,137.95
2019-10-31,137.95
2019-11-01,138.18
2019-11-04,136.56
2019-11-05,140.48
2019-11-06,143.26
2019-11-07,141.97
2019-11-08,143.95
2019-11-11,143.215
2019-11-12,144.51
2019-11-13,144.455
2019-11-14,144.955
2019-11-15,146.59
2019-11-18,144.65
2019-11-19,144.645
2019-11-20,142.51
2019-11-21,142.285
2019-11-22,143.695
2019-11-25,145.205
