date,close
2017-10-17,17.4019
2017-10-18,17.355
2017-10-19,17.355
2017-10-20,16.8859
2017-10-23,16.8859
2017-10-24,17.4957
2017-10-25,17.4957
2017-10-26,17.355
2017-10-27,17.3925
2017-10-31,17.355
2017-11-01,17.355
2017-11-02,17.355
2017-11-03,17.3925
2017-11-06,17.4019
2017-11-07,17.43
2017-11-08,17.4019
2017-11-09,17.4019
2017-11-10,17.355
2017-11-13,17.355
2017-11-14,17.2142
2017-11-15,17.355
2017-11-16,17.355
2017-11-17,17.4019
2017-11-20,17.4488
2017-11-21,17.5895
2017-11-22,17.5895
2017-11-27,17.6364
2017-11-28,17.824
2017-11-29,17.8709
2017-11-30,18.5276
2017-12-01,18.5557
2017-12-04,18.7621
2017-12-05,19.7002
2017-12-06,18.6214
2017-12-07,18.5745
2017-12-08,18.5745
2017-12-11,18.5839
2017-12-12,18.5839
2017-12-13,18.6214
2017-12-14,18.7621
2017-12-15,18.7621
2017-12-18,18.7621
2017-12-19,18.7387
2017-12-20,18.7621
2017-12-21,19.2312
2017-12-22,18.9497
2017-12-26,18.7621
2017-12-27,19.2312
2017-12-29,19.2312
2018-01-02,18.8559
2018-01-03,18.9122
2018-01-04,18.9497
2018-01-05,18.9497
2018-01-08,18.9497
2018-01-09,18.9591
2018-01-10,18.7621
2018-01-11,18.7621
2018-01-12,18.7527
2018-01-16,20.1693
2018-01-17,19.9629
2018-01-18,19.7002
2018-01-19,19.4657
2018-01-22,21.5671
2018-01-23,19.7002
2018-01-24,19.7002
2018-01-25,19.6346
2018-01-26,19.794
2018-01-29,19.794
2018-01-30,19.7471
2018-01-31,20.6383
2018-02-01,19.597
2018-02-02,19.7096
2018-02-05,19.3344
2018-02-06,19.2312
2018-02-07,19.4751
2018-02-08,18.7621
2018-02-09,18.6777
2018-02-12,18.3681
2018-02-13,18.4807
2018-02-14,18.4338
2018-02-15,18.6214
2018-02-16,18.7527
2018-02-20,18.7621
2018-02-21,18.4525
2018-02-22,18.612
2018-02-23,18.5933
2018-02-26,18.4807
2018-02-27,18.2555
2018-02-28,18.34
2018-03-01,18.2837
2018-03-02,18.1993
2018-03-05,18.2649
2018-03-06,18.3963
2018-03-07,18.3963
2018-03-08,18.0961
2018-03-09,18.3869
2018-03-12,18.1899
2018-03-13,18.3869
2018-03-14,18.415
2018-03-15,18.218
2018-03-16,18.218
2018-03-19,18.0398
2018-03-20,17.8522
2018-03-21,17.7959
2018-03-22,17.6364
2018-03-23,17.3268
2018-03-26,17.5051
2018-03-27,17.3362
2018-03-28,17.2889
2018-03-29,17.3362
2018-04-02,17.3078
2018-04-03,17.2889
2018-04-04,17.1564
2018-04-05,17.2037
2018-04-06,17.2983
2018-04-09,17.1659
2018-04-10,17.1848
2018-04-11,17.1943
2018-04-12,17.1943
2018-04-13,17.2226
2018-04-16,17.251
2018-04-17,17.2889
2018-04-18,17.393
2018-04-19,17.251
2018-04-20,17.2037
2018-04-23,17.1186
2018-04-24,17.0712
2018-04-25,17.0712
2018-04-26,17.0429
2018-04-27,17.0807
2018-04-30,17.2037
2018-05-01,17.2321
2018-05-02,16.9104
2018-05-03,16.8914
2018-05-04,17.0523
2018-05-07,17.1848
2018-05-08,17.4214
2018-05-09,17.8756
2018-05-10,18.0932
2018-05-11,17.9797
2018-05-14,18.2636
2018-05-15,18.3109
2018-05-16,18.5948
2018-05-17,18.6421
2018-05-18,18.5096
2018-05-21,18.6989
2018-05-22,18.6894
2018-05-23,18.8314
2018-05-24,18.784
2018-05-25,18.7935
2018-05-29,18.8692
2018-05-30,18.8787
2018-05-31,18.3298
2018-06-01,18.8124
2018-06-04,19.2761
2018-06-05,19.0301
2018-06-06,18.9071
2018-06-07,18.9354
2018-06-08,19.3424
2018-06-11,19.4275
2018-06-12,19.4938
2018-06-13,19.4938
2018-06-14,19.4275
2018-06-15,19.4181
2018-06-18,19.4938
2018-06-19,19.5411
2018-06-20,19.8155
2018-06-21,19.8439
2018-06-22,19.8534
2018-06-25,19.7209
2018-06-26,19.6736
2018-06-27,19.628
2018-06-28,19.6184
2018-06-29,19.7814
2018-07-02,19.8389
2018-07-03,19.9922
2018-07-05,20.1168
2018-07-06,20.2222
2018-07-09,20.2318
2018-07-10,20.2606
2018-07-11,20.0881
2018-07-12,20.0689
2018-07-13,20.2893
2018-07-16,20.2893
2018-07-17,20.0785
2018-07-18,19.8772
2018-07-19,19.906
2018-07-20,19.8676
2018-07-23,19.743
2018-07-24,19.628
2018-07-25,19.7047
2018-07-26,19.6472
2018-07-27,19.4747
2018-07-30,19.5609
2018-07-31,19.5034
2018-08-01,19.168
2018-08-02,18.8326
2018-08-03,18.7271
2018-08-06,18.9284
2018-08-07,19.0338
2018-08-08,19.4268
2018-08-09,19.283
2018-08-10,19.3118
2018-08-13,19.2447
2018-08-14,19.2638
2018-08-15,19.5609
2018-08-16,19.8101
2018-08-17,19.8101
2018-08-20,19.6089
2018-08-21,19.8101
2018-08-22,19.676
2018-08-23,19.8293
2018-08-24,19.8389
2018-08-27,19.9443
2018-08-28,20.0593
2018-08-29,20.0306
2018-08-30,19.7814
2018-08-31,20.0401
2018-09-04,20.0593
2018-09-05,20.0306
2018-09-06,19.9443
2018-09-07,19.9731
2018-09-10,20.136
2018-09-11,20.0976
2018-09-12,20.0976
2018-09-13,20.2318
2018-09-14,20.3852
2018-09-17,20.6248
2018-09-18,20.7014
2018-09-19,20.596
2018-09-20,20.5289
2018-09-21,20.5385
2018-09-24,20.3852
2018-09-25,20.4139
2018-09-26,20.2127
2018-09-27,20.5503
2018-09-28,21.007
2018-10-01,20.6377
2018-10-02,20.9098
2018-10-03,20.696
2018-10-04,20.5892
2018-10-05,20.3754
2018-10-08,20.7641
2018-10-09,20.8904
2018-10-10,20.6086
2018-10-11,20.045
2018-10-12,20.0548
2018-10-15,20.288
2018-10-16,20.492
2018-10-17,20.8418
2018-10-18,20.8904
2018-10-19,21.0264
2018-10-22,20.6572
2018-10-23,20.7446
2018-10-24,20.9098
2018-10-25,21.3568
2018-10-26,21.1819
2018-10-29,20.939
2018-10-30,20.9001
2018-10-31,20.9778
2018-11-01,21.2013
2018-11-02,20.8224
2018-11-05,20.9098
2018-11-06,21.1819
2018-11-07,21.5025
2018-11-08,21.1333
2018-11-09,21.0847
2018-11-12,20.9001
2018-11-13,20.8612
2018-11-14,20.8321
2018-11-15,20.5309
2018-11-16,20.696
2018-11-19,20.8126
2018-11-20,20.628
2018-11-21,20.8126
2018-11-23,21.0361
2018-11-26,21.2596
2018-11-27,21.4539
2018-11-28,21.4151
2018-11-29,21.4442
2018-11-30,21.1527
2018-12-03,21.143
2018-12-04,20.8029
2018-12-06,21.2693
2018-12-07,20.9195
2018-12-10,20.3268
2018-12-11,20.3463
2018-12-12,20.0645
2018-12-13,20.0742
2018-12-14,20.0548
2018-12-17,19.1803
2018-12-18,19.2386
2018-12-19,19.0443
2018-12-20,18.5584
2018-12-21,18.1212
2018-12-24,17.5091
2018-12-26,18.0629
2018-12-27,18.1098
2018-12-28,18.3269
2018-12-31,18.5341
2019-01-02,18.2381
2019-01-03,18.5243
2019-01-04,18.7315
2019-01-07,18.7809
2019-01-08,19.3533
2019-01-09,19.6099
2019-01-10,19.8072
2019-01-11,20.0342
2019-01-14,20.1823
2019-01-15,20.3106
2019-01-16,20.5968
2019-01-17,20.7152
2019-01-18,20.8336
2019-01-22,20.6856
2019-01-23,20.7448
2019-01-24,20.8534
2019-01-25,21.1692
2019-01-28,21.179
2019-01-29,21.2284
2019-01-30,21.11
2019-01-31,21.2481
2019-02-01,21.3567
2019-02-04,21.2383
2019-02-05,21.2383
2019-02-06,21.179
2019-02-07,21.179
2019-02-08,21.406
2019-02-11,21.4258
2019-02-12,21.2777
2019-02-13,21.2876
2019-02-14,21.3764
2019-02-15,21.1001
2019-02-19,21.0409
2019-02-20,21.2087
2019-02-21,21.3764
2019-02-22,21.1889
2019-02-25,21.0804
2019-02-26,20.9817
2019-02-27,20.9521
2019-02-28,21.031
2019-03-01,20.7843
2019-03-04,21.031
2019-03-05,20.8238
2019-03-06,20.7547
2019-03-07,20.6659
2019-03-08,20.883
2019-03-11,21.1889
2019-03-12,21.179
2019-03-13,21.1988
2019-03-14,21.1396
2019-03-15,21.258
2019-03-18,21.1988
2019-03-19,21.11
2019-03-20,21.1692
2019-03-21,21.4751
2019-03-22,21.6133
2019-03-25,21.6232
2019-03-26,21.8008
2019-03-27,21.6725
2019-03-28,21.8
2019-03-29,21.88
2019-04-01,21.79
2019-04-02,21.79
2019-04-03,21.92
2019-04-04,21.93
2019-04-05,22.12
2019-04-08,22.08
2019-04-09,22.03
2019-04-10,22.24
2019-04-11,22.18
2019-04-12,22.15
2019-04-15,22.25
2019-04-16,22
2019-04-17,21.86
2019-04-18,21.9
2019-04-22,21.75
2019-04-23,22.13
2019-04-24,22.48
2019-04-25,22.59
2019-04-26,22.75
2019-04-29,22.6
2019-04-30,22.8
2019-05-01,22.83
2019-05-02,22.83
2019-05-03,22.86
2019-05-06,22.75
2019-05-07,22.4
2019-05-08,22.22
2019-05-09,22.07
2019-05-10,22.42
2019-05-13,22.45
2019-05-14,22.26
2019-05-15,22.3
2019-05-16,22.64
2019-05-17,22.63
2019-05-20,22.3
2019-05-21,22.37
2019-05-22,22.48
2019-05-23,22.6
2019-05-24,22.77
2019-05-28,22.57
2019-05-29,22.38
2019-05-30,22.36
2019-05-31,22.18
2019-06-03,22.1
2019-06-04,21.85
2019-06-05,22.38
2019-06-06,22.5
2019-06-07,22.15
2019-06-10,22.29
2019-06-11,22.39
2019-06-12,22.43
2019-06-13,22.39
2019-06-14,22.685
2019-06-17,22.83
2019-06-18,22.755
2019-06-19,22.995
2019-06-20,23.15
2019-06-21,22.855
2019-06-24,22.34
2019-06-25,21.925
2019-06-26,21.735
2019-06-27,21.725
2019-06-28,21.985
2019-07-01,22.155
2019-07-02,22.445
2019-07-03,22.625
2019-07-04,22.625
2019-07-05,22.285
2019-07-08,22.035
2019-07-09,22.125
2019-07-10,22.255
2019-07-11,22.065
2019-07-12,22.2
2019-07-15,22.405
2019-07-16,22.25
2019-07-17,21.91
2019-07-18,21.935
2019-07-19,21.595
2019-07-22,21.575
2019-07-23,21.405
2019-07-24,21.4
2019-07-25,21.285
2019-07-26,21.31
2019-07-29,21.295
2019-07-30,21.56
2019-07-31,21.305
2019-08-01,20.995
2019-08-02,21.185
2019-08-05,20.885
2019-08-06,20.86
2019-08-07,20.955
2019-08-08,21.16
2019-08-09,21.155
2019-08-12,21.2
2019-08-13,21.255
2019-08-14,20.76
2019-08-15,20.555
2019-08-16,20.695
2019-08-19,21.115
2019-08-20,20.76
2019-08-21,20.965
2019-08-22,21.26
2019-08-23,20.95
2019-08-26,21.635
2019-08-27,21.835
2019-08-28,21.8
2019-08-29,22.085
2019-08-30,22.125
2019-09-02,22.16
2019-09-03,22.13
2019-09-04,22.145
2019-09-05,22.135
2019-09-06,22.295
2019-09-09,21.89
2019-09-10,21.815
2019-09-11,21.945
2019-09-12,21.99
2019-09-13,21.765
2019-09-16,22.095
2019-09-17,22.335
2019-09-18,22.505
2019-09-19,22.66
2019-09-20,22.9
2019-09-23,22.9
2019-09-24,22.995
2019-09-25,23
2019-09-26,22.5
2019-09-27,22.495
2019-09-30,22.665
2019-10-01,22.625
2019-10-02,22.57
2019-10-03,22.805
2019-10-04,22.895
2019-10-07,23.01
2019-10-08,22.925
2019-10-09,22.985
2019-10-10,23.025
2019-10-11,22.915
2019-10-14,22.975
2019-10-15,23.02
2019-10-16,23.075
2019-10-17,23.155
2019-10-18,23.14
2019-10-21,23.475
2019-10-22,23.575
2019-10-23,23.61
2019-10-24,23.7
2019-10-25,23.655
2019-10-28,23.73
2019-10-29,23.795
2019-10-30,23.975
2019-10-31,23.61
2019-11-01,24.47
2019-11-04,24.605
2019-11-05,24.05
2019-11-06,24.15
2019-11-07,23.995
2019-11-08,24.245
2019-11-11,24.615
2019-11-12,24.36
2019-11-13,24.335
2019-11-14,24.535
2019-11-15,24.585
2019-11-18,24.545
2019-11-19,24.435
2019-11-20,24.67
2019-11-21,24.38
2019-11-22,24.3
2019-11-25,24.5
