date,close
2014-06-13,40.8447
2014-06-16,40.5479
2014-06-17,40.7241
2014-06-18,40.585
2014-06-19,40.3902
2014-06-20,41.2342
2014-06-23,40.6685
2014-06-24,39.9729
2014-06-25,40.316
2014-06-26,40.1491
2014-06-27,40.7241
2014-06-30,40.9467
2014-07-01,42.1617
2014-07-02,41.7629
2014-07-03,42.0689
2014-07-07,41.2157
2014-07-08,40.2511
2014-07-09,40.3995
2014-07-10,41.0487
2014-07-11,40.6777
2014-07-14,40.2789
2014-07-15,39.8616
2014-07-16,39.4442
2014-07-17,38.9991
2014-07-18,40.8169
2014-07-21,39.6575
2014-07-22,39.6205
2014-07-23,35.9292
2014-07-24,35.8736
2014-07-25,36.4857
2014-07-28,36.9772
2014-07-29,36.4486
2014-07-30,36.5228
2014-07-31,36.1704
2014-08-01,35.6603
2014-08-04,35.6974
2014-08-05,35.0945
2014-08-06,34.8645
2014-08-07,34.501
2014-08-08,34.0465
2014-08-11,34.3155
2014-08-12,33.8796
2014-08-13,34.705
2014-08-14,34.6401
2014-08-15,34.7514
2014-08-18,34.7977
2014-08-19,34.8812
2014-08-20,34.6679
2014-08-21,34.8719
2014-08-22,34.8905
2014-08-25,35.1223
2014-08-26,36.1704
2014-08-27,36.3558
2014-08-28,36.3002
2014-08-29,36.6341
2014-09-02,36.9123
2014-09-03,36.9958
2014-09-04,37.4688
2014-09-05,37.5708
2014-09-08,37.6543
2014-09-09,36.801
2014-09-10,36.699
2014-09-11,36.9507
2014-09-12,37.0812
2014-09-15,36.6524
2014-09-16,36.7549
2014-09-17,35.7668
2014-09-18,35.8973
2014-09-19,35.0584
2014-09-22,35.2169
2014-09-23,34.8254
2014-09-24,34.8347
2014-09-25,34.1542
2014-09-26,34.8626
2014-09-29,35.2635
2014-09-30,34.3406
2014-10-01,34.7787
2014-10-02,35.1236
2014-10-03,35.1236
2014-10-06,35.4313
2014-10-07,35.6643
2014-10-08,36.9973
2014-10-09,36.4939
2014-10-10,36.671
2014-10-13,36.9041
2014-10-14,36.8481
2014-10-15,36.932
2014-10-16,36.7829
2014-10-17,36.6431
2014-10-20,36.7456
2014-10-21,37.249
2014-10-22,36.6431
2014-10-23,37.3049
2014-10-24,38.2464
2014-10-27,38.0506
2014-10-28,39.2251
2014-10-29,38.9828
2014-10-30,39.1878
2014-10-31,39.1412
2014-11-03,39.1506
2014-11-04,39.2158
2014-11-05,38.8429
2014-11-06,39.1506
2014-11-07,38.9362
2014-11-10,39.2345
2014-11-11,39.5327
2014-11-12,39.6166
2014-11-13,39.4488
2014-11-14,39.1133
2014-11-17,38.8896
2014-11-18,39.337
2014-11-19,38.8802
2014-11-20,38.8896
2014-11-21,39.0667
2014-11-24,39.4209
2014-11-25,39.3277
2014-11-26,39.8776
2014-11-28,39.5514
2014-12-01,39.598
2014-12-02,39.7565
2014-12-03,40.6234
2014-12-04,40.7352
2014-12-05,41.1174
2014-12-08,41.164
2014-12-09,41.7047
2014-12-10,41.1547
2014-12-11,41.2577
2014-12-12,40.7708
2014-12-15,39.8812
2014-12-16,39.5535
2014-12-17,40.5273
2014-12-18,41.2483
2014-12-19,42.0068
2014-12-22,42.063
2014-12-23,42.0536
2014-12-24,42.4469
2014-12-26,42.2877
2014-12-29,42.2222
2014-12-30,42.1098
2014-12-31,42.1005
2015-01-02,42.1379
2015-01-05,42.4376
2015-01-06,42.0443
2015-01-07,42.6623
2015-01-08,42.7185
2015-01-09,42.3439
2015-01-12,43.0369
2015-01-13,43.7953
2015-01-14,43.8141
2015-01-15,43.1305
2015-01-16,44.2448
2015-01-20,44.2074
2015-01-21,43.5425
2015-01-22,44.6568
2015-01-23,44.2635
2015-01-26,44.7598
2015-01-27,44.5913
2015-01-28,44.1418
2015-01-29,44.5819
2015-01-30,44.61
2015-02-02,44.8066
2015-02-03,45.2187
2015-02-04,44.9565
2015-02-05,45.6026
2015-02-06,45.1625
2015-02-09,43.9592
2015-02-10,44.1886
2015-02-11,44.0482
2015-02-12,44.1793
2015-02-13,45.8648
2015-02-17,46.2393
2015-02-18,47.1102
2015-02-19,47.4098
2015-02-20,47.8125
2015-02-23,48.4586
2015-02-24,48.0747
2015-02-25,48.2526
2015-02-26,47.9998
2015-02-27,48.0372
2015-03-02,48.0934
2015-03-03,47.8874
2015-03-04,47.7657
2015-03-05,48.1496
2015-03-06,47.2319
2015-03-09,47.3817
2015-03-10,47.0821
2015-03-11,47.2506
2015-03-12,48.0968
2015-03-13,48.3036
2015-03-16,48.4822
2015-03-17,48.2378
2015-03-18,48.36
2015-03-19,48.7455
2015-03-20,48.7737
2015-03-23,48.6703
2015-03-24,48.2942
2015-03-25,46.9122
2015-03-26,46.4422
2015-03-27,47.3447
2015-03-30,47.9182
2015-03-31,47.4669
2015-04-01,48.1156
2015-04-02,48.0592
2015-04-06,47.7113
2015-04-07,46.3011
2015-04-08,46.5738
2015-04-09,46.0285
2015-04-10,46.3293
2015-04-13,46.4892
2015-04-14,45.6807
2015-04-15,45.8875
2015-04-16,45.6525
2015-04-17,45.3986
2015-04-20,45.7841
2015-04-21,46.0567
2015-04-22,46.3952
2015-04-23,50.983
2015-04-24,50.2027
2015-04-27,48.7361
2015-04-28,48.7925
2015-04-29,47.7395
2015-04-30,47.2225
2015-05-01,47.1567
2015-05-04,48.1626
2015-05-05,47.8147
2015-05-06,49.8454
2015-05-07,50.3343
2015-05-08,51.8667
2015-05-11,52.1017
2015-05-12,50.4095
2015-05-13,50.2497
2015-05-14,52.0641
2015-05-15,51.5094
2015-05-18,52.4966
2015-05-19,52.7222
2015-05-20,52.7504
2015-05-21,52.3461
2015-05-22,51.9983
2015-05-26,51.6222
2015-05-27,52.3461
2015-05-28,52.4872
2015-05-29,52.2145
2015-06-01,52.3649
2015-06-02,52.7504
2015-06-03,53.5213
2015-06-04,52.9384
2015-06-05,52.7222
2015-06-08,52.4496
2015-06-09,52.1957
2015-06-10,52.647
2015-06-11,53.1942
2015-06-12,53.0432
2015-06-15,53.0715
2015-06-16,53.4867
2015-06-17,53.6848
2015-06-18,54.2603
2015-06-19,55.1283
2015-06-22,54.9774
2015-06-23,55.5246
2015-06-24,55.0434
2015-06-25,55.402
2015-06-26,55.7699
2015-06-29,54.5623
2015-06-30,54.9774
2015-07-01,55.4208
2015-07-02,55.251
2015-07-06,55.8643
2015-07-07,55.9492
2015-07-08,55.3925
2015-07-09,54.7981
2015-07-10,55.185
2015-07-13,56.0813
2015-07-14,56.4304
2015-07-15,56.0624
2015-07-16,56.5719
2015-07-17,56.6285
2015-07-20,56.7889
2015-07-21,56.3926
2015-07-22,54.3641
2015-07-23,54.4585
2015-07-24,54.4396
2015-07-27,54.0811
2015-07-28,54.4679
2015-07-29,53.8075
2015-07-30,53.6376
2015-07-31,53.515
2015-08-03,53.6376
2015-08-04,53.4206
2015-08-05,53.949
2015-08-06,52.9111
2015-08-07,53.0244
2015-08-10,52.9111
2015-08-11,52.8451
2015-08-12,52.4488
2015-08-13,52.4583
2015-08-14,52.9017
2015-08-17,53.6848
2015-08-18,53.6565
2015-08-19,53.5716
2015-08-20,52.5715
2015-08-21,51.7035
2015-08-24,48.9768
2015-08-25,49.3447
2015-08-26,50.109
2015-08-27,50.2222
2015-08-28,50.7317
2015-08-31,50.0618
2015-09-01,48.4767
2015-09-02,48.3352
2015-09-03,48.1182
2015-09-04,47.7691
2015-09-08,48.939
2015-09-09,48.1276
2015-09-10,48.2597
2015-09-11,48.7712
2015-09-14,48.5533
2015-09-15,48.7996
2015-09-16,48.7996
2015-09-17,49.1311
2015-09-18,48.9133
2015-09-21,49.2637
2015-09-22,48.9606
2015-09-23,48.5723
2015-09-24,47.9756
2015-09-25,46.2516
2015-09-28,45.0203
2015-09-29,44.6035
2015-09-30,45.2192
2015-10-01,44.7267
2015-10-02,46.1285
2015-10-05,45.7496
2015-10-06,45.4844
2015-10-07,45.7023
2015-10-08,44.9066
2015-10-09,45.0108
2015-10-12,45.7023
2015-10-13,45.6549
2015-10-14,45.3234
2015-10-15,46.6495
2015-10-16,46.962
2015-10-19,47.3504
2015-10-20,46.8105
2015-10-21,46.1664
2015-10-22,38.1531
2015-10-23,38.2099
2015-10-26,38.1152
2015-10-27,38.4278
2015-10-28,38.8825
2015-10-29,38.5699
2015-10-30,38.4183
2015-11-02,39.7539
2015-11-03,39.2519
2015-11-04,39.0529
2015-11-05,39.1003
2015-11-06,39.2329
2015-11-09,38.8635
2015-11-10,39.0624
2015-11-11,38.191
2015-11-12,37.2343
2015-11-13,36.3155
2015-11-16,39.2897
2015-11-17,39.5076
2015-11-18,40.0475
2015-11-19,39.6118
2015-11-20,40.0759
2015-11-23,40.1233
2015-11-24,40.3033
2015-11-25,40.7958
2015-11-27,40.6916
2015-11-30,40.2559
2015-12-01,40.057
2015-12-02,40.0096
2015-12-03,39.9149
2015-12-04,40.379
2015-12-07,40.3033
2015-12-08,40.1138
2015-12-09,39.4981
2015-12-10,39.4224
2015-12-11,39.0892
2015-12-14,38.8798
2015-12-15,39.2605
2015-12-16,39.9649
2015-12-17,40.4978
2015-12-18,40.5454
2015-12-21,40.4312
2015-12-22,40.7548
2015-12-23,40.8976
2015-12-24,41.4401
2015-12-28,41.7827
2015-12-29,42.3919
2015-12-30,42.2205
2015-12-31,41.9255
2016-01-04,40.4217
2016-01-05,40.5549
2016-01-06,40.4217
2016-01-07,39.4985
2016-01-08,38.8703
2016-01-11,37.8043
2016-01-12,38.9845
2016-01-13,37.9566
2016-01-14,38.0899
2016-01-15,37.1762
2016-01-19,36.0245
2016-01-20,36.5004
2016-01-21,36.8145
2016-01-22,37.2047
2016-01-25,36.4433
2016-01-26,37.2047
2016-01-27,36.7193
2016-01-28,35.0061
2016-01-29,35.1584
2016-02-01,35.6057
2016-02-02,35.5772
2016-02-03,34.949
2016-02-04,35.1489
2016-02-05,34.6349
2016-02-08,35.0252
2016-02-09,34.7967
2016-02-10,34.7682
2016-02-11,34.416
2016-02-12,34.8824
2016-02-16,35.6153
2016-02-17,35.501
2016-02-18,35.1013
2016-02-19,36.3481
2016-02-22,36.1292
2016-02-23,36.3101
2016-02-24,37.1286
2016-02-25,37.4141
2016-02-26,37.4331
2016-02-29,37.8234
2016-03-01,37.9471
2016-03-02,38.185
2016-03-03,38.0613
2016-03-04,39.0321
2016-03-07,39.6222
2016-03-08,38.4896
2016-03-09,38.7561
2016-03-10,38.7751
2016-03-11,39.8177
2016-03-14,39.7603
2016-03-15,38.5456
2016-03-16,38.0769
2016-03-17,37.7708
2016-03-18,38.6508
2016-03-21,38.4882
2016-03-22,38.2873
2016-03-23,37.7326
2016-03-24,37.2639
2016-03-28,37.8952
2016-03-29,39.416
2016-03-30,39.1386
2016-03-31,40.1142
2016-04-01,40.9367
2016-04-04,40.8315
2016-04-05,39.7029
2016-04-06,40.0472
2016-04-07,39.8368
2016-04-08,39.6646
2016-04-11,39.0429
2016-04-12,39.6933
2016-04-13,41.0611
2016-04-14,41.1663
2016-04-15,41.5106
2016-04-18,41.5011
2016-04-19,41.0324
2016-04-20,41.2715
2016-04-21,41.1185
2016-04-22,41.0898
2016-04-25,41.1663
2016-04-26,42.2567
2016-04-27,42.4671
2016-04-28,40.5446
2016-04-29,39.6168
2016-05-02,40.6211
2016-05-03,40.0185
2016-05-04,41.0037
2016-05-05,41.128
2016-05-06,41.0515
2016-05-09,40.9846
2016-05-10,40.5542
2016-05-11,39.7029
2016-05-12,39.0334
2016-05-13,38.6221
2016-05-16,38.8612
2016-05-17,38.0673
2016-05-18,37.9239
2016-05-19,37.2735
2016-05-20,37.4935
2016-05-23,37.2735
2016-05-24,37.8378
2016-05-25,38.01
2016-05-26,37.3978
2016-05-27,37.79
2016-05-31,38.0865
2016-06-01,39.2725
2016-06-02,40.3533
2016-06-03,40.009
2016-06-06,40.4489
2016-06-07,40.7454
2016-06-08,40.975
2016-06-09,41.0659
2016-06-10,41.1185
2016-06-13,41.4548
2016-06-14,41.4932
2016-06-15,41.3779
2016-06-16,41.5124
2016-06-17,41.3587
2016-06-20,42.4734
2016-06-21,42.3677
2016-06-22,42.7809
2016-06-23,43.7226
2016-06-24,42.4734
2016-06-27,42.2332
2016-06-28,42.7617
2016-06-29,44.1166
2016-06-30,45.8655
2016-07-01,46.7015
2016-07-05,46.4132
2016-07-06,46.173
2016-07-07,45.8751
2016-07-08,46.7784
2016-07-11,47.403
2016-07-12,47.6624
2016-07-13,47.2396
2016-07-14,47.5471
2016-07-15,48.0468
2016-07-18,47.5375
2016-07-19,47.0282
2016-07-20,47.2492
2016-07-21,46.6727
2016-07-22,46.4036
2016-07-25,46.2595
2016-07-26,46.4709
2016-07-27,46.3171
2016-07-28,38.3606
2016-07-29,39.0524
2016-08-01,38.6008
2016-08-02,38.178
2016-08-03,38.4759
2016-08-04,38.0819
2016-08-05,37.8609
2016-08-08,37.5053
2016-08-09,38.1492
2016-08-10,37.2363
2016-08-11,37.4189
2016-08-12,37.169
2016-08-15,37.9954
2016-08-16,37.9954
2016-08-17,38.1396
2016-08-18,38.4759
2016-08-19,38.4663
2016-08-22,39.0044
2016-08-23,38.9756
2016-08-24,38.4567
2016-08-25,38.351
2016-08-26,38.5624
2016-08-29,38.8026
2016-08-30,38.9756
2016-08-31,39.2062
2016-09-01,38.9756
2016-09-02,39.3888
2016-09-06,40.5035
2016-09-07,40.811
2016-09-08,40.4458
2016-09-09,39.1485
2016-09-12,39.0909
2016-09-13,38.0383
2016-09-14,37.1595
2016-09-15,37.4106
2016-09-16,37.6617
2016-09-19,38.3473
2016-09-20,38.2218
2016-09-21,38.2218
2016-09-22,38.666
2016-09-23,38.4632
2016-09-26,37.7582
2016-09-27,38.3666
2016-09-28,39.1198
2016-09-29,38.1542
2016-09-30,38.6853
2016-10-03,38.328
2016-10-04,38.5984
2016-10-05,39.3323
2016-10-06,38.9653
2016-10-07,38.8494
2016-10-10,39.6703
2016-10-11,37.9996
2016-10-12,38.0866
2016-10-13,38.1735
2016-10-14,37.8645
2016-10-17,37.9224
2016-10-18,38.9653
2016-10-19,38.9267
2016-10-20,38.7529
2016-10-21,38.0479
2016-10-24,38.4439
2016-10-25,37.8741
2016-10-26,36.8022
2016-10-27,36.4546
2016-10-28,38.6273
2016-10-31,38.6273
2016-11-01,37.9996
2016-11-02,37.8934
2016-11-03,37.8355
2016-11-04,38.4052
2016-11-07,39.651
2016-11-08,40.4235
2016-11-09,41.1864
2016-11-10,42.3935
2016-11-11,43.0695
2016-11-14,43.2626
2016-11-15,43.253
2016-11-16,42.9633
2016-11-17,43.3013
2016-11-18,44.0786
2016-11-21,44.856
2016-11-22,43.5523
2016-11-23,43.562
2016-11-25,43.5282
2016-11-28,43.1178
2016-11-29,43.1564
2016-11-30,42.0845
2016-12-01,41.9396
2016-12-02,41.872
2016-12-05,42.3452
2016-12-06,42.4418
2016-12-07,43.0019
2016-12-08,43.6586
2016-12-09,44.1607
2016-12-12,44.1028
2016-12-13,43.7778
2016-12-14,43.4917
2016-12-15,43.6954
2016-12-16,43.4529
2016-12-19,43.2007
2016-12-20,43.0358
2016-12-21,42.4151
2016-12-22,42.2453
2016-12-23,42.3569
2016-12-27,42.677
2016-12-28,42.6382
2016-12-29,43.0067
2016-12-30,42.8418
2017-01-03,42.8612
2017-01-04,43.9379
2017-01-05,43.2492
2017-01-06,43.5305
2017-01-09,43.385
2017-01-10,44.1804
2017-01-11,44.161
2017-01-12,43.2298
2017-01-13,43.5014
2017-01-17,43.1037
2017-01-18,42.6091
2017-01-19,42.3181
2017-01-20,42.1532
2017-01-23,41.5324
2017-01-24,41.8525
2017-01-25,42.5363
2017-01-26,41.4936
2017-01-27,42.1144
2017-01-30,42.192
2017-01-31,43.2492
2017-02-01,42.9388
2017-02-02,40.2618
2017-02-03,41.5227
2017-02-06,41.5033
2017-02-07,41.7846
2017-02-08,41.5227
2017-02-09,41.9398
2017-02-10,42.3472
2017-02-13,42.4733
2017-02-14,42.1629
2017-02-15,41.9689
2017-02-16,42.0853
2017-02-17,42.192
2017-02-21,41.7458
2017-02-22,40.7662
2017-02-23,40.4558
2017-02-24,41.3773
2017-02-27,41.1833
2017-02-28,40.3685
2017-03-01,40.6692
2017-03-02,40.6207
2017-03-03,40.2909
2017-03-06,39.6314
2017-03-07,39.4568
2017-03-08,39.3598
2017-03-09,38.9039
2017-03-10,39.0203
2017-03-13,39.9366
2017-03-14,40.3752
2017-03-15,41.3793
2017-03-16,41.3598
2017-03-17,41.8569
2017-03-20,41.4767
2017-03-21,41.5645
2017-03-22,41.0966
2017-03-23,41.9008
2017-03-24,41.5742
2017-03-27,41.7497
2017-03-28,41.7887
2017-03-29,42.2761
2017-03-30,42.549
2017-03-31,43.2898
2017-04-03,42.4028
2017-04-04,42.5051
2017-04-05,42.6855
2017-04-06,43.2703
2017-04-07,43.8552
2017-04-10,43.8454
2017-04-11,44.3036
2017-04-12,44.0696
2017-04-13,44.0696
2017-04-17,44.9469
2017-04-18,44.8885
2017-04-19,45.0834
2017-04-20,46.0874
2017-04-21,46.1459
2017-04-24,46.2921
2017-04-25,46.0095
2017-04-26,46.916
2017-04-27,47.9298
2017-04-28,47.92
2017-05-01,49.1872
2017-05-02,49.5089
2017-05-03,49.2944
2017-05-04,49.7526
2017-05-05,49.1677
2017-05-08,48.924
2017-05-09,49.2944
2017-05-10,49.7039
2017-05-11,49.2165
2017-05-12,49.7623
2017-05-15,49.6551
2017-05-16,49.8306
2017-05-17,48.924
2017-05-18,48.4659
2017-05-19,48.4659
2017-05-22,48.6803
2017-05-23,48.5536
2017-05-24,48.6998
2017-05-25,49.275
2017-05-26,49.5089
2017-05-30,49.1872
2017-05-31,49.4894
2017-06-01,50.5909
2017-06-02,50.9418
2017-06-05,50.2302
2017-06-06,50.0938
2017-06-07,50.5422
2017-06-08,50.7761
2017-06-09,50.7469
2017-06-12,51.1368
2017-06-13,51.3618
2017-06-14,50.4909
2017-06-15,49.9087
2017-06-16,49.8256
2017-06-19,50.6084
2017-06-20,49.6983
2017-06-21,49.7962
2017-06-22,50.4518
2017-06-23,50.3148
2017-06-26,50.08
2017-06-27,49.1015
2017-06-28,48.7981
2017-06-29,49.8549
2017-06-30,49.8451
2017-07-03,49.6788
2017-07-05,49.1015
2017-07-06,49.3461
2017-07-07,49.9234
2017-07-10,49.0721
2017-07-11,49.3167
2017-07-12,49.9919
2017-07-13,49.5809
2017-07-14,49.6592
2017-07-17,49.7571
2017-07-18,49.6592
2017-07-19,49.9919
2017-07-20,49.3852
2017-07-21,49.033
2017-07-24,48.7981
2017-07-25,49.5614
2017-07-26,48.9058
2017-07-27,48.896
2017-07-28,50.0604
2017-07-31,50.217
2017-08-01,50.2072
2017-08-02,47.8979
2017-08-03,47.6826
2017-08-04,48.3089
2017-08-07,48.5535
2017-08-08,48.9253
2017-08-09,48.5682
2017-08-10,48.348
2017-08-11,48.2306
2017-08-14,49.0623
2017-08-15,48.8764
2017-08-16,48.5731
2017-08-17,47.9175
2017-08-18,47.5554
2017-08-21,47.4967
2017-08-22,48.6024
2017-08-23,47.3401
2017-08-24,48.1327
2017-08-25,47.5163
2017-08-28,47.5065
2017-08-29,47.8979
2017-08-30,47.4674
2017-08-31,48.5339
2017-09-01,48.847
2017-09-05,48.3187
2017-09-06,48.2795
2017-09-07,48.4654
2017-09-08,48.4948
2017-09-11,49.0819
2017-09-12,49.4342
2017-09-13,50.0017
2017-09-14,50.9055
2017-09-15,50.9153
2017-09-18,51.0233
2017-09-19,50.6206
2017-09-20,49.8642
2017-09-21,49.3632
2017-09-22,49.8445
2017-09-25,49.9035
2017-09-26,50.3455
2017-09-27,51.4359
2017-09-28,51.5931
2017-09-29,51.544
2017-10-02,52.7523
2017-10-03,52.3397
2017-10-04,52.6737
2017-10-05,53.2533
2017-10-06,53.2827
2017-10-09,52.0646
2017-10-10,51.4065
2017-10-11,51.2591
2017-10-12,51.5342
2017-10-13,51.1903
2017-10-16,51.5636
2017-10-17,51.4654
2017-10-18,52.0646
2017-10-19,52.487
2017-10-20,52.3495
2017-10-23,51.9762
2017-10-24,51.9566
2017-10-25,52.212
2017-10-26,51.9566
2017-10-27,51.7699
2017-10-30,50.7777
2017-10-31,51.2984
2017-11-01,51.4359
2017-11-02,52.2709
2017-11-03,52.4281
2017-11-06,51.0233
2017-11-07,50.0606
2017-11-08,50.0803
2017-11-09,50.2571
2017-11-10,48.9113
2017-11-13,49.3533
2017-11-14,49.9919
2017-11-15,49.4417
2017-11-16,51.0037
2017-11-17,51.21
2017-11-20,51.5342
2017-11-21,52.3102
2017-11-22,52.2415
2017-11-24,52.6246
2017-11-27,52.3102
2017-11-28,53.0666
2017-11-29,52.5558
2017-11-30,52.5558
2017-12-01,51.8092
2017-12-04,51.5145
2017-12-05,51.1412
2017-12-06,50.9153
2017-12-07,51.3377
2017-12-08,50.542
2017-12-11,49.9035
2017-12-12,49.5007
2017-12-13,50.0115
2017-12-14,49.2817
2017-12-15,49.8044
2017-12-18,49.7847
2017-12-19,49.0943
2017-12-20,48.621
2017-12-21,50.4652
2017-12-22,50.2778
2017-12-26,50.12
2017-12-27,50.0214
2017-12-28,50.7512
2017-12-29,50.268
2018-01-02,49.9129
2018-01-03,50.4356
2018-01-04,51.3134
2018-01-05,51.6684
2018-01-08,52.6349
2018-01-09,52.6842
2018-01-10,53.3943
2018-01-11,55.3865
2018-01-12,55.7021
2018-01-16,55.1301
2018-01-17,55.2385
2018-01-18,54.992
2018-01-19,55.7119
2018-01-22,55.3569
2018-01-23,55.7612
2018-01-24,55.6922
2018-01-25,56.994
2018-01-26,57.2011
2018-01-29,56.491
2018-01-30,56.708
2018-01-31,56.9842
2018-02-01,62.4774
2018-02-02,62.3394
2018-02-05,60.7614
2018-02-06,59.9428
2018-02-07,59.3807
2018-02-08,58.4142
2018-02-09,59.2623
2018-02-12,59.1933
2018-02-13,58.7988
2018-02-14,59.2722
2018-02-15,60.3768
2018-02-16,60.4261
2018-02-20,60.1598
2018-02-21,59.6667
2018-02-22,59.5779
2018-02-23,59.8344
2018-02-26,60.288
2018-02-27,60.1499
2018-02-28,59.6963
2018-03-01,59.1341
2018-03-02,60.2584
2018-03-05,60.2683
2018-03-06,60.5346
2018-03-07,61.1559
2018-03-08,61.3038
2018-03-09,62.438
2018-03-12,62.6056
2018-03-13,63.4242
2018-03-14,63.8199
2018-03-15,63.4044
2018-03-16,63.6913
2018-03-19,63.1472
2018-03-20,63.8397
2018-03-21,63.7606
2018-03-22,62.801
2018-03-23,62.2371
2018-03-26,63.5726
2018-03-27,62.0491
2018-03-28,62.5141
2018-03-29,62.6526
2018-04-02,60.8125
2018-04-03,61.3566
2018-04-04,62.1579
2018-04-05,62.4151
2018-04-06,60.9609
2018-04-09,60.6839
2018-04-10,61.2082
2018-04-11,60.9114
2018-04-12,61.2774
2018-04-13,61.2379
2018-04-16,62.1183
2018-04-17,62.5734
2018-04-18,62.4646
2018-04-19,62.3261
2018-04-20,62.2371
2018-04-23,61.9205
2018-04-24,61.0994
2018-04-25,62.4349
2018-04-26,65.4919
2018-04-27,64.552
2018-04-30,64.3344
2018-05-01,64.7796
2018-05-02,64.8686
2018-05-03,64.6806
2018-05-04,66.036
2018-05-07,66.6493
2018-05-08,66.9165
2018-05-09,67.332
2018-05-10,67.0253
2018-05-11,67.1143
2018-05-14,67.0154
2018-05-15,67.4903
2018-05-16,68.0542
2018-05-17,67.7574
2018-05-18,68.1135
2018-05-21,68.252
2018-05-22,68.0443
2018-05-23,68.1432
2018-05-24,67.6881
2018-05-25,67.6485
2018-05-29,67.8167
2018-05-30,68.252
2018-05-31,67.9157
2018-06-01,68.2916
2018-06-04,69.2611
2018-06-05,70.5175
2018-06-06,72.2092
2018-06-07,72.2191
2018-06-08,71.8432
2018-06-11,71.7047
2018-06-12,71.6849
2018-06-13,72.1993
2018-06-14,73.2806
2018-06-15,73.8064
2018-06-18,73.8064
2018-06-19,73.6774
2018-06-20,75.1456
2018-06-21,74.7091
2018-06-22,75.8202
2018-06-25,74.7786
2018-06-26,73.3203
2018-06-27,72.7052
2018-06-28,72.5564
2018-06-29,72.616
2018-07-02,73.5782
2018-07-03,73.9254
2018-07-05,73.9849
2018-07-06,75.0266
2018-07-09,74.6496
2018-07-10,74.6397
2018-07-11,73.7469
2018-07-12,73.6973
2018-07-13,73.1913
2018-07-16,72.5664
2018-07-17,73.3897
2018-07-18,72.9929
2018-07-19,73.1616
2018-07-20,72.8441
2018-07-23,74.0841
2018-07-24,73.5187
2018-07-25,74.233
2018-07-26,74.8778
2018-07-27,72.854
2018-07-30,72.5068
2018-07-31,73.4096
2018-08-01,75.6714
2018-08-02,79.7585
2018-08-03,79.4411
2018-08-06,77.4173
2018-08-07,77.1693
2018-08-08,76.3956
2018-08-09,75.4928
2018-08-10,75.8103
2018-08-13,76.2071
2018-08-14,77.2586
2018-08-15,75.969
2018-08-16,76.6932
2018-08-17,77.09
2018-08-20,77.6356
2018-08-21,77.2785
2018-08-22,77.1297
2018-08-23,77.0305
2018-08-24,77.1991
2018-08-27,77.3777
2018-08-28,77.3677
2018-08-29,78.9748
2018-08-30,79.2427
2018-08-31,79.7883
2018-09-04,80.314
2018-09-05,80.2644
2018-09-06,80.9291
2018-09-07,80.6017
2018-09-10,80.2644
2018-09-11,80.9886
2018-09-12,78.578
2018-09-13,78.8167
2018-09-14,80.2787
2018-09-17,79.1548
2018-09-18,79.5725
2018-09-19,78.3294
2018-09-20,79.6024
2018-09-21,77.484
2018-09-24,79.1847
2018-09-25,78.8565
2018-09-26,79.672
2018-09-27,79.125
2018-09-28,78.7869
2018-10-01,78.6277
2018-10-02,78.3592
2018-10-03,77.7128
2018-10-04,75.6541
2018-10-05,74.1722
2018-10-08,73.1976
2018-10-09,72.8793
2018-10-10,70.7411
2018-10-11,70.5124
2018-10-12,71.9644
2018-10-15,72.7003
2018-10-16,75.0474
2018-10-17,74.0827
2018-10-18,72.76
2018-10-19,71.3478
2018-10-22,71.2085
2018-10-23,69.4283
2018-10-24,69.0206
2018-10-25,70.025
2018-10-26,68.6128
2018-10-29,68.0956
2018-10-30,68.8614
2018-10-31,67.0613
2018-11-01,69.5576
2018-11-02,66.6735
2018-11-05,67.9166
2018-11-06,67.9564
2018-11-07,68.0658
2018-11-08,68.8714
2018-11-09,68.7222
2018-11-12,68.0658
2018-11-13,67.658
2018-11-14,67.7973
2018-11-15,68.4537
2018-11-16,68.205
2018-11-19,67.2006
2018-11-20,66.8724
2018-11-21,66.6933
2018-11-23,67.4194
2018-11-26,66.9022
2018-11-27,66.1265
2018-11-28,68.4139
2018-11-29,66.9619
2018-11-30,67.5884
2018-12-03,68.4736
2018-12-04,66.6237
2018-12-06,66.1762
2018-12-07,64.9728
2018-12-10,65.7485
2018-12-11,66.6635
2018-12-12,67.2403
2018-12-13,67.1605
2018-12-14,63.5796
2018-12-17,61.7043
2018-12-18,60.8066
2018-12-19,60.6769
2018-12-20,59.46
2018-12-21,59.2605
2018-12-24,57.2655
2018-12-26,61.0859
2018-12-27,61.834
2018-12-28,62.5522
2018-12-31,64.0384
2019-01-02,63.2504
2019-01-03,60.637
2019-01-04,62.1731
2019-01-07,61.1058
2019-01-08,61.7442
2019-01-09,63.3202
2019-01-10,64.188
2019-01-11,64.0783
2019-01-14,64.5371
2019-01-15,65.6244
2019-01-16,67.2104
2019-01-17,67.6892
2019-01-18,66.4723
2019-01-22,66.572
2019-01-23,70.522
2019-01-24,69.4747
2019-01-25,69.7141
2019-01-28,67.9785
2019-01-29,67.7391
2019-01-30,68.6967
2019-01-31,70.1729
2019-02-01,69.6343
2019-02-04,70.0732
2019-02-05,69.5744
2019-02-06,69.365
2019-02-07,69.5844
2019-02-08,69.1256
2019-02-11,70.4921
2019-02-12,71.0008
2019-02-13,70.8113
2019-02-14,70.8612
2019-02-15,71.7589
2019-02-19,74.5918
2019-02-20,73.5344
2019-02-21,74.9509
2019-02-22,75.5793
2019-02-25,74.6915
2019-02-26,74.1928
2019-02-27,75.5992
2019-02-28,76.7064
2019-03-01,78.5618
2019-03-04,77.2052
2019-03-05,77.5743
2019-03-06,77.1453
2019-03-07,77.7039
2019-03-08,77.2251
2019-03-11,77.7438
2019-03-12,78.3722
2019-03-13,79.27
2019-03-14,77.82
2019-03-15,78.9
2019-03-18,79.81
2019-03-19,79.97
2019-03-20,80.13
2019-03-21,82.04
2019-03-22,79.82
2019-03-25,80.75
2019-03-26,81.55
2019-03-27,81.67
2019-03-28,81.85
2019-03-29,83.18
2019-04-01,82.68
2019-04-02,82.79
2019-04-03,82.73
2019-04-04,82.37
2019-04-05,83.5
2019-04-08,82.38
2019-04-09,82.64
2019-04-10,82.84
2019-04-11,83.25
2019-04-12,83.18
2019-04-15,83.44
2019-04-16,80.92
2019-04-17,78.27
2019-04-18,79.42
2019-04-22,79.14
2019-04-23,80.76
2019-04-24,80.01
2019-04-25,81.32
2019-04-26,82.48
2019-04-29,78.7
2019-04-30,80.03
2019-05-01,79.76
2019-05-02,81.06
2019-05-03,82.5
2019-05-06,82.25
2019-05-07,80.77
2019-05-08,80.94
2019-05-09,81.7
2019-05-10,81.85
2019-05-13,80.65
2019-05-14,81.15
2019-05-15,82.39
2019-05-16,81.89
2019-05-17,80.32
2019-05-20,80.02
2019-05-21,80.65
2019-05-22,81.5
2019-05-23,80.99
2019-05-24,81.43
2019-05-28,82.26
2019-05-29,81.73
2019-05-30,81.96
2019-05-31,80.48
2019-06-03,79.94
2019-06-04,81.8
2019-06-05,82.38
2019-06-06,81.66
2019-06-07,81.93
2019-06-10,83.86
2019-06-11,82.94
2019-06-12,84.19
2019-06-13,83.94
2019-06-14,82.91
2019-06-17,83.25
2019-06-18,84.21
2019-06-19,85.53
2019-06-20,85.81
2019-06-21,86.205
2019-06-24,86.8
2019-06-25,85.41
2019-06-26,83.94
2019-06-27,85.095
2019-06-28,85.64
2019-07-01,85.69
2019-07-02,85.215
2019-07-03,86.35
2019-07-04,86.35
2019-07-05,87.23
2019-07-08,86.93
2019-07-09,86.735
2019-07-10,87.68
2019-07-11,87.885
2019-07-12,88.225
2019-07-15,86.735
2019-07-16,85.38
2019-07-17,85.315
2019-07-18,86.315
2019-07-19,84.34
2019-07-22,83.92
2019-07-23,84.54
2019-07-24,85.745
2019-07-25,85.52
2019-07-26,86.895
2019-07-29,86.68
2019-07-30,87.07
2019-07-31,87.36
2019-08-01,93.785
2019-08-02,92.48
2019-08-05,91.44
2019-08-06,92.925
2019-08-07,94.135
2019-08-08,95.955
2019-08-09,94.77
2019-08-12,95.425
2019-08-13,95.41
2019-08-14,94.65
2019-08-15,94.16
2019-08-16,95.19
2019-08-19,96.67
2019-08-20,95.89
2019-08-21,97.4
2019-08-22,101.23
2019-08-23,99.19
2019-08-26,100.73
2019-08-27,100.04
2019-08-28,100.6
2019-08-29,101.135
2019-08-30,100.885
2019-09-02,100.84
2019-09-03,98.77
2019-09-04,98.515
2019-09-05,98.94
2019-09-06,98.805
2019-09-09,98.16
2019-09-10,98.01
2019-09-11,99.51
2019-09-12,100.785
2019-09-13,101.095
2019-09-16,101.67
2019-09-17,102.215
2019-09-18,101.93
2019-09-19,101.11
2019-09-20,100.385
2019-09-23,100.57
2019-09-24,98.255
2019-09-25,97.875
2019-09-26,97.35
2019-09-27,95.805
2019-09-30,96.11
2019-10-01,93.63
2019-10-02,93.26
2019-10-03,94.6
2019-10-04,96.2
2019-10-07,96.06
2019-10-08,94.64
2019-10-09,94.79
2019-10-10,93.555
2019-10-11,95.125
2019-10-14,94.72
2019-10-15,95.33
2019-10-16,95.69
2019-10-17,97.2
2019-10-18,97.795
2019-10-21,97.88
2019-10-22,96.6
2019-10-23,97.325
2019-10-24,98.095
2019-10-25,97.75
2019-10-28,99.39
2019-10-29,99.69
2019-10-30,102.48
2019-10-31,110.08
2019-11-01,109.06
2019-11-04,112.53
2019-11-05,109.64
2019-11-06,110.52
2019-11-07,109.41
2019-11-08,110.235
2019-11-11,109.71
2019-11-12,112.095
2019-11-13,113.64
2019-11-14,112.86
2019-11-15,113.275
2019-11-18,113.44
2019-11-19,113.055
2019-11-20,112.94
2019-11-21,112.325
2019-11-22,113.315
2019-11-25,116.775
