date,close
2014-06-13,28.4969
2014-06-16,28.3536
2014-06-17,28.0607
2014-06-18,28.1729
2014-06-19,28.0233
2014-06-20,28.391
2014-06-23,28.5094
2014-06-24,28.9145
2014-06-25,28.8085
2014-06-26,28.9145
2014-06-27,29.226
2014-06-30,29.2447
2014-07-01,29.251
2014-07-02,29.4441
2014-07-03,29.7183
2014-07-07,29.8492
2014-07-08,29.9115
2014-07-09,30.4474
2014-07-10,30.7528
2014-07-11,30.8463
2014-07-14,31.3136
2014-07-15,31.1454
2014-07-16,31.189
2014-07-17,32.024
2014-07-18,32.024
2014-07-21,31.8994
2014-07-22,31.3635
2014-07-23,31.6065
2014-07-24,31.7187
2014-07-25,31.7872
2014-07-28,31.8682
2014-07-29,31.9056
2014-07-30,31.8807
2014-07-31,31.8433
2014-08-01,31.3946
2014-08-04,31.9181
2014-08-05,31.6813
2014-08-06,31.6813
2014-08-07,32.0178
2014-08-08,32.2484
2014-08-11,32.8279
2014-08-12,33.962
2014-08-13,34.9092
2014-08-14,34.822
2014-08-15,35.2306
2014-08-18,36.3566
2014-08-19,36.1616
2014-08-20,36.4824
2014-08-21,36.6396
2014-08-22,37.2812
2014-08-25,37.2623
2014-08-26,37.0925
2014-08-27,35.9477
2014-08-28,35.9855
2014-08-29,35.9037
2014-09-02,35.8408
2014-09-03,35.2055
2014-09-04,33.6644
2014-09-05,32.1485
2014-09-08,32.1485
2014-09-09,32.6957
2014-09-10,31.8655
2014-09-11,32.0101
2014-09-12,33.0857
2014-09-15,32.9662
2014-09-16,33.1298
2014-09-17,33.1675
2014-09-18,33.4002
2014-09-19,33.8846
2014-09-22,33.8846
2014-09-23,33.8657
2014-09-24,33.4757
2014-09-25,32.8593
2014-09-26,34.2808
2014-09-29,34.5136
2014-09-30,34.5953
2014-10-01,34.457
2014-10-02,34.7778
2014-10-03,34.5953
2014-10-06,34.5639
2014-10-07,32.8404
2014-10-08,31.7019
2014-10-09,30.4439
2014-10-10,28.3367
2014-10-13,27.8335
2014-10-14,27.6763
2014-10-15,28.6009
2014-10-16,31.1861
2014-10-17,31.5824
2014-10-20,31.3245
2014-10-21,29.2048
2014-10-22,28.5695
2014-10-23,28.5003
2014-10-24,28.9343
2014-10-27,29.0601
2014-10-28,29.1733
2014-10-29,29.0601
2014-10-30,28.8022
2014-10-31,28.9783
2014-11-03,28.5632
2014-11-04,28.2864
2014-11-05,28.3053
2014-11-06,27.9279
2014-11-07,28.689
2014-11-10,28.6198
2014-11-11,28.3367
2014-11-12,28.4751
2014-11-13,28.6072
2014-11-14,29.0756
2014-11-17,29.0883
2014-11-18,29.2539
2014-11-19,28.9865
2014-11-20,29.4194
2014-11-21,29.413
2014-11-24,29.1647
2014-11-25,29.2157
2014-11-26,29.8332
2014-11-28,29.8969
2014-12-01,28.0124
2014-12-02,28.6745
2014-12-03,29.5467
2014-12-04,29.5913
2014-12-05,30.0242
2014-12-08,29.0374
2014-12-09,28.6618
2014-12-10,27.8469
2014-12-11,28.9674
2014-12-12,28.9483
2014-12-15,28.0761
2014-12-16,27.9615
2014-12-17,28.3244
2014-12-18,28.6427
2014-12-19,29.3303
2014-12-22,29.3557
2014-12-23,29.8969
2014-12-24,30.0751
2014-12-26,30.4571
2014-12-29,31.2338
2014-12-30,31.6731
2014-12-31,31.6858
2015-01-02,31.2848
2015-01-05,30.7245
2015-01-06,30.7245
2015-01-07,30.5781
2015-01-08,30.8773
2015-01-09,31.0237
2015-01-12,30.3998
2015-01-13,30.1834
2015-01-14,30.0051
2015-01-15,30.75
2015-01-16,30.9601
2015-01-20,31.393
2015-01-21,31.5139
2015-01-22,31.9851
2015-01-23,32.6599
2015-01-26,33.0419
2015-01-27,32.8764
2015-01-28,32.4244
2015-01-29,31.9341
2015-01-30,31.9214
2015-02-02,32.3862
2015-02-03,32.8636
2015-02-04,32.8318
2015-02-05,32.749
2015-02-06,32.8
2015-02-09,32.6217
2015-02-10,32.2652
2015-02-11,32.0678
2015-02-12,32.2933
2015-02-13,32.4351
2015-02-17,31.8939
2015-02-18,31.9647
2015-02-19,32.9312
2015-02-20,33.189
2015-02-23,33.6593
2015-02-24,33.5562
2015-02-25,33.5755
2015-02-26,33.5047
2015-02-27,33.2341
2015-03-02,33.2083
2015-03-03,33.0343
2015-03-04,33.1825
2015-03-05,33.0279
2015-03-06,32.8281
2015-03-09,32.8861
2015-03-10,32.6799
2015-03-11,31.9776
2015-03-12,32.8603
2015-03-13,32.8926
2015-03-16,32.9828
2015-03-17,32.7895
2015-03-18,32.7573
2015-03-19,32.6671
2015-03-20,33.3371
2015-03-23,33.6786
2015-03-24,33.3307
2015-03-25,33.2727
2015-03-26,33.408
2015-03-27,33.015
2015-03-30,33.1567
2015-03-31,33.0859
2015-04-01,32.8861
2015-04-02,32.5704
2015-04-06,32.3449
2015-04-07,31.8423
2015-04-08,31.2624
2015-04-09,31.2689
2015-04-10,31.5717
2015-04-13,31.1916
2015-04-14,31.4879
2015-04-15,31.6297
2015-04-16,32.3771
2015-04-17,32.7186
2015-04-20,32.6993
2015-04-21,32.4544
2015-04-22,32.9183
2015-04-23,32.9312
2015-04-24,32.9055
2015-04-27,32.899
2015-04-28,32.9055
2015-04-29,33.7688
2015-04-30,33.64
2015-05-01,34.5291
2015-05-04,34.4067
2015-05-05,33.0279
2015-05-06,32.8861
2015-05-07,32.3513
2015-05-08,31.6168
2015-05-11,30.9789
2015-05-12,31.2238
2015-05-13,31.2818
2015-05-14,31.1916
2015-05-15,31.8348
2015-05-18,31.1818
2015-05-19,30.6659
2015-05-20,30.4439
2015-05-21,30.5288
2015-05-22,30.8553
2015-05-26,31.3189
2015-05-27,30.79
2015-05-28,30.052
2015-05-29,30.1696
2015-06-01,29.8104
2015-06-02,30.5941
2015-06-03,30.4961
2015-06-04,29.2749
2015-06-05,28.6611
2015-06-08,28.5566
2015-06-09,29.0007
2015-06-10,29.5884
2015-06-11,29.4251
2015-06-12,29.5688
2015-06-15,30.1565
2015-06-16,30.4504
2015-06-17,30.8357
2015-06-18,29.8888
2015-06-19,29.8365
2015-06-22,30.4439
2015-06-23,30.5288
2015-06-24,30.039
2015-06-25,29.6145
2015-06-26,29.1248
2015-06-29,29.0203
2015-06-30,29.5819
2015-07-01,29.9345
2015-07-02,29.0007
2015-07-06,28.4195
2015-07-07,29.3403
2015-07-08,28.8505
2015-07-09,28.5762
2015-07-10,28.8505
2015-07-13,28.5697
2015-07-14,28.426
2015-07-15,26.1862
2015-07-16,26.0556
2015-07-17,25.6442
2015-07-20,24.3577
2015-07-21,24.7169
2015-07-22,24.3577
2015-07-23,24.5863
2015-07-24,24.8213
2015-07-27,25.0826
2015-07-28,26.1013
2015-07-29,26.3821
2015-07-30,26.049
2015-07-31,25.9249
2015-08-03,25.6572
2015-08-04,25.5462
2015-08-05,24.8605
2015-08-06,23.672
2015-08-07,23.4304
2015-08-10,24.1226
2015-08-11,25.0695
2015-08-12,26.3951
2015-08-13,26.3951
2015-08-14,26.4838
2015-08-17,26.6764
2015-08-18,26.6499
2015-08-19,25.8592
2015-08-20,25.3742
2015-08-21,24.331
2015-08-24,23.8992
2015-08-25,23.9855
2015-08-26,23.9257
2015-08-27,25.4008
2015-08-28,25.8061
2015-08-31,26.1648
2015-09-01,25.434
2015-09-02,25.5469
2015-09-03,25.1881
2015-09-04,24.8294
2015-09-08,24.7629
2015-09-09,23.9922
2015-09-10,24.3709
2015-09-11,23.5935
2015-09-14,23.2879
2015-09-15,22.9158
2015-09-16,22.6899
2015-09-17,23.1152
2015-09-18,23.5005
2015-09-21,23.2281
2015-09-22,23.8859
2015-09-23,22.9225
2015-09-24,22.2581
2015-09-25,22.464
2015-09-28,21.5272
2015-09-29,20.5106
2015-09-30,22.4906
2015-10-01,22.6899
2015-10-02,22.4707
2015-10-05,22.6368
2015-10-06,22.7763
2015-10-07,23.0155
2015-10-08,23.3543
2015-10-09,24.052
2015-10-12,23.8394
2015-10-13,23.7331
2015-10-14,24.331
2015-10-15,24.3045
2015-10-16,24.5171
2015-10-19,24.0852
2015-10-20,24.2646
2015-10-21,24.4374
2015-10-22,23.8327
2015-10-23,23.5271
2015-10-26,22.6966
2015-10-27,21.7398
2015-10-28,21.5803
2015-10-29,22.6368
2015-10-30,22.9158
2015-11-02,22.0986
2015-11-03,22.3843
2015-11-04,22.2647
2015-11-05,24.0188
2015-11-06,23.9191
2015-11-09,23.4208
2015-11-10,23.3743
2015-11-11,22.8361
2015-11-12,22.3776
2015-11-13,22.5104
2015-11-16,23.7606
2015-11-17,24.4537
2015-11-18,25.7446
2015-11-19,26.6687
2015-11-20,26.0912
2015-11-23,26.098
2015-11-24,25.9281
2015-11-25,25.7243
2015-11-27,25.6631
2015-11-30,25.2758
2015-12-01,25.1603
2015-12-02,24.9429
2015-12-03,24.9769
2015-12-04,24.6303
2015-12-07,24.2362
2015-12-08,23.8014
2015-12-09,24.508
2015-12-10,25.4593
2015-12-11,24.4673
2015-12-14,24.1004
2015-12-15,24.4876
2015-12-16,25.1263
2015-12-17,24.4605
2015-12-18,23.9169
2015-12-21,24.1139
2015-12-22,25.1059
2015-12-23,26.5396
2015-12-24,26.4173
2015-12-28,25.6155
2015-12-29,26.1251
2015-12-30,26.6551
2015-12-31,26.9133
2016-01-04,26.8997
2016-01-05,26.8657
2016-01-06,26.0436
2016-01-07,25.337
2016-01-08,24.9293
2016-01-11,23.7946
2016-01-12,23.4956
2016-01-13,22.5512
2016-01-14,23.4277
2016-01-15,23.7131
2016-01-19,21.8446
2016-01-20,19.8877
2016-01-21,19.1539
2016-01-22,20.4653
2016-01-25,20.6419
2016-01-26,22.1843
2016-01-27,22.9792
2016-01-28,23.1967
2016-01-29,23.1083
2016-02-01,22.7414
2016-02-02,22.2183
2016-02-03,21.1326
2016-02-04,21.7873
2016-02-05,20.2898
2016-02-08,17.037
2016-02-09,16.3753
2016-02-10,16.5843
2016-02-11,16.1594
2016-02-12,16.8141
2016-02-16,19.6142
2016-02-17,20.7495
2016-02-18,20.7425
2016-02-19,20.5614
2016-02-22,21.5644
2016-02-23,21.0629
2016-02-24,21.3067
2016-02-25,20.3246
2016-02-26,21.4669
2016-02-29,20.9306
2016-03-01,21.4112
2016-03-02,22.8948
2016-03-03,22.9853
2016-03-04,22.8182
2016-03-07,23.3127
2016-03-08,22.6928
2016-03-09,22.463
2016-03-10,22.4212
2016-03-11,23.1664
2016-03-14,22.8321
2016-03-15,23.048
2016-03-16,23.3545
2016-03-17,23.5635
2016-03-18,23.3406
2016-03-21,23.3336
2016-03-22,23.2779
2016-03-23,22.449
2016-03-24,22.4699
2016-03-28,22.5744
2016-03-29,22.6789
2016-03-30,22.8948
2016-03-31,23.0759
2016-04-01,22.5326
2016-04-04,22.1983
2016-04-05,22.1495
2016-04-06,22.6232
2016-04-07,22.4978
2016-04-08,22.4908
2016-04-11,22.3445
2016-04-12,23.5286
2016-04-13,23.452
2016-04-14,23.3893
2016-04-15,22.8043
2016-04-18,23.4868
2016-04-19,24.0789
2016-04-20,24.6222
2016-04-21,24.1346
2016-04-22,25.1167
2016-04-25,24.5456
2016-04-26,25.0122
2016-04-27,25.3048
2016-04-28,25.2769
2016-04-29,24.9983
2016-05-02,24.6779
2016-05-03,24.3087
2016-05-04,24.2498
2016-05-05,23.9716
2016-05-06,23.5722
2016-05-09,23.2084
2016-05-10,23.5579
2016-05-11,24.1499
2016-05-12,23.9645
2016-05-13,23.7719
2016-05-16,24.2284
2016-05-17,23.8004
2016-05-18,23.3083
2016-05-19,23.1371
2016-05-20,23.8789
2016-05-23,24.0001
2016-05-24,24.1214
2016-05-25,24.0857
2016-05-26,23.8218
2016-05-27,23.9431
2016-05-31,23.6578
2016-06-01,24.0714
2016-06-02,24.0857
2016-06-03,23.7291
2016-06-06,24.0358
2016-06-07,24.05
2016-06-08,22.0673
2016-06-09,21.2685
2016-06-10,21.026
2016-06-13,20.8976
2016-06-14,20.8833
2016-06-15,20.9118
2016-06-16,20.6551
2016-06-17,21.4396
2016-06-20,21.3255
2016-06-21,22.0387
2016-06-22,21.511
2016-06-23,21.9817
2016-06-24,21.4396
2016-06-27,20.812
2016-06-28,21.3968
2016-06-29,21.782
2016-06-30,21.3612
2016-07-01,20.8904
2016-07-05,20.6622
2016-07-06,20.2771
2016-07-07,19.6423
2016-07-08,20.4839
2016-07-11,21.0402
2016-07-12,21.4111
2016-07-13,21.2257
2016-07-14,21.4396
2016-07-15,21.4182
2016-07-18,21.4111
2016-07-19,21.5751
2016-07-20,21.6679
2016-07-21,21.7535
2016-07-22,21.8462
2016-07-25,22.0174
2016-07-26,21.9389
2016-07-27,22.0387
2016-07-28,22.0174
2016-07-29,22.1101
2016-08-01,22.1101
2016-08-02,22.1956
2016-08-03,22.6393
2016-08-04,21.2545
2016-08-05,22.163
2016-08-08,22.2363
2016-08-09,22.0238
2016-08-10,21.9506
2016-08-11,21.7381
2016-08-12,22.4121
2016-08-15,22.4415
2016-08-16,22.4634
2016-08-17,22.566
2016-08-18,22.7712
2016-08-19,22.588
2016-08-22,22.4561
2016-08-23,22.522
2016-08-24,22.1118
2016-08-25,22.0092
2016-08-26,22.0165
2016-08-29,22.3755
2016-08-30,22.1557
2016-08-31,21.8187
2016-09-01,21.8407
2016-09-02,21.9652
2016-09-06,22.3682
2016-09-07,22.4195
2016-09-08,22.5074
2016-09-09,21.8114
2016-09-12,22.0825
2016-09-13,21.892
2016-09-14,21.9286
2016-09-15,21.8553
2016-09-16,21.4231
2016-09-19,21.4963
2016-09-20,21.2912
2016-09-21,21.8333
2016-09-22,21.9286
2016-09-23,22.0971
2016-09-26,21.7967
2016-09-27,21.6355
2016-09-28,21.7528
2016-09-29,21.3791
2016-09-30,21.2545
2016-10-03,21.3864
2016-10-04,21.0787
2016-10-05,20.8149
2016-10-06,20.8882
2016-10-07,20.793
2016-10-10,21.13
2016-10-11,20.9835
2016-10-12,20.9175
2016-10-13,20.7563
2016-10-14,20.7417
2016-10-17,21.0054
2016-10-18,21.0787
2016-10-19,21.1007
2016-10-20,21.2839
2016-10-21,21.4817
2016-10-24,21.4963
2016-10-25,21.1886
2016-10-26,20.8149
2016-10-27,20.8882
2016-10-28,20.8296
2016-10-31,20.8736
2016-11-01,20.8516
2016-11-02,20.4559
2016-11-03,20.0222
2016-11-04,19.8259
2016-11-07,20.2789
2016-11-08,19.3654
2016-11-09,20.4752
2016-11-10,18.8595
2016-11-11,18.5198
2016-11-14,18.0441
2016-11-15,18.8293
2016-11-16,18.6104
2016-11-17,18.3235
2016-11-18,17.9762
2016-11-21,17.2967
2016-11-22,16.0585
2016-11-23,16.1869
2016-11-25,16.4587
2016-11-28,16.0132
2016-11-29,16.1718
2016-11-30,18.1951
2016-12-01,17.9309
2016-12-02,18.5047
2016-12-05,18.8671
2016-12-06,18.4518
2016-12-07,18.2857
2016-12-08,18.3537
2016-12-09,18.5273
2016-12-12,18.6708
2016-12-13,18.7236
2016-12-14,18.3008
2016-12-15,18.3386
2016-12-16,18.4669
2016-12-19,18.1725
2016-12-20,16.7154
2016-12-21,17.7724
2016-12-22,20.0222
2016-12-23,20.3695
2016-12-27,20.5583
2016-12-28,20.1053
2016-12-29,20.1581
2016-12-30,20.3016
2017-01-03,20.3846
2017-01-04,20.7243
2017-01-05,20.5356
2017-01-06,20.2563
2017-01-09,20.6639
2017-01-10,20.1959
2017-01-11,20.4148
2017-01-12,20.294
2017-01-13,20.1204
2017-01-17,20.2034
2017-01-18,20.143
2017-01-19,20.1279
2017-01-20,20.1581
2017-01-23,20.3091
2017-01-24,20.747
2017-01-25,21.0792
2017-01-26,21.4189
2017-01-27,21.502
2017-01-30,21.5171
2017-01-31,21.3661
2017-02-01,21.3208
2017-02-02,21.8946
2017-02-03,22.3174
2017-02-06,22.6043
2017-02-07,22.4457
2017-02-08,22.3325
2017-02-09,22.6552
2017-02-10,22.3057
2017-02-13,21.7931
2017-02-14,22.1892
2017-02-15,21.8008
2017-02-16,22.1426
2017-02-17,21.7775
2017-02-21,22.0338
2017-02-22,21.5756
2017-02-23,21.4047
2017-02-24,21.3659
2017-02-27,20.597
2017-02-28,19.8903
2017-03-01,19.4243
2017-03-02,19.7039
2017-03-03,19.6262
2017-03-06,19.4631
2017-03-07,18.9738
2017-03-08,18.4146
2017-03-09,18.135
2017-03-10,18.5699
2017-03-13,18.7253
2017-03-14,18.7719
2017-03-15,19.0282
2017-03-16,19.0903
2017-03-17,19.1524
2017-03-20,18.7952
2017-03-21,18.5932
2017-03-22,18.6398
2017-03-23,18.8961
2017-03-24,18.9272
2017-03-27,18.601
2017-03-28,18.6321
2017-03-29,18.7874
2017-03-30,18.2981
2017-03-31,18.7719
2017-04-03,18.7563
2017-04-04,18.6942
2017-04-05,18.5311
2017-04-06,22.2824
2017-04-07,22.8338
2017-04-10,23.2454
2017-04-11,23.2299
2017-04-12,23.2066
2017-04-13,23.1833
2017-04-17,23.3386
2017-04-18,23.5328
2017-04-19,23.2998
2017-04-20,23.4706
2017-04-21,23.4706
2017-04-24,23.4318
2017-04-25,24.0454
2017-04-26,24.0764
2017-04-27,23.6881
2017-04-28,23.6027
2017-05-01,23.1367
2017-05-02,23.0901
2017-05-03,22.7639
2017-05-04,23.1134
2017-05-05,23.9645
2017-05-08,24.0684
2017-05-09,23.9645
2017-05-10,24.4598
2017-05-11,24.5397
2017-05-12,24.356
2017-05-15,24.4598
2017-05-16,24.316
2017-05-17,23.9326
2017-05-18,24.0524
2017-05-19,24.2281
2017-05-22,24.2761
2017-05-23,24.316
2017-05-24,24.4358
2017-05-25,24.348
2017-05-26,24.2441
2017-05-30,23.8048
2017-05-31,23.8208
2017-06-01,24.1483
2017-06-02,24.324
2017-06-05,24.1243
2017-06-06,23.9805
2017-06-07,23.685
2017-06-08,23.9246
2017-06-09,23.9805
2017-06-12,23.9725
2017-06-13,23.9885
2017-06-14,23.8048
2017-06-15,23.7249
2017-06-16,23.9006
2017-06-19,23.8926
2017-06-20,23.5172
2017-06-21,23.5012
2017-06-22,24.0524
2017-06-23,24.2601
2017-06-26,24.348
2017-06-27,24.1083
2017-06-28,24.2441
2017-06-29,24.4758
2017-06-30,24.4518
2017-07-03,24.4678
2017-07-05,24.2441
2017-07-06,24.1563
2017-07-07,24.5157
2017-07-10,24.1163
2017-07-11,24.2441
2017-07-12,24.308
2017-07-13,24.4997
2017-07-14,24.6515
2017-07-17,24.7314
2017-07-18,24.8752
2017-07-19,24.8752
2017-07-20,24.8273
2017-07-21,24.3799
2017-07-24,25.0749
2017-07-25,25.4024
2017-07-26,25.1148
2017-07-27,25.4503
2017-07-28,25.8577
2017-07-31,25.8178
2017-08-01,25.6148
2017-08-02,25.6021
2017-08-03,25.418
2017-08-04,25.6148
2017-08-07,25.2213
2017-08-08,24.8113
2017-08-09,26.033
2017-08-10,25.5574
2017-08-11,25.4344
2017-08-14,25.6148
2017-08-15,25.0491
2017-08-16,25.0491
2017-08-17,24.9999
2017-08-18,24.9589
2017-08-21,24.8605
2017-08-22,25.2295
2017-08-23,25.5492
2017-08-24,25.541
2017-08-25,25.5984
2017-08-28,25.4426
2017-08-29,25.6066
2017-08-30,25.7706
2017-08-31,25.6722
2017-09-01,26.2134
2017-09-05,25.6804
2017-09-06,25.9428
2017-09-07,26.1478
2017-09-08,26.1232
2017-09-11,26.0002
2017-09-12,25.9346
2017-09-13,26.0494
2017-09-14,25.9264
2017-09-15,25.9428
2017-09-18,25.8444
2017-09-19,25.8198
2017-09-20,25.541
2017-09-21,25.2295
2017-09-22,25.3361
2017-09-25,25.2213
2017-09-26,25.4016
2017-09-27,25.3279
2017-09-28,25.1229
2017-09-29,25.5
2017-10-02,25.6394
2017-10-03,26.1314
2017-10-04,26.1314
2017-10-05,25.9428
2017-10-06,26.0166
2017-10-09,26.1642
2017-10-10,25.9756
2017-10-11,26.0658
2017-10-12,26.5496
2017-10-13,25.9838
2017-10-16,25.91
2017-10-17,25.6804
2017-10-18,24.9671
2017-10-19,25.2541
2017-10-20,24.9507
2017-10-23,24.6883
2017-10-24,24.8851
2017-10-25,24.6884
2017-10-26,24.9261
2017-10-27,25.3525
2017-10-30,25.2951
2017-10-31,25.3935
2017-11-01,25.7624
2017-11-02,25.2377
2017-11-03,25.2541
2017-11-06,25.4946
2017-11-07,25.8822
2017-11-08,25.9411
2017-11-09,25.958
2017-11-10,26.0085
2017-11-13,25.8653
2017-11-14,25.5452
2017-11-15,25.4525
2017-11-16,25.5957
2017-11-17,25.6715
2017-11-20,25.7305
2017-11-21,25.4778
2017-11-22,25.4862
2017-11-24,25.621
2017-11-27,25.4019
2017-11-28,24.6268
2017-11-29,24.4246
2017-11-30,24.7363
2017-12-01,24.8122
2017-12-04,24.5004
2017-12-05,24.2224
2017-12-06,24.7195
2017-12-07,24.8459
2017-12-08,24.5678
2017-12-11,24.551
2017-12-12,24.3488
2017-12-13,24.5257
2017-12-14,24.5341
2017-12-15,24.2224
2017-12-18,24.2224
2017-12-19,23.8601
2017-12-20,23.9275
2017-12-21,23.8854
2017-12-22,23.9781
2017-12-26,23.8348
2017-12-27,23.6242
2017-12-28,23.8348
2017-12-29,23.9275
2018-01-02,24.3235
2018-01-03,24.7195
2018-01-04,24.4078
2018-01-05,24.0202
2018-01-08,24.6015
2018-01-09,25.4441
2018-01-10,25.6126
2018-01-11,25.9496
2018-01-12,26.6152
2018-01-16,27.0617
2018-01-17,26.4214
2018-01-18,26.4803
2018-01-19,26.7668
2018-01-22,27.4071
2018-01-23,27.306
2018-01-24,27.4155
2018-01-25,26.9606
2018-01-26,27.2807
2018-01-29,26.9606
2018-01-30,26.4635
2018-01-31,26.8848
2018-02-01,27.3397
2018-02-02,26.4888
2018-02-05,25.9571
2018-02-06,26.1215
2018-02-07,25.9052
2018-02-08,25.4033
2018-02-09,25.8013
2018-02-12,26.5973
2018-02-13,26.5627
2018-02-14,26.7185
2018-02-15,26.7358
2018-02-16,26.3118
2018-02-20,26.0263
2018-02-21,25.9571
2018-02-22,26.1215
2018-02-23,26.381
2018-02-26,25.8446
2018-02-27,25.386
2018-02-28,25.0226
2018-03-01,24.7804
2018-03-02,24.6679
2018-03-05,24.4343
2018-03-06,24.5035
2018-03-07,24.2266
2018-03-08,23.8632
2018-03-09,24.0882
2018-03-12,24.2439
2018-03-13,24.2439
2018-03-14,23.9497
2018-03-15,23.6296
2018-03-16,24.1141
2018-03-19,23.3008
2018-03-20,23.1537
2018-03-21,22.9547
2018-03-22,22.6086
2018-03-23,22.7903
2018-03-26,22.6
2018-03-27,22.4269
2018-03-28,22.176
2018-03-29,22.0722
2018-04-02,22.0722
2018-04-03,22.0549
2018-04-04,22.4702
2018-04-05,23.0672
2018-04-06,22.8682
2018-04-09,22.8682
2018-04-10,23.4133
2018-04-11,23.9151
2018-04-12,23.8805
2018-04-13,23.768
2018-04-16,24.3391
2018-04-17,24.4775
2018-04-18,24.5467
2018-04-19,24.2006
2018-04-20,24.166
2018-04-23,24.2266
2018-04-24,23.9065
2018-04-25,24.0276
2018-04-26,24.0103
2018-04-27,23.4306
2018-04-30,23.8113
2018-05-01,23.9411
2018-05-02,23.8719
2018-05-03,23.6729
2018-05-04,23.9633
2018-05-07,23.9186
2018-05-08,23.5083
2018-05-09,23.9186
2018-05-10,23.9186
2018-05-11,23.8651
2018-05-14,24.1238
2018-05-15,24.0882
2018-05-16,24.0525
2018-05-17,23.9722
2018-05-18,23.9454
2018-05-21,23.7135
2018-05-22,23.3298
2018-05-23,23.2941
2018-05-24,22.964
2018-05-25,23.1603
2018-05-29,23.2049
2018-05-30,23.8116
2018-05-31,23.7313
2018-06-01,23.3655
2018-06-04,23.3744
2018-06-05,23.5796
2018-06-06,23.3477
2018-06-07,23.312
2018-06-08,23.3744
2018-06-11,23.6688
2018-06-12,23.4636
2018-06-13,23.2852
2018-06-14,23.0533
2018-06-15,22.625
2018-06-18,23.0086
2018-06-19,22.8748
2018-06-20,22.7588
2018-06-21,22.5715
2018-06-22,22.4644
2018-06-25,22.0362
2018-06-26,22.0184
2018-06-27,22.3217
2018-06-28,22.0719
2018-06-29,22.2682
2018-07-02,21.8756
2018-07-03,22.4287
2018-07-05,22.3485
2018-07-06,22.2057
2018-07-09,22.4823
2018-07-10,22.4377
2018-07-11,22.4198
2018-07-12,22.4912
2018-07-13,22.5893
2018-07-16,22.9284
2018-07-17,22.6429
2018-07-18,22.8481
2018-07-19,23.0354
2018-07-20,23.0176
2018-07-23,23.4547
2018-07-24,23.3387
2018-07-25,23.5618
2018-07-26,23.7491
2018-07-27,23.4993
2018-07-30,23.6153
2018-07-31,23.8116
2018-08-01,23.9989
2018-08-02,24.5164
2018-08-03,24.7751
2018-08-06,24.6055
2018-08-07,23.9894
2018-08-08,23.8607
2018-08-09,25.2583
2018-08-10,25.5801
2018-08-13,24.9916
2018-08-14,24.7802
2018-08-15,24.4124
2018-08-16,24.5135
2018-08-17,24.771
2018-08-20,25.1663
2018-08-21,25.5617
2018-08-22,25.5893
2018-08-23,25.2123
2018-08-24,25.3043
2018-08-27,25.3686
2018-08-28,25.3135
2018-08-29,25.2583
2018-08-30,25.102
2018-08-31,24.9089
2018-09-04,25.1296
2018-09-05,25.1755
2018-09-06,24.8445
2018-09-07,24.7618
2018-09-10,25.3502
2018-09-11,25.4974
2018-09-12,25.6537
2018-09-13,25.5341
2018-09-14,25.6261
2018-09-17,25.5066
2018-09-18,25.7916
2018-09-19,25.8008
2018-09-20,25.9203
2018-09-21,25.9571
2018-09-24,26.0123
2018-09-25,26.2697
2018-09-26,26.5272
2018-09-27,26.895
2018-09-28,27.1708
2018-10-01,27.3731
2018-10-02,27.3547
2018-10-03,27.5938
2018-10-04,27.2812
2018-10-05,27.4283
2018-10-08,27.9892
2018-10-09,27.9708
2018-10-10,27.603
2018-10-11,27.1984
2018-10-12,26.7663
2018-10-15,26.7111
2018-10-16,27.2076
2018-10-17,26.9961
2018-10-18,26.9961
2018-10-19,26.7846
2018-10-22,26.849
2018-10-23,26.5548
2018-10-24,25.5341
2018-10-25,25.3043
2018-10-26,24.725
2018-10-29,24.7526
2018-10-30,24.6882
2018-10-31,25.1388
2018-11-01,25.7364
2018-11-02,25.3319
2018-11-05,25.2233
2018-11-06,25.0338
2018-11-07,25.375
2018-11-08,26.958
2018-11-09,26.9674
2018-11-12,27.3466
2018-11-13,26.8442
2018-11-14,26.6167
2018-11-15,26.6167
2018-11-16,26.067
2018-11-19,25.3181
2018-11-20,25.4698
2018-11-21,26.4651
2018-11-23,26.4366
2018-11-26,26.74
2018-11-27,26.3892
2018-11-28,26.702
2018-11-29,26.7589
2018-11-30,26.503
2018-12-03,26.4461
2018-12-04,25.8869
2018-12-06,26.067
2018-12-07,25.7731
2018-12-10,25.7636
2018-12-11,25.9627
2018-12-12,26.1807
2018-12-13,26.4651
2018-12-14,26.2565
2018-12-17,25.5835
2018-12-18,25.4224
2018-12-19,25.5077
2018-12-20,24.8063
2018-12-21,23.9342
2018-12-24,22.8631
2018-12-26,24.1901
2018-12-27,24.5598
2018-12-28,24.9484
2018-12-31,25.7731
2019-01-02,25.7068
2019-01-03,25.8015
2019-01-04,26.1238
2019-01-07,26.5883
2019-01-08,26.8347
2019-01-09,27.0812
2019-01-10,27.0528
2019-01-11,26.7684
2019-01-14,27.3087
2019-01-15,27.4603
2019-01-16,27.4793
2019-01-17,27.5457
2019-01-18,27.612
2019-01-22,27.6878
2019-01-23,28.0196
2019-01-24,28.4082
2019-01-25,28.9011
2019-01-28,28.5883
2019-01-29,28.6073
2019-01-30,29.0528
2019-01-31,29.0338
2019-02-01,29.3277
2019-02-04,29.4794
2019-02-05,29.4165
2019-02-06,28.5986
2019-02-07,28.287
2019-02-08,28.2967
2019-02-11,28.6668
2019-02-12,29.2997
2019-02-13,29.4165
2019-02-14,29.3581
2019-02-15,29.5431
2019-02-19,29.475
2019-02-20,29.066
2019-02-21,28.7154
2019-02-22,29.0757
2019-02-25,29.5236
2019-02-26,29.3971
2019-02-27,29.3094
2019-02-28,29.1926
2019-03-01,29.3094
2019-03-04,29.1926
2019-03-05,29.066
2019-03-06,28.9978
2019-03-07,28.7836
2019-03-08,28.8712
2019-03-11,29.2121
2019-03-12,29.1147
2019-03-13,29.1634
2019-03-14,29.2218
2019-03-15,29.4263
2019-03-18,29.6989
2019-03-19,29.7768
2019-03-20,29.9034
2019-03-21,30.1371
2019-03-22,29.9813
2019-03-25,29.8742
2019-03-26,30.0397
2019-03-27,30.03
2019-03-28,30.2832
2019-03-29,30.3416
2019-04-01,30.6337
2019-04-02,30.8285
2019-04-03,30.5753
2019-04-04,30.3805
2019-04-05,30.3318
2019-04-08,30.176
2019-04-09,29.845
2019-04-10,29.7087
2019-04-11,29.9813
2019-04-12,30.0981
2019-04-15,30.03
2019-04-16,29.5626
2019-04-17,29.5236
2019-04-18,29.4944
2019-04-22,30.0397
2019-04-23,29.8839
2019-04-24,29.7866
2019-04-25,29.6015
2019-04-26,30.0008
2019-04-29,29.9034
2019-04-30,30.1176
2019-05-01,30.2539
2019-05-02,30.3611
2019-05-03,30.6045
2019-05-06,30.28
2019-05-07,29.79
2019-05-08,29.63
2019-05-09,30.13
2019-05-10,30.6
2019-05-13,30.46
2019-05-14,30.73
2019-05-15,30.31
2019-05-16,30.35
2019-05-17,30.44
2019-05-20,30.35
2019-05-21,30.68
2019-05-22,30.61
2019-05-23,30.19
2019-05-24,30.09
2019-05-28,29.94
2019-05-29,29.78
2019-05-30,30
2019-05-31,29.96
2019-06-03,30.31
2019-06-04,30.91
2019-06-05,30.59
2019-06-06,30.89
2019-06-07,30.87
2019-06-10,31.05
2019-06-11,30.9
2019-06-12,30.62
2019-06-13,31
2019-06-14,30.93
2019-06-17,30.92
2019-06-18,30.7
2019-06-19,31.04
2019-06-20,30.905
2019-06-21,31.04
2019-06-24,31.06
2019-06-25,30.915
2019-06-26,30.95
2019-06-27,31.315
2019-06-28,31.47
2019-07-01,31.33
2019-07-02,31.765
2019-07-03,32.085
2019-07-04,32.085
2019-07-05,32.425
2019-07-08,32.49
2019-07-09,32.32
2019-07-10,32.45
2019-07-11,32.49
2019-07-12,32.89
2019-07-15,33.11
2019-07-16,33.55
2019-07-17,33.13
2019-07-18,32.87
2019-07-19,33.43
2019-07-22,33.73
2019-07-23,33.65
2019-07-24,33.58
2019-07-25,33.735
2019-07-26,33.825
2019-07-29,33.91
2019-07-30,33.75
2019-07-31,33.76
2019-08-01,33.56
2019-08-02,33.51
2019-08-05,31.71
2019-08-06,32.45
2019-08-07,31.74
2019-08-08,31.04
2019-08-09,30.625
2019-08-12,30.61
2019-08-13,30.9
2019-08-14,30.49
2019-08-15,29.94
2019-08-16,30.42
2019-08-19,30.53
2019-08-20,30.59
2019-08-21,31.03
2019-08-22,30.96
2019-08-23,30.795
2019-08-26,30.98
2019-08-27,30.715
2019-08-28,31.03
2019-08-29,31.745
2019-08-30,31.405
2019-09-02,31.435
2019-09-03,30.89
2019-09-04,30.835
2019-09-05,30.94
2019-09-06,31.05
2019-09-09,31.355
2019-09-10,31.35
2019-09-11,31.05
2019-09-12,31.41
2019-09-13,31.35
2019-09-16,31.105
2019-09-17,31.46
2019-09-18,31.55
2019-09-19,31.53
2019-09-20,31.94
2019-09-23,32.06
2019-09-24,31.7
2019-09-25,31.25
2019-09-26,31.19
2019-09-27,31.5
2019-09-30,31.53
2019-10-01,31.1
2019-10-02,30.94
2019-10-03,31.11
2019-10-04,31.14
2019-10-07,31.35
2019-10-08,31.53
2019-10-09,31.08
2019-10-10,31.24
2019-10-11,31.6
2019-10-14,31.58
2019-10-15,31.74
2019-10-16,31.91
2019-10-17,32.02
2019-10-18,32.48
2019-10-21,32.35
2019-10-22,32.3
2019-10-23,32.82
2019-10-24,32.665
2019-10-25,32.74
2019-10-28,32.795
2019-10-29,33.22
2019-10-30,33.345
2019-10-31,33.575
2019-11-01,33.915
2019-11-04,32.98
2019-11-05,32.305
2019-11-06,32.57
2019-11-07,32.45
2019-11-08,31.71
2019-11-11,31.76
2019-11-12,31.33
2019-11-13,31.83
2019-11-14,31.72
2019-11-15,32.255
2019-11-18,31.54
2019-11-19,31.19
2019-11-20,31.54
2019-11-21,31.725
2019-11-22,31.305
2019-11-25,31.38
