date,close
2014-06-13,45.3656
2014-06-16,45.5513
2014-06-17,45.7462
2014-06-18,45.6627
2014-06-19,45.8298
2014-06-20,45.8298
2014-06-23,45.6813
2014-06-24,45.3841
2014-06-25,45.6905
2014-06-26,45.4677
2014-06-27,45.6163
2014-06-30,45.9505
2014-07-01,46.6933
2014-07-02,46.8326
2014-07-03,47.2875
2014-07-07,46.9347
2014-07-08,46.7026
2014-07-09,46.8511
2014-07-10,46.879
2014-07-11,46.7769
2014-07-14,47.0554
2014-07-15,46.944
2014-07-16,47.4639
2014-07-17,46.2941
2014-07-18,46.8419
2014-07-21,47.0275
2014-07-22,47.4732
2014-07-23,46.489
2014-07-24,46.4426
2014-07-25,45.5698
2014-07-28,45.5513
2014-07-29,45.5327
2014-07-30,46.1455
2014-07-31,45.2727
2014-08-01,45.4306
2014-08-04,45.6255
2014-08-05,44.8735
2014-08-06,45.1242
2014-08-07,44.6228
2014-08-08,44.9663
2014-08-11,45.4306
2014-08-12,45.3934
2014-08-13,45.9505
2014-08-14,46.1084
2014-08-15,46.489
2014-08-18,46.6933
2014-08-19,46.9904
2014-08-20,47.2504
2014-08-21,47.4547
2014-08-22,47.5196
2014-08-25,47.3432
2014-08-26,47.3525
2014-08-27,47.4454
2014-08-28,47.6125
2014-08-29,47.9839
2014-09-02,47.9746
2014-09-03,48.1139
2014-09-04,48.216
2014-09-05,48.4481
2014-09-08,48.4853
2014-09-09,48.1232
2014-09-10,48.1139
2014-09-11,48.1882
2014-09-12,47.5382
2014-09-15,47.1297
2014-09-16,47.826
2014-09-17,48.1417
2014-09-18,48.7917
2014-09-19,48.216
2014-09-22,47.6775
2014-09-23,47.4639
2014-09-24,48.021
2014-09-25,47.1947
2014-09-26,46.3962
2014-09-29,47.7053
2014-09-30,47.4361
2014-10-01,46.3962
2014-10-02,46.1733
2014-10-03,46.5447
2014-10-06,46.3312
2014-10-07,45.4306
2014-10-08,46.3962
2014-10-09,45.3099
2014-10-10,42.3109
2014-10-13,41.7074
2014-10-14,42.5987
2014-10-15,42.5894
2014-10-16,43.555
2014-10-17,43.555
2014-10-20,43.9728
2014-10-21,45.3284
2014-10-22,44.7899
2014-10-23,45.3656
2014-10-24,45.7462
2014-10-27,46.5169
2014-10-28,46.6376
2014-10-29,46.6654
2014-10-30,48.1417
2014-10-31,47.7425
2014-11-03,48.0117
2014-11-04,47.9932
2014-11-05,48.3181
2014-11-06,48.2624
2014-11-07,47.891
2014-11-10,48.2531
2014-11-11,48.1139
2014-11-12,48.0117
2014-11-13,48.1417
2014-11-14,48.5595
2014-11-17,48.3181
2014-11-18,48.9402
2014-11-19,48.8567
2014-11-20,49.5902
2014-11-21,49.878
2014-11-24,50.2587
2014-11-25,50.2215
2014-11-26,51.2336
2014-11-28,51.5771
2014-12-01,50.9829
2014-12-02,51.6792
2014-12-03,51.9764
2014-12-04,52.0506
2014-12-05,52.487
2014-12-08,51.7721
2014-12-09,51.6792
2014-12-10,50.8807
2014-12-11,51.0943
2014-12-12,50.3329
2014-12-15,49.8966
2014-12-16,49.4787
2014-12-17,50.4629
2014-12-18,51.345
2014-12-19,51.1593
2014-12-22,52.0065
2014-12-23,51.8938
2014-12-24,52.0253
2014-12-26,51.9783
2014-12-29,51.8374
2014-12-30,51.5087
2014-12-31,51.3021
2015-01-02,51.1799
2015-01-05,50.2689
2015-01-06,49.0854
2015-01-07,49.7241
2015-01-08,50.9639
2015-01-09,50.8136
2015-01-12,50.1656
2015-01-13,49.8838
2015-01-14,49.6959
2015-01-15,49.9683
2015-01-16,50.3722
2015-01-20,50.87
2015-01-21,51.5275
2015-01-22,51.9877
2015-01-23,51.7623
2015-01-26,51.7717
2015-01-27,50.7385
2015-01-28,50.3064
2015-01-29,50.5882
2015-01-30,49.5269
2015-02-02,49.6208
2015-02-03,50.3252
2015-02-04,50.6821
2015-02-05,51.1893
2015-02-06,50.6446
2015-02-09,49.9777
2015-02-10,51.6214
2015-02-11,51.922
2015-02-12,52.6546
2015-02-13,52.9645
2015-02-17,53.19
2015-02-18,53.0115
2015-02-19,53.0397
2015-02-20,53.2839
2015-02-23,52.8988
2015-02-24,53.9883
2015-02-25,53.622
2015-02-26,53.8193
2015-02-27,53.5093
2015-03-02,54.9182
2015-03-03,54.0165
2015-03-04,53.932
2015-03-05,53.9132
2015-03-06,53.2369
2015-03-09,53.0491
2015-03-10,51.9689
2015-03-11,52.354
2015-03-12,52.0628
2015-03-13,52.4949
2015-03-16,53.19
2015-03-17,52.833
2015-03-18,53.3214
2015-03-19,53.3872
2015-03-20,54.2325
2015-03-23,53.7535
2015-03-24,53.2651
2015-03-25,50.7761
2015-03-26,50.4098
2015-03-27,52.0253
2015-03-30,52.4667
2015-03-31,51.9407
2015-04-01,51.4335
2015-04-02,51.5744
2015-04-06,51.7059
2015-04-07,51.7341
2015-04-08,51.9877
2015-04-09,52.5043
2015-04-10,52.8143
2015-04-13,52.4479
2015-04-14,51.9689
2015-04-15,52.9364
2015-04-16,52.7015
2015-04-17,52.0253
2015-04-20,52.4573
2015-04-21,52.7955
2015-04-22,53.7535
2015-04-23,53.1993
2015-04-24,52.6358
2015-04-27,53.0585
2015-04-28,53.0209
2015-04-29,52.6358
2015-04-30,52.091
2015-05-01,53.575
2015-05-04,53.2839
2015-05-05,52.2695
2015-05-06,52.2601
2015-05-07,52.6358
2015-05-08,53.1336
2015-05-11,53.1148
2015-05-12,52.7109
2015-05-13,52.9739
2015-05-14,53.5187
2015-05-15,53.5938
2015-05-18,54.0635
2015-05-19,53.9695
2015-05-20,54.1292
2015-05-21,54.2325
2015-05-22,54.2795
2015-05-26,53.8474
2015-05-27,55.8574
2015-05-28,55.9326
2015-05-29,56.1768
2015-06-01,55.9795
2015-06-02,55.1812
2015-06-03,54.7961
2015-06-04,54.148
2015-06-05,53.9883
2015-06-08,53.0209
2015-06-09,53.0772
2015-06-10,53.885
2015-06-11,53.9507
2015-06-12,53.4905
2015-06-15,53.3402
2015-06-16,53.575
2015-06-17,53.622
2015-06-18,54.3828
2015-06-19,54.1856
2015-06-22,54.6552
2015-06-23,54.3922
2015-06-24,53.9695
2015-06-25,54.0916
2015-06-26,52.5137
2015-06-29,51.0109
2015-06-30,51.2551
2015-07-01,51.4523
2015-07-02,51.7717
2015-07-06,50.9357
2015-07-07,50.6821
2015-07-08,49.3578
2015-07-09,48.8036
2015-07-10,49.6865
2015-07-13,50.1186
2015-07-14,50.5225
2015-07-15,50.2689
2015-07-16,50.2407
2015-07-17,50.2125
2015-07-20,49.8086
2015-07-21,49.7711
2015-07-22,48.5594
2015-07-23,49.2357
2015-07-24,48.0992
2015-07-27,47.9113
2015-07-28,48.907
2015-07-29,49.1042
2015-07-30,49.555
2015-07-31,48.9821
2015-08-03,48.7473
2015-08-04,48.2307
2015-08-05,48.813
2015-08-06,48.2495
2015-08-07,48.3716
2015-08-10,49.5926
2015-08-11,48.4655
2015-08-12,48.5876
2015-08-13,47.9207
2015-08-14,47.5732
2015-08-17,47.9395
2015-08-18,47.0942
2015-08-19,46.6152
2015-08-20,45.0936
2015-08-21,43.9477
2015-08-24,43.2526
2015-08-25,42.8863
2015-08-26,44.8494
2015-08-27,46.3428
2015-08-28,46.7373
2015-08-31,46.54
2015-09-01,45.0936
2015-09-02,46.2113
2015-09-03,46.6715
2015-09-04,45.9389
2015-09-08,47.6859
2015-09-09,46.9627
2015-09-10,47.113
2015-09-11,47.1975
2015-09-14,47.3102
2015-09-15,48.0053
2015-09-16,48.2213
2015-09-17,47.9113
2015-09-18,47.1036
2015-09-21,47.0754
2015-09-22,46.0986
2015-09-23,45.7698
2015-09-24,45.7511
2015-09-25,45.9953
2015-09-28,45.0184
2015-09-29,45.3284
2015-09-30,46.85
2015-10-01,46.54
2015-10-02,47.2727
2015-10-05,48.1086
2015-10-06,48.3058
2015-10-07,49.0291
2015-10-08,49.6584
2015-10-09,49.0854
2015-10-12,49.1606
2015-10-13,48.5594
2015-10-14,50.0153
2015-10-15,50.3534
2015-10-16,50.56
2015-10-19,50.5976
2015-10-20,50.4943
2015-10-21,50.5882
2015-10-22,52.1286
2015-10-23,52.7203
2015-10-26,51.7153
2015-10-27,51.396
2015-10-28,51.9126
2015-10-29,50.5694
2015-10-30,50.917
2015-11-02,51.396
2015-11-03,51.8374
2015-11-04,52.1756
2015-11-05,50.823
2015-11-06,51.8374
2015-11-09,51.4242
2015-11-10,50.607
2015-11-11,50.6258
2015-11-12,49.9777
2015-11-13,49.4611
2015-11-16,50.0998
2015-11-17,50.607
2015-11-18,50.87
2015-11-19,51.2645
2015-11-20,51.4617
2015-11-23,50.8794
2015-11-24,51.4148
2015-11-25,51.4899
2015-11-27,51.7435
2015-11-30,52.4104
2015-12-01,53.0303
2015-12-02,52.8236
2015-12-03,52.4667
2015-12-04,53.3496
2015-12-07,52.9082
2015-12-08,52.4292
2015-12-09,51.875
2015-12-10,52.0628
2015-12-11,51.0578
2015-12-14,50.6728
2015-12-15,51.4711
2015-12-16,51.875
2015-12-17,51.1799
2015-12-18,50.4755
2015-12-21,51.3593
2015-12-22,51.58
2015-12-23,51.8583
2015-12-24,52.0023
2015-12-28,51.8775
2015-12-29,52.4533
2015-12-30,51.9447
2015-12-31,51.129
2016-01-04,50.5916
2016-01-05,50.1214
2016-01-06,48.8259
2016-01-07,47.3193
2016-01-08,46.5708
2016-01-11,46.993
2016-01-12,47.3961
2016-01-13,46.0046
2016-01-14,47.2233
2016-01-15,44.8147
2016-01-19,45.1122
2016-01-20,45.2273
2016-01-21,45.8511
2016-01-22,46.7243
2016-01-25,46.1965
2016-01-26,46.59
2016-01-27,46.0718
2016-01-28,45.8319
2016-01-29,47.7127
2016-02-01,47.9239
2016-02-02,46.6092
2016-02-03,46.6763
2016-02-04,47.5784
2016-02-05,45.9182
2016-02-08,44.9394
2016-02-09,44.7475
2016-02-10,44.1045
2016-02-11,43.7879
2016-02-12,44.6515
2016-02-16,46.1677
2016-02-17,47.2713
2016-02-18,47.0794
2016-02-19,47.1658
2016-02-22,47.9335
2016-02-23,47.1274
2016-02-24,47.7319
2016-02-25,48.2885
2016-02-26,48.5572
2016-02-29,48.3941
2016-03-01,49.8815
2016-03-02,50.1406
2016-03-03,50.2558
2016-03-04,50.582
2016-03-07,50.774
2016-03-08,49.8143
2016-03-09,50.1694
2016-03-10,50.4381
2016-03-11,51.4553
2016-03-14,51.225
2016-03-15,51.0523
2016-03-16,51.6472
2016-03-17,52.0023
2016-03-18,52.6644
2016-03-21,52.6644
2016-03-22,52.6356
2016-03-23,52.0119
2016-03-24,51.9255
2016-03-28,51.9063
2016-03-29,52.626
2016-03-30,53.1538
2016-03-31,52.8564
2016-04-01,53.1059
2016-04-04,52.6932
2016-04-05,52.2998
2016-04-06,52.7892
2016-04-07,52.0887
2016-04-08,52.3382
2016-04-11,52.3957
2016-04-12,52.3094
2016-04-13,53.3746
2016-04-14,52.7988
2016-04-15,52.4053
2016-04-18,52.4725
2016-04-19,52.0311
2016-04-20,52.2806
2016-04-21,51.9927
2016-04-22,52.0215
2016-04-25,51.7624
2016-04-26,52.319
2016-04-27,52.9331
2016-04-28,51.6184
2016-04-29,50.3421
2016-05-02,50.678
2016-05-03,50.1502
2016-05-04,49.6128
2016-05-05,49.7951
2016-05-06,49.8047
2016-05-09,49.7568
2016-05-10,50.3133
2016-05-11,50.083
2016-05-12,49.1906
2016-05-13,49.3345
2016-05-16,50.3229
2016-05-17,49.8527
2016-05-18,50.7356
2016-05-19,50.2941
2016-05-20,51.9639
2016-05-23,52.2998
2016-05-24,53.5665
2016-05-25,53.864
2016-05-26,54.0463
2016-05-27,54.4014
2016-05-31,54.6029
2016-06-01,54.8236
2016-06-02,54.814
2016-06-03,54.9196
2016-06-06,54.7852
2016-06-07,55.361
2016-06-08,55.3706
2016-06-09,55.3706
2016-06-10,54.411
2016-06-13,54.1806
2016-06-14,54.1135
2016-06-15,54.0559
2016-06-16,54.0847
2016-06-17,53.72
2016-06-20,54.6221
2016-06-21,54.8812
2016-06-22,54.814
2016-06-23,56.1863
2016-06-24,52.9043
2016-06-27,51.273
2016-06-28,52.674
2016-06-29,53.7488
2016-06-30,54.7084
2016-07-01,54.3054
2016-07-05,53.4417
2016-07-06,53.5185
2016-07-07,54.1231
2016-07-08,55.6009
2016-07-11,56.3494
2016-07-12,56.9636
2016-07-13,56.9732
2016-07-14,57.453
2016-07-15,57.2898
2016-07-18,58.9596
2016-07-19,58.7293
2016-07-20,59.6313
2016-07-21,59.1227
2016-07-22,59.4778
2016-07-25,59.7561
2016-07-26,61.4834
2016-07-27,61.2627
2016-07-28,61.1859
2016-07-29,60.9364
2016-08-01,61.1092
2016-08-02,60.3031
2016-08-03,60.4566
2016-08-04,60.8884
2016-08-05,61.5986
2016-08-08,61.5986
2016-08-09,62.0112
2016-08-10,61.5986
2016-08-11,61.8481
2016-08-12,62.1072
2016-08-15,62.8077
2016-08-16,62.443
2016-08-17,62.3087
2016-08-18,62.7885
2016-08-19,63.1148
2016-08-22,63.134
2016-08-23,63.4411
2016-08-24,62.9421
2016-08-25,63.1532
2016-08-26,63.4219
2016-08-29,63.6426
2016-08-30,63.537
2016-08-31,63.537
2016-09-01,64.1224
2016-09-02,64.0648
2016-09-06,64.0552
2016-09-07,63.633
2016-09-08,63.5082
2016-09-09,61.2051
2016-09-12,62.4622
2016-09-13,61.7809
2016-09-14,62.2991
2016-09-15,63.8441
2016-09-16,63.8729
2016-09-19,64.0936
2016-09-20,63.8537
2016-09-21,64.7366
2016-09-22,65.0436
2016-09-23,64.2855
2016-09-26,63.6906
2016-09-27,64.7366
2016-09-28,64.8229
2016-09-29,65.6194
2016-09-30,66.6654
2016-10-03,66.1472
2016-10-04,65.8689
2016-10-05,66.3775
2016-10-06,66.7614
2016-10-07,66.8094
2016-10-10,66.5982
2016-10-11,65.226
2016-10-12,65.226
2016-10-13,64.4775
2016-10-14,64.8901
2016-10-17,64.6214
2016-10-18,65.3507
2016-10-19,64.679
2016-10-20,65.2452
2016-10-21,65.1588
2016-10-24,65.9937
2016-10-25,65.8113
2016-10-26,65.6194
2016-10-27,65.4275
2016-10-28,65.0532
2016-10-31,65.5139
2016-11-01,64.9093
2016-11-02,64.5062
2016-11-03,64.2376
2016-11-04,63.9017
2016-11-07,65.8209
2016-11-08,65.9361
2016-11-09,65.4083
2016-11-10,64.1896
2016-11-11,65.7922
2016-11-14,65.082
2016-11-15,66.1664
2016-11-16,66.6846
2016-11-17,67.1068
2016-11-18,67.4907
2016-11-21,67.9321
2016-11-22,68.719
2016-11-23,68.6135
2016-11-25,68.815
2016-11-28,68.6423
2016-11-29,68.3832
2016-11-30,68.1912
2016-12-01,64.9477
2016-12-02,65.9937
2016-12-05,66.6558
2016-12-06,67.3851
2016-12-07,68.7286
2016-12-08,69.1413
2016-12-09,68.7862
2016-12-12,68.4983
2016-12-13,69.717
2016-12-14,68.9685
2016-12-15,70.0721
2016-12-16,69.17
2016-12-19,70.0271
2016-12-20,70.1335
2016-12-21,70.0658
2016-12-22,70.4237
2016-12-23,70.7526
2016-12-27,71.3524
2016-12-28,70.1722
2016-12-29,70.1916
2016-12-30,69.3016
2017-01-03,69.4177
2017-01-04,69.6402
2017-01-05,69.2339
2017-01-06,69.5918
2017-01-09,70.3947
2017-01-10,70.6656
2017-01-11,70.9655
2017-01-12,69.7853
2017-01-13,70.8204
2017-01-17,69.9884
2017-01-18,71.2266
2017-01-19,70.6849
2017-01-20,71.3621
2017-01-23,70.7333
2017-01-24,72.1166
2017-01-25,73.0066
2017-01-26,72.4455
2017-01-27,73.3742
2017-01-30,73.0259
2017-01-31,72.0102
2017-02-01,72.7454
2017-02-02,72.8228
2017-02-03,73.142
2017-02-06,73.055
2017-02-07,73.3645
2017-02-08,73.4419
2017-02-09,72.8034
2017-02-10,72.8808
2017-02-13,73.8385
2017-02-14,73.2678
2017-02-15,74.0223
2017-02-16,74.3028
2017-02-17,74.5737
2017-02-21,75.2799
2017-02-22,74.951
2017-02-23,74.119
2017-02-24,74.2255
2017-02-27,74.5834
2017-02-28,73.8966
2017-03-01,74.7575
2017-03-02,74.0997
2017-03-03,74.3609
2017-03-06,74.3899
2017-03-07,74.5737
2017-03-08,74.6511
2017-03-09,74.6801
2017-03-10,75.3863
2017-03-13,75.7539
2017-03-14,75.483
2017-03-15,76.1698
2017-03-16,76.2279
2017-03-17,76.431
2017-03-20,76.9008
2017-03-21,75.4443
2017-03-22,76.1795
2017-03-23,75.9474
2017-03-24,76.5471
2017-03-27,76.8954
2017-03-28,77.0405
2017-03-29,76.7309
2017-03-30,77.1179
2017-03-31,77.1082
2017-04-03,76.9244
2017-04-04,76.6535
2017-04-05,76.1989
2017-04-06,76.2376
2017-04-07,76.5374
2017-04-10,75.8603
2017-04-11,75.2896
2017-04-12,74.3125
2017-04-13,73.7611
2017-04-17,74.564
2017-04-18,74.8639
2017-04-19,75.2702
2017-04-20,76.3536
2017-04-21,76.0441
2017-04-24,77.1469
2017-04-25,77.9208
2017-04-26,77.3307
2017-04-27,78.3658
2017-04-28,77.0985
2017-05-01,77.9014
2017-05-02,77.4855
2017-05-03,77.9304
2017-05-04,77.8531
2017-05-05,78.1626
2017-05-08,77.9691
2017-05-09,78.7527
2017-05-10,79.7491
2017-05-11,79.9232
2017-05-12,80.1457
2017-05-15,81.0357
2017-05-16,82.003
2017-05-17,78.9171
2017-05-18,80.0877
2017-05-19,81.0163
2017-05-22,81.7902
2017-05-23,81.6161
2017-05-24,81.974
2017-05-25,82.5351
2017-05-26,82.6898
2017-05-30,83.2799
2017-05-31,83.1832
2017-06-01,83.338
2017-06-02,83.9861
2017-06-05,84.2086
2017-06-06,84.4021
2017-06-07,85.0309
2017-06-08,86.153
2017-06-09,82.893
2017-06-12,82.39
2017-06-13,82.922
2017-06-14,82.2062
2017-06-15,81.4516
2017-06-16,81.4033
2017-06-19,82.8446
2017-06-20,81.8096
2017-06-21,82.7479
2017-06-22,82.5351
2017-06-23,82.8736
2017-06-26,82.5544
2017-06-27,80.1941
2017-06-28,81.3549
2017-06-29,79.5266
2017-06-30,79.188
2017-07-03,78.2787
2017-07-05,79.7684
2017-07-06,79.4298
2017-07-07,80.4939
2017-07-10,81.3259
2017-07-11,81.974
2017-07-12,83.1542
2017-07-13,82.9607
2017-07-14,83.9861
2017-07-17,83.7539
2017-07-18,84.0732
2017-07-19,84.9051
2017-07-20,85.0889
2017-07-21,84.6149
2017-07-24,84.344
2017-07-25,84.1119
2017-07-26,85.0018
2017-07-27,83.9281
2017-07-28,83.5314
2017-07-31,83.0381
2017-08-01,83.396
2017-08-02,82.9414
2017-08-03,82.6512
2017-08-04,82.893
2017-08-07,84.3537
2017-08-08,84.1022
2017-08-09,83.9377
2017-08-10,81.6354
2017-08-11,82.39
2017-08-14,84.0151
2017-08-15,84.3247
2017-08-16,84.4988
2017-08-17,82.4964
2017-08-18,82.6802
2017-08-21,82.3706
2017-08-22,83.4734
2017-08-23,83.6475
2017-08-24,83.6379
2017-08-25,83.3767
2017-08-28,83.6185
2017-08-29,83.8507
2017-08-30,85.0212
2017-08-31,85.6887
2017-09-01,86.095
2017-09-05,85.0018
2017-09-06,85.3017
2017-09-07,85.6306
2017-09-08,84.702
2017-09-11,86.2401
2017-09-12,86.569
2017-09-13,86.5883
2017-09-14,86.9656
2017-09-15,88.1167
2017-09-18,89.3453
2017-09-19,89.5774
2017-09-20,88.3876
2017-09-21,88.2231
2017-09-22,88.5811
2017-09-25,86.8011
2017-09-26,86.9075
2017-09-27,88.8713
2017-09-28,89.442
2017-09-29,90.2739
2017-10-02,90.8737
2017-10-03,91.1736
2017-10-04,91.309
2017-10-05,91.4058
2017-10-06,91.7733
2017-10-09,92.4408
2017-10-10,92.9148
2017-10-11,93.5726
2017-10-12,93.3792
2017-10-13,94.0176
2017-10-16,94.5206
2017-10-17,94.5013
2017-10-18,94.8495
2017-10-19,94.6561
2017-10-20,95.1688
2017-10-23,95.5267
2017-10-24,96.1071
2017-10-25,94.8882
2017-10-26,95.4009
2017-10-27,97.3163
2017-10-30,97.355
2017-10-31,98.2933
2017-11-01,98.0322
2017-11-02,98.4965
2017-11-03,99.5799
2017-11-06,100.8665
2017-11-07,100.6634
2017-11-08,100.8955
2017-11-09,98.9318
2017-11-10,99.5025
2017-11-13,99.9185
2017-11-14,99.9185
2017-11-15,98.9898
2017-11-16,101.4469
2017-11-17,99.8798
2017-11-20,101.089
2017-11-21,102.1241
2017-11-22,101.4566
2017-11-24,102.3176
2017-11-27,100.7311
2017-11-28,100.644
2017-11-29,96.378
2017-11-30,96.9777
2017-12-01,96.1361
2017-12-04,94.095
2017-12-05,94.095
2017-12-06,94.3078
2017-12-07,95.2365
2017-12-08,94.8012
2017-12-11,95.3816
2017-12-12,94.4433
2017-12-13,94.5013
2017-12-14,94.4626
2017-12-15,96.0104
2017-12-18,97.7038
2017-12-19,97.6548
2017-12-20,98.2925
2017-12-21,97.2525
2017-12-22,97.2917
2017-12-26,96.1928
2017-12-27,96.5068
2017-12-28,96.86
2017-12-29,95.9672
2018-01-02,98.4789
2018-01-03,99.8722
2018-01-04,100.3824
2018-01-05,101.0299
2018-01-08,101.7266
2018-01-09,100.7748
2018-01-10,99.4405
2018-01-11,99.9114
2018-01-12,100.4216
2018-01-16,100.8828
2018-01-17,103.8949
2018-01-18,104.6602
2018-01-19,104.7583
2018-01-22,105.7886
2018-01-23,106.4754
2018-01-24,104.3168
2018-01-25,102.6292
2018-01-26,105.8965
2018-01-29,105.7003
2018-01-30,103.63
2018-01-31,104.5032
2018-02-01,103.8655
2018-02-02,100.9711
2018-02-05,96.4185
2018-02-06,99.9703
2018-02-07,97.331
2018-02-08,93.4554
2018-02-09,95.8985
2018-02-12,97.9295
2018-02-13,97.7332
2018-02-14,99.8133
2018-02-15,101.0692
2018-02-16,100.8533
2018-02-20,102.8549
2018-02-21,101.7364
2018-02-22,101.393
2018-02-23,103.6693
2018-02-26,105.7591
2018-02-27,105.3667
2018-02-28,104.5327
2018-03-01,102.8647
2018-03-02,104.4738
2018-03-05,105.6806
2018-03-06,107.2309
2018-03-07,107.692
2018-03-08,107.7411
2018-03-09,109.8211
2018-03-12,110.9396
2018-03-13,109.3894
2018-03-14,109.4483
2018-03-15,109.3502
2018-03-16,109.3109
2018-03-19,107.535
2018-03-20,108.2611
2018-03-21,108.4868
2018-03-22,105.5629
2018-03-23,102.1387
2018-03-26,106.2006
2018-03-27,102.5409
2018-03-28,100.2646
2018-03-29,102.3153
2018-04-02,98.5672
2018-04-03,100.3824
2018-04-04,101.6088
2018-04-05,100.4903
2018-04-06,97.5861
2018-04-09,98.2533
2018-04-10,101.2556
2018-04-11,101.2066
2018-04-12,102.8843
2018-04-13,101.9228
2018-04-16,102.1288
2018-04-17,103.993
2018-04-18,102.8157
2018-04-19,98.2336
2018-04-20,97.1053
2018-04-23,95.8494
2018-04-24,95.3588
2018-04-25,94.8781
2018-04-26,96.8698
2018-04-27,96.2419
2018-04-30,95.3294
2018-05-01,96.86
2018-05-02,96.1634
2018-05-03,96.3989
2018-05-04,98.9008
2018-05-07,99.4307
2018-05-08,100.1273
2018-05-09,101.55
2018-05-10,103.2375
2018-05-11,102.4428
2018-05-14,104.2285
2018-05-15,103.0609
2018-05-16,104.5229
2018-05-17,103.8361
2018-05-18,102.5802
2018-05-21,104.0519
2018-05-22,104.7976
2018-05-23,104.9153
2018-05-24,105.2195
2018-05-25,106.2693
2018-05-29,105.4157
2018-05-30,106.0535
2018-05-31,105.1704
2018-06-01,107.4663
2018-06-04,108.2022
2018-06-05,108.8105
2018-06-06,109.5072
2018-06-07,108.6339
2018-06-08,107.8981
2018-06-11,107.7803
2018-06-12,108.1041
2018-06-13,107.8784
2018-06-14,108.0452
2018-06-15,108.2218
2018-06-18,106.9169
2018-06-19,105.6414
2018-06-20,106.2988
2018-06-21,104.9742
2018-06-22,104.5817
2018-06-25,100.8043
2018-06-26,101.7364
2018-06-27,99.2442
2018-06-28,100.245
2018-06-29,100.7356
2018-07-02,100.7748
2018-07-03,99.0088
2018-07-05,101.6775
2018-07-06,102.9726
2018-07-09,103.7478
2018-07-10,104.8663
2018-07-11,101.9817
2018-07-12,103.2179
2018-07-13,103.0021
2018-07-16,102.6881
2018-07-17,104.0421
2018-07-18,105.1018
2018-07-19,104.7583
2018-07-20,104.6504
2018-07-23,104.5817
2018-07-24,103.2768
2018-07-25,103.7968
2018-07-26,105.3274
2018-07-27,104.8074
2018-07-30,104.0912
2018-07-31,103.8949
2018-08-01,104.3463
2018-08-02,105.3961
2018-08-03,105.5629
2018-08-06,106.1222
2018-08-07,106.8384
2018-08-08,107.172
2018-08-09,106.132
2018-08-10,103.6398
2018-08-13,103.7576
2018-08-14,103.5123
2018-08-15,101.7952
2018-08-16,101.6383
2018-08-17,100.8926
2018-08-20,100.7552
2018-08-21,102.8353
2018-08-22,103.2179
2018-08-23,103.3455
2018-08-24,104.9251
2018-08-27,106.5637
2018-08-28,106.966
2018-08-29,107.5743
2018-08-30,106.4263
2018-08-31,106.8875
2018-09-04,107.6626
2018-09-05,107.0739
2018-09-06,104.2972
2018-09-07,103.8361
2018-09-10,104.8467
2018-09-11,103.5319
2018-09-12,102.3447
2018-09-13,103.6006
2018-09-14,104.67
2018-09-17,103.2572
2018-09-18,104.0421
2018-09-19,104.2776
2018-09-20,105.6218
2018-09-21,105.0919
2018-09-24,105.8376
2018-09-25,104.15
2018-09-26,103.2277
2018-09-27,103.8753
2018-09-28,104.4444
2018-10-01,104.7191
2018-10-02,104.6406
2018-10-03,105.0429
2018-10-04,102.6783
2018-10-05,100.3431
2018-10-08,99.1657
2018-10-09,98.9793
2018-10-10,94.4856
2018-10-11,93.6516
2018-10-12,95.506
2018-10-15,94.466
2018-10-16,97.6646
2018-10-17,97.1838
2018-10-18,94.6524
2018-10-19,93.2886
2018-10-22,93.789
2018-10-23,93.4161
2018-10-24,87.1465
2018-10-25,89.6093
2018-10-26,87.9903
2018-10-29,86.9797
2018-10-30,90.6787
2018-10-31,91.6991
2018-11-01,96.1241
2018-11-02,94.5935
2018-11-05,93.7203
2018-11-06,94.6917
2018-11-07,95.8592
2018-11-08,95.4177
2018-11-09,93.6909
2018-11-12,89.5896
2018-11-13,90.7474
2018-11-14,91.2184
2018-11-15,94.103
2018-11-16,92.5037
2018-11-19,89.0304
2018-11-20,88.9519
2018-11-21,89.3443
2018-11-23,89.2168
2018-11-26,90.9927
2018-11-27,91.13
2018-11-28,93.5437
2018-11-29,92.6607
2018-11-30,94.9271
2018-12-03,96.5951
2018-12-04,91.8463
2018-12-06,91.3067
2018-12-07,87.8432
2018-12-10,88.8636
2018-12-11,89.3051
2018-12-12,90.6591
2018-12-13,90.3549
2018-12-14,88.9519
2018-12-17,88.1081
2018-12-18,89.1677
2018-12-19,85.302
2018-12-20,84.62
2018-12-21,83.16
2018-12-24,80.96
2018-12-26,85.51
2018-12-27,86.26
2018-12-28,86.85
2018-12-31,87.28
2019-01-02,87.92
2019-01-03,82.64
2019-01-04,86.49
2019-01-07,88.16
2019-01-08,87.65
2019-01-09,89.89
2019-01-10,90.82
2019-01-11,91.57
2019-01-14,90
2019-01-15,90.24
2019-01-16,89.53
2019-01-17,90.64
2019-01-18,92.88
2019-01-22,90.19
2019-01-23,89.83
2019-01-24,95.12
2019-01-25,96.89
2019-01-28,95.08
2019-01-29,93.82
2019-01-30,96.66
2019-01-31,96.59
2019-02-01,97.82
2019-02-04,98.3
2019-02-05,98.85
2019-02-06,101.3
2019-02-07,99.12
2019-02-08,98.85
2019-02-11,99.28
2019-02-12,101.49
2019-02-13,101.73
2019-02-14,102.03
2019-02-15,102.55
2019-02-19,102.43
2019-02-20,103.36
2019-02-21,102.72
2019-02-22,104.18
2019-02-25,105.13
2019-02-26,104.45
2019-02-27,103.38
2019-02-28,103.33
2019-03-01,104.28
2019-03-04,104.33
2019-03-05,103.84
2019-03-06,102.09
2019-03-07,100.98
2019-03-08,100.95
2019-03-11,103.1
2019-03-12,103.61
2019-03-13,104.03
2019-03-14,103.45
2019-03-15,106.22
2019-03-18,105.93
2019-03-19,107.15
2019-03-20,106.23
2019-03-21,109.89
2019-03-22,106.75
2019-03-25,105.4
2019-03-26,106.38
2019-03-27,104.83
2019-03-28,104.63
2019-03-29,106.33
2019-04-01,108.95
2019-04-02,109.04
2019-04-03,111.58
2019-04-04,111.7
2019-04-05,112.54
2019-04-08,112.77
2019-04-09,111.54
2019-04-10,112.44
2019-04-11,112.33
2019-04-12,113.91
2019-04-15,113.09
2019-04-16,115.85
2019-04-17,117.56
2019-04-18,117.73
2019-04-22,117.64
2019-04-23,118.59
2019-04-24,119.6
2019-04-25,117.24
2019-04-26,115.81
2019-04-29,115.2
2019-04-30,116.25
2019-05-01,115.36
2019-05-02,116.45
2019-05-03,117.49
2019-05-06,115.61
2019-05-07,112.97
2019-05-08,112.16
2019-05-09,110.58
2019-05-10,110.46
2019-05-13,105.34
2019-05-14,108.04
2019-05-15,109.04
2019-05-16,107.5
2019-05-17,105.43
2019-05-20,101.24
2019-05-21,103.55
2019-05-22,101.73
2019-05-23,100.04
2019-05-24,99.43
2019-05-28,98.55
2019-05-29,98.88
2019-05-30,99.64
2019-05-31,98.23
2019-06-03,98.12
2019-06-04,102.14
2019-06-05,101.36
2019-06-06,102.76
2019-06-07,104.09
2019-06-10,106.69
2019-06-11,107.08
2019-06-12,104.76
2019-06-13,104.99
2019-06-14,103.005
2019-06-17,102.02
2019-06-18,106.115
2019-06-19,106.49
2019-06-20,107.53
2019-06-21,107.115
2019-06-24,107.39
2019-06-25,105.91
2019-06-26,108.755
2019-06-27,110.04
2019-06-28,110.5
2019-07-01,113.31
2019-07-02,111.78
2019-07-03,111.57
2019-07-04,111.57
2019-07-05,110.775
2019-07-08,110.12
2019-07-09,110.52
2019-07-10,111.985
2019-07-11,112.09
2019-07-12,114.24
2019-07-15,115.2
2019-07-16,114.06
2019-07-17,114.47
2019-07-18,116.4
2019-07-19,116.52
2019-07-22,118.75
2019-07-23,120.04
2019-07-24,123.305
2019-07-25,121.07
2019-07-26,120.78
2019-07-29,121.26
2019-07-30,120.64
2019-07-31,117.1
2019-08-01,114.805
2019-08-02,113.25
2019-08-05,108.52
2019-08-06,110.09
2019-08-07,110.73
2019-08-08,113.28
2019-08-09,111.47
2019-08-12,110.23
2019-08-13,113.215
2019-08-14,109.73
2019-08-15,109.73
2019-08-16,112.275
2019-08-19,114.17
2019-08-20,113.58
2019-08-21,114.61
2019-08-22,114.545
2019-08-23,109.355
2019-08-26,110.595
2019-08-27,110.6
2019-08-28,111.26
2019-08-29,113.61
2019-08-30,114.525
2019-09-02,114.515
2019-09-03,112.69
2019-09-04,115.86
2019-09-05,119.47
2019-09-06,119.455
2019-09-09,119.95
2019-09-10,120.02
2019-09-11,121.64
2019-09-12,121.98
2019-09-13,122.02
2019-09-16,121.09
2019-09-17,121.565
2019-09-18,121.66
2019-09-19,121.23
2019-09-20,119.25
2019-09-23,119.99
2019-09-24,118.23
2019-09-25,120.13
2019-09-26,120.485
2019-09-27,117.69
2019-09-30,119.1
2019-10-01,118.41
2019-10-02,116.41
2019-10-03,118.08
2019-10-04,120.195
2019-10-07,119.87
2019-10-08,116.585
2019-10-09,118.54
2019-10-10,119.73
2019-10-11,122.44
2019-10-14,122.66
2019-10-15,125.34
2019-10-16,123.305
2019-10-17,123.255
2019-10-18,122.165
2019-10-21,124.275
2019-10-22,123.485
2019-10-23,121.255
2019-10-24,124.45
2019-10-25,127.035
2019-10-28,128.985
2019-10-29,128.11
2019-10-30,128.185
2019-10-31,127.38
2019-11-01,130.06
2019-11-04,132.82
2019-11-05,132.89
2019-11-06,132.105
2019-11-07,132.75
2019-11-08,133.08
2019-11-11,132.6
2019-11-12,132.92
2019-11-13,133.24
2019-11-14,132.845
2019-11-15,134.235
2019-11-18,134.225
2019-11-19,133.99
2019-11-20,132.53
2019-11-21,131.165
2019-11-22,130.935
2019-11-25,133.85
