date,close
2015-11-11,23.89
2015-11-12,24.15
2015-11-13,23.99
2015-11-16,24.21
2015-11-17,24.45
2015-11-18,24.17
2015-11-19,24.11
2015-11-20,24.1
2015-11-23,24.09
2015-11-24,24.12
2015-11-25,24.18
2015-11-27,24.09
2015-11-30,24.19
2015-12-01,24.24
2015-12-02,24.15
2015-12-03,24
2015-12-04,24
2015-12-07,24
2015-12-08,23.85
2015-12-09,23.86
2015-12-10,23.51
2015-12-11,23
2015-12-14,23.05
2015-12-15,23.66
2015-12-16,23.73
2015-12-17,23.8
2015-12-18,23.75
2015-12-21,23.63
2015-12-22,23.87
2015-12-23,24.36
2015-12-24,23.7
2015-12-28,23.36
2015-12-29,23.3
2015-12-30,23.3
2015-12-31,23.39
2016-01-04,23.23
2016-01-05,23.52
2016-01-06,23.93
2016-01-07,23.9
2016-01-08,23.84
2016-01-11,23.94
2016-01-12,23.93
2016-01-13,23.88
2016-01-14,23.47
2016-01-15,23.35
2016-01-19,22.72
2016-01-20,22.96
2016-01-21,22.79
2016-01-22,22.99
2016-01-25,22.09
2016-01-26,21.86
2016-01-27,20.8
2016-01-28,21.21
2016-01-29,22
2016-02-01,21.88
2016-02-02,21.75
2016-02-03,21.9
2016-02-04,22.1
2016-02-05,22.02
2016-02-08,22.11
2016-02-09,22.01
2016-02-10,21.06
2016-02-11,20.88
2016-02-12,20.77
2016-02-16,20.84
2016-02-17,20.65
2016-02-18,20.59
2016-02-19,20.74
2016-02-22,20.9
2016-02-23,20.91
2016-02-24,20.85
2016-02-25,20.99
2016-02-26,20.91
2016-02-29,20.89
2016-03-01,20.92
2016-03-02,20.89
2016-03-03,20.9
2016-03-04,20.78
2016-03-07,21.01
2016-03-08,20.96
2016-03-09,21.18
2016-03-10,20.97
2016-03-11,21.4
2016-03-14,21.47
2016-03-15,21.23
2016-03-16,21.05
2016-03-17,20.83
2016-03-18,21.32
2016-03-21,21.1
2016-03-22,21.19
2016-03-23,21.16
2016-03-24,21.02
2016-03-28,21.31
2016-03-29,20.74
2016-03-30,20.99
2016-03-31,21
2016-04-01,21.02
2016-04-04,21
2016-04-05,21.01
2016-04-06,21.01
2016-04-07,20.67
2016-04-08,21.05
2016-04-11,21.1
2016-04-12,20.96
2016-04-13,20.92
2016-04-14,20.82
2016-04-15,20.97
2016-04-18,20.95
2016-04-19,20.84
2016-04-20,20.98
2016-04-21,20.9
2016-04-22,21.05
2016-04-25,21.1
2016-04-26,21.02
2016-04-27,21.21
2016-04-28,21.01
2016-04-29,20.97
2016-05-02,21
2016-05-03,21.02
2016-05-04,20.98
2016-05-05,20.92
2016-05-06,21.63
2016-05-09,21.38
2016-05-10,21.5
2016-05-11,21.2
2016-05-12,21.5
2016-05-13,21.05
2016-05-16,21.03
2016-05-17,21.37
2016-05-18,21.52
2016-05-19,21.59
2016-05-20,22
2016-05-23,21.84
2016-05-24,22.75
2016-05-25,23.43
2016-05-26,23.2
2016-05-27,23.66
2016-05-31,23.75
2016-06-01,23.45
2016-06-02,22.96
2016-06-03,23
2016-06-06,23.84
2016-06-07,23.18
2016-06-08,23.24
2016-06-09,23.73
2016-06-10,23.6
2016-06-13,23.61
2016-06-14,23.11
2016-06-15,23.25
2016-06-16,23.11
2016-06-17,22.75
2016-06-20,22.44
2016-06-21,22.49
2016-06-22,22.38
2016-06-23,22.05
2016-06-24,21.67
2016-06-27,20.81
2016-06-28,21.39
2016-06-29,21.9
2016-06-30,22.14
2016-07-01,21.42
2016-07-05,21.09
2016-07-06,21.02
2016-07-07,21.14
2016-07-08,21.56
2016-07-11,21.71
2016-07-12,21.82
2016-07-13,21.58
2016-07-14,21.88
2016-07-15,22.94
2016-07-18,23.12
2016-07-19,22.62
2016-07-20,22.7
2016-07-21,22.78
2016-07-22,22.62
2016-07-25,22.55
2016-07-26,22.85
2016-07-27,22.75
2016-07-28,22.74
2016-07-29,22.59
2016-08-01,22.66
2016-08-02,23.1
2016-08-03,23.74
2016-08-04,23.9
2016-08-05,23.9
2016-08-08,23.71
2016-08-09,23.78
2016-08-10,23.43
2016-08-11,23.54
2016-08-12,23.44
2016-08-15,23.47
2016-08-16,23.1
2016-08-17,23.68
2016-08-18,23.8
2016-08-19,23.83
2016-08-22,23.84
2016-08-23,23.82
2016-08-24,23.95
2016-08-25,24.02
2016-08-26,24.09
2016-08-29,24.04
2016-08-30,24.35
2016-08-31,24.19
2016-09-01,24.35
2016-09-02,24.53
2016-09-06,25.7
2016-09-07,25.68
2016-09-08,25.9
2016-09-09,25.73
2016-09-12,25.85
2016-09-13,25.66
2016-09-14,25.55
2016-09-15,25.78
2016-09-16,24.88
2016-09-19,23.98
2016-09-20,25.02
2016-09-21,25.57
2016-09-22,25.92
2016-09-23,25.62
2016-09-26,25.56
2016-09-27,25.37
2016-09-28,25.08
2016-09-29,24.7
2016-09-30,25.94
2016-10-03,25.64
2016-10-04,25.55
2016-10-05,25.68
2016-10-06,25.6
2016-10-07,25.65
2016-10-10,25.75
2016-10-11,25.4
2016-10-12,25.68
2016-10-13,25.01
2016-10-14,24.87
2016-10-17,25.7
2016-10-18,25.67
2016-10-19,26.09
2016-10-20,26.46
2016-10-21,26.92
2016-10-24,27.71
2016-10-25,26.98
2016-10-26,26.88
2016-10-27,26.28
2016-10-28,26.18
2016-10-31,26.03
2016-11-01,26.01
2016-11-02,26.02
2016-11-03,26.07
2016-11-04,26.02
2016-11-07,26.59
2016-11-08,26.37
2016-11-09,27.2
2016-11-10,27.62
2016-11-11,28.5
2016-11-14,29.47
2016-11-15,29.88
2016-11-16,29.91
2016-11-17,30.18
2016-11-18,30.39
2016-11-21,30.48
2016-11-22,31.49
2016-11-23,31.43
2016-11-25,31.17
2016-11-28,31.2
2016-11-29,31.05
2016-11-30,31.32
2016-12-01,31.9
2016-12-02,32.66
2016-12-05,33.23
2016-12-06,35.23
2016-12-07,35.45
2016-12-08,37.34
2016-12-09,36.62
2016-12-12,36.82
2016-12-13,35.75
2016-12-14,35.3
2016-12-15,35.46
2016-12-16,35.04
2016-12-19,35.21
2016-12-20,35
2016-12-21,33.78
2016-12-22,33.71
2016-12-23,33.98
2016-12-27,32.87
2016-12-28,32.55
2016-12-29,33.72
2016-12-30,33.64
2017-01-03,32.65
2017-01-04,32.19
2017-01-05,32.26
2017-01-06,32.5
2017-01-09,32.51
2017-01-10,32.73
2017-01-11,32.55
2017-01-12,32.57
2017-01-13,33.04
2017-01-17,32.75
2017-01-18,33
2017-01-19,32.9
2017-01-20,33
2017-01-23,33.07
2017-01-24,33.13
2017-01-25,34.1
2017-01-26,34.6
2017-01-27,34.7
2017-01-30,33.15
2017-01-31,32.66
2017-02-01,32.96
2017-02-02,32.67
2017-02-03,33.88
2017-02-06,33.41
2017-02-07,32.79
2017-02-08,32.48
2017-02-09,32.82
2017-02-10,34.24
2017-02-13,34.19
2017-02-14,33.85
2017-02-15,33.49
2017-02-16,33.49
2017-02-17,33.5
2017-02-21,33.4
2017-02-22,33.68
2017-02-23,33.39
2017-02-24,32.92
2017-02-27,32.95
2017-02-28,32.54
2017-03-01,32.99
2017-03-02,32.59
2017-03-03,32.42
2017-03-06,32.22
2017-03-07,32.18
2017-03-08,32.57
2017-03-09,32.24
2017-03-10,31.79
2017-03-13,32.58
2017-03-14,31.99
2017-03-15,32.24
2017-03-16,32.38
2017-03-17,33.06
2017-03-20,32.94
2017-03-21,31.2
2017-03-22,30.3
2017-03-23,30.57
2017-03-24,30.6
2017-03-27,30.58
2017-03-28,31.16
2017-03-29,30.6
2017-03-30,31.63
2017-03-31,31.77
2017-04-03,31.19
2017-04-04,31.76
2017-04-05,31
2017-04-06,31.08
2017-04-07,31.1
2017-04-10,30.53
2017-04-11,30.89
2017-04-12,30.5
2017-04-13,29.6
2017-04-17,30.36
2017-04-18,30.69
2017-04-19,31.09
2017-04-20,31.5
2017-04-21,31.49
2017-04-24,31.95
2017-04-25,32.36
2017-04-26,32.47
2017-04-27,32.02
2017-04-28,31.57
2017-05-01,31.87
2017-05-02,31.9
2017-05-03,31.79
2017-05-04,31.75
2017-05-05,31.52
2017-05-08,31.48
2017-05-09,31.06
2017-05-10,30.96
2017-05-11,30.53
2017-05-12,30.39
2017-05-15,30.81
2017-05-16,30.54
2017-05-17,29.7
2017-05-18,29.76
2017-05-19,29.59
2017-05-22,29.92
2017-05-23,30.42
2017-05-24,30.09
2017-05-25,31.22
2017-05-26,30.9
2017-05-30,29.75
2017-05-31,29.74
2017-06-01,30.48
2017-06-02,30.14
2017-06-05,30
2017-06-06,30.2
2017-06-07,30.13
2017-06-08,30.69
2017-06-09,31.06
2017-06-12,31.45
2017-06-13,31.78
2017-06-14,31.91
2017-06-15,31.98
2017-06-16,31.67
2017-06-19,31.9
2017-06-20,31.91
2017-06-21,30.46
2017-06-22,30.42
2017-06-23,30.55
2017-06-26,29.88
2017-06-27,30.03
2017-06-28,31.17
2017-06-29,30.87
2017-06-30,30.64
2017-07-03,31.91
2017-07-05,31.04
2017-07-06,31.55
2017-07-07,31.73
2017-07-10,31.6
2017-07-11,31.61
2017-07-12,31.76
2017-07-13,31.75
2017-07-14,31.57
2017-07-17,33.9
2017-07-18,34.43
2017-07-19,34.43
2017-07-20,34.74
2017-07-21,35.28
2017-07-24,35.54
2017-07-25,35.88
2017-07-26,35.16
2017-07-27,34.53
2017-07-28,34.35
2017-07-31,34.57
2017-08-01,34.75
2017-08-02,34.44
2017-08-03,34.42
2017-08-04,34.45
2017-08-07,34.48
2017-08-08,34.49
2017-08-09,34.2
2017-08-10,34.29
2017-08-11,34.24
2017-08-14,34.5
2017-08-15,33.92
2017-08-16,33.92
2017-08-17,33.83
2017-08-18,34.01
2017-08-21,34.12
2017-08-22,34.01
2017-08-23,34.09
2017-08-24,34.17
2017-08-25,34.1
2017-08-28,34.11
2017-08-29,34.07
2017-08-30,34
2017-08-31,34.15
2017-09-01,34.13
2017-09-05,34.03
2017-09-06,34.16
2017-09-07,34.13
2017-09-08,33.79
2017-09-11,34.09
2017-09-12,34.23
2017-09-13,34.1
2017-09-14,34.1
2017-09-15,33.32
2017-09-18,33.99
2017-09-19,34.27
2017-09-20,34.3
2017-09-21,33.99
2017-09-22,34.46
2017-09-25,34.46
2017-09-26,34.28
2017-09-27,34.5
2017-09-28,35.27
2017-09-29,35.58
2017-10-02,35.75
2017-10-03,36.3
2017-10-04,36.03
2017-10-05,36.24
2017-10-06,36.17
2017-10-09,36.38
2017-10-10,36.62
2017-10-11,36.73
2017-10-12,36.3
2017-10-13,36.17
2017-10-16,36.26
2017-10-17,35.72
2017-10-18,35.76
2017-10-19,35.37
2017-10-20,33.96
2017-10-23,33.9
2017-10-24,34
2017-10-25,34
2017-10-26,34.06
2017-10-27,34.02
2017-10-30,33.64
2017-10-31,34.09
2017-11-01,34.03
2017-11-02,34.26
2017-11-03,34.1
2017-11-06,34.06
2017-11-07,33.93
2017-11-08,34.06
2017-11-09,33.36
2017-11-10,33.15
2017-11-13,33.33
2017-11-14,33.52
2017-11-15,33.18
2017-11-16,33.57
2017-11-17,33.65
2017-11-20,33.99
2017-11-21,34.38
2017-11-22,34.29
2017-11-24,33.8
2017-11-27,34.03
2017-11-28,34.8
2017-11-29,35.16
2017-11-30,34.57
2017-12-01,34.12
2017-12-04,35.08
2017-12-05,34.55
2017-12-06,34.5
2017-12-07,34.05
2017-12-08,34.04
2017-12-11,33.99
2017-12-12,34
2017-12-13,34.06
2017-12-14,33.9
2017-12-15,35.1
2017-12-18,35.13
2017-12-19,35.73
2017-12-20,36.02
2017-12-21,36.65
2017-12-22,36.3
2017-12-26,35.39
2017-12-27,35.33
2017-12-28,35.06
2017-12-29,35.41
2018-01-02,35.67
2018-01-03,35.51
2018-01-04,36.05
2018-01-05,35.96
2018-01-08,35.73
2018-01-09,35.56
2018-01-10,35.68
2018-01-11,35.89
2018-01-12,36.22
2018-01-16,35.72
2018-01-17,36.08
2018-01-18,35.67
2018-01-19,35.69
2018-01-22,35.7
2018-01-23,35.69
2018-01-24,35.45
2018-01-25,35.13
2018-01-26,35.78
2018-01-29,36.04
2018-01-30,36.15
2018-01-31,36.01
2018-02-01,36.23
2018-02-02,36.1
2018-02-05,35.76
2018-02-06,35.62
2018-02-07,35.74
2018-02-08,35.58
2018-02-09,35.86
2018-02-12,35.73
2018-02-13,36.01
2018-02-14,36.3
2018-02-15,36.4
2018-02-16,36.83
2018-02-20,37
2018-02-21,37.71
2018-02-22,37.41
2018-02-23,37.64
2018-02-26,37.65
2018-02-27,37.07
2018-02-28,36.94
2018-03-01,37.85
2018-03-02,38.45
2018-03-05,38.58
2018-03-06,38.61
2018-03-07,38.8
2018-03-08,38.45
2018-03-09,38.86
2018-03-12,38.85
2018-03-13,38.81
2018-03-14,38.69
2018-03-15,38.82
2018-03-16,38.96
2018-03-19,39.78
2018-03-20,39.76
2018-03-21,39.73
2018-03-22,39.3
2018-03-23,37.76
2018-03-26,38.79
2018-03-27,38.73
2018-03-28,38.96
2018-03-29,39.16
2018-04-02,39.05
2018-04-03,39.5
2018-04-04,39.92
2018-04-05,40.13
2018-04-06,39.44
2018-04-09,39.13
2018-04-10,39.6
2018-04-11,39.35
2018-04-12,40.04
2018-04-13,39.92
2018-04-16,40.69
2018-04-17,40.59
2018-04-18,40.55
2018-04-19,40.59
2018-04-20,39.73
2018-04-23,39.37
2018-04-24,39.55
2018-04-25,39.13
2018-04-26,38.85
2018-04-27,38.72
2018-04-30,38.13
2018-05-01,38.3
2018-05-02,38.78
2018-05-03,38.49
2018-05-04,39.11
2018-05-07,39.28
2018-05-08,39.39
2018-05-09,39.76
2018-05-10,39.67
2018-05-11,39.52
2018-05-14,39.36
2018-05-15,39.49
2018-05-16,40.18
2018-05-17,40.14
2018-05-18,39.76
2018-05-21,40.2
2018-05-22,40.37
2018-05-23,40.39
2018-05-24,40.13
2018-05-25,40.7
2018-05-29,40.15
2018-05-30,40.19
2018-05-31,39.81
2018-06-01,40.18
2018-06-04,40.43
2018-06-05,40.32
2018-06-06,40.65
2018-06-07,40.97
2018-06-08,40.97
2018-06-11,40.77
2018-06-12,40.39
2018-06-13,41.68
2018-06-14,41.22
2018-06-15,42.64
2018-06-18,43.75
2018-06-19,43.87
2018-06-20,43.82
2018-06-21,43.13
2018-06-22,42.96
2018-06-25,43.18
2018-06-26,43.06
2018-06-27,42.04
2018-06-28,41.84
2018-06-29,41.48
2018-07-02,42.25
2018-07-03,42.28
2018-07-05,42.55
2018-07-06,42.65
2018-07-09,43.43
2018-07-10,43.12
2018-07-11,42.99
2018-07-12,42.67
2018-07-13,42.15
2018-07-16,42.87
2018-07-17,42.81
2018-07-18,43.12
2018-07-19,43.66
2018-07-20,42.41
2018-07-23,41.88
2018-07-24,40.82
2018-07-25,40.08
2018-07-26,40.58
2018-07-27,40.08
2018-07-30,40.31
2018-07-31,40.5
2018-08-01,40.79
2018-08-02,41.13
2018-08-03,41.13
2018-08-06,41.37
2018-08-07,41.31
2018-08-08,41.46
2018-08-09,41.39
2018-08-10,41.22
2018-08-13,41.16
2018-08-14,41.73
2018-08-15,41.46
2018-08-16,41.79
2018-08-17,41.41
2018-08-20,41.52
2018-08-21,42.47
2018-08-22,42.49
2018-08-23,42.22
2018-08-24,41.99
2018-08-27,41.47
2018-08-28,41.06
2018-08-29,40.59
2018-08-30,40.52
2018-08-31,40.59
2018-09-04,40.84
2018-09-05,40.7
2018-09-06,40.3
2018-09-07,39.93
2018-09-10,39.86
2018-09-11,40
2018-09-12,39.87
2018-09-13,39.89
2018-09-14,40.32
2018-09-17,40.27
2018-09-18,40.35
2018-09-19,40.16
2018-09-20,40.66
2018-09-21,40.79
2018-09-24,40.45
2018-09-25,39.92
2018-09-26,39.14
2018-09-27,39.14
2018-09-28,39.26
2018-10-01,38.61
2018-10-02,38.06
2018-10-03,39.06
2018-10-04,38.97
2018-10-05,38.52
2018-10-08,38.84
2018-10-09,38.75
2018-10-10,37.95
2018-10-11,37.19
2018-10-12,36.28
2018-10-15,37.56
2018-10-16,38.41
2018-10-17,36.82
2018-10-18,35.54
2018-10-19,35.01
2018-10-22,33.49
2018-10-23,33.97
2018-10-24,31.66
2018-10-25,33.52
2018-10-26,35
2018-10-29,35.22
2018-10-30,34.93
2018-10-31,36.09
2018-11-01,36.42
2018-11-02,36.36
2018-11-05,36.3
2018-11-06,36.62
2018-11-07,36.64
2018-11-08,36.94
2018-11-09,36.61
2018-11-12,36.44
2018-11-13,36.37
2018-11-14,36.67
2018-11-15,37.63
2018-11-16,37.81
2018-11-19,37
2018-11-20,37.19
2018-11-21,37
2018-11-23,37.85
2018-11-26,37.8
2018-11-27,37.76
2018-11-28,38.16
2018-11-29,37.69
2018-11-30,37.77
2018-12-03,37.51
2018-12-04,34.92
2018-12-06,35.07
2018-12-07,35.53
2018-12-10,35.72
2018-12-11,35.92
2018-12-12,36.53
2018-12-13,36.2
2018-12-14,36.35
2018-12-17,36.85
2018-12-18,35.65
2018-12-19,35
2018-12-20,34.87
2018-12-21,34.68
2018-12-24,34.24
2018-12-26,35.14
2018-12-27,34.9
2018-12-28,35.08
2018-12-31,35.25
2019-01-02,35.8
2019-01-03,33.32
2019-01-04,33.76
2019-01-07,33.97
2019-01-08,34.03
2019-01-09,33.96
2019-01-10,34.3
2019-01-11,34.08
2019-01-14,33.58
2019-01-15,33.54
2019-01-16,34.28
2019-01-17,34.68
2019-01-18,34.81
2019-01-22,34.7
2019-01-23,34.29
2019-01-24,32.15
2019-01-25,32
2019-01-28,32.87
2019-01-29,32.33
2019-01-30,31.96
2019-01-31,31.75
2019-02-01,32.03
2019-02-04,33.06
2019-02-05,32.69
2019-02-06,32.1
2019-02-07,32.39
2019-02-08,31.99
2019-02-11,32.29
2019-02-12,32.55
2019-02-13,32.75
2019-02-14,32.47
2019-02-15,32.93
2019-02-19,33.1
2019-02-20,33.41
2019-02-21,34.36
2019-02-22,34.08
2019-02-25,33.61
2019-02-26,33.43
2019-02-27,33.89
2019-02-28,33.99
2019-03-01,33.7
2019-03-04,34.07
2019-03-05,33.82
2019-03-06,32.81
2019-03-07,32.26
2019-03-08,32.05
2019-03-11,32.45
2019-03-12,31.98
2019-03-13,32.2
2019-03-14,32.2
2019-03-15,32.22
2019-03-18,32.61
2019-03-19,32.25
2019-03-20,30.56
2019-03-21,29.73
2019-03-22,27.96
2019-03-25,28.01
2019-03-26,28.62
2019-03-27,28.58
2019-03-28,28.77
2019-03-29,28.8
2019-04-01,28.85
2019-04-02,28.28
2019-04-03,28.15
2019-04-04,28.39
2019-04-05,28.92
2019-04-08,28.74
2019-04-09,28.73
2019-04-10,29.09
2019-04-11,29.12
2019-04-12,29.82
2019-04-15,29.4
2019-04-16,29.7
2019-04-17,29.98
2019-04-18,29.8
2019-04-22,29.47
2019-04-23,24.71
2019-04-24,24.7
2019-04-25,24.78
2019-04-26,25.15
2019-04-29,26.31
2019-04-30,26.26
2019-05-01,26.37
2019-05-02,26.28
2019-05-03,26.48
2019-05-06,26.73
2019-05-07,26.85
2019-05-08,26.72
2019-05-09,26.97
2019-05-10,27.03
2019-05-13,26.61
2019-05-14,26.7
2019-05-15,26.52
2019-05-16,26.83
2019-05-17,26.86
2019-05-20,27.11
2019-05-21,26.9
2019-05-22,26.6
2019-05-23,25.97
2019-05-24,25.92
2019-05-28,25.51
2019-05-29,25.64
2019-05-30,25.14
2019-05-31,24.88
2019-06-03,24.82
2019-06-04,25.18
2019-06-05,24.85
2019-06-06,24.61
2019-06-07,24.49
2019-06-10,24.85
2019-06-11,25.08
2019-06-12,25.46
2019-06-13,25.56
2019-06-14,25.97
2019-06-17,25.455
2019-06-18,25.695
2019-06-19,25.78
2019-06-20,26.27
2019-06-21,26.515
2019-06-24,26.335
2019-06-25,26.33
2019-06-26,26.49
2019-06-27,26.565
2019-06-28,26.94
2019-07-01,27.25
2019-07-02,27.22
2019-07-03,27.46
2019-07-04,27.46
2019-07-05,28
2019-07-08,27.805
2019-07-09,26.85
2019-07-10,25.73
2019-07-11,25.615
2019-07-12,26.04
2019-07-15,24.92
2019-07-16,24.81
2019-07-17,24.43
2019-07-18,24.58
2019-07-19,24.6
2019-07-22,24.405
2019-07-23,25.735
2019-07-24,25.94
2019-07-25,26.115
2019-07-26,26.92
2019-07-29,26.375
2019-07-30,26.715
2019-07-31,26.49
2019-08-01,25.41
2019-08-02,26.165
2019-08-05,25.245
2019-08-06,25.39
2019-08-07,24.8
2019-08-08,25.415
2019-08-09,25.69
2019-08-12,25.55
2019-08-13,25.51
2019-08-14,24.77
2019-08-15,24.84
2019-08-16,25.39
2019-08-19,25.545
2019-08-20,25.61
2019-08-21,25.95
2019-08-22,26.11
2019-08-23,25.1
2019-08-26,25.45
2019-08-27,24.865
2019-08-28,25.04
2019-08-29,25.49
2019-08-30,25.29
2019-09-02,25.29
2019-09-03,24.85
2019-09-04,25.07
2019-09-05,25.8
2019-09-06,25.515
2019-09-09,26.05
2019-09-10,26.67
2019-09-11,27.535
2019-09-12,27.69
2019-09-13,28.31
2019-09-16,28.29
2019-09-17,28.17
2019-09-18,28.135
2019-09-19,28.05
2019-09-20,27.555
2019-09-23,27.7
2019-09-24,27.68
2019-09-25,28.485
2019-09-26,27.22
2019-09-27,27.195
2019-09-30,26.87
2019-10-01,26.25
2019-10-02,26.25
2019-10-03,25.875
2019-10-04,25.875
2019-10-07,26.01
2019-10-08,25.59
2019-10-09,25.585
2019-10-10,25.69
2019-10-11,26.245
2019-10-14,26.1
2019-10-15,26.595
2019-10-16,26.42
2019-10-17,26.62
2019-10-18,26.8
2019-10-21,27.21
2019-10-22,28.13
2019-10-23,28.425
2019-10-24,28.27
2019-10-25,28.28
2019-10-28,28.27
2019-10-29,28.415
2019-10-30,28.24
2019-10-31,27.66
2019-11-01,28.25
2019-11-04,28.38
2019-11-05,28.925
2019-11-06,28.77
2019-11-07,29.055
2019-11-08,28.94
2019-11-11,28.775
2019-11-12,28.95
2019-11-13,28.61
2019-11-14,28.655
2019-11-15,28.44
2019-11-18,28.05
2019-11-19,28.61
2019-11-20,28.51
2019-11-21,28.71
2019-11-22,28.575
2019-11-25,29.38
