date,close
2014-06-13,92.9064
2014-06-16,93.3078
2014-06-17,93.751
2014-06-18,94.7713
2014-06-19,95.9587
2014-06-20,97.1462
2014-06-23,96.5775
2014-06-24,96.2263
2014-06-25,96.5692
2014-06-26,95.4235
2014-06-27,96.0591
2014-06-30,96.1176
2014-07-01,95.9838
2014-07-02,95.6075
2014-07-03,96.7113
2014-07-07,96.2514
2014-07-08,95.5406
2014-07-09,95.9587
2014-07-10,94.8632
2014-07-11,94.5455
2014-07-14,94.7378
2014-07-15,94.211
2014-07-16,94.2528
2014-07-17,94.2026
2014-07-18,94.2026
2014-07-21,93.5253
2014-07-22,94.3448
2014-07-23,94.3699
2014-07-24,94.5037
2014-07-25,92.7225
2014-07-28,91.811
2014-07-29,91.7273
2014-07-30,91.719
2014-07-31,90.2974
2014-08-01,89.5113
2014-08-04,90.7406
2014-08-05,90.1468
2014-08-06,90.2221
2014-08-07,89.3022
2014-08-08,90.0465
2014-08-11,90.7071
2014-08-12,90.59
2014-08-13,90.381
2014-08-14,91.4597
2014-08-15,92.0535
2014-08-18,92.597
2014-08-19,92.9399
2014-08-20,92.9399
2014-08-21,92.9399
2014-08-22,92.1036
2014-08-25,93.4082
2014-08-26,93.6674
2014-08-27,93.5922
2014-08-28,93.057
2014-08-29,93.4751
2014-09-02,93.0737
2014-09-03,94.0019
2014-09-04,94.8465
2014-09-05,94.5371
2014-09-08,93.1991
2014-09-09,93.2242
2014-09-10,93.4165
2014-09-11,93.751
2014-09-12,92.781
2014-09-15,95.7078
2014-09-16,95.7162
2014-09-17,94.7127
2014-09-18,95.9253
2014-09-19,96.0089
2014-09-22,95.7998
2014-09-23,95.3315
2014-09-24,95.574
2014-09-25,94.1023
2014-09-26,93.6758
2014-09-29,92.5636
2014-09-30,92.6974
2014-10-01,90.105
2014-10-02,89.4277
2014-10-03,89.8542
2014-10-06,90.6653
2014-10-07,88.1064
2014-10-08,89.1015
2014-10-09,87.8221
2014-10-10,88.859
2014-10-13,88.6667
2014-10-14,88.4994
2014-10-15,88.2569
2014-10-16,86.8437
2014-10-17,89.0179
2014-10-20,89.5447
2014-10-21,90.5064
2014-10-22,89.4695
2014-10-23,90.105
2014-10-24,90.9413
2014-10-27,90.3141
2014-10-28,92.1455
2014-10-29,91.9197
2014-10-30,91.9949
2014-10-31,92.8061
2014-11-03,91.6103
2014-11-04,91.4848
2014-11-05,91.9029
2014-11-06,91.7693
2014-11-07,91.634
2014-11-10,92.632
2014-11-11,93.3763
2014-11-12,92.4375
2014-11-13,93.7146
2014-11-14,93.6893
2014-11-17,93.647
2014-11-18,94.2813
2014-11-19,94.8988
2014-11-20,95.4316
2014-11-21,96.8779
2014-11-24,97.5292
2014-11-25,97.3347
2014-11-26,97.3854
2014-11-28,98.9501
2014-12-01,98.2397
2014-12-02,97.1824
2014-12-03,96.5396
2014-12-04,96.5396
2014-12-05,98.1128
2014-12-08,97.3347
2014-12-09,96.1167
2014-12-10,95.8545
2014-12-11,95.3132
2014-12-12,93.3171
2014-12-15,92.3614
2014-12-16,92.133
2014-12-17,93.2325
2014-12-18,96.9625
2014-12-19,96.6496
2014-12-22,96.861
2014-12-23,97.6222
2014-12-24,97.6984
2014-12-26,97.5292
2014-12-29,97.1232
2014-12-30,95.5754
2014-12-31,95.0002
2015-01-02,94.5097
2015-01-05,91.4225
2015-01-06,91.2195
2015-01-07,92.5474
2015-01-08,95.4739
2015-01-09,94.7042
2015-01-12,95.9645
2015-01-13,96.3282
2015-01-14,96.0237
2015-01-15,96.6242
2015-01-16,98.9671
2015-01-20,98.7387
2015-01-21,99.5929
2015-01-22,100.6079
2015-01-23,101.4283
2015-01-26,102.401
2015-01-27,102.2234
2015-01-28,101.792
2015-01-29,104.4309
2015-01-30,103.2468
2015-02-02,104.2026
2015-02-03,106.1902
2015-02-04,104.5916
2015-02-05,105.0399
2015-02-06,102.5871
2015-02-09,101.8259
2015-02-10,103.1284
2015-02-11,102.5363
2015-02-12,103.6274
2015-02-13,102.9508
2015-02-17,103.1791
2015-02-18,103.0776
2015-02-19,103.8135
2015-02-20,104.5155
2015-02-23,105.9534
2015-02-24,106.1564
2015-02-25,105.2513
2015-02-26,107.831
2015-02-27,107.129
2015-03-02,107.2221
2015-03-03,106.7992
2015-03-04,106.8414
2015-03-05,108.0002
2015-03-06,105.5558
2015-03-09,104.9046
2015-03-10,101.2338
2015-03-11,102.7055
2015-03-12,103.9742
2015-03-13,102.0965
2015-03-16,103.4498
2015-03-17,102.3418
2015-03-18,103.8304
2015-03-19,102.7224
2015-03-20,103.9065
2015-03-23,104.3125
2015-03-24,103.4752
2015-03-25,103.0692
2015-03-26,102.4348
2015-03-27,103.6528
2015-03-30,104.4986
2015-03-31,103.1115
2015-04-01,104.4478
2015-04-02,106.3255
2015-04-06,107.129
2015-04-07,107.129
2015-04-08,106.1817
2015-04-09,106.5031
2015-04-10,105.8011
2015-04-13,105.5051
2015-04-14,105.928
2015-04-15,105.3867
2015-04-16,105.3782
2015-04-17,104.6339
2015-04-20,103.6951
2015-04-21,104.3717
2015-04-22,103.3483
2015-04-23,103.6105
2015-04-24,104.6424
2015-04-27,105.5897
2015-04-28,105.226
2015-04-29,103.0654
2015-04-30,103.3927
2015-05-01,104.5554
2015-05-04,101.8681
2015-05-05,100.9465
2015-05-06,103.2548
2015-05-07,103.0912
2015-05-08,105.589
2015-05-11,104.3918
2015-05-12,103.9353
2015-05-13,104.0559
2015-05-14,105.6924
2015-05-15,105.9249
2015-05-18,105.0981
2015-05-19,106.6312
2015-05-20,106.2867
2015-05-21,106.726
2015-05-22,105.5459
2015-05-26,103.4099
2015-05-27,105.0292
2015-05-28,105.4081
2015-05-29,103.8405
2015-06-01,102.7467
2015-06-02,105.0808
2015-06-03,106.0024
2015-06-04,104.8913
2015-06-05,107.2341
2015-06-08,103.8664
2015-06-09,103.5563
2015-06-10,105.434
2015-06-11,105.8905
2015-06-12,105.0981
2015-06-15,103.7027
2015-06-16,104.5727
2015-06-17,104.5899
2015-06-18,105.6751
2015-06-19,105.0894
2015-06-22,107.6476
2015-06-23,108.6725
2015-06-24,108.6036
2015-06-25,108.0954
2015-06-26,108.4744
2015-06-29,104.9516
2015-06-30,103.9353
2015-07-01,105.5632
2015-07-02,105.0464
2015-07-06,101.9887
2015-07-07,102.8414
2015-07-08,102.1782
2015-07-09,103.7027
2015-07-10,109.0515
2015-07-13,109.0946
2015-07-14,109.4305
2015-07-15,109.5425
2015-07-16,110.6191
2015-07-17,110.6794
2015-07-20,110.688
2015-07-21,110.309
2015-07-22,109.7922
2015-07-23,108.3538
2015-07-24,107.1394
2015-07-27,106.235
2015-07-28,106.6312
2015-07-29,107.7423
2015-07-30,103.2721
2015-07-31,102.9706
2015-08-03,103.4874
2015-08-04,103.0395
2015-08-05,104.8741
2015-08-06,104.9861
2015-08-07,103.8922
2015-08-10,105.0378
2015-08-11,104.1765
2015-08-12,102.7036
2015-08-13,102.4624
2015-08-14,101.0499
2015-08-17,100.5675
2015-08-18,100.7226
2015-08-19,98.6554
2015-08-20,96.5968
2015-08-21,93.8492
2015-08-24,92.5573
2015-08-25,91.4462
2015-08-26,93.1774
2015-08-27,95.0206
2015-08-28,94.6503
2015-08-31,93.8062
2015-09-01,91.36
2015-09-02,93.2463
2015-09-03,92.8846
2015-09-04,91.2136
2015-09-08,92.9707
2015-09-09,93.0741
2015-09-10,93.1343
2015-09-11,92.6348
2015-09-14,91.6443
2015-09-15,93.0568
2015-09-16,99.422
2015-09-17,98.888
2015-09-18,98.4745
2015-09-21,95.1412
2015-09-22,92.5659
2015-09-23,92.8673
2015-09-24,92.0405
2015-09-25,94.323
2015-09-28,91.0586
2015-09-29,89.4565
2015-09-30,91.5754
2015-10-01,91.8768
2015-10-02,94.7795
2015-10-05,95.3824
2015-10-06,94.4005
2015-10-07,95.5719
2015-10-08,95.3393
2015-10-09,96.3643
2015-10-12,96.0284
2015-10-13,98.0439
2015-10-14,99.422
2015-10-15,99.2755
2015-10-16,99.1377
2015-10-19,100.0249
2015-10-20,99.9388
2015-10-21,98.3023
2015-10-22,101.0068
2015-10-23,102.2643
2015-10-26,101.5494
2015-10-27,100.9551
2015-10-28,102.2643
2015-10-29,101.4116
2015-10-30,102.7811
2015-11-02,102.9792
2015-11-03,102.3332
2015-11-04,102.7208
2015-11-05,103.9008
2015-11-06,103.9886
2015-11-09,103.2368
2015-11-10,103.4553
2015-11-11,106.3225
2015-11-12,105.9729
2015-11-13,105.0113
2015-11-16,106.9869
2015-11-17,109.1897
2015-11-18,110.1775
2015-11-19,109.0674
2015-11-20,110.0114
2015-11-23,110.5709
2015-11-24,111.8297
2015-11-25,112.8874
2015-11-27,112.8874
2015-11-30,112.293
2015-12-01,112.4328
2015-12-02,111.6636
2015-12-03,110.8856
2015-12-04,111.7772
2015-12-07,112.6776
2015-12-08,112.4853
2015-12-09,110.8331
2015-12-10,110.431
2015-12-11,107.1705
2015-12-14,107.3453
2015-12-15,107.0656
2015-12-16,109.3646
2015-12-17,109.0848
2015-12-18,108.3943
2015-12-21,108.2282
2015-12-22,108.8313
2015-12-23,110.0114
2015-12-24,109.924
2015-12-28,110.0027
2015-12-29,111.3576
2015-12-30,110.2562
2015-12-31,109.2684
2016-01-04,107.0568
2016-01-05,107.1268
2016-01-06,105.0987
2016-01-07,104.4344
2016-01-08,102.3889
2016-01-11,104.1721
2016-01-12,104.0235
2016-01-13,101.5235
2016-01-14,102.3889
2016-01-15,101.7595
2016-01-19,103.8837
2016-01-20,101.3486
2016-01-21,102.048
2016-01-22,105.7631
2016-01-25,106.0253
2016-01-26,107.1879
2016-01-27,106.5586
2016-01-28,106.9082
2016-01-29,110.0027
2016-02-01,110.7632
2016-02-02,109.2597
2016-02-03,109.2334
2016-02-04,106.9694
2016-02-05,103.4116
2016-02-08,100.693
2016-02-09,101.4972
2016-02-10,101.6546
2016-02-11,100.1948
2016-02-12,100.8941
2016-02-16,101.9955
2016-02-17,102.6686
2016-02-18,101.707
2016-02-19,101.7507
2016-02-22,102.3889
2016-02-23,101.6284
2016-02-24,101.1126
2016-02-25,99.1545
2016-02-26,98.1405
2016-02-29,97.4674
2016-03-01,99.7315
2016-03-02,99.3119
2016-03-03,100.0549
2016-03-04,101.6284
2016-03-07,101.27
2016-03-08,100.5357
2016-03-09,101.2874
2016-03-10,102.0917
2016-03-11,102.9308
2016-03-14,102.4238
2016-03-15,101.8469
2016-03-16,102.4763
2016-03-17,103.499
2016-03-18,106.2526
2016-03-21,105.562
2016-03-22,106.8121
2016-03-23,106.7858
2016-03-24,106.2788
2016-03-28,106.5498
2016-03-29,108.7264
2016-03-30,109.9153
2016-03-31,108.9712
2016-04-01,109.8366
2016-04-04,110.2475
2016-04-05,108.4117
2016-04-06,107.861
2016-04-07,105.7806
2016-04-08,106.3138
2016-04-11,105.3697
2016-04-12,105.8855
2016-04-13,106.8295
2016-04-14,109.8978
2016-04-15,110.3786
2016-04-18,111.8209
2016-04-19,115.1864
2016-04-20,114.6444
2016-04-21,112.3804
2016-04-22,112.1269
2016-04-25,112.8
2016-04-26,112.3367
2016-04-27,112.2318
2016-04-28,111.4056
2016-04-29,110.5333
2016-05-02,112.0108
2016-05-03,111.2364
2016-05-04,109.5274
2016-05-05,111.4501
2016-05-06,111.272
2016-05-09,113.2748
2016-05-10,114.0225
2016-05-11,112.9009
2016-05-12,112.5983
2016-05-13,111.1652
2016-05-16,111.6993
2016-05-17,109.7322
2016-05-18,108.8243
2016-05-19,108.9044
2016-05-20,108.5839
2016-05-23,108.1656
2016-05-24,111.1296
2016-05-25,112.2156
2016-05-26,113.1947
2016-05-27,112.4114
2016-05-31,112.3491
2016-06-01,114.8503
2016-06-02,114.1649
2016-06-03,113.9424
2016-06-06,115.8739
2016-06-07,116.0786
2016-06-08,117.2001
2016-06-09,115.6425
2016-06-10,111.6993
2016-06-13,110.3196
2016-06-14,108.8421
2016-06-15,110.6134
2016-06-16,111.7438
2016-06-17,110.5778
2016-06-20,112.5538
2016-06-21,114.4319
2016-06-22,114.334
2016-06-23,115.3398
2016-06-24,109.0112
2016-06-27,108.0677
2016-06-28,109.8123
2016-06-29,112.4203
2016-06-30,117.2091
2016-07-01,116.9598
2016-07-05,114.4408
2016-07-06,113.9958
2016-07-07,113.2125
2016-07-08,113.7109
2016-07-11,113.4261
2016-07-12,113.9424
2016-07-13,113.6842
2016-07-14,112.4737
2016-07-15,111.6459
2016-07-18,112.0909
2016-07-19,110.8982
2016-07-20,112.3491
2016-07-21,110.8181
2016-07-22,112.2601
2016-07-25,112.1176
2016-07-26,112.6873
2016-07-27,108.5394
2016-07-28,112.082
2016-07-29,115.2152
2016-08-01,111.4679
2016-08-02,110.9338
2016-08-03,110.0615
2016-08-04,110.3107
2016-08-05,110.2395
2016-08-08,109.4206
2016-08-09,109.5808
2016-08-10,110.0615
2016-08-11,110.9071
2016-08-12,112.3224
2016-08-15,111.8417
2016-08-16,112.1533
2016-08-17,112.6339
2016-08-18,112.8742
2016-08-19,112.4915
2016-08-22,111.6637
2016-08-23,112.5538
2016-08-24,112.0375
2016-08-25,111.9752
2016-08-26,111.9218
2016-08-29,112.4559
2016-08-30,111.5925
2016-08-31,110.3997
2016-09-01,111.094
2016-09-02,112.8297
2016-09-06,113.8801
2016-09-07,113.3727
2016-09-08,112.6517
2016-09-09,109.6877
2016-09-12,111.0851
2016-09-13,109.0824
2016-09-14,109.2871
2016-09-15,110.8715
2016-09-16,110.4532
2016-09-19,111.5302
2016-09-20,112.0464
2016-09-21,113.3104
2016-09-22,115.7671
2016-09-23,115.8561
2016-09-26,117.6719
2016-09-27,117.3871
2016-09-28,118.7756
2016-09-29,116.7462
2016-09-30,116.9687
2016-10-03,114.7435
2016-10-04,114.5743
2016-10-05,115.055
2016-10-06,113.2748
2016-10-07,113.2659
2016-10-10,113.4795
2016-10-11,114.0848
2016-10-12,113.3727
2016-10-13,113.2926
2016-10-14,114.512
2016-10-17,114.1204
2016-10-18,113.8979
2016-10-19,114.5654
2016-10-20,113.435
2016-10-21,112.8386
2016-10-24,111.3344
2016-10-25,110.1772
2016-10-26,108.2012
2016-10-27,108.1122
2016-10-28,103.9999
2016-10-31,102.7982
2016-11-01,102.3532
2016-11-02,101.9972
2016-11-03,100.0478
2016-11-04,99.7719
2016-11-07,100.6175
2016-11-08,102.8962
2016-11-09,99.9855
2016-11-10,96.5764
2016-11-11,95.9533
2016-11-14,93.7104
2016-11-15,94.8131
2016-11-16,93.9769
2016-11-17,94.6477
2016-11-18,93.6185
2016-11-21,94.9509
2016-11-22,94.3353
2016-11-23,94.0964
2016-11-25,95.4196
2016-11-28,96.3201
2016-11-29,96.3109
2016-11-30,94.8958
2016-12-01,91.8083
2016-12-02,93.1683
2016-12-05,94.8866
2016-12-06,95.6126
2016-12-07,95.879
2016-12-08,94.3261
2016-12-09,95.1439
2016-12-12,95.2818
2016-12-13,96.5315
2016-12-14,94.565
2016-12-15,93.3245
2016-12-16,94.6477
2016-12-19,94.3996
2016-12-20,94.6293
2016-12-21,95.2082
2016-12-22,94.4823
2016-12-23,95.098
2016-12-27,95.4931
2016-12-28,95.4747
2016-12-29,96.3844
2016-12-30,96.8898
2017-01-03,96.0628
2017-01-04,96.6877
2017-01-05,98.1396
2017-01-06,97.3401
2017-01-09,97.3493
2017-01-10,96.8807
2017-01-11,96.6234
2017-01-12,97.3493
2017-01-13,97.2758
2017-01-17,97.6342
2017-01-18,96.8255
2017-01-19,96.3569
2017-01-20,96.8439
2017-01-23,97.625
2017-01-24,97.5515
2017-01-25,97.5882
2017-01-26,96.3109
2017-01-27,96.6417
2017-01-30,96.0169
2017-01-31,95.8055
2017-02-01,95.8882
2017-02-02,96.0169
2017-02-03,96.7612
2017-02-06,96.4947
2017-02-07,96.8439
2017-02-08,97.3125
2017-02-09,97.7352
2017-02-10,97.2942
2017-02-13,98.1579
2017-02-14,99.6466
2017-02-15,99.1963
2017-02-16,99.9498
2017-02-17,99.9958
2017-02-21,100.4644
2017-02-22,100.3082
2017-02-23,99.9406
2017-02-24,100.4001
2017-02-27,100.4736
2017-02-28,100.6114
2017-03-01,101.0249
2017-03-02,97.2666
2017-03-03,99.9131
2017-03-06,98.5347
2017-03-07,98.9574
2017-03-08,97.4228
2017-03-09,98.1487
2017-03-10,98.8839
2017-03-13,99.1779
2017-03-14,98.5439
2017-03-15,99.8304
2017-03-16,101.8611
2017-03-17,102.6882
2017-03-20,102.8719
2017-03-21,102.4768
2017-03-22,101.9438
2017-03-23,101.9806
2017-03-24,101.8703
2017-03-27,102.339
2017-03-28,102.486
2017-03-29,102.3022
2017-03-30,101.319
2017-03-31,100.8595
2017-04-03,101.7601
2017-04-04,101.8611
2017-04-05,101.5211
2017-04-06,101.5303
2017-04-07,101.0249
2017-04-10,101.6957
2017-04-11,101.1168
2017-04-12,101.3006
2017-04-13,100.1887
2017-04-17,101.4293
2017-04-18,101.8336
2017-04-19,101.0341
2017-04-20,100.2439
2017-04-21,99.4995
2017-04-24,103.4233
2017-04-25,104.6822
2017-04-26,103.1017
2017-04-27,103.1292
2017-04-28,104.0573
2017-05-01,104.3879
2017-05-02,105.2031
2017-05-03,105.9247
2017-05-04,111.9499
2017-05-05,112.9901
2017-05-08,111.6126
2017-05-09,111.6126
2017-05-10,111.5002
2017-05-11,111.4065
2017-05-12,112.2873
2017-05-15,112.0905
2017-05-16,112.8683
2017-05-17,111.9874
2017-05-18,109.6354
2017-05-19,110.5818
2017-05-22,110.966
2017-05-23,111.1253
2017-05-24,111.0691
2017-05-25,110.9098
2017-05-26,111.0316
2017-05-30,109.3543
2017-05-31,109.5886
2017-06-01,109.9821
2017-06-02,110.7693
2017-06-05,110.9473
2017-06-06,110.5912
2017-06-07,109.776
2017-06-08,107.274
2017-06-09,106.3557
2017-06-12,105.8497
2017-06-13,106.7118
2017-06-14,106.8055
2017-06-15,106.084
2017-06-16,106.7305
2017-06-19,106.9648
2017-06-20,106.9929
2017-06-21,106.6556
2017-06-22,106.2152
2017-06-23,106.1683
2017-06-26,106.7493
2017-06-27,106.4682
2017-06-28,106.5431
2017-06-29,103.6945
2017-06-30,103.4134
2017-07-03,103.4696
2017-07-05,103.076
2017-07-06,103.4227
2017-07-07,103.8444
2017-07-10,104.7253
2017-07-11,104.0787
2017-07-12,105.428
2017-07-13,105.9341
2017-07-14,107.096
2017-07-17,107.0023
2017-07-18,107.2834
2017-07-19,107.5833
2017-07-20,108.2392
2017-07-21,107.5177
2017-07-24,106.6087
2017-07-25,106.7868
2017-07-26,108.4266
2017-07-27,115.1078
2017-07-28,113.5523
2017-07-31,113.065
2017-08-01,112.4747
2017-08-02,111.2846
2017-08-03,112.2498
2017-08-04,112.4747
2017-08-07,112.0062
2017-08-08,111.3409
2017-08-09,110.2351
2017-08-10,108.7546
2017-08-11,108.5297
2017-08-14,109.0826
2017-08-15,109.6635
2017-08-16,110.3382
2017-08-17,109.5136
2017-08-18,108.9795
2017-08-21,109.4105
2017-08-22,109.5323
2017-08-23,108.7827
2017-08-24,108.5765
2017-08-25,109.1575
2017-08-28,108.5203
2017-08-29,109.4949
2017-08-30,110.3476
2017-08-31,110.9192
2017-09-01,111.1628
2017-09-05,111.3596
2017-09-06,111.9312
2017-09-07,113.5804
2017-09-08,113.8428
2017-09-11,113.974
2017-09-12,114.0396
2017-09-13,113.7585
2017-09-14,114.0771
2017-09-15,113.2524
2017-09-18,112.6059
2017-09-19,112.5215
2017-09-20,110.6662
2017-09-21,109.6167
2017-09-22,109.0638
2017-09-25,109.4855
2017-09-26,110.0946
2017-09-27,111.041
2017-09-28,111.5095
2017-09-29,111.7906
2017-10-02,111.4908
2017-10-03,112.5215
2017-10-04,113.3368
2017-10-05,114.8642
2017-10-06,113.9552
2017-10-09,114.6955
2017-10-10,116.2885
2017-10-11,116.3635
2017-10-12,116.7758
2017-10-13,117.4692
2017-10-16,117.8065
2017-10-17,118.0877
2017-10-18,117.8815
2017-10-19,118.0127
2017-10-20,117.591
2017-10-23,117.2256
2017-10-24,116.1948
2017-10-25,113.9084
2017-10-26,112.8308
2017-10-27,112.1561
2017-10-30,113.2056
2017-10-31,115.0516
2017-11-01,114.4519
2017-11-02,113.318
2017-11-03,114.0677
2017-11-06,112.9901
2017-11-07,111.1909
2017-11-08,110.713
2017-11-09,110.7599
2017-11-10,110.7224
2017-11-13,110.3569
2017-11-14,109.2942
2017-11-15,108.0848
2017-11-16,109.4275
2017-11-17,109.5037
2017-11-20,110.0179
2017-11-21,110.1036
2017-11-22,110.2274
2017-11-24,111.951
2017-11-27,111.9034
2017-11-28,111.8368
2017-11-29,110.3607
2017-11-30,109.0275
2017-12-01,109.9512
2017-12-04,109.9036
2017-12-05,107.58
2017-12-06,107.6086
2017-12-07,105.9516
2017-12-08,106.3516
2017-12-11,106.104
2017-12-12,105.8183
2017-12-13,105.6183
2017-12-14,105.2279
2017-12-15,105.3422
2017-12-18,106.1135
2017-12-19,106.4468
2017-12-20,106.304
2017-12-21,106.0373
2017-12-22,106.2373
2017-12-26,106.0945
2017-12-27,106.7992
2017-12-28,105.9516
2017-12-29,106.2373
2018-01-02,107.0563
2018-01-03,107.8848
2018-01-04,108.18
2018-01-05,109.2656
2018-01-08,108.5133
2018-01-09,108.8752
2018-01-10,108.4847
2018-01-11,108.7514
2018-01-12,109.418
2018-01-16,110.0274
2018-01-17,110.4464
2018-01-18,109.6275
2018-01-19,109.7322
2018-01-22,109.7227
2018-01-23,109.037
2018-01-24,108.799
2018-01-25,108.2562
2018-01-26,109.437
2018-01-29,108.1038
2018-01-30,107.5515
2018-01-31,108.0657
2018-02-01,108.6561
2018-02-02,106.4278
2018-02-05,101.8663
2018-02-06,103.7614
2018-02-07,101.9615
2018-02-08,98.6571
2018-02-09,98.2286
2018-02-12,99.2285
2018-02-13,98.8476
2018-02-14,99.2285
2018-02-15,99.6665
2018-02-16,101.0569
2018-02-20,100.3236
2018-02-21,100.0474
2018-02-22,100.3141
2018-02-23,102.133
2018-02-26,103.7995
2018-02-27,101.1711
2018-02-28,101.114
2018-03-01,104.228
2018-03-02,105.3517
2018-03-05,106.3325
2018-03-06,107.3801
2018-03-07,107.4277
2018-03-08,109.7417
2018-03-09,109.6941
2018-03-12,110.0846
2018-03-13,109.2275
2018-03-14,108.0848
2018-03-15,107.4848
2018-03-16,107.6181
2018-03-19,106.8754
2018-03-20,107.2944
2018-03-21,104.9708
2018-03-22,103.3043
2018-03-23,101.7044
2018-03-26,102.6091
2018-03-27,102.3425
2018-03-28,104.3994
2018-03-29,104.6946
2018-04-02,102.6472
2018-04-03,103.59
2018-04-04,104.028
2018-04-05,104.7898
2018-04-06,102.79
2018-04-09,103.5233
2018-04-10,103.1519
2018-04-11,101.1807
2018-04-12,100.1808
2018-04-13,99.7998
2018-04-16,99.3427
2018-04-17,101.6187
2018-04-18,101.8949
2018-04-19,100.0474
2018-04-20,98.9809
2018-04-23,98.1524
2018-04-24,97.5905
2018-04-25,98.3048
2018-04-26,97.0382
2018-04-27,95.086
2018-04-30,95.305
2018-05-01,95.2075
2018-05-02,92.3685
2018-05-03,94.2612
2018-05-04,95.0612
2018-05-07,95.2563
2018-05-08,95.8416
2018-05-09,95.5392
2018-05-10,93.071
2018-05-11,92.7393
2018-05-14,93.149
2018-05-15,91.3051
2018-05-16,91.6368
2018-05-17,92.1149
2018-05-18,91.9978
2018-05-21,91.9003
2018-05-22,92.6124
2018-05-23,92.4563
2018-05-24,93.4124
2018-05-25,92.4076
2018-05-29,90.0857
2018-05-30,91.8515
2018-05-31,91.3051
2018-06-01,91.1393
2018-06-04,93.9295
2018-06-05,92.8173
2018-06-06,92.5539
2018-06-07,91.6661
2018-06-08,92.3588
2018-06-11,94.5636
2018-06-12,95.266
2018-06-13,95.4124
2018-06-14,94.9929
2018-06-15,96.1245
2018-06-18,94.2417
2018-06-19,94.0661
2018-06-20,94.4368
2018-06-21,94.9148
2018-06-22,96.7099
2018-06-25,95.4416
2018-06-26,96.0075
2018-06-27,95.3538
2018-06-28,96.7489
2018-06-29,98.3001
2018-07-02,98.144
2018-07-03,98.9537
2018-07-05,99.9196
2018-07-06,101.3049
2018-07-09,101.2756
2018-07-10,101.3537
2018-07-11,100.544
2018-07-12,100.8854
2018-07-13,101.383
2018-07-16,100.8952
2018-07-17,100.2415
2018-07-18,99.9781
2018-07-19,101.0025
2018-07-20,102.0659
2018-07-23,102.3293
2018-07-24,102.4073
2018-07-25,104.1244
2018-07-26,98.8952
2018-07-27,99.2659
2018-07-30,98.7977
2018-07-31,99.2367
2018-08-01,98.6903
2018-08-02,97.9782
2018-08-03,98.183
2018-08-06,97.5391
2018-08-07,98.2904
2018-08-08,97.1001
2018-08-09,97.2757
2018-08-10,94.0758
2018-08-13,94.0465
2018-08-14,95.3246
2018-08-15,95.9782
2018-08-16,96.066
2018-08-17,97.4221
2018-08-20,96.9733
2018-08-21,97.7733
2018-08-22,96.066
2018-08-23,95.4124
2018-08-24,95.8124
2018-08-27,96.2709
2018-08-28,95.5977
2018-08-29,95.5587
2018-08-30,93.2563
2018-08-31,90.9539
2018-09-04,89.7149
2018-09-05,88.6808
2018-09-06,88.0272
2018-09-07,87.5491
2018-09-10,87.6857
2018-09-11,85.8711
2018-09-12,85.9784
2018-09-13,87.1687
2018-09-14,87.1101
2018-09-17,87.6077
2018-09-18,87.9589
2018-09-19,87.7345
2018-09-20,89.6857
2018-09-21,89.793
2018-09-24,88.3003
2018-09-25,88.3003
2018-09-26,87.4809
2018-09-27,85.9492
2018-09-28,85.4321
2018-10-01,84.4273
2018-10-02,83.7248
2018-10-03,85.4711
2018-10-04,84.9346
2018-10-05,84.5346
2018-10-08,84.9346
2018-10-09,84.476
2018-10-10,82.9346
2018-10-11,82.281
2018-10-12,82.281
2018-10-15,82.5639
2018-10-16,83.3444
2018-10-17,81.6664
2018-10-18,81.3834
2018-10-19,81.8127
2018-10-22,81.4225
2018-10-23,80.2127
2018-10-24,80.242
2018-10-25,72.7202
2018-10-26,72.2715
2018-10-29,73.0324
2018-10-30,72.5251
2018-10-31,72.1739
2018-11-01,74.808
2018-11-02,74.6421
2018-11-05,74.1153
2018-11-06,74.0665
2018-11-07,74.769
2018-11-08,72.7885
2018-11-09,72.7983
2018-11-12,71.4129
2018-11-13,71.4227
2018-11-14,74.7299
2018-11-15,75.3446
2018-11-16,76.925
2018-11-19,76.3884
2018-11-20,74.2324
2018-11-21,74.6714
2018-11-23,74.3007
2018-11-26,75.2275
2018-11-27,75.0287
2018-11-28,76.085
2018-11-29,76.2529
2018-11-30,75.8876
2018-12-03,74.9103
2018-12-04,73.3208
2018-12-06,71.3464
2018-12-07,69.8656
2018-12-10,69.6484
2018-12-11,69.4707
2018-12-12,70.6751
2018-12-13,70.3888
2018-12-14,68.8092
2018-12-17,67.358
2018-12-18,67.8714
2018-12-19,67.9207
2018-12-20,66.9138
2018-12-21,65.5415
2018-12-24,64.5938
2018-12-26,66.0746
2018-12-27,65.4527
2018-12-28,65.0282
2018-12-31,64.9689
2019-01-02,65.0677
2019-01-03,65.5712
2019-01-04,68.207
2019-01-07,68.5131
2019-01-08,69.8458
2019-01-09,69.3423
2019-01-10,69.8557
2019-01-11,72.7877
2019-01-14,71.6031
2019-01-15,71.5932
2019-01-16,69.599
2019-01-17,71.0601
2019-01-18,72.7088
2019-01-22,72.5607
2019-01-23,72.9654
2019-01-24,73.3011
2019-01-25,73.9033
2019-01-28,72.7384
2019-01-29,73.0444
2019-01-30,73.9823
2019-01-31,75.4631
2019-02-01,75.858
2019-02-04,76.4207
2019-02-05,77.8522
2019-02-06,77.2993
2019-02-07,75.9172
2019-02-08,75.1768
2019-02-11,75.394
2019-02-12,75.3742
2019-02-13,76.7465
2019-02-14,74.93
2019-02-15,76.6971
2019-02-19,76.1245
2019-02-20,76.6873
2019-02-21,76.5096
2019-02-22,74.081
2019-02-25,73.9033
2019-02-26,74.2389
2019-02-27,73.7651
2019-02-28,77.1611
2019-03-01,80.9126
2019-03-04,80.7349
2019-03-05,81.1495
2019-03-06,81.0804
2019-03-07,79.333
2019-03-08,79.5502
2019-03-11,79.7674
2019-03-12,79.6687
2019-03-13,79.6983
2019-03-14,78.6321
2019-03-15,80.2116
2019-03-18,81.0211
2019-03-19,82.7981
2019-03-20,82.3638
2019-03-21,82.8475
2019-03-22,79.7081
2019-03-25,79.3231
2019-03-26,80.9817
2019-03-27,81.4062
2019-03-28,81.6431
2019-03-29,82.8969
2019-04-01,82.5711
2019-04-02,83.1042
2019-04-03,82.7784
2019-04-04,83.9038
2019-04-05,85.2168
2019-04-08,84.9602
2019-04-09,85.3254
2019-04-10,86.1152
2019-04-11,86.8457
2019-04-12,87.4085
2019-04-15,87.9712
2019-04-16,87.5862
2019-04-17,87.2011
2019-04-18,88.8103
2019-04-22,88.4549
2019-04-23,88.1094
2019-04-24,87.0827
2019-04-25,85.5327
2019-04-26,86.4607
2019-04-29,86.8852
2019-04-30,87.8033
2019-05-01,86.6878
2019-05-02,86.4212
2019-05-03,86.9741
2019-05-06,86.6483
2019-05-07,84.26
2019-05-08,84.94
2019-05-09,83.94
2019-05-10,84.14
2019-05-13,82.73
2019-05-14,83.01
2019-05-15,83.83
2019-05-16,83.88
2019-05-17,82.64
2019-05-20,81.01
2019-05-21,81
2019-05-22,82.62
2019-05-23,82.3
2019-05-24,82.76
2019-05-28,82.35
2019-05-29,81.3
2019-05-30,82.38
2019-05-31,81.4
2019-06-03,82.28
2019-06-04,83.94
2019-06-05,83.27
2019-06-06,84.1
2019-06-07,85.32
2019-06-10,85.33
2019-06-11,85.81
2019-06-12,86.8
2019-06-13,85.66
2019-06-14,84.15
2019-06-17,84.34
2019-06-18,87.095
2019-06-19,88.09
2019-06-20,89.58
2019-06-21,90.42
2019-06-24,90.08
2019-06-25,88.51
2019-06-26,87.53
2019-06-27,86.94
2019-06-28,88.41
2019-07-01,88.27
2019-07-02,90.57
2019-07-03,93.96
2019-07-04,93.96
2019-07-05,92.76
2019-07-08,91.59
2019-07-09,91.47
2019-07-10,91.42
2019-07-11,89.545
2019-07-12,87.19
2019-07-15,88.45
2019-07-16,87.95
2019-07-17,88.49
2019-07-18,89.38
2019-07-19,94.34
2019-07-22,94.95
2019-07-23,95.83
2019-07-24,95.44
2019-07-25,99.47
2019-07-26,100.58
2019-07-29,101.82
2019-07-30,101.515
2019-07-31,101.03
2019-08-01,100.6
2019-08-02,100.22
2019-08-05,98.185
2019-08-06,97.72
2019-08-07,98.15
2019-08-08,98.54
2019-08-09,98.1
2019-08-12,96.29
2019-08-13,95.52
2019-08-14,93.37
2019-08-15,93.75
2019-08-16,95.295
2019-08-19,95.91
2019-08-20,94.96
2019-08-21,95.94
2019-08-22,95.66
2019-08-23,93.96
2019-08-26,94.75
2019-08-27,92.965
2019-08-28,93.7
2019-08-29,95.23
2019-08-30,94.495
2019-09-02,94.46
2019-09-03,93.98
2019-09-04,94.71
2019-09-05,93.25
2019-09-06,93.52
2019-09-09,95.8
2019-09-10,94.005
2019-09-11,94.17
2019-09-12,97.405
2019-09-13,96.36
2019-09-16,95.77
2019-09-17,96.92
2019-09-18,96.725
2019-09-19,95.03
2019-09-20,96.27
2019-09-23,96.31
2019-09-24,93.82
2019-09-25,94.59
2019-09-26,94.93
2019-09-27,94.41
2019-09-30,95.2
2019-10-01,93.23
2019-10-02,90.975
2019-10-03,91.765
2019-10-04,93.235
2019-10-07,93.16
2019-10-08,91.925
2019-10-09,92.59
2019-10-10,91.635
2019-10-11,92.4
2019-10-14,91.31
2019-10-15,92.37
2019-10-16,92.26
2019-10-17,93.25
2019-10-18,93.04
2019-10-21,93.415
2019-10-22,91.85
2019-10-23,91.37
2019-10-24,91.6
2019-10-25,81.825
2019-10-28,81.035
2019-10-29,80.375
2019-10-30,81.035
2019-10-31,80.615
2019-11-01,79.29
2019-11-04,79.375
2019-11-05,79.12
2019-11-06,79.33
2019-11-07,78.345
2019-11-08,78.345
2019-11-11,78.76
2019-11-12,79.1
2019-11-13,79.32
2019-11-14,79.205
2019-11-15,79.69
2019-11-18,80.065
2019-11-19,79.2
2019-11-20,78.405
2019-11-21,78.595
2019-11-22,79.125
2019-11-25,79.11
