date,close
2014-06-13,70.79
2014-06-16,70.77
2014-06-17,70.18
2014-06-18,70.42
2014-06-19,71.58
2014-06-20,71.83
2014-06-23,71.53
2014-06-24,71.39
2014-06-25,71.86
2014-06-26,71.61
2014-06-27,72.95
2014-06-30,72.32
2014-07-01,73.16
2014-07-02,73.6
2014-07-03,73.32
2014-07-07,73.28
2014-07-08,72.81
2014-07-09,73.22
2014-07-10,73.04
2014-07-11,73.08
2014-07-14,73.57
2014-07-15,73.26
2014-07-16,73.82
2014-07-17,73.4
2014-07-18,73.85
2014-07-21,71.01
2014-07-22,71.67
2014-07-23,71.67
2014-07-24,71.89
2014-07-25,71.46
2014-07-28,71.75
2014-07-29,71.33
2014-07-30,71.32
2014-07-31,70.44
2014-08-01,72.15
2014-08-04,72.15
2014-08-05,71.51
2014-08-06,71.52
2014-08-07,71.49
2014-08-08,71.85
2014-08-11,71.79
2014-08-12,72.04
2014-08-13,72.42
2014-08-14,73.1
2014-08-15,72.11
2014-08-18,73.43
2014-08-19,73.8
2014-08-20,73.72
2014-08-21,73.83
2014-08-22,73.65
2014-08-25,73.9
2014-08-26,74.43
2014-08-27,74.57
2014-08-28,74.42
2014-08-29,74.68
2014-09-02,74.58
2014-09-03,74.55
2014-09-04,74.12
2014-09-05,74.3
2014-09-08,74.43
2014-09-09,74.29
2014-09-10,74.21
2014-09-11,74.31
2014-09-12,74.07
2014-09-15,73.93
2014-09-16,74.24
2014-09-17,73.93
2014-09-18,74.71
2014-09-19,74.88
2014-09-22,74.76
2014-09-23,74.01
2014-09-24,74.94
2014-09-25,73.77
2014-09-26,73.4
2014-09-29,73.48
2014-09-30,73.14
2014-10-01,72.78
2014-10-02,73.74
2014-10-03,74.45
2014-10-06,73.81
2014-10-07,73.13
2014-10-08,75.01
2014-10-09,73.99
2014-10-10,73.42
2014-10-13,73.56
2014-10-14,73.59
2014-10-15,72.74
2014-10-16,72.03
2014-10-17,72.75
2014-10-20,73.56
2014-10-21,75.5
2014-10-22,75.28
2014-10-23,76.25
2014-10-24,76.73
2014-10-27,76.7
2014-10-28,77.58
2014-10-29,77.37
2014-10-30,77.62
2014-10-31,78.07
2014-11-03,78.03
2014-11-04,77.84
2014-11-05,77.51
2014-11-06,78.03
2014-11-07,74.49
2014-11-10,74.72
2014-11-11,76.13
2014-11-12,76.72
2014-11-13,77.04
2014-11-14,75.66
2014-11-17,75.51
2014-11-18,75.23
2014-11-19,75.12
2014-11-20,75.13
2014-11-21,74.54
2014-11-24,74.49
2014-11-25,75.06
2014-11-26,76.1
2014-11-28,76.53
2014-12-01,76.01
2014-12-02,75.7
2014-12-03,75.69
2014-12-04,75.3
2014-12-05,75.63
2014-12-08,75.87
2014-12-09,75.15
2014-12-10,74.45
2014-12-11,74.51
2014-12-12,73.4
2014-12-15,72.86
2014-12-16,72.77
2014-12-17,74.33
2014-12-18,75.2
2014-12-19,75.94
2014-12-22,76.35
2014-12-23,75.99
2014-12-24,76.06
2014-12-26,76.22
2014-12-29,76.1
2014-12-30,76
2014-12-31,75.74
2015-01-02,75.83
2015-01-05,74.7
2015-01-06,73.62
2015-01-07,74.29
2015-01-08,75.77
2015-01-09,75.22
2015-01-12,74.42
2015-01-13,74.54
2015-01-14,74.69
2015-01-15,74.46
2015-01-16,75.05
2015-01-20,75.21
2015-01-21,75.73
2015-01-22,76.15
2015-01-23,75.85
2015-01-26,76.19
2015-01-27,76.04
2015-01-28,75.52
2015-01-29,76.14
2015-01-30,75.06
2015-02-02,75.57
2015-02-03,75.6
2015-02-04,75.96
2015-02-05,76.77
2015-02-06,75.57
2015-02-09,74.67
2015-02-10,75.77
2015-02-11,75.95
2015-02-12,76.39
2015-02-13,73.1
2015-02-17,72.78
2015-02-18,73.28
2015-02-19,73.24
2015-02-20,73.76
2015-02-23,73.86
2015-02-24,72.93
2015-02-25,73.93
2015-02-26,74.3
2015-02-27,74.6
2015-03-02,75.56
2015-03-03,75.89
2015-03-04,76.75
2015-03-05,76.93
2015-03-06,77.63
2015-03-09,78
2015-03-10,78.1
2015-03-11,79.41
2015-03-12,79.7
2015-03-13,80.81
2015-03-16,81.41
2015-03-17,81.11
2015-03-18,81.64
2015-03-19,81.44
2015-03-20,81.86
2015-03-23,82.84
2015-03-24,82.19
2015-03-25,81.05
2015-03-26,81.07
2015-03-27,81.83
2015-03-30,82.17
2015-03-31,81.28
2015-04-01,80.05
2015-04-02,80.59
2015-04-06,81.47
2015-04-07,81.86
2015-04-08,81.74
2015-04-09,81.52
2015-04-10,81.9
2015-04-13,81.76
2015-04-14,82.01
2015-04-15,81.61
2015-04-16,82.13
2015-04-17,81.26
2015-04-20,81.84
2015-04-21,83.12
2015-04-22,83.22
2015-04-23,83.41
2015-04-24,83.91
2015-04-27,83.79
2015-04-28,83.59
2015-04-29,82.64
2015-04-30,81.1
2015-05-01,82.4
2015-05-04,82.34
2015-05-05,81.51
2015-05-06,81.41
2015-05-07,81.76
2015-05-08,82.17
2015-05-11,81.59
2015-05-12,80.92
2015-05-13,80.98
2015-05-14,81.86
2015-05-15,81.48
2015-05-18,82.7
2015-05-19,83.2
2015-05-20,83.69
2015-05-21,83.49
2015-05-22,84.09
2015-05-26,83.75
2015-05-27,84.06
2015-05-28,84.23
2015-05-29,83.78
2015-06-01,83.88
2015-06-02,83.82
2015-06-03,83.96
2015-06-04,82.6
2015-06-05,82.54
2015-06-08,81.87
2015-06-09,81.49
2015-06-10,81.68
2015-06-11,82.19
2015-06-12,81.4
2015-06-15,81.28
2015-06-16,81.51
2015-06-17,81.07
2015-06-18,81.45
2015-06-19,82.19
2015-06-22,82.13
2015-06-23,81.57
2015-06-24,80.19
2015-06-25,80.91
2015-06-26,81.08
2015-06-29,79.61
2015-06-30,79.47
2015-07-01,79.32
2015-07-02,78.94
2015-07-06,79.55
2015-07-07,79.66
2015-07-08,78.81
2015-07-09,78.82
2015-07-10,79.3
2015-07-13,79.5
2015-07-14,80.07
2015-07-15,79.67
2015-07-16,79.84
2015-07-17,79.97
2015-07-20,79.88
2015-07-21,79.62
2015-07-22,80.06
2015-07-23,80.13
2015-07-24,79.39
2015-07-27,78.43
2015-07-28,79.02
2015-07-29,79.07
2015-07-30,78.63
2015-07-31,79.03
2015-08-03,79.71
2015-08-04,80.2
2015-08-05,80.49
2015-08-06,81.14
2015-08-07,81.02
2015-08-10,81.05
2015-08-11,80.77
2015-08-12,79.95
2015-08-13,79.65
2015-08-14,80.28
2015-08-17,80.28
2015-08-18,80
2015-08-19,80.08
2015-08-20,78.53
2015-08-21,75.99
2015-08-24,74.08
2015-08-25,74.33
2015-08-26,76.12
2015-08-27,76.65
2015-08-28,76.29
2015-08-31,75.64
2015-09-01,74.05
2015-09-02,75.12
2015-09-03,75.44
2015-09-04,74.55
2015-09-08,75.46
2015-09-09,74.74
2015-09-10,74.64
2015-09-11,75
2015-09-14,74.77
2015-09-15,75.15
2015-09-16,75.82
2015-09-17,75.77
2015-09-18,74.99
2015-09-21,76.02
2015-09-22,75.36
2015-09-23,75.52
2015-09-24,74.35
2015-09-25,72.26
2015-09-28,70.93
2015-09-29,71.18
2015-09-30,72.33
2015-10-01,72.05
2015-10-02,72.9
2015-10-05,73.36
2015-10-06,72.15
2015-10-07,73.19
2015-10-08,73.1
2015-10-09,73.16
2015-10-12,73.64
2015-10-13,73.35
2015-10-14,73.24
2015-10-15,75.23
2015-10-16,76.5
2015-10-19,76.33
2015-10-20,76.19
2015-10-21,76.46
2015-10-22,74.98
2015-10-23,75.94
2015-10-26,76.4
2015-10-27,76.95
2015-10-28,77.44
2015-10-29,77.75
2015-10-30,77.51
2015-11-02,78.16
2015-11-03,77.6
2015-11-04,77.45
2015-11-05,77.75
2015-11-06,77.27
2015-11-09,75.59
2015-11-10,76.11
2015-11-11,74.97
2015-11-12,73.24
2015-11-13,72.58
2015-11-16,73.51
2015-11-17,73.15
2015-11-18,73.99
2015-11-19,73.21
2015-11-20,73.53
2015-11-23,73.41
2015-11-24,73.5
2015-11-25,73.75
2015-11-27,74.32
2015-11-30,73.04
2015-12-01,73.52
2015-12-02,72.77
2015-12-03,71.67
2015-12-04,72.22
2015-12-07,71.55
2015-12-08,71.37
2015-12-09,70.86
2015-12-10,71
2015-12-11,69.71
2015-12-14,68.07
2015-12-15,68.02
2015-12-16,68.13
2015-12-17,68.12
2015-12-18,67.79
2015-12-21,69
2015-12-22,69.57
2015-12-23,70.3
2015-12-24,70.14
2015-12-28,70.22
2015-12-29,70.61
2015-12-30,70.02
2015-12-31,69.71
2016-01-04,68.67
2016-01-05,69.12
2016-01-06,68.16
2016-01-07,67.62
2016-01-08,67.67
2016-01-11,67.23
2016-01-12,67.45
2016-01-13,66.13
2016-01-14,67.45
2016-01-15,66.47
2016-01-19,65.71
2016-01-20,65.41
2016-01-21,65.2
2016-01-22,66.89
2016-01-25,65.95
2016-01-26,66.52
2016-01-27,65.72
2016-01-28,64.45
2016-01-29,67.12
2016-02-01,67.41
2016-02-02,66.26
2016-02-03,65.44
2016-02-04,65.45
2016-02-05,63.9
2016-02-08,62.24
2016-02-09,62.25
2016-02-10,63.66
2016-02-11,62.57
2016-02-12,62.56
2016-02-16,62.64
2016-02-17,64.09
2016-02-18,64.5
2016-02-19,63.8
2016-02-22,64.85
2016-02-23,64.28
2016-02-24,64.14
2016-02-25,65.33
2016-02-26,66.46
2016-02-29,65.97
2016-03-01,68.21
2016-03-02,68.18
2016-03-03,70.08
2016-03-04,70.51
2016-03-07,70.93
2016-03-08,69.75
2016-03-09,70.17
2016-03-10,69.84
2016-03-11,71.05
2016-03-14,70.92
2016-03-15,69.82
2016-03-16,70.16
2016-03-17,70.95
2016-03-18,72.74
2016-03-21,72.29
2016-03-22,72.69
2016-03-23,72.32
2016-03-24,71.55
2016-03-28,71.5
2016-03-29,72.71
2016-03-30,73.03
2016-03-31,73.38
2016-04-01,73.97
2016-04-04,73.47
2016-04-05,73.03
2016-04-06,74.53
2016-04-07,73.95
2016-04-08,74.1
2016-04-11,73.42
2016-04-12,73.78
2016-04-13,74.19
2016-04-14,74.2
2016-04-15,74.21
2016-04-18,74.48
2016-04-19,74.94
2016-04-20,74.84
2016-04-21,74.45
2016-04-22,74.9
2016-04-25,74.71
2016-04-26,74.91
2016-04-27,75.12
2016-04-28,74.78
2016-04-29,73.9
2016-05-02,73.64
2016-05-03,73.71
2016-05-04,73.24
2016-05-05,75.83
2016-05-06,75.7
2016-05-09,76.04
2016-05-10,76.49
2016-05-11,76.32
2016-05-12,75.59
2016-05-13,75.42
2016-05-16,77.07
2016-05-17,76.76
2016-05-18,76.85
2016-05-19,77.34
2016-05-20,77.37
2016-05-23,76.78
2016-05-24,77.35
2016-05-25,77.15
2016-05-26,76.95
2016-05-27,77.05
2016-05-31,77.32
2016-06-01,77.53
2016-06-02,77.93
2016-06-03,77.15
2016-06-06,77
2016-06-07,76.94
2016-06-08,76.9
2016-06-09,77.21
2016-06-10,76.08
2016-06-13,75.56
2016-06-14,75.63
2016-06-15,75.45
2016-06-16,75.68
2016-06-17,75.11
2016-06-20,75.77
2016-06-21,75.65
2016-06-22,76.18
2016-06-23,77.15
2016-06-24,75.7
2016-06-27,73.78
2016-06-28,74.61
2016-06-29,76.68
2016-06-30,77.32
2016-07-01,77.32
2016-07-05,76.37
2016-07-06,76.68
2016-07-07,76.92
2016-07-08,78.07
2016-07-11,78.44
2016-07-12,77.85
2016-07-13,77.99
2016-07-14,77.73
2016-07-15,77.73
2016-07-18,77.51
2016-07-19,77.35
2016-07-20,77.62
2016-07-21,77.58
2016-07-22,77.91
2016-07-25,77.94
2016-07-26,78.18
2016-07-27,76.55
2016-07-28,76.76
2016-07-29,77.54
2016-08-01,77
2016-08-02,76
2016-08-03,76.08
2016-08-04,75.91
2016-08-05,76.96
2016-08-08,75.36
2016-08-09,72.31
2016-08-10,70.11
2016-08-11,70.09
2016-08-12,69.15
2016-08-15,68.33
2016-08-16,68.26
2016-08-17,67.2
2016-08-18,67.65
2016-08-19,64.48
2016-08-22,65.17
2016-08-23,65.45
2016-08-24,64.51
2016-08-25,64.24
2016-08-26,63.68
2016-08-29,64.41
2016-08-30,64.66
2016-08-31,64.63
2016-09-01,64.19
2016-09-02,64.78
2016-09-06,64.06
2016-09-07,64.33
2016-09-08,64.43
2016-09-09,63.65
2016-09-12,64.71
2016-09-13,63.95
2016-09-14,63.34
2016-09-15,64.07
2016-09-16,64.44
2016-09-19,63.6
2016-09-20,64.99
2016-09-21,65.83
2016-09-22,66.72
2016-09-23,66.5
2016-09-26,66.15
2016-09-27,66.33
2016-09-28,66.21
2016-09-29,65.46
2016-09-30,66.07
2016-10-03,64.1
2016-10-04,64.34
2016-10-05,64.11
2016-10-06,64.28
2016-10-07,63.43
2016-10-10,63.7
2016-10-11,62
2016-10-12,62.66
2016-10-13,62.99
2016-10-14,62.85
2016-10-17,62.26
2016-10-18,62.51
2016-10-19,62.78
2016-10-20,61.1
2016-10-21,60.96
2016-10-24,58.1
2016-10-25,58.29
2016-10-26,56.86
2016-10-27,55.93
2016-10-28,55.16
2016-10-31,58.62
2016-11-01,57.82
2016-11-02,57.97
2016-11-03,58.46
2016-11-04,58.63
2016-11-07,57.85
2016-11-08,58.02
2016-11-09,59.33
2016-11-10,59.98
2016-11-11,59.53
2016-11-14,60.59
2016-11-15,60.3
2016-11-16,60.43
2016-11-17,61.99
2016-11-18,61.52
2016-11-21,62.85
2016-11-22,63.03
2016-11-23,63.36
2016-11-25,63.33
2016-11-28,63.2
2016-11-29,63.66
2016-11-30,63.35
2016-12-01,64.59
2016-12-02,64.23
2016-12-05,64.11
2016-12-06,64.1
2016-12-07,64.01
2016-12-08,66.28
2016-12-09,66.49
2016-12-12,66.59
2016-12-13,65.37
2016-12-14,63.8
2016-12-15,64.12
2016-12-16,64.94
2016-12-19,65.19
2016-12-20,64.87
2016-12-21,64.67
2016-12-22,64.85
2016-12-23,65.2
2016-12-27,65.01
2016-12-28,64.31
2016-12-29,64.36
2016-12-30,64.2
2017-01-03,65.09
2017-01-04,66.31
2017-01-05,65.71
2017-01-06,65.79
2017-01-09,63.38
2017-01-10,63.63
2017-01-11,63.19
2017-01-12,63.41
2017-01-13,63.93
2017-01-17,63.85
2017-01-18,63.89
2017-01-19,62.9
2017-01-20,63.02
2017-01-23,63.12
2017-01-24,63.56
2017-01-25,64.08
2017-01-26,65.21
2017-01-27,64.55
2017-01-30,63.35
2017-01-31,63.75
2017-02-01,64.63
2017-02-02,64.78
2017-02-03,65.32
2017-02-06,64.62
2017-02-07,64.27
2017-02-08,64.69
2017-02-09,64.66
2017-02-10,64.75
2017-02-13,64.81
2017-02-14,64.73
2017-02-15,64.85
2017-02-16,64.66
2017-02-17,66.9
2017-02-21,68.89
2017-02-22,69.08
2017-02-23,68.95
2017-02-24,69.04
2017-02-27,69.19
2017-02-28,69.41
2017-03-01,69.17
2017-03-02,69.99
2017-03-03,70
2017-03-06,69.42
2017-03-07,68.13
2017-03-08,68.26
2017-03-09,68.29
2017-03-10,68.55
2017-03-13,68.75
2017-03-14,68.7
2017-03-15,69.03
2017-03-16,67.74
2017-03-17,67.8
2017-03-20,67.41
2017-03-21,66.01
2017-03-22,65.56
2017-03-23,66.12
2017-03-24,66.77
2017-03-27,66.93
2017-03-28,67.69
2017-03-29,68.31
2017-03-30,68.5
2017-03-31,67.97
2017-04-03,67.64
2017-04-04,67.18
2017-04-05,67.35
2017-04-06,67.76
2017-04-07,67.04
2017-04-10,68.27
2017-04-11,68.31
2017-04-12,68.1
2017-04-13,67.78
2017-04-17,68.34
2017-04-18,67.72
2017-04-19,67.77
2017-04-20,68.43
2017-04-21,67.74
2017-04-24,68.27
2017-04-25,68.5
2017-04-26,68.48
2017-04-27,68.82
2017-04-28,69.01
2017-05-01,69.08
2017-05-02,70.09
2017-05-03,66.45
2017-05-04,65.24
2017-05-05,65.45
2017-05-08,65.39
2017-05-09,65.87
2017-05-10,66.54
2017-05-11,66.88
2017-05-12,66.64
2017-05-15,66.03
2017-05-16,62.09
2017-05-17,63.95
2017-05-18,64.1
2017-05-19,64.57
2017-05-22,64.7
2017-05-23,64.88
2017-05-24,64.77
2017-05-25,66.27
2017-05-26,64.75
2017-05-30,65.2
2017-05-31,66.26
2017-06-01,67.42
2017-06-02,66.43
2017-06-05,65.69
2017-06-06,65.48
2017-06-07,64.05
2017-06-08,63.61
2017-06-09,64.47
2017-06-12,65.22
2017-06-13,65.61
2017-06-14,65.97
2017-06-15,65.56
2017-06-16,66.17
2017-06-19,66.05
2017-06-20,65.08
2017-06-21,64.29
2017-06-22,65.07
2017-06-23,64.89
2017-06-26,64.45
2017-06-27,64.12
2017-06-28,64.72
2017-06-29,64.06
2017-06-30,64.76
2017-07-03,64.38
2017-07-05,64.1
2017-07-06,63.05
2017-07-07,63.42
2017-07-10,62.34
2017-07-11,63.36
2017-07-12,63.88
2017-07-13,64.24
2017-07-14,64.7
2017-07-17,65.27
2017-07-18,65.21
2017-07-19,65.41
2017-07-20,66.42
2017-07-21,65.76
2017-07-24,65.48
2017-07-25,65.37
2017-07-26,64.89
2017-07-27,64.88
2017-07-28,65.47
2017-07-31,64.78
2017-08-01,57.7
2017-08-02,58.46
2017-08-03,58.5
2017-08-04,57.7
2017-08-07,56.85
2017-08-08,57.05
2017-08-09,56.52
2017-08-10,56.13
2017-08-11,56.55
2017-08-14,56.92
2017-08-15,56.98
2017-08-16,57.34
2017-08-17,56.56
2017-08-18,56.23
2017-08-21,56.47
2017-08-22,56.78
2017-08-23,56.71
2017-08-24,56.94
2017-08-25,57.23
2017-08-28,57.32
2017-08-29,57.07
2017-08-30,57.52
2017-08-31,58.56
2017-09-01,57.88
2017-09-05,57.23
2017-09-06,57.42
2017-09-07,57.37
2017-09-08,58.31
2017-09-11,59.8
2017-09-12,60.29
2017-09-13,59.78
2017-09-14,59.71
2017-09-15,59.63
2017-09-18,60.71
2017-09-19,59.28
2017-09-20,60.53
2017-09-21,61.26
2017-09-22,57.49
2017-09-25,57.68
2017-09-26,58.47
2017-09-27,58.31
2017-09-28,58.47
2017-09-29,59.39
2017-10-02,60.18
2017-10-03,60.91
2017-10-04,59.92
2017-10-05,60.38
2017-10-06,59.82
2017-10-09,53.89
2017-10-10,54.32
2017-10-11,54.56
2017-10-12,54.4
2017-10-13,54.73
2017-10-16,56.93
2017-10-17,56.49
2017-10-18,57.72
2017-10-19,58.7
2017-10-20,59.35
2017-10-23,61
2017-10-24,62.5
2017-10-25,62.61
2017-10-26,61.53
2017-10-27,61.89
2017-10-30,61.07
2017-10-31,60.74
2017-11-01,59.83
2017-11-02,59.52
2017-11-03,59.91
2017-11-06,59.41
2017-11-07,58.96
2017-11-08,54.34
2017-11-09,55.11
2017-11-10,55
2017-11-13,54.99
2017-11-14,54.66
2017-11-15,54.38
2017-11-16,55.64
2017-11-17,54.91
2017-11-20,54.76
2017-11-21,55.17
2017-11-22,55.39
2017-11-24,57.15
2017-11-27,57.99
2017-11-28,58.48
2017-11-29,60.64
2017-11-30,61.06
2017-12-01,61.11
2017-12-04,61.93
2017-12-05,60.93
2017-12-06,69.2
2017-12-07,67.14
2017-12-08,67.71
2017-12-11,69.51
2017-12-12,70.4
2017-12-13,71.3
2017-12-14,69.03
2017-12-15,70.52
2017-12-18,71.07
2017-12-19,71.8
2017-12-20,71.75
2017-12-21,71.9
2017-12-22,71.98
2017-12-26,72.1
2017-12-27,72.31
2017-12-28,72.36
2017-12-29,72.25
2018-01-02,72.54
2018-01-03,72.91
2018-01-04,74.85
2018-01-05,75.53
2018-01-08,75.66
2018-01-09,77.47
2018-01-10,78.07
2018-01-11,80.03
2018-01-12,79.13
2018-01-16,79.15
2018-01-17,79.06
2018-01-18,78.19
2018-01-19,78.61
2018-01-22,78.95
2018-01-23,79.04
2018-01-24,78.64
2018-01-25,78.96
2018-01-26,79.1
2018-01-29,79.09
2018-01-30,78.93
2018-01-31,78.04
2018-02-01,77.55
2018-02-02,75.65
2018-02-05,72.84
2018-02-06,74.03
2018-02-07,74.66
2018-02-08,71.91
2018-02-09,72.97
2018-02-12,73.41
2018-02-13,73.54
2018-02-14,74.75
2018-02-15,73.84
2018-02-16,73.65
2018-02-20,72.77
2018-02-21,72.55
2018-02-22,72.07
2018-02-23,73.18
2018-02-26,73.5
2018-02-27,73.67
2018-02-28,72.02
2018-03-01,70.45
2018-03-02,71.91
2018-03-05,72.19
2018-03-06,72.06
2018-03-07,72.19
2018-03-08,72.6
2018-03-09,72.46
2018-03-12,72.26
2018-03-13,70.19
2018-03-14,70.03
2018-03-15,69.45
2018-03-16,68.53
2018-03-19,68.41
2018-03-20,66.37
2018-03-21,66.84
2018-03-22,65.79
2018-03-23,65
2018-03-26,65.64
2018-03-27,65.34
2018-03-28,66
2018-03-29,65.94
2018-04-02,63.79
2018-04-03,64.35
2018-04-04,63.67
2018-04-05,64.19
2018-04-06,63.03
2018-04-09,62.77
2018-04-10,63.18
2018-04-11,62.96
2018-04-12,62.87
2018-04-13,62.9
2018-04-16,63.17
2018-04-17,63.08
2018-04-18,64.16
2018-04-19,64.12
2018-04-20,63.75
2018-04-23,63.09
2018-04-24,62.85
2018-04-25,63.3
2018-04-26,62.94
2018-04-27,63.22
2018-04-30,62.79
2018-05-01,63.12
2018-05-02,63.38
2018-05-03,63.3
2018-05-04,66.38
2018-05-07,66.02
2018-05-08,64.16
2018-05-09,64.8
2018-05-10,65.77
2018-05-11,66.01
2018-05-14,66.6
2018-05-15,66.29
2018-05-16,66.83
2018-05-17,67.58
2018-05-18,68.12
2018-05-21,67.92
2018-05-22,67.92
2018-05-23,68.53
2018-05-24,68.09
2018-05-25,67.89
2018-05-29,67.05
2018-05-30,68.36
2018-05-31,66.84
2018-06-01,67.09
2018-06-04,66.91
2018-06-05,67.39
2018-06-06,68.7
2018-06-07,68.94
2018-06-08,71.05
2018-06-11,72.11
2018-06-12,71.76
2018-06-13,70.97
2018-06-14,71.04
2018-06-15,73.47
2018-06-18,72.91
2018-06-19,72.97
2018-06-20,72.44
2018-06-21,72.08
2018-06-22,71.95
2018-06-25,71.31
2018-06-26,71.51
2018-06-27,70.8
2018-06-28,70.15
2018-06-29,69.44
2018-07-02,69.48
2018-07-03,69.17
2018-07-05,69.27
2018-07-06,70.22
2018-07-09,70.62
2018-07-10,70.6
2018-07-11,69.64
2018-07-12,71.5
2018-07-13,71.77
2018-07-16,71.71
2018-07-17,71.32
2018-07-18,70.61
2018-07-19,70.57
2018-07-20,69.98
2018-07-23,70.88
2018-07-24,70.07
2018-07-25,69.48
2018-07-26,70.18
2018-07-27,69.67
2018-07-30,69.81
2018-07-31,70.28
2018-08-01,70.34
2018-08-02,74.1
2018-08-03,74.55
2018-08-06,73.03
2018-08-07,72.84
2018-08-08,73.34
2018-08-09,72.65
2018-08-10,71.79
2018-08-13,72.05
2018-08-14,72.18
2018-08-15,71.89
2018-08-16,72.87
2018-08-17,72.49
2018-08-20,72.46
2018-08-21,72.3
2018-08-22,72.05
2018-08-23,72.02
2018-08-24,72.83
2018-08-27,72.16
2018-08-28,72.22
2018-08-29,73.05
2018-08-30,66.51
2018-08-31,69.29
2018-09-04,67.68
2018-09-05,67.09
2018-09-06,67.83
2018-09-07,67.24
2018-09-10,67.39
2018-09-11,66.56
2018-09-12,67.56
2018-09-13,71.33
2018-09-14,70.78
2018-09-17,70.36
2018-09-18,70.71
2018-09-19,70.15
2018-09-20,70.42
2018-09-21,69.92
2018-09-24,70.14
2018-09-25,69.94
2018-09-26,70.13
2018-09-27,71.24
2018-09-28,71.63
2018-10-01,74.04
2018-10-02,72.75
2018-10-03,72.42
2018-10-04,72.83
2018-10-05,72.05
2018-10-08,73.3
2018-10-09,74.84
2018-10-10,73.01
2018-10-11,70.17
2018-10-12,68.93
2018-10-15,69.96
2018-10-16,70.43
2018-10-17,68.36
2018-10-18,68.95
2018-10-19,67.65
2018-10-22,66.99
2018-10-23,67.89
2018-10-24,65.33
2018-10-25,65.34
2018-10-26,65.08
2018-10-29,66.09
2018-10-30,66.76
2018-10-31,67.34
2018-11-01,68.53
2018-11-02,67.66
2018-11-05,68.57
2018-11-06,69.25
2018-11-07,76.08
2018-11-08,70.15
2018-11-09,69.7
2018-11-12,68.2
2018-11-13,64.47
2018-11-14,64.35
2018-11-15,64.64
2018-11-16,62.43
2018-11-19,60.45
2018-11-20,58.69
2018-11-21,59.63
2018-11-23,59.66
2018-11-26,60.78
2018-11-27,62.68
2018-11-28,65.61
2018-11-29,65.66
2018-11-30,66.06
2018-12-03,66.38
2018-12-04,64.07
2018-12-06,61.82
2018-12-07,58.96
2018-12-10,58.01
2018-12-11,57.57
2018-12-12,58.52
2018-12-13,59.4
2018-12-14,58.02
2018-12-17,56.7
2018-12-18,55.08
2018-12-19,53.38
2018-12-20,51.22
2018-12-21,49.82
2018-12-24,48.73
2018-12-26,50.82
2018-12-27,50.68
2018-12-28,50.37
2018-12-31,51.46
2019-01-02,51.73
2019-01-03,50.98
2019-01-04,54
2019-01-07,54.37
2019-01-08,54.06
2019-01-09,53.92
2019-01-10,55.16
2019-01-11,56.07
2019-01-14,55.96
2019-01-15,56.77
2019-01-16,57.27
2019-01-17,56.72
2019-01-18,57.37
2019-01-22,56.85
2019-01-23,56.96
2019-01-24,56.39
2019-01-25,57.09
2019-01-28,56.07
2019-01-29,56.61
2019-01-30,55.84
2019-01-31,56.13
2019-02-01,56.3
2019-02-04,56.6
2019-02-05,56.85
2019-02-06,56.15
2019-02-07,57.03
2019-02-08,56.13
2019-02-11,55.99
2019-02-12,57.36
2019-02-13,57.92
2019-02-14,58.09
2019-02-15,59.1
2019-02-19,59.14
2019-02-20,59.06
2019-02-21,59.21
2019-02-22,58.7
2019-02-25,58.24
2019-02-26,57.99
2019-02-27,56.92
2019-02-28,56.9
2019-03-01,57.05
2019-03-04,55.44
2019-03-05,53.1
2019-03-06,51.04
2019-03-07,50.54
2019-03-08,49.95
2019-03-11,50.47
2019-03-12,51.33
2019-03-13,53.6
2019-03-14,53.58
2019-03-15,53.53
2019-03-18,52.07
2019-03-19,53.91
2019-03-20,53.71
2019-03-21,55
2019-03-22,54.05
2019-03-25,53.24
2019-03-26,53.09
2019-03-27,53.48
2019-03-28,53.52
2019-03-29,54.29
2019-04-01,54.92
2019-04-02,54.6
2019-04-03,55.27
2019-04-04,55.11
2019-04-05,55.95
2019-04-08,55.24
2019-04-09,55.11
2019-04-10,55.9
2019-04-11,54.63
2019-04-12,54.54
2019-04-15,55.17
2019-04-16,55.32
2019-04-17,51.05
2019-04-18,52.23
2019-04-22,51.1
2019-04-23,53.03
2019-04-24,54.03
2019-04-25,53.89
2019-04-26,55.61
2019-04-29,56.15
2019-04-30,55.24
2019-05-01,55.6
2019-05-02,56.51
2019-05-03,56.99
2019-05-06,57.79
2019-05-07,56.6
2019-05-08,51.76
2019-05-09,52.38
2019-05-10,52.11
2019-05-13,51.18
2019-05-14,51.24
2019-05-15,50.22
2019-05-16,50
2019-05-17,49.23
2019-05-20,48.87
2019-05-21,49.6
2019-05-22,49.25
2019-05-23,48.15
2019-05-24,47.56
2019-05-28,46.92
2019-05-29,44.39
2019-05-30,44.64
2019-05-31,43.42
2019-06-03,45.3
2019-06-04,47
2019-06-05,46.62
2019-06-06,46.56
2019-06-07,47.69
2019-06-10,47.99
2019-06-11,48.23
2019-06-12,48.08
2019-06-13,48.9
2019-06-14,49.005
2019-06-17,49.31
2019-06-18,49.66
2019-06-19,51.09
2019-06-20,52.31
2019-06-21,53.38
2019-06-24,53.4
2019-06-25,54.34
2019-06-26,54.95
2019-06-27,55.89
2019-06-28,56.28
2019-07-01,56.25
2019-07-02,56.98
2019-07-03,57.3
2019-07-04,57.3
2019-07-05,58.21
2019-07-08,55.73
2019-07-09,52.705
2019-07-10,54.83
2019-07-11,56.52
2019-07-12,56.83
2019-07-15,57.21
2019-07-16,57.72
2019-07-17,56.615
2019-07-18,56.85
2019-07-19,56
2019-07-22,58.79
2019-07-23,59.245
2019-07-24,59.515
2019-07-25,58.76
2019-07-26,59.505
2019-07-29,59.66
2019-07-30,60.04
2019-07-31,59.96
2019-08-01,59.295
2019-08-02,59.995
2019-08-05,58.625
2019-08-06,59
2019-08-07,59.78
2019-08-08,59.75
2019-08-09,59.78
2019-08-12,58.925
2019-08-13,59.41
2019-08-14,58.31
2019-08-15,58.29
2019-08-16,57.98
2019-08-19,56.985
2019-08-20,55.975
2019-08-21,56.55
2019-08-22,55.855
2019-08-23,54.5
2019-08-26,55.01
2019-08-27,53.815
2019-08-28,54.385
2019-08-29,55.475
2019-08-30,56.32
2019-09-02,56.4
2019-09-03,58.56
2019-09-04,59.195
2019-09-05,58.015
2019-09-06,59.28
2019-09-09,61.26
2019-09-10,61.515
2019-09-11,59.8
2019-09-12,60.37
2019-09-13,61.8
2019-09-16,63.3
2019-09-17,61.7
2019-09-18,61.3
2019-09-19,59.625
2019-09-20,60.05
2019-09-23,59.35
2019-09-24,57.5
2019-09-25,57.855
2019-09-26,55.975
2019-09-27,56.175
2019-09-30,57.01
2019-10-01,56.65
2019-10-02,55.525
2019-10-03,55.76
2019-10-04,55.995
2019-10-07,55.73
2019-10-08,54.175
2019-10-09,55.21
2019-10-10,55.815
2019-10-11,56.51
2019-10-14,55.63
2019-10-15,56.57
2019-10-16,56.96
2019-10-17,57.865
2019-10-18,58.73
2019-10-21,58.655
2019-10-22,59.27
2019-10-23,59.1
2019-10-24,58.175
2019-10-25,57.785
2019-10-28,57.89
2019-10-29,58.975
2019-10-30,58.96
2019-10-31,58.485
2019-11-01,59.51
2019-11-04,61.485
2019-11-05,62.605
2019-11-06,70.43
2019-11-07,69.005
2019-11-08,69.815
2019-11-11,69.405
2019-11-12,69.86
2019-11-13,69.255
2019-11-14,68.935
2019-11-15,70.66
2019-11-18,70.935
2019-11-19,72.58
2019-11-20,72.465
2019-11-21,72.07
2019-11-22,72.495
2019-11-25,73.355
