date,close
2014-06-13,43.4687
2014-06-16,43.9617
2014-06-17,44.3831
2014-06-18,44.4189
2014-06-19,44.4369
2014-06-20,44.392
2014-06-23,44.2665
2014-06-24,44.2307
2014-06-25,44.2217
2014-06-26,44.2755
2014-06-27,44.9299
2014-06-30,44.8313
2014-07-01,45.5664
2014-07-02,45.3333
2014-07-03,45.5395
2014-07-07,44.6879
2014-07-08,44.3382
2014-07-09,44.1859
2014-07-10,43.3611
2014-07-11,42.895
2014-07-14,43.2177
2014-07-15,42.8233
2014-07-16,43.0384
2014-07-17,42.1868
2014-07-18,42.6619
2014-07-21,41.9627
2014-07-22,42.6619
2014-07-23,42.2137
2014-07-24,41.6758
2014-07-25,41.2634
2014-07-28,40.7525
2014-07-29,41.0393
2014-07-30,40.618
2014-07-31,40.3401
2014-08-01,37.1308
2014-08-04,38.3141
2014-08-05,38.3858
2014-08-06,38.1348
2014-08-07,37.839
2014-08-08,37.6776
2014-08-11,37.6508
2014-08-12,36.8708
2014-08-13,36.9874
2014-08-14,37.1039
2014-08-15,36.7543
2014-08-18,37.3908
2014-08-19,38.7892
2014-08-20,38.7265
2014-08-21,38.7803
2014-08-22,38.5651
2014-08-25,38.8161
2014-08-26,39.354
2014-08-27,39.5243
2014-08-28,39.5512
2014-08-29,39.7933
2014-09-02,40.3939
2014-09-03,40.9318
2014-09-04,41.6399
2014-09-05,41.4517
2014-09-08,41.5144
2014-09-09,41.371
2014-09-10,41.4427
2014-09-11,42.1509
2014-09-12,41.8103
2014-09-15,41.371
2014-09-16,41.3979
2014-09-17,41.6758
2014-09-18,42.384
2014-09-19,41.0752
2014-09-22,40.627
2014-09-23,39.9367
2014-09-24,39.7126
2014-09-25,39.0402
2014-09-26,38.7892
2014-09-29,38.7175
2014-09-30,37.8211
2014-10-01,37.848
2014-10-02,38.3141
2014-10-03,38.4665
2014-10-06,38.1438
2014-10-07,37.6059
2014-10-08,38.0721
2014-10-09,37.6597
2014-10-10,37.9197
2014-10-13,38.0273
2014-10-14,38.7803
2014-10-15,39.3271
2014-10-16,39.614
2014-10-17,39.4257
2014-10-20,39.605
2014-10-21,40.2863
2014-10-22,39.4795
2014-10-23,40.5821
2014-10-24,40.3491
2014-10-27,40.1249
2014-10-28,41.9089
2014-10-29,41.8372
2014-10-30,42.6977
2014-10-31,43.0832
2014-11-03,41.8909
2014-11-04,41.9716
2014-11-05,41.9089
2014-11-06,42.4378
2014-11-07,42.0523
2014-11-10,42.5991
2014-11-11,42.6081
2014-11-12,42.7426
2014-11-13,42.635
2014-11-14,43.0474
2014-11-17,42.5095
2014-11-18,42.4109
2014-11-19,41.9716
2014-11-20,42.2495
2014-11-21,42.133
2014-11-24,42.4647
2014-11-25,42.4467
2014-11-26,42.384
2014-11-28,42.2226
2014-12-01,42.1061
2014-12-02,42.2316
2014-12-03,43.5763
2014-12-04,43.1998
2014-12-05,43.0653
2014-12-08,41.8103
2014-12-09,42.6798
2014-12-10,41.7206
2014-12-11,42.5185
2014-12-12,42.0702
2014-12-15,42.877
2014-12-16,43.6749
2014-12-17,45.1988
2014-12-18,45.1361
2014-12-19,45.1092
2014-12-22,45.3154
2014-12-23,45.5574
2014-12-24,45.7367
2014-12-26,46.3373
2014-12-29,46.3284
2014-12-30,46.1311
2014-12-31,45.7815
2015-01-02,44.7954
2015-01-05,44.2934
2015-01-06,43.3253
2015-01-07,43.0205
2015-01-08,43.8811
2015-01-09,42.7605
2015-01-12,43.1012
2015-01-13,43.0294
2015-01-14,43.2535
2015-01-15,42.6977
2015-01-16,43.379
2015-01-20,43.8811
2015-01-21,43.7825
2015-01-22,45.3423
2015-01-23,45.3064
2015-01-26,45.8981
2015-01-27,45.4409
2015-01-28,44.5265
2015-01-29,46.1939
2015-01-30,45.0733
2015-02-02,46.427
2015-02-03,46.9111
2015-02-04,46.9111
2015-02-05,47.3145
2015-02-06,47.6103
2015-02-09,46.7945
2015-02-10,46.8124
2015-02-11,46.4628
2015-02-12,47.0455
2015-02-13,47.0276
2015-02-17,47.0634
2015-02-18,47.1531
2015-02-19,48.0226
2015-02-20,48.444
2015-02-23,48.4888
2015-02-24,51.0975
2015-02-25,54.0468
2015-02-26,53.7061
2015-02-27,52.8814
2015-03-02,53.4193
2015-03-03,53.6344
2015-03-04,52.9172
2015-03-05,53.3117
2015-03-06,52.5856
2015-03-09,53.4282
2015-03-10,53.0159
2015-03-11,53.7778
2015-03-12,54.2619
2015-03-13,54.4233
2015-03-16,55.2839
2015-03-17,55.508
2015-03-18,56.2072
2015-03-19,56.4492
2015-03-20,57.1574
2015-03-23,57.7401
2015-03-24,57.9194
2015-03-25,56.43
2015-03-26,55.801
2015-03-27,56.9758
2015-03-30,57.3089
2015-03-31,56.9296
2015-04-01,56.2265
2015-04-02,56.7723
2015-04-06,56.208
2015-04-07,56.1063
2015-04-08,56.4485
2015-04-09,55.9212
2015-04-10,55.4494
2015-04-13,55.2644
2015-04-14,55.5697
2015-04-15,55.9767
2015-04-16,55.9212
2015-04-17,54.8019
2015-04-20,55.2182
2015-04-21,55.3847
2015-04-22,54.7371
2015-04-23,54.9869
2015-04-24,54.6539
2015-04-27,54.4134
2015-04-28,54.9777
2015-04-29,53.9601
2015-04-30,52.4244
2015-05-01,53.0812
2015-05-04,53.2107
2015-05-05,51.1201
2015-05-06,51.6659
2015-05-07,54.1913
2015-05-08,54.6724
2015-05-11,55.4772
2015-05-12,55.3107
2015-05-13,55.2737
2015-05-14,56.2728
2015-05-15,56.9018
2015-05-18,57.9102
2015-05-19,57.0406
2015-05-20,56.9203
2015-05-21,56.6798
2015-05-22,56.3838
2015-05-26,55.8565
2015-05-27,57.2904
2015-05-28,57.9009
2015-05-29,56.8001
2015-06-01,56.5133
2015-06-02,56.8186
2015-06-03,57.7714
2015-06-04,56.9758
2015-06-05,54.5429
2015-06-08,54.1728
2015-06-09,54.1266
2015-06-10,54.0063
2015-06-11,52.9702
2015-06-12,53.3958
2015-06-15,54.3301
2015-06-16,54.4504
2015-06-17,53.9693
2015-06-18,54.6909
2015-06-19,54.0341
2015-06-22,53.5808
2015-06-23,53.9878
2015-06-24,53.9601
2015-06-25,54.6724
2015-06-26,54.7926
2015-06-29,53.0812
2015-06-30,53.6733
2015-07-01,54.0526
2015-07-02,53.9601
2015-07-06,53.9416
2015-07-07,54.0988
2015-07-08,53.8676
2015-07-09,53.6733
2015-07-10,54.6816
2015-07-13,54.7926
2015-07-14,54.8574
2015-07-15,53.7843
2015-07-16,53.9323
2015-07-17,54.0711
2015-07-20,53.8861
2015-07-21,53.59
2015-07-22,53.8861
2015-07-23,53.4698
2015-07-24,52.6187
2015-07-27,52.3412
2015-07-28,52.9332
2015-07-29,53.0257
2015-07-30,53.701
2015-07-31,54.2653
2015-08-03,54.9684
2015-08-04,52.6834
2015-08-05,52.7575
2015-08-06,53.1182
2015-08-07,52.8777
2015-08-10,52.8685
2015-08-11,53.627
2015-08-12,52.9887
2015-08-13,53.9971
2015-08-14,54.5891
2015-08-17,54.4874
2015-08-18,53.6733
2015-08-19,53.035
2015-08-20,51.6936
2015-08-21,50.6483
2015-08-24,48.4928
2015-08-25,48.5668
2015-08-26,49.8434
2015-08-27,50.898
2015-08-28,51.2403
2015-08-31,51.1201
2015-09-01,49.6492
2015-09-02,49.8619
2015-09-03,50.269
2015-09-04,50.121
2015-09-08,51.1293
2015-09-09,50.3892
2015-09-10,50.269
2015-09-11,50.6205
2015-09-14,50.2412
2015-09-15,50.8795
2015-09-16,51.7399
2015-09-17,51.8139
2015-09-18,51.8139
2015-09-21,52.1099
2015-09-22,50.3522
2015-09-23,49.9175
2015-09-24,49.0201
2015-09-25,49.2236
2015-09-28,49.0664
2015-09-29,49.3717
2015-09-30,50.5188
2015-10-01,50.5095
2015-10-02,49.5382
2015-10-05,51.3051
2015-10-06,50.6853
2015-10-07,51.9989
2015-10-08,53.8306
2015-10-09,54.4134
2015-10-12,54.7371
2015-10-13,54.2376
2015-10-14,53.812
2015-10-15,54.6724
2015-10-16,55.0979
2015-10-19,55.5049
2015-10-20,55.2552
2015-10-21,54.8666
2015-10-22,55.3199
2015-10-23,56.7261
2015-10-26,56.0415
2015-10-27,55.2459
2015-10-28,57.2626
2015-10-29,55.653
2015-10-30,55.3477
2015-11-02,56.2635
2015-11-03,55.616
2015-11-04,56.6521
2015-11-05,55.3199
2015-11-06,54.5799
2015-11-09,53.9323
2015-11-10,54.4781
2015-11-11,54.5521
2015-11-12,54.2746
2015-11-13,54.2653
2015-11-16,54.0433
2015-11-17,53.7288
2015-11-18,54.5429
2015-11-19,53.9601
2015-11-20,54.4596
2015-11-23,55.2737
2015-11-24,54.8204
2015-11-25,55.986
2015-11-27,57.0498
2015-11-30,55.9027
2015-12-01,57.1516
2015-12-02,56.1803
2015-12-03,55.1257
2015-12-04,55.986
2015-12-07,55.0794
2015-12-08,54.6446
2015-12-09,54.4134
2015-12-10,54.2283
2015-12-11,53.627
2015-12-14,53.6825
2015-12-15,54.9777
2015-12-16,56.208
2015-12-17,55.3662
2015-12-18,55.1442
2015-12-21,55.653
2015-12-22,55.8935
2015-12-23,56.1433
2015-12-24,56.43
2015-12-28,56.5595
2015-12-29,56.9481
2015-12-30,57.1886
2015-12-31,56.3283
2016-01-04,54.2006
2016-01-05,53.2107
2016-01-06,51.7769
2016-01-07,50.8148
2016-01-08,50.3152
2016-01-11,51.8324
2016-01-12,51.8324
2016-01-13,49.7324
2016-01-14,49.3439
2016-01-15,48.8906
2016-01-19,49.4734
2016-01-20,49.6769
2016-01-21,50.2135
2016-01-22,51.5548
2016-01-25,50.8703
2016-01-26,51.9249
2016-01-27,51.2681
2016-01-28,50.4355
2016-01-29,53.0997
2016-02-01,53.7288
2016-02-02,53.3865
2016-02-03,51.7306
2016-02-04,52.2672
2016-02-05,51.1663
2016-02-08,50.8518
2016-02-09,50.3892
2016-02-10,51.009
2016-02-11,52.5909
2016-02-12,53.6548
2016-02-16,54.4689
2016-02-17,54.8111
2016-02-18,54.3023
2016-02-19,54.7556
2016-02-22,55.9397
2016-02-23,55.7177
2016-02-24,55.5142
2016-02-25,55.3847
2016-02-26,55.5049
2016-02-29,55.6807
2016-03-01,56.097
2016-03-02,56.4485
2016-03-03,56.5873
2016-03-04,57.1701
2016-03-07,57.3181
2016-03-08,57.3181
2016-03-09,57.6789
2016-03-10,57.2534
2016-03-11,58.4005
2016-03-14,57.8362
2016-03-15,57.3181
2016-03-16,57.6881
2016-03-17,58.3912
2016-03-18,59.0203
2016-03-21,58.6965
2016-03-22,57.9472
2016-03-23,57.2349
2016-03-24,58.0119
2016-03-28,57.6789
2016-03-29,59.3348
2016-03-30,59.8553
2016-03-31,59.911
2016-04-01,59.3812
2016-04-04,58.0522
2016-04-05,57.3737
2016-04-06,58.3031
2016-04-07,56.4628
2016-04-08,57.448
2016-04-11,57.4387
2016-04-12,57.7176
2016-04-13,59.53
2016-04-14,59.2976
2016-04-15,59.7437
2016-04-18,59.9017
2016-04-19,59.9482
2016-04-20,59.6973
2016-04-21,59.0281
2016-04-22,59.911
2016-04-25,59.7158
2016-04-26,60.6824
2016-04-27,60.4222
2016-04-28,59.9575
2016-04-29,60.2549
2016-05-02,60.1806
2016-05-03,59.4184
2016-05-04,59.2047
2016-05-05,59.7065
2016-05-06,60.1527
2016-05-09,65.4876
2016-05-10,66.7052
2016-05-11,66.1475
2016-05-12,67.8948
2016-05-13,68.1829
2016-05-16,69.2239
2016-05-17,67.8019
2016-05-18,67.8762
2016-05-19,68.2387
2016-05-20,69.1681
2016-05-23,68.2201
2016-05-24,70.5344
2016-05-25,70.8225
2016-05-26,70.8039
2016-05-27,71.7427
2016-05-31,71.9007
2016-06-01,71.9854
2016-06-02,73.1051
2016-06-03,72.9372
2016-06-06,73.2171
2016-06-07,73.7116
2016-06-08,75.2978
2016-06-09,75.0459
2016-06-10,73.7116
2016-06-13,72.7039
2016-06-14,73.413
2016-06-15,75.0925
2016-06-16,75.839
2016-06-17,74.5234
2016-06-20,76.2308
2016-06-21,76.3615
2016-06-22,77.1079
2016-06-23,79.3939
2016-06-24,75.6337
2016-06-27,73.0958
2016-06-28,75.3444
2016-06-29,76.5014
2016-06-30,79.1606
2016-07-01,80.0564
2016-07-05,78.946
2016-07-06,79.7298
2016-07-07,80.4296
2016-07-08,82.6596
2016-07-11,84.5164
2016-07-12,85.9533
2016-07-13,84.2925
2016-07-14,83.9846
2016-07-15,83.686
2016-07-18,84.2738
2016-07-19,84.2925
2016-07-20,84.4418
2016-07-21,84.1525
2016-07-22,84.4511
2016-07-25,83.546
2016-07-26,85.1136
2016-07-27,86.3918
2016-07-28,86.7371
2016-07-29,85.4775
2016-08-01,85.944
2016-08-02,84.4418
2016-08-03,83.6673
2016-08-04,87.7541
2016-08-05,87.1663
2016-08-08,90.2267
2016-08-09,89.7509
2016-08-10,89.7135
2016-08-11,89.9468
2016-08-12,89.247
2016-08-15,90.5906
2016-08-16,90.628
2016-08-17,91.9757
2016-08-18,94.0816
2016-08-19,93.1176
2016-08-22,93.155
2016-08-23,93.492
2016-08-24,92.5841
2016-08-25,93.9599
2016-08-26,93.6043
2016-08-29,95.3732
2016-08-30,95.0737
2016-08-31,95.3264
2016-09-01,94.4747
2016-09-02,95.8974
2016-09-06,95.6634
2016-09-07,94.7555
2016-09-08,94.0723
2016-09-09,89.0556
2016-09-12,90.1132
2016-09-13,88.026
2016-09-14,88.3536
2016-09-15,89.5984
2016-09-16,88.0541
2016-09-19,88.6625
2016-09-20,88.8684
2016-09-21,89.926
2016-09-22,91.9289
2016-09-23,91.1053
2016-09-26,90.7964
2016-09-27,93.7915
2016-09-28,93.8851
2016-09-29,91.592
2016-09-30,91.7417
2016-10-03,92.6496
2016-10-04,92.4437
2016-10-05,90.7122
2016-10-06,90.7216
2016-10-07,91.0117
2016-10-10,91.6201
2016-10-11,89.327
2016-10-12,89.7295
2016-10-13,87.9324
2016-10-14,87.2305
2016-10-17,86.5191
2016-10-18,84.4788
2016-10-19,86.828
2016-10-20,86.332
2016-10-21,85.6581
2016-10-24,87.9231
2016-10-25,87.9886
2016-10-26,86.6408
2016-10-27,83.0281
2016-10-28,82.6911
2016-10-31,83.8143
2016-11-01,81.3808
2016-11-02,82.2699
2016-11-03,78.8069
2016-11-04,81.0532
2016-11-07,82.6911
2016-11-08,83.5803
2016-11-09,83.3463
2016-11-10,83.9546
2016-11-11,86.9029
2016-11-14,88.728
2016-11-15,89.2896
2016-11-16,91.489
2016-11-17,93.2205
2016-11-18,93.2205
2016-11-21,93.6417
2016-11-22,96.8707
2016-11-23,96.4946
2016-11-25,97.6702
2016-11-28,96.7767
2016-11-29,100.0214
2016-11-30,98.8458
2016-12-01,99.0339
2016-12-02,97.4821
2016-12-05,100.3506
2016-12-06,100.6327
2016-12-07,102.3726
2016-12-08,102.6078
2016-12-09,102.984
2016-12-12,102.7488
2016-12-13,101.5732
2016-12-14,101.4321
2016-12-15,102.8899
2016-12-16,101.7143
2016-12-19,103.031
2016-12-20,106.2287
2016-12-21,104.6768
2016-12-22,103.5953
2016-12-23,105.1471
2016-12-27,105.5233
2016-12-28,103.078
2016-12-29,102.1375
2016-12-30,101.3381
2017-01-03,109.5674
2017-01-04,102.6078
2017-01-05,102.1375
2017-01-06,103.1721
2017-01-09,100.9149
2017-01-10,103.3602
2017-01-11,103.5483
2017-01-12,103.4542
2017-01-13,105.8525
2017-01-17,102.984
2017-01-18,103.6423
2017-01-19,101.2911
2017-01-20,99.7393
2017-01-23,101.5262
2017-01-24,105.1471
2017-01-25,108.4388
2017-01-26,109.0031
2017-01-27,109.8496
2017-01-30,103.4542
2017-01-31,103.2191
2017-02-01,101.9024
2017-02-02,101.5732
2017-02-03,101.8083
2017-02-06,101.6673
2017-02-07,101.6202
2017-02-08,103.8304
2017-02-09,105.8054
2017-02-10,101.9024
2017-02-13,102.0905
2017-02-14,101.9964
2017-02-15,102.2316
2017-02-16,103.3131
2017-02-17,102.4667
2017-02-21,103.5953
2017-02-22,104.3947
2017-02-23,103.078
2017-02-24,102.5607
2017-02-27,104.7239
2017-02-28,101.2911
2017-03-01,105.6173
2017-03-02,105.9952
2017-03-03,106.0424
2017-03-06,105.5228
2017-03-07,103.9641
2017-03-08,101.6968
2017-03-09,95.3673
2017-03-10,96.1703
2017-03-13,96.8316
2017-03-14,96.3593
2017-03-15,98.721
2017-03-16,97.0205
2017-03-17,97.2567
2017-03-20,96.2175
2017-03-21,93.0528
2017-03-22,94.1392
2017-03-23,94.2809
2017-03-24,94.4226
2017-03-27,93.3835
2017-03-28,94.5171
2017-03-29,93.6669
2017-03-30,94.5171
2017-03-31,94.2809
2017-04-03,92.1553
2017-04-04,91.1162
2017-04-05,88.7072
2017-04-06,87.6208
2017-04-07,89.0851
2017-04-10,88.66
2017-04-11,89.5574
2017-04-12,88.5655
2017-04-13,87.6208
2017-04-17,87.9042
2017-04-18,88.2821
2017-04-19,89.7936
2017-04-20,91.9664
2017-04-21,91.8247
2017-04-24,93.8558
2017-04-25,95.8397
2017-04-26,96.5954
2017-04-27,97.0678
2017-04-28,95.5563
2017-05-01,96.9261
2017-05-02,95.6507
2017-05-03,95.7452
2017-05-04,92.9583
2017-05-05,89.7936
2017-05-08,87.8097
2017-05-09,87.9514
2017-05-10,86.5816
2017-05-11,87.9042
2017-05-12,86.6761
2017-05-15,87.3374
2017-05-16,88.9906
2017-05-17,85.9515
2017-05-18,85.619
2017-05-19,84.3369
2017-05-22,84.8593
2017-05-23,85.5716
2017-05-24,85.5241
2017-05-25,84.2419
2017-05-26,83.5771
2017-05-30,83.2922
2017-05-31,84.5268
2017-06-01,85.1442
2017-06-02,87.661
2017-06-05,87.6135
2017-06-06,90.7001
2017-06-07,88.1833
2017-06-08,90.2728
2017-06-09,90.3677
2017-06-12,92.4097
2017-06-13,93.5019
2017-06-14,93.9768
2017-06-15,94.0242
2017-06-16,93.4069
2017-06-19,94.0717
2017-06-20,94.5941
2017-06-21,95.2589
2017-06-22,97.1109
2017-06-23,98.8679
2017-06-26,100.245
2017-06-27,98.7729
2017-06-28,99.7702
2017-06-29,98.2031
2017-06-30,97.2534
2017-07-03,98.4405
2017-07-05,96.4936
2017-07-06,93.7393
2017-07-07,95.2114
2017-07-10,94.6891
2017-07-11,95.5913
2017-07-12,95.5438
2017-07-13,96.1137
2017-07-14,95.8762
2017-07-17,96.4936
2017-07-18,96.0662
2017-07-19,97.8232
2017-07-20,97.6807
2017-07-21,96.7785
2017-07-24,97.3483
2017-07-25,100.5774
2017-07-26,101.0048
2017-07-27,101.7171
2017-07-28,101.9546
2017-07-31,101.3847
2017-08-01,95.8287
2017-08-02,98.7729
2017-08-03,99.0104
2017-08-04,95.8287
2017-08-07,94.974
2017-08-08,91.9823
2017-08-09,90.4152
2017-08-10,89.2281
2017-08-11,91.6974
2017-08-14,93.8343
2017-08-15,92.5996
2017-08-16,91.3109
2017-08-17,90.2608
2017-08-18,90.6426
2017-08-21,90.7381
2017-08-22,91.2631
2017-08-23,90.8813
2017-08-24,90.5471
2017-08-25,90.0221
2017-08-28,96.7045
2017-08-29,94.8907
2017-08-30,94.8907
2017-08-31,94.318
2017-09-01,94.6998
2017-09-05,94.4611
2017-09-06,95.559
2017-09-07,94.4611
2017-09-08,95.559
2017-09-11,97.4205
2017-09-12,98.757
2017-09-13,100.8095
2017-09-14,123.9285
2017-09-15,101.0959
2017-09-18,101.0481
2017-09-19,101.6209
2017-09-20,101.43
2017-09-21,102.0505
2017-09-22,102.8619
2017-09-25,103.8166
2017-09-26,104.9621
2017-09-27,108.9716
2017-09-28,108.8284
2017-09-29,110.5945
2017-10-02,114.1266
2017-10-03,111.931
2017-10-04,109.2103
2017-10-05,109.3535
2017-10-06,110.8331
2017-10-09,111.6446
2017-10-10,112.9811
2017-10-11,113.6493
2017-10-12,114.0789
2017-10-13,115.0813
2017-10-16,116.1791
2017-10-17,115.2245
2017-10-18,116.561
2017-10-19,116.37
2017-10-20,117.7542
2017-10-23,117.0383
2017-10-24,118.2316
2017-10-25,117.9452
2017-10-26,119.3771
2017-10-27,119.5681
2017-10-30,115.845
2017-10-31,118.1838
2017-11-01,117.2292
2017-11-02,110.8809
2017-11-03,112.9333
2017-11-06,111.5014
2017-11-07,110.3081
2017-11-08,110.499
2017-11-09,110.2126
2017-11-10,109.8308
2017-11-13,110.2604
2017-11-14,110.9763
2017-11-15,110.3558
2017-11-16,113.0416
2017-11-17,113.6171
2017-11-20,116.207
2017-11-21,119.1805
2017-11-22,117.8856
2017-11-24,118.9886
2017-11-27,118.0774
2017-11-28,123.1132
2017-11-29,124.8398
2017-11-30,125.5592
2017-12-01,124.6479
2017-12-04,123.2571
2017-12-05,122.5377
2017-12-06,121.5785
2017-12-07,121.7224
2017-12-08,122.5856
2017-12-11,119.8999
2017-12-12,119.3723
2017-12-13,122.6336
2017-12-14,120.4274
2017-12-15,124.2642
2017-12-18,126.4224
2017-12-19,123.9285
2017-12-20,123.7367
2017-12-21,122.9693
2017-12-22,123.5928
2017-12-26,124.2163
2017-12-27,124.4561
2017-12-28,126.2786
2017-12-29,124.6959
2018-01-02,126.0388
2018-01-03,124.8877
2018-01-04,124.8877
2018-01-05,124.0724
2018-01-08,123.1132
2018-01-09,122.0581
2018-01-10,120.8591
2018-01-11,123.305
2018-01-12,121.2428
2018-01-16,118.605
2018-01-17,122.7775
2018-01-18,120.907
2018-01-19,121.4346
2018-01-22,121.0509
2018-01-23,121.4346
2018-01-24,123.0652
2018-01-25,119.708
2018-01-26,110.6436
2018-01-29,109.2528
2018-01-30,109.9722
2018-01-31,105.7517
2018-02-01,103.6894
2018-02-02,100.5241
2018-02-05,100.4281
2018-02-06,104.7925
2018-02-07,106.5191
2018-02-08,105.5119
2018-02-09,110.0201
2018-02-12,112.1783
2018-02-13,111.2671
2018-02-14,113.1855
2018-02-15,113.809
2018-02-16,109.1089
2018-02-20,108.917
2018-02-21,106.615
2018-02-22,106.9027
2018-02-23,109.6844
2018-02-26,112.61
2018-02-27,106.4711
2018-02-28,104.8405
2018-03-01,101.771
2018-03-02,101.4353
2018-03-05,104.6966
2018-03-06,106.7589
2018-03-07,106.3752
2018-03-08,104.7445
2018-03-09,106.8068
2018-03-12,106.2793
2018-03-13,105.4639
2018-03-14,105.7037
2018-03-15,104.2095
2018-03-16,106.3785
2018-03-19,104.3541
2018-03-20,105.0771
2018-03-21,103.8721
2018-03-22,99.8233
2018-03-23,97.3169
2018-03-26,97.9435
2018-03-27,97.3169
2018-03-28,97.7989
2018-03-29,100.4017
2018-04-02,95.3888
2018-04-03,95.0032
2018-04-04,97.124
2018-04-05,99.3895
2018-04-06,96.5938
2018-04-09,96.2564
2018-04-10,93.5572
2018-04-11,92.6896
2018-04-12,91.9184
2018-04-13,91.099
2018-04-16,91.9184
2018-04-17,92.545
2018-04-18,92.5932
2018-04-19,90.2796
2018-04-20,90.0868
2018-04-23,89.5566
2018-04-24,88.4962
2018-04-25,89.2674
2018-04-26,95.0514
2018-04-27,94.8586
2018-04-30,91.8702
2018-05-01,92.786
2018-05-02,94.714
2018-05-03,92.545
2018-05-04,91.4846
2018-05-07,91.0026
2018-05-08,86.4235
2018-05-09,84.9293
2018-05-10,86.5681
2018-05-11,85.3631
2018-05-14,83.3387
2018-05-15,83.1941
2018-05-16,85.2667
2018-05-17,85.6523
2018-05-18,88.3516
2018-05-21,89.5084
2018-05-22,88.8818
2018-05-23,86.7127
2018-05-24,84.4955
2018-05-25,84.6401
2018-05-29,85.6041
2018-05-30,88.448
2018-05-31,84.5437
2018-06-01,81.0009
2018-06-04,80.2729
2018-06-05,84.0584
2018-06-06,88.572
2018-06-07,90.5618
2018-06-08,91.8236
2018-06-11,91.9207
2018-06-12,90.7559
2018-06-13,88.9117
2018-06-14,88.4749
2018-06-15,90.1735
2018-06-18,88.6205
2018-06-19,88.4749
2018-06-20,93.5223
2018-06-21,92.2119
2018-06-22,90.4647
2018-06-25,89.3485
2018-06-26,89.2029
2018-06-27,88.8632
2018-06-28,88.7661
2018-06-29,87.5042
2018-07-02,88.8632
2018-07-03,87.844
2018-07-05,89.4455
2018-07-06,91.7751
2018-07-09,91.2898
2018-07-10,89.6397
2018-07-11,89.5426
2018-07-12,90.4162
2018-07-13,91.7751
2018-07-16,90.5133
2018-07-17,92.5031
2018-07-18,94.3473
2018-07-19,95.7548
2018-07-20,94.6871
2018-07-23,91.5324
2018-07-24,88.5234
2018-07-25,85.0776
2018-07-26,87.6013
2018-07-27,84.7864
2018-07-30,87.7469
2018-07-31,89.2514
2018-08-01,85.2717
2018-08-02,94.8812
2018-08-03,97.5505
2018-08-06,95.318
2018-08-07,95.318
2018-08-08,96.5798
2018-08-09,95.8518
2018-08-10,95.2695
2018-08-13,94.59
2018-08-14,96.4828
2018-08-15,94.7841
2018-08-16,96.7254
2018-08-17,91.581
2018-08-20,90.6103
2018-08-21,91.7266
2018-08-22,90.4162
2018-08-23,89.2999
2018-08-24,89.6882
2018-08-27,91.6295
2018-08-28,91.0957
2018-08-29,91.6295
2018-08-30,90.848
2018-08-31,90.7992
2018-09-04,88.992
2018-09-05,89.5781
2018-09-06,89.2362
2018-09-07,90.7503
2018-09-10,91.3853
2018-09-11,91.9714
2018-09-12,90.2619
2018-09-13,90.2619
2018-09-14,93.1437
2018-09-17,92.7529
2018-09-18,92.2156
2018-09-19,94.1694
2018-09-20,91.9226
2018-09-21,89.8223
2018-09-24,87.0871
2018-09-25,86.4522
2018-09-26,84.938
2018-09-27,83.4239
2018-09-28,80.8841
2018-10-01,80.5128
2018-10-02,79.4383
2018-10-03,79.7118
2018-10-04,79.8583
2018-10-05,78.8033
2018-10-08,78.4419
2018-10-09,76.7129
2018-10-10,75.9509
2018-10-11,76.6445
2018-10-12,76.2342
2018-10-15,76.3123
2018-10-16,76.8985
2018-10-17,76.9571
2018-10-18,74.1339
2018-10-19,72.7077
2018-10-22,72.737
2018-10-23,73.6162
2018-10-24,70.8517
2018-10-25,70.5586
2018-10-26,68.39
2018-10-29,66.2214
2018-10-30,67.9309
2018-10-31,67.7453
2018-11-01,75.9216
2018-11-02,77.0059
2018-11-05,75.9704
2018-11-06,76.117
2018-11-07,75.736
2018-11-08,73.2841
2018-11-09,71.5453
2018-11-12,71.1838
2018-11-13,71.9555
2018-11-14,71.3597
2018-11-15,72.5807
2018-11-16,73.0692
2018-11-19,73.4111
2018-11-20,68.8198
2018-11-21,69.9432
2018-11-23,70.8495
2018-11-26,73.6374
2018-11-27,72.6523
2018-11-28,75.1643
2018-11-29,75.1545
2018-11-30,76.2283
2018-12-03,79.223
2018-12-04,71.1352
2018-12-06,70.7116
2018-12-07,69.7758
2018-12-10,66.978
2018-12-11,65.8747
2018-12-12,64.8896
2018-12-13,63.5104
2018-12-14,61.5796
2018-12-17,60.8112
2018-12-18,60.7915
2018-12-19,63.0671
2018-12-20,65.7762
2018-12-21,60.5452
2018-12-24,59.6882
2018-12-26,62.7026
2018-12-27,63.3824
2018-12-28,64.3182
2018-12-31,65.8057
2019-01-02,65.9929
2019-01-03,64.2394
2019-01-04,70.485
2019-01-07,71.8543
2019-01-08,72.5045
2019-01-09,75.2431
2019-01-10,76.0115
2019-01-11,75.1545
2019-01-14,75.2136
2019-01-15,74.79
2019-01-16,77.3414
2019-01-17,78.366
2019-01-18,82.2769
2019-01-22,81.9025
2019-01-23,80.9667
2019-01-24,81.6464
2019-01-25,82.6118
2019-01-28,82.533
2019-01-29,80.2475
2019-01-30,80.7401
2019-01-31,81.2129
2019-02-01,79.8239
2019-02-04,78.3463
2019-02-05,79.0161
2019-02-06,76.8292
2019-02-07,75.9721
2019-02-08,75.8441
2019-02-11,78.4645
2019-02-12,80.346
2019-02-13,79.6565
2019-02-14,79.5087
2019-02-15,81.7351
2019-02-19,82.8778
2019-02-20,82.4837
2019-02-21,81.7055
2019-02-22,82.4049
2019-02-25,82.5133
2019-02-26,80.6514
2019-02-27,80.6908
2019-02-28,80.2672
2019-03-01,82.0601
2019-03-04,81.4888
2019-03-05,80.4446
2019-03-06,78.3266
2019-03-07,77.5325
2019-03-08,78.128
2019-03-11,79.9643
2019-03-12,79.0908
2019-03-13,78.8427
2019-03-14,78.0883
2019-03-15,78.9519
2019-03-18,79.468
2019-03-19,78.8129
2019-03-20,76.4307
2019-03-21,76.6193
2019-03-22,73.1551
2019-03-25,73.2543
2019-03-26,74.1278
2019-03-27,74.5249
2019-03-28,76.7781
2019-03-29,76.252
2019-04-01,77.0461
2019-04-02,75.2693
2019-04-03,79.1206
2019-04-04,81.2746
2019-04-05,82.5153
2019-04-08,84.4013
2019-04-09,83.8454
2019-04-10,86.1781
2019-04-11,87.0615
2019-04-12,89.3742
2019-04-15,89.682
2019-04-16,90.4363
2019-04-17,92.3421
2019-04-18,92.4513
2019-04-22,89.9897
2019-04-23,90.9922
2019-04-24,91.0617
2019-04-25,86.4957
2019-04-26,89.5728
2019-04-29,89.1856
2019-04-30,87.2004
2019-05-01,87.0813
2019-05-02,87.6173
2019-05-03,90.1584
2019-05-06,89.4437
2019-05-07,92.9873
2019-05-08,92.7491
2019-05-09,89.7217
2019-05-10,90.3668
2019-05-13,87.0416
2019-05-14,89.4537
2019-05-15,90.5852
2019-05-16,88.5603
2019-05-17,86.1185
2019-05-20,85.7215
2019-05-21,89.0268
2019-05-22,86.9126
2019-05-23,86.8927
2019-05-24,88.5107
2019-05-28,86.049
2019-05-29,86.7438
2019-05-30,86.3468
2019-05-31,82.2573
2019-06-03,84.1035
2019-06-04,87.9548
2019-06-05,87.26
2019-06-06,86.43
2019-06-07,87.74
2019-06-10,92.08
2019-06-11,90.55
2019-06-12,87.81
2019-06-13,90.38
2019-06-14,89.39
2019-06-17,89
2019-06-18,90.98
2019-06-19,90.425
2019-06-20,91.28
2019-06-21,89.965
2019-06-24,88.955
2019-06-25,87.01
2019-06-26,88.36
2019-06-27,89.965
2019-06-28,90.29
2019-07-01,89.865
2019-07-02,88.145
2019-07-03,87.61
2019-07-04,87.61
2019-07-05,89.32
2019-07-08,87.355
2019-07-09,88.19
2019-07-10,88.51
2019-07-11,87.25
2019-07-12,90.57
2019-07-15,90.515
2019-07-16,91.23
2019-07-17,90.61
2019-07-18,91.7
2019-07-19,91.405
2019-07-22,88.66
2019-07-23,89.7
2019-07-24,91.835
2019-07-25,91.05
2019-07-26,91.64
2019-07-29,90.275
2019-07-30,91.265
2019-07-31,91.52
2019-08-01,90.025
2019-08-02,89.185
2019-08-05,84.9
2019-08-06,87.4
2019-08-07,90.935
2019-08-08,92.51
2019-08-09,92.55
2019-08-12,91.16
2019-08-13,89.79
2019-08-14,87.34
2019-08-15,82.73
2019-08-16,85.79
2019-08-19,86.7
2019-08-20,85.625
2019-08-21,84.93
2019-08-22,84.655
2019-08-23,80.89
2019-08-26,81.915
2019-08-27,80.875
2019-08-28,81.625
2019-08-29,84.39
2019-08-30,84.79
2019-09-02,84.75
2019-09-03,82.475
2019-09-04,83.4
2019-09-05,86.33
2019-09-06,84.97
2019-09-09,87.915
2019-09-10,90.33
2019-09-11,92.45
2019-09-12,93.5
2019-09-13,94.305
2019-09-16,94.255
2019-09-17,93.3
2019-09-18,93.22
2019-09-19,92.5
2019-09-20,93.52
2019-09-23,94.04
2019-09-24,90.97
2019-09-25,91.735
2019-09-26,89.54
2019-09-27,88.69
2019-09-30,91.85
2019-10-01,90.88
2019-10-02,89.29
2019-10-03,89.9
2019-10-04,89.6
2019-10-07,89.74
2019-10-08,89.1
2019-10-09,89.02
2019-10-10,88.73
2019-10-11,90.93
2019-10-14,90.105
2019-10-15,92.81
2019-10-16,95.32
2019-10-17,94.66
2019-10-18,95.23
2019-10-21,97.58
2019-10-22,97.605
2019-10-23,99.56
2019-10-24,97.57
2019-10-25,97.58
2019-10-28,101.4
2019-10-29,100.985
2019-10-30,100.41
2019-10-31,96.91
2019-11-01,99.965
2019-11-04,103.44
2019-11-05,102.18
2019-11-06,106.03
2019-11-07,106.685
2019-11-08,105.62
2019-11-11,106.54
2019-11-12,106.47
2019-11-13,104.76
2019-11-14,104.45
2019-11-15,104.785
2019-11-18,105.235
2019-11-19,105.185
2019-11-20,104.46
2019-11-21,103.09
2019-11-22,103.765
2019-11-25,107.82
