date,close
2014-06-13,21.1249
2014-06-16,21.1377
2014-06-17,21.1169
2014-06-18,21.1488
2014-06-19,21.1409
2014-06-20,21.1616
2014-06-23,21.1807
2014-06-24,21.1807
2014-06-25,21.1807
2014-06-26,21.1728
2014-06-27,21.1648
2014-06-30,21.093
2014-07-01,21.1675
2014-07-02,21.1675
2014-07-03,21.1675
2014-07-07,21.1835
2014-07-08,21.1835
2014-07-09,21.1875
2014-07-10,21.1435
2014-07-11,21.1355
2014-07-14,21.1515
2014-07-15,21.1195
2014-07-16,21.1275
2014-07-17,21.0235
2014-07-18,21.0475
2014-07-21,21.0075
2014-07-22,21.0315
2014-07-23,21.0475
2014-07-24,21.0554
2014-07-25,21.0395
2014-07-28,21.0395
2014-07-29,21.0315
2014-07-30,20.9434
2014-07-31,20.7914
2014-08-01,20.8026
2014-08-04,20.7865
2014-08-05,20.7383
2014-08-06,20.8026
2014-08-07,20.7383
2014-08-08,20.7311
2014-08-11,20.7303
2014-08-12,20.7785
2014-08-13,20.915
2014-08-14,20.9391
2014-08-15,20.9817
2014-08-18,21.0355
2014-08-19,21.0515
2014-08-20,21.0355
2014-08-21,21.0676
2014-08-22,21.0515
2014-08-25,21.0756
2014-08-26,21.156
2014-08-27,21.0997
2014-08-28,21.0837
2014-08-29,21.0676
2014-09-02,21.1124
2014-09-03,21.0721
2014-09-04,21.0641
2014-09-05,21.0721
2014-09-08,21.0399
2014-09-09,20.9754
2014-09-10,20.9673
2014-09-11,20.9431
2014-09-12,20.9431
2014-09-15,20.9431
2014-09-16,20.9431
2014-09-17,20.9431
2014-09-18,20.9431
2014-09-19,20.9673
2014-09-22,20.9673
2014-09-23,20.919
2014-09-24,20.8867
2014-09-25,20.7577
2014-09-26,20.79
2014-09-29,20.6529
2014-09-30,20.7174
2014-10-01,20.7153
2014-10-02,20.7558
2014-10-03,20.8367
2014-10-06,20.8448
2014-10-07,20.8124
2014-10-08,20.8853
2014-10-09,20.7234
2014-10-10,20.6749
2014-10-13,20.6101
2014-10-14,20.5778
2014-10-15,20.5535
2014-10-16,20.5373
2014-10-17,20.6911
2014-10-20,20.7477
2014-10-21,20.8529
2014-10-22,20.8448
2014-10-23,20.95
2014-10-24,20.95
2014-10-27,20.9014
2014-10-28,20.9581
2014-10-29,20.9176
2014-10-30,21.0348
2014-10-31,20.9581
2014-11-03,20.9374
2014-11-04,20.9455
2014-11-05,20.9293
2014-11-06,20.9536
2014-11-07,20.9211
2014-11-10,20.9211
2014-11-11,20.8887
2014-11-12,20.9293
2014-11-13,21.0348
2014-11-14,20.8562
2014-11-17,20.8156
2014-11-18,20.7993
2014-11-19,20.71
2014-11-20,20.71
2014-11-21,20.7262
2014-11-24,20.7506
2014-11-25,20.7425
2014-11-26,20.775
2014-11-28,20.6694
2014-12-01,20.6256
2014-12-02,20.6012
2014-12-03,20.5963
2014-12-04,20.593
2014-12-05,20.4789
2014-12-08,20.5433
2014-12-09,20.4545
2014-12-10,20.2426
2014-12-11,20.2018
2014-12-12,20.0959
2014-12-15,20.0144
2014-12-16,19.8025
2014-12-17,19.9411
2014-12-18,20.0715
2014-12-19,20.2589
2014-12-22,20.21
2014-12-23,20.2344
2014-12-24,20.263
2014-12-26,20.3119
2014-12-29,20.2678
2014-12-30,20.3218
2014-12-31,20.3824
2015-01-02,20.4315
2015-01-05,20.3333
2015-01-06,20.276
2015-01-07,20.3333
2015-01-08,20.3906
2015-01-09,20.4315
2015-01-12,20.4193
2015-01-13,20.3988
2015-01-14,20.366
2015-01-15,20.276
2015-01-16,20.3006
2015-01-20,20.3006
2015-01-21,20.3088
2015-01-22,20.3333
2015-01-23,20.3579
2015-01-26,20.407
2015-01-27,20.3497
2015-01-28,20.5288
2015-01-29,20.4233
2015-01-30,20.3857
2015-02-02,20.443
2015-02-03,20.4677
2015-02-04,20.4677
2015-02-05,20.5581
2015-02-06,20.5992
2015-02-09,20.5827
2015-02-10,20.6452
2015-02-11,20.6238
2015-02-12,20.6731
2015-02-13,20.6402
2015-02-17,20.7224
2015-02-18,20.7651
2015-02-19,20.7553
2015-02-20,20.7799
2015-02-23,20.7881
2015-02-24,20.821
2015-02-25,20.8292
2015-02-26,20.8457
2015-02-27,20.8949
2015-03-02,20.9312
2015-03-03,20.8978
2015-03-04,20.8653
2015-03-05,20.857
2015-03-06,20.7334
2015-03-09,20.7993
2015-03-10,20.7334
2015-03-11,20.7457
2015-03-12,20.774
2015-03-13,20.7169
2015-03-16,20.6839
2015-03-17,20.6344
2015-03-18,20.7004
2015-03-19,20.6921
2015-03-20,20.6921
2015-03-23,20.7416
2015-03-24,20.7416
2015-03-25,20.7466
2015-03-26,20.7499
2015-03-27,20.7705
2015-03-30,20.7911
2015-03-31,20.8075
2015-04-01,20.7872
2015-04-02,20.8203
2015-04-06,20.8534
2015-04-07,20.899
2015-04-08,20.8948
2015-04-09,20.9693
2015-04-10,20.9693
2015-04-13,20.9486
2015-04-14,21.0054
2015-04-15,21.0024
2015-04-16,21.0024
2015-04-17,20.9942
2015-04-20,21.0356
2015-04-21,20.9942
2015-04-22,21.048
2015-04-23,21.0231
2015-04-24,21.0356
2015-04-27,21.0521
2015-04-28,21.0438
2015-04-29,21.0273
2015-04-30,21.0107
2015-05-01,21.0652
2015-05-04,21.0569
2015-05-05,21.0569
2015-05-06,21.0403
2015-05-07,21.0652
2015-05-08,21.1068
2015-05-11,21.0902
2015-05-12,21.0943
2015-05-13,21.0486
2015-05-14,21.1359
2015-05-15,21.1317
2015-05-18,21.14
2015-05-19,21.1317
2015-05-20,21.1276
2015-05-21,21.14
2015-05-22,21.1068
2015-05-26,21.1276
2015-05-27,21.1566
2015-05-28,21.1483
2015-05-29,21.1317
2015-06-01,21.164
2015-06-02,21.1473
2015-06-03,21.1139
2015-06-04,21.0823
2015-06-05,21.0472
2015-06-08,21.0222
2015-06-09,21.0055
2015-06-10,21.0263
2015-06-11,21.0555
2015-06-12,21.0222
2015-06-15,20.9971
2015-06-16,21.0055
2015-06-17,20.9971
2015-06-18,21.0639
2015-06-19,21.0472
2015-06-22,21.0722
2015-06-23,21.1056
2015-06-24,21.0806
2015-06-25,21.0806
2015-06-26,21.0389
2015-06-29,20.9471
2015-06-30,20.9805
2015-07-01,21.0055
2015-07-02,21.0204
2015-07-06,21.0139
2015-07-07,20.9636
2015-07-08,20.8966
2015-07-09,20.9552
2015-07-10,20.9971
2015-07-13,21.0139
2015-07-14,20.9971
2015-07-15,21.0055
2015-07-16,21.0223
2015-07-17,20.9971
2015-07-20,20.9469
2015-07-21,20.8966
2015-07-22,20.7961
2015-07-23,20.7709
2015-07-24,20.7542
2015-07-27,20.7039
2015-07-28,20.7039
2015-07-29,20.7877
2015-07-30,20.8212
2015-07-31,20.8421
2015-08-03,20.7806
2015-08-04,20.7722
2015-08-05,20.7554
2015-08-06,20.6881
2015-08-07,20.6713
2015-08-10,20.6544
2015-08-11,20.5535
2015-08-12,20.5451
2015-08-13,20.5282
2015-08-14,20.5282
2015-08-17,20.5451
2015-08-18,20.503
2015-08-19,20.4848
2015-08-20,20.4104
2015-08-21,20.2927
2015-08-24,20.1665
2015-08-25,20.1875
2015-08-26,20.2365
2015-08-27,20.3095
2015-08-28,20.3852
2015-08-31,20.2981
2015-09-01,20.3631
2015-09-02,20.473
2015-09-03,20.4392
2015-09-04,20.4138
2015-09-08,20.5152
2015-09-09,20.5067
2015-09-10,20.4814
2015-09-11,20.5405
2015-09-14,20.4899
2015-09-15,20.4814
2015-09-16,20.4556
2015-09-17,20.4814
2015-09-18,20.38
2015-09-21,20.3968
2015-09-22,20.2955
2015-09-23,20.2786
2015-09-24,20.1861
2015-09-25,20.1539
2015-09-28,19.9913
2015-09-29,20.042
2015-09-30,19.9322
2015-10-01,19.8299
2015-10-02,19.8384
2015-10-05,19.9571
2015-10-06,20.0335
2015-10-07,20.1353
2015-10-08,20.2287
2015-10-09,20.2626
2015-10-12,20.3262
2015-10-13,20.2881
2015-10-14,20.2711
2015-10-15,20.3135
2015-10-16,20.3219
2015-10-19,20.3559
2015-10-20,20.3814
2015-10-21,20.3391
2015-10-22,20.3899
2015-10-23,20.4832
2015-10-26,20.4831
2015-10-27,20.4238
2015-10-28,20.4663
2015-10-29,20.4578
2015-10-30,20.4663
2015-11-02,20.494
2015-11-03,20.5068
2015-11-04,20.5111
2015-11-05,20.494
2015-11-06,20.264
2015-11-09,20.2632
2015-11-10,20.1959
2015-11-11,20.2036
2015-11-12,20.1022
2015-11-13,20.0596
2015-11-16,20.1363
2015-11-17,20.0937
2015-11-18,20.0937
2015-11-19,19.9744
2015-11-20,20.1192
2015-11-23,20.0511
2015-11-24,20.0596
2015-11-25,20.0511
2015-11-27,20
2015-11-30,20.1277
2015-12-01,20.2363
2015-12-02,20.1422
2015-12-03,20.1593
2015-12-04,20.1499
2015-12-07,20.0566
2015-12-08,19.9369
2015-12-09,19.9095
2015-12-10,19.8684
2015-12-11,19.5261
2015-12-14,19.4406
2015-12-15,19.5946
2015-12-16,19.6973
2015-12-17,19.4662
2015-12-18,19.432
2015-12-21,19.3209
2015-12-22,19.3978
2015-12-23,19.5604
2015-12-24,19.509
2015-12-28,19.4063
2015-12-29,19.5946
2015-12-30,19.5345
2015-12-31,19.5345
2016-01-04,19.4485
2016-01-05,19.586
2016-01-06,19.5517
2016-01-07,19.4917
2016-01-08,19.4958
2016-01-11,19.4916
2016-01-12,19.5001
2016-01-13,19.2938
2016-01-14,19.3712
2016-01-15,19.1392
2016-01-19,18.9759
2016-01-20,18.804
2016-01-21,18.8899
2016-01-22,19.1735
2016-01-25,19.1048
2016-01-26,19.2079
2016-01-27,19.1821
2016-01-28,19.2337
2016-01-29,19.3368
2016-02-01,19.3319
2016-02-02,19.1939
2016-02-03,19.2975
2016-02-04,19.2198
2016-02-05,19.1162
2016-02-08,19.0127
2016-02-09,18.8918
2016-02-10,18.8314
2016-02-11,18.771
2016-02-12,18.8746
2016-02-16,18.8142
2016-02-17,18.9609
2016-02-18,19.0558
2016-02-19,19.0509
2016-02-22,19.1507
2016-02-23,19.1507
2016-02-24,19.1335
2016-02-25,19.1853
2016-02-26,19.3234
2016-02-29,19.4528
2016-03-01,19.6192
2016-03-02,19.5845
2016-03-03,19.6365
2016-03-04,19.7059
2016-03-07,19.7492
2016-03-08,19.7232
2016-03-09,19.7319
2016-03-10,19.8012
2016-03-11,19.9053
2016-03-14,19.8619
2016-03-15,19.8359
2016-03-16,19.9616
2016-03-17,20.005
2016-03-18,20.018
2016-03-21,20.096
2016-03-22,20.07
2016-03-23,20.0483
2016-03-24,19.966
2016-03-28,19.9139
2016-03-29,19.9573
2016-03-30,20.018
2016-03-31,20.0512
2016-04-01,20.0947
2016-04-04,20.0468
2016-04-05,19.9554
2016-04-06,20.1122
2016-04-07,20.0686
2016-04-08,20.1209
2016-04-11,20.1296
2016-04-12,20.1992
2016-04-13,20.295
2016-04-14,20.2776
2016-04-15,20.2776
2016-04-18,20.3385
2016-04-19,20.3908
2016-04-20,20.4691
2016-04-21,20.4343
2016-04-22,20.4778
2016-04-25,20.443
2016-04-26,20.443
2016-04-27,20.5388
2016-04-28,20.5562
2016-04-29,20.4604
2016-05-02,20.6131
2016-05-03,20.5345
2016-05-04,20.4907
2016-05-05,20.5345
2016-05-06,20.4995
2016-05-09,20.4733
2016-05-10,20.5519
2016-05-11,20.5082
2016-05-12,20.517
2016-05-13,20.4296
2016-05-16,20.517
2016-05-17,20.4733
2016-05-18,20.4907
2016-05-19,20.482
2016-05-20,20.482
2016-05-23,20.5345
2016-05-24,20.5869
2016-05-25,20.6088
2016-05-26,20.5607
2016-05-27,20.6219
2016-05-31,20.6256
2016-06-01,20.6519
2016-06-02,20.6432
2016-06-03,20.6783
2016-06-06,20.731
2016-06-07,20.7837
2016-06-08,20.8363
2016-06-09,20.8012
2016-06-10,20.7661
2016-06-13,20.7398
2016-06-14,20.7134
2016-06-15,20.6958
2016-06-16,20.6695
2016-06-17,20.6958
2016-06-20,20.7837
2016-06-21,20.7749
2016-06-22,20.7661
2016-06-23,20.8802
2016-06-24,20.6871
2016-06-27,20.529
2016-06-28,20.6432
2016-06-29,20.7661
2016-06-30,20.7991
2016-07-01,20.8432
2016-07-05,20.8432
2016-07-06,20.9049
2016-07-07,20.949
2016-07-08,21.0725
2016-07-11,21.1255
2016-07-12,21.1784
2016-07-13,21.1696
2016-07-14,21.196
2016-07-15,21.1872
2016-07-18,21.2313
2016-07-19,21.196
2016-07-20,21.2578
2016-07-21,21.2313
2016-07-22,21.2666
2016-07-25,21.2313
2016-07-26,21.2048
2016-07-27,21.2137
2016-07-28,21.1519
2016-07-29,21.168
2016-08-01,21.1414
2016-08-02,21.1414
2016-08-03,21.1591
2016-08-04,21.1857
2016-08-05,21.2211
2016-08-08,21.292
2016-08-09,21.2831
2016-08-10,21.3008
2016-08-11,21.3363
2016-08-12,21.3363
2016-08-15,21.3717
2016-08-16,21.3363
2016-08-17,21.3628
2016-08-18,21.3717
2016-08-19,21.3452
2016-08-22,21.3628
2016-08-23,21.3628
2016-08-24,21.3717
2016-08-25,21.3628
2016-08-26,21.3717
2016-08-29,21.4248
2016-08-30,21.3983
2016-08-31,21.3898
2016-09-01,21.3542
2016-09-02,21.4432
2016-09-06,21.4254
2016-09-07,21.4432
2016-09-08,21.4343
2016-09-09,21.3275
2016-09-12,21.3987
2016-09-13,21.2474
2016-09-14,21.3097
2016-09-15,21.3364
2016-09-16,21.3453
2016-09-19,21.3453
2016-09-20,21.3542
2016-09-21,21.4165
2016-09-22,21.4698
2016-09-23,21.4698
2016-09-26,21.452
2016-09-27,21.4787
2016-09-28,21.5499
2016-09-29,21.5054
2016-09-30,21.5766
2016-10-03,21.5759
2016-10-04,21.6027
2016-10-05,21.6027
2016-10-06,21.6206
2016-10-07,21.6563
2016-10-10,21.6742
2016-10-11,21.6275
2016-10-12,21.6183
2016-10-13,21.6206
2016-10-14,21.6742
2016-10-17,21.6474
2016-10-18,21.701
2016-10-19,21.7367
2016-10-20,21.7278
2016-10-21,21.7367
2016-10-24,21.737
2016-10-25,21.7278
2016-10-26,21.6831
2016-10-27,21.6206
2016-10-28,21.5759
2016-10-31,21.5134
2016-11-01,21.4941
2016-11-02,21.3685
2016-11-03,21.3685
2016-11-04,21.3954
2016-11-07,21.5479
2016-11-08,21.53
2016-11-09,21.4403
2016-11-10,21.3147
2016-11-11,21.2071
2016-11-14,21.1444
2016-11-15,21.3819
2016-11-16,21.2968
2016-11-17,21.3596
2016-11-18,21.3685
2016-11-21,21.4941
2016-11-22,21.521
2016-11-23,21.53
2016-11-25,21.53
2016-11-28,21.5031
2016-11-29,21.521
2016-11-30,21.5569
2016-12-01,21.5108
2016-12-02,21.5559
2016-12-05,21.6189
2016-12-06,21.6864
2016-12-07,21.7449
2016-12-08,21.7341
2016-12-09,21.7089
2016-12-12,21.7449
2016-12-13,21.763
2016-12-14,21.6999
2016-12-15,21.6909
2016-12-16,21.6909
2016-12-19,21.7179
2016-12-20,21.7359
2016-12-21,21.763
2016-12-22,21.799
2016-12-23,21.808
2016-12-27,21.826
2016-12-28,21.771
2016-12-29,21.762
2016-12-30,21.7665
2017-01-03,21.8341
2017-01-04,21.8702
2017-01-05,21.8792
2017-01-06,21.8792
2017-01-09,21.9062
2017-01-10,21.9107
2017-01-11,21.8972
2017-01-12,21.8972
2017-01-13,21.9107
2017-01-17,21.8972
2017-01-18,21.9152
2017-01-19,21.8972
2017-01-20,21.9062
2017-01-23,21.9152
2017-01-24,21.9062
2017-01-25,21.9603
2017-01-26,21.9558
2017-01-27,21.9738
2017-01-30,21.9738
2017-01-31,21.9693
2017-02-01,21.9913
2017-02-02,22.0094
2017-02-03,22.0547
2017-02-06,21.9913
2017-02-07,22.0275
2017-02-08,22.0275
2017-02-09,22.0456
2017-02-10,22.0456
2017-02-13,22.0909
2017-02-14,22.0999
2017-02-15,22.0456
2017-02-16,22.0728
2017-02-17,22.0637
2017-02-21,22.1271
2017-02-22,22.1361
2017-02-23,22.118
2017-02-24,22.1633
2017-02-27,22.1452
2017-02-28,22.1854
2017-03-01,22.219
2017-03-02,22.1646
2017-03-03,22.2009
2017-03-06,22.1736
2017-03-07,22.1192
2017-03-08,21.992
2017-03-09,22.0193
2017-03-10,22.0011
2017-03-13,22.0011
2017-03-14,21.9648
2017-03-15,22.1101
2017-03-16,22.1101
2017-03-17,22.1282
2017-03-20,22.1056
2017-03-21,22.0284
2017-03-22,22.0374
2017-03-23,22.0738
2017-03-24,22.1101
2017-03-27,22.101
2017-03-28,22.1464
2017-03-29,22.21
2017-03-30,22.2463
2017-03-31,22.2372
2017-04-03,22.2201
2017-04-04,22.2565
2017-04-05,22.2292
2017-04-06,22.2656
2017-04-07,22.2748
2017-04-10,22.293
2017-04-11,22.2383
2017-04-12,22.2565
2017-04-13,22.2383
2017-04-17,22.293
2017-04-18,22.2748
2017-04-19,22.2793
2017-04-20,22.3021
2017-04-21,22.293
2017-04-24,22.3932
2017-04-25,22.3659
2017-04-26,22.4024
2017-04-27,22.4024
2017-04-28,22.4206
2017-05-01,22.4154
2017-05-02,22.4428
2017-05-03,22.452
2017-05-04,22.4154
2017-05-05,22.4154
2017-05-08,22.452
2017-05-09,22.4428
2017-05-10,22.4702
2017-05-11,22.4611
2017-05-12,22.4794
2017-05-15,22.4931
2017-05-16,22.5068
2017-05-17,22.452
2017-05-18,22.4428
2017-05-19,22.4977
2017-05-22,22.5434
2017-05-23,22.5343
2017-05-24,22.5434
2017-05-25,22.5617
2017-05-26,22.5617
2017-05-30,22.5708
2017-05-31,22.5617
2017-06-01,22.5963
2017-06-02,22.6055
2017-06-05,22.6147
2017-06-06,22.6055
2017-06-07,22.5963
2017-06-08,22.5871
2017-06-09,22.5871
2017-06-12,22.6055
2017-06-13,22.6422
2017-06-14,22.6239
2017-06-15,22.633
2017-06-16,22.5963
2017-06-19,22.633
2017-06-20,22.5963
2017-06-21,22.532
2017-06-22,22.5688
2017-06-23,22.5963
2017-06-26,22.6239
2017-06-27,22.5963
2017-06-28,22.6514
2017-06-29,22.5871
2017-06-30,22.6422
2017-07-03,22.6221
2017-07-05,22.6682
2017-07-06,22.6129
2017-07-07,22.6498
2017-07-10,22.6314
2017-07-11,22.6498
2017-07-12,22.6682
2017-07-13,22.6866
2017-07-14,22.7143
2017-07-17,22.7327
2017-07-18,22.7235
2017-07-19,22.7696
2017-07-20,22.7511
2017-07-21,22.7604
2017-07-24,22.7972
2017-07-25,22.8156
2017-07-26,22.8156
2017-07-27,22.8341
2017-07-28,22.8064
2017-07-31,22.8341
2017-08-01,22.8194
2017-08-02,22.8425
2017-08-03,22.8148
2017-08-04,22.8194
2017-08-07,22.8333
2017-08-08,22.7963
2017-08-09,22.75
2017-08-10,22.6575
2017-08-11,22.6945
2017-08-14,22.7408
2017-08-15,22.7315
2017-08-16,22.713
2017-08-17,22.6668
2017-08-18,22.676
2017-08-21,22.7315
2017-08-22,22.7315
2017-08-23,22.75
2017-08-24,22.75
2017-08-25,22.7778
2017-08-28,22.787
2017-08-29,22.787
2017-08-30,22.8148
2017-08-31,22.8517
2017-09-01,22.8415
2017-09-05,22.8508
2017-09-06,22.8415
2017-09-07,22.8601
2017-09-08,22.8044
2017-09-11,22.8601
2017-09-12,22.8972
2017-09-13,22.8601
2017-09-14,22.8787
2017-09-15,22.8694
2017-09-18,22.9065
2017-09-19,22.9158
2017-09-20,22.8879
2017-09-21,22.8972
2017-09-22,22.8879
2017-09-25,22.9065
2017-09-26,22.9251
2017-09-27,22.9158
2017-09-28,22.9158
2017-09-29,22.9344
2017-10-02,22.9436
2017-10-03,22.9527
2017-10-04,22.948
2017-10-05,22.962
2017-10-06,22.9434
2017-10-09,22.962
2017-10-10,22.976
2017-10-11,22.9713
2017-10-12,22.9527
2017-10-13,22.962
2017-10-16,22.9713
2017-10-17,22.9806
2017-10-18,22.9899
2017-10-19,22.9899
2017-10-20,23.0086
2017-10-23,22.9713
2017-10-24,23.0086
2017-10-25,22.9993
2017-10-26,22.9806
2017-10-27,22.9993
2017-10-30,23.0086
2017-10-31,23.0179
2017-11-01,22.9899
2017-11-02,23.0126
2017-11-03,23.0032
2017-11-06,22.9939
2017-11-07,22.9845
2017-11-08,22.9004
2017-11-09,22.8724
2017-11-10,22.8724
2017-11-13,22.863
2017-11-14,22.7976
2017-11-15,22.7789
2017-11-16,22.8724
2017-11-17,22.863
2017-11-20,22.8817
2017-11-21,22.9144
2017-11-22,22.9284
2017-11-24,22.929
2017-11-27,22.9191
2017-11-28,22.9378
2017-11-29,22.9378
2017-11-30,22.9378
2017-12-01,22.9004
2017-12-04,22.9406
2017-12-05,22.9218
2017-12-06,22.9218
2017-12-07,22.9218
2017-12-08,22.9218
2017-12-11,22.9124
2017-12-12,22.9406
2017-12-13,22.9593
2017-12-14,22.9124
2017-12-15,22.8937
2017-12-18,22.8937
2017-12-19,22.8937
2017-12-20,22.8796
2017-12-21,22.8843
2017-12-22,22.8937
2017-12-26,22.9406
2017-12-27,22.9406
2017-12-28,22.94
2017-12-29,22.9683
2018-01-02,23.0154
2018-01-03,23.0154
2018-01-04,23.0201
2018-01-05,23.0436
2018-01-08,23.0436
2018-01-09,23.0059
2018-01-10,22.9777
2018-01-11,23.0342
2018-01-12,23.0342
2018-01-16,23.0154
2018-01-17,23.0154
2018-01-18,23.0248
2018-01-19,22.9965
2018-01-22,23.0248
2018-01-23,23.0813
2018-01-24,23.0625
2018-01-25,23.0813
2018-01-26,23.0907
2018-01-29,23.0342
2018-01-30,23.0059
2018-01-31,23.0295
2018-02-01,23.0059
2018-02-02,22.926
2018-02-05,22.8598
2018-02-06,22.926
2018-02-07,22.8504
2018-02-08,22.7463
2018-02-09,22.7558
2018-02-12,22.8409
2018-02-13,22.7936
2018-02-14,22.7936
2018-02-15,22.926
2018-02-16,22.9544
2018-02-20,22.9544
2018-02-21,22.9166
2018-02-22,22.9355
2018-02-23,23.0017
2018-02-26,23.0395
2018-02-27,22.9733
2018-02-28,22.9922
2018-03-01,22.9544
2018-03-02,22.9948
2018-03-05,22.9996
2018-03-06,22.9806
2018-03-07,22.9936
2018-03-08,22.9711
2018-03-09,23.0375
2018-03-12,23.028
2018-03-13,22.9996
2018-03-14,22.9711
2018-03-15,22.9996
2018-03-16,22.99
2018-03-19,22.9901
2018-03-20,22.9901
2018-03-21,23.0043
2018-03-22,22.9237
2018-03-23,22.8952
2018-03-26,22.9901
2018-03-27,22.9711
2018-03-28,22.9521
2018-03-29,23.0745
2018-04-02,22.9616
2018-04-03,22.9978
2018-04-04,23.0359
2018-04-05,23.0549
2018-04-06,23.0454
2018-04-09,23.036
2018-04-10,23.1025
2018-04-11,23.1406
2018-04-12,23.1692
2018-04-13,23.1597
2018-04-16,23.1787
2018-04-17,23.1882
2018-04-18,23.1692
2018-04-19,23.1406
2018-04-20,23.1185
2018-04-23,23.0835
2018-04-24,23.0549
2018-04-25,23.0644
2018-04-26,23.1216
2018-04-27,23.1121
2018-04-30,23.093
2018-05-01,23.093
2018-05-02,23.0657
2018-05-03,23.0944
2018-05-04,23.0896
2018-05-07,23.1039
2018-05-08,23.0848
2018-05-09,23.1039
2018-05-10,23.1421
2018-05-11,23.123
2018-05-14,23.1326
2018-05-15,23.0657
2018-05-16,23.0753
2018-05-17,23.0753
2018-05-18,23.0944
2018-05-21,23.1039
2018-05-22,23.1039
2018-05-23,23.1182
2018-05-24,23.1135
2018-05-25,23.1135
2018-05-29,23.0753
2018-05-30,23.1421
2018-05-31,23.1326
2018-06-01,23.1517
2018-06-04,23.1799
2018-06-05,23.1799
2018-06-06,23.2374
2018-06-07,23.2278
2018-06-08,23.2278
2018-06-11,23.2182
2018-06-12,23.247
2018-06-13,23.2278
2018-06-14,23.2566
2018-06-15,23.3045
2018-06-18,23.295
2018-06-19,23.2854
2018-06-20,23.2902
2018-06-21,23.2854
2018-06-22,23.3043
2018-06-25,23.2854
2018-06-26,23.2854
2018-06-27,23.2566
2018-06-28,23.2182
2018-06-29,23.1847
2018-07-02,23.2038
2018-07-03,23.2048
2018-07-05,23.2337
2018-07-06,23.2529
2018-07-09,23.2721
2018-07-10,23.2721
2018-07-11,23.2529
2018-07-12,23.2914
2018-07-13,23.2818
2018-07-16,23.301
2018-07-17,23.301
2018-07-18,23.3058
2018-07-19,23.3079
2018-07-20,23.3289
2018-07-23,23.3393
2018-07-24,23.3395
2018-07-25,23.3587
2018-07-26,23.3491
2018-07-27,23.3681
2018-07-30,23.3876
2018-07-31,23.378
2018-08-01,23.378
2018-08-02,23.3747
2018-08-03,23.3844
2018-08-06,23.4037
2018-08-07,23.4037
2018-08-08,23.4056
2018-08-09,23.4037
2018-08-10,23.3747
2018-08-13,23.3844
2018-08-14,23.394
2018-08-15,23.3844
2018-08-16,23.4037
2018-08-17,23.4037
2018-08-20,23.4302
2018-08-21,23.4399
2018-08-22,23.4302
2018-08-23,23.4399
2018-08-24,23.4447
2018-08-27,23.4544
2018-08-28,23.4592
2018-08-29,23.4592
2018-08-30,23.4399
2018-08-31,23.4495
2018-09-04,23.4495
2018-09-05,23.4592
2018-09-06,23.4495
2018-09-07,23.4495
2018-09-10,23.4689
2018-09-11,23.4882
2018-09-12,23.4882
2018-09-13,23.5075
2018-09-14,23.5269
2018-09-17,23.5172
2018-09-18,23.522
2018-09-19,23.4979
2018-09-20,23.5269
2018-09-21,23.5172
2018-09-24,23.5278
2018-09-25,23.5084
2018-09-26,23.4793
2018-09-27,23.5375
2018-09-28,23.5472
2018-10-01,23.5375
2018-10-02,23.5472
2018-10-03,23.5375
2018-10-04,23.4793
2018-10-05,23.4502
2018-10-08,23.5084
2018-10-09,23.4696
2018-10-10,23.4017
2018-10-11,23.4308
2018-10-12,23.4502
2018-10-15,23.4405
2018-10-16,23.4696
2018-10-17,23.4696
2018-10-18,23.455
2018-10-19,23.4405
2018-10-22,23.4519
2018-10-23,23.4325
2018-10-24,23.379
2018-10-25,23.4228
2018-10-26,23.3936
2018-10-29,23.3838
2018-10-30,23.413
2018-10-31,23.4325
2018-11-01,23.4714
2018-11-02,23.4519
2018-11-05,23.4617
2018-11-06,23.4811
2018-11-07,23.5395
2018-11-08,23.5201
2018-11-09,23.4909
2018-11-12,23.4519
2018-11-13,23.4325
2018-11-14,23.4325
2018-11-15,23.4276
2018-11-16,23.4033
2018-11-19,23.3755
2018-11-20,23.3755
2018-11-21,23.4243
2018-11-23,23.3755
2018-11-26,23.4048
2018-11-27,23.4048
2018-11-28,23.4536
2018-11-29,23.4341
2018-11-30,23.4243
2018-12-03,23.4731
2018-12-04,23.3852
2018-12-06,23.3852
2018-12-07,23.3657
2018-12-10,23.3559
2018-12-11,23.3852
2018-12-12,23.4048
2018-12-13,23.4438
2018-12-14,23.4048
2018-12-17,23.3364
2018-12-18,23.3359
2018-12-19,23.2681
2018-12-20,23.1509
2018-12-21,23.1216
2018-12-24,23.0414
2018-12-26,23.228
2018-12-27,23.1985
2018-12-28,23.1985
2018-12-31,23.2181
2019-01-02,23.2476
2019-01-03,23.228
2019-01-04,23.3556
2019-01-07,23.4637
2019-01-08,23.4637
2019-01-09,23.5128
2019-01-10,23.5324
2019-01-11,23.5226
2019-01-14,23.503
2019-01-15,23.5226
2019-01-16,23.5226
2019-01-17,23.5521
2019-01-18,23.5717
2019-01-22,23.5775
2019-01-23,23.548
2019-01-24,23.5726
2019-01-25,23.612
2019-01-28,23.5775
2019-01-29,23.5677
2019-01-30,23.6169
2019-01-31,23.6367
2019-02-01,23.6169
2019-02-04,23.6367
2019-02-05,23.6564
2019-02-06,23.6465
2019-02-07,23.6268
2019-02-08,23.6268
2019-02-11,23.6367
2019-02-12,23.6761
2019-02-13,23.6564
2019-02-14,23.6465
2019-02-15,23.6662
2019-02-19,23.676
2019-02-20,23.6859
2019-02-21,23.6958
2019-02-22,23.7156
2019-02-25,23.7156
2019-02-26,23.7107
2019-02-27,23.7255
2019-02-28,23.7255
2019-03-01,23.7331
2019-03-04,23.7255
2019-03-05,23.7255
2019-03-06,23.7255
2019-03-07,23.7255
2019-03-08,23.7255
2019-03-11,23.7354
2019-03-12,23.7453
2019-03-13,23.7651
2019-03-14,23.7948
2019-03-15,23.7898
2019-03-18,23.7765
2019-03-19,23.7846
2019-03-20,23.7964
2019-03-21,23.8063
2019-03-22,23.7975
2019-03-25,23.7964
2019-03-26,23.7865
2019-03-27,23.7865
2019-03-28,23.8113
2019-03-29,23.8361
2019-04-01,23.8461
2019-04-02,23.8361
2019-04-03,23.8361
2019-04-04,23.8361
2019-04-05,23.8461
2019-04-08,23.8461
2019-04-09,23.8361
2019-04-10,23.8461
2019-04-11,23.856
2019-04-12,23.8659
2019-04-15,23.8808
2019-04-16,23.8758
2019-04-17,23.8858
2019-04-18,23.8753
2019-04-22,23.8722
2019-04-23,23.8921
2019-04-24,23.8822
2019-04-25,23.8921
2019-04-26,23.8921
2019-04-29,23.9021
2019-04-30,23.9021
2019-05-01,23.9071
2019-05-02,23.922
2019-05-03,23.9021
2019-05-06,23.8921
2019-05-07,23.8921
2019-05-08,23.8921
2019-05-09,23.8722
2019-05-10,23.9021
2019-05-13,23.8722
2019-05-14,23.8772
2019-05-15,23.8722
2019-05-16,23.8921
2019-05-17,23.8921
2019-05-20,23.89
2019-05-21,23.92
2019-05-22,23.92
2019-05-23,23.92
2019-05-24,23.9
2019-05-28,23.9
2019-05-29,23.895
2019-05-30,23.905
2019-05-31,23.89
2019-06-03,23.905
2019-06-04,23.94
2019-06-05,23.95
2019-06-06,23.94
2019-06-07,23.97
2019-06-10,23.965
2019-06-11,23.975
2019-06-12,23.98
2019-06-13,23.975
2019-06-14,23.975
2019-06-17,23.975
2019-06-18,23.985
2019-06-19,23.995
2019-06-20,24.005
2019-06-21,24.005
2019-06-24,23.93
2019-06-25,23.925
2019-06-26,23.935
2019-06-27,23.935
2019-06-28,23.935
2019-07-01,23.95
2019-07-02,23.96
2019-07-03,23.955
2019-07-04,23.955
2019-07-05,23.955
2019-07-08,23.94
2019-07-09,23.94
2019-07-10,23.94
2019-07-11,23.945
2019-07-12,23.945
2019-07-15,23.95
2019-07-16,23.95
2019-07-17,23.955
2019-07-18,23.955
2019-07-19,23.955
2019-07-22,23.89
2019-07-23,23.9
2019-07-24,23.9
2019-07-25,23.92
2019-07-26,23.91
2019-07-29,23.915
2019-07-30,23.91
2019-07-31,23.895
2019-08-01,23.895
2019-08-02,23.905
2019-08-05,23.905
2019-08-06,23.905
2019-08-07,23.905
2019-08-08,23.925
2019-08-09,23.925
2019-08-12,23.925
2019-08-13,23.925
2019-08-14,23.92
2019-08-15,23.92
2019-08-16,23.92
2019-08-19,23.92
2019-08-20,23.92
2019-08-21,23.895
2019-08-22,23.895
2019-08-23,23.895
2019-08-26,23.895
2019-08-27,23.895
2019-08-28,23.88
2019-08-29,23.905
2019-08-30,23.91
2019-09-02,23.91
2019-09-03,23.935
2019-09-04,23.925
2019-09-05,23.945
2019-09-06,23.945
2019-09-09,23.96
2019-09-10,23.955
2019-09-11,23.955
2019-09-12,23.955
2019-09-13,23.96
2019-09-16,23.96
2019-09-17,23.96
2019-09-18,23.96
2019-09-19,23.965
2019-09-20,23.965
2019-09-23,23.965
2019-09-24,23.915
2019-09-25,23.915
2019-09-26,23.925
2019-09-27,23.915
2019-09-30,23.915
2019-10-01,23.915
2019-10-02,23.915
2019-10-03,23.915
2019-10-04,23.925
2019-10-07,23.925
2019-10-08,23.92
2019-10-09,23.925
2019-10-10,23.93
2019-10-11,23.935
2019-10-14,23.935
2019-10-15,23.935
2019-10-16,23.945
2019-10-17,23.945
2019-10-18,23.945
2019-10-21,23.89
2019-10-22,23.895
2019-10-23,23.895
2019-10-24,23.895
2019-10-25,23.905
2019-10-28,23.905
2019-10-29,23.905
2019-10-30,23.905
2019-10-31,23.905
2019-11-01,23.915
2019-11-04,23.915
2019-11-05,23.915
2019-11-06,23.915
2019-11-07,23.915
2019-11-08,23.905
2019-11-11,23.915
2019-11-12,23.915
2019-11-13,23.91
2019-11-14,23.915
2019-11-15,23.915
2019-11-18,23.915
2019-11-19,23.915
2019-11-20,23.855
2019-11-21,23.855
2019-11-22,23.855
2019-11-25,23.865
