date,close
2013-06-20,51.4542
2013-06-21,51.9019
2013-06-24,51.4176
2013-06-25,51.774
2013-06-26,52.4317
2013-06-27,52.8246
2013-06-28,52.8246
2013-07-01,53.2631
2013-07-02,54.3777
2013-07-03,54.8802
2013-07-05,56.1044
2013-07-08,55.6659
2013-07-09,55.9857
2013-07-10,55.739
2013-07-11,56.342
2013-07-12,56.3694
2013-07-15,56.1136
2013-07-16,55.9948
2013-07-17,56.3054
2013-07-18,56.8719
2013-07-19,56.4333
2013-07-22,56.8445
2013-07-23,57.4109
2013-07-24,56.9175
2013-07-25,57.2921
2013-07-26,57.5753
2013-07-29,57.1003
2013-07-30,56.7074
2013-07-31,56.881
2013-08-01,57.6119
2013-08-02,58.7356
2013-08-05,58.9001
2013-08-06,58.5438
2013-08-07,58.3245
2013-08-08,58.4159
2013-08-09,57.9225
2013-08-12,57.8586
2013-08-13,57.6484
2013-08-14,56.9358
2013-08-15,55.9217
2013-08-16,55.602
2013-08-19,55.5928
2013-08-20,56.5338
2013-08-21,55.9674
2013-08-22,56.9815
2013-08-23,56.9724
2013-08-26,56.9921
2013-08-27,56.4597
2013-08-28,55.9732
2013-08-29,55.9916
2013-08-30,55.5602
2013-09-03,56.322
2013-09-04,56.9003
2013-09-05,56.5239
2013-09-06,56.4046
2013-09-09,57.1298
2013-09-10,57.7723
2013-09-11,58.1211
2013-09-12,57.6438
2013-09-13,57.4235
2013-09-16,57.5703
2013-09-17,57.7356
2013-09-18,58.1394
2013-09-19,59.1124
2013-09-20,59.0206
2013-09-23,58.2496
2013-09-24,58.1486
2013-09-25,58.7177
2013-09-26,59.5438
2013-09-27,60.7646
2013-09-30,60.4066
2013-10-01,61.2052
2013-10-02,60.9115
2013-10-03,59.9293
2013-10-04,61.0033
2013-10-07,60.3057
2013-10-08,59.6815
2013-10-09,59.3052
2013-10-10,61.7927
2013-10-11,62.3434
2013-10-14,62.4535
2013-10-15,61.9303
2013-10-16,62.4168
2013-10-17,62.3709
2013-10-18,63.0869
2013-10-21,63.2521
2013-10-22,64.0048
2013-10-23,64.1057
2013-10-24,64.5372
2013-10-25,64.4913
2013-10-28,64.3995
2013-10-29,64.3169
2013-10-30,62.9125
2013-10-31,63.0961
2013-11-01,63.1603
2013-11-04,63.0318
2013-11-05,62.6279
2013-11-06,62.1323
2013-11-07,60.0119
2013-11-08,62.0956
2013-11-11,61.9579
2013-11-12,61.3062
2013-11-13,62.1323
2013-11-14,62.784
2013-11-15,62.0864
2013-11-18,61.3612
2013-11-19,60.838
2013-11-20,60.324
2013-11-21,61.453
2013-11-22,61.4898
2013-11-25,61.1593
2013-11-26,60.6039
2013-11-27,60.5117
2013-11-29,60.5762
2013-12-02,60.484
2013-12-03,60.3458
2013-12-04,60.3273
2013-12-05,60.4656
2013-12-06,61.369
2013-12-09,60.3734
2013-12-10,61.4059
2013-12-11,61.2308
2013-12-12,60.6776
2013-12-13,60.4287
2013-12-16,61.1386
2013-12-17,60.6592
2013-12-18,62.3186
2013-12-19,62.5951
2013-12-20,63.0008
2013-12-23,63.3234
2013-12-24,63.9779
2013-12-26,64.5311
2013-12-27,64.1992
2013-12-30,64.2268
2013-12-31,64.2729
2014-01-02,63.3603
2014-01-03,63.305
2014-01-06,62.8348
2014-01-07,62.2264
2014-01-08,61.5442
2014-01-09,61.1109
2014-01-10,61.0187
2014-01-13,60.355
2014-01-14,60.2259
2014-01-15,60.0508
2014-01-16,59.8756
2014-01-17,59.3686
2014-01-21,59.5069
2014-01-22,60.6223
2014-01-23,59.5898
2014-01-24,58.373
2014-01-27,57.9673
2014-01-28,58.207
2014-01-29,57.4511
2014-01-30,58.4467
2014-01-31,57.9212
2014-02-03,56.7136
2014-02-04,57.5248
2014-02-05,58.1609
2014-02-06,58.3453
2014-02-07,58.9169
2014-02-10,58.6772
2014-02-11,59.7742
2014-02-12,59.977
2014-02-13,59.553
2014-02-14,60.1983
2014-02-18,60.1983
2014-02-19,59.5714
2014-02-20,59.9033
2014-02-21,59.6728
2014-02-24,59.9309
2014-02-25,59.7189
2014-02-26,59.9296
2014-02-27,60.9302
2014-02-28,62.1901
2014-03-03,61.5787
2014-03-04,62.0511
2014-03-05,63.4407
2014-03-06,63.8576
2014-03-07,63.274
2014-03-10,63.4871
2014-03-11,62.6996
2014-03-12,62.3105
2014-03-13,61.7825
2014-03-14,61.6806
2014-03-17,61.7639
2014-03-18,62.2549
2014-03-19,62.1438
2014-03-20,61.6064
2014-03-21,61.4582
2014-03-24,60.5225
2014-03-25,60.7264
2014-03-26,59.8926
2014-03-27,58.7994
2014-03-28,59.8926
2014-03-31,60.5225
2014-04-01,61.171
2014-04-02,62.1252
2014-04-03,61.838
2014-04-04,61.6157
2014-04-07,60.0223
2014-04-08,60.4577
2014-04-09,61.1432
2014-04-10,58.8921
2014-04-11,58.1417
2014-04-14,58.3825
2014-04-15,58.6234
2014-04-16,59.7444
2014-04-17,60.3558
2014-04-21,60.2631
2014-04-22,60.1427
2014-04-23,61.1432
2014-04-24,60.8097
2014-04-25,60.4021
2014-04-28,60.2909
2014-04-29,59.976
2014-04-30,61.5694
2014-05-01,61.9492
2014-05-02,61.3285
2014-05-05,62.5051
2014-05-06,62.5236
2014-05-07,62.8293
2014-05-08,63.0331
2014-05-09,63.3388
2014-05-12,64.3301
2014-05-13,64.08
2014-05-14,63.8762
2014-05-15,63.4593
2014-05-16,63.8206
2014-05-19,64.9508
2014-05-20,63.8229
2014-05-21,65.205
2014-05-22,65.1212
2014-05-23,65.782
2014-05-27,65.6983
2014-05-28,65.7714
2014-05-29,65.4364
2014-05-30,64.9896
2014-06-02,65.8459
2014-06-03,65.8459
2014-06-04,65.6225
2014-06-05,65.9669
2014-06-06,63.4168
2014-06-09,64.2079
2014-06-10,64.3009
2014-06-11,64.1427
2014-06-12,63.6308
2014-06-13,63.1376
2014-06-16,63.7704
2014-06-17,63.4912
2014-06-18,64.4685
2014-06-19,64.5429
2014-06-20,63.5657
2014-06-23,63.4633
2014-06-24,63.5098
2014-06-25,64.2823
2014-06-26,64.5894
2014-06-27,64.9059
2014-06-30,65.3805
2014-07-01,65.6783
2014-07-02,66.0134
2014-07-03,66.4415
2014-07-07,66.2368
2014-07-08,65.8459
2014-07-09,67.3908
2014-07-10,67.214
2014-07-11,67.2791
2014-07-14,66.7114
2014-07-15,66.0878
2014-07-16,77.3677
2014-07-17,80.1505
2014-07-18,81.1835
2014-07-21,81.3045
2014-07-22,80.7647
2014-07-23,78.4194
2014-07-24,78.1867
2014-07-25,79.0988
2014-07-28,79.3315
2014-07-29,78.0378
2014-07-30,78.6335
2014-07-31,77.2654
2014-08-01,77.9913
2014-08-04,79.6014
2014-08-05,79.2849
2014-08-06,69.094
2014-08-07,67.0651
2014-08-08,68.154
2014-08-11,68.9078
2014-08-12,67.9771
2014-08-13,69.0195
2014-08-14,71.2159
2014-08-15,71.1973
2014-08-18,71.5323
2014-08-19,71.6533
2014-08-20,71.6813
2014-08-21,71.4393
2014-08-22,71.8767
2014-08-25,71.6161
2014-08-26,71.644
2014-08-27,71.8192
2014-08-28,71.9127
2014-08-29,71.9874
2014-09-02,72.2584
2014-09-03,72.2678
2014-09-04,72.1743
2014-09-05,71.922
2014-09-08,72.1463
2014-09-09,71.3893
2014-09-10,70.9594
2014-09-11,71.7351
2014-09-12,71.7818
2014-09-15,71.2118
2014-09-16,71.7351
2014-09-17,71.8286
2014-09-18,72.3145
2014-09-19,72.707
2014-09-22,70.7165
2014-09-23,70.3426
2014-09-24,71.2118
2014-09-25,70.4174
2014-09-26,70.7071
2014-09-29,70.6884
2014-09-30,70.2866
2014-10-01,68.8848
2014-10-02,68.4082
2014-10-03,69.8287
2014-10-06,68.9876
2014-10-07,68.567
2014-10-08,69.1464
2014-10-09,67.3521
2014-10-10,67.1185
2014-10-13,66.0157
2014-10-14,66.0157
2014-10-15,67.483
2014-10-16,70.4735
2014-10-17,70.8847
2014-10-20,72.6042
2014-10-21,72.165
2014-10-22,71.5575
2014-10-23,73.0715
2014-10-24,73.6135
2014-10-27,74.0808
2014-10-28,74.3892
2014-10-29,73.464
2014-10-30,72.5949
2014-10-31,74.2677
2014-11-03,73.6042
2014-11-04,70.0623
2014-11-05,72.8846
2014-11-06,72.2958
2014-11-07,71.9594
2014-11-10,72.2678
2014-11-11,72.9313
2014-11-12,72.5949
2014-11-13,73.8098
2014-11-14,74.5294
2014-11-17,75.1368
2014-11-18,75.2303
2014-11-19,75.6321
2014-11-20,75.3144
2014-11-21,74.8097
2014-11-24,76.0994
2014-11-25,77.3449
2014-11-26,78.6114
2014-11-28,79.8592
2014-12-01,78.7709
2014-12-02,79.2588
2014-12-03,78.6865
2014-12-04,79.4276
2014-12-05,79.0524
2014-12-08,78.1798
2014-12-09,78.7334
2014-12-10,78.0673
2014-12-11,78.1611
2014-12-12,77.0446
2014-12-15,76.5286
2014-12-16,75.581
2014-12-17,77.1947
2014-12-18,79.1649
2014-12-19,79.681
2014-12-22,80.2814
2014-12-23,80.4784
2014-12-24,80.2908
2014-12-26,81.3509
2014-12-29,80.9851
2014-12-30,80.6473
2014-12-31,80.1407
2015-01-02,79.681
2015-01-05,78.0954
2015-01-06,77.2135
2015-01-07,78.0297
2015-01-08,80.2063
2015-01-09,79.0055
2015-01-12,78.8553
2015-01-13,79.8967
2015-01-14,77.2979
2015-01-15,77.3261
2015-01-16,78.0391
2015-01-20,75.384
2015-01-21,75.7405
2015-01-22,76.6693
2015-01-23,75.0275
2015-01-26,75.9657
2015-01-27,75.6561
2015-01-28,74.0143
2015-01-29,74.8023
2015-01-30,73.1136
2015-02-02,73.7328
2015-02-03,75.3653
2015-02-04,75.187
2015-02-05,75.0369
2015-02-06,75.4122
2015-02-09,75.5623
2015-02-10,75.8156
2015-02-11,76.0032
2015-02-12,78.1611
2015-02-13,78.6865
2015-02-17,78.8835
2015-02-18,78.4144
2015-02-19,78.7334
2015-02-20,79.3057
2015-02-23,78.5927
2015-02-24,78.4519
2015-02-25,77.7171
2015-02-26,77.6511
2015-02-27,77.1235
2015-03-02,77.9809
2015-03-03,78.3483
2015-03-04,78.2729
2015-03-05,78.4425
2015-03-06,79.2528
2015-03-09,80.2703
2015-03-10,78.5556
2015-03-11,78.141
2015-03-12,79.6767
2015-03-13,79.2245
2015-03-16,80.5058
2015-03-17,80.7979
2015-03-18,82.1546
2015-03-19,81.806
2015-03-20,82.8046
2015-03-23,82.0415
2015-03-24,81.3443
2015-03-25,80.242
2015-03-26,79.8275
2015-03-27,80.1855
2015-03-30,80.3645
2015-03-31,79.5543
2015-04-01,78.0091
2015-04-02,80.0819
2015-04-06,80.3457
2015-04-07,80.3739
2015-04-08,80.2514
2015-04-09,80.6566
2015-04-10,80.5435
2015-04-13,79.6202
2015-04-14,79.5166
2015-04-15,80.0159
2015-04-16,79.7238
2015-04-17,78.5744
2015-04-20,79.2057
2015-04-21,79.1774
2015-04-22,79.5731
2015-04-23,79.9688
2015-04-24,80.421
2015-04-27,79.8557
2015-04-28,80.063
2015-04-29,80.5058
2015-04-30,79.526
2015-05-01,80.6283
2015-05-04,80.9392
2015-05-05,79.5637
2015-05-06,78.7911
2015-05-07,78.8382
2015-05-08,79.3564
2015-05-11,78.207
2015-05-12,78.4143
2015-05-13,78.5838
2015-05-14,79.2339
2015-05-15,80.3551
2015-05-18,80.3645
2015-05-19,80.7508
2015-05-20,80.6095
2015-05-21,80.2232
2015-05-22,80.2703
2015-05-26,79.7709
2015-05-27,80.6224
2015-05-28,80.2062
2015-05-29,79.9223
2015-06-01,79.8372
2015-06-02,80.1494
2015-06-03,81.332
2015-06-04,80.4805
2015-06-05,80.3197
2015-06-08,81.3793
2015-06-09,80.9157
2015-06-10,81.0103
2015-06-11,81.9185
2015-06-12,81.3698
2015-06-15,81.5306
2015-06-16,82.3442
2015-06-17,82.5145
2015-06-18,83.5457
2015-06-19,83.2524
2015-06-22,83.2714
2015-06-23,82.9592
2015-06-24,82.401
2015-06-25,83.4416
2015-06-26,83.3754
2015-06-29,81.8617
2015-06-30,82.6943
2015-07-01,83.5457
2015-07-02,83.716
2015-07-06,82.6659
2015-07-07,82.6564
2015-07-08,81.1806
2015-07-09,82.3915
2015-07-10,83.8484
2015-07-13,85.0405
2015-07-14,85.1351
2015-07-15,85.5986
2015-07-16,86.1
2015-07-17,84.8513
2015-07-20,84.5485
2015-07-21,83.962
2015-07-22,83.9336
2015-07-23,82.9592
2015-07-24,82.6659
2015-07-27,81.8712
2015-07-28,83.0254
2015-07-29,83.3565
2015-07-30,83.6687
2015-07-31,83.2903
2015-08-03,83.0443
2015-08-04,82.9213
2015-08-05,75.4948
2015-08-06,74.8799
2015-08-07,75.807
2015-08-10,77.7275
2015-08-11,75.4664
2015-08-12,75.5989
2015-08-13,74.7664
2015-08-14,74.0095
2015-08-17,75.1164
2015-08-18,74.7474
2015-08-19,73.6216
2015-08-20,69.9131
2015-08-21,68.7779
2015-08-24,66.0438
2015-08-25,65.9303
2015-08-26,67.8034
2015-08-27,69.2294
2015-08-28,68.8111
2015-08-31,67.5942
2015-09-01,66.0161
2015-09-02,67.0143
2015-09-03,67.214
2015-09-04,66.558
2015-09-08,68.1457
2015-09-09,66.6531
2015-09-10,67.2235
2015-09-11,66.558
2015-09-14,66.1967
2015-09-15,66.539
2015-09-16,67.0904
2015-09-17,66.7862
2015-09-18,66.2062
2015-09-21,66.1397
2015-09-22,65.9686
2015-09-23,65.6168
2015-09-24,64.2858
2015-09-25,64.5235
2015-09-28,63.183
2015-09-29,63.3161
2015-09-30,65.3601
2015-10-01,65.921
2015-10-02,67.1094
2015-10-05,67.5657
2015-10-06,67.889
2015-10-07,68.2597
2015-10-08,69.3816
2015-10-09,69.4861
2015-10-12,69.5717
2015-10-13,69.2009
2015-10-14,67.5277
2015-10-15,68.9157
2015-10-16,68.4689
2015-10-19,67.6513
2015-10-20,68.1932
2015-10-21,67.6228
2015-10-22,68.9537
2015-10-23,69.6573
2015-10-26,69.7333
2015-10-27,69.3055
2015-10-28,71.3685
2015-10-29,71.7488
2015-10-30,71.6252
2015-11-02,72.785
2015-11-03,73.4885
2015-11-04,68.64
2015-11-05,66.0066
2015-11-06,65.4647
2015-11-09,65.1129
2015-11-10,66.3013
2015-11-11,67.5467
2015-11-12,66.9478
2015-11-13,66.4819
2015-11-16,67.5942
2015-11-17,66.9858
2015-11-18,68.2312
2015-11-19,67.4802
2015-11-20,67.233
2015-11-23,67.0428
2015-11-24,66.7291
2015-11-25,67.1686
2015-11-27,66.6718
2015-11-30,66.8629
2015-12-01,67.8756
2015-12-02,66.9011
2015-12-03,66.0794
2015-12-04,67.4648
2015-12-07,67.2259
2015-12-08,65.7545
2015-12-09,65.2577
2015-12-10,64.8182
2015-12-11,62.5537
2015-12-14,61.3976
2015-12-15,61.8276
2015-12-16,62.9646
2015-12-17,61.9709
2015-12-18,60.681
2015-12-21,60.5855
2015-12-22,61.2639
2015-12-23,61.6174
2015-12-24,61.5219
2015-12-28,61.6078
2015-12-29,61.9518
2015-12-30,61.5696
2015-12-31,61.7894
2016-01-04,62.0282
2016-01-05,62.6015
2016-01-06,65.5634
2016-01-07,67.0731
2016-01-08,67.9998
2016-01-11,66.5093
2016-01-12,67.9234
2016-01-13,67.503
2016-01-14,67.4075
2016-01-15,66.5476
2016-01-19,66.6813
2016-01-20,65.831
2016-01-21,66.3851
2016-01-22,67.7323
2016-01-25,66.6431
2016-01-26,68.7833
2016-01-27,67.7896
2016-01-28,66.4807
2016-01-29,67.3024
2016-02-01,69.1273
2016-02-02,67.3788
2016-02-03,68.2769
2016-02-04,68.64
2016-02-05,66.0794
2016-02-08,64.3022
2016-02-09,60.3944
2016-02-10,57.3943
2016-02-11,59.5441
2016-02-12,59.4867
2016-02-16,60.5091
2016-02-17,61.8085
2016-02-18,61.7416
2016-02-19,61.7894
2016-02-22,62.7926
2016-02-23,63.1557
2016-02-24,64.4742
2016-02-25,64.0729
2016-02-26,64.0729
2016-02-29,63.6308
2016-03-01,64.2075
2016-03-02,64.169
2016-03-03,66.1491
2016-03-04,66.1395
2016-03-07,66.87
2016-03-08,65.4378
2016-03-09,65.9857
2016-03-10,66.1203
2016-03-11,67.687
2016-03-14,68.0042
2016-03-15,68.206
2016-03-16,68.7251
2016-03-17,69.5037
2016-03-18,69.5517
2016-03-21,69.3403
2016-03-22,69.9939
2016-03-23,67.9465
2016-03-24,67.2929
2016-03-28,69.7247
2016-03-29,69.4075
2016-03-30,69.3595
2016-03-31,69.7343
2016-04-01,70.1573
2016-04-04,70.7051
2016-04-05,69.8977
2016-04-06,71.0992
2016-04-07,70.0804
2016-04-08,70.7532
2016-04-11,70.4264
2016-04-12,70.907
2016-04-13,72.0893
2016-04-14,72.1373
2016-04-15,71.6087
2016-04-18,72.3007
2016-04-19,71.9355
2016-04-20,71.8778
2016-04-21,72.5122
2016-04-22,73.6752
2016-04-25,73.3869
2016-04-26,74.0309
2016-04-27,73.9251
2016-04-28,73.7713
2016-04-29,72.2238
2016-05-02,72.3968
2016-05-03,70.782
2016-05-04,71.897
2016-05-05,72.6948
2016-05-06,71.9835
2016-05-09,71.2819
2016-05-10,71.897
2016-05-11,71.2626
2016-05-12,70.5417
2016-05-13,70.388
2016-05-16,70.2822
2016-05-17,69.9939
2016-05-18,68.6963
2016-05-19,68.8116
2016-05-20,69.9746
2016-05-23,69.273
2016-05-24,70.2918
2016-05-25,70.5129
2016-05-26,71.5882
2016-05-27,72.7576
2016-05-31,73.1249
2016-06-01,73.8497
2016-06-02,74.1784
2016-06-03,73.2988
2016-06-06,73.4631
2016-06-07,72.6706
2016-06-08,72.9316
2016-06-09,72.4967
2016-06-10,71.1629
2016-06-13,70.6796
2016-06-14,70.322
2016-06-15,70.438
2016-06-16,70.9599
2016-06-17,69.9451
2016-06-20,70.2061
2016-06-21,69.4039
2016-06-22,70.0128
2016-06-23,70.6023
2016-06-24,68.3504
2016-06-27,66.891
2016-06-28,67.7995
2016-06-29,69.2879
2016-06-30,71.0759
2016-07-01,71.8201
2016-07-05,71.3755
2016-07-06,72.0424
2016-07-07,73.5598
2016-07-08,75.3478
2016-07-11,75.7537
2016-07-12,75.6378
2016-07-13,75.4348
2016-07-14,75.9567
2016-07-15,76.005
2016-07-18,75.2995
2016-07-19,75.4638
2016-07-20,75.2512
2016-07-21,75.1352
2016-07-22,75.7344
2016-07-25,75.8697
2016-07-26,75.6474
2016-07-27,75.3188
2016-07-28,75.0192
2016-07-29,74.0817
2016-08-01,74.1687
2016-08-02,73.2409
2016-08-03,75.2222
2016-08-04,75.2705
2016-08-05,76.4593
2016-08-08,76.1017
2016-08-09,76.5076
2016-08-10,77.1841
2016-08-11,77.7254
2016-08-12,77.851
2016-08-15,78.1506
2016-08-16,78.3343
2016-08-17,78.3343
2016-08-18,78.1216
2016-08-19,78.0927
2016-08-22,77.8124
2016-08-23,77.996
2016-08-24,77.4838
2016-08-25,77.1358
2016-08-26,76.5869
2016-08-29,76.8808
2016-08-30,76.6573
2016-08-31,76.1716
2016-09-01,75.9287
2016-09-02,76.2882
2016-09-06,76.1522
2016-09-07,76.4727
2016-09-08,76.667
2016-09-09,74.8116
2016-09-12,76.1327
2016-09-13,74.2481
2016-09-14,74.0441
2016-09-15,73.4612
2016-09-16,72.7132
2016-09-19,73.5487
2016-09-20,73.2475
2016-09-21,74.4715
2016-09-22,75.103
2016-09-23,74.5395
2016-09-26,73.9275
2016-09-27,75.6567
2016-09-28,76.3173
2016-09-29,76.3659
2016-09-30,77.3373
2016-10-03,77.0556
2016-10-04,76.9196
2016-10-05,77.3179
2016-10-06,77.3859
2016-10-07,76.7253
2016-10-10,77.0945
2016-10-11,76.327
2016-10-12,77.6288
2016-10-13,77.1333
2016-10-14,77.279
2016-10-17,76.5893
2016-10-18,77.2402
2016-10-19,76.9779
2016-10-20,80.6208
2016-10-21,86.9256
2016-10-24,84.2638
2016-10-25,84.6718
2016-10-26,86.1678
2016-10-27,85.7793
2016-10-28,84.9729
2016-10-31,86.4496
2016-11-01,85.7307
2016-11-02,84.7884
2016-11-03,84.6621
2016-11-04,83.9529
2016-11-07,85.2352
2016-11-08,85.3615
2016-11-09,84.1278
2016-11-10,83.8655
2016-11-11,84.3221
2016-11-14,84.3221
2016-11-15,86.1387
2016-11-16,86.4107
2016-11-17,88.101
2016-11-18,88.7422
2016-11-21,88.9462
2016-11-22,89.6942
2016-11-23,90.1314
2016-11-25,90.5394
2016-11-28,90.6394
2016-11-29,90.6492
2016-11-30,89.5857
2016-12-01,91.8492
2016-12-02,91.5175
2016-12-05,91.0687
2016-12-06,91.6151
2016-12-07,91.6931
2016-12-08,92.2493
2016-12-09,92.9127
2016-12-12,92.3663
2016-12-13,92.3663
2016-12-14,92.3468
2016-12-15,93.0005
2016-12-16,92.4932
2016-12-19,92.7664
2016-12-20,93.4005
2016-12-21,93.6542
2016-12-22,94.1128
2016-12-23,94.064
2016-12-27,94.386
2016-12-28,93.8786
2016-12-29,94.3372
2016-12-30,94.1811
2017-01-03,94.4055
2017-01-04,94.3567
2017-01-05,92.7761
2017-01-06,92.4444
2017-01-09,91.2736
2017-01-10,91.1272
2017-01-11,91.4004
2017-01-12,91.5663
2017-01-13,91.8492
2017-01-17,92.5615
2017-01-18,92.7956
2017-01-19,93.3615
2017-01-20,93.7713
2017-01-23,94.4152
2017-01-24,94.0055
2017-01-25,93.3908
2017-01-26,93.742
2017-01-27,94.0347
2017-01-30,94.2689
2017-01-31,94.4933
2017-02-01,94.3665
2017-02-02,93.303
2017-02-03,93.5371
2017-02-06,94.0152
2017-02-07,93.8786
2017-02-08,94.2494
2017-02-09,94.025
2017-02-10,94.2299
2017-02-13,93.7323
2017-02-14,94.0445
2017-02-15,93.9762
2017-02-16,94.0445
2017-02-17,94.1323
2017-02-21,94.0738
2017-02-22,93.9762
2017-02-23,94.6982
2017-02-24,95.3081
2017-02-27,96.2094
2017-02-28,96.2192
2017-03-01,96.8952
2017-03-02,96.954
2017-03-03,96.7287
2017-03-06,96.1016
2017-03-07,96.2486
2017-03-08,96.5131
2017-03-09,96.4544
2017-03-10,96.6013
2017-03-13,96.6209
2017-03-14,96.3662
2017-03-15,96.7385
2017-03-16,96.4642
2017-03-17,96.5621
2017-03-20,96.2878
2017-03-21,95.4942
2017-03-22,94.877
2017-03-23,95.2101
2017-03-24,95.5334
2017-03-27,95.3864
2017-03-28,95.3473
2017-03-29,95.4942
2017-03-30,96.0527
2017-03-31,95.7294
2017-04-03,96.0135
2017-04-04,96.2878
2017-04-05,96.376
2017-04-06,96.3074
2017-04-07,96.4642
2017-04-10,96.6895
2017-04-11,96.7189
2017-04-12,96.7483
2017-04-13,96.2682
2017-04-17,97.1598
2017-04-18,97.63
2017-04-19,97.9729
2017-04-20,97.9729
2017-04-21,97.8162
2017-04-24,97.9337
2017-04-25,98.0121
2017-04-26,98.1689
2017-04-27,97.875
2017-04-28,97.2577
2017-05-01,97.052
2017-05-02,97.3165
2017-05-03,97.0422
2017-05-04,96.3074
2017-05-05,96.376
2017-05-08,96.3956
2017-05-09,96.1408
2017-05-10,96.7385
2017-05-11,96.8364
2017-05-12,96.7091
2017-05-15,96.5327
2017-05-16,95.8861
2017-05-17,94.7888
2017-05-18,95.0435
2017-05-19,95.651
2017-05-22,95.9155
2017-05-23,96.2388
2017-05-24,96.4054
2017-05-25,97.3557
2017-05-26,97.4566
2017-05-30,97.3287
2017-05-31,97.8697
2017-06-01,98.0763
2017-06-02,97.5648
2017-06-05,98.0763
2017-06-06,97.8796
2017-06-07,97.7222
2017-06-08,97.2893
2017-06-09,97.5746
2017-06-12,98.3222
2017-06-13,97.5845
2017-06-14,97.5254
2017-06-15,97.5058
2017-06-16,97.5845
2017-06-19,98.2731
2017-06-20,97.8993
2017-06-21,97.6337
2017-06-22,97.7812
2017-06-23,98.0763
2017-06-26,98.1944
2017-06-27,97.6927
2017-06-28,98.0075
2017-06-29,98.155
2017-06-30,98.7748
2017-07-03,99.729
2017-07-05,99.9159
2017-07-06,100.2443
2017-07-07,99.9875
2017-07-10,99.306
2017-07-11,98.6147
2017-07-12,98.4962
2017-07-13,97.9036
2017-07-14,98.5554
2017-07-17,97.9826
2017-07-18,97.874
2017-07-19,97.9233
2017-07-20,98.19
2017-07-21,98.2394
2017-07-24,98.8715
2017-07-25,98.5752
2017-07-26,100.3924
2017-07-27,101.9232
2017-07-28,101.4591
2017-07-31,101.1529
2017-08-01,101.2517
2017-08-02,101.2517
2017-08-03,101.0838
2017-08-04,101.2517
2017-08-07,101.1628
2017-08-08,100.906
2017-08-09,101.0146
2017-08-10,100.6788
2017-08-11,100.6393
2017-08-14,101.0245
2017-08-15,100.4418
2017-08-16,100.6591
2017-08-17,100.3529
2017-08-18,99.9381
2017-08-21,100.8467
2017-08-22,100.5406
2017-08-23,100.3924
2017-08-24,100.0665
2017-08-25,100.1653
2017-08-28,100.4418
2017-08-29,100.1258
2017-08-30,100.0863
2017-08-31,99.8492
2017-09-01,100.343
2017-09-05,99.9677
2017-09-06,99.5529
2017-09-07,99.227
2017-09-08,98.9604
2017-09-11,99.3258
2017-09-12,99.7505
2017-09-13,100.0467
2017-09-14,99.7603
2017-09-15,100.6097
2017-09-18,100.7085
2017-09-19,101.5084
2017-09-20,101.6171
2017-09-21,101.222
2017-09-22,101.1331
2017-09-25,101.943
2017-09-26,101.6566
2017-09-27,101.1331
2017-09-28,100.9751
2017-09-29,101.1825
2017-10-02,101.8047
2017-10-03,102.0023
2017-10-04,102.2195
2017-10-05,102.3578
2017-10-06,102.4198
2017-10-09,102.4694
2017-10-10,102.4694
2017-10-11,102.4991
2017-10-12,100.5856
2017-10-13,100.0799
2017-10-16,100.2584
2017-10-17,100.5955
2017-10-18,100.6153
2017-10-19,101.3292
2017-10-20,100.9623
2017-10-23,100.4666
2017-10-24,99.6437
2017-10-25,97.8689
2017-10-26,98.1267
2017-10-27,97.9482
2017-10-30,97.6508
2017-10-31,97.4525
2017-11-01,97.5516
2017-11-02,93.8931
2017-11-03,92.4852
2017-11-06,93.6551
2017-11-07,93.8534
2017-11-08,87.7459
2017-11-09,86.3083
2017-11-10,89.828
2017-11-13,87.736
2017-11-14,86.7643
2017-11-15,86.6255
2017-11-16,87.2601
2017-11-17,87.964
2017-11-20,86.9626
2017-11-21,88.7969
2017-11-22,89.243
2017-11-24,88.7374
2017-11-27,88.3111
2017-11-28,88.8564
2017-11-29,90.1453
2017-11-30,90.7303
2017-12-01,90.5221
2017-12-04,91.92
2017-12-05,90.3039
2017-12-06,89.6099
2017-12-07,89.6
2017-12-08,89.9371
2017-12-11,90.0461
2017-12-12,89.8776
2017-12-13,89.2926
2017-12-14,88.8861
2017-12-15,89.481
2017-12-18,89.0249
2017-12-19,89.1142
2017-12-20,89.8082
2017-12-21,92.158
2017-12-22,91.5929
2017-12-26,90.8691
2017-12-27,90.5915
2017-12-28,90.8294
2017-12-29,90.6906
2018-01-02,91.1269
2018-01-03,90.7203
2018-01-04,91.8407
2018-01-05,92.8025
2018-01-08,92.2671
2018-01-09,91.8911
2018-01-10,91.7019
2018-01-11,91.5028
2018-01-12,91.6621
2018-01-16,91.5227
2018-01-17,91.7816
2018-01-18,92.5782
2018-01-19,92.9666
2018-01-22,93.6039
2018-01-23,93.2653
2018-01-24,93.4346
2018-01-25,93.6835
2018-01-26,94.4304
2018-01-29,94.1018
2018-01-30,94.052
2018-01-31,94.9482
2018-02-01,96.5912
2018-02-02,96.3423
2018-02-05,94.988
2018-02-06,94.759
2018-02-07,94.7092
2018-02-08,92.628
2018-02-09,92.0106
2018-02-12,93.2155
2018-02-13,93.9126
2018-02-14,94.1217
2018-02-15,94.5897
2018-02-16,94.9681
2018-02-20,94.6694
2018-02-21,94.4005
2018-02-22,93.9723
2018-02-23,94.3009
2018-02-26,94.8785
2018-02-27,93.9225
2018-02-28,92.5683
2018-03-01,92.7674
2018-03-02,93.1857
2018-03-05,94.1914
2018-03-06,94.7192
2018-03-07,94.5997
2018-03-08,94.3906
2018-03-09,94.8586
2018-03-12,96.3423
2018-03-13,95.7548
2018-03-14,95.9938
2018-03-15,96.4717
2018-03-16,95.8743
2018-03-19,94.6495
2018-03-20,94.7789
2018-03-21,94.8884
2018-03-22,93.8628
2018-03-23,92.1799
2018-03-26,93.5939
2018-03-27,93.803
2018-03-28,93.803
2018-03-29,94.1814
2018-04-02,94.4005
2018-04-03,94.7092
2018-04-04,95.5058
2018-04-05,95.9838
2018-04-06,95.1175
2018-04-09,95.49
2018-04-10,96.71
2018-04-11,96.27
2018-04-12,96.34
2018-04-13,96.68
2018-04-16,97.34
2018-04-17,97.41
2018-04-18,97.1
2018-04-19,96.58
2018-04-20,96.24
2018-04-23,96.36
2018-04-24,96.04
2018-04-25,96.28
2018-04-26,93.67
2018-04-27,94.6
2018-04-30,94.8
2018-05-01,94.27
2018-05-02,93.02
2018-05-03,92.18
2018-05-04,93.14
2018-05-07,92.56
2018-05-08,92.45
2018-05-09,92.38
2018-05-10,92.54
2018-05-11,93.81
2018-05-14,94.38
2018-05-15,94.42
2018-05-16,94.19
2018-05-17,92.88
2018-05-18,94.45
2018-05-21,94.74
2018-05-22,94.43
2018-05-23,94
2018-05-24,94.26
2018-05-25,94.17
2018-05-29,93.36
2018-05-30,94.1
2018-05-31,94.16
2018-06-01,93.89
2018-06-04,93.46
2018-06-05,93.46
2018-06-06,94.92
2018-06-07,95.37
2018-06-08,95.34
2018-06-11,96.17
2018-06-12,96.22
2018-06-13,97.95
2018-06-14,98.77
2018-06-15,98.77
