date,close
2014-06-13,27.069
2014-06-16,27.0303
2014-06-17,27.0612
2014-06-18,27.2003
2014-06-19,27.324
2014-06-20,27.3472
2014-06-23,27.3472
2014-06-24,27.2699
2014-06-25,27.2467
2014-06-26,27.2467
2014-06-27,27.3626
2014-06-30,27.324
2014-07-01,27.4167
2014-07-02,27.5635
2014-07-03,27.6949
2014-07-07,27.834
2014-07-08,27.834
2014-07-09,27.9044
2014-07-10,27.9436
2014-07-11,27.9905
2014-07-14,28.0688
2014-07-15,28.3663
2014-07-16,28.5306
2014-07-17,28.2019
2014-07-18,28.3115
2014-07-21,28.1471
2014-07-22,28.1314
2014-07-23,28.0845
2014-07-24,27.787
2014-07-25,27.8183
2014-07-28,28.4602
2014-07-29,28.6402
2014-07-30,28.4602
2014-07-31,27.8575
2014-08-01,27.654
2014-08-04,27.7557
2014-08-05,27.4818
2014-08-06,27.0982
2014-08-07,26.7773
2014-08-08,26.9808
2014-08-11,26.9808
2014-08-12,27.1139
2014-08-13,27.153
2014-08-14,27.3252
2014-08-15,27.1922
2014-08-18,27.1217
2014-08-19,26.9886
2014-08-20,27.0278
2014-08-21,27.1139
2014-08-22,27.0043
2014-08-25,27.0121
2014-08-26,27.0043
2014-08-27,27.2
2014-08-28,27.1922
2014-08-29,27.3644
2014-09-02,27.2704
2014-09-03,27.3722
2014-09-04,27.3487
2014-09-05,27.5131
2014-09-08,27.4035
2014-09-09,27.1295
2014-09-10,27.1608
2014-09-11,27.2783
2014-09-12,27.0043
2014-09-15,27.153
2014-09-16,27.3565
2014-09-17,27.4113
2014-09-18,27.5209
2014-09-19,27.7635
2014-09-22,27.787
2014-09-23,27.5992
2014-09-24,27.7088
2014-09-25,27.4583
2014-09-26,27.6148
2014-09-29,27.5757
2014-09-30,27.5835
2014-10-01,27.3644
2014-10-02,27.3722
2014-10-03,27.6774
2014-10-06,27.7792
2014-10-07,27.654
2014-10-08,27.876
2014-10-09,27.4874
2014-10-10,27.1623
2014-10-13,26.8213
2014-10-14,26.8371
2014-10-15,26.8609
2014-10-16,26.6785
2014-10-17,27.0274
2014-10-20,27.1861
2014-10-21,27.4557
2014-10-22,27.3605
2014-10-23,26.6944
2014-10-24,26.8609
2014-10-27,27.0512
2014-10-28,27.2257
2014-10-29,27.2812
2014-10-30,27.3685
2014-10-31,27.6302
2014-11-03,27.6302
2014-11-04,27.5905
2014-11-05,27.6936
2014-11-06,27.535
2014-11-07,27.6857
2014-11-10,27.8522
2014-11-11,27.8364
2014-11-12,28.0743
2014-11-13,28.2408
2014-11-14,28.4708
2014-11-17,28.4312
2014-11-18,28.3281
2014-11-19,28.0505
2014-11-20,27.9791
2014-11-21,27.9791
2014-11-24,27.5191
2014-11-25,27.6143
2014-11-26,27.8602
2014-11-28,28.0584
2014-12-01,27.8046
2014-12-02,27.194
2014-12-03,26.964
2014-12-04,26.8926
2014-12-05,26.9164
2014-12-08,26.8688
2014-12-09,26.0837
2014-12-10,25.7665
2014-12-11,25.941
2014-12-12,25.5048
2014-12-15,25.5761
2014-12-16,25.4889
2014-12-17,25.9092
2014-12-18,26.5754
2014-12-19,26.5992
2014-12-22,26.845
2014-12-23,26.9878
2014-12-24,26.9323
2014-12-26,27.0988
2014-12-29,27.0512
2014-12-30,27.0274
2014-12-31,26.6388
2015-01-02,26.8609
2015-01-05,26.6071
2015-01-06,26.6468
2015-01-07,26.6789
2015-01-08,26.9444
2015-01-09,26.8639
2015-01-12,26.9363
2015-01-13,26.9363
2015-01-14,26.8076
2015-01-15,26.7513
2015-01-16,27.1857
2015-01-20,27.3063
2015-01-21,27.3465
2015-01-22,27.1776
2015-01-23,26.8398
2015-01-26,26.687
2015-01-27,26.3894
2015-01-28,26.2848
2015-01-29,26.51
2015-01-30,26.4779
2015-02-02,26.9926
2015-02-03,27.62
2015-02-04,27.6763
2015-02-05,27.7809
2015-02-06,28.0463
2015-02-09,27.8613
2015-02-10,28.0302
2015-02-11,27.6602
2015-02-12,27.8372
2015-02-13,27.8774
2015-02-17,27.9176
2015-02-18,27.7406
2015-02-19,27.4189
2015-02-20,27.4109
2015-02-23,27.2259
2015-02-24,27.3867
2015-02-25,27.5154
2015-02-26,27.7487
2015-02-27,27.7969
2015-03-02,27.8613
2015-03-03,27.6763
2015-03-04,27.3465
2015-03-05,27.3465
2015-03-06,26.9283
2015-03-09,26.8237
2015-03-10,26.3653
2015-03-11,26.2366
2015-03-12,26.6468
2015-03-13,26.3492
2015-03-16,26.5905
2015-03-17,26.4618
2015-03-18,27.0168
2015-03-19,26.7031
2015-03-20,26.7272
2015-03-23,26.7674
2015-03-24,26.5985
2015-03-25,26.2366
2015-03-26,26.3974
2015-03-27,26.3411
2015-03-30,26.5181
2015-03-31,26.2607
2015-04-01,26.4537
2015-04-02,26.6468
2015-04-06,26.8076
2015-04-07,26.6709
2015-04-08,26.6383
2015-04-09,26.6709
2015-04-10,26.7362
2015-04-13,26.8259
2015-04-14,26.6709
2015-04-15,26.8341
2015-04-16,26.7199
2015-04-17,26.5241
2015-04-20,26.7851
2015-04-21,26.6464
2015-04-22,26.8096
2015-04-23,27.9274
2015-04-24,27.7479
2015-04-27,27.8131
2015-04-28,28.4414
2015-04-29,28.3598
2015-04-30,28.2619
2015-05-01,28.0824
2015-05-04,28.1721
2015-05-05,27.5113
2015-05-06,27.2339
2015-05-07,27.2257
2015-05-08,27.4868
2015-05-11,27.3236
2015-05-12,27.4623
2015-05-13,27.6581
2015-05-14,27.8458
2015-05-15,28.0089
2015-05-18,28.4495
2015-05-19,28.0416
2015-05-20,28.2455
2015-05-21,28.6127
2015-05-22,28.319
2015-05-26,28.2863
2015-05-27,28.5148
2015-05-28,28.3924
2015-05-29,28.1803
2015-06-01,28.0253
2015-06-02,28.0334
2015-06-03,28.5801
2015-06-04,28.7759
2015-06-05,28.2048
2015-06-08,28.2211
2015-06-09,28.1558
2015-06-10,28.3271
2015-06-11,28.4577
2015-06-12,28.27
2015-06-15,28.0742
2015-06-16,28.2863
2015-06-17,28.3924
2015-06-18,28.5719
2015-06-19,28.5474
2015-06-22,28.5882
2015-06-23,29.298
2015-06-24,29.192
2015-06-25,29.5183
2015-06-26,29.4694
2015-06-29,29.1838
2015-06-30,28.9798
2015-07-01,29.0206
2015-07-02,29.1512
2015-07-06,29.0533
2015-07-07,29.1838
2015-07-08,28.7622
2015-07-09,28.4315
2015-07-10,28.6464
2015-07-13,28.8366
2015-07-14,29.035
2015-07-15,28.7126
2015-07-16,29.0681
2015-07-17,28.9441
2015-07-20,28.8531
2015-07-21,28.5803
2015-07-22,28.3323
2015-07-23,28.0512
2015-07-24,28.3488
2015-07-27,28.3736
2015-07-28,28.3819
2015-07-29,28.6795
2015-07-30,28.7704
2015-07-31,28.7208
2015-08-03,28.6547
2015-08-04,28.5886
2015-08-05,28.5803
2015-08-06,28.3075
2015-08-07,28.2827
2015-08-10,28.7539
2015-08-11,28.6464
2015-08-12,28.1256
2015-08-13,27.952
2015-08-14,28.1504
2015-08-17,28.2992
2015-08-18,28.3984
2015-08-19,28.4067
2015-08-20,28.0677
2015-08-21,27.5965
2015-08-24,26.7615
2015-08-25,26.2902
2015-08-26,27.026
2015-08-27,27.6461
2015-08-28,27.5221
2015-08-31,27.4477
2015-09-01,26.7201
2015-09-02,27.1335
2015-09-03,27.3154
2015-09-04,26.9186
2015-09-08,27.3981
2015-09-09,27.1004
2015-09-10,27.0756
2015-09-11,27.0508
2015-09-14,26.9103
2015-09-15,27.1666
2015-09-16,27.2327
2015-09-17,27.1004
2015-09-18,26.9103
2015-09-21,26.9186
2015-09-22,26.6788
2015-09-23,26.6209
2015-09-24,26.5465
2015-09-25,26.7284
2015-09-28,26.3729
2015-09-29,26.5135
2015-09-30,26.9351
2015-10-01,26.8938
2015-10-02,26.9847
2015-10-05,27.6378
2015-10-06,27.5386
2015-10-07,27.7734
2015-10-08,28.0082
2015-10-09,27.7902
2015-10-12,27.9244
2015-10-13,27.8573
2015-10-14,27.8992
2015-10-15,28.0837
2015-10-16,28.3688
2015-10-19,28.2011
2015-10-20,28.3017
2015-10-21,28.1759
2015-10-22,28.4778
2015-10-23,28.2933
2015-10-26,28.2262
2015-10-27,27.8489
2015-10-28,28.025
2015-10-29,28.134
2015-10-30,28.1005
2015-11-02,28.1843
2015-11-03,28.2011
2015-11-04,28.0753
2015-11-05,27.9579
2015-11-06,27.807
2015-11-09,27.5386
2015-11-10,27.4967
2015-11-11,27.6057
2015-11-12,27.4128
2015-11-13,27.0942
2015-11-16,27.7063
2015-11-17,27.8908
2015-11-18,28.1256
2015-11-19,28.1927
2015-11-20,28.2262
2015-11-23,28.0585
2015-11-24,27.9998
2015-11-25,28.0501
2015-11-27,28.1508
2015-11-30,28.2346
2015-12-01,28.3185
2015-12-02,28.1424
2015-12-03,27.7566
2015-12-04,28.6036
2015-12-07,28.7378
2015-12-08,28.3856
2015-12-09,28.1508
2015-12-10,28.2346
2015-12-11,27.8153
2015-12-14,28.1759
2015-12-15,28.352
2015-12-16,28.8468
2015-12-17,28.5365
2015-12-18,28.1759
2015-12-21,28.5868
2015-12-22,28.8552
2015-12-23,29.1654
2015-12-24,29.0648
2015-12-28,29.1487
2015-12-29,29.2912
2015-12-30,29.1319
2015-12-31,28.8552
2016-01-04,28.8049
2016-01-05,29.0061
2016-01-06,28.9636
2016-01-07,28.4959
2016-01-08,28.5214
2016-01-11,28.8701
2016-01-12,28.8275
2016-01-13,28.6915
2016-01-14,29.1677
2016-01-15,28.9041
2016-01-19,29.3463
2016-01-20,28.8275
2016-01-21,29.3718
2016-01-22,29.882
2016-01-25,29.7629
2016-01-26,30.1031
2016-01-27,30.1711
2016-01-28,30.2136
2016-01-29,30.6643
2016-02-01,30.7664
2016-02-02,30.6643
2016-02-03,31.2256
2016-02-04,31.064
2016-02-05,31.3616
2016-02-08,31.5572
2016-02-09,31.1661
2016-02-10,30.979
2016-02-11,30.7919
2016-02-12,31.013
2016-02-16,31.1661
2016-02-17,31.1576
2016-02-18,31.4552
2016-02-19,31.098
2016-02-22,31.3446
2016-02-23,31.2426
2016-02-24,31.5487
2016-02-25,31.7783
2016-02-26,31.5742
2016-02-29,31.4212
2016-03-01,31.7953
2016-03-02,32.0504
2016-03-03,32.3056
2016-03-04,32.2545
2016-03-07,32.4246
2016-03-08,32.3906
2016-03-09,32.297
2016-03-10,32.5777
2016-03-11,32.6202
2016-03-14,32.5862
2016-03-15,32.7562
2016-03-16,32.9688
2016-03-17,33.2665
2016-03-18,32.7903
2016-03-21,33.0964
2016-03-22,32.8498
2016-03-23,32.7733
2016-03-24,33.0624
2016-03-28,33.2239
2016-03-29,33.5471
2016-03-30,33.4791
2016-03-31,33.309
2016-04-01,33.2069
2016-04-04,33.4706
2016-04-05,33.3345
2016-04-06,33.2656
2016-04-07,33.2226
2016-04-08,33.1451
2016-04-11,33.0504
2016-04-12,33.2915
2016-04-13,32.9299
2016-04-14,33.0762
2016-04-15,33.1279
2016-04-18,33.2742
2016-04-19,33.5067
2016-04-20,33.3345
2016-04-21,32.5941
2016-04-22,32.7749
2016-04-25,32.8954
2016-04-26,32.7921
2016-04-27,33.3345
2016-04-28,33.2656
2016-04-29,33.4206
2016-05-02,33.6616
2016-05-03,33.4981
2016-05-04,33.4722
2016-05-05,33.3517
2016-05-06,33.5669
2016-05-09,33.455
2016-05-10,33.8424
2016-05-11,33.7305
2016-05-12,34.0491
2016-05-13,33.7047
2016-05-16,33.8166
2016-05-17,33.6703
2016-05-18,33.1021
2016-05-19,33.0934
2016-05-20,33.1021
2016-05-23,32.9901
2016-05-24,33.1451
2016-05-25,33.2484
2016-05-26,33.4378
2016-05-27,33.5669
2016-05-31,33.7047
2016-06-01,33.3431
2016-06-02,33.4378
2016-06-03,33.7563
2016-06-06,33.8683
2016-06-07,34.2557
2016-06-08,34.3159
2016-06-09,34.514
2016-06-10,34.7206
2016-06-13,34.6
2016-06-14,34.7636
2016-06-15,34.6861
2016-06-16,34.8583
2016-06-17,35.0649
2016-06-20,35.108
2016-06-21,35.3576
2016-06-22,35.5557
2016-06-23,36.055
2016-06-24,35.7451
2016-06-27,36.1841
2016-06-28,36.1755
2016-06-29,36.6232
2016-06-30,37.2
2016-07-01,37.4238
2016-07-05,37.3291
2016-07-06,37.5206
2016-07-07,36.8242
2016-07-08,37.0941
2016-07-11,37.007
2016-07-12,36.92
2016-07-13,37.0767
2016-07-14,37.2334
2016-07-15,37.3378
2016-07-18,37.303
2016-07-19,37.2334
2016-07-20,37.1811
2016-07-21,37.0157
2016-07-22,37.5294
2016-07-25,37.3814
2016-07-26,36.8939
2016-07-27,37.2247
2016-07-28,37.068
2016-07-29,37.6861
2016-08-01,37.5903
2016-08-02,37.5729
2016-08-03,37.5555
2016-08-04,37.5032
2016-08-05,37.5729
2016-08-08,37.3727
2016-08-09,37.5032
2016-08-10,37.6077
2016-08-11,37.7731
2016-08-12,37.6773
2016-08-15,37.451
2016-08-16,36.5282
2016-08-17,36.4412
2016-08-18,36.0407
2016-08-19,35.7012
2016-08-22,35.6141
2016-08-23,35.5619
2016-08-24,35.5793
2016-08-25,35.7534
2016-08-26,35.4139
2016-08-29,35.6925
2016-08-30,35.5967
2016-08-31,35.588
2016-09-01,35.6577
2016-09-02,35.649
2016-09-06,35.8927
2016-09-07,35.9275
2016-09-08,35.8579
2016-09-09,34.5695
2016-09-12,35.44
2016-09-13,34.7958
2016-09-14,34.7262
2016-09-15,35.2137
2016-09-16,34.9961
2016-09-19,34.8742
2016-09-20,34.7871
2016-09-21,35.3182
2016-09-22,35.7883
2016-09-23,35.9362
2016-09-26,35.8144
2016-09-27,36.0929
2016-09-28,35.5619
2016-09-29,35.4574
2016-09-30,35.353
2016-10-03,35.4923
2016-10-04,34.7349
2016-10-05,34.0907
2016-10-06,34.0472
2016-10-07,33.8382
2016-10-10,33.9601
2016-10-11,34.0385
2016-10-12,34.2387
2016-10-13,34.2735
2016-10-14,34.1429
2016-10-17,34.1864
2016-10-18,34.2648
2016-10-19,34.2822
2016-10-20,33.6467
2016-10-21,32.6369
2016-10-24,32.0884
2016-10-25,31.9491
2016-10-26,31.7141
2016-10-27,31.7924
2016-10-28,31.7837
2016-10-31,32.0275
2016-11-01,31.8273
2016-11-02,31.6619
2016-11-03,31.8882
2016-11-04,31.775
2016-11-07,32.0449
2016-11-08,32.2016
2016-11-09,32.5933
2016-11-10,31.836
2016-11-11,31.7837
2016-11-14,31.4529
2016-11-15,32.0101
2016-11-16,32.3409
2016-11-17,32.5672
2016-11-18,32.6978
2016-11-21,32.8545
2016-11-22,33.5597
2016-11-23,33.7164
2016-11-25,34.1342
2016-11-28,34.4215
2016-11-29,34.3693
2016-11-30,33.6293
2016-12-01,33.8469
2016-12-02,33.6119
2016-12-05,33.6293
2016-12-06,34.2561
2016-12-07,35.2137
2016-12-08,35.1789
2016-12-09,35.1528
2016-12-12,35.797
2016-12-13,36.0059
2016-12-14,35.7796
2016-12-15,36.1278
2016-12-16,36.2758
2016-12-19,36.6675
2016-12-20,36.9722
2016-12-21,36.8764
2016-12-22,37.1898
2016-12-23,37.1985
2016-12-27,37.1289
2016-12-28,37.0157
2016-12-29,37.1376
2016-12-30,37.0244
2017-01-03,37.451
2017-01-04,37.2334
2017-01-05,37.1289
2017-01-06,36.3891
2017-01-09,35.9312
2017-01-10,35.94
2017-01-11,35.7639
2017-01-12,36.1161
2017-01-13,36.0721
2017-01-17,36.2042
2017-01-18,35.9312
2017-01-19,36.1073
2017-01-20,36.5036
2017-01-23,36.988
2017-01-24,36.4244
2017-01-25,36.4508
2017-01-26,36.7854
2017-01-27,36.9968
2017-01-30,36.8295
2017-01-31,37.1289
2017-02-01,37.0408
2017-02-02,36.2659
2017-02-03,36.3275
2017-02-06,36.1602
2017-02-07,36.213
2017-02-08,36.2923
2017-02-09,36.3803
2017-02-10,36.442
2017-02-13,35.7991
2017-02-14,35.8872
2017-02-15,36.213
2017-02-16,36.3275
2017-02-17,36.5301
2017-02-21,36.7502
2017-02-22,36.6269
2017-02-23,36.944
2017-02-24,37.305
2017-02-27,36.8295
2017-02-28,36.8031
2017-03-01,37.0232
2017-03-02,37.0496
2017-03-03,36.9968
2017-03-06,36.9528
2017-03-07,36.8823
2017-03-08,36.7854
2017-03-09,36.9352
2017-03-10,37.2962
2017-03-13,37.3138
2017-03-14,37.0673
2017-03-15,37.5076
2017-03-16,37.3755
2017-03-17,37.5252
2017-03-20,37.3579
2017-03-21,37.0585
2017-03-22,36.6798
2017-03-23,36.6798
2017-03-24,36.7062
2017-03-27,36.5389
2017-03-28,36.6005
2017-03-29,36.5036
2017-03-30,36.7766
2017-03-31,36.5917
2017-04-03,36.6093
2017-04-04,36.715
2017-04-05,36.5565
2017-04-06,36.1822
2017-04-07,36.1732
2017-04-10,35.9861
2017-04-11,35.9237
2017-04-12,36.1465
2017-04-13,35.897
2017-04-17,35.9148
2017-04-18,35.8702
2017-04-19,35.8702
2017-04-20,35.9683
2017-04-21,35.5851
2017-04-24,35.6653
2017-04-25,35.594
2017-04-26,36.0396
2017-04-27,35.5672
2017-04-28,35.3177
2017-05-01,34.8454
2017-05-02,34.7117
2017-05-03,34.2216
2017-05-04,33.874
2017-05-05,34.3641
2017-05-08,34.3731
2017-05-09,34.0611
2017-05-10,34.2661
2017-05-11,34.2572
2017-05-12,34.3018
2017-05-15,34.3909
2017-05-16,34.0344
2017-05-17,33.3838
2017-05-18,33.8205
2017-05-19,34.079
2017-05-22,34.0879
2017-05-23,34.1413
2017-05-24,33.9988
2017-05-25,34.0701
2017-05-26,33.972
2017-05-30,34.3552
2017-05-31,34.3374
2017-06-01,34.6404
2017-06-02,34.6404
2017-06-05,34.5869
2017-06-06,34.5156
2017-06-07,34.5424
2017-06-08,34.3107
2017-06-09,34.5691
2017-06-12,34.8186
2017-06-13,34.4711
2017-06-14,34.5067
2017-06-15,34.6137
2017-06-16,34.7206
2017-06-19,34.6761
2017-06-20,34.4533
2017-06-21,33.9988
2017-06-22,33.9542
2017-06-23,33.8205
2017-06-26,33.9988
2017-06-27,33.5977
2017-06-28,33.8116
2017-06-29,33.5264
2017-06-30,33.6245
2017-07-03,33.9631
2017-07-05,33.972
2017-07-06,33.5658
2017-07-07,33.3852
2017-07-10,33.2498
2017-07-11,33.0421
2017-07-12,33.2498
2017-07-13,32.6901
2017-07-14,32.7713
2017-07-17,32.8526
2017-07-18,32.4914
2017-07-19,32.6178
2017-07-20,32.9699
2017-07-21,32.9609
2017-07-24,32.7081
2017-07-25,32.6991
2017-07-26,34.3331
2017-07-27,35.579
2017-07-28,35.2088
2017-07-31,35.2088
2017-08-01,35.1005
2017-08-02,34.5498
2017-08-03,34.5588
2017-08-04,34.6942
2017-08-07,34.7755
2017-08-08,34.6311
2017-08-09,34.6311
2017-08-10,34.4776
2017-08-11,34.3963
2017-08-14,34.7574
2017-08-15,34.4505
2017-08-16,34.5137
2017-08-17,33.9449
2017-08-18,33.7373
2017-08-21,33.9269
2017-08-22,34.288
2017-08-23,34.2338
2017-08-24,34.0172
2017-08-25,34.297
2017-08-28,34.2519
2017-08-29,34.1706
2017-08-30,34.0081
2017-08-31,33.8185
2017-09-01,33.8366
2017-09-05,33.4845
2017-09-06,33.0151
2017-09-07,32.1393
2017-09-08,32.1303
2017-09-11,32.2657
2017-09-12,32.7352
2017-09-13,32.997
2017-09-14,32.7894
2017-09-15,33.4935
2017-09-18,33.7824
2017-09-19,34.4956
2017-09-20,34.6942
2017-09-21,34.5047
2017-09-22,34.8387
2017-09-25,35.3172
2017-09-26,34.9561
2017-09-27,35.0012
2017-09-28,35.2449
2017-09-29,35.3623
2017-10-02,35.3081
2017-10-03,35.6422
2017-10-04,35.6602
2017-10-05,35.6693
2017-10-06,35.2762
2017-10-09,35.0111
2017-10-10,35.1939
2017-10-11,34.9105
2017-10-12,32.7806
2017-10-13,32.6344
2017-10-16,33.064
2017-10-17,33.1188
2017-10-18,32.6435
2017-10-19,32.6252
2017-10-20,32.4881
2017-10-23,32.223
2017-10-24,31.8665
2017-10-25,30.6099
2017-10-26,30.7878
2017-10-27,31.0529
2017-10-30,30.6598
2017-10-31,30.7604
2017-11-01,30.669
2017-11-02,30.3216
2017-11-03,30.4405
2017-11-06,30.0382
2017-11-07,30.2302
2017-11-08,30.5684
2017-11-09,31.0803
2017-11-10,31.2814
2017-11-13,31.2357
2017-11-14,30.8244
2017-11-15,30.9067
2017-11-16,31.5557
2017-11-17,31.5465
2017-11-20,31.6654
2017-11-21,31.382
2017-11-22,31.8756
2017-11-24,31.8208
2017-11-27,31.7019
2017-11-28,32.3784
2017-11-29,33.3474
2017-11-30,33.256
2017-12-01,33.3657
2017-12-04,34.0695
2017-12-05,33.4114
2017-12-06,33.0092
2017-12-07,33.064
2017-12-08,33.5759
2017-12-11,33.7313
2017-12-12,34.8283
2017-12-13,34.7734
2017-12-14,34.4992
2017-12-15,34.9562
2017-12-18,35.1574
2017-12-19,34.7826
2017-12-20,35.2396
2017-12-21,35.5413
2017-12-22,35.5961
2017-12-26,35.7058
2017-12-27,35.5504
2017-12-28,35.8155
2017-12-29,35.5413
2018-01-02,35.2305
2018-01-03,34.4169
2018-01-04,34.7369
2018-01-05,34.8648
2018-01-08,34.9654
2018-01-09,34.7246
2018-01-10,33.9187
2018-01-11,33.7891
2018-01-12,34.1781
2018-01-16,34.0114
2018-01-17,34.1318
2018-01-18,34.4096
2018-01-19,34.4652
2018-01-22,35.0765
2018-01-23,34.4467
2018-01-24,34.2892
2018-01-25,34.6875
2018-01-26,35.0302
2018-01-29,34.5115
2018-01-30,34.6783
2018-01-31,34.6875
2018-02-01,36.2714
2018-02-02,35.2618
2018-02-05,33.928
2018-02-06,34.1133
2018-02-07,34.2059
2018-02-08,32.9462
2018-02-09,33.3908
2018-02-12,33.6872
2018-02-13,33.9002
2018-02-14,33.7242
2018-02-15,34.2707
2018-02-16,34.4004
2018-02-20,34.0577
2018-02-21,33.6316
2018-02-22,33.7798
2018-02-23,34.0114
2018-02-26,34.6968
2018-02-27,34.1503
2018-02-28,33.6223
2018-03-01,33.3445
2018-03-02,33.6687
2018-03-05,33.9928
2018-03-06,34.1503
2018-03-07,34.1874
2018-03-08,34.3726
2018-03-09,34.317
2018-03-12,34.6042
2018-03-13,34.6319
2018-03-14,34.2985
2018-03-15,34.3078
2018-03-16,34.2707
2018-03-19,33.8817
2018-03-20,33.6594
2018-03-21,33.3445
2018-03-22,32.7609
2018-03-23,32.1404
2018-03-26,32.1311
2018-03-27,32.3256
2018-03-28,32.9369
2018-03-29,33.0203
2018-04-02,32.5109
2018-04-03,32.7609
2018-04-04,33.2333
2018-04-05,33.4741
2018-04-06,33.0018
2018-04-09,33.0393
2018-04-10,33.6406
2018-04-11,33.1145
2018-04-12,33.0299
2018-04-13,33.0112
2018-04-16,33.4809
2018-04-17,33.2178
2018-04-18,33.0769
2018-04-19,32.7105
2018-04-20,32.5696
2018-04-23,32.7763
2018-04-24,32.8796
2018-04-25,33.0675
2018-04-26,31.0947
2018-04-27,31.0384
2018-04-30,30.719
2018-05-01,30.5687
2018-05-02,30.1178
2018-05-03,30.005
2018-05-04,30.1929
2018-05-07,30.099
2018-05-08,29.7796
2018-05-09,29.4977
2018-05-10,29.9487
2018-05-11,30.3338
2018-05-14,30.2399
2018-05-15,30.1459
2018-05-16,30.3432
2018-05-17,29.9956
2018-05-18,30.1084
2018-05-21,30.6156
2018-05-22,30.4653
2018-05-23,30.3714
2018-05-24,30.7941
2018-05-25,30.5405
2018-05-29,30.3714
2018-05-30,30.5969
2018-05-31,30.362
2018-06-01,30.5029
2018-06-04,30.4465
2018-06-05,30.7002
2018-06-06,31.3578
2018-06-07,31.7617
2018-06-08,31.7805
2018-06-11,32.1093
2018-06-12,32.269
2018-06-13,30.2681
2018-06-14,30.5499
2018-06-15,31.1417
2018-06-18,30.2399
2018-06-19,30.4278
2018-06-20,30.0614
2018-06-21,29.6856
2018-06-22,29.7702
2018-06-25,29.789
2018-06-26,29.7044
2018-06-27,29.7326
2018-06-28,30.2399
2018-06-29,30.1647
2018-07-02,30.2587
2018-07-03,30.7284
2018-07-05,30.625
2018-07-06,30.7002
2018-07-09,30.6716
2018-07-10,31.0055
2018-07-11,30.4045
2018-07-12,30.7479
2018-07-13,30.2136
2018-07-16,30.4331
2018-07-17,30.2995
2018-07-18,30.2518
2018-07-19,29.832
2018-07-20,29.6699
2018-07-23,29.5745
2018-07-24,30.2232
2018-07-25,28.8589
2018-07-26,28.9543
2018-07-27,29.6508
2018-07-30,30.5285
2018-07-31,30.4999
2018-08-01,30.4331
2018-08-02,30.3854
2018-08-03,30.7861
2018-08-06,30.6334
2018-08-07,30.9101
2018-08-08,30.8719
2018-08-09,30.9959
2018-08-10,30.7765
2018-08-13,30.7288
2018-08-14,30.7574
2018-08-15,30.9769
2018-08-16,31.5683
2018-08-17,31.5111
2018-08-20,31.5874
2018-08-21,31.8641
2018-08-22,31.1772
2018-08-23,30.9959
2018-08-24,31.139
2018-08-27,31.3203
2018-08-28,31.1677
2018-08-29,30.7479
2018-08-30,30.4903
2018-08-31,30.4712
2018-09-04,30.3949
2018-09-05,30.5476
2018-09-06,30.7002
2018-09-07,30.643
2018-09-10,30.9005
2018-09-11,31.1677
2018-09-12,31.8832
2018-09-13,32.1312
2018-09-14,32.0549
2018-09-17,32.074
2018-09-18,32.1694
2018-09-19,31.8355
2018-09-20,31.9023
2018-09-21,32.2266
2018-09-24,32.3506
2018-09-25,32.2075
2018-09-26,31.8164
2018-09-27,31.8832
2018-09-28,32.0358
2018-10-01,31.95
2018-10-02,32.3602
2018-10-03,32.3602
2018-10-04,32.551
2018-10-05,32.427
2018-10-08,32.5414
2018-10-09,32.4349
2018-10-10,31.8056
2018-10-11,30.7406
2018-10-12,31.2247
2018-10-15,31.3312
2018-10-16,31.3602
2018-10-17,31.5345
2018-10-18,31.4667
2018-10-19,31.825
2018-10-22,31.6313
2018-10-23,31.9702
2018-10-24,29.3948
2018-10-25,29.0268
2018-10-26,28.1651
2018-10-29,28.6976
2018-10-30,29.5013
2018-10-31,29.7046
2018-11-01,29.5206
2018-11-02,29.5497
2018-11-05,29.6562
2018-11-06,29.9757
2018-11-07,30.1112
2018-11-08,30.0531
2018-11-09,29.7143
2018-11-12,29.8014
2018-11-13,29.3657
2018-11-14,29.54
2018-11-15,29.1624
2018-11-16,29.327
2018-11-19,29.3851
2018-11-20,28.4846
2018-11-21,28.8235
2018-11-23,28.4265
2018-11-26,28.9978
2018-11-27,29.4722
2018-11-28,29.7627
2018-11-29,29.5981
2018-11-30,30.2468
2018-12-03,30.7018
2018-12-04,29.753
2018-12-06,29.5594
2018-12-07,29.1818
2018-12-10,28.9591
2018-12-11,28.7557
2018-12-12,29.2011
2018-12-13,28.9591
2018-12-14,29.2592
2018-12-17,28.9107
2018-12-18,28.8041
2018-12-19,28.8719
2018-12-20,27.7391
2018-12-21,27.4099
2018-12-24,26.4901
2018-12-26,27.1872
2018-12-27,27.255
2018-12-28,27.5552
2018-12-31,27.6326
2019-01-02,28.6008
2019-01-03,28.6396
2019-01-04,29.3754
2019-01-07,29.9079
2019-01-08,30.2855
2019-01-09,29.626
2019-01-10,29.9213
2019-01-11,30.3839
2019-01-14,30.1379
2019-01-15,30.1182
2019-01-16,30.0788
2019-01-17,30.1575
2019-01-18,30.4725
2019-01-22,30.0985
2019-01-23,30.4036
2019-01-24,30.1182
2019-01-25,30.1772
2019-01-28,30.1871
2019-01-29,30.2166
2019-01-30,28.9075
2019-01-31,29.5867
2019-02-01,29.5276
2019-02-04,29.1438
2019-02-05,29.1634
2019-02-06,29.0945
2019-02-07,28.9863
2019-02-08,29.0847
2019-02-11,29.2422
2019-02-12,29.3406
2019-02-13,29.3701
2019-02-14,29.3209
2019-02-15,29.9902
2019-02-19,30.1477
2019-02-20,30.3642
2019-02-21,30.3446
2019-02-22,30.6595
2019-02-25,30.6398
2019-02-26,30.7284
2019-02-27,30.5709
2019-02-28,30.63
2019-03-01,30.3347
2019-03-04,29.5079
2019-03-05,29.4784
2019-03-06,29.3406
2019-03-07,29.4489
2019-03-08,29.4883
2019-03-11,29.7442
2019-03-12,30.1477
2019-03-13,29.8032
2019-03-14,29.8032
2019-03-15,30.1871
2019-03-18,30.315
2019-03-19,30.1969
2019-03-20,30.0296
2019-03-21,30.5709
2019-03-22,30.5808
2019-03-25,30.2855
2019-03-26,30.8957
2019-03-27,30.9056
2019-03-28,30.5217
2019-03-29,30.8662
2019-04-01,31.4469
2019-04-02,31.132
2019-04-03,31.3682
2019-04-04,31.4764
2019-04-05,31.8406
2019-04-08,31.88
2019-04-09,31.75
2019-04-10,31.88
2019-04-11,32.2
2019-04-12,32.2
2019-04-15,32.02
2019-04-16,32.25
2019-04-17,31.95
2019-04-18,32.03
2019-04-22,32.08
2019-04-23,32.1
2019-04-24,30.79
2019-04-25,30.34
2019-04-26,30.68
2019-04-29,30.88
2019-04-30,30.96
2019-05-01,30.79
2019-05-02,30.62
2019-05-03,30.7
2019-05-06,30.59
2019-05-07,30.53
2019-05-08,30.3
2019-05-09,30.38
2019-05-10,30.62
2019-05-13,30.47
2019-05-14,31.09
2019-05-15,31.25
2019-05-16,31.62
2019-05-17,31.8
2019-05-20,32.19
2019-05-21,32.41
2019-05-22,32.28
2019-05-23,32.14
2019-05-24,32.27
2019-05-28,31.93
2019-05-29,31.91
2019-05-30,31.86
2019-05-31,30.58
2019-06-03,31.09
2019-06-04,31.48
2019-06-05,31.68
2019-06-06,32.1
2019-06-07,32.49
2019-06-10,31.93
2019-06-11,32.11
2019-06-12,32.18
2019-06-13,32.24
2019-06-14,32.43
2019-06-17,32.36
2019-06-18,32.465
2019-06-19,32.46
2019-06-20,32.45
2019-06-21,32.49
2019-06-24,32.595
2019-06-25,32.56
2019-06-26,32.555
2019-06-27,32.92
2019-06-28,33.295
2019-07-01,33.445
2019-07-02,33.855
2019-07-03,33.975
2019-07-04,33.975
2019-07-05,34.3
2019-07-08,34.325
2019-07-09,33.505
2019-07-10,33.79
2019-07-11,33.375
2019-07-12,33.595
2019-07-15,33.65
2019-07-16,33.575
2019-07-17,33.275
2019-07-18,33.11
2019-07-19,32.805
2019-07-22,32.165
2019-07-23,32.055
2019-07-24,33.145
2019-07-25,33.765
2019-07-26,34.205
2019-07-29,34.355
2019-07-30,34.16
2019-07-31,34.055
2019-08-01,34.08
2019-08-02,34.14
2019-08-05,33.495
2019-08-06,33.88
2019-08-07,34.135
2019-08-08,34.445
2019-08-09,34.535
2019-08-12,34.48
2019-08-13,34.815
2019-08-14,34.17
2019-08-15,34.385
2019-08-16,34.95
2019-08-19,35.4
2019-08-20,35.005
2019-08-21,35.175
2019-08-22,35.45
2019-08-23,34.67
2019-08-26,34.935
2019-08-27,34.745
2019-08-28,34.935
2019-08-29,35.15
2019-08-30,35.265
2019-09-02,35.235
2019-09-03,35.38
2019-09-04,35.73
2019-09-05,35.855
2019-09-06,36.225
2019-09-09,36.735
2019-09-10,37.545
2019-09-11,38.725
2019-09-12,38.35
2019-09-13,37.84
2019-09-16,37.415
2019-09-17,37.125
2019-09-18,36.73
2019-09-19,37.115
2019-09-20,37.93
2019-09-23,37.63
2019-09-24,37.425
2019-09-25,37.425
2019-09-26,37.375
2019-09-27,37.45
2019-09-30,37.84
2019-10-01,37.415
2019-10-02,37.095
2019-10-03,37.155
2019-10-04,37.52
2019-10-07,37.71
2019-10-08,37.465
2019-10-09,37.055
2019-10-10,37.405
2019-10-11,37.615
2019-10-14,37.525
2019-10-15,38.04
2019-10-16,37.805
2019-10-17,37.83
2019-10-18,38.43
2019-10-21,38.225
2019-10-22,38.16
2019-10-23,37.725
2019-10-24,36.79
2019-10-25,36.91
2019-10-28,38.52
2019-10-29,38.05
2019-10-30,38.225
2019-10-31,38.39
2019-11-01,38.895
2019-11-04,38.905
