date,close
2016-09-16,20.5514
2016-09-19,20.3236
2016-09-20,20.3038
2016-09-21,20.5514
2016-09-22,20.5514
2016-09-23,20.6108
2016-09-26,20.3038
2016-09-27,20.3137
2016-09-28,20.2047
2016-09-29,20.1255
2016-09-30,19.9868
2016-10-03,19.6402
2016-10-04,20.7396
2016-10-05,21.6409
2016-10-06,21.7399
2016-10-07,21.7201
2016-10-10,21.7399
2016-10-11,21.7003
2016-10-12,21.3635
2016-10-13,21.0466
2016-10-14,21.3437
2016-10-17,20.9476
2016-10-18,20.9674
2016-10-19,20.8386
2016-10-20,21.1556
2016-10-21,21.0466
2016-10-24,21.2051
2016-10-25,21.5418
2016-10-26,21.6111
2016-10-27,21.4329
2016-10-28,20.6009
2016-10-31,20.6504
2016-11-01,20.8584
2016-11-02,20.8485
2016-11-03,21.2744
2016-11-04,21.2249
2016-11-07,21.2249
2016-11-08,20.6405
2016-11-09,20.9773
2016-11-10,22.3144
2016-11-11,22.037
2016-11-14,22.1163
2016-11-15,22.4332
2016-11-16,22.5322
2016-11-17,23.1958
2016-11-18,23.0275
2016-11-21,22.8987
2016-11-22,22.0568
2016-11-23,23.176
2016-11-25,23.0968
2016-11-28,23.1463
2016-11-29,23.3048
2016-11-30,23.4732
2016-12-01,23.1958
2016-12-02,23.6217
2016-12-05,23.6019
2016-12-06,23.5524
2016-12-07,23.6613
2016-12-08,23.2355
2016-12-09,23.7406
2016-12-12,24.3645
2016-12-13,23.8
2016-12-14,23.384
2016-12-15,24.4834
2016-12-16,24.6419
2016-12-19,25.4738
2016-12-20,25.563
2016-12-21,25.5729
2016-12-22,25.3054
2016-12-23,25.563
2016-12-27,25.7809
2016-12-28,26.0681
2016-12-29,26.1473
2016-12-30,25.7016
2017-01-03,25.8106
2017-01-04,26.5534
2017-01-05,26.6425
2017-01-06,26.7713
2017-01-09,26.0681
2017-01-10,26.4841
2017-01-11,27.3853
2017-01-12,26.6821
2017-01-13,26.4444
2017-01-17,26.3256
2017-01-18,26.8505
2017-01-19,26.3652
2017-01-20,26.2464
2017-01-23,25.8106
2017-01-24,25.3748
2017-01-25,24.9687
2017-01-26,24.7508
2017-01-27,25.4441
2017-01-30,24.632
2017-01-31,25.2163
2017-02-01,25.1569
2017-02-02,24.6815
2017-02-03,24.9192
2017-02-06,24.6815
2017-02-07,24.4636
2017-02-08,23.9783
2017-02-09,26.0681
2017-02-10,29.7921
2017-02-13,30.4755
2017-02-14,31.3173
2017-02-15,31.8027
2017-02-16,33.0011
2017-02-17,32.7931
2017-02-21,32.7139
2017-02-22,32.6148
2017-02-23,32.5257
2017-02-24,31.9215
2017-02-27,32.1592
2017-02-28,31.4461
2017-03-01,31.5551
2017-03-02,31.3372
2017-03-03,31.456
2017-03-06,31.4065
2017-03-07,31.5253
2017-03-08,31.1193
2017-03-09,31.1193
2017-03-10,31.2084
2017-03-13,31.0598
2017-03-14,31.1193
2017-03-15,32.7337
2017-03-16,33.1595
2017-03-17,32.4365
2017-03-20,31.9116
2017-03-21,30.4953
2017-03-22,30.4656
2017-03-23,31.1589
2017-03-24,31.3273
2017-03-27,31.3867
2017-03-28,32.5356
2017-03-29,32.6247
2017-03-30,34.3382
2017-03-31,35.0215
2017-04-03,33.7043
2017-04-04,33.1992
2017-04-05,32.902
2017-04-06,33.1298
2017-04-07,33.9024
2017-04-10,34.2094
2017-04-11,34.2589
2017-04-12,33.625
2017-04-13,32.6742
2017-04-17,33.1496
2017-04-18,33.3576
2017-04-19,33.7736
2017-04-20,34.4174
2017-04-21,34.8235
2017-04-24,35.3682
2017-04-25,36.8439
2017-04-26,35.4177
2017-04-27,37.0519
2017-04-28,35.8931
2017-05-01,36.8935
2017-05-02,36.6558
2017-05-03,36.6459
2017-05-04,36.5963
2017-05-05,37.3094
2017-05-08,37.7056
2017-05-09,38.0721
2017-05-10,37.6363
2017-05-11,37.2599
2017-05-12,36.527
2017-05-15,36.8737
2017-05-16,37.8146
2017-05-17,36.834
2017-05-18,37.4976
2017-05-19,37.4976
2017-05-22,37.6264
2017-05-23,37.5273
2017-05-24,36.8836
2017-05-25,36.9727
2017-05-26,36.5567
2017-05-30,34.0707
2017-05-31,33.8429
2017-06-01,34.1698
2017-06-02,33.8231
2017-06-05,34.0707
2017-06-06,34.1104
2017-06-07,34.2688
2017-06-08,35.5861
2017-06-09,36.5072
2017-06-12,35.5564
2017-06-13,35.6356
2017-06-14,35.6455
2017-06-15,35.8238
2017-06-16,35.9526
2017-06-19,35.8535
2017-06-20,35.8535
2017-06-21,35.6851
2017-06-22,35.7446
2017-06-23,35.9724
2017-06-26,35.9426
2017-06-27,35.7842
2017-06-28,35.9724
2017-06-29,35.903
2017-06-30,35.8436
2017-07-03,36.0318
2017-07-05,35.8436
2017-07-06,36.0714
2017-07-07,35.9922
2017-07-10,35.4871
2017-07-11,35.4177
2017-07-12,35.3781
2017-07-13,35.1602
2017-07-14,34.4273
2017-07-17,34.5263
2017-07-18,34.4471
2017-07-19,34.0806
2017-07-20,33.6746
2017-07-21,34.1797
2017-07-24,33.5656
2017-07-25,34.041
2017-07-26,33.4072
2017-07-27,33.2982
2017-07-28,33.7736
2017-07-31,34.041
2017-08-01,34.0905
2017-08-02,32.9813
2017-08-03,33.3873
2017-08-04,33.7538
2017-08-07,33.8033
2017-08-08,34.3877
2017-08-09,34.15
2017-08-10,32.9317
2017-08-11,32.6841
2017-08-14,33.6944
2017-08-15,34.7541
2017-08-16,34.1896
2017-08-17,33.6647
2017-08-18,33.6944
2017-08-21,33.7241
2017-08-22,33.942
2017-08-23,34.0311
2017-08-24,34.566
2017-08-25,34.3877
2017-08-28,34.3481
2017-08-29,34.1995
2017-08-30,34.2391
2017-08-31,34.4174
2017-09-01,34.8631
2017-09-05,34.3084
2017-09-06,33.9222
2017-09-07,33.8528
2017-09-08,33.734
2017-09-11,34.457
2017-09-12,34.9918
2017-09-13,35.2097
2017-09-14,35.3781
2017-09-15,35.2394
2017-09-18,35.0315
2017-09-19,35.2692
2017-09-20,35.5861
2017-09-21,35.7148
2017-09-22,36.1903
2017-09-25,36.4379
2017-09-26,36.6359
2017-09-27,37.6462
2017-09-28,37.4184
2017-09-29,37.359
2017-10-02,37.666
2017-10-03,37.8839
2017-10-04,37.2995
2017-10-05,37.6363
2017-10-06,37.6462
2017-10-09,37.567
2017-10-10,37.8839
2017-10-11,37.7155
2017-10-12,37.2797
2017-10-13,37.4976
2017-10-16,37.6957
2017-10-17,37.5372
2017-10-18,37.8245
2017-10-19,37.6066
2017-10-20,37.9829
2017-10-23,37.8245
2017-10-24,39.1021
2017-10-25,39.6469
2017-10-26,40.36
2017-10-27,41.3207
2017-10-30,40.4986
2017-10-31,40.4788
2017-11-01,39.6667
2017-11-02,40.1619
2017-11-03,40.2807
2017-11-06,40.6373
2017-11-07,40.2906
2017-11-08,39.1913
2017-11-09,38.6267
2017-11-10,38.6465
2017-11-13,38.7059
2017-11-14,38.7753
2017-11-15,39.0625
2017-11-16,39.4091
2017-11-17,39.7558
2017-11-20,40.0232
2017-11-21,39.6568
2017-11-22,39.5973
2017-11-24,39.4785
2017-11-27,39.5082
2017-11-28,40.8651
2017-11-29,41.806
2017-11-30,42.0437
2017-12-01,42.4795
2017-12-04,42.5884
2017-12-05,41.8456
2017-12-06,42.0734
2017-12-07,42.5686
2017-12-08,42.7964
2017-12-11,42.5587
2017-12-12,42.6379
2017-12-13,42.2616
2017-12-14,41.5089
2017-12-15,43.0836
2017-12-18,43.4006
2017-12-19,42.9846
2017-12-20,43.0935
2017-12-21,43.4204
2017-12-22,43.0836
2017-12-26,42.9747
2017-12-27,42.8063
2017-12-28,42.6478
2017-12-29,41.5881
2018-01-02,42.5785
2018-01-03,43.0935
2018-01-04,43.3312
2018-01-05,43.6779
2018-01-08,42.6875
2018-01-09,42.5785
2018-01-10,43.5888
2018-01-11,44.183
2018-01-12,44.2523
2018-01-16,43.4105
2018-01-17,43.3114
2018-01-18,42.8856
2018-01-19,43.2718
2018-01-22,43.4006
2018-01-23,42.5983
2018-01-24,42.8558
2018-01-25,42.836
2018-01-26,42.9648
2018-01-29,43.0341
2018-01-30,42.7766
2018-01-31,41.8753
2018-02-01,42.5389
2018-02-02,41.598
2018-02-05,39.4884
2018-02-06,39.6766
2018-02-07,39.9935
2018-02-08,38.597
2018-02-09,39.1516
2018-02-12,39.5577
2018-02-13,39.627
2018-02-14,40.043
2018-02-15,40.5779
2018-02-16,41.1028
2018-02-20,40.2609
2018-02-21,41.1325
2018-02-22,40.3996
2018-02-23,40.4986
2018-02-26,40.974
2018-02-27,39.8449
2018-02-28,39.1516
2018-03-01,39.4785
2018-03-02,40.2015
2018-03-05,40.5184
2018-03-06,41.1622
2018-03-07,41.6079
2018-03-08,41.6079
2018-03-09,41.6376
2018-03-12,41.5287
2018-03-13,41.499
2018-03-14,41.291
2018-03-15,40.6868
2018-03-16,40.568
2018-03-19,40.6769
2018-03-20,41.0731
2018-03-21,41.9347
2018-03-22,40.6373
2018-03-23,39.3893
2018-03-26,40.6868
2018-03-27,39.7063
2018-03-28,40.1124
2018-03-29,40.2015
2018-04-02,39.4587
2018-04-03,40.2114
2018-04-04,40.3897
2018-04-05,40.7264
2018-04-06,40.3203
2018-04-09,39.944
2018-04-10,40.568
2018-04-11,40.2708
2018-04-12,40.6175
2018-04-13,40.2609
2018-04-16,40.3699
2018-04-17,40.1223
2018-04-18,39.835
2018-04-19,40.4194
2018-04-20,41.0434
2018-04-23,41.2018
2018-04-24,40.558
2018-04-25,40.2708
2018-04-26,40.4095
2018-04-27,40.3301
2018-04-30,39.5069
2018-05-01,39.6755
2018-05-02,39.9929
2018-05-03,39.6457
2018-05-04,40.5285
2018-05-07,40.955
2018-05-08,41.7287
2018-05-09,42.2643
2018-05-10,42.3437
2018-05-11,42.1949
2018-05-14,41.5998
2018-05-15,41.7882
2018-05-16,42.0263
2018-05-17,42.7305
2018-05-18,42.6313
2018-05-21,43.286
2018-05-22,41.8874
2018-05-23,40.6674
2018-05-24,41.0542
2018-05-25,41.2129
2018-05-29,40.5781
2018-05-30,40.9154
2018-05-31,40.588
2018-06-01,40.9054
2018-06-04,41.818
2018-06-05,41.4411
2018-06-06,41.7188
2018-06-07,41.6196
2018-06-08,41.6494
2018-06-11,41.0542
2018-06-12,40.3897
2018-06-13,40.5285
2018-06-14,40.8162
2018-06-15,40.6079
2018-06-18,40.9947
2018-06-19,41.4609
2018-06-20,41.8973
2018-06-21,42.0957
2018-06-22,41.3022
2018-06-25,40.3996
2018-06-26,40.4789
2018-06-27,39.9929
2018-06-28,40.3897
2018-06-29,40.3897
2018-07-02,40.9451
2018-07-03,40.8955
2018-07-05,41.5105
2018-07-06,41.57
2018-07-09,41.9767
2018-07-10,41.689
2018-07-11,41.5105
2018-07-12,40.8261
2018-07-13,40.5087
2018-07-16,40.717
2018-07-17,40.5087
2018-07-18,40.4293
2018-07-19,40.4194
2018-07-20,40.6872
2018-07-23,40.836
2018-07-24,42.2742
2018-07-25,43.2661
2018-07-26,42.9983
2018-07-27,42.2742
2018-07-30,42.2643
2018-07-31,42.2743
2018-08-01,42.612
2018-08-02,43.5755
2018-08-03,42.4232
2018-08-06,42.7709
2018-08-07,42.751
2018-08-08,43.1384
2018-08-09,43.2477
2018-08-10,43.3669
2018-08-13,43.2675
2018-08-14,43.6649
2018-08-15,43.3669
2018-08-16,43.9132
2018-08-17,43.933
2018-08-20,43.8734
2018-08-21,43.7245
2018-08-22,43.9231
2018-08-23,43.6549
2018-08-24,43.5854
2018-08-27,43.8138
2018-08-28,43.7046
2018-08-29,43.6152
2018-08-30,43.5854
2018-08-31,43.6847
2018-09-04,43.6748
2018-09-05,43.7841
2018-09-06,43.794
2018-09-07,43.8436
2018-09-10,43.347
2018-09-11,43.7642
2018-09-12,43.7145
2018-09-13,43.3172
2018-09-14,43.8337
2018-09-17,43.6351
2018-09-18,43.6748
2018-09-19,43.645
2018-09-20,44.0026
2018-09-21,43.6649
2018-09-24,43.1682
2018-09-25,41.0227
2018-09-26,40.0294
2018-09-27,38.8474
2018-09-28,38.9169
2018-10-01,38.47
2018-10-02,37.6555
2018-10-03,38.3408
2018-10-04,37.7548
2018-10-05,37.6853
2018-10-08,37.7449
2018-10-09,37.4965
2018-10-10,36.7516
2018-10-11,36.1854
2018-10-12,35.5696
2018-10-15,35.6093
2018-10-16,35.8775
2018-10-17,36.0464
2018-10-18,35.3411
2018-10-19,34.5962
2018-10-22,33.4837
2018-10-23,36.245
2018-10-24,33.8313
2018-10-25,35.8278
2018-10-26,36.7317
2018-10-29,36.2748
2018-10-30,36.5033
2018-10-31,36.3141
2018-11-01,36.6227
2018-11-02,37.0109
2018-11-05,36.6824
2018-11-06,37.22
2018-11-07,37.2399
2018-11-08,38.0164
2018-11-09,37.5983
2018-11-12,37.8272
2018-11-13,38.1657
2018-11-14,37.5784
2018-11-15,38.1856
2018-11-16,38.8127
2018-11-19,38.5937
2018-11-20,38.3548
2018-11-21,38.1955
2018-11-23,38.5539
2018-11-26,38.8824
2018-11-27,38.4842
2018-11-28,38.9123
2018-11-29,38.4444
2018-11-30,38.4743
2018-12-03,38.4444
2018-12-04,36.0254
2018-12-06,36.0752
2018-12-07,35.687
2018-12-10,35.4979
2018-12-11,35.3087
2018-12-12,36.0951
2018-12-13,34.6816
2018-12-14,34.5422
2018-12-17,35.0499
2018-12-18,34.4228
2018-12-19,33.3875
2018-12-20,33.925
2018-12-21,33.6463
2018-12-24,32.7106
2018-12-26,34.5223
2018-12-27,33.8255
2018-12-28,34.4526
2018-12-31,34.8608
2019-01-02,35.04
2019-01-03,34.8309
2019-01-04,35.7368
2019-01-07,35.8761
2019-01-08,35.8761
2019-01-09,35.8164
2019-01-10,35.8363
2019-01-11,36.334
2019-01-14,35.9657
2019-01-15,36.5232
2019-01-16,37.6082
2019-01-17,37.5286
2019-01-18,38.2254
2019-01-22,37.8471
2019-01-23,34.4526
2019-01-24,34.592
2019-01-25,33.8753
2019-01-28,33.3278
2019-01-29,34.3232
2019-01-30,33.4572
2019-01-31,33.0082
2019-02-01,33.2975
2019-02-04,34.0758
2019-02-05,33.6068
2019-02-06,33.7166
2019-02-07,33.7465
2019-02-08,33.4771
2019-02-11,33.7266
2019-02-12,33.996
2019-02-13,34.1457
2019-02-14,34.1058
2019-02-15,35.393
2019-02-19,35.5227
2019-02-20,35.4329
2019-02-21,35.3231
2019-02-22,35.5027
2019-02-25,35.7721
2019-02-26,35.2433
2019-02-27,35.1834
2019-02-28,35.373
2019-03-01,35.3032
2019-03-04,35.0936
2019-03-05,34.8042
2019-03-06,33.6068
2019-03-07,33.3574
2019-03-08,33.4672
2019-03-11,33.9062
2019-03-12,33.527
2019-03-13,34.016
2019-03-14,34.1157
2019-03-15,34.904
2019-03-18,34.7543
2019-03-19,33.7066
2019-03-20,32.7487
2019-03-21,32.14
2019-03-22,30.5435
2019-03-25,30.9027
2019-03-26,31.681
2019-03-27,31.681
2019-03-28,31.6711
2019-03-29,31.691
2019-04-01,32.5292
2019-04-02,32.9383
2019-04-03,32.9084
2019-04-04,33.2377
2019-04-05,33.8363
2019-04-08,33.8164
2019-04-09,33.098
2019-04-10,33.7865
2019-04-11,33.8164
2019-04-12,35.0038
2019-04-15,34.1756
2019-04-16,34.8142
2019-04-17,35.0138
2019-04-18,34.5348
2019-04-22,34.1257
2019-04-23,36.1613
2019-04-24,36.7999
2019-04-25,36.5804
2019-04-26,36.4806
2019-04-29,36.76
2019-04-30,36.74
2019-05-01,36.63
2019-05-02,36.69
2019-05-03,37.27
2019-05-06,37.02
2019-05-07,36.32
2019-05-08,35.91
2019-05-09,35.45
2019-05-10,35.42
2019-05-13,34.91
2019-05-14,35.83
2019-05-15,34.77
2019-05-16,34.93
2019-05-17,34.87
2019-05-20,34.97
2019-05-21,35.17
2019-05-22,34.9
2019-05-23,34.76
2019-05-24,35.29
2019-05-28,35.21
2019-05-29,35.06
2019-05-30,35.31
2019-05-31,34.79
2019-06-03,35.14
2019-06-04,35.88
2019-06-05,35.78
2019-06-06,35.94
2019-06-07,35.55
2019-06-10,35.75
2019-06-11,36.09
2019-06-12,36.04
2019-06-13,35.865
2019-06-14,36.08
2019-06-17,35.84
2019-06-18,35
2019-06-19,35.57
2019-06-20,35.44
2019-06-21,35.27
2019-06-24,35.2
2019-06-25,35.96
2019-06-26,35.2
2019-06-27,35.62
2019-06-28,36.6
2019-07-01,37.14
2019-07-02,36.145
2019-07-03,36.145
2019-07-04,36.145
2019-07-05,36.835
2019-07-08,36.41
2019-07-09,36.885
2019-07-10,36.55
2019-07-11,36.775
2019-07-12,37.21
2019-07-15,36.57
2019-07-16,37.125
2019-07-17,37.045
2019-07-18,36.915
2019-07-19,36.885
2019-07-22,36.985
2019-07-23,37.2
2019-07-24,38.275
2019-07-25,37.865
2019-07-26,38.42
2019-07-29,38.275
2019-07-30,38.525
2019-07-31,38.015
2019-08-01,37.07
2019-08-02,36.85
2019-08-05,35.755
2019-08-06,35.755
2019-08-07,36.06
2019-08-08,36.61
2019-08-09,36.645
2019-08-12,35.905
2019-08-13,36.3
2019-08-14,35.55
2019-08-15,35.13
2019-08-16,35.62
2019-08-19,36.345
2019-08-20,35.98
2019-08-21,36.19
2019-08-22,36.26
2019-08-23,35.005
2019-08-26,35.42
2019-08-27,34.98
2019-08-28,35.2
2019-08-29,35.61
2019-08-30,35.89
2019-09-02,35.89
2019-09-03,35.765
2019-09-04,35.42
2019-09-05,36.23
2019-09-06,36.09
2019-09-09,36.965
2019-09-10,37.44
2019-09-11,37.93
2019-09-12,38.465
2019-09-13,38.66
2019-09-16,38.635
2019-09-17,38.285
2019-09-18,38.16
2019-09-19,38.1
2019-09-20,37.935
2019-09-23,37.99
2019-09-24,37.37
2019-09-25,37.91
2019-09-26,37.57
2019-09-27,37.735
2019-09-30,37.59
2019-10-01,36.885
2019-10-02,36.83
2019-10-03,36.62
2019-10-04,36.805
2019-10-07,36.77
2019-10-08,36
2019-10-09,36.28
2019-10-10,36.16
2019-10-11,36.575
2019-10-14,36.76
2019-10-15,37.21
2019-10-16,36.92
2019-10-17,37.25
2019-10-18,37.72
2019-10-21,37.945
2019-10-22,38.61
2019-10-23,37.775
2019-10-24,37.74
2019-10-25,37.89
2019-10-28,38.135
2019-10-29,38.38
2019-10-30,38.215
2019-10-31,37.595
2019-11-01,38.44
2019-11-04,38.73
2019-11-05,38.74
2019-11-06,39.02
2019-11-07,39.11
2019-11-08,38.95
2019-11-11,38.73
2019-11-12,38.9
2019-11-13,38.225
2019-11-14,38.225
2019-11-15,38.015
2019-11-18,38.015
2019-11-19,37.95
2019-11-20,37.75
2019-11-21,37.85
2019-11-22,38.095
2019-11-25,38.57
