date,close
2014-06-13,33.3983
2014-06-16,33.1407
2014-06-17,33.3581
2014-06-18,33.7364
2014-06-19,33.8894
2014-06-20,34.0262
2014-06-23,33.833
2014-06-24,33.8974
2014-06-25,33.7928
2014-06-26,33.6318
2014-06-27,33.8733
2014-06-30,33.7686
2014-07-01,33.9377
2014-07-02,33.7364
2014-07-03,33.664
2014-07-07,33.511
2014-07-08,33.7445
2014-07-09,33.7123
2014-07-10,33.7606
2014-07-11,33.6398
2014-07-14,34.0504
2014-07-15,33.8894
2014-07-16,33.8974
2014-07-17,33.7445
2014-07-18,34.308
2014-07-21,34.1067
2014-07-22,34.2355
2014-07-23,34.1953
2014-07-24,34.1309
2014-07-25,33.7928
2014-07-28,33.9779
2014-07-29,33.8813
2014-07-30,34.2194
2014-07-31,33.8652
2014-08-01,33.7123
2014-08-04,33.833
2014-08-05,33.4547
2014-08-06,33.4788
2014-08-07,33.5432
2014-08-08,33.7284
2014-08-11,34.0182
2014-08-12,33.9538
2014-08-13,34.3884
2014-08-14,34.1649
2014-08-15,34.0185
2014-08-18,34.4576
2014-08-19,34.4901
2014-08-20,34.5551
2014-08-21,34.6365
2014-08-22,34.3356
2014-08-25,34.1486
2014-08-26,34.2137
2014-08-27,34.2624
2014-08-28,34.2299
2014-08-29,34.5958
2014-09-02,34.734
2014-09-03,34.669
2014-09-04,34.5551
2014-09-05,34.9535
2014-09-08,34.7909
2014-09-09,34.5958
2014-09-10,34.2218
2014-09-11,34.3275
2014-09-12,33.0835
2014-09-15,33.0428
2014-09-16,33.5388
2014-09-17,33.3437
2014-09-18,32.9859
2014-09-19,32.7339
2014-09-22,32.3924
2014-09-23,32.0672
2014-09-24,31.9127
2014-09-25,31.4005
2014-09-26,31.8476
2014-09-29,31.872
2014-09-30,31.6281
2014-10-01,31.7094
2014-10-02,31.6606
2014-10-03,31.9127
2014-10-06,31.9533
2014-10-07,31.5468
2014-10-08,32.1566
2014-10-09,32.0672
2014-10-10,32.0021
2014-10-13,32.3274
2014-10-14,33.3925
2014-10-15,33.116
2014-10-16,32.9128
2014-10-17,32.8315
2014-10-20,33.2055
2014-10-21,33.5551
2014-10-22,33.6608
2014-10-23,34.0917
2014-10-24,34.1242
2014-10-27,34.3031
2014-10-28,34.5795
2014-10-29,34.4169
2014-10-30,34.5775
2014-10-31,34.856
2014-11-03,34.8397
2014-11-04,34.9292
2014-11-05,34.734
2014-11-06,34.5714
2014-11-07,34.5145
2014-11-10,34.8641
2014-11-11,34.7015
2014-11-12,34.3763
2014-11-13,34.5775
2014-11-14,34.175
2014-11-17,34.1258
2014-11-18,34.2325
2014-11-19,34.2982
2014-11-20,34.2408
2014-11-21,34.6596
2014-11-24,34.9224
2014-11-25,35.2181
2014-11-26,35.4235
2014-11-28,35.4481
2014-12-01,35.6534
2014-12-02,35.8505
2014-12-03,35.8505
2014-12-04,36.1708
2014-12-05,36.1626
2014-12-08,36.0066
2014-12-09,36.409
2014-12-10,36.2119
2014-12-11,35.9491
2014-12-12,35.6534
2014-12-15,35.0867
2014-12-16,35.1853
2014-12-17,36.0887
2014-12-18,36.483
2014-12-19,36.5158
2014-12-22,36.8936
2014-12-23,36.9018
2014-12-24,36.9265
2014-12-26,37.0497
2014-12-29,37.0661
2014-12-30,37.0332
2014-12-31,36.368
2015-01-02,36.91
2015-01-05,37.0825
2015-01-06,37.255
2015-01-07,37.5342
2015-01-08,37.5589
2015-01-09,37.411
2015-01-12,38.142
2015-01-13,38.3966
2015-01-14,38.7909
2015-01-15,38.6841
2015-01-16,39.3247
2015-01-20,38.9058
2015-01-21,38.8812
2015-01-22,39.4561
2015-01-23,38.9962
2015-01-26,39.4068
2015-01-27,39.3576
2015-01-28,38.9962
2015-01-29,39.2015
2015-01-30,38.602
2015-02-02,38.6759
2015-02-03,39.5383
2015-02-04,39.1851
2015-02-05,39.53
2015-02-06,38.5937
2015-02-09,38.2652
2015-02-10,38.0352
2015-02-11,38.2899
2015-02-12,38.8812
2015-02-13,38.6699
2015-02-17,38.3715
2015-02-18,38.587
2015-02-19,38.04
2015-02-20,38.3135
2015-02-23,38.6616
2015-02-24,37.9074
2015-02-25,37.9489
2015-02-26,37.4848
2015-02-27,37.7997
2015-03-02,38.0483
2015-03-03,37.982
2015-03-04,37.3522
2015-03-05,37.261
2015-03-06,35.8935
2015-03-09,36.0261
2015-03-10,35.9267
2015-03-11,35.8604
2015-03-12,36.2333
2015-03-13,36.225
2015-03-16,36.4405
2015-03-17,36.5565
2015-03-18,37.2693
2015-03-19,37.3853
2015-03-20,38.6119
2015-03-23,38.6699
2015-03-24,38.5373
2015-03-25,37.6671
2015-03-26,37.319
2015-03-27,37.5676
2015-03-30,38.1726
2015-03-31,37.9406
2015-04-01,37.8494
2015-04-02,38.3632
2015-04-06,38.9351
2015-04-07,38.2306
2015-04-08,38.2389
2015-04-09,37.5013
2015-04-10,37.5593
2015-04-13,37.3522
2015-04-14,37.6505
2015-04-15,37.3604
2015-04-16,37.5759
2015-04-17,37.1201
2015-04-20,37.435
2015-04-21,37.3522
2015-04-22,37.377
2015-04-23,37.3522
2015-04-24,37.5428
2015-04-27,37.3853
2015-04-28,37.2693
2015-04-29,36.482
2015-04-30,35.6698
2015-05-01,35.6449
2015-05-04,35.877
2015-05-05,35.0068
2015-05-06,34.8244
2015-05-07,35.504
2015-05-08,35.6615
2015-05-11,34.9653
2015-05-12,35.2057
2015-05-13,34.8825
2015-05-14,35.4129
2015-05-15,35.504
2015-05-18,35.7259
2015-05-19,35.8179
2015-05-20,35.91
2015-05-21,35.9351
2015-05-22,35.5166
2015-05-26,35.4329
2015-05-27,35.9937
2015-05-28,35.7259
2015-05-29,35.1148
2015-06-01,35.6505
2015-06-02,35.2404
2015-06-03,35.1064
2015-06-04,34.9892
2015-06-05,34.5958
2015-06-08,34.4954
2015-06-09,34.2359
2015-06-10,34.5037
2015-06-11,34.6963
2015-06-12,34.5875
2015-06-15,34.3614
2015-06-16,34.7046
2015-06-17,34.7381
2015-06-18,35.3073
2015-06-19,34.8888
2015-06-22,34.6879
2015-06-23,34.4284
2015-06-24,34.3447
2015-06-25,33.7839
2015-06-26,34.0601
2015-06-29,33.449
2015-06-30,33.4407
2015-07-01,33.9345
2015-07-02,33.8508
2015-07-06,34.102
2015-07-07,34.5623
2015-07-08,34.4452
2015-07-09,34.2861
2015-07-10,34.5791
2015-07-13,34.713
2015-07-14,34.7297
2015-07-15,34.8386
2015-07-16,35.1315
2015-07-17,35.1315
2015-07-20,35.1148
2015-07-21,35.1483
2015-07-22,35.1985
2015-07-23,34.8051
2015-07-24,34.8721
2015-07-27,34.8888
2015-07-28,34.8972
2015-07-29,35.2487
2015-07-30,35.0981
2015-07-31,35.4329
2015-08-03,35.7175
2015-08-04,35.2738
2015-08-05,34.9976
2015-08-06,35.0813
2015-08-07,35.0813
2015-08-10,35.1064
2015-08-11,35.1901
2015-08-12,35.1315
2015-08-13,35.2034
2015-08-14,35.3133
2015-08-17,35.5755
2015-08-18,35.5332
2015-08-19,35.3133
2015-08-20,35.1611
2015-08-21,34.4254
2015-08-24,32.5651
2015-08-25,31.6687
2015-08-26,32.5059
2015-08-27,33.0471
2015-08-28,32.954
2015-08-31,32.0831
2015-09-01,31.3981
2015-09-02,31.711
2015-09-03,31.897
2015-09-04,31.136
2015-09-08,31.5841
2015-09-09,31.2882
2015-09-10,31.6602
2015-09-11,32.1845
2015-09-14,32.2268
2015-09-15,32.6158
2015-09-16,32.8695
2015-09-17,33.3346
2015-09-18,33.0893
2015-09-21,33.3177
2015-09-22,32.6327
2015-09-23,32.8779
2015-09-24,32.6496
2015-09-25,32.675
2015-09-28,32.2691
2015-09-29,32.8357
2015-09-30,32.768
2015-10-01,32.7934
2015-10-02,33.2669
2015-10-05,34.0026
2015-10-06,33.9181
2015-10-07,34.5354
2015-10-08,34.9666
2015-10-09,34.8482
2015-10-12,35.1442
2015-10-13,34.9413
2015-10-14,34.7214
2015-10-15,35.178
2015-10-16,35.3472
2015-10-19,35.8292
2015-10-20,35.9476
2015-10-21,36.0659
2015-10-22,36.4803
2015-10-23,36.438
2015-10-26,36.7678
2015-10-27,36.6833
2015-10-28,37.2075
2015-10-29,37.123
2015-10-30,36.7425
2015-11-02,37.5035
2015-11-03,37.1991
2015-11-04,36.8355
2015-11-05,37.1314
2015-11-06,36.1251
2015-11-09,35.2964
2015-11-10,35.7784
2015-11-11,36.252
2015-11-12,35.7438
2015-11-13,35.3338
2015-11-16,35.8207
2015-11-17,36.1282
2015-11-18,36.7943
2015-11-19,37.1531
2015-11-20,37.4691
2015-11-23,37.4776
2015-11-24,37.2983
2015-11-25,37.3068
2015-11-27,37.7339
2015-11-30,37.2043
2015-12-01,37.8022
2015-12-02,36.8883
2015-12-03,36.1367
2015-12-04,36.4442
2015-12-07,36.3588
2015-12-08,36.0684
2015-12-09,35.7438
2015-12-10,35.6072
2015-12-11,35.5217
2015-12-14,35.7865
2015-12-15,36.3417
2015-12-16,36.9908
2015-12-17,36.8456
2015-12-18,36.6406
2015-12-21,36.5552
2015-12-22,37.0847
2015-12-23,37.452
2015-12-24,37.452
2015-12-28,37.6314
2015-12-29,37.8961
2015-12-30,37.6484
2015-12-31,37.2385
2016-01-04,36.8883
2016-01-05,37.5887
2016-01-06,37.2129
2016-01-07,35.9573
2016-01-08,35.3595
2016-01-11,35.8975
2016-01-12,35.2826
2016-01-13,34.7445
2016-01-14,34.8385
2016-01-15,34.2321
2016-01-19,34.4541
2016-01-20,33.3182
2016-01-21,33.5403
2016-01-22,34.4798
2016-01-25,34.3858
2016-01-26,35.3851
2016-01-27,35.1801
2016-01-28,35.1801
2016-01-29,36.1196
2016-02-01,35.8975
2016-02-02,35.4705
2016-02-03,36.0342
2016-02-04,36.6406
2016-02-05,36.4869
2016-02-08,36.0427
2016-02-09,35.6584
2016-02-10,36.0086
2016-02-11,35.2911
2016-02-12,35.6752
2016-02-16,36.5295
2016-02-17,37.125
2016-02-18,37.5392
2016-02-19,37.6255
2016-02-22,38.0656
2016-02-23,37.8326
2016-02-24,38.1001
2016-02-25,38.8336
2016-02-26,38.3159
2016-02-29,37.5823
2016-03-01,38.5748
2016-03-02,39.1443
2016-03-03,39.5154
2016-03-04,39.7311
2016-03-07,40.0073
2016-03-08,39.386
2016-03-09,39.5413
2016-03-10,39.2997
2016-03-11,39.9987
2016-03-14,40.0504
2016-03-15,40.0677
2016-03-16,40.4043
2016-03-17,40.6114
2016-03-18,40.1626
2016-03-21,39.9469
2016-03-22,40.0073
2016-03-23,39.6966
2016-03-24,39.6103
2016-03-28,39.757
2016-03-29,41.319
2016-03-30,41.2413
2016-03-31,41.2586
2016-04-01,41.25
2016-04-04,41.0256
2016-04-05,40.8185
2016-04-06,40.8357
2016-04-07,40.2576
2016-04-08,40.6373
2016-04-11,40.6718
2016-04-12,40.9393
2016-04-13,40.8703
2016-04-14,40.6545
2016-04-15,41.1119
2016-04-18,40.9566
2016-04-19,41.3276
2016-04-20,40.6373
2016-04-21,40.0763
2016-04-22,40.2921
2016-04-25,40.6718
2016-04-26,40.9134
2016-04-27,41.0256
2016-04-28,41.1809
2016-04-29,40.3266
2016-05-02,41.3017
2016-05-03,40.6027
2016-05-04,41.4139
2016-05-05,41.3622
2016-05-06,41.9576
2016-05-09,42.1561
2016-05-10,42.018
2016-05-11,41.2068
2016-05-12,41.5002
2016-05-13,41.0946
2016-05-16,41.3341
2016-05-17,40.4198
2016-05-18,39.9496
2016-05-19,39.462
2016-05-20,40.1934
2016-05-23,40.385
2016-05-24,41.2644
2016-05-25,41.2644
2016-05-26,41.4125
2016-05-27,41.961
2016-05-31,42.3703
2016-06-01,42.5531
2016-06-02,42.4138
2016-06-03,42.4661
2016-06-06,42.022
2016-06-07,42.4051
2016-06-08,42.9885
2016-06-09,43.2236
2016-06-10,42.9275
2016-06-13,42.9972
2016-06-14,42.8231
2016-06-15,42.8231
2016-06-16,43.1278
2016-06-17,42.8492
2016-06-20,42.9885
2016-06-21,42.9972
2016-06-22,42.9972
2016-06-23,43.6503
2016-06-24,43.5197
2016-06-27,43.4848
2016-06-28,44.8345
2016-06-29,45.3395
2016-06-30,45.9751
2016-07-01,45.8619
2016-07-05,46.306
2016-07-06,46.3234
2016-07-07,45.7226
2016-07-08,46.3757
2016-07-11,46.7501
2016-07-12,46.7327
2016-07-13,46.7501
2016-07-14,46.4279
2016-07-15,46.2538
2016-07-18,46.4802
2016-07-19,46.7588
2016-07-20,47.0113
2016-07-21,47.1419
2016-07-22,47.2377
2016-07-25,47.229
2016-07-26,47.377
2016-07-27,47.0549
2016-07-28,47.9604
2016-07-29,48.5177
2016-08-01,48.5351
2016-08-02,48.1433
2016-08-03,48.1172
2016-08-04,47.8211
2016-08-05,47.5512
2016-08-08,47.5773
2016-08-09,47.4902
2016-08-10,47.528
2016-08-11,47.0585
2016-08-12,47.1287
2016-08-15,46.9093
2016-08-16,46.4353
2016-08-17,46.8215
2016-08-18,46.7074
2016-08-19,46.2949
2016-08-22,46.5143
2016-08-23,46.6986
2016-08-24,46.5407
2016-08-25,46.4529
2016-08-26,46.1808
2016-08-29,46.3915
2016-08-30,46.5231
2016-08-31,46.5494
2016-09-01,46.567
2016-09-02,46.9795
2016-09-06,47.1199
2016-09-07,47.3218
2016-09-08,46.7601
2016-09-09,44.8381
2016-09-12,45.3997
2016-09-13,44.4256
2016-09-14,44.5836
2016-09-15,44.6538
2016-09-16,44.5309
2016-09-19,44.803
2016-09-20,44.9258
2016-09-21,45.3032
2016-09-22,45.9878
2016-09-23,45.9527
2016-09-26,46.1808
2016-09-27,45.8473
2016-09-28,46.3125
2016-09-29,45.7245
2016-09-30,45.742
2016-10-03,44.7064
2016-10-04,44.1711
2016-10-05,42.8634
2016-10-06,43.232
2016-10-07,43.0477
2016-10-10,43.3022
2016-10-11,42.9248
2016-10-12,43.4075
2016-10-13,44.2501
2016-10-14,44.2501
2016-10-17,44.3905
2016-10-18,44.5221
2016-10-19,44.5046
2016-10-20,44.3641
2016-10-21,43.8288
2016-10-24,44.136
2016-10-25,43.6094
2016-10-26,43.3461
2016-10-27,42.8897
2016-10-28,42.8546
2016-10-31,43.5567
2016-11-01,42.3632
2016-11-02,41.5821
2016-11-03,41.2573
2016-11-04,41.4504
2016-11-07,42.3895
2016-11-08,42.5211
2016-11-09,42.0032
2016-11-10,40.6042
2016-11-11,41.4188
2016-11-14,41.9589
2016-11-15,42.198
2016-11-16,41.9678
2016-11-17,41.9058
2016-11-18,42.0917
2016-11-21,41.8792
2016-11-22,42.2511
2016-11-23,42.1448
2016-11-25,42.4016
2016-11-28,42.375
2016-11-29,43.0834
2016-11-30,42.5521
2016-12-01,42.136
2016-12-02,42.499
2016-12-05,42.5521
2016-12-06,42.6761
2016-12-07,43.6589
2016-12-08,43.8802
2016-12-09,43.7297
2016-12-12,44.1724
2016-12-13,44.4114
2016-12-14,43.4818
2016-12-15,43.2516
2016-12-16,44.137
2016-12-19,44.0927
2016-12-20,44.5354
2016-12-21,44.6239
2016-12-22,44.8219
2016-12-23,44.7049
2016-12-27,44.516
2016-12-28,44.363
2016-12-29,45.2807
2016-12-30,45.8925
2017-01-03,46.2074
2017-01-04,47.5479
2017-01-05,47.5749
2017-01-06,47.5029
2017-01-09,46.7832
2017-01-10,46.5133
2017-01-11,45.8565
2017-01-12,46.2434
2017-01-13,46.3693
2017-01-17,46.7202
2017-01-18,47.0711
2017-01-19,46.7382
2017-01-20,47.0801
2017-01-23,47.5839
2017-01-24,47.8538
2017-01-25,47.6559
2017-01-26,47.359
2017-01-27,46.5852
2017-01-30,46.3513
2017-01-31,46.2524
2017-02-01,44.9388
2017-02-02,45.1817
2017-02-03,45.0648
2017-02-06,45.0198
2017-02-07,44.9028
2017-02-08,44.7859
2017-02-09,44.8579
2017-02-10,45.1907
2017-02-13,45.1098
2017-02-14,45.0108
2017-02-15,45.2196
2017-02-16,46.5566
2017-02-17,46.7489
2017-02-21,47.28
2017-02-22,47.5547
2017-02-23,47.8844
2017-02-24,48.0309
2017-02-27,48.324
2017-02-28,48.0676
2017-03-01,47.7013
2017-03-02,47.6188
2017-03-03,47.4265
2017-03-06,47.0877
2017-03-07,46.8496
2017-03-08,45.9888
2017-03-09,45.0822
2017-03-10,44.7526
2017-03-13,44.9174
2017-03-14,44.8808
2017-03-15,45.5676
2017-03-16,45.3478
2017-03-17,45.5126
2017-03-20,45.5126
2017-03-21,45.2928
2017-03-22,45.2837
2017-03-23,45.4485
2017-03-24,45.3661
2017-03-27,44.8716
2017-03-28,44.8991
2017-03-29,44.9082
2017-03-30,44.9723
2017-03-31,44.9906
2017-04-03,45.4485
2017-04-04,46.0163
2017-04-05,46.1994
2017-04-06,46.4375
2017-04-07,46.639
2017-04-10,46.9137
2017-04-11,47.0328
2017-04-12,46.9046
2017-04-13,46.6482
2017-04-17,47.3075
2017-04-18,47.2525
2017-04-19,47.2434
2017-04-20,47.2709
2017-04-21,47.3166
2017-04-24,46.9229
2017-04-25,47.1335
2017-04-26,47.0969
2017-04-27,46.8496
2017-04-28,46.5932
2017-05-01,46.6756
2017-05-02,46.4742
2017-05-03,45.8057
2017-05-04,46.1445
2017-05-05,46.6115
2017-05-08,46.291
2017-05-09,45.9797
2017-05-10,46.2819
2017-05-11,46.1262
2017-05-12,45.7599
2017-05-15,46.1017
2017-05-16,46.037
2017-05-17,46.0001
2017-05-18,46.1571
2017-05-19,46.6468
2017-05-22,46.7577
2017-05-23,47.1457
2017-05-24,47.3674
2017-05-25,47.3212
2017-05-26,46.9332
2017-05-30,46.5914
2017-05-31,46.5636
2017-06-01,46.924
2017-06-02,47.2011
2017-06-05,47.2011
2017-06-06,46.7392
2017-06-07,46.7484
2017-06-08,46.462
2017-06-09,47.0533
2017-06-12,47.8756
2017-06-13,48.1712
2017-06-14,48.6424
2017-06-15,48.5962
2017-06-16,48.2451
2017-06-19,48.2266
2017-06-20,48.1065
2017-06-21,48.1989
2017-06-22,48.1158
2017-06-23,48.1804
2017-06-26,48.4114
2017-06-27,48.0511
2017-06-28,47.5984
2017-06-29,46.4251
2017-06-30,46.85
2017-07-03,47.7554
2017-07-05,46.8593
2017-07-06,46.2588
2017-07-07,46.2865
2017-07-10,45.5566
2017-07-11,45.4273
2017-07-12,46.1387
2017-07-13,45.9631
2017-07-14,46.3789
2017-07-17,46.6745
2017-07-18,46.3234
2017-07-19,46.9701
2017-07-20,46.6006
2017-07-21,46.3604
2017-07-24,46.3881
2017-07-25,46.3604
2017-07-26,47.4044
2017-07-27,47.0718
2017-07-28,47.312
2017-07-31,47.5984
2017-08-01,47.8756
2017-08-02,47.1642
2017-08-03,47.0441
2017-08-04,46.693
2017-08-07,46.656
2017-08-08,46.6098
2017-08-09,46.3419
2017-08-10,46.8359
2017-08-11,46.5842
2017-08-14,47.2553
2017-08-15,47.4231
2017-08-16,47.9544
2017-08-17,47.8705
2017-08-18,47.4417
2017-08-21,47.7586
2017-08-22,47.4697
2017-08-23,47.6934
2017-08-24,47.6654
2017-08-25,47.9637
2017-08-28,47.6654
2017-08-29,47.5443
2017-08-30,47.9264
2017-08-31,48.6814
2017-09-01,48.7653
2017-09-05,48.5136
2017-09-06,48.467
2017-09-07,48.5043
2017-09-08,48.2806
2017-09-11,48.7653
2017-09-12,48.2992
2017-09-13,48.262
2017-09-14,48.7932
2017-09-15,48.4856
2017-09-18,48.5416
2017-09-19,48.3552
2017-09-20,48.4577
2017-09-21,48.3458
2017-09-22,48.1687
2017-09-25,48.7746
2017-09-26,48.5509
2017-09-27,48.3738
2017-09-28,48.4577
2017-09-29,48.5509
2017-10-02,48.7466
2017-10-03,49.0915
2017-10-04,49.2313
2017-10-05,49.2313
2017-10-06,49.166
2017-10-09,49.2127
2017-10-10,49.1194
2017-10-11,49.2313
2017-10-12,49.1194
2017-10-13,48.9796
2017-10-16,49.0169
2017-10-17,49.2872
2017-10-18,49.194
2017-10-19,48.7653
2017-10-20,48.4297
2017-10-23,48.3924
2017-10-24,47.7959
2017-10-25,48.0849
2017-10-26,47.768
2017-10-27,47.8146
2017-10-30,47.5163
2017-10-31,47.5815
2017-11-01,47.5443
2017-11-02,47.5349
2017-11-03,47.7027
2017-11-06,47.8984
2017-11-07,47.9171
2017-11-08,48.4018
2017-11-09,48.1687
2017-11-10,48.2247
2017-11-13,48.6007
2017-11-14,48.7041
2017-11-15,48.1777
2017-11-16,48.7887
2017-11-17,48.3751
2017-11-20,48.0743
2017-11-21,48.4033
2017-11-22,48.1401
2017-11-24,48.1025
2017-11-27,47.9238
2017-11-28,47.5854
2017-11-29,47.6888
2017-11-30,47.7452
2017-12-01,47.6136
2017-12-04,47.9333
2017-12-05,47.4726
2017-12-06,47.6512
2017-12-07,48.0273
2017-12-08,48.4033
2017-12-11,48.4597
2017-12-12,48.6007
2017-12-13,48.5537
2017-12-14,48.5443
2017-12-15,48.6477
2017-12-18,49.1177
2017-12-19,48.1025
2017-12-20,47.482
2017-12-21,47.1718
2017-12-22,47.2564
2017-12-26,47.388
2017-12-27,47.905
2017-12-28,47.905
2017-12-29,47.858
2018-01-02,47.7358
2018-01-03,47.3598
2018-01-04,46.2788
2018-01-05,46.4574
2018-01-08,46.1754
2018-01-09,45.6959
2018-01-10,45.1977
2018-01-11,45.1883
2018-01-12,44.8029
2018-01-16,44.9345
2018-01-17,45.1601
2018-01-18,44.6431
2018-01-19,44.9721
2018-01-22,45.2729
2018-01-23,45.6301
2018-01-24,45.4797
2018-01-25,45.4515
2018-01-26,45.1225
2018-01-29,44.5491
2018-01-30,44.3705
2018-01-31,45.0097
2018-02-01,44.1824
2018-02-02,44.2953
2018-02-05,42.622
2018-02-06,42.1613
2018-02-07,41.7383
2018-02-08,40.2436
2018-02-09,41.0803
2018-02-12,40.5068
2018-02-13,40.5068
2018-02-14,40.2436
2018-02-15,40.7325
2018-02-16,41.5045
2018-02-20,41.343
2018-02-21,40.7823
2018-02-22,41.4095
2018-02-23,41.9701
2018-02-26,41.78
2018-02-27,40.8679
2018-02-28,40.8679
2018-03-01,40.8394
2018-03-02,40.8584
2018-03-05,41.1149
2018-03-06,41.3715
2018-03-07,41.8181
2018-03-08,41.8276
2018-03-09,42.2836
2018-03-12,42.2361
2018-03-13,41.5425
2018-03-14,41.571
2018-03-15,41.476
2018-03-16,41.799
2018-03-19,41.4855
2018-03-20,41.1909
2018-03-21,40.7443
2018-03-22,40.3833
2018-03-23,39.4331
2018-03-26,39.8607
2018-03-27,40.0032
2018-03-28,41.3049
2018-03-29,41.6375
2018-04-02,40.8108
2018-04-03,41.5805
2018-04-04,41.647
2018-04-05,41.666
2018-04-06,41.1909
2018-04-09,41.0104
2018-04-10,41.0484
2018-04-11,40.8679
2018-04-12,40.4308
2018-04-13,40.8108
2018-04-16,41.0484
2018-04-17,41.2669
2018-04-18,41.0009
2018-04-19,40.3167
2018-04-20,40.3357
2018-04-23,40.2597
2018-04-24,40.6208
2018-04-25,41.1054
2018-04-26,41.4475
2018-04-27,42.3787
2018-04-30,41.8276
2018-05-01,42.2741
2018-05-02,42.4832
2018-05-03,42.4262
2018-05-04,43.0533
2018-05-07,43.6899
2018-05-08,43.861
2018-05-09,44.0225
2018-05-10,44.3171
2018-05-11,44.2886
2018-05-14,43.6519
2018-05-15,42.5212
2018-05-16,42.6637
2018-05-17,42.4357
2018-05-18,42.4933
2018-05-21,43.1654
2018-05-22,44.0103
2018-05-23,44.5191
2018-05-24,44.6631
2018-05-25,44.7015
2018-05-29,44.8839
2018-05-30,45.6136
2018-05-31,45.9208
2018-06-01,46.4873
2018-06-04,47.0249
2018-06-05,46.7081
2018-06-06,46.8713
2018-06-07,46.8713
2018-06-08,47.0057
2018-06-11,46.8521
2018-06-12,47.0249
2018-06-13,46.1896
2018-06-14,46.4105
2018-06-15,46.5641
2018-06-18,46.7177
2018-06-19,46.7177
2018-06-20,47.697
2018-06-21,47.9082
2018-06-22,48.3882
2018-06-25,48.1194
2018-06-26,48.3594
2018-06-27,47.8506
2018-06-28,48.3978
2018-06-29,48.7051
2018-07-02,48.5515
2018-07-03,49.0507
2018-07-05,49.5595
2018-07-06,49.646
2018-07-09,49.2139
2018-07-10,49.2331
2018-07-11,49.0411
2018-07-12,49.0795
2018-07-13,48.7435
2018-07-16,48.5035
2018-07-17,48.033
2018-07-18,47.8218
2018-07-19,48.3882
2018-07-20,47.505
2018-07-23,47.7066
2018-07-24,47.601
2018-07-25,47.3994
2018-07-26,47.2457
2018-07-27,46.4969
2018-07-30,46.3721
2018-07-31,47.1497
2018-08-01,47.6874
2018-08-02,47.601
2018-08-03,48.1674
2018-08-06,48.2634
2018-08-07,48.1866
2018-08-08,47.8986
2018-08-09,48.0234
2018-08-10,47.8805
2018-08-13,47.3475
2018-08-14,47.7836
2018-08-15,48.2487
2018-08-16,48.4716
2018-08-17,48.8301
2018-08-20,48.7138
2018-08-21,48.2487
2018-08-22,48.1033
2018-08-23,47.8223
2018-08-24,47.9386
2018-08-27,47.6576
2018-08-28,48.0646
2018-08-29,47.7642
2018-08-30,47.9192
2018-08-31,48.2002
2018-09-04,47.0083
2018-09-05,47.3475
2018-09-06,47.3862
2018-09-07,47.0665
2018-09-10,47.27
2018-09-11,47.3378
2018-09-12,47.0277
2018-09-13,46.611
2018-09-14,46.5141
2018-09-17,47.0858
2018-09-18,46.5723
2018-09-19,46.0005
2018-09-20,46.5335
2018-09-21,46.5238
2018-09-24,45.6032
2018-09-25,45.5548
2018-09-26,44.6729
2018-09-27,44.983
2018-09-28,45.797
2018-10-01,45.4869
2018-10-02,45.5063
2018-10-03,45.0605
2018-10-04,44.702
2018-10-05,44.6535
2018-10-08,45.2737
2018-10-09,45.3222
2018-10-10,44.857
2018-10-11,43.1225
2018-10-12,42.9286
2018-10-15,43.2969
2018-10-16,43.9849
2018-10-17,43.6748
2018-10-18,43.5391
2018-10-19,43.6554
2018-10-22,43.1515
2018-10-23,43.0934
2018-10-24,42.7833
2018-10-25,43.4229
2018-10-26,42.1825
2018-10-29,41.8724
2018-10-30,41.853
2018-10-31,41.32
2018-11-01,41.9499
2018-11-02,41.7949
2018-11-05,42.3472
2018-11-06,42.5701
2018-11-07,43.0449
2018-11-08,43.3118
2018-11-09,42.9788
2018-11-12,42.8026
2018-11-13,43.4293
2018-11-14,43.4391
2018-11-15,43.0572
2018-11-16,43.2432
2018-11-19,42.8026
2018-11-20,42.313
2018-11-21,42.3717
2018-11-23,42.499
2018-11-26,42.4794
2018-11-27,41.9115
2018-11-28,42.313
2018-11-29,42.1269
2018-11-30,42.4696
2018-12-03,42.6753
2018-12-04,41.8331
2018-12-06,42.5186
2018-12-07,42.45
2018-12-10,41.6471
2018-12-11,41.4414
2018-12-12,40.472
2018-12-13,40.5112
2018-12-14,40.423
2018-12-17,39.0815
2018-12-18,39.3948
2018-12-19,39.1108
2018-12-20,38.5723
2018-12-21,38.4743
2018-12-24,36.5256
2018-12-26,37.7595
2018-12-27,37.6518
2018-12-28,37.6909
2018-12-31,37.8868
2019-01-02,37.1719
2019-01-03,37.926
2019-01-04,39.0619
2019-01-07,39.5613
2019-01-08,40.5503
2019-01-09,40.7658
2019-01-10,41.1966
2019-01-11,41.275
2019-01-14,40.6874
2019-01-15,40.8441
2019-01-16,41.3239
2019-01-17,41.4023
2019-01-18,41.8723
2019-01-22,41.8331
2019-01-23,42.1759
2019-01-24,42.3032
2019-01-25,42.8711
2019-01-28,43.1061
2019-01-29,43.3705
2019-01-30,43.2628
2019-01-31,43.3999
2019-02-01,43.1943
2019-02-04,44.0854
2019-02-05,44.4967
2019-02-06,44.624
2019-02-07,45.5249
2019-02-08,45.5151
2019-02-11,45.8774
2019-02-12,45.3976
2019-02-13,45.4074
2019-02-14,45.8088
2019-02-15,46.3777
2019-02-19,46.6844
2019-02-20,45.8039
2019-02-21,46.0215
2019-02-22,46.2886
2019-02-25,45.982
2019-02-26,45.8138
2019-02-27,45.5764
2019-02-28,45.8138
2019-03-01,45.7149
2019-03-04,45.1312
2019-03-05,45.1114
2019-03-06,44.5178
2019-03-07,44.0924
2019-03-08,44.2507
2019-03-11,44.7256
2019-03-12,44.9333
2019-03-13,45.0125
2019-03-14,45.4379
2019-03-15,45.1708
2019-03-18,44.8047
2019-03-19,44.7454
2019-03-20,45.3093
2019-03-21,45.9919
2019-03-22,45.5665
2019-03-25,44.7355
2019-03-26,45.3191
2019-03-27,45.5764
2019-03-28,46.2392
2019-03-29,46.2788
2019-04-01,46.1798
2019-04-02,46.0413
2019-04-03,46.2985
2019-04-04,46.3282
2019-04-05,46.3777
2019-04-08,45.8929
2019-04-09,45.2301
2019-04-10,45.6456
2019-04-11,45.8633
2019-04-12,45.9424
2019-04-15,45.5071
2019-04-16,44.2804
2019-04-17,44.1023
2019-04-18,44.5079
2019-04-22,43.667
2019-04-23,44.409
2019-04-24,43.7363
2019-04-25,43.6967
2019-04-26,44.1221
2019-04-29,43.6967
2019-04-30,44.1023
2019-05-01,44.3496
2019-05-02,44.0628
2019-05-03,44.597
2019-05-06,44.597
2019-05-07,43.9836
2019-05-08,43.6868
2019-05-09,43.855
2019-05-10,44.12
2019-05-13,43.8
2019-05-14,44.03
2019-05-15,44.33
2019-05-16,44.68
2019-05-17,44.29
2019-05-20,43.23
2019-05-21,43.86
2019-05-22,43.98
2019-05-23,43.81
2019-05-24,44.26
2019-05-28,43.75
2019-05-29,43.4
2019-05-30,43.61
2019-05-31,43.86
2019-06-03,43.49
2019-06-04,43.53
2019-06-05,44.42
2019-06-06,44.6
2019-06-07,44.55
2019-06-10,43.98
2019-06-11,43.84
2019-06-12,43.96
2019-06-13,44.385
2019-06-14,44.48
2019-06-17,44.41
2019-06-18,43.86
2019-06-19,44.205
2019-06-20,44.29
2019-06-21,43.41
2019-06-24,43.01
2019-06-25,42.78
2019-06-26,40.905
2019-06-27,41.265
2019-06-28,41.375
2019-07-01,42.27
2019-07-02,42.905
2019-07-03,42.97
2019-07-04,42.97
2019-07-05,42.98
2019-07-08,43.285
2019-07-09,43.78
2019-07-10,44.05
2019-07-11,43.76
2019-07-12,43.85
2019-07-15,43.3
2019-07-16,42.74
2019-07-17,42.89
2019-07-18,43.45
2019-07-19,42.58
2019-07-22,42.29
2019-07-23,42.96
2019-07-24,44.37
2019-07-25,44.41
2019-07-26,45.09
2019-07-29,44.79
2019-07-30,44.78
2019-07-31,45.33
2019-08-01,44.365
2019-08-02,44.89
2019-08-05,43.54
2019-08-06,43.86
2019-08-07,44.29
2019-08-08,44.92
2019-08-09,44.03
2019-08-12,44.1
2019-08-13,43.855
2019-08-14,43.16
2019-08-15,43.13
2019-08-16,43.615
2019-08-19,44.18
2019-08-20,43.73
2019-08-21,43.91
2019-08-22,43.85
2019-08-23,42.71
2019-08-26,42.71
2019-08-27,42.28
2019-08-28,42.02
2019-08-29,42.985
2019-08-30,43.195
2019-09-02,43.2
2019-09-03,43.165
2019-09-04,43.735
2019-09-05,43.5
2019-09-06,43.56
2019-09-09,43.575
2019-09-10,44.26
2019-09-11,44.735
2019-09-12,44.965
2019-09-13,44.445
2019-09-16,44.995
2019-09-17,44.965
2019-09-18,45.06
2019-09-19,45.145
2019-09-20,45.01
2019-09-23,44.95
2019-09-24,44.08
2019-09-25,44.53
2019-09-26,44.95
2019-09-27,44.94
2019-09-30,44.91
2019-10-01,44.45
2019-10-02,43.93
2019-10-03,44.43
2019-10-04,44.525
2019-10-07,44.29
2019-10-08,43.645
2019-10-09,43.64
2019-10-10,43.18
2019-10-11,43.6
2019-10-14,43.125
2019-10-15,43.39
2019-10-16,43.82
2019-10-17,44.185
2019-10-18,44.095
2019-10-21,44.255
2019-10-22,44.24
2019-10-23,44.48
2019-10-24,45.75
2019-10-25,45.665
2019-10-28,45.62
2019-10-29,46.045
2019-10-30,46.905
2019-10-31,46.75
2019-11-01,47.2
2019-11-04,47.045
2019-11-05,46.53
2019-11-06,46.54
2019-11-07,46.06
2019-11-08,46.415
2019-11-11,46.235
2019-11-12,45.69
2019-11-13,46.04
2019-11-14,46.485
2019-11-15,46.755
2019-11-18,47.465
2019-11-19,47.855
2019-11-20,47.64
2019-11-21,46.51
2019-11-22,46.725
2019-11-25,47.455
