date,close
2014-06-13,58.4342
2014-06-16,58.5043
2014-06-17,58.2062
2014-06-18,58.3728
2014-06-19,60.2052
2014-06-20,59.1268
2014-06-23,59.1531
2014-06-24,58.8901
2014-06-25,59.2846
2014-06-26,58.9339
2014-06-27,59.0216
2014-06-30,42.5741
2014-07-01,42.2585
2014-07-02,43.5999
2014-07-03,43.4596
2014-07-07,42.7582
2014-07-08,42.3637
2014-07-09,42.3987
2014-07-10,41.7061
2014-07-11,39.245
2014-07-14,41.9516
2014-07-15,41.6798
2014-07-16,41.9954
2014-07-17,41.8902
2014-07-18,42.276
2014-07-21,42.6881
2014-07-22,43.0037
2014-07-23,43.0212
2014-07-24,42.653
2014-07-25,42.3023
2014-07-28,41.9516
2014-07-29,41.2152
2014-07-30,40.768
2014-07-31,38.8392
2014-08-01,39.0233
2014-08-04,39.7072
2014-08-05,39.5757
2014-08-06,39.7247
2014-08-07,39.4091
2014-08-08,40.2157
2014-08-11,39.8825
2014-08-12,39.8475
2014-08-13,40.5576
2014-08-14,40.3998
2014-08-15,40.2235
2014-08-18,40.673
2014-08-19,40.5496
2014-08-20,40.5673
2014-08-21,40.2499
2014-08-22,40.2411
2014-08-25,40.1618
2014-08-26,40.1706
2014-08-27,40.0472
2014-08-28,39.9943
2014-08-29,39.9238
2014-09-02,39.8885
2014-09-03,39.6857
2014-09-04,39.7651
2014-09-05,39.6681
2014-09-08,39.5359
2014-09-09,39.3243
2014-09-10,39.3155
2014-09-11,39.8268
2014-09-12,39.8268
2014-09-15,39.4654
2014-09-16,39.245
2014-09-17,39.2714
2014-09-18,39.9326
2014-09-19,39.5623
2014-09-22,38.8571
2014-09-23,38.4164
2014-09-24,38.2136
2014-09-25,37.8169
2014-09-26,38.1167
2014-09-29,37.8786
2014-09-30,37.3674
2014-10-01,36.7327
2014-10-02,36.3713
2014-10-03,36.3977
2014-10-06,36.5916
2014-10-07,35.5603
2014-10-08,35.8423
2014-10-09,34.7845
2014-10-10,33.9383
2014-10-13,33.7003
2014-10-14,34.1498
2014-10-15,34.2556
2014-10-16,34.3085
2014-10-17,34.8286
2014-10-20,35.0049
2014-10-21,36.1685
2014-10-22,35.4192
2014-10-23,36.5123
2014-10-24,36.6445
2014-10-27,36.4947
2014-10-28,36.8914
2014-10-29,36.7327
2014-10-30,37.6759
2014-10-31,37.8963
2014-11-03,38.0902
2014-11-04,37.6759
2014-11-05,38.2224
2014-11-06,38.4428
2014-11-07,38.3458
2014-11-10,38.3018
2014-11-11,38.3458
2014-11-12,38.1519
2014-11-13,37.6759
2014-11-14,37.7905
2014-11-17,38.0549
2014-11-18,38.3811
2014-11-19,37.4203
2014-11-20,37.8548
2014-11-21,38.5021
2014-11-24,38.2893
2014-11-25,39.0696
2014-11-26,38.5553
2014-11-28,37.9434
2014-12-01,37.3404
2014-12-02,37.8725
2014-12-03,38.3158
2014-12-04,37.8281
2014-12-05,38.307
2014-12-08,37.6153
2014-12-09,38.2006
2014-12-10,36.6311
2014-12-11,37.0212
2014-12-12,36.0369
2014-12-15,36.0547
2014-12-16,35.966
2014-12-17,36.6044
2014-12-18,37.7661
2014-12-19,38.3336
2014-12-22,38.5375
2014-12-23,38.7504
2014-12-24,38.6617
2014-12-26,38.8656
2014-12-29,39.0518
2014-12-30,38.5907
2014-12-31,37.8459
2015-01-02,37.8902
2015-01-05,36.7375
2015-01-06,35.9749
2015-01-07,36.2143
2015-01-08,36.7818
2015-01-09,36.4892
2015-01-12,36.5335
2015-01-13,36.4271
2015-01-14,36.1611
2015-01-15,35.9039
2015-01-16,36.0813
2015-01-20,35.7887
2015-01-21,36.5601
2015-01-22,37.2695
2015-01-23,36.9769
2015-01-26,37.4646
2015-01-27,36.4537
2015-01-28,35.9394
2015-01-29,34.1216
2015-01-30,33.7048
2015-02-02,34.9374
2015-02-03,35.8685
2015-02-04,35.2832
2015-02-05,35.5758
2015-02-06,35.8419
2015-02-09,35.9571
2015-02-10,36.1611
2015-02-11,36.7463
2015-02-12,37.305
2015-02-13,37.7129
2015-02-17,37.7217
2015-02-18,37.4912
2015-02-19,37.625
2015-02-20,37.848
2015-02-23,37.5982
2015-02-24,37.9461
2015-02-25,37.9194
2015-02-26,37.9372
2015-02-27,37.8926
2015-03-02,38.8024
2015-03-03,38.3297
2015-03-04,37.955
2015-03-05,38.0888
2015-03-06,37.7766
2015-03-09,38.0175
2015-03-10,37.6339
2015-03-11,37.3663
2015-03-12,37.6339
2015-03-13,37.2503
2015-03-16,37.3039
2015-03-17,36.6616
2015-03-18,37.1165
2015-03-19,36.6705
2015-03-20,37.1968
2015-03-23,37.0898
2015-03-24,36.8757
2015-03-25,36.7062
2015-03-26,36.617
2015-03-27,36.394
2015-03-30,37.5179
2015-03-31,37.5893
2015-04-01,37.5269
2015-04-02,37.7588
2015-04-06,38.2494
2015-04-07,37.5893
2015-04-08,37.2057
2015-04-09,37.0719
2015-04-10,37.2503
2015-04-13,37.1165
2015-04-14,37.0809
2015-04-15,37.509
2015-04-16,37.2682
2015-04-17,36.0194
2015-04-20,36.2156
2015-04-21,35.7518
2015-04-22,35.9302
2015-04-23,36.0105
2015-04-24,35.832
2015-04-27,36.1621
2015-04-28,36.4743
2015-04-29,36.5011
2015-04-30,35.0471
2015-05-01,35.1095
2015-05-04,35.4931
2015-05-05,35.0203
2015-05-06,35.3414
2015-05-07,35.1541
2015-05-08,35.5198
2015-05-11,36.0194
2015-05-12,35.8677
2015-05-13,36.1175
2015-05-14,36.6023
2015-05-15,36.4586
2015-05-18,36.6831
2015-05-19,36.4048
2015-05-20,36.4317
2015-05-21,36.4676
2015-05-22,36.4227
2015-05-26,36.0636
2015-05-27,36.3958
2015-05-28,35.8481
2015-05-29,35.103
2015-06-01,35.2825
2015-06-02,35.5519
2015-06-03,35.5609
2015-06-04,35.0581
2015-06-05,35.103
2015-06-08,34.9234
2015-06-09,34.8516
2015-06-10,35.2556
2015-06-11,35.1928
2015-06-12,34.9504
2015-06-15,34.699
2015-06-16,34.5464
2015-06-17,34.5913
2015-06-18,34.4297
2015-06-19,33.9179
2015-06-22,34.0885
2015-06-23,33.8371
2015-06-24,33.6666
2015-06-25,33.1997
2015-06-26,33.496
2015-06-29,32.5892
2015-06-30,32.8316
2015-07-01,32.9034
2015-07-02,32.5354
2015-07-06,32.0057
2015-07-07,32.3019
2015-07-08,31.7453
2015-07-09,31.1887
2015-07-10,31.2695
2015-07-13,31.7274
2015-07-14,31.7453
2015-07-15,31.1977
2015-07-16,31.2695
2015-07-17,30.8116
2015-07-20,30.6411
2015-07-21,30.4076
2015-07-22,29.8241
2015-07-23,29.3213
2015-07-24,28.6211
2015-07-27,28.3158
2015-07-28,28.7108
2015-07-29,29.6715
2015-07-30,30.0665
2015-07-31,29.9677
2015-08-03,29.2854
2015-08-04,29.3931
2015-08-05,29.5817
2015-08-06,29.5817
2015-08-07,29.3662
2015-08-10,30.1742
2015-08-11,29.4291
2015-08-12,29.5817
2015-08-13,29.4201
2015-08-14,29.5907
2015-08-17,29.8151
2015-08-18,29.5907
2015-08-19,29.4291
2015-08-20,28.9494
2015-08-21,28.2526
2015-08-24,27.1214
2015-08-25,26.6056
2015-08-26,27.1214
2015-08-27,27.8364
2015-08-28,28.3703
2015-08-31,28.7323
2015-09-01,27.5468
2015-09-02,27.7821
2015-09-03,27.9449
2015-09-04,27.4382
2015-09-08,28.1078
2015-09-09,27.6101
2015-09-10,27.4744
2015-09-11,27.5015
2015-09-14,26.3975
2015-09-15,26.9223
2015-09-16,27.2119
2015-09-17,27.049
2015-09-18,26.2617
2015-09-21,26.1622
2015-09-22,25.7731
2015-09-23,25.4292
2015-09-24,24.7143
2015-09-25,24.5242
2015-09-28,23.9451
2015-09-29,24.3613
2015-09-30,24.8772
2015-10-01,24.85
2015-10-02,25.5378
2015-10-05,26.7142
2015-10-06,26.9404
2015-10-07,27.0038
2015-10-08,28.0535
2015-10-09,28.0445
2015-10-12,27.5015
2015-10-13,27.04
2015-10-14,27.0581
2015-10-15,27.4472
2015-10-16,25.8726
2015-10-19,25.9631
2015-10-20,25.9631
2015-10-21,25.8545
2015-10-22,26.5061
2015-10-23,26.8952
2015-10-26,26.7233
2015-10-27,26.0445
2015-10-28,27.6916
2015-10-29,28.1078
2015-10-30,28.5965
2015-11-02,29.2119
2015-11-03,29.3295
2015-11-04,29.1847
2015-11-05,29.2933
2015-11-06,29.1938
2015-11-09,28.5513
2015-11-10,28.868
2015-11-11,28.5241
2015-11-12,27.3658
2015-11-13,27.6192
2015-11-16,28.2345
2015-11-17,27.8092
2015-11-18,28.3069
2015-11-19,28.4803
2015-11-20,28.9731
2015-11-23,28.8271
2015-11-24,29.3472
2015-11-25,29.2377
2015-11-27,29.3472
2015-11-30,29.4202
2015-12-01,29.2742
2015-12-02,28.7084
2015-12-03,28.5898
2015-12-04,28.5898
2015-12-07,28.1792
2015-12-08,27.0568
2015-12-09,27.1024
2015-12-10,26.9107
2015-12-11,26.272
2015-12-14,25.9982
2015-12-15,25.5054
2015-12-16,25.5784
2015-12-17,24.8758
2015-12-18,24.7115
2015-12-21,24.9762
2015-12-22,25.4598
2015-12-23,26.3176
2015-12-24,26.4454
2015-12-28,25.9617
2015-12-29,26.1077
2015-12-30,26.1533
2015-12-31,26.0895
2016-01-04,25.8522
2016-01-05,25.3868
2016-01-06,25.0583
2016-01-07,24.3648
2016-01-08,23.4887
2016-01-11,23.1055
2016-01-12,23.2697
2016-01-13,22.6218
2016-01-14,22.6218
2016-01-15,22.3754
2016-01-19,21.4446
2016-01-20,21.3625
2016-01-21,21.4903
2016-01-22,22.1382
2016-01-25,21.5815
2016-01-26,22.8226
2016-01-27,22.9503
2016-01-28,23.1876
2016-01-29,24.2279
2016-02-01,23.8629
2016-02-02,23.2788
2016-02-03,25.5693
2016-02-04,26.7556
2016-02-05,26.9381
2016-02-08,26.5457
2016-02-09,26.4636
2016-02-10,25.7427
2016-02-11,25.6423
2016-02-12,27.2758
2016-02-16,27.7047
2016-02-17,28.024
2016-02-18,28.1153
2016-02-19,27.738
2016-02-22,28.2441
2016-02-23,27.2962
2016-02-24,27.6828
2016-02-25,27.3975
2016-02-26,27.4435
2016-02-29,27.4527
2016-03-01,28.4282
2016-03-02,28.373
2016-03-03,28.419
2016-03-04,29.0816
2016-03-07,29.505
2016-03-08,28.2073
2016-03-09,28.0233
2016-03-10,28.0141
2016-03-11,28.8239
2016-03-14,28.7227
2016-03-15,28.0693
2016-03-16,28.8792
2016-03-17,30.37
2016-03-18,30.775
2016-03-21,30.5817
2016-03-22,30.7382
2016-03-23,30.0019
2016-03-24,30.1492
2016-03-28,29.6982
2016-03-29,30.2504
2016-03-30,30.6553
2016-03-31,30.821
2016-04-01,30.9866
2016-04-04,30.867
2016-04-05,30.6369
2016-04-06,30.6922
2016-04-07,29.9927
2016-04-08,30.4989
2016-04-11,30.8486
2016-04-12,31.1891
2016-04-13,31.9898
2016-04-14,31.8701
2016-04-15,32.1646
2016-04-18,31.9254
2016-04-19,32.6616
2016-04-20,32.634
2016-04-21,32.8641
2016-04-22,33.6739
2016-04-25,33.0665
2016-04-26,33.5911
2016-04-27,32.9469
2016-04-28,33.0757
2016-04-29,32.7904
2016-05-02,32.9561
2016-05-03,31.6769
2016-05-04,30.8394
2016-05-05,30.7658
2016-05-06,30.913
2016-05-09,29.9835
2016-05-10,31.0235
2016-05-11,31.0603
2016-05-12,30.8026
2016-05-13,30.278
2016-05-16,30.7566
2016-05-17,30.8762
2016-05-18,30.5145
2016-05-19,30.0415
2016-05-20,30.2084
2016-05-23,30.3105
2016-05-24,30.8113
2016-05-25,31.5718
2016-05-26,31.2379
2016-05-27,31.0153
2016-05-31,30.8391
2016-06-01,30.8484
2016-06-02,31.3492
2016-06-03,31.1266
2016-06-06,31.4791
2016-06-07,31.7852
2016-06-08,31.8872
2016-06-09,31.6182
2016-06-10,31.0153
2016-06-13,30.5238
2016-06-14,30.1621
2016-06-15,30.0879
2016-06-16,30.1342
2016-06-17,30.5331
2016-06-20,30.9411
2016-06-21,30.2919
2016-06-22,30.2641
2016-06-23,31.0339
2016-06-24,28.2329
2016-06-27,26.8695
2016-06-28,27.4352
2016-06-29,27.5651
2016-06-30,28.4369
2016-07-01,28.6595
2016-07-05,27.8433
2016-07-06,27.9268
2016-07-07,27.8248
2016-07-08,28.474
2016-07-11,29.012
2016-07-12,29.5128
2016-07-13,29.2438
2016-07-14,29.2346
2016-07-15,29.4293
2016-07-18,29.4015
2016-07-19,29.2438
2016-07-20,29.3088
2016-07-21,28.641
2016-07-22,28.8079
2016-07-25,28.8728
2016-07-26,29.6705
2016-07-27,30.06
2016-07-28,30.9319
2016-07-29,31.0246
2016-08-01,31.173
2016-08-02,30.9226
2016-08-03,30.9968
2016-08-04,30.9411
2016-08-05,31.544
2016-08-08,31.6831
2016-08-09,31.4234
2016-08-10,31.2843
2016-08-11,31.6675
2016-08-12,31.331
2016-08-15,31.518
2016-08-16,31.3497
2016-08-17,31.4339
2016-08-18,31.4058
2016-08-19,31.518
2016-08-22,31.4432
2016-08-23,32.0601
2016-08-24,31.8451
2016-08-25,31.9666
2016-08-26,31.9199
2016-08-29,32.1349
2016-08-30,32.1349
2016-08-31,31.6582
2016-09-01,31.4993
2016-09-02,31.733
2016-09-06,31.3217
2016-09-07,31.6021
2016-09-08,31.4806
2016-09-09,30.6113
2016-09-12,31.1908
2016-09-13,30.2375
2016-09-14,29.7888
2016-09-15,30.4057
2016-09-16,30.0692
2016-09-19,30.3216
2016-09-20,30.1159
2016-09-21,30.7796
2016-09-22,31.4713
2016-09-23,31.088
2016-09-26,31.4245
2016-09-27,31.6021
2016-09-28,32.4246
2016-09-29,32.3031
2016-09-30,32.8453
2016-10-03,32.6022
2016-10-04,32.3031
2016-10-05,33.0976
2016-10-06,33.5276
2016-10-07,32.6677
2016-10-10,32.6116
2016-10-11,32.2377
2016-10-12,32.4433
2016-10-13,32.0227
2016-10-14,32.1723
2016-10-17,32.2657
2016-10-18,32.3873
2016-10-19,32.3312
2016-10-20,31.976
2016-10-21,32.2097
2016-10-24,32.1536
2016-10-25,32.3312
2016-10-26,32.6677
2016-10-27,31.0319
2016-10-28,30.8263
2016-10-31,30.8917
2016-11-01,30.4711
2016-11-02,29.957
2016-11-03,29.9103
2016-11-04,30.1907
2016-11-07,31.546
2016-11-08,31.733
2016-11-09,34.3501
2016-11-10,35.9391
2016-11-11,35.8924
2016-11-14,36.5934
2016-11-15,37.0607
2016-11-16,36.126
2016-11-17,36.0793
2016-11-18,35.9946
2016-11-21,36.324
2016-11-22,37.3121
2016-11-23,37.218
2016-11-25,37.265
2016-11-28,36.8886
2016-11-29,36.371
2016-11-30,36.7475
2016-12-01,36.7945
2016-12-02,37.1239
2016-12-05,36.8416
2016-12-06,36.7945
2016-12-07,37.5944
2016-12-08,37.8296
2016-12-09,36.9827
2016-12-12,37.5003
2016-12-13,37.7826
2016-12-14,37.0768
2016-12-15,37.1709
2016-12-16,37.3121
2016-12-19,37.7355
2016-12-20,38.5354
2016-12-21,38.3472
2016-12-22,38.159
2016-12-23,38.2531
2016-12-27,38.2531
2016-12-28,37.5944
2016-12-29,37.5944
2016-12-30,37.3591
2017-01-03,38.5354
2017-01-04,39.0059
2017-01-05,39.053
2017-01-06,39.6647
2017-01-09,39.1471
2017-01-10,39.8529
2017-01-11,40.7939
2017-01-12,40.3234
2017-01-13,41.5938
2017-01-17,41.2174
2017-01-18,41.2644
2017-01-19,40.7939
2017-01-20,40.4175
2017-01-23,40.0411
2017-01-24,41.5467
2017-01-25,42.0643
2017-01-26,41.3585
2017-01-27,42.723
2017-01-30,42.1114
2017-01-31,41.782
2017-02-01,42.1114
2017-02-02,41.5938
2017-02-03,41.9702
2017-02-06,42.1114
2017-02-07,41.8761
2017-02-08,41.4056
2017-02-09,41.6879
2017-02-10,42.4878
2017-02-13,42.8642
2017-02-14,42.676
2017-02-15,42.2996
2017-02-16,41.9231
2017-02-17,42.1219
2017-02-21,42.3586
2017-02-22,41.7906
2017-02-23,40.7494
2017-02-24,40.7494
2017-02-27,42.2166
2017-02-28,41.838
2017-03-01,43.0685
2017-03-02,42.0746
2017-03-03,42.5952
2017-03-06,43.1158
2017-03-07,42.3586
2017-03-08,42.0273
2017-03-09,41.0334
2017-03-10,42.1692
2017-03-13,42.4532
2017-03-14,41.838
2017-03-15,43.2105
2017-03-16,43.1158
2017-03-17,42.5479
2017-03-20,42.6425
2017-03-21,40.8441
2017-03-22,41.6486
2017-03-23,41.7906
2017-03-24,41.2227
2017-03-27,40.6074
2017-03-28,41.3647
2017-03-29,41.6486
2017-03-30,42.7372
2017-03-31,42.7845
2017-04-03,41.9799
2017-04-04,41.7906
2017-04-05,41.0334
2017-04-06,41.3173
2017-04-07,41.0807
2017-04-10,41.554
2017-04-11,41.838
2017-04-12,40.8914
2017-04-13,40.3235
2017-04-17,40.8914
2017-04-18,41.27
2017-04-19,41.412
2017-04-20,42.0746
2017-04-21,42.5005
2017-04-24,43.6364
2017-04-25,45.6242
2017-04-26,46.8547
2017-04-27,46.1448
2017-04-28,45.6715
2017-05-01,45.5295
2017-05-02,45.3402
2017-05-03,45.1509
2017-05-04,44.6776
2017-05-05,45.3876
2017-05-08,45.1509
2017-05-09,45.1509
2017-05-10,45.4822
2017-05-11,45.6242
2017-05-12,45.4822
2017-05-15,46.2395
2017-05-16,46.6181
2017-05-17,44.8287
2017-05-18,44.2577
2017-05-19,43.7342
2017-05-22,43.2583
2017-05-23,43.7342
2017-05-24,43.9721
2017-05-25,43.2107
2017-05-26,43.877
2017-05-30,44.1625
2017-05-31,43.9245
2017-06-01,44.8763
2017-06-02,44.2101
2017-06-05,43.5914
2017-06-06,43.0679
2017-06-07,42.0686
2017-06-08,43.6866
2017-06-09,44.0197
2017-06-12,44.3053
2017-06-13,44.2101
2017-06-14,43.1155
2017-06-15,43.5914
2017-06-16,43.3535
2017-06-19,44.3528
2017-06-20,43.877
2017-06-21,42.2113
2017-06-22,42.6872
2017-06-23,42.3541
2017-06-26,42.3541
2017-06-27,41.4975
2017-06-28,43.2107
2017-06-29,43.2107
2017-06-30,44.0197
2017-07-03,44.0673
2017-07-05,43.877
2017-07-06,43.639
2017-07-07,44.1625
2017-07-10,44.686
2017-07-11,45.257
2017-07-12,46.2088
2017-07-13,46.6371
2017-07-14,46.3992
2017-07-17,46.6371
2017-07-18,46.4943
2017-07-19,47.113
2017-07-20,47.3034
2017-07-21,46.3516
2017-07-24,46.3992
2017-07-25,46.9702
2017-07-26,43.5914
2017-07-27,43.9245
2017-07-28,43.2583
2017-07-31,43.3059
2017-08-01,42.83
2017-08-02,42.7348
2017-08-03,42.1638
2017-08-04,42.5445
2017-08-07,42.5445
2017-08-08,42.83
2017-08-09,42.3065
2017-08-10,41.4975
2017-08-11,41.5451
2017-08-14,42.2589
2017-08-15,41.4023
2017-08-16,41.5451
2017-08-17,41.212
2017-08-18,40.9917
2017-08-21,41.3269
2017-08-22,42.7157
2017-08-23,42.1889
2017-08-24,41.9016
2017-08-25,41.9973
2017-08-28,42.3326
2017-08-29,42.3326
2017-08-30,43.1945
2017-08-31,42.9551
2017-09-01,43.2424
2017-09-05,42.5241
2017-09-06,42.7635
2017-09-07,42.141
2017-09-08,42.141
2017-09-11,43.1466
2017-09-12,43.865
2017-09-13,44.0086
2017-09-14,44.3438
2017-09-15,44.8706
2017-09-18,45.7805
2017-09-19,46.1157
2017-09-20,46.4509
2017-09-21,46.5467
2017-09-22,47.0255
2017-09-25,46.9776
2017-09-26,45.8283
2017-09-27,46.3072
2017-09-28,46.6903
2017-09-29,46.4988
2017-10-02,46.4988
2017-10-03,46.6903
2017-10-04,46.6903
2017-10-05,46.7382
2017-10-06,47.265
2017-10-09,47.8875
2017-10-10,47.7917
2017-10-11,47.6481
2017-10-12,48.0312
2017-10-13,48.2706
2017-10-16,47.7438
2017-10-17,47.4565
2017-10-18,47.9833
2017-10-19,48.2706
2017-10-20,48.8453
2017-10-23,48.4143
2017-10-24,49.372
2017-10-25,47.0255
2017-10-26,46.6903
2017-10-27,45.8762
2017-10-30,45.0143
2017-10-31,45.1579
2017-11-01,44.5833
2017-11-02,44.7269
2017-11-03,44.679
2017-11-06,45.1579
2017-11-07,44.9185
2017-11-08,44.4875
2017-11-09,44.2481
2017-11-10,44.679
2017-11-13,44.7748
2017-11-14,43.6255
2017-11-15,42.9551
2017-11-16,44.2752
2017-11-17,44.3233
2017-11-20,44.8533
2017-11-21,45.6241
2017-11-22,45.2869
2017-11-24,45.2869
2017-11-27,45.7205
2017-11-28,47.0695
2017-11-29,47.4549
2017-11-30,48.0812
2017-12-01,47.4067
2017-12-04,48.2257
2017-12-05,47.0695
2017-12-06,47.0213
2017-12-07,47.5512
2017-12-08,47.214
2017-12-11,46.6359
2017-12-12,46.8767
2017-12-13,46.9249
2017-12-14,45.7687
2017-12-15,45.7205
2017-12-18,47.1176
2017-12-19,46.8767
2017-12-20,46.8286
2017-12-21,47.3585
2017-12-22,47.0213
2017-12-26,47.2622
2017-12-27,47.1176
2017-12-28,47.2622
2017-12-29,47.3585
2018-01-02,49.4302
2018-01-03,48.4184
2018-01-04,48.7557
2018-01-05,49.2374
2018-01-08,49.3338
2018-01-09,49.2374
2018-01-10,48.852
2018-01-11,49.9601
2018-01-12,50.2974
2018-01-16,49.7192
2018-01-17,49.7674
2018-01-18,52.0317
2018-01-19,53.2362
2018-01-22,53.4771
2018-01-23,51.9836
2018-01-24,52.6581
2018-01-25,52.8989
2018-01-26,52.7062
2018-01-29,51.8872
2018-01-30,51.1164
2018-01-31,50.6346
2018-02-01,50.5382
2018-02-02,48.1775
2018-02-05,46.5877
2018-02-06,46.8767
2018-02-07,44.3233
2018-02-08,42.3481
2018-02-09,42.8298
2018-02-12,42.8298
2018-02-13,42.7817
2018-02-14,43.697
2018-02-15,43.697
2018-02-16,43.6195
2018-02-20,43.7649
2018-02-21,44.7342
2018-02-22,45.2673
2018-02-23,45.1704
2018-02-26,44.8796
2018-02-27,43.7649
2018-02-28,42.4563
2018-03-01,41.8263
2018-03-02,42.1655
2018-03-05,42.6502
2018-03-06,43.4256
2018-03-07,42.9894
2018-03-08,43.7164
2018-03-09,45.2673
2018-03-12,44.7827
2018-03-13,44.298
2018-03-14,43.2802
2018-03-15,43.4256
2018-03-16,44.298
2018-03-19,44.2496
2018-03-20,47.1575
2018-03-21,46.5275
2018-03-22,44.4434
2018-03-23,42.844
2018-03-26,43.9588
2018-03-27,43.1348
2018-03-28,44.0072
2018-03-29,44.2011
2018-04-02,42.5532
2018-04-03,43.1348
2018-04-04,43.4256
2018-04-05,45.3158
2018-04-06,43.4256
2018-04-09,43.571
2018-04-10,44.7342
2018-04-11,44.298
2018-04-12,44.8796
2018-04-13,44.6858
2018-04-16,44.9281
2018-04-17,45.2189
2018-04-18,45.6551
2018-04-19,45.6066
2018-04-20,44.8796
2018-04-23,44.5404
2018-04-24,42.2624
2018-04-25,42.5048
2018-04-26,42.5532
2018-04-27,42.214
2018-04-30,41.4385
2018-05-01,43.0379
2018-05-02,44.0557
2018-05-03,43.5226
2018-05-04,44.8311
2018-05-07,45.6066
2018-05-08,46.6729
2018-05-09,46.5759
2018-05-10,46.3821
2018-05-11,46.5275
2018-05-14,46.4305
2018-05-15,47.0606
2018-05-16,47.5937
2018-05-17,48.2079
2018-05-18,48.5491
2018-05-21,48.7928
2018-05-22,48.1592
2018-05-23,47.9154
2018-05-24,48.1104
2018-05-25,47.5255
2018-05-29,47.6717
2018-05-30,47.5255
2018-05-31,46.1119
2018-06-01,46.3556
2018-06-04,45.722
2018-06-05,46.4044
2018-06-06,47.038
2018-06-07,47.233
2018-06-08,47.3305
2018-06-11,47.1843
2018-06-12,47.2818
2018-06-13,47.2818
2018-06-14,46.8918
2018-06-15,46.5019
2018-06-18,46.4531
2018-06-19,44.9421
2018-06-20,44.8933
2018-06-21,43.3335
2018-06-22,43.4797
2018-06-25,42.9435
2018-06-26,43.1385
2018-06-27,43.5285
2018-06-28,42.4561
2018-06-29,42.4561
2018-07-02,42.2124
2018-07-03,42.1149
2018-07-05,42.3586
2018-07-06,42.3099
2018-07-09,43.5285
2018-07-10,43.3822
2018-07-11,42.6023
2018-07-12,43.1873
2018-07-13,43.626
2018-07-16,42.4561
2018-07-17,43.041
2018-07-18,43.6747
2018-07-19,44.2109
2018-07-20,43.9184
2018-07-23,43.1385
2018-07-24,43.236
2018-07-25,42.8948
2018-07-26,44.0647
2018-07-27,44.2596
2018-07-30,44.8446
2018-07-31,48.0129
2018-08-01,45.3808
2018-08-02,45.4782
2018-08-03,45.332
2018-08-06,46.6968
2018-08-07,47.1355
2018-08-08,47.3793
2018-08-09,46.8918
2018-08-10,46.9893
2018-08-13,47.038
2018-08-14,46.7943
2018-08-15,45.8682
2018-08-16,46.437
2018-08-17,46.7803
2018-08-20,46.9274
2018-08-21,48.0552
2018-08-22,47.0254
2018-08-23,46.3389
2018-08-24,46.6331
2018-08-27,47.761
2018-08-28,47.5648
2018-08-29,48.0552
2018-08-30,47.9571
2018-08-31,47.7119
2018-09-04,47.6139
2018-09-05,47.6629
2018-09-06,47.1725
2018-09-07,46.7312
2018-09-10,46.9764
2018-09-11,46.8293
2018-09-12,47.0254
2018-09-13,46.8293
2018-09-14,47.1725
2018-09-17,47.761
2018-09-18,47.6629
2018-09-19,48.5455
2018-09-20,50.556
2018-09-21,51.0954
2018-09-24,50.4579
2018-09-25,49.9676
2018-09-26,49.2321
2018-09-27,49.0849
2018-09-28,48.8888
2018-10-01,48.8888
2018-10-02,48.7613
2018-10-03,49.0849
2018-10-04,48.9967
2018-10-05,47.7708
2018-10-08,47.6629
2018-10-09,46.2212
2018-10-10,44.1519
2018-10-11,42.828
2018-10-12,42.014
2018-10-15,41.8963
2018-10-16,42.5239
2018-10-17,41.9747
2018-10-18,40.3762
2018-10-19,39.6897
2018-10-22,39.7387
2018-10-23,38.8561
2018-10-24,36.6985
2018-10-25,36.4729
2018-10-26,36.8358
2018-10-29,36.5318
2018-10-30,37.3752
2018-10-31,38.7874
2018-11-01,39.4641
2018-11-02,39.8172
2018-11-05,39.8564
2018-11-06,40.1702
2018-11-07,41.6707
2018-11-08,41.3078
2018-11-09,39.876
2018-11-12,38.9051
2018-11-13,39.3464
2018-11-14,38.9639
2018-11-15,40.3664
2018-11-16,40.1016
2018-11-19,39.1733
2018-11-20,38.3834
2018-11-21,38.6994
2018-11-23,38.5512
2018-11-26,39.0549
2018-11-27,38.3636
2018-11-28,39.282
2018-11-29,38.7092
2018-11-30,39.6473
2018-12-03,41.0002
2018-12-04,39.2425
2018-12-06,38.255
2018-12-07,37.0305
2018-12-10,36.833
2018-12-11,37.1688
2018-12-12,38.1859
2018-12-13,37.544
2018-12-14,37.386
2018-12-17,36.9021
2018-12-18,37.149
2018-12-19,35.8752
2018-12-20,35.6678
2018-12-21,35.2136
2018-12-24,33.999
2018-12-26,36.1122
2018-12-27,36.6355
2018-12-28,36.3788
2018-12-31,36.8528
2019-01-02,37.1885
2019-01-03,35.9344
2019-01-04,38.0279
2019-01-07,38.65
2019-01-08,39.1832
2019-01-09,39.8152
2019-01-10,40.8422
2019-01-11,41.0693
2019-01-14,40.8027
2019-01-15,40.8027
2019-01-16,41.4248
2019-01-17,42.2444
2019-01-18,43.5281
2019-01-22,42.0272
2019-01-23,41.3557
2019-01-24,41.1483
2019-01-25,41.9383
2019-01-28,41.3952
2019-01-29,42.1062
2019-01-30,42.985
2019-01-31,42.0568
2019-02-01,42.353
2019-02-04,42.8961
2019-02-05,42.8764
2019-02-06,42.9554
2019-02-07,41.4939
2019-02-08,41.4347
2019-02-11,41.6223
2019-02-12,42.7382
2019-02-13,42.9554
2019-02-14,42.1062
2019-02-15,42.8468
2019-02-19,42.9263
2019-02-20,43.2443
2019-02-21,43.135
2019-02-22,43.4431
2019-02-25,43.4431
2019-02-26,43.0952
2019-02-27,43.3735
2019-02-28,43.1251
2019-03-01,43.2741
2019-03-04,43.135
2019-03-05,43.453
2019-03-06,42.976
2019-03-07,42.4194
2019-03-08,42.3896
2019-03-11,43.0356
2019-03-12,43.1847
2019-03-13,43.7214
2019-03-14,43.0356
2019-03-15,43.0257
2019-03-18,43.6816
2019-03-19,43.4928
2019-03-20,43.4431
2019-03-21,44.2084
2019-03-22,41.3758
2019-03-25,41.6939
2019-03-26,42.1908
2019-03-27,42.1809
2019-03-28,42.5188
2019-03-29,43.3537
2019-04-01,45.1029
2019-04-02,45.3514
2019-04-03,46.057
2019-04-04,46.4944
2019-04-05,47.3094
2019-04-08,46.7031
2019-04-09,46.2359
2019-04-10,45.8781
2019-04-11,46.5043
2019-04-12,47.4286
2019-04-15,47.1702
2019-04-16,47.697
2019-04-17,47.538
2019-04-18,47.6373
2019-04-22,47.5678
2019-04-23,47.7964
2019-04-24,47.6075
2019-04-25,46.3254
2019-04-26,47.4684
2019-04-29,47.8461
2019-04-30,47.6572
2019-05-01,51.4738
2019-05-02,50.2215
2019-05-03,51.8415
2019-05-06,51.0862
2019-05-07,50.0724
2019-05-08,49.7245
2019-05-09,49.6152
2019-05-10,49.7146
2019-05-13,47.7566
2019-05-14,47.8262
2019-05-15,48.184
2019-05-16,47.5876
2019-05-17,46.2359
2019-05-20,45.58
2019-05-21,46.47
2019-05-22,45.75
2019-05-23,44.62
2019-05-24,44.46
2019-05-28,43.78
2019-05-29,44.29
2019-05-30,44.09
2019-05-31,44.01
2019-06-03,45.23
2019-06-04,46.6
2019-06-05,46.84
2019-06-06,47.39
2019-06-07,47.52
2019-06-10,47.77
2019-06-11,48.21
2019-06-12,47.98
2019-06-13,48.36
2019-06-14,47.38
2019-06-17,46.885
2019-06-18,48.15
2019-06-19,48.89
2019-06-20,50.15
2019-06-21,49.87
2019-06-24,49.77
2019-06-25,50.23
2019-06-26,50.89
2019-06-27,50.4
2019-06-28,51.09
2019-07-01,51.15
2019-07-02,50.085
2019-07-03,50.36
2019-07-04,50.36
2019-07-05,49.73
2019-07-08,49.46
2019-07-09,48.815
2019-07-10,47.95
2019-07-11,47.315
2019-07-12,48.415
2019-07-15,47.66
2019-07-16,48.795
2019-07-17,48.05
2019-07-18,47.38
2019-07-19,47.79
2019-07-22,47.67
2019-07-23,49.21
2019-07-24,49.95
2019-07-25,48.425
2019-07-26,48.01
2019-07-29,48.41
2019-07-30,48.6
2019-07-31,45.58
2019-08-01,43.19
2019-08-02,43.585
2019-08-05,42.37
2019-08-06,42.89
2019-08-07,42.64
2019-08-08,42.975
2019-08-09,41.45
2019-08-12,41.325
2019-08-13,41.44
2019-08-14,40.09
2019-08-15,39.55
2019-08-16,39.99
2019-08-19,40.56
2019-08-20,39.98
2019-08-21,40.325
2019-08-22,40.22
2019-08-23,38.72
2019-08-26,38.625
2019-08-27,38.065
2019-08-28,38.83
2019-08-29,39.48
2019-08-30,40.185
2019-09-02,40.2
2019-09-03,38.77
2019-09-04,39.34
2019-09-05,40.9
2019-09-06,41.035
2019-09-09,42.2
2019-09-10,44.17
2019-09-11,45.2
2019-09-12,44.505
2019-09-13,44.64
2019-09-16,45.06
2019-09-17,44.495
2019-09-18,44.49
2019-09-19,44.39
2019-09-20,44.29
2019-09-23,43.94
2019-09-24,42.99
2019-09-25,43.84
2019-09-26,43.44
2019-09-27,42.86
2019-09-30,43.49
2019-10-01,41.745
2019-10-02,41.22
2019-10-03,41.47
2019-10-04,41.81
2019-10-07,42.015
2019-10-08,41.055
2019-10-09,41.085
2019-10-10,41.81
2019-10-11,43
2019-10-14,43.02
2019-10-15,43.745
2019-10-16,43.615
2019-10-17,44.26
2019-10-18,44.42
2019-10-21,44.605
2019-10-22,46.1
2019-10-23,46.23
2019-10-24,46.63
2019-10-25,47.855
2019-10-28,48.17
2019-10-29,49
2019-10-30,49.03
2019-10-31,49
2019-11-01,51.425
2019-11-04,53.155
2019-11-05,52.75
2019-11-06,52.75
2019-11-07,53.47
2019-11-08,53.62
2019-11-11,54.035
2019-11-12,53.86
2019-11-13,52.975
2019-11-14,53.15
2019-11-15,53.92
2019-11-18,52.475
2019-11-19,52.81
2019-11-20,51.94
2019-11-21,51.58
2019-11-22,52.275
2019-11-25,52.8
