date,close
2014-06-13,31.631
2014-06-16,31.7926
2014-06-17,32.2676
2014-06-18,33.5219
2014-06-19,35.2607
2014-06-20,35.4412
2014-06-23,35.8593
2014-06-24,34.9281
2014-06-25,35.5552
2014-06-26,35.4222
2014-06-27,35.7548
2014-06-30,36.3914
2014-07-01,36.0683
2014-07-02,36.8854
2014-07-03,36.3819
2014-07-07,36.1823
2014-07-08,36.9995
2014-07-09,38.3772
2014-07-10,37.7121
2014-07-11,38.8048
2014-07-14,38.3962
2014-07-15,37.4556
2014-07-16,38.1017
2014-07-17,39.5554
2014-07-18,39.6694
2014-07-21,39.4509
2014-07-22,39.0613
2014-07-23,39.1183
2014-07-24,38.7193
2014-07-25,39.736
2014-07-28,40.021
2014-07-29,39.2609
2014-07-30,38.7288
2014-07-31,35.3367
2014-08-01,35.7453
2014-08-04,35.2892
2014-08-05,35.7262
2014-08-06,36.971
2014-08-07,36.7429
2014-08-08,36.5624
2014-08-11,36.895
2014-08-12,38.1397
2014-08-13,38.1112
2014-08-14,37.9306
2014-08-15,37.5031
2014-08-18,37.6646
2014-08-19,37.3035
2014-08-20,36.971
2014-08-21,32.7372
2014-08-22,35.4792
2014-08-25,34.6621
2014-08-26,35.4887
2014-08-27,35.3082
2014-08-28,35.9271
2014-08-29,36.4508
2014-09-02,35.1653
2014-09-03,34.6321
2014-09-04,33.2419
2014-09-05,33.2704
2014-09-08,32.204
2014-09-09,32.7372
2014-09-10,32.423
2014-09-11,32.7753
2014-09-12,32.3563
2014-09-15,32.5944
2014-09-16,33.1276
2014-09-17,32.2516
2014-09-18,30.928
2014-09-19,29.5854
2014-09-22,28.6522
2014-09-23,29.1188
2014-09-24,28.557
2014-09-25,28.7284
2014-09-26,28.4617
2014-09-29,28.2808
2014-09-30,27.6428
2014-10-01,27.8618
2014-10-02,28.8426
2014-10-03,26.7097
2014-10-06,27.281
2014-10-07,26.6335
2014-10-08,29.2045
2014-10-09,28.0999
2014-10-10,27.8333
2014-10-13,28.5474
2014-10-14,28.6141
2014-10-15,29.3568
2014-10-16,29.0045
2014-10-17,27.3477
2014-10-20,28.8807
2014-10-21,28.8617
2014-10-22,27.4334
2014-10-23,27.8428
2014-10-24,27.8047
2014-10-27,27.2905
2014-10-28,28.0809
2014-10-29,26.7382
2014-10-30,22.3104
2014-10-31,22.3771
2014-11-03,22.8437
2014-11-04,21.9105
2014-11-05,21.1487
2014-11-06,22.0152
2014-11-07,23.434
2014-11-10,21.9105
2014-11-11,22.9103
2014-11-12,22.6247
2014-11-13,22.3104
2014-11-14,23.9102
2014-11-17,24.51
2014-11-18,25.5956
2014-11-19,24.8052
2014-11-20,25.6241
2014-11-21,25.367
2014-11-24,24.7005
2014-11-25,25.4432
2014-11-26,24.8224
2014-11-28,22.4347
2014-12-01,23.982
2014-12-02,23.1415
2014-12-03,24.1443
2014-12-04,23.1701
2014-12-05,22.6448
2014-12-08,22.7881
2014-12-09,24.4977
2014-12-10,23.7432
2014-12-11,23.428
2014-12-12,23.151
2014-12-15,21.2027
2014-12-16,20.8207
2014-12-17,22.0909
2014-12-18,23.6286
2014-12-19,23.8005
2014-12-22,22.1005
2014-12-23,21.9667
2014-12-24,22.5875
2014-12-26,23.2561
2014-12-29,22.7595
2014-12-30,23.9246
2014-12-31,23.7718
2015-01-02,25.787
2015-01-05,26.2168
2015-01-06,27.7259
2015-01-07,27.1624
2015-01-08,26.7517
2015-01-09,28.4422
2015-01-12,29.4354
2015-01-13,28.4135
2015-01-14,28.1079
2015-01-15,29.9512
2015-01-16,31.2501
2015-01-20,31.6512
2015-01-21,31.2023
2015-01-22,31.9186
2015-01-23,31.0973
2015-01-26,31.2405
2015-01-27,32.7304
2015-01-28,31.4697
2015-01-29,31.1832
2015-01-30,32.2052
2015-02-02,33.0265
2015-02-03,32.2529
2015-02-04,32.5776
2015-02-05,33.0074
2015-02-06,30.1613
2015-02-09,30.6484
2015-02-10,30.0276
2015-02-11,29.3877
2015-02-12,31.0495
2015-02-13,31.145
2015-02-17,29.9225
2015-02-18,30.4956
2015-02-19,29.5309
2015-02-20,29.0057
2015-02-23,29.4163
2015-02-24,29.1776
2015-02-25,30.677
2015-02-26,30.7441
2015-02-27,30.7824
2015-03-02,30.6579
2015-03-03,30.3036
2015-03-04,29.4706
2015-03-05,29.9781
2015-03-06,27.4408
2015-03-09,26.4738
2015-03-10,26.3206
2015-03-11,27.3738
2015-03-12,27.2685
2015-03-13,27.1536
2015-03-16,27.2302
2015-03-17,26.9046
2015-03-18,28.0249
2015-03-19,27.3451
2015-03-20,28.4557
2015-03-23,29.126
2015-03-24,28.9632
2015-03-25,28.8291
2015-03-26,27.9004
2015-03-27,27.6227
2015-03-30,26.8089
2015-03-31,26.7515
2015-04-01,28.9057
2015-04-02,28.4653
2015-04-06,29.5568
2015-04-07,28.4079
2015-04-08,27.7472
2015-04-09,27.5653
2015-04-10,28.4366
2015-04-13,27.8142
2015-04-14,28.0919
2015-04-15,29.126
2015-04-16,28.7908
2015-04-17,28.9823
2015-04-20,28.8483
2015-04-21,29.2887
2015-04-22,27.8525
2015-04-23,29.2409
2015-04-24,28.5515
2015-04-27,28.8196
2015-04-28,30.6962
2015-04-29,30.543
2015-04-30,29.0111
2015-05-01,30.3802
2015-05-04,30.227
2015-05-05,30.4473
2015-05-06,29.3462
2015-05-07,30.0547
2015-05-08,30.3419
2015-05-11,31.0122
2015-05-12,32.0654
2015-05-13,32.659
2015-05-14,32.5154
2015-05-15,32.0941
2015-05-18,32.5154
2015-05-19,31.1271
2015-05-20,31.4047
2015-05-21,31.2898
2015-05-22,31.1654
2015-05-26,29.7675
2015-05-27,30.0355
2015-05-28,30.7939
2015-05-29,30.8803
2015-06-01,30.8131
2015-06-02,31.2834
2015-06-03,30.5635
2015-06-04,30.4003
2015-06-05,29.594
2015-06-08,30.1411
2015-06-09,29.6996
2015-06-10,30.3235
2015-06-11,29.9491
2015-06-12,29.6516
2015-06-15,29.8244
2015-06-16,29.0372
2015-06-17,29.7284
2015-06-18,30.6403
2015-06-19,29.7092
2015-06-22,28.9988
2015-06-23,28.8932
2015-06-24,28.8357
2015-06-25,28.3941
2015-06-26,27.9909
2015-06-29,27.8757
2015-06-30,27.2326
2015-07-01,26.5415
2015-07-02,27.2902
2015-07-06,28.5573
2015-07-07,27.2902
2015-07-08,27.4246
2015-07-09,27.4438
2015-07-10,26.839
2015-07-13,26.3207
2015-07-14,26.3207
2015-07-15,25.8599
2015-07-16,25.6008
2015-07-17,24.1513
2015-07-20,21.8091
2015-07-21,22.4043
2015-07-22,22.3371
2015-07-23,21.4828
2015-07-24,22.9226
2015-07-27,22.0491
2015-07-28,22.1931
2015-07-29,22.4331
2015-07-30,20.7628
2015-07-31,21.2428
2015-08-03,20.3117
2015-08-04,20.4461
2015-08-05,20.2541
2015-08-06,21.0508
2015-08-07,21.2044
2015-08-10,22.7402
2015-08-11,22.7594
2015-08-12,24.8136
2015-08-13,23.2586
2015-08-14,22.7594
2015-08-17,23.6329
2015-08-18,23.6042
2015-08-19,25.2744
2015-08-20,26.0039
2015-08-21,25.14
2015-08-24,23.6809
2015-08-25,22.7402
2015-08-26,21.6555
2015-08-27,22.5579
2015-08-28,23.6655
2015-08-31,23.5788
2015-09-01,23.2417
2015-09-02,22.7505
2015-09-03,21.951
2015-09-04,21.9703
2015-09-08,21.8258
2015-09-09,20.7567
2015-09-10,21.0167
2015-09-11,21.3346
2015-09-14,21.3635
2015-09-15,21.2575
2015-09-16,22.8564
2015-09-17,23.4055
2015-09-18,23.5596
2015-09-21,23.2128
2015-09-22,22.1822
2015-09-23,22.2689
2015-09-24,24.8117
2015-09-25,25.0332
2015-09-28,23.8196
2015-09-29,23.7522
2015-09-30,24.3879
2015-10-01,23.8004
2015-10-02,26.7862
2015-10-05,27.2678
2015-10-06,27.7494
2015-10-07,27.1234
2015-10-08,26.4877
2015-10-09,27.6724
2015-10-12,26.6996
2015-10-13,27.2486
2015-10-14,29.1172
2015-10-15,29.0305
2015-10-16,28.1251
2015-10-19,27.2582
2015-10-20,27.8843
2015-10-21,27.4027
2015-10-22,28.0191
2015-10-23,27.9902
2015-10-26,26.9307
2015-10-27,26.9885
2015-10-28,26.767
2015-10-29,27.0656
2015-10-30,27.2486
2015-11-02,27.0752
2015-11-03,26.7477
2015-11-04,26.5743
2015-11-05,25.4185
2015-11-06,24.2049
2015-11-09,24.9177
2015-11-10,24.6961
2015-11-11,25.4089
2015-11-12,25.1681
2015-11-13,25.1103
2015-11-16,25.2162
2015-11-17,24.1278
2015-11-18,25.38
2015-11-19,26.035
2015-11-20,25.274
2015-11-23,24.9658
2015-11-24,25.7171
2015-11-25,25.7075
2015-11-27,25.1375
2015-11-30,25.5529
2015-12-01,26.4127
2015-12-02,25.92
2015-12-03,26.0552
2015-12-04,28.142
2015-12-07,26.8957
2015-12-08,27.089
2015-12-09,26.9827
2015-12-10,26.5576
2015-12-11,26.9247
2015-12-14,25.6785
2015-12-15,25.5529
2015-12-16,26.3547
2015-12-17,24.2004
2015-12-18,25.1858
2015-12-21,25.8234
2015-12-22,25.5819
2015-12-23,25.7847
2015-12-24,26.2871
2015-12-28,25.9103
2015-12-29,26.0166
2015-12-30,25.3307
2015-12-31,25.3887
2016-01-04,26.0263
2016-01-05,26.6832
2016-01-06,27.485
2016-01-07,28.9728
2016-01-08,28.5574
2016-01-11,27.6203
2016-01-12,27.5623
2016-01-13,27.9971
2016-01-14,26.9247
2016-01-15,27.06
2016-01-19,25.8717
2016-01-20,25.9586
2016-01-21,26.3161
2016-01-22,26.3547
2016-01-25,26.9537
2016-01-26,27.7749
2016-01-27,27.9681
2016-01-28,27.9874
2016-01-29,28.4415
2016-02-01,29.0501
2016-02-02,28.7506
2016-02-03,30.335
2016-02-04,31.6199
2016-02-05,32.3734
2016-02-08,32.7599
2016-02-09,31.987
2016-02-10,32.1706
2016-02-11,34.1317
2016-02-12,34.4312
2016-02-16,32.9627
2016-02-17,32.7502
2016-02-18,33.8709
2016-02-19,33.4554
2016-02-22,33.4748
2016-02-23,34.0544
2016-02-24,34.0158
2016-02-25,34.4215
2016-02-26,33.4533
2016-02-29,34.0826
2016-03-01,32.3882
2016-03-02,32.8142
2016-03-03,33.2596
2016-03-04,33.2112
2016-03-07,34.102
2016-03-08,33.0369
2016-03-09,33.1531
2016-03-10,35.2542
2016-03-11,34.5861
2016-03-14,33.9568
2016-03-15,34.6345
2016-03-16,36.6098
2016-03-17,36.8325
2016-03-18,36.7841
2016-03-21,36.8615
2016-03-22,36.3193
2016-03-23,34.3247
2016-03-24,34.9734
2016-03-28,34.8669
2016-03-29,36.116
2016-03-30,35.5834
2016-03-31,35.0122
2016-04-01,35.3704
2016-04-04,34.6926
2016-04-05,35.2736
2016-04-06,35.3607
2016-04-07,36.6679
2016-04-08,37.2488
2016-04-11,39.2918
2016-04-12,39.776
2016-04-13,39.1369
2016-04-14,38.3042
2016-04-15,39.1369
2016-04-18,38.7884
2016-04-19,40.173
2016-04-20,39.5339
2016-04-21,40.5022
2016-04-22,40.0277
2016-04-25,39.2918
2016-04-26,39.805
2016-04-27,40.0665
2016-04-28,41.8577
2016-04-29,45.7114
2016-05-02,45.2757
2016-05-03,44.259
2016-05-04,42.4096
2016-05-05,43.5522
2016-05-06,44.5785
2016-05-09,42.7098
2016-05-10,43.9104
2016-05-11,45.1788
2016-05-12,44.2977
2016-05-13,44.7334
2016-05-16,46.0212
2016-05-17,46.7765
2016-05-18,43.465
2016-05-19,44.2203
2016-05-20,44.7141
2016-05-23,44.472
2016-05-24,42.7485
2016-05-25,43.3973
2016-05-26,43.6393
2016-05-27,42.8164
2016-05-31,43.573
2016-06-01,43.8155
2016-06-02,43.767
2016-06-03,48.6559
2016-06-06,48.7529
2016-06-07,48.6462
2016-06-08,49.073
2016-06-09,49.5677
2016-06-10,49.073
2016-06-13,49.8878
2016-06-14,48.4231
2016-06-15,49.7229
2016-06-16,48.9954
2016-06-17,48.7141
2016-06-20,48.879
2016-06-21,48.1515
2016-06-22,48.8887
2016-06-23,48.3067
2016-06-24,50.4698
2016-06-27,50.9645
2016-06-28,50.7511
2016-06-29,51.3719
2016-06-30,51.8958
2016-07-01,53.9328
2016-07-05,53.6612
2016-07-06,54.6506
2016-07-07,53.6612
2016-07-08,54.1656
2016-07-11,53.8746
2016-07-12,52.6524
2016-07-13,55.1065
2016-07-14,54.3984
2016-07-15,54.3887
2016-07-18,54.3887
2016-07-19,54.0395
2016-07-20,50.6832
2016-07-21,51.6338
2016-07-22,52.1189
2016-07-25,49.752
2016-07-26,51.1391
2016-07-27,53.021
2016-07-28,54.8446
2016-07-29,56.3966
2016-08-01,57.1241
2016-08-02,57.5994
2016-08-03,57.5412
2016-08-04,57.9777
2016-08-05,56.1832
2016-08-08,55.5333
2016-08-09,56.61
2016-08-10,57.3278
2016-08-11,56.8331
2016-08-12,56.707
2016-08-15,56.3772
2016-08-16,56.416
2016-08-17,55.5818
2016-08-18,56.0086
2016-08-19,54.4566
2016-08-22,54.5633
2016-08-23,54.2529
2016-08-24,50.431
2016-08-25,50.8966
2016-08-26,50.8481
2016-08-29,51.7017
2016-08-30,49.3985
2016-08-31,49.2236
2016-09-01,50.623
2016-09-02,52.0613
2016-09-06,54.2965
2016-09-07,54.5395
2016-09-08,53.004
2016-09-09,49.5345
2016-09-12,51.2547
2016-09-13,49.8455
2016-09-14,49.6123
2016-09-15,50.2148
2016-09-16,49.9913
2016-09-19,50.6619
2016-09-20,50.8076
2016-09-21,54.452
2016-09-22,54.9574
2016-09-23,52.7999
2016-09-26,52.6153
2016-09-27,52.5278
2016-09-28,53.451
2016-09-29,53.5968
2016-09-30,52.6541
2016-10-03,51.2838
2016-10-04,46.1234
2016-10-05,45.4431
2016-10-06,44.3449
2016-10-07,43.6841
2016-10-10,43.6744
2016-10-11,43.4606
2016-10-12,44.792
2016-10-13,45.0058
2016-10-14,44.3741
2016-10-17,44.8697
2016-10-18,46.6579
2016-10-19,48.0962
2016-10-20,47.7852
2016-10-21,47.6686
2016-10-24,46.93
2016-10-25,48.1934
2016-10-26,47.0369
2016-10-27,47.3965
2016-10-28,48.0088
2016-10-31,49.3693
2016-11-01,50.1662
2016-11-02,49.7775
2016-11-03,50.4092
2016-11-04,50.2245
2016-11-07,48.1934
2016-11-08,48.3003
2016-11-09,49.1167
2016-11-10,45.239
2016-11-11,41.0504
2016-11-14,40.8366
2016-11-15,42.9844
2016-11-16,43.0232
2016-11-17,41.5752
2016-11-18,41.0115
2016-11-21,41.9736
2016-11-22,41.5363
2016-11-23,38.718
2016-11-25,39.7287
2016-11-28,40.9824
2016-11-29,40.8655
2016-11-30,39.9887
2016-12-01,39.073
2016-12-02,40.0374
2016-12-05,39.8524
2016-12-06,39.4627
2016-12-07,39.2776
2016-12-08,39.3848
2016-12-09,37.2903
2016-12-12,37.9138
2016-12-13,38.6249
2016-12-14,36.8909
2016-12-15,35.4979
2016-12-16,36.3746
2016-12-19,37.115
2016-12-20,36.7838
2016-12-21,37.2416
2016-12-22,37.1345
2016-12-23,37.8553
2016-12-27,38.9269
2016-12-28,39.453
2016-12-29,42.278
2016-12-30,40.9142
2017-01-03,41.937
2017-01-04,42.1513
2017-01-05,44.3821
2017-01-06,43.7295
2017-01-09,42.9891
2017-01-10,43.2034
2017-01-11,44.3724
2017-01-12,44.4601
2017-01-13,44.8595
2017-01-17,45.2881
2017-01-18,44.5185
2017-01-19,44.0314
2017-01-20,44.4601
2017-01-23,45.8921
2017-01-24,46.0382
2017-01-25,44.6744
2017-01-26,43.7684
2017-01-27,44.7328
2017-01-30,44.9764
2017-01-31,46.4668
2017-02-01,46.1746
2017-02-02,47.3922
2017-02-03,47.9378
2017-02-06,49.0386
2017-02-07,48.7853
2017-02-08,49.5451
2017-02-09,48.9022
2017-02-10,49.5159
2017-02-13,48.4638
2017-02-14,48.1716
2017-02-15,48.1423
2017-02-16,45.8823
2017-02-17,45.6096
2017-02-21,45.405
2017-02-22,44.2945
2017-02-23,44.2068
2017-02-24,44.1483
2017-02-27,41.4538
2017-02-28,41.405
2017-03-01,41.1999
2017-03-02,39.6281
2017-03-03,40.2529
2017-03-06,39.1692
2017-03-07,39.0325
2017-03-08,39.1009
2017-03-09,38.9154
2017-03-10,40.2236
2017-03-13,40.2724
2017-03-14,38.974
2017-03-15,41.9712
2017-03-16,41.2487
2017-03-17,41.3659
2017-03-20,42.0103
2017-03-21,43.0451
2017-03-22,43.3185
2017-03-23,43.2794
2017-03-24,42.7913
2017-03-27,43.5821
2017-03-28,42.0688
2017-03-29,42.1372
2017-03-30,41.2683
2017-03-31,41.4342
2017-04-03,42.5179
2017-04-04,43.299
2017-04-05,43.5821
2017-04-06,43.8555
2017-04-07,43.5333
2017-04-10,44.2069
2017-04-11,45.2613
2017-04-12,46.0033
2017-04-13,45.5152
2017-04-17,45.6226
2017-04-18,45.3687
2017-04-19,44.3046
2017-04-20,44.4901
2017-04-21,44.9196
2017-04-24,44.5779
2017-04-25,42.4301
2017-04-26,42.5765
2017-04-27,42.4496
2017-04-28,46.6965
2017-05-01,45.6128
2017-05-02,45.73
2017-05-03,45.1735
2017-05-04,44.2753
2017-05-05,45.564
2017-05-08,45.5152
2017-05-09,45.1247
2017-05-10,45.6616
2017-05-11,46.4915
2017-05-12,47.2725
2017-05-15,47.6923
2017-05-16,47.995
2017-05-17,48.3562
2017-05-18,47.6533
2017-05-19,48.0731
2017-05-22,47.9657
2017-05-23,46.472
2017-05-24,47.1261
2017-05-25,47.1066
2017-05-26,47.9657
2017-05-30,47.0167
2017-05-31,47.3591
2017-06-01,47.5548
2017-06-02,47.8287
2017-06-05,47.0559
2017-06-06,49.482
2017-06-07,49.0027
2017-06-08,48.5918
2017-06-09,47.1537
2017-06-12,47.0656
2017-06-13,48.2005
2017-06-14,45.9406
2017-06-15,45.383
2017-06-16,45.8232
2017-06-19,45.3145
2017-06-20,44.708
2017-06-21,45.4123
2017-06-22,45.5395
2017-06-23,46.8015
2017-06-26,46.2439
2017-06-27,45.0797
2017-06-28,45.4515
2017-06-29,43.7786
2017-06-30,44.1406
2017-07-03,43.0938
2017-07-05,43.2699
2017-07-06,43.0155
2017-07-07,42.6144
2017-07-10,43.5242
2017-07-11,43.8373
2017-07-12,43.671
2017-07-13,42.7514
2017-07-14,43.6318
2017-07-17,43.9155
2017-07-18,44.0329
2017-07-19,43.9645
2017-07-20,44.6395
2017-07-21,45.0504
2017-07-24,44.9232
2017-07-25,44.4438
2017-07-26,46.3515
2017-07-27,46.2145
2017-07-28,46.2634
2017-07-31,45.696
2017-08-01,43.8275
2017-08-02,44.9525
2017-08-03,44.6297
2017-08-04,43.8275
2017-08-07,44.0036
2017-08-08,43.5829
2017-08-09,43.759
2017-08-10,45.2949
2017-08-11,45.1482
2017-08-14,44.9917
2017-08-15,44.6786
2017-08-16,45.6863
2017-08-17,46.0189
2017-08-18,45.8037
2017-08-21,46.1852
2017-08-22,45.8428
2017-08-23,45.9895
2017-08-24,45.9504
2017-08-25,46.4395
2017-08-28,48.5233
2017-08-29,49.9125
2017-08-30,49.491
2017-08-31,50.2458
2017-09-01,50.2163
2017-09-05,50.4124
2017-09-06,49.54
2017-09-07,50.3536
2017-09-08,50.1869
2017-09-11,48.4814
2017-09-12,48.6284
2017-09-13,47.5796
2017-09-14,47.8638
2017-09-15,47.1679
2017-09-18,46.3151
2017-09-19,46.5111
2017-09-20,46.0014
2017-09-21,45.2271
2017-09-22,45.8152
2017-09-25,46.5405
2017-09-26,45.0408
2017-09-27,44.4625
2017-09-28,44.7075
2017-09-29,44.3155
2017-10-02,44.2762
2017-10-03,44.2762
2017-10-04,44.5409
2017-10-05,44.3841
2017-10-06,44.9134
2017-10-09,45.3839
2017-10-10,45.0408
2017-10-11,45.3349
2017-10-12,45.4329
2017-10-13,45.776
2017-10-16,44.6193
2017-10-17,44.188
2017-10-18,43.9332
2017-10-19,43.7763
2017-10-20,43.4823
2017-10-23,44.0214
2017-10-24,43.3647
2017-10-25,43.1196
2017-10-26,44.5507
2017-10-27,44.5213
2017-10-30,44.3351
2017-10-31,43.7469
2017-11-01,43.3843
2017-11-02,43.1784
2017-11-03,43.2372
2017-11-06,44.2959
2017-11-07,44.1488
2017-11-08,44.6879
2017-11-09,44.4527
2017-11-10,44.1096
2017-11-13,44.1782
2017-11-14,44.5017
2017-11-15,44.5017
2017-11-16,43.7371
2017-11-17,43.7175
2017-11-20,43.1196
2017-11-21,43.5705
2017-11-22,44.0312
2017-11-24,43.8057
2017-11-27,44.4821
2017-11-28,44.2959
2017-11-29,42.7275
2017-11-30,42.9536
2017-12-01,42.9536
2017-12-04,42.4229
2017-12-05,41.6957
2017-12-06,40.7032
2017-12-07,41.4206
2017-12-08,42.0986
2017-12-11,41.794
2017-12-12,41.2535
2017-12-13,41.8824
2017-12-14,42.1183
2017-12-15,42.2264
2017-12-18,42.9437
2017-12-19,43.0715
2017-12-20,43.5628
2017-12-21,43.7692
2017-12-22,44.5357
2017-12-26,45.2236
2017-12-27,45.1548
2017-12-28,45.5282
2017-12-29,45.3808
2018-01-02,45.9213
2018-01-03,45.656
2018-01-04,46.049
2018-01-05,46.2063
2018-01-08,46.3144
2018-01-09,45.9213
2018-01-10,45.7542
2018-01-11,45.4987
2018-01-12,46.4126
2018-01-16,47.1005
2018-01-17,46.6387
2018-01-18,45.8918
2018-01-19,45.4594
2018-01-22,45.1253
2018-01-23,45.6756
2018-01-24,48.2699
2018-01-25,47.9456
2018-01-26,48.378
2018-01-29,46.845
2018-01-30,46.5306
2018-01-31,46.4618
2018-02-01,46.3242
2018-02-02,44.9976
2018-02-05,43.9952
2018-02-06,43.1501
2018-02-07,43.0813
2018-02-08,42.7079
2018-02-09,42.1084
2018-02-12,43.2877
2018-02-13,43.1599
2018-02-14,44.7027
2018-02-15,44.3195
2018-02-16,42.3541
2018-02-20,40.9587
2018-02-21,39.7401
2018-02-22,39.5534
2018-02-23,39.8581
2018-02-26,39.7401
2018-02-27,37.932
2018-02-28,37.5378
2018-03-01,38.0995
2018-03-02,37.5772
2018-03-05,37.7546
2018-03-06,38.6021
2018-03-07,37.8236
2018-03-08,38.5233
2018-03-09,38.4937
2018-03-12,38.8879
2018-03-13,38.9372
2018-03-14,39.223
2018-03-15,38.5036
2018-03-16,38.8781
2018-03-19,39.223
2018-03-20,39.0555
2018-03-21,39.9818
2018-03-22,39.4989
2018-03-23,41.2334
2018-03-26,41.7557
2018-03-27,41.3024
2018-03-28,40.8195
2018-03-29,41.4601
2018-04-02,41.9726
2018-04-03,41.6769
2018-04-04,41.0659
2018-04-05,41.4305
2018-04-06,41.9331
2018-04-09,42.4752
2018-04-10,42.692
2018-04-11,43.3326
2018-04-12,42.8792
2018-04-13,44.2096
2018-04-16,44.5447
2018-04-17,44.4462
2018-04-18,44.8108
2018-04-19,43.7465
2018-04-20,43.5198
2018-04-23,42.9383
2018-04-24,42.9383
2018-04-25,42.6624
2018-04-26,43.0369
2018-04-27,43.3227
2018-04-30,41.4798
2018-05-01,41.6079
2018-05-02,41.4601
2018-05-03,41.8937
2018-05-04,42.1204
2018-05-07,42.1499
2018-05-08,42.5146
2018-05-09,42.9975
2018-05-10,44.0125
2018-05-11,44.0815
2018-05-14,44.1702
2018-05-15,43.0073
2018-05-16,43.1946
2018-05-17,42.8595
2018-05-18,42.4653
2018-05-21,42.2189
2018-05-22,42.2091
2018-05-23,43.0172
2018-05-24,43.6381
2018-05-25,43.2833
2018-05-29,44.3279
2018-05-30,44.6925
2018-05-31,44.4061
2018-06-01,44.1789
2018-06-04,43.843
2018-06-05,44.1295
2018-06-06,43.9319
2018-06-07,43.7145
2018-06-08,43.922
2018-06-11,44.5641
2018-06-12,45.0186
2018-06-13,45.1766
2018-06-14,46.0361
2018-06-15,44.5938
2018-06-18,44.8803
2018-06-19,43.9418
2018-06-20,43.4379
2018-06-21,43.5565
2018-06-22,44.3073
2018-06-25,43.7639
2018-06-26,44.0109
2018-06-27,43.6256
2018-06-28,44.0307
2018-06-29,45.2754
2018-07-02,44.6333
2018-07-03,45.7397
2018-07-05,47.1623
2018-07-06,46.3028
2018-07-09,45.6212
2018-07-10,45.72
2018-07-11,44.742
2018-07-12,45.4631
2018-07-13,44.9692
2018-07-16,45.1371
2018-07-17,44.9988
2018-07-18,44.9889
2018-07-19,44.9395
2018-07-20,45.473
2018-07-23,43.7639
2018-07-24,43.922
2018-07-25,44.2974
2018-07-26,41.9561
2018-07-27,41.2942
2018-07-30,41.4325
2018-07-31,41.3732
2018-08-01,40.8595
2018-08-02,40.8002
2018-08-03,41.0472
2018-08-06,40.7607
2018-08-07,39.6938
2018-08-08,39.6444
2018-08-09,39.921
2018-08-10,39.4863
2018-08-13,38.1625
2018-08-14,37.8365
2018-08-15,35.0803
2018-08-16,34.1319
2018-08-17,35.1297
2018-08-20,34.9815
2018-08-21,35.1396
2018-08-22,35.673
2018-08-23,34.2603
2018-08-24,35.7224
2018-08-27,36.2757
2018-08-28,35.5545
2018-08-29,35.1989
2018-08-30,34.5448
2018-08-31,34.2079
2018-09-04,32.9097
2018-09-05,32.2953
2018-09-06,32.3746
2018-09-07,32.8602
2018-09-10,32.7314
2018-09-11,32.771
2018-09-12,33.7917
2018-09-13,33.2268
2018-09-14,32.9989
2018-09-17,33.752
2018-09-18,34.1583
2018-09-19,34.5745
2018-09-20,34.8322
2018-09-21,34.3565
2018-09-24,34.0394
2018-09-25,34.7826
2018-09-26,33.4448
2018-09-27,33.643
2018-09-28,33.8908
2018-10-01,33.8016
2018-10-02,35.5159
2018-10-03,34.6241
2018-10-04,34.7133
2018-10-05,34.7727
2018-10-08,34.7826
2018-10-09,33.3854
2018-10-10,34.3763
2018-10-11,37.0321
2018-10-12,36.9528
2018-10-15,37.6366
2018-10-16,36.9033
2018-10-17,36.4673
2018-10-18,36.6853
2018-10-19,36.6853
2018-10-22,35.9421
2018-10-23,36.7844
2018-10-24,36.3583
2018-10-25,35.07
2018-10-26,34.8421
2018-10-29,35.1592
2018-10-30,35.288
2018-10-31,35.0403
2018-11-01,36.715
2018-11-02,36.9231
2018-11-05,35.9916
2018-11-06,35.6646
2018-11-07,35.3574
2018-11-08,35.1988
2018-11-09,33.9304
2018-11-12,33.6926
2018-11-13,33.2863
2018-11-14,34.5646
2018-11-15,34.9808
2018-11-16,35.6943
2018-11-19,35.397
2018-11-20,35.5457
2018-11-21,36.9429
2018-11-23,35.615
2018-11-26,35.3673
2018-11-27,34.6241
2018-11-28,35.1691
2018-11-29,34.692
2018-11-30,34.9106
2018-12-03,35.6363
2018-12-04,36.4713
2018-12-06,38.1214
2018-12-07,39.682
2018-12-10,38.9663
2018-12-11,38.8172
2018-12-12,39.2447
2018-12-13,39.7814
2018-12-14,38.5687
2018-12-17,39.195
2018-12-18,40.0796
2018-12-19,37.9723
2018-12-20,40.1592
2018-12-21,39.4534
2018-12-24,40.4971
2018-12-26,39.5528
2018-12-27,40.6463
2018-12-28,40.0399
2018-12-31,40.1592
2019-01-02,40.1294
2019-01-03,41.024
2019-01-04,40.2486
2019-01-07,39.5627
2019-01-08,39.3838
2019-01-09,40.2089
2019-01-10,39.4037
2019-01-11,39.5627
2019-01-14,39.6125
2019-01-15,38.9067
2019-01-16,39.0458
2019-01-17,39.2248
2019-01-18,38.7576
2019-01-22,39.0359
2019-01-23,38.9365
2019-01-24,39.3639
2019-01-25,41.0538
2019-01-28,41.2725
2019-01-29,42.1572
2019-01-30,42.6343
2019-01-31,43.3202
2019-02-01,43.0121
2019-02-04,43.3003
2019-02-05,43.4693
2019-02-06,42.7238
2019-02-07,42.5946
2019-02-08,43.0916
2019-02-11,42.2964
2019-02-12,41.7596
2019-02-13,41.3719
2019-02-14,41.6105
2019-02-15,42.8828
2019-02-19,43.0419
2019-02-20,43.4793
2019-02-21,43.1115
2019-02-22,43.3003
2019-02-25,42.9723
2019-02-26,43.0021
2019-02-27,42.2566
2019-02-28,42.3313
2019-03-01,42.112
2019-03-04,42.3912
2019-03-05,42.4909
2019-03-06,41.4939
2019-03-07,42.1619
2019-03-08,43.4878
2019-03-11,43.2087
2019-03-12,44.2954
2019-03-13,44.5346
2019-03-14,43.4878
2019-03-15,43.5776
2019-03-18,43.0791
2019-03-19,43.1289
2019-03-20,44.2655
2019-03-21,44.2455
2019-03-22,44.1558
2019-03-25,45.0032
2019-03-26,45.422
2019-03-27,44.4649
2019-03-28,43.3981
2019-03-29,43.3682
2019-04-01,42.76
2019-04-02,43.0791
2019-04-03,42.6504
2019-04-04,43.5676
2019-04-05,43.3183
2019-04-08,43.6274
2019-04-09,43.5576
2019-04-10,42.9395
2019-04-11,42.2815
2019-04-12,42.122
2019-04-15,42.78
2019-04-16,41.5736
2019-04-17,40.7362
2019-04-18,40.2776
2019-04-22,40.0483
2019-04-23,40.0084
2019-04-24,40.477
2019-04-25,40.4969
2019-04-26,42.1419
2019-04-29,41.1948
2019-04-30,41.2845
2019-05-01,40.8259
2019-05-02,40.1779
2019-05-03,40.9456
2019-05-06,40.7561
2019-05-07,41.5437
2019-05-08,40.6963
2019-05-09,40.6066
2019-05-10,40.2776
2019-05-13,41.4042
2019-05-14,41.3942
2019-05-15,40.9655
2019-05-16,40.6265
2019-05-17,40.9854
2019-05-20,41.2048
2019-05-21,40.796
2019-05-22,40.2078
2019-05-23,40.7661
2019-05-24,41.0153
2019-05-28,41.0054
2019-05-29,41.135
2019-05-30,41.94
2019-05-31,43.59
2019-06-03,45.15
2019-06-04,45.27
2019-06-05,45.89
2019-06-06,46.21
2019-06-07,46.14
2019-06-10,45.86
2019-06-11,46.09
2019-06-12,46.5
2019-06-13,46.65
2019-06-14,46.24
2019-06-17,46.975
2019-06-18,47.715
2019-06-19,48.5
2019-06-20,49.805
2019-06-21,50.3
2019-06-24,52.32
2019-06-25,51.27
2019-06-26,51.29
2019-06-27,50.97
2019-06-28,50.95
2019-07-01,50.19
2019-07-02,51.49
2019-07-03,51.94
2019-07-04,51.94
2019-07-05,51.65
2019-07-08,51.34
2019-07-09,51.63
2019-07-10,51.89
2019-07-11,51.89
2019-07-12,51.95
2019-07-15,51.815
2019-07-16,51.61
2019-07-17,52.78
2019-07-18,54.07
2019-07-19,53.53
2019-07-22,53.62
2019-07-23,53.185
2019-07-24,53.66
2019-07-25,53.87
2019-07-26,53.81
2019-07-29,54.34
2019-07-30,54.14
2019-07-31,52.25
2019-08-01,54.31
2019-08-02,54.08
2019-08-05,56.235
2019-08-06,56.68
2019-08-07,58.39
2019-08-08,59.255
2019-08-09,59.295
2019-08-12,59.8
2019-08-13,58.755
2019-08-14,58.5
2019-08-15,59.11
2019-08-16,59.105
2019-08-19,58.5
2019-08-20,59.45
2019-08-21,59.56
2019-08-22,59.38
2019-08-23,61.515
2019-08-26,62.11
2019-08-27,64.06
2019-08-28,63.98
2019-08-29,61.88
2019-08-30,62.52
2019-09-02,62.59
2019-09-03,63.3
2019-09-04,64.035
2019-09-05,61.3
2019-09-06,59.645
2019-09-09,57.83
2019-09-10,56.62
2019-09-11,57.09
2019-09-12,56.635
2019-09-13,55.22
2019-09-16,55.815
2019-09-17,57.645
2019-09-18,56.76
2019-09-19,57.1
2019-09-20,58.18
2019-09-23,59.505
2019-09-24,59.905
2019-09-25,58.48
2019-09-26,58.075
2019-09-27,55.375
2019-09-30,53.555
2019-10-01,53.19
2019-10-02,53.38
2019-10-03,53.45
2019-10-04,54.25
2019-10-07,54.075
2019-10-08,54.92
2019-10-09,54.665
2019-10-10,55.045
2019-10-11,52.125
2019-10-14,52.715
2019-10-15,51.755
2019-10-16,52.26
2019-10-17,53.625
2019-10-18,54.275
2019-10-21,53.035
2019-10-22,53.045
2019-10-23,54.165
2019-10-24,57.655
2019-10-25,58.655
2019-10-28,58.355
2019-10-29,59.345
2019-10-30,59.725
2019-10-31,61.425
2019-11-01,60.12
2019-11-04,59.72
2019-11-05,59.085
2019-11-06,59.48
2019-11-07,58.44
2019-11-08,57.655
2019-11-11,57.945
2019-11-12,58.015
2019-11-13,58.995
2019-11-14,59.155
2019-11-15,58.575
2019-11-18,59.365
2019-11-19,60.135
2019-11-20,60.51
2019-11-21,60.23
2019-11-22,59.975
2019-11-25,58.195
