date,close
2014-06-13,16.9243
2014-06-16,16.9996
2014-06-17,16.8565
2014-06-18,16.8264
2014-06-19,16.5855
2014-06-20,16.593
2014-06-23,16.5403
2014-06-24,16.6156
2014-06-25,16.5704
2014-06-26,16.6834
2014-06-27,16.7962
2014-06-30,16.9167
2014-07-01,16.9544
2014-07-02,17.0146
2014-07-03,17.12
2014-07-07,17.0146
2014-07-08,17.0146
2014-07-09,16.8189
2014-07-10,16.7059
2014-07-11,16.9167
2014-07-14,17.1125
2014-07-15,17.0824
2014-07-16,17.1125
2014-07-17,16.8791
2014-07-18,17.0297
2014-07-21,17.0673
2014-07-22,17.4061
2014-07-23,17.4061
2014-07-24,17.7901
2014-07-25,17.9707
2014-07-28,18.5053
2014-07-29,18.5203
2014-07-30,18.3547
2014-07-31,18.5429
2014-08-01,18.5128
2014-08-04,18.8817
2014-08-05,18.6784
2014-08-06,18.6107
2014-08-07,18.3773
2014-08-08,18.6032
2014-08-11,18.8592
2014-08-12,18.8516
2014-08-13,18.8365
2014-08-14,18.6182
2014-08-15,18.7914
2014-08-18,18.9796
2014-08-19,18.9871
2014-08-20,18.8215
2014-08-21,18.6709
2014-08-22,18.7311
2014-08-25,18.6032
2014-08-26,18.5053
2014-08-27,18.5128
2014-08-28,18.3396
2014-08-29,18.543
2014-09-02,18.9495
2014-09-03,19.3108
2014-09-04,19.3635
2014-09-05,19.6045
2014-09-08,19.5593
2014-09-09,19.4614
2014-09-10,19.3635
2014-09-11,19.356
2014-09-12,19.3786
2014-09-15,19.2732
2014-09-16,19.1377
2014-09-17,19.0323
2014-09-18,19.1076
2014-09-19,19.1
2014-09-22,18.686
2014-09-23,18.8516
2014-09-24,19.4012
2014-09-25,19.1753
2014-09-26,19.2807
2014-09-29,19.085
2014-09-30,19.4012
2014-10-01,19.228
2014-10-02,19.1603
2014-10-03,19.341
2014-10-06,19.5518
2014-10-07,19.3711
2014-10-08,19.7626
2014-10-09,19.4689
2014-10-10,19.3034
2014-10-13,19.2958
2014-10-14,19.3033
2014-10-15,19.4238
2014-10-16,19.2732
2014-10-17,19.3937
2014-10-20,19.4614
2014-10-21,19.4162
2014-10-22,19.1753
2014-10-23,18.9871
2014-10-24,19.0021
2014-10-27,18.7311
2014-10-28,19.2958
2014-10-29,19.4614
2014-10-30,19.6421
2014-10-31,20.0035
2014-11-03,19.9809
2014-11-04,19.9884
2014-11-05,19.9282
2014-11-06,19.9056
2014-11-07,19.8579
2014-11-10,20.3874
2014-11-11,20.5004
2014-11-12,20.6585
2014-11-13,20.5907
2014-11-14,21.2683
2014-11-17,20.6509
2014-11-18,20.4627
2014-11-19,20.5756
2014-11-20,20.5004
2014-11-21,21.5393
2014-11-24,21.9835
2014-11-25,22.3373
2014-11-26,22.2771
2014-11-28,22.8116
2014-12-01,21.9985
2014-12-02,23.2709
2014-12-03,24.2496
2014-12-04,26.192
2014-12-05,25.9661
2014-12-08,26.463
2014-12-09,24.5206
2014-12-10,25.0627
2014-12-11,25.6424
2014-12-12,25.1681
2014-12-15,25.2584
2014-12-16,26.192
2014-12-17,27.0276
2014-12-18,26.7641
2014-12-19,26.9392
2014-12-22,26.7278
2014-12-23,25.7236
2014-12-24,25.565
2014-12-26,27.3016
2014-12-29,27.143
2014-12-30,27.3544
2014-12-31,28.0944
2015-01-02,28.1472
2015-01-05,28.2831
2015-01-06,28.3737
2015-01-07,28.6984
2015-01-08,27.9509
2015-01-09,27.9056
2015-01-12,27.4752
2015-01-13,27.4299
2015-01-14,27.2487
2015-01-15,28.1699
2015-01-16,27.3846
2015-01-20,26.3503
2015-01-21,27.898
2015-01-22,27.9358
2015-01-23,27.8452
2015-01-26,28.0566
2015-01-27,27.6036
2015-01-28,26.7504
2015-01-29,26.9845
2015-01-30,25.5952
2015-02-02,26.1011
2015-02-03,27.1279
2015-02-04,27.4299
2015-02-05,26.3578
2015-02-06,25.4216
2015-02-09,25.7538
2015-02-10,26.3578
2015-02-11,26.3352
2015-02-12,26.7127
2015-02-13,26.9316
2015-02-17,27.3167
2015-02-18,27.211
2015-02-19,27.1053
2015-02-20,27.2185
2015-02-23,27.1808
2015-02-24,27.4903
2015-02-25,26.8108
2015-02-26,27.5885
2015-02-27,27.445
2015-03-02,27.7319
2015-03-03,26.992
2015-03-04,26.9467
2015-03-05,26.7655
2015-03-06,26.4258
2015-03-09,27.0071
2015-03-10,26.7353
2015-03-11,27.0524
2015-03-12,27.664
2015-03-13,27.6791
2015-03-16,28.7663
2015-03-17,29.3099
2015-03-18,30.148
2015-03-19,29.9744
2015-03-20,30.601
2015-03-23,30.8124
2015-03-24,30.7822
2015-03-25,30.3292
2015-03-26,30.5029
2015-03-27,30.9408
2015-03-30,32.3829
2015-03-31,31.4391
2015-04-01,32.2394
2015-04-02,31.9525
2015-04-06,32.8132
2015-04-07,33.153
2015-04-08,33.3569
2015-04-09,32.6622
2015-04-10,33.976
2015-04-13,33.9911
2015-04-14,34.2402
2015-04-15,33.8174
2015-04-16,35.335
2015-04-17,33.5834
2015-04-20,35.0632
2015-04-21,35.8258
2015-04-22,37.1773
2015-04-23,36.6789
2015-04-24,36.7167
2015-04-27,37.2981
2015-04-28,36.8828
2015-04-29,36.9583
2015-04-30,36.8149
2015-05-01,37.064
2015-05-04,37.4642
2015-05-05,35.5691
2015-05-06,34.8744
2015-05-07,34.6706
2015-05-08,35.5766
2015-05-11,36.3014
2015-05-12,36.6487
2015-05-13,36.2108
2015-05-14,36.7318
2015-05-15,36.0296
2015-05-18,35.5842
2015-05-19,37.2377
2015-05-20,37.2226
2015-05-21,38.0757
2015-05-22,39.3291
2015-05-26,40.4692
2015-05-27,40.2049
2015-05-28,37.8794
2015-05-29,37.7133
2015-06-01,39.7368
2015-06-02,40.4692
2015-06-03,39.9859
2015-06-04,39.9104
2015-06-05,39.9859
2015-06-08,41.3148
2015-06-09,40.5447
2015-06-10,40.8618
2015-06-11,41.1562
2015-06-12,41.6545
2015-06-15,40.1747
2015-06-16,39.0724
2015-06-17,39.7141
2015-06-18,38.5816
2015-06-19,36.4222
2015-06-22,36.7016
2015-06-23,37.6378
2015-06-24,38.0455
2015-06-25,36.0976
2015-06-26,32.4659
2015-06-29,32.5565
2015-06-30,34.7385
2015-07-01,33.372
2015-07-02,32.028
2015-07-06,31.2126
2015-07-07,28.8494
2015-07-08,25.5877
2015-07-09,30.7218
2015-07-10,32.6547
2015-07-13,32.3602
2015-07-14,31.7638
2015-07-15,30.3821
2015-07-16,31.794
2015-07-17,32.8132
2015-07-20,32.1413
2015-07-21,32.4584
2015-07-22,32.481
2015-07-23,33.4475
2015-07-24,32.549
2015-07-27,29.5666
2015-07-28,30.1556
2015-07-29,30.9936
2015-07-30,30.0725
2015-07-31,29.8234
2015-08-03,29.6874
2015-08-04,31.0087
2015-08-05,30.3821
2015-08-06,29.9366
2015-08-07,30.5255
2015-08-10,32.3074
2015-08-11,31.0993
2015-08-12,30.1782
2015-08-13,30.7747
2015-08-14,30.7822
2015-08-17,30.5708
2015-08-18,28.4115
2015-08-19,28.5172
2015-08-20,27.6791
2015-08-21,26.3276
2015-08-24,22.7337
2015-08-25,22.7488
2015-08-26,22.9074
2015-08-27,24.8704
2015-08-28,24.6892
2015-08-31,24.1833
2015-09-01,23.4736
2015-09-02,23.602
2015-09-03,23.8134
2015-09-04,22.7337
2015-09-08,25.3687
2015-09-09,24.5458
2015-09-10,25.1271
2015-09-11,25.1649
2015-09-14,23.9191
2015-09-15,23.5944
2015-09-16,25.0214
2015-09-17,24.4098
2015-09-18,23.8587
2015-09-21,24.8931
2015-09-22,24.6062
2015-09-23,24.5609
2015-09-24,24.6892
2015-09-25,24.0701
2015-09-28,23.987
2015-09-29,24.2286
2015-09-30,24.4174
2015-10-01,24.6062
2015-10-02,25.2177
2015-10-05,25.5575
2015-10-06,25.3612
2015-10-07,26.0633
2015-10-08,25.716
2015-10-09,25.3838
2015-10-12,26.3125
2015-10-13,26.1917
2015-10-14,25.7991
2015-10-15,27.0071
2015-10-16,27.3242
2015-10-19,26.8712
2015-10-20,27.3771
2015-10-21,26.1313
2015-10-22,27.1355
2015-10-23,27.8603
2015-10-26,27.1204
2015-10-27,26.9694
2015-10-28,26.388
2015-10-29,26.7278
2015-10-30,26.8184
2015-11-02,26.539
2015-11-03,26.3654
2015-11-04,27.5205
2015-11-05,28.0113
2015-11-06,28.6984
2015-11-09,28.5927
2015-11-10,28.8192
2015-11-11,28.9173
2015-11-12,28.2529
2015-11-13,27.3167
2015-11-16,28.6531
2015-11-17,28.3511
2015-11-18,28.2907
2015-11-19,28.6757
2015-11-20,28.5851
2015-11-23,28.2378
2015-11-24,28.3209
2015-11-25,28.5776
2015-11-27,26.5013
2015-11-30,27.1204
2015-12-01,27.0524
2015-12-02,27.8376
2015-12-03,27.9131
2015-12-04,27.7999
2015-12-07,27.3846
2015-12-08,26.9543
2015-12-09,26.8108
2015-12-10,26.841
2015-12-11,26.3578
2015-12-14,27.3771
2015-12-15,27.4073
2015-12-16,27.5611
2015-12-17,27.5125
2015-12-18,27.8041
2015-12-21,28.5721
2015-12-22,28.9318
2015-12-23,28.5721
2015-12-24,28.2708
2015-12-28,27.3861
2015-12-29,27.6194
2015-12-30,27.5125
2015-12-31,27.2014
2016-01-04,24.8876
2016-01-05,25.2376
2016-01-06,25.0334
2016-01-07,23.4585
2016-01-08,23.5849
2016-01-11,23.0113
2016-01-12,23.5168
2016-01-13,22.3114
2016-01-14,23.2835
2016-01-15,22.0391
2016-01-19,23.1669
2016-01-20,22.6808
2016-01-21,22.4669
2016-01-22,22.7877
2016-01-25,22.1753
2016-01-26,21.3975
2016-01-27,21.0184
2016-01-28,20.6878
2016-01-29,21.5531
2016-02-01,20.8337
2016-02-02,21.135
2016-02-03,21.5433
2016-02-04,21.7183
2016-02-05,21.0378
2016-02-08,20.8434
2016-02-09,20.7364
2016-02-10,20.9698
2016-02-11,20.4934
2016-02-12,20.9017
2016-02-16,22.3697
2016-02-17,22.778
2016-02-18,22.3988
2016-02-19,22.4766
2016-02-22,23.1474
2016-02-23,22.4863
2016-02-24,22.8655
2016-02-25,21.5433
2016-02-26,21.6794
2016-02-29,21.1545
2016-03-01,21.835
2016-03-02,22.4475
2016-03-03,22.5447
2016-03-04,23.2155
2016-03-07,22.8558
2016-03-08,22.5155
2016-03-09,22.4377
2016-03-10,21.903
2016-03-11,22.4669
2016-03-14,22.7197
2016-03-15,22.5544
2016-03-16,23.128
2016-03-17,23.4877
2016-03-18,24.0029
2016-03-21,24.3626
2016-03-22,23.8668
2016-03-23,23.7891
2016-03-24,23.2641
2016-03-28,23.4099
2016-03-29,23.2446
2016-03-30,24.1488
2016-03-31,23.8668
2016-04-01,24.0127
2016-04-04,23.8085
2016-04-05,24.0224
2016-04-06,24.2946
2016-04-07,23.478
2016-04-08,23.6821
2016-04-11,23.9446
2016-04-12,24.0515
2016-04-13,24.489
2016-04-14,24.3432
2016-04-15,24.1682
2016-04-18,24.1099
2016-04-19,24.1876
2016-04-20,23.5168
2016-04-21,23.1085
2016-04-22,23.3127
2016-04-25,23.196
2016-04-26,23.5266
2016-04-27,23.4294
2016-04-28,23.1863
2016-04-29,23.2544
2016-05-02,23.2835
2016-05-03,23.4488
2016-05-04,23.3419
2016-05-05,23.4682
2016-05-06,22.778
2016-05-09,22.0878
2016-05-10,22.5738
2016-05-11,22.3114
2016-05-12,22.4183
2016-05-13,22.1655
2016-05-16,22.5836
2016-05-17,22.3016
2016-05-18,22.1169
2016-05-19,22.0878
2016-05-20,22.4669
2016-05-23,22.3891
2016-05-24,22.6225
2016-05-25,22.4183
2016-05-26,22.3988
2016-05-27,22.4961
2016-05-31,23.546
2016-06-01,23.1377
2016-06-02,23.3516
2016-06-03,23.6141
2016-06-06,23.5266
2016-06-07,23.4099
2016-06-08,23.2446
2016-06-09,23.1571
2016-06-10,22.7245
2016-06-13,22.1655
2016-06-14,22.4572
2016-06-15,22.5058
2016-06-16,22.6322
2016-06-17,22.778
2016-06-20,22.8169
2016-06-21,22.7002
2016-06-22,22.9822
2016-06-23,23.1183
2016-06-24,22.2822
2016-06-27,22.4669
2016-06-28,22.7488
2016-06-29,23.0988
2016-06-30,23.0988
2016-07-01,22.9335
2016-07-05,23.1766
2016-07-06,23.4196
2016-07-07,23.2932
2016-07-08,23.4391
2016-07-11,23.4099
2016-07-12,24.1002
2016-07-13,24.1196
2016-07-14,24.0321
2016-07-15,23.9349
2016-07-18,23.7696
2016-07-19,23.6043
2016-07-20,23.7988
2016-07-21,23.7696
2016-07-22,23.6627
2016-07-25,23.6043
2016-07-26,24.0321
2016-07-27,23.546
2016-07-28,23.653
2016-07-29,23.6141
2016-08-01,23.1863
2016-08-02,23.3807
2016-08-03,23.4974
2016-08-04,23.546
2016-08-05,23.5849
2016-08-08,23.7307
2016-08-09,24.0127
2016-08-10,23.8668
2016-08-11,23.8863
2016-08-12,24.3335
2016-08-15,25.2959
2016-08-16,25.189
2016-08-17,24.9362
2016-08-18,24.9557
2016-08-19,24.8001
2016-08-22,24.6543
2016-08-23,24.664
2016-08-24,24.5376
2016-08-25,24.3724
2016-08-26,24.2071
2016-08-29,24.3724
2016-08-30,24.3238
2016-08-31,24.4501
2016-09-01,24.2654
2016-09-02,24.421
2016-09-06,24.6348
2016-09-07,24.5474
2016-09-08,24.5668
2016-09-09,24.0418
2016-09-12,23.9835
2016-09-13,23.7113
2016-09-14,23.6724
2016-09-15,23.9252
2016-09-16,23.964
2016-09-19,24.0029
2016-09-20,23.9057
2016-09-21,24.1488
2016-09-22,24.2071
2016-09-23,23.9154
2016-09-26,23.4488
2016-09-27,23.6918
2016-09-28,23.7891
2016-09-29,23.7502
2016-09-30,23.896
2016-10-03,23.8668
2016-10-04,23.7599
2016-10-05,23.8377
2016-10-06,23.8863
2016-10-07,23.9738
2016-10-10,24.0613
2016-10-11,23.9252
2016-10-12,23.964
2016-10-13,23.8668
2016-10-14,24.0127
2016-10-17,23.7016
2016-10-18,24.1682
2016-10-19,24.0613
2016-10-20,24.071
2016-10-21,24.0127
2016-10-24,24.3335
2016-10-25,24.2071
2016-10-26,24.1099
2016-10-27,23.9835
2016-10-28,23.964
2016-10-31,23.9543
2016-11-01,24.1293
2016-11-02,23.9543
2016-11-03,24.2071
2016-11-04,24.0515
2016-11-07,24.2071
2016-11-08,24.2849
2016-11-09,24.2071
2016-11-10,24.1002
2016-11-11,24.4112
2016-11-14,24.3335
2016-11-15,24.3724
2016-11-16,24.2265
2016-11-17,24.3821
2016-11-18,24.139
2016-11-21,24.4404
2016-11-22,24.7029
2016-11-23,24.5474
2016-11-25,24.9848
2016-11-28,25.014
2016-11-29,25.4029
2016-11-30,25.1598
2016-12-01,25.4515
2016-12-02,25.2084
2016-12-05,24.839
2016-12-06,24.6446
2016-12-07,24.8682
2016-12-08,24.5765
2016-12-09,24.7321
2016-12-12,23.9154
2016-12-13,23.9446
2016-12-14,23.5849
2016-12-15,23.3807
2016-12-16,23.2835
2016-12-19,23.2835
2016-12-20,23.128
2016-12-21,23.3644
2016-12-22,23.2763
2016-12-23,23.0315
2016-12-27,23.2371
2016-12-28,22.9727
2016-12-29,23.051
2016-12-30,22.9629
2017-01-03,23.3938
2017-01-04,23.9617
2017-01-05,24.1478
2017-01-06,23.7463
2017-01-09,23.7757
2017-01-10,23.8344
2017-01-11,23.5896
2017-01-12,23.6582
2017-01-13,23.7757
2017-01-17,24.0009
2017-01-18,23.9226
2017-01-19,23.8442
2017-01-20,24.1576
2017-01-23,24.2555
2017-01-24,24.2261
2017-01-25,24.3338
2017-01-26,24.3338
2017-01-27,24.3926
2017-01-30,24.3632
2017-01-31,24.4318
2017-02-01,24.3926
2017-02-02,24.4611
2017-02-03,24.2653
2017-02-06,24.2261
2017-02-07,24.0205
2017-02-08,24.1674
2017-02-09,24.2359
2017-02-10,24.3828
2017-02-13,24.4905
2017-02-14,24.5297
2017-02-15,24.4122
2017-02-16,24.6374
2017-02-17,24.4122
2017-02-21,24.9116
2017-02-22,24.9703
2017-02-23,24.8724
2017-02-24,24.8137
2017-02-27,24.6178
2017-02-28,24.6374
2017-03-01,24.7647
2017-03-02,24.3142
2017-03-03,24.373
2017-03-06,24.4122
2017-03-07,24.4905
2017-03-08,24.2947
2017-03-09,24.0792
2017-03-10,24.2261
2017-03-13,24.373
2017-03-14,24.3045
2017-03-15,24.7451
2017-03-16,24.892
2017-03-17,24.4415
2017-03-20,24.5133
2017-03-21,24.5884
2017-03-22,24.6864
2017-03-23,24.6864
2017-03-24,24.8724
2017-03-27,24.8626
2017-03-28,24.6864
2017-03-29,24.6472
2017-03-30,24.373
2017-03-31,24.608
2017-04-03,24.6961
2017-04-04,24.7647
2017-04-05,24.9703
2017-04-06,24.9214
2017-04-07,24.9116
2017-04-10,24.7059
2017-04-11,24.8528
2017-04-12,24.8724
2017-04-13,24.8724
2017-04-17,24.608
2017-04-18,24.4415
2017-04-19,24.2947
2017-04-20,24.5884
2017-04-21,24.5101
2017-04-24,24.2653
2017-04-25,24.3534
2017-04-26,24.324
2017-04-27,24.324
2017-04-28,24.3045
2017-05-01,24.324
2017-05-02,24.2163
2017-05-03,24.1282
2017-05-04,23.9911
2017-05-05,23.8344
2017-05-08,23.5407
2017-05-09,23.6484
2017-05-10,23.5211
2017-05-11,23.6386
2017-05-12,24.0107
2017-05-15,24.1184
2017-05-16,24.324
2017-05-17,24.089
2017-05-18,24.0205
2017-05-19,24.1674
2017-05-22,24.1184
2017-05-23,24.2457
2017-05-24,24.3045
2017-05-25,24.9703
2017-05-26,24.941
2017-05-30,25.078
2017-05-31,25.2053
2017-06-01,25.2249
2017-06-02,25.0683
2017-06-05,24.9507
2017-06-06,25.2543
2017-06-07,25.5187
2017-06-08,25.8516
2017-06-09,25.9104
2017-06-12,25.7733
2017-06-13,25.9398
2017-06-14,25.6362
2017-06-15,25.4795
2017-06-16,25.4306
2017-06-19,25.6656
2017-06-20,25.5481
2017-06-21,25.8614
2017-06-22,25.8712
2017-06-23,26.165
2017-06-26,26.4881
2017-06-27,26.5175
2017-06-28,26.5077
2017-06-29,26.5273
2017-06-30,26.6938
2017-07-03,26.4881
2017-07-05,26.5959
2017-07-06,26.5273
2017-07-07,26.5959
2017-07-10,26.5665
2017-07-11,26.8309
2017-07-12,26.87
2017-07-13,27.0071
2017-07-14,27.2813
2017-07-17,26.7819
2017-07-18,26.8407
2017-07-19,27.4184
2017-07-20,27.4869
2017-07-21,27.3596
2017-07-24,27.5359
2017-07-25,27.3792
2017-07-26,27.2911
2017-07-27,27.3205
2017-07-28,27.4478
2017-07-31,27.624
2017-08-01,27.3401
2017-08-02,27.7905
2017-08-03,27.5457
2017-08-04,27.3401
2017-08-07,27.4967
2017-08-08,27.6338
2017-08-09,27.6142
2017-08-10,27.2617
2017-08-11,26.8504
2017-08-14,27.2813
2017-08-15,27.2715
2017-08-16,27.438
2017-08-17,27.3792
2017-08-18,27.5653
2017-08-21,27.7807
2017-08-22,27.8884
2017-08-23,27.8297
2017-08-24,27.7415
2017-08-25,28.4466
2017-08-28,28.9166
2017-08-29,28.8579
2017-08-30,28.7991
2017-08-31,28.7991
2017-09-01,29.1516
2017-09-05,29.3279
2017-09-06,29.3769
2017-09-07,29.3671
2017-09-08,29.2398
2017-09-11,29.1614
2017-09-12,29.23
2017-09-13,29.1614
2017-09-14,29.0243
2017-09-15,29.1614
2017-09-18,29.0831
2017-09-19,28.8579
2017-09-20,28.9362
2017-09-21,29.0145
2017-09-22,28.9166
2017-09-25,28.3585
2017-09-26,28.4368
2017-09-27,28.3878
2017-09-28,28.3389
2017-09-29,28.5837
2017-10-02,28.6522
2017-10-03,29.3279
2017-10-04,29.4062
2017-10-05,29.465
2017-10-06,29.3377
2017-10-09,29.1516
2017-10-10,29.4454
2017-10-11,29.5433
2017-10-12,29.6119
2017-10-13,29.7588
2017-10-16,29.5629
2017-10-17,29.3964
2017-10-18,29.6706
2017-10-19,29.3475
2017-10-20,29.4454
2017-10-23,29.2691
2017-10-24,29.6315
2017-10-25,29.6608
2017-10-26,29.8371
2017-10-27,30.1504
2017-10-30,29.8763
2017-10-31,29.984
2017-11-01,30.0329
2017-11-02,29.9546
2017-11-03,29.7881
2017-11-06,30.1896
2017-11-07,30.3561
2017-11-08,30.219
2017-11-09,30.3365
2017-11-10,30.738
2017-11-13,30.8261
2017-11-14,30.5421
2017-11-15,30.3071
2017-11-16,30.7772
2017-11-17,30.7282
2017-11-20,30.9338
2017-11-21,31.776
2017-11-22,31.7466
2017-11-24,30.8751
2017-11-27,30.3757
2017-11-28,30.4834
2017-11-29,30.1407
2017-11-30,29.9252
2017-12-01,29.6119
2017-12-04,29.8959
2017-12-05,30.1211
2017-12-06,29.7686
2017-12-07,29.5042
2017-12-08,29.8567
2017-12-11,30.454
2017-12-12,29.9252
2017-12-13,30.3757
2017-12-14,30.1309
2017-12-15,29.8077
2017-12-18,29.749
2017-12-19,30.1361
2017-12-20,30.2447
2017-12-21,30.6892
2017-12-22,30.5707
2017-12-26,30.6892
2017-12-27,30.1064
2017-12-28,30.5015
2017-12-29,30.6497
2018-01-02,31.2226
2018-01-03,31.5288
2018-01-04,31.6374
2018-01-05,31.756
2018-01-08,31.7658
2018-01-09,31.7362
2018-01-10,31.9239
2018-01-11,32.1116
2018-01-12,32.5067
2018-01-16,32.6449
2018-01-17,32.7931
2018-01-18,32.9709
2018-01-19,33.3462
2018-01-22,33.7315
2018-01-23,33.9586
2018-01-24,34.2648
2018-01-25,34.0574
2018-01-26,34.4229
2018-01-29,33.4648
2018-01-30,33.1487
2018-01-31,33.5635
2018-02-01,33.0795
2018-02-02,32.9808
2018-02-05,32.7042
2018-02-06,32.6647
2018-02-07,31.1633
2018-02-08,30.1855
2018-02-09,29.4051
2018-02-12,30.3139
2018-02-13,30.6695
2018-02-14,31.2325
2018-02-15,31.835
2018-02-16,31.835
2018-02-20,31.2028
2018-02-21,31.4004
2018-02-22,31.5881
2018-02-23,31.7856
2018-02-26,32.477
2018-02-27,31.2621
2018-02-28,30.9164
2018-03-01,30.9263
2018-03-02,31.2522
2018-03-05,31.2917
2018-03-06,31.7165
2018-03-07,31.5288
2018-03-08,31.6572
2018-03-09,32.24
2018-03-12,32.1708
2018-03-13,31.5387
2018-03-14,31.6868
2018-03-15,31.7856
2018-03-16,31.5584
2018-03-19,31.5288
2018-03-20,31.7856
2018-03-21,31.5189
2018-03-22,30.6892
2018-03-23,29.8299
2018-03-26,30.6398
2018-03-27,30.304
2018-03-28,29.8299
2018-03-29,30.8966
2018-04-02,30.1756
2018-04-03,30.5509
2018-04-04,30.5608
2018-04-05,30.6892
2018-04-06,29.9089
2018-04-09,29.9484
2018-04-10,30.9658
2018-04-11,31.0053
2018-04-12,30.8769
2018-04-13,30.3139
2018-04-16,29.9484
2018-04-17,29.7311
2018-04-18,29.7706
2018-04-19,29.8595
2018-04-20,29.2866
2018-04-23,29.336
2018-04-24,29.9978
2018-04-25,29.82
2018-04-26,29.4446
2018-04-27,29.3459
2018-04-30,29.4348
2018-05-01,29.3261
2018-05-02,29.0199
2018-05-03,29.3261
2018-05-04,29.3064
2018-05-07,29.6718
2018-05-08,29.9879
2018-05-09,30.0867
2018-05-10,30.5608
2018-05-11,30.2447
2018-05-14,30.5806
2018-05-15,30.1459
2018-05-16,30.4028
2018-05-17,29.9286
2018-05-18,30.1558
2018-05-21,30.5312
2018-05-22,30.3435
2018-05-23,29.7706
2018-05-24,29.6422
2018-05-25,29.4743
2018-05-29,28.9804
2018-05-30,28.931
2018-05-31,29.2372
2018-06-01,29.1977
2018-06-04,29.3953
2018-06-05,29.6718
2018-06-06,29.8397
2018-06-07,29.5039
2018-06-08,29.2273
2018-06-11,29.2866
2018-06-12,29.4743
2018-06-13,29.1384
2018-06-14,29.0496
2018-06-15,28.7038
2018-06-18,28.368
2018-06-19,27.3803
2018-06-20,27.5383
2018-06-21,27.0049
2018-06-22,27.2914
2018-06-25,26.6592
2018-06-26,26.3629
2018-06-27,25.5727
2018-06-28,25.711
2018-06-29,26.2048
2018-07-02,25.1381
2018-07-03,25.0887
2018-07-05,24.8516
2018-07-06,25.0788
2018-07-09,25.9974
2018-07-10,25.9579
2018-07-11,25.0591
2018-07-12,25.9974
2018-07-13,25.869
2018-07-16,25.7406
2018-07-17,25.6715
2018-07-18,25.4542
2018-07-19,24.98
2018-07-20,25.8196
2018-07-23,25.7801
2018-07-24,26.5802
2018-07-25,26.679
2018-07-26,25.9875
2018-07-27,25.8394
2018-07-30,25.79
2018-07-31,26.1752
2018-08-01,25.1282
2018-08-02,24.5948
2018-08-03,24.3578
2018-08-06,23.8836
2018-08-07,24.8911
2018-08-08,24.2985
2018-08-09,25.0591
2018-08-10,24.6936
2018-08-13,24.5257
2018-08-14,24.5849
2018-08-15,23.5083
2018-08-16,23.9824
2018-08-17,24.1602
2018-08-20,23.9923
2018-08-21,24.6245
2018-08-22,24.2886
2018-08-23,24.0219
2018-08-24,24.664
2018-08-27,25.1875
2018-08-28,25.0196
2018-08-29,24.9702
2018-08-30,24.2392
2018-08-31,24.4368
2018-09-04,24.5257
2018-09-05,24.0614
2018-09-06,24.0318
2018-09-07,23.7552
2018-09-10,23.5379
2018-09-11,23.2712
2018-09-12,23.7849
2018-09-13,23.933
2018-09-14,23.449
2018-09-17,23.3799
2018-09-18,24.0318
2018-09-19,24.4269
2018-09-20,24.5059
2018-09-21,24.9899
2018-09-24,24.6837
2018-09-25,24.7331
2018-09-26,25.0788
2018-09-27,24.8516
2018-09-28,25.0393
2018-10-01,25.0887
2018-10-02,24.5751
2018-10-03,24.4664
2018-10-04,23.8738
2018-10-05,24.2392
2018-10-08,23.7651
2018-10-09,23.6861
2018-10-10,23.1725
2018-10-11,22.8465
2018-10-12,23.1428
2018-10-15,22.728
2018-10-16,22.8564
2018-10-17,22.4119
2018-10-18,21.7501
2018-10-19,22.5798
2018-10-22,23.6268
2018-10-23,23.1428
2018-10-24,22.6984
2018-10-25,23.3108
2018-10-26,22.9947
2018-10-29,21.9773
2018-10-30,22.4317
2018-10-31,22.9453
2018-11-01,23.8441
2018-11-02,23.8244
2018-11-05,23.6268
2018-11-06,23.4787
2018-11-07,23.7157
2018-11-08,23.0638
2018-11-09,22.5897
2018-11-12,22.7774
2018-11-13,23.4293
2018-11-14,23.0836
2018-11-15,23.7059
2018-11-16,23.8738
2018-11-19,23.6268
2018-11-20,22.965
2018-11-21,23.3997
2018-11-23,22.6984
2018-11-26,22.8169
2018-11-27,22.6984
2018-11-28,23.2219
2018-11-29,22.7774
2018-11-30,23.133
2018-12-03,23.9528
2018-12-04,23.5972
2018-12-06,23.291
2018-12-07,22.99
2018-12-10,22.83
2018-12-11,23.07
2018-12-12,23.15
2018-12-13,23.44
2018-12-14,23.02
2018-12-17,22.7
2018-12-18,22.8
2018-12-19,22.25
2018-12-20,22.23
2018-12-21,21.68
2018-12-24,21.81
2018-12-26,22.07
2018-12-27,21.83
2018-12-28,22.01
2018-12-31,21.93
2019-01-02,21.76
2019-01-03,21.51
2019-01-04,22.5
2019-01-07,22.41
2019-01-08,22.44
2019-01-09,22.87
2019-01-10,22.88
2019-01-11,23.03
2019-01-14,22.75
2019-01-15,23.22
2019-01-16,23.38
2019-01-17,23.38
2019-01-18,23.53
2019-01-22,23.07
2019-01-23,23.27
2019-01-24,23.48
2019-01-25,23.88
2019-01-28,23.66
2019-01-29,23.7
2019-01-30,23.96
2019-01-31,24.25
2019-02-01,24.19
2019-02-04,24.11
2019-02-05,24.41
2019-02-06,24.17
2019-02-07,23.95
2019-02-08,23.81
2019-02-11,24.45
2019-02-12,24.66
2019-02-13,25.16
2019-02-14,25.18
2019-02-15,25.03
2019-02-19,25.79
2019-02-20,25.93
2019-02-21,25.68
2019-02-22,26.47
2019-02-25,28.13
2019-02-26,27.77
2019-02-27,27.6
2019-02-28,27.46
2019-03-01,28.19
2019-03-04,28.43
2019-03-05,28.67
2019-03-06,28.75
2019-03-07,27.99
2019-03-08,26.9
2019-03-11,28.09
2019-03-12,28.17
2019-03-13,27.86
2019-03-14,27.52
2019-03-15,28.11
2019-03-18,28.78
2019-03-19,28.64
2019-03-20,28.71
2019-03-21,28.78
2019-03-22,28.08
2019-03-25,27.87
2019-03-26,27.7
2019-03-27,27.72
2019-03-28,27.8
2019-03-29,28.73
2019-04-01,29.75
2019-04-02,29.59
2019-04-03,30
2019-04-04,30.53
2019-04-05,30.79
2019-04-08,30.5
2019-04-09,30.17
2019-04-10,30.35
2019-04-11,29.5
2019-04-12,30.22
2019-04-15,29.51
2019-04-16,30.31
2019-04-17,30.51
2019-04-18,30.42
2019-04-22,30
2019-04-23,29.83
2019-04-24,29.59
2019-04-25,28.9
2019-04-26,29.08
2019-04-29,28.83
2019-04-30,29
2019-05-01,28.86
2019-05-02,28.67
2019-05-03,29.22
2019-05-06,27.74
2019-05-07,26.74
2019-05-08,26.69
2019-05-09,26.46
2019-05-10,27.05
2019-05-13,25.66
2019-05-14,26.44
2019-05-15,26.69
2019-05-16,26.96
2019-05-17,26.02
2019-05-20,25.78
2019-05-21,26.29
2019-05-22,26.17
2019-05-23,25.84
2019-05-24,25.74
2019-05-28,26.13
2019-05-29,26.43
2019-05-30,26.27
2019-05-31,26.12
2019-06-03,26.44
2019-06-04,26.36
2019-06-05,26.06
2019-06-06,26.08
2019-06-07,26.22
2019-06-10,26.3
2019-06-11,26.96
2019-06-12,26.69
2019-06-13,26.755
2019-06-14,26.4
2019-06-17,26.585
2019-06-18,27.285
2019-06-19,27.32
2019-06-20,28.25
2019-06-21,28.085
2019-06-24,28.265
2019-06-25,27.74
2019-06-26,27.91
2019-06-27,28.065
2019-06-28,28.145
2019-07-01,28.985
2019-07-02,28.745
2019-07-03,28.595
2019-07-04,28.595
2019-07-05,28.145
2019-07-08,27.815
2019-07-09,27.77
2019-07-10,27.985
2019-07-11,27.675
2019-07-12,27.755
2019-07-15,28.045
2019-07-16,27.915
2019-07-17,27.82
2019-07-18,27.82
2019-07-19,27.805
2019-07-22,27.64
2019-07-23,27.885
2019-07-24,28.11
2019-07-25,28.115
2019-07-26,28.305
2019-07-29,28.34
2019-07-30,28.165
2019-07-31,27.885
2019-08-01,26.805
2019-08-02,26.735
2019-08-05,25.61
2019-08-06,26.085
2019-08-07,26.075
2019-08-08,26.385
2019-08-09,25.945
2019-08-12,25.985
2019-08-13,26.905
2019-08-14,26.125
2019-08-15,26.475
2019-08-16,26.815
2019-08-19,27.095
2019-08-20,27.045
2019-08-21,27.445
2019-08-22,27.2
2019-08-23,26.67
2019-08-26,26.875
2019-08-27,26.94
2019-08-28,26.945
2019-08-29,27.22
2019-08-30,27.095
2019-09-02,27.11
2019-09-03,27.285
2019-09-04,27.73
2019-09-05,28.245
2019-09-06,28.355
2019-09-09,28.495
2019-09-10,28.395
2019-09-11,28.29
2019-09-12,28.665
2019-09-13,28.865
2019-09-16,28.435
2019-09-17,28.065
2019-09-18,28.03
2019-09-19,28.1
2019-09-20,27.795
2019-09-23,27.74
2019-09-24,27.705
2019-09-25,27.7
2019-09-26,27.365
2019-09-27,26.975
2019-09-30,27.055
2019-10-01,26.97
2019-10-02,26.91
2019-10-03,27.055
2019-10-04,27.155
2019-10-07,27.085
2019-10-08,26.81
2019-10-09,27.29
2019-10-10,27.755
2019-10-11,28.19
2019-10-14,28.27
2019-10-15,28.195
2019-10-16,28.065
2019-10-17,28.175
2019-10-18,27.775
2019-10-21,27.9
2019-10-22,27.955
2019-10-23,27.995
2019-10-24,27.855
2019-10-25,28.18
2019-10-28,28.37
2019-10-29,28.085
2019-10-30,28.025
2019-10-31,27.9
2019-11-01,28.495
2019-11-04,28.73
2019-11-05,28.94
2019-11-06,28.75
2019-11-07,29.145
2019-11-08,28.98
2019-11-11,28.44
2019-11-12,28.21
2019-11-13,28.115
2019-11-14,28.335
2019-11-15,28.195
2019-11-18,28.2
2019-11-19,28.465
2019-11-20,28.11
2019-11-21,28.105
2019-11-22,27.645
2019-11-25,27.925
