date,close
2014-06-13,25.5597
2014-06-16,25.2632
2014-06-17,25.1771
2014-06-18,25.3206
2014-06-19,25.3875
2014-06-20,25.5119
2014-06-23,25.1388
2014-06-24,24.8997
2014-06-25,24.871
2014-06-26,24.7944
2014-06-27,25.1197
2014-06-30,25.3588
2014-07-01,25.7414
2014-07-02,25.3006
2014-07-03,25.5114
2014-07-07,25.291
2014-07-08,25.3198
2014-07-09,25.2527
2014-07-10,25.0227
2014-07-11,25.0418
2014-07-14,25.0802
2014-07-15,25.2431
2014-07-16,25.3294
2014-07-17,25.0418
2014-07-18,25.2719
2014-07-21,24.2368
2014-07-22,24.6968
2014-07-23,24.9173
2014-07-24,25.0323
2014-07-25,24.2368
2014-07-28,23.7864
2014-07-29,23.6043
2014-07-30,23.796
2014-07-31,23.5564
2014-08-01,23.4797
2014-08-04,23.5947
2014-08-05,23.4893
2014-08-06,23.566
2014-08-07,23.6139
2014-08-08,23.7001
2014-08-11,23.8631
2014-08-12,23.9589
2014-08-13,24.0164
2014-08-14,24.0356
2014-08-15,23.5851
2014-08-18,23.9254
2014-08-19,23.8679
2014-08-20,23.7481
2014-08-21,23.8151
2014-08-22,23.7529
2014-08-25,23.9397
2014-08-26,23.8631
2014-08-27,23.7145
2014-08-28,23.8439
2014-08-29,23.8631
2014-09-02,24.1122
2014-09-03,23.9685
2014-09-04,24.0068
2014-09-05,23.9397
2014-09-08,23.8535
2014-09-09,23.6906
2014-09-10,23.7145
2014-09-11,23.7768
2014-09-12,24.3997
2014-09-15,24.117
2014-09-16,24.3518
2014-09-17,24.3039
2014-09-18,24.486
2014-09-19,24.2464
2014-09-22,24.0643
2014-09-23,23.8343
2014-09-24,23.9302
2014-09-25,23.8631
2014-09-26,24.1602
2014-09-29,24.2752
2014-09-30,24.1506
2014-10-01,23.5468
2014-10-02,23.7005
2014-10-03,23.8445
2014-10-06,23.6716
2014-10-07,23.1051
2014-10-08,23.422
2014-10-09,22.8554
2014-10-10,22.8938
2014-10-13,22.7498
2014-10-14,23.2827
2014-10-15,23.0859
2014-10-16,23.2203
2014-10-17,23.5756
2014-10-20,23.8685
2014-10-21,24.776
2014-10-22,24.5503
2014-10-23,24.872
2014-10-24,24.6512
2014-10-27,25.429
2014-10-28,25.7027
2014-10-29,25.9092
2014-10-30,26.0436
2014-10-31,26.4469
2014-11-03,26.639
2014-11-04,26.8023
2014-11-05,26.7831
2014-11-06,27.2344
2014-11-07,27.1672
2014-11-10,27.2152
2014-11-11,27.3016
2014-11-12,27.4361
2014-11-13,27.5225
2014-11-14,27.3688
2014-11-17,27.2728
2014-11-18,27.2632
2014-11-19,27.3208
2014-11-20,27.5993
2014-11-21,27.9258
2014-11-24,28.2619
2014-11-25,28.8765
2014-11-26,29.1262
2014-11-28,29.7888
2014-12-01,29.2222
2014-12-02,29.4143
2014-12-03,29.7504
2014-12-04,29.7504
2014-12-05,29.5872
2014-12-08,29.1742
2014-12-09,28.9438
2014-12-10,28.963
2014-12-11,29.1358
2014-12-12,29.1742
2014-12-15,29.3471
2014-12-16,29.4623
2014-12-17,29.616
2014-12-18,29.856
2014-12-19,29.664
2014-12-22,29.712
2014-12-23,30.0289
2014-12-24,30.0193
2014-12-26,30.2114
2014-12-29,30.0961
2014-12-30,29.9521
2014-12-31,29.9617
2015-01-02,29.9425
2015-01-05,29.3269
2015-01-06,28.6055
2015-01-07,28.7305
2015-01-08,29.3653
2015-01-09,28.8171
2015-01-12,29.2307
2015-01-13,29.702
2015-01-14,29.3173
2015-01-15,28.9421
2015-01-16,29.0768
2015-01-20,29.3557
2015-01-21,28.5959
2015-01-22,29.4904
2015-01-23,29.3269
2015-01-26,29.5866
2015-01-27,29.577
2015-01-28,28.9517
2015-01-29,28.1342
2015-01-30,27.4416
2015-02-02,27.634
2015-02-03,28.038
2015-02-04,27.6629
2015-02-05,28.0861
2015-02-06,28.0091
2015-02-09,27.7687
2015-02-10,28.2496
2015-02-11,28.644
2015-02-12,29.3942
2015-02-13,29.8751
2015-02-17,29.9136
2015-02-18,30.0675
2015-02-19,30.3464
2015-02-20,30.4811
2015-02-23,30.558
2015-02-24,31.1063
2015-02-25,30.6254
2015-02-26,30.8177
2015-02-27,30.8466
2015-03-02,30.7408
2015-03-03,30.2406
2015-03-04,30.029
2015-03-05,30.308
2015-03-06,30.029
2015-03-09,29.9906
2015-03-10,29.4712
2015-03-11,30.6446
2015-03-12,30.962
2015-03-13,30.7216
2015-03-16,31.2506
2015-03-17,31.2698
2015-03-18,31.5872
2015-03-19,31.8662
2015-03-20,31.8277
2015-03-23,31.241
2015-03-24,30.9909
2015-03-25,30.5484
2015-03-26,29.7982
2015-03-27,29.4712
2015-03-30,29.7116
2015-03-31,30.2118
2015-04-01,30.2214
2015-04-02,29.0864
2015-04-06,28.7594
2015-04-07,28.8171
2015-04-08,29.0864
2015-04-09,29.2788
2015-04-10,29.827
2015-04-13,29.7405
2015-04-14,30.0964
2015-04-15,30.0867
2015-04-16,29.5761
2015-04-17,29.3834
2015-04-20,29.711
2015-04-21,30.2505
2015-04-22,29.1811
2015-04-23,29.1522
2015-04-24,28.4971
2015-04-27,26.8305
2015-04-28,27.1195
2015-04-29,26.4451
2015-04-30,25.8863
2015-05-01,26.2621
2015-05-04,26.368
2015-05-05,26.2235
2015-05-06,26.4066
2015-05-07,26.7534
2015-05-08,26.8883
2015-05-11,26.8786
2015-05-12,26.7341
2015-05-13,26.3777
2015-05-14,26.4836
2015-05-15,26.3391
2015-05-18,26.8016
2015-05-19,27.0135
2015-05-20,26.8208
2015-05-21,26.8786
2015-05-22,26.3584
2015-05-26,26.3584
2015-05-27,27.0328
2015-05-28,26.9557
2015-05-29,26.5125
2015-06-01,26.4162
2015-06-02,26.4451
2015-06-03,27.0135
2015-06-04,27.1002
2015-06-05,27.7553
2015-06-08,27.3411
2015-06-09,27.2544
2015-06-10,27.5915
2015-06-11,27.4759
2015-06-12,27.1195
2015-06-15,26.8883
2015-06-16,26.6859
2015-06-17,26.4644
2015-06-18,26.7438
2015-06-19,26.58
2015-06-22,26.6281
2015-06-23,26.6089
2015-06-24,25.6937
2015-06-25,25.7804
2015-06-26,25.4335
2015-06-29,24.9133
2015-06-30,25.289
2015-07-01,25.347
2015-07-02,25.3856
2015-07-06,25.3663
2015-07-07,25.762
2015-07-08,25.2215
2015-07-09,25.6848
2015-07-10,26.1674
2015-07-13,26.6886
2015-07-14,26.5728
2015-07-15,26.0709
2015-07-16,26.7465
2015-07-17,26.4859
2015-07-20,26.5824
2015-07-21,27.9048
2015-07-22,26.9396
2015-07-23,26.3025
2015-07-24,25.9937
2015-07-27,25.7137
2015-07-28,26.4666
2015-07-29,27.0554
2015-07-30,27.3353
2015-07-31,27.2581
2015-08-03,27.7986
2015-08-04,27.9531
2015-08-05,27.8855
2015-08-06,27.6442
2015-08-07,26.7851
2015-08-10,27.4125
2015-08-11,27.2195
2015-08-12,27.1519
2015-08-13,27.1133
2015-08-14,27.4608
2015-08-17,27.4801
2015-08-18,27.8952
2015-08-19,27.4318
2015-08-20,26.6886
2015-08-21,25.8682
2015-08-24,25.3373
2015-08-25,24.6713
2015-08-26,25.4049
2015-08-27,25.5303
2015-08-28,25.6172
2015-08-31,25.569
2015-09-01,24.6037
2015-09-02,25.3856
2015-09-03,25.4049
2015-09-04,25.7234
2015-09-08,26.2446
2015-09-09,26.2832
2015-09-10,26.7755
2015-09-11,26.7562
2015-09-14,26.6211
2015-09-15,27.2292
2015-09-16,27.316
2015-09-17,27.6345
2015-09-18,27.3064
2015-09-21,27.2678
2015-09-22,26.2543
2015-09-23,25.9744
2015-09-24,24.9126
2015-09-25,25.0381
2015-09-28,24.6327
2015-09-29,24.5169
2015-09-30,24.2273
2015-10-01,24.624
2015-10-02,24.5562
2015-10-05,24.6917
2015-10-06,24.6627
2015-10-07,24.8368
2015-10-08,25.369
2015-10-09,26.1333
2015-10-12,26.3075
2015-10-13,24.7594
2015-10-14,25.0787
2015-10-15,25.427
2015-10-16,25.5044
2015-10-19,26.0656
2015-10-20,26.085
2015-10-21,26.7139
2015-10-22,25.7463
2015-10-23,26.5204
2015-10-26,26.7332
2015-10-27,25.0303
2015-10-28,24.8078
2015-10-29,25.6012
2015-10-30,25.6012
2015-11-02,26.2204
2015-11-03,26.3752
2015-11-04,26.5107
2015-11-05,26.7332
2015-11-06,27.0718
2015-11-09,26.3462
2015-11-10,26.9751
2015-11-11,26.8203
2015-11-12,25.5722
2015-11-13,25.0981
2015-11-16,24.8852
2015-11-17,25.6109
2015-11-18,25.7366
2015-11-19,26.2785
2015-11-20,26.3268
2015-11-23,26.6268
2015-11-24,26.7816
2015-11-25,26.8396
2015-11-27,27.2073
2015-11-30,26.085
2015-12-01,26.4139
2015-12-02,25.4754
2015-12-03,24.8368
2015-12-04,25.1658
2015-12-07,24.3337
2015-12-08,23.966
2015-12-09,23.8403
2015-12-10,24.3337
2015-12-11,23.8306
2015-12-14,23.7629
2015-12-15,23.9467
2015-12-16,24.4111
2015-12-17,23.879
2015-12-18,21.9245
2015-12-21,21.9535
2015-12-22,22.3406
2015-12-23,22.476
2015-12-24,22.5341
2015-12-28,22.3696
2015-12-29,22.476
2015-12-30,22.6409
2015-12-31,22.6894
2016-01-04,22.6118
2016-01-05,22.864
2016-01-06,22.1268
2016-01-07,21.2538
2016-01-08,21.2538
2016-01-11,21.6321
2016-01-12,21.8261
2016-01-13,20.7687
2016-01-14,21.1083
2016-01-15,21.1083
2016-01-19,21.1277
2016-01-20,21.0404
2016-01-21,21.5448
2016-01-22,21.8455
2016-01-25,21.5933
2016-01-26,23.4558
2016-01-27,22.4857
2016-01-28,22.1365
2016-01-29,23.4267
2016-02-01,23.8438
2016-02-02,23.5819
2016-02-03,24.0184
2016-02-04,24.9399
2016-02-05,25.1534
2016-02-08,25.4347
2016-02-09,26.104
2016-02-10,25.6287
2016-02-11,25.1243
2016-02-12,25.7839
2016-02-16,26.0652
2016-02-17,26.0555
2016-02-18,26.0361
2016-02-19,25.4153
2016-02-22,25.7063
2016-02-23,25.8906
2016-02-24,25.8906
2016-02-25,25.9488
2016-02-26,26.104
2016-02-29,25.7548
2016-03-01,25.9197
2016-03-02,24.8817
2016-03-03,25.716
2016-03-04,26.4726
2016-03-07,26.6569
2016-03-08,25.8421
2016-03-09,26.6181
2016-03-10,26.589
2016-03-11,26.7151
2016-03-14,25.9391
2016-03-15,25.6578
2016-03-16,25.9294
2016-03-17,26.298
2016-03-18,26.8121
2016-03-21,26.7927
2016-03-22,26.492
2016-03-23,26.4629
2016-03-24,26.492
2016-03-28,25.7063
2016-03-29,26.492
2016-03-30,26.395
2016-03-31,26.3465
2016-04-01,26.1137
2016-04-04,26.2689
2016-04-05,25.716
2016-04-06,25.7451
2016-04-07,25.1049
2016-04-08,25.3765
2016-04-11,25.4541
2016-04-12,25.6966
2016-04-13,26.8703
2016-04-14,26.7926
2016-04-15,26.6662
2016-04-18,27.2689
2016-04-19,27.687
2016-04-20,27.6675
2016-04-21,25.0135
2016-04-22,25.451
2016-04-25,25.0232
2016-04-26,25.5385
2016-04-27,25.869
2016-04-28,25.451
2016-04-29,24.6344
2016-05-02,24.7316
2016-05-03,24.6247
2016-05-04,24.1775
2016-05-05,23.915
2016-05-06,24.5469
2016-05-09,24.2455
2016-05-10,24.4351
2016-05-11,24.1094
2016-05-12,23.9539
2016-05-13,23.0012
2016-05-16,22.7387
2016-05-17,23.0984
2016-05-18,22.7387
2016-05-19,22.7387
2016-05-20,22.904
2016-05-23,22.3887
2016-05-24,22.9137
2016-05-25,23.5942
2016-05-26,23.7303
2016-05-27,23.8664
2016-05-31,24.1969
2016-06-01,24.3039
2016-06-02,24.1678
2016-06-03,24.5275
2016-06-06,24.9066
2016-06-07,24.3136
2016-06-08,24.4788
2016-06-09,24.2261
2016-06-10,23.8955
2016-06-13,23.8761
2016-06-14,23.3123
2016-06-15,23.2053
2016-06-16,23.2345
2016-06-17,23.672
2016-06-20,23.9928
2016-06-21,21.6888
2016-06-22,21.5332
2016-06-23,21.7763
2016-06-24,21.436
2016-06-27,21.1055
2016-06-28,21.4263
2016-06-29,21.7763
2016-06-30,22.3304
2016-07-01,22.6706
2016-07-05,22.3887
2016-07-06,22.5934
2016-07-07,22.4764
2016-07-08,23.2172
2016-07-11,23.2074
2016-07-12,23.6071
2016-07-13,24.2114
2016-07-14,23.8995
2016-07-15,23.8897
2016-07-18,23.802
2016-07-19,23.5096
2016-07-20,23.4121
2016-07-21,23.4999
2016-07-22,24.6208
2016-07-25,23.763
2016-07-26,23.9872
2016-07-27,24.0749
2016-07-28,24.4745
2016-07-29,24.4843
2016-08-01,24.3283
2016-08-02,23.6168
2016-08-03,23.6168
2016-08-04,23.3342
2016-08-05,24.1139
2016-08-08,23.7338
2016-08-09,23.2562
2016-08-10,22.9638
2016-08-11,22.9833
2016-08-12,22.8078
2016-08-15,22.4667
2016-08-16,22.8273
2016-08-17,22.7396
2016-08-18,22.8566
2016-08-19,23.3049
2016-08-22,23.2854
2016-08-23,23.7435
2016-08-24,23.685
2016-08-25,22.8663
2016-08-26,22.5154
2016-08-29,22.5836
2016-08-30,22.6616
2016-08-31,22.4959
2016-09-01,22.7006
2016-09-02,22.5934
2016-09-06,22.7201
2016-09-07,23.0807
2016-09-08,23.2562
2016-09-09,22.5836
2016-09-12,22.9053
2016-09-13,22.5641
2016-09-14,22.7104
2016-09-15,23.3147
2016-09-16,23.0515
2016-09-19,23.0905
2016-09-20,22.7201
2016-09-21,22.6714
2016-09-22,22.3595
2016-09-23,22.1353
2016-09-26,22.145
2016-09-27,22.145
2016-09-28,22.6421
2016-09-29,22.8571
2016-09-30,22.7399
2016-10-03,23.0623
2016-10-04,23.0428
2016-10-05,23.2187
2016-10-06,23.3066
2016-10-07,23.3066
2016-10-10,23.5314
2016-10-11,23.336
2016-10-12,23.2089
2016-10-13,22.7301
2016-10-14,22.3685
2016-10-17,22.134
2016-10-18,22.4271
2016-10-19,22.2806
2016-10-20,22.1828
2016-10-21,22.5737
2016-10-24,23.1356
2016-10-25,23.5509
2016-10-26,23.5998
2016-10-27,23.9907
2016-10-28,23.5509
2016-10-31,23.5021
2016-11-01,23.5998
2016-11-02,23.5509
2016-11-03,23.3555
2016-11-04,23.5998
2016-11-07,24.2839
2016-11-08,24.577
2016-11-09,25.1633
2016-11-10,25.3099
2016-11-11,25.5054
2016-11-14,25.6031
2016-11-15,26.0428
2016-11-16,26.0428
2016-11-17,26.2871
2016-11-18,26.4826
2016-11-21,26.6292
2016-11-22,26.1894
2016-11-23,26.3604
2016-11-25,26.7758
2016-11-28,26.5803
2016-11-29,26.336
2016-11-30,26.4337
2016-12-01,27.1178
2016-12-02,27.0689
2016-12-05,27.2644
2016-12-06,27.2155
2016-12-07,27.6553
2016-12-08,28.095
2016-12-09,27.1178
2016-12-12,27.4109
2016-12-13,26.9712
2016-12-14,26.9223
2016-12-15,27.0689
2016-12-16,26.5803
2016-12-19,26.8735
2016-12-20,27.1178
2016-12-21,26.9712
2016-12-22,26.7758
2016-12-23,26.9223
2016-12-27,27.1666
2016-12-28,26.678
2016-12-29,26.7368
2016-12-30,26.394
2017-01-03,27.1286
2017-01-04,27.3244
2017-01-05,26.5409
2017-01-06,26.394
2017-01-09,26.2471
2017-01-10,26.492
2017-01-11,26.492
2017-01-12,26.443
2017-01-13,26.6878
2017-01-17,26.0512
2017-01-18,26.443
2017-01-19,26.1492
2017-01-20,25.9533
2017-01-23,25.8064
2017-01-24,26.3451
2017-01-25,26.9816
2017-01-26,26.492
2017-01-27,26.9816
2017-01-30,27.2265
2017-01-31,27.5203
2017-02-01,27.5693
2017-02-02,27.1775
2017-02-03,27.3244
2017-02-06,27.4224
2017-02-07,26.9327
2017-02-08,27.0306
2017-02-09,26.8837
2017-02-10,27.6672
2017-02-13,27.6672
2017-02-14,26.7858
2017-02-15,27.3734
2017-02-16,27.3244
2017-02-17,27.2755
2017-02-21,26.9327
2017-02-22,26.9327
2017-02-23,26.7858
2017-02-24,27.2265
2017-02-27,27.5693
2017-02-28,27.4224
2017-03-01,27.961
2017-03-02,27.0306
2017-03-03,26.8837
2017-03-06,26.9816
2017-03-07,26.443
2017-03-08,26.5409
2017-03-09,26.3451
2017-03-10,26.7858
2017-03-13,26.6389
2017-03-14,26.492
2017-03-15,27.0306
2017-03-16,27.0306
2017-03-17,26.7858
2017-03-20,26.492
2017-03-21,26.1492
2017-03-22,25.9533
2017-03-23,25.7085
2017-03-24,25.5126
2017-03-27,25.0229
2017-03-28,25.4636
2017-03-29,25.4636
2017-03-30,25.5616
2017-03-31,25.6595
2017-04-03,25.5616
2017-04-04,25.5126
2017-04-05,25.2677
2017-04-06,24.925
2017-04-07,24.925
2017-04-10,26.0512
2017-04-11,25.4636
2017-04-12,24.7372
2017-04-13,23.9028
2017-04-17,24.2955
2017-04-18,24.1482
2017-04-19,24.1973
2017-04-20,24.6391
2017-04-21,26.6514
2017-04-24,27.4367
2017-04-25,27.0931
2017-04-26,27.1422
2017-04-27,27.2895
2017-04-28,26.7987
2017-05-01,26.5532
2017-05-02,26.7496
2017-05-03,26.6514
2017-05-04,26.4551
2017-05-05,26.2097
2017-05-08,26.0133
2017-05-09,25.9152
2017-05-10,25.9643
2017-05-11,25.6207
2017-05-12,25.2771
2017-05-15,25.4734
2017-05-16,25.6207
2017-05-17,24.7372
2017-05-18,25.3262
2017-05-19,25.3753
2017-05-22,25.8661
2017-05-23,26.5532
2017-05-24,26.7987
2017-05-25,27.0441
2017-05-26,26.5042
2017-05-30,26.7496
2017-05-31,26.7496
2017-06-01,26.8477
2017-06-02,27.3386
2017-06-05,27.6821
2017-06-06,27.584
2017-06-07,28.222
2017-06-08,28.2711
2017-06-09,28.4674
2017-06-12,28.9092
2017-06-13,28.9583
2017-06-14,28.6638
2017-06-15,28.9092
2017-06-16,28.4674
2017-06-19,28.6147
2017-06-20,28.2711
2017-06-21,27.9275
2017-06-22,28.0257
2017-06-23,28.2711
2017-06-26,28.6638
2017-06-27,28.7619
2017-06-28,29.2037
2017-06-29,29.0564
2017-06-30,28.8793
2017-07-03,29.3713
2017-07-05,29.3713
2017-07-06,28.8793
2017-07-07,29.2729
2017-07-10,28.6333
2017-07-11,28.4365
2017-07-12,28.9777
2017-07-13,28.9285
2017-07-14,28.9777
2017-07-17,29.0761
2017-07-18,28.5841
2017-07-19,28.5841
2017-07-20,28.9285
2017-07-21,29.0761
2017-07-24,28.7317
2017-07-25,30.6504
2017-07-26,30.9456
2017-07-27,29.3713
2017-07-28,29.4697
2017-07-31,29.1745
2017-08-01,28.7809
2017-08-02,28.6825
2017-08-03,29.0269
2017-08-04,29.5189
2017-08-07,29.6173
2017-08-08,29.6173
2017-08-09,29.8633
2017-08-10,29.5189
2017-08-11,29.9617
2017-08-14,30.6504
2017-08-15,30.552
2017-08-16,30.4536
2017-08-17,30.2077
2017-08-18,30.3061
2017-08-21,30.6012
2017-08-22,30.8964
2017-08-23,30.8964
2017-08-24,30.5028
2017-08-25,31.29
2017-08-28,32.1756
2017-08-29,32.8644
2017-08-30,32.9136
2017-08-31,32.5692
2017-09-01,32.9136
2017-09-05,32.6184
2017-09-06,32.766
2017-09-07,33.5531
2017-09-08,34.1927
2017-09-11,33.5039
2017-09-12,33.8483
2017-09-13,33.3071
2017-09-14,33.5039
2017-09-15,34.1435
2017-09-18,34.0943
2017-09-19,34.0943
2017-09-20,34.7339
2017-09-21,35.1767
2017-09-22,34.9799
2017-09-25,34.2419
2017-09-26,34.8815
2017-09-27,35.5211
2017-09-28,35.4227
2017-09-29,36.0339
2017-10-02,35.7874
2017-10-03,35.886
2017-10-04,35.048
2017-10-05,35.0973
2017-10-06,35.1959
2017-10-09,35.048
2017-10-10,34.9001
2017-10-11,35.1466
2017-10-12,35.6395
2017-10-13,34.0621
2017-10-16,33.7171
2017-10-17,34.21
2017-10-18,34.9001
2017-10-19,35.0973
2017-10-20,35.1466
2017-10-23,34.5551
2017-10-24,34.8015
2017-10-25,34.9494
2017-10-26,36.0339
2017-10-27,36.2311
2017-10-30,35.2945
2017-10-31,35.1466
2017-11-01,34.7522
2017-11-02,35.541
2017-11-03,34.5551
2017-11-06,34.4565
2017-11-07,33.9635
2017-11-08,34.4072
2017-11-09,33.9635
2017-11-10,33.865
2017-11-13,33.5199
2017-11-14,33.8157
2017-11-15,33.1748
2017-11-16,33.6185
2017-11-17,33.2241
2017-11-20,33.7664
2017-11-21,34.4565
2017-11-22,34.703
2017-11-24,34.629
2017-11-27,34.7522
2017-11-28,35.8367
2017-11-29,36.5761
2017-11-30,37.6606
2017-12-01,37.4634
2017-12-04,36.8226
2017-12-05,36.5268
2017-12-06,36.9705
2017-12-07,37.6606
2017-12-08,38.3507
2017-12-11,37.4634
2017-12-12,37.562
2017-12-13,38.1535
2017-12-14,37.4141
2017-12-15,37.8085
2017-12-18,38.2521
2017-12-19,38.3014
2017-12-20,38.6958
2017-12-21,38.4493
2017-12-22,39.0901
2017-12-26,38.8929
2017-12-27,38.9422
2017-12-28,38.6465
2017-12-29,38.1724
2018-01-02,38.4193
2018-01-03,38.3206
2018-01-04,37.9749
2018-01-05,37.7774
2018-01-08,39.0119
2018-01-09,39.9008
2018-01-10,38.9625
2018-01-11,39.6045
2018-01-12,39.407
2018-01-16,39.9996
2018-01-17,40.0489
2018-01-18,40.3946
2018-01-19,40.8884
2018-01-22,41.2835
2018-01-23,41.3823
2018-01-24,41.4316
2018-01-25,41.5304
2018-01-26,42.3205
2018-01-29,42.3699
2018-01-30,40.1971
2018-01-31,40.1971
2018-02-01,40.0489
2018-02-02,39.407
2018-02-05,37.1848
2018-02-06,37.7774
2018-02-07,37.8267
2018-02-08,35.8021
2018-02-09,35.9008
2018-02-12,35.7527
2018-02-13,38.3206
2018-02-14,38.0736
2018-02-15,37.9255
2018-02-16,38.0736
2018-02-20,37.6786
2018-02-21,38.0243
2018-02-22,37.8267
2018-02-23,37.5304
2018-02-26,38.2712
2018-02-27,37.4811
2018-02-28,36.7897
2018-03-01,37.0366
2018-03-02,37.6292
2018-03-05,36.8885
2018-03-06,37.0366
2018-03-07,37.1354
2018-03-08,37.0366
2018-03-09,38.5675
2018-03-12,38.4687
2018-03-13,38.5181
2018-03-14,37.9255
2018-03-15,38.0736
2018-03-16,38.6168
2018-03-19,38.7156
2018-03-20,38.6662
2018-03-21,38.765
2018-03-22,37.6786
2018-03-23,36.9872
2018-03-26,37.086
2018-03-27,35.2095
2018-03-28,35.6539
2018-03-29,36.049
2018-04-02,35.4564
2018-04-03,36.444
2018-04-04,36.444
2018-04-05,35.9996
2018-04-06,35.1107
2018-04-09,34.5675
2018-04-10,35.6045
2018-04-11,35.6045
2018-04-12,35.9008
2018-04-13,35.8217
2018-04-16,37.0091
2018-04-17,36.8607
2018-04-18,37.5534
2018-04-19,37.1576
2018-04-20,35.6238
2018-04-23,35.4753
2018-04-24,34.3374
2018-04-25,34.3374
2018-04-26,33.6447
2018-04-27,34.5353
2018-04-30,33.9415
2018-05-01,33.7436
2018-05-02,34.6342
2018-05-03,34.6342
2018-05-04,34.3374
2018-05-07,34.4858
2018-05-08,35.0795
2018-05-09,35.1785
2018-05-10,35.6732
2018-05-11,36.4649
2018-05-14,36.7617
2018-05-15,36.0196
2018-05-16,36.1185
2018-05-17,36.9597
2018-05-18,37.5534
2018-05-21,38.5429
2018-05-22,37.8997
2018-05-23,37.8008
2018-05-24,38.2461
2018-05-25,38.5924
2018-05-29,38.5924
2018-05-30,39.4335
2018-05-31,38.7903
2018-06-01,39.2356
2018-06-04,37.9492
2018-06-05,37.0586
2018-06-06,36.6133
2018-06-07,36.8607
2018-06-08,37.8008
2018-06-11,38.7903
2018-06-12,39.2356
2018-06-13,38.6914
2018-06-14,38.0976
2018-06-15,38.6914
2018-06-18,38.444
2018-06-19,38.6419
2018-06-20,39.582
2018-06-21,39.8294
2018-06-22,39.3841
2018-06-25,37.6029
2018-06-26,37.4544
2018-06-27,37.1576
2018-06-28,37.1081
2018-06-29,37.247
2018-07-02,37.3462
2018-07-03,37.247
2018-07-05,37.2966
2018-07-06,37.5941
2018-07-09,38.0901
2018-07-10,37.8421
2018-07-11,37.247
2018-07-12,37.3462
2018-07-13,36.8502
2018-07-16,35.5607
2018-07-17,36.3046
2018-07-18,36.999
2018-07-19,37.7925
2018-07-20,39.0324
2018-07-23,39.826
2018-07-24,35.8583
2018-07-25,36.3046
2018-07-26,35.7591
2018-07-27,36.0566
2018-07-30,36.0566
2018-07-31,36.9494
2018-08-01,37.1478
2018-08-02,37.4949
2018-08-03,35.9575
2018-08-06,35.9079
2018-08-07,36.3046
2018-08-08,36.4534
2018-08-09,36.751
2018-08-10,36.8006
2018-08-13,36.8006
2018-08-14,36.6518
2018-08-15,36.4534
2018-08-16,36.503
2018-08-17,36.3542
2018-08-20,36.5526
2018-08-21,36.6518
2018-08-22,36.8502
2018-08-23,36.751
2018-08-24,36.503
2018-08-27,36.8502
2018-08-28,36.4038
2018-08-29,36.7014
2018-08-30,36.6518
2018-08-31,36.751
2018-09-04,36.255
2018-09-05,36.999
2018-09-06,37.0486
2018-09-07,36.9494
2018-09-10,40.3219
2018-09-11,38.4869
2018-09-12,38.2885
2018-09-13,37.247
2018-09-14,37.3958
2018-09-17,36.3046
2018-09-18,36.5526
2018-09-19,36.503
2018-09-20,36.3046
2018-09-21,35.3127
2018-09-24,34.9655
2018-09-25,34.8663
2018-09-26,35.0647
2018-09-27,35.1143
2018-09-28,35.1541
2018-10-01,35.5121
2018-10-02,34.8359
2018-10-03,35.3729
2018-10-04,34.8856
2018-10-05,33.9607
2018-10-08,34.0403
2018-10-09,33.8712
2018-10-10,32.8668
2018-10-11,32.2702
2018-10-12,32.0414
2018-10-15,32.5585
2018-10-16,33.4337
2018-10-17,33.1652
2018-10-18,32.2005
2018-10-19,33.2845
2018-10-22,33.7519
2018-10-23,33.7121
2018-10-24,32.3
2018-10-25,32.7574
2018-10-26,31.4746
2018-10-29,31.2459
2018-10-30,32.5983
2018-10-31,32.0116
2018-11-01,32.4989
2018-11-02,32.5287
2018-11-05,32.8668
2018-11-06,32.9961
2018-11-07,33.2248
2018-11-08,33.1751
2018-11-09,33.0458
2018-11-12,32.7475
2018-11-13,32.5088
2018-11-14,32.837
2018-11-15,33.3442
2018-11-16,33.2547
2018-11-19,33.9607
2018-11-20,32.9464
2018-11-21,33.5132
2018-11-23,33.2547
2018-11-26,33.6624
2018-11-27,32.9364
2018-11-28,33.8414
2018-11-29,33.1552
2018-11-30,33.6723
2018-12-03,33.1154
2018-12-04,31.6536
2018-12-06,32.2403
2018-12-07,30.8779
2018-12-10,31.5641
2018-12-11,31.7928
2018-12-12,31.7431
2018-12-13,30.8381
2018-12-14,29.8735
2018-12-17,30.6691
2018-12-18,30.4801
2018-12-19,30.0625
2018-12-20,29.9133
2018-12-21,29.2371
2018-12-24,28.9487
2018-12-26,29.9033
2018-12-27,29.8835
2018-12-28,29.8835
2018-12-31,29.4645
2019-01-02,30.0929
2019-01-03,29.0955
2019-01-04,30.0929
2019-01-07,30.1627
2019-01-08,30.841
2019-01-09,31.5691
2019-01-10,31.22
2019-01-11,31.22
2019-01-14,31.1303
2019-01-15,30.8809
2019-01-16,31.0405
2019-01-17,31.8384
2019-01-18,33.0154
2019-01-22,32.7062
2019-01-23,32.4269
2019-01-24,31.9282
2019-01-25,32.3771
2019-01-28,32.8259
2019-01-29,33.2648
2019-01-30,33.564
2019-01-31,32.8359
2019-02-01,32.9257
2019-02-04,33.6239
2019-02-05,33.7037
2019-02-06,33.1152
2019-02-07,34.4517
2019-02-08,34.0827
2019-02-11,33.8234
2019-02-12,34.3221
2019-02-13,34.8807
2019-02-14,34.9704
2019-02-15,34.372
2019-02-19,34.7809
2019-02-20,34.9804
2019-02-21,34.7909
2019-02-22,34.9106
2019-02-25,34.751
2019-02-26,34.7909
2019-02-27,34.4218
2019-02-28,34.4418
2019-03-01,34.4418
2019-03-04,33.6937
2019-03-05,33.3047
2019-03-06,33.4443
2019-03-07,33.564
2019-03-08,33.8732
2019-03-11,35.0303
2019-03-12,34.741
2019-03-13,35.0402
2019-03-14,34.6413
2019-03-15,34.3321
2019-03-18,34.731
2019-03-19,33.2448
2019-03-20,32.8558
2019-03-21,33.2448
2019-03-22,32.776
2019-03-25,32.7461
2019-03-26,33.6139
2019-03-27,33.5341
2019-03-28,34.3321
2019-03-29,34.0627
2019-04-01,34.6911
2019-04-02,34.4119
2019-04-03,34.3919
2019-04-04,34.9205
2019-04-05,35.13
2019-04-08,35.15
2019-04-09,34.8906
2019-04-10,34.6512
2019-04-11,35.13
2019-04-12,35.01
2019-04-15,34.39
2019-04-16,34.74
2019-04-17,34.79
2019-04-18,35.33
2019-04-22,35.35
2019-04-23,35.45
2019-04-24,36.13
2019-04-25,34.81
2019-04-26,35.75
2019-04-29,34.55
2019-04-30,33.5
2019-05-01,32.28
2019-05-02,32.92
2019-05-03,33.48
2019-05-06,33.65
2019-05-07,33.09
2019-05-08,32.39
2019-05-09,32.55
2019-05-10,32.39
2019-05-13,31.41
2019-05-14,31.76
2019-05-15,32.82
2019-05-16,33.39
2019-05-17,33.74
2019-05-20,34.26
2019-05-21,34.12
2019-05-22,34.07
2019-05-23,29.56
2019-05-24,29.37
2019-05-28,29.11
2019-05-29,28.25
2019-05-30,28.25
2019-05-31,27.88
2019-06-03,28.4
2019-06-04,29.3
2019-06-05,29.42
2019-06-06,29.24
2019-06-07,29.07
2019-06-10,29.55
2019-06-11,29.48
2019-06-12,29.96
2019-06-13,30.415
2019-06-14,30.59
2019-06-17,30.23
2019-06-18,30.27
2019-06-19,30.29
2019-06-20,30.51
2019-06-21,30.19
2019-06-24,29.38
2019-06-25,29.51
2019-06-26,29.925
2019-06-27,30.775
2019-06-28,31.13
2019-07-01,31.145
2019-07-02,30.49
2019-07-03,30.93
2019-07-04,30.93
2019-07-05,30.95
2019-07-08,31
2019-07-09,30.67
2019-07-10,29.825
2019-07-11,29.595
2019-07-12,31.065
2019-07-15,30.875
2019-07-16,32
2019-07-17,31.785
2019-07-18,31.93
2019-07-19,32.795
2019-07-22,32.84
2019-07-23,32.915
2019-07-24,33.575
2019-07-25,33.26
2019-07-26,33.25
2019-07-29,33.235
2019-07-30,33.71
2019-07-31,33.16
2019-08-01,32.5
2019-08-02,32.4
2019-08-05,31.49
2019-08-06,31.98
2019-08-07,31.76
2019-08-08,32.13
2019-08-09,31.57
2019-08-12,30.81
2019-08-13,31.65
2019-08-14,31.11
2019-08-15,30.59
2019-08-16,31.42
2019-08-19,31.825
2019-08-20,31.72
2019-08-21,32.08
2019-08-22,31.895
2019-08-23,30.635
2019-08-26,30.995
2019-08-27,30.64
2019-08-28,31.33
2019-08-29,32.025
2019-08-30,32.68
2019-09-02,32.71
2019-09-03,32.575
2019-09-04,33.06
2019-09-05,33.135
2019-09-06,32.94
2019-09-09,34.21
2019-09-10,34.135
2019-09-11,35.3
2019-09-12,35.035
2019-09-13,35.285
2019-09-16,34.59
2019-09-17,34.845
2019-09-18,34.35
2019-09-19,34.18
2019-09-20,34.41
2019-09-23,34.37
2019-09-24,33.87
2019-09-25,35.17
2019-09-26,35.545
2019-09-27,35.325
2019-09-30,35.3
2019-10-01,34.725
2019-10-02,34.4
2019-10-03,33.81
2019-10-04,33.91
2019-10-07,34.675
2019-10-08,34.375
2019-10-09,34.49
2019-10-10,34.65
2019-10-11,35.255
2019-10-14,35.24
2019-10-15,34.925
2019-10-16,35.9
2019-10-17,36.51
2019-10-18,36.335
2019-10-21,36.9
2019-10-22,37.75
2019-10-23,37.71
2019-10-24,37.91
2019-10-25,38.85
2019-10-28,38.475
2019-10-29,38.825
2019-10-30,37.495
2019-10-31,36.53
2019-11-01,36.76
2019-11-04,37.855
2019-11-05,37.825
2019-11-06,38.045
2019-11-07,38.18
2019-11-08,38.09
2019-11-11,37.82
2019-11-12,37.745
2019-11-13,37.355
2019-11-14,37.69
2019-11-15,37.815
2019-11-18,37.415
2019-11-19,37.08
2019-11-20,36.74
2019-11-21,36.545
2019-11-22,36.53
2019-11-25,36.84
