date,close
2014-06-13,31.6519
2014-06-16,31.6597
2014-06-17,31.6207
2014-06-18,31.9328
2014-06-19,31.9874
2014-06-20,31.9016
2014-06-23,31.2306
2014-06-24,31.6391
2014-06-25,31.6391
2014-06-26,31.8146
2014-06-27,31.8943
2014-06-30,31.8146
2014-07-01,32.0299
2014-07-02,32.0219
2014-07-03,32.1256
2014-07-07,31.8864
2014-07-08,31.6311
2014-07-09,31.5992
2014-07-10,31.2643
2014-07-11,31.3121
2014-07-14,31.5035
2014-07-15,31.3201
2014-07-16,31.4477
2014-07-17,31.0569
2014-07-18,31.3839
2014-07-21,31.3121
2014-07-22,31.4477
2014-07-23,31.6311
2014-07-24,31.7029
2014-07-25,31.5354
2014-07-28,31.5594
2014-07-29,31.4238
2014-07-30,31.3679
2014-07-31,30.7698
2014-08-01,30.5943
2014-08-04,30.8096
2014-08-05,30.3471
2014-08-06,30.2514
2014-08-07,29.9164
2014-08-08,30.0679
2014-08-11,30.1477
2014-08-12,30.1716
2014-08-13,30.3152
2014-08-14,30.5704
2014-08-15,30.5863
2014-08-18,30.7299
2014-08-19,30.8017
2014-08-20,30.7379
2014-08-21,30.8814
2014-08-22,30.706
2014-08-25,30.8176
2014-08-26,30.8814
2014-08-27,31.0968
2014-08-28,30.9293
2014-08-29,30.8814
2014-09-02,30.7937
2014-09-03,30.9891
2014-09-04,30.8416
2014-09-05,30.9452
2014-09-08,30.5146
2014-09-09,30.4029
2014-09-10,30.379
2014-09-11,30.1078
2014-09-12,29.9961
2014-09-15,29.8526
2014-09-16,29.9642
2014-09-17,29.709
2014-09-18,29.8845
2014-09-19,29.7569
2014-09-22,29.5894
2014-09-23,29.3581
2014-09-24,29.4692
2014-09-25,28.8822
2014-09-26,28.9867
2014-09-29,28.7777
2014-09-30,28.7777
2014-10-01,28.4801
2014-10-02,28.3274
2014-10-03,28.2228
2014-10-06,28.4078
2014-10-07,27.9012
2014-10-08,28.4239
2014-10-09,27.6359
2014-10-10,27.1856
2014-10-13,27.1534
2014-10-14,27.2338
2014-10-15,27.1856
2014-10-16,27.5313
2014-10-17,27.5313
2014-10-20,27.7404
2014-10-21,28.1505
2014-10-22,27.9173
2014-10-23,28.2711
2014-10-24,28.4882
2014-10-27,28.3595
2014-10-28,28.8822
2014-10-29,28.5927
2014-10-30,28.6651
2014-10-31,29.0108
2014-11-03,28.6088
2014-11-04,28.6329
2014-11-05,28.7053
2014-11-06,28.5364
2014-11-07,28.6008
2014-11-10,28.7374
2014-11-11,28.9586
2014-11-12,28.6892
2014-11-13,28.6651
2014-11-14,28.8018
2014-11-17,28.7133
2014-11-18,29.035
2014-11-19,28.8983
2014-11-20,28.8098
2014-11-21,29.0108
2014-11-24,29.1234
2014-11-25,29.1154
2014-11-26,29.236
2014-11-28,28.8822
2014-12-01,28.6731
2014-12-02,28.5445
2014-12-03,28.6008
2014-12-04,28.5445
2014-12-05,28.649
2014-12-08,28.3676
2014-12-09,28.1264
2014-12-10,27.7886
2014-12-11,27.7082
2014-12-12,27.1856
2014-12-15,26.7755
2014-12-16,27.0248
2014-12-17,27.4027
2014-12-18,27.8047
2014-12-19,27.7676
2014-12-22,28.0039
2014-12-23,27.8898
2014-12-24,27.9958
2014-12-26,28.0691
2014-12-29,27.9469
2014-12-30,27.6943
2014-12-31,27.4499
2015-01-02,27.3847
2015-01-05,26.7817
2015-01-06,26.521
2015-01-07,26.8388
2015-01-08,27.018
2015-01-09,27.1402
2015-01-12,26.9936
2015-01-13,27.0832
2015-01-14,27.0506
2015-01-15,27.1565
2015-01-16,27.5232
2015-01-20,27.5558
2015-01-21,27.678
2015-01-22,27.8002
2015-01-23,27.5721
2015-01-26,27.9224
2015-01-27,27.955
2015-01-28,27.4661
2015-01-29,27.8002
2015-01-30,27.4824
2015-02-02,27.8735
2015-02-03,28.5254
2015-02-04,28.1343
2015-02-05,28.5824
2015-02-06,28.1994
2015-02-09,28.1261
2015-02-10,28.395
2015-02-11,28.2157
2015-02-12,28.6557
2015-02-13,28.7616
2015-02-17,28.8431
2015-02-18,28.8594
2015-02-19,28.6965
2015-02-20,28.9898
2015-02-23,28.8431
2015-02-24,29.0468
2015-02-25,29.169
2015-02-26,28.8839
2015-02-27,28.9572
2015-03-02,28.9246
2015-03-03,28.729
2015-03-04,28.6068
2015-03-05,28.672
2015-03-06,28.1098
2015-03-09,28.0854
2015-03-10,27.4336
2015-03-11,27.4336
2015-03-12,27.8328
2015-03-13,27.4906
2015-03-16,27.7024
2015-03-17,27.6291
2015-03-18,28.2076
2015-03-19,27.8246
2015-03-20,28.4439
2015-03-23,28.7616
2015-03-24,28.6802
2015-03-25,28.4696
2015-03-26,28.2072
2015-03-27,28.0514
2015-03-30,27.8956
2015-03-31,27.584
2015-04-01,27.6332
2015-04-02,27.7398
2015-04-06,28.0678
2015-04-07,28.0678
2015-04-08,28.2072
2015-04-09,28.1334
2015-04-10,28.1498
2015-04-13,27.8382
2015-04-14,28.1334
2015-04-15,28.3466
2015-04-16,28.6254
2015-04-17,28.3138
2015-04-20,28.2564
2015-04-21,28.322
2015-04-22,28.363
2015-04-23,28.5352
2015-04-24,28.8304
2015-04-27,29.0272
2015-04-28,29.2076
2015-04-29,28.9534
2015-04-30,28.7238
2015-05-01,28.8878
2015-05-04,28.8468
2015-05-05,28.5926
2015-05-06,28.568
2015-05-07,28.3958
2015-05-08,28.8714
2015-05-11,28.6418
2015-05-12,28.8304
2015-05-13,29.2322
2015-05-14,29.511
2015-05-15,29.4536
2015-05-18,29.101
2015-05-19,28.732
2015-05-20,28.6582
2015-05-21,28.9288
2015-05-22,28.691
2015-05-26,28.2564
2015-05-27,28.3958
2015-05-28,28.24
2015-05-29,28.1334
2015-06-01,27.9202
2015-06-02,28.1744
2015-06-03,28.24
2015-06-04,27.6414
2015-06-05,27.4036
2015-06-08,27.4036
2015-06-09,27.3216
2015-06-10,27.8874
2015-06-11,27.9612
2015-06-12,27.6742
2015-06-15,27.543
2015-06-16,27.5922
2015-06-17,27.6168
2015-06-18,27.8792
2015-06-19,27.789
2015-06-22,28.1744
2015-06-23,28.1826
2015-06-24,27.9829
2015-06-25,27.9495
2015-06-26,27.708
2015-06-29,26.9502
2015-06-30,26.9252
2015-07-01,27.0001
2015-07-02,27.15
2015-07-06,26.4338
2015-07-07,26.4505
2015-07-08,25.8508
2015-07-09,26.1673
2015-07-10,26.8835
2015-07-13,26.7919
2015-07-14,27.0418
2015-07-15,26.9502
2015-07-16,27.15
2015-07-17,27.0418
2015-07-20,27.0751
2015-07-21,27.0334
2015-07-22,26.7419
2015-07-23,26.5088
2015-07-24,26.2173
2015-07-27,26.059
2015-07-28,26.4421
2015-07-29,26.5421
2015-07-30,26.617
2015-07-31,26.642
2015-08-03,26.5171
2015-08-04,26.592
2015-08-05,26.7003
2015-08-06,26.4421
2015-08-07,26.2589
2015-08-10,26.592
2015-08-11,26.2173
2015-08-12,26.2423
2015-08-13,26.1173
2015-08-14,26.0507
2015-08-17,25.9758
2015-08-18,25.7093
2015-08-19,25.576
2015-08-20,24.9597
2015-08-21,24.485
2015-08-24,23.344
2015-08-25,23.7854
2015-08-26,24.46
2015-08-27,24.8181
2015-08-28,24.8681
2015-08-31,24.5766
2015-09-01,23.8354
2015-09-02,24.1352
2015-09-03,24.0936
2015-09-04,23.6688
2015-09-08,24.4767
2015-09-09,24.3268
2015-09-10,24.4767
2015-09-11,24.4683
2015-09-14,24.3018
2015-09-15,24.4184
2015-09-16,24.9014
2015-09-17,24.9514
2015-09-18,24.535
2015-09-21,24.4267
2015-09-22,23.902
2015-09-23,23.6772
2015-09-24,23.7271
2015-09-25,23.7697
2015-09-28,23.3741
2015-09-29,23.332
2015-09-30,23.6771
2015-10-01,23.7697
2015-10-02,24.1821
2015-10-05,24.7124
2015-10-06,24.8976
2015-10-07,25.3521
2015-10-08,25.6214
2015-10-09,25.7224
2015-10-12,25.6383
2015-10-13,25.2258
2015-10-14,25.4194
2015-10-15,25.8066
2015-10-16,25.7645
2015-10-19,25.5962
2015-10-20,25.4699
2015-10-21,25.4194
2015-10-22,25.7224
2015-10-23,25.8403
2015-10-26,25.7393
2015-10-27,25.4026
2015-10-28,25.4783
2015-10-29,25.1838
2015-10-30,25.2343
2015-11-02,25.4278
2015-11-03,25.6214
2015-11-04,25.3858
2015-11-05,25.2932
2015-11-06,24.9986
2015-11-09,24.6282
2015-11-10,24.603
2015-11-11,24.6535
2015-11-12,24.4262
2015-11-13,24.1905
2015-11-16,24.5693
2015-11-17,24.6114
2015-11-18,24.8892
2015-11-19,25.209
2015-11-20,25.108
2015-11-23,24.9902
2015-11-24,25.0322
2015-11-25,24.9733
2015-11-27,24.9228
2015-11-30,24.9481
2015-12-01,25.2848
2015-12-02,24.9986
2015-12-03,24.8807
2015-12-04,25.0154
2015-12-07,24.6282
2015-12-08,24.14
2015-12-09,24.1737
2015-12-10,24.14
2015-12-11,23.6434
2015-12-14,23.6014
2015-12-15,23.6855
2015-12-16,24.1569
2015-12-17,23.8118
2015-12-18,23.7318
2015-12-21,23.8845
2015-12-22,24.0297
2015-12-23,24.5591
2015-12-24,24.636
2015-12-28,24.5164
2015-12-29,24.9178
2015-12-30,24.747
2015-12-31,24.5164
2016-01-04,24.2346
2016-01-05,24.0553
2016-01-06,23.5856
2016-01-07,22.9452
2016-01-08,22.7488
2016-01-11,22.8342
2016-01-12,22.8939
2016-01-13,22.5097
2016-01-14,22.7744
2016-01-15,21.9205
2016-01-19,22.1169
2016-01-20,21.707
2016-01-21,21.9717
2016-01-22,22.5951
2016-01-25,22.2962
2016-01-26,22.8
2016-01-27,22.6292
2016-01-28,22.9281
2016-01-29,23.3124
2016-02-01,23.338
2016-02-02,22.7744
2016-02-03,23.0818
2016-02-04,23.2782
2016-02-05,22.9452
2016-02-08,22.5865
2016-02-09,22.2877
2016-02-10,22.2193
2016-02-11,22.0229
2016-02-12,22.4243
2016-02-16,22.9281
2016-02-17,23.3636
2016-02-18,23.3892
2016-02-19,23.2953
2016-02-22,23.6539
2016-02-23,23.2611
2016-02-24,23.0989
2016-02-25,23.2697
2016-02-26,22.9623
2016-02-29,22.9366
2016-03-01,23.56
2016-03-02,23.782
2016-03-03,24.1919
2016-03-04,24.4993
2016-03-07,24.6701
2016-03-08,24.3286
2016-03-09,24.5591
2016-03-10,24.4993
2016-03-11,25.0459
2016-03-14,24.8068
2016-03-15,24.4908
2016-03-16,24.8921
2016-03-17,25.3618
2016-03-18,25.2252
2016-03-21,25.2166
2016-03-22,25.1137
2016-03-23,24.7422
2016-03-24,24.5954
2016-03-28,24.7077
2016-03-29,24.9409
2016-03-30,25.2001
2016-03-31,25.0446
2016-04-01,24.8459
2016-04-04,24.7249
2016-04-05,24.1893
2016-04-06,24.5262
2016-04-07,24.1288
2016-04-08,24.5349
2016-04-11,24.6213
2016-04-12,25.0878
2016-04-13,25.3901
2016-04-14,25.4161
2016-04-15,25.4852
2016-04-18,25.6061
2016-04-19,26.064
2016-04-20,26.0294
2016-04-21,25.8394
2016-04-22,25.7962
2016-04-25,25.6666
2016-04-26,25.8221
2016-04-27,25.7962
2016-04-28,25.7616
2016-04-29,25.7962
2016-05-02,25.9085
2016-05-03,25.4161
2016-05-04,25.0273
2016-05-05,25.0187
2016-05-06,24.9841
2016-05-09,24.8286
2016-05-10,25.1569
2016-05-11,25.0273
2016-05-12,25.0619
2016-05-13,24.7336
2016-05-16,25.0791
2016-05-17,25.0187
2016-05-18,24.8804
2016-05-19,24.7163
2016-05-20,24.9064
2016-05-23,24.7509
2016-05-24,25.0359
2016-05-25,25.3469
2016-05-26,25.4333
2016-05-27,25.3815
2016-05-31,25.2951
2016-06-01,25.1828
2016-06-02,25.1655
2016-06-03,25.4938
2016-06-06,25.6839
2016-06-07,25.9258
2016-06-08,26.0208
2016-06-09,25.753
2016-06-10,25.0446
2016-06-13,24.7163
2016-06-14,24.3448
2016-06-15,24.4571
2016-06-16,24.4917
2016-06-17,24.7768
2016-06-20,25.3578
2016-06-21,25.4898
2016-06-22,25.4634
2016-06-23,26.1852
2016-06-24,23.9671
2016-06-27,23.4742
2016-06-28,24.2576
2016-06-29,24.7593
2016-06-30,25.1994
2016-07-01,25.3138
2016-07-05,24.6713
2016-07-06,24.7241
2016-07-07,24.6009
2016-07-08,25.0014
2016-07-11,25.2346
2016-07-12,25.6307
2016-07-13,25.6131
2016-07-14,25.8067
2016-07-15,25.7187
2016-07-18,25.7187
2016-07-19,25.5251
2016-07-20,25.6131
2016-07-21,25.5955
2016-07-22,25.6307
2016-07-25,25.6307
2016-07-26,25.7363
2016-07-27,25.8683
2016-07-28,25.9035
2016-07-29,26.0444
2016-08-01,25.7363
2016-08-02,25.7275
2016-08-03,25.6395
2016-08-04,25.7451
2016-08-05,25.8683
2016-08-08,26.0091
2016-08-09,26.2028
2016-08-10,26.2468
2016-08-11,26.4316
2016-08-12,26.3436
2016-08-15,26.4404
2016-08-16,26.414
2016-08-17,26.458
2016-08-18,26.6605
2016-08-19,26.4228
2016-08-22,26.4404
2016-08-23,26.5637
2016-08-24,26.4844
2016-08-25,26.4492
2016-08-26,26.282
2016-08-29,26.326
2016-08-30,26.2908
2016-08-31,26.1852
2016-09-01,26.3084
2016-09-02,26.6605
2016-09-06,26.9685
2016-09-07,26.9597
2016-09-08,26.9421
2016-09-09,26.2732
2016-09-12,26.4492
2016-09-13,25.7275
2016-09-14,25.7891
2016-09-15,26.1324
2016-09-16,25.8507
2016-09-19,25.9475
2016-09-20,26.0356
2016-09-21,26.4052
2016-09-22,26.6429
2016-09-23,26.4668
2016-09-26,26.2968
2016-09-27,26.3591
2016-09-28,26.644
2016-09-29,26.4482
2016-09-30,26.6885
2016-10-03,26.6351
2016-10-04,26.5372
2016-10-05,26.6084
2016-10-06,26.4571
2016-10-07,26.3146
2016-10-10,26.4482
2016-10-11,26.0209
2016-10-12,26.0743
2016-10-13,26.0298
2016-10-14,26.0743
2016-10-17,25.9763
2016-10-18,26.2523
2016-10-19,26.3146
2016-10-20,26.2523
2016-10-21,26.1277
2016-10-24,26.1099
2016-10-25,26.1811
2016-10-26,26.0209
2016-10-27,25.8962
2016-10-28,25.9229
2016-10-31,25.9051
2016-11-01,25.8695
2016-11-02,25.6559
2016-11-03,25.6648
2016-11-04,25.3799
2016-11-07,25.825
2016-11-08,25.9496
2016-11-09,25.8606
2016-11-10,25.7449
2016-11-11,25.5579
2016-11-14,25.3354
2016-11-15,25.549
2016-11-16,25.3087
2016-11-17,25.3443
2016-11-18,25.2108
2016-11-21,25.46
2016-11-22,25.549
2016-11-23,25.5134
2016-11-25,25.7004
2016-11-28,25.5936
2016-11-29,25.7093
2016-11-30,25.6292
2016-12-01,25.7449
2016-12-02,25.7894
2016-12-05,25.9407
2016-12-06,26.1099
2016-12-07,26.4482
2016-12-08,26.466
2016-12-09,26.6262
2016-12-12,26.6796
2016-12-13,26.8933
2016-12-14,26.4393
2016-12-15,26.3146
2016-12-16,26.2968
2016-12-19,26.19
2016-12-20,26.3057
2016-12-21,26.3413
2016-12-22,26.2839
2016-12-23,26.3735
2016-12-27,26.3824
2016-12-28,26.3018
2016-12-29,26.5435
2016-12-30,26.463
2017-01-03,26.7136
2017-01-04,26.9822
2017-01-05,27.2597
2017-01-06,27.0986
2017-01-09,27.0628
2017-01-10,27.0091
2017-01-11,27.206
2017-01-12,27.3313
2017-01-13,27.3493
2017-01-17,27.3851
2017-01-18,27.215
2017-01-19,27.1702
2017-01-20,27.2866
2017-01-23,27.2866
2017-01-24,27.4567
2017-01-25,27.6536
2017-01-26,27.5193
2017-01-27,27.5193
2017-01-30,27.3313
2017-01-31,27.3851
2017-02-01,27.4298
2017-02-02,27.5014
2017-02-03,27.5552
2017-02-06,27.3403
2017-02-07,27.2508
2017-02-08,27.3313
2017-02-09,27.4388
2017-02-10,27.591
2017-02-13,27.7073
2017-02-14,27.6984
2017-02-15,27.8864
2017-02-16,27.9401
2017-02-17,27.7521
2017-02-21,27.8864
2017-02-22,27.7879
2017-02-23,27.8774
2017-02-24,27.5641
2017-02-27,27.5462
2017-02-28,27.4835
2017-03-01,27.6984
2017-03-02,27.6089
2017-03-03,27.7252
2017-03-06,27.7163
2017-03-07,27.5731
2017-03-08,27.3851
2017-03-09,27.4656
2017-03-10,27.6626
2017-03-13,27.779
2017-03-14,27.5372
2017-03-15,28.0117
2017-03-16,28.1371
2017-03-17,28.2266
2017-03-20,28.102
2017-03-21,28.0207
2017-03-22,28.0565
2017-03-23,28.1102
2017-03-24,28.1396
2017-03-27,28.3024
2017-03-28,28.3386
2017-03-29,28.3748
2017-03-30,28.3386
2017-03-31,28.4562
2017-04-03,28.3748
2017-04-04,28.3296
2017-04-05,28.1577
2017-04-06,28.212
2017-04-07,28.1034
2017-04-10,28.1125
2017-04-11,28.3296
2017-04-12,28.2843
2017-04-13,28.1758
2017-04-17,28.3476
2017-04-18,28.1396
2017-04-19,28.022
2017-04-20,28.1848
2017-04-21,28.1939
2017-04-24,28.8451
2017-04-25,28.9808
2017-04-26,28.8089
2017-04-27,28.827
2017-04-28,28.7728
2017-05-01,28.8994
2017-05-02,29.0622
2017-05-03,28.8542
2017-05-04,29.1165
2017-05-05,29.5054
2017-05-08,29.3245
2017-05-09,29.2341
2017-05-10,29.3697
2017-05-11,29.1255
2017-05-12,29.3969
2017-05-15,29.6501
2017-05-16,29.822
2017-05-17,29.4964
2017-05-18,29.4873
2017-05-19,29.8853
2017-05-22,30.0753
2017-05-23,30.0934
2017-05-24,30.1476
2017-05-25,30.1205
2017-05-26,30.012
2017-05-30,29.9848
2017-05-31,30.012
2017-06-01,30.2924
2017-06-02,30.3376
2017-06-05,30.1838
2017-06-06,30.0753
2017-06-07,30.0391
2017-06-08,30.1024
2017-06-09,29.9848
2017-06-12,29.8853
2017-06-13,30.229
2017-06-14,30.2381
2017-06-15,29.9125
2017-06-16,30.2562
2017-06-19,30.2833
2017-06-20,29.9407
2017-06-21,29.8303
2017-06-22,29.8579
2017-06-23,29.9683
2017-06-26,30.0512
2017-06-27,29.9867
2017-06-28,30.318
2017-06-29,30.134
2017-06-30,30.1064
2017-07-03,30.088
2017-07-05,30.1248
2017-07-06,29.9407
2017-07-07,29.9959
2017-07-10,29.9591
2017-07-11,30.0051
2017-07-12,30.1708
2017-07-13,30.2996
2017-07-14,30.5848
2017-07-17,30.5664
2017-07-18,30.6768
2017-07-19,30.8517
2017-07-20,30.8885
2017-07-21,30.8057
2017-07-24,30.7136
2017-07-25,30.7412
2017-07-26,30.9345
2017-07-27,30.6032
2017-07-28,30.7044
2017-07-31,30.8333
2017-08-01,30.9621
2017-08-02,31.0265
2017-08-03,31.0173
2017-08-04,30.9621
2017-08-07,30.9437
2017-08-08,30.8425
2017-08-09,30.8057
2017-08-10,30.4008
2017-08-11,30.3456
2017-08-14,30.5572
2017-08-15,30.5342
2017-08-16,30.7965
2017-08-17,30.4744
2017-08-18,30.5756
2017-08-21,30.6216
2017-08-22,30.64
2017-08-23,30.6308
2017-08-24,30.5848
2017-08-25,30.7596
2017-08-28,30.7412
2017-08-29,30.5296
2017-08-30,30.4422
2017-08-31,30.6492
2017-09-01,30.7504
2017-09-05,30.5204
2017-09-06,30.6768
2017-09-07,30.9713
2017-09-08,30.9437
2017-09-11,31.2013
2017-09-12,31.3117
2017-09-13,31.0541
2017-09-14,31.1047
2017-09-15,31.1737
2017-09-18,31.1737
2017-09-19,31.3577
2017-09-20,31.2979
2017-09-21,31.1645
2017-09-22,31.2657
2017-09-25,31.1369
2017-09-26,31.0357
2017-09-27,31.0172
2017-09-28,31.1285
2017-09-29,31.3046
2017-10-02,31.3046
2017-10-03,31.3603
2017-10-04,31.1748
2017-10-05,31.1377
2017-10-06,31.0914
2017-10-09,31.045
2017-10-10,31.3696
2017-10-11,31.4623
2017-10-12,31.4066
2017-10-13,31.5086
2017-10-16,31.3974
2017-10-17,31.3696
2017-10-18,31.4066
2017-10-19,31.4066
2017-10-20,31.3788
2017-10-23,31.2305
2017-10-24,31.2212
2017-10-25,31.0218
2017-10-26,30.9245
2017-10-27,30.8317
2017-10-30,30.9708
2017-10-31,31.0543
2017-11-01,31.0636
2017-11-02,31.1377
2017-11-03,31.0126
2017-11-06,31.1748
2017-11-07,30.9894
2017-11-08,31.0357
2017-11-09,30.9337
2017-11-10,30.8874
2017-11-13,30.6834
2017-11-14,30.7112
2017-11-15,30.6185
2017-11-16,30.8132
2017-11-17,30.637
2017-11-20,30.5814
2017-11-21,30.7019
2017-11-22,30.9059
2017-11-24,31.0033
2017-11-27,30.8596
2017-11-28,31.0914
2017-11-29,31.0543
2017-11-30,31.1192
2017-12-01,31.1238
2017-12-04,30.9986
2017-12-05,30.8781
2017-12-06,30.8039
2017-12-07,30.9013
2017-12-08,31.0821
2017-12-11,31.0914
2017-12-12,31.1377
2017-12-13,31.1841
2017-12-14,31.0636
2017-12-15,31.0172
2017-12-18,31.1934
2017-12-19,31.2305
2017-12-20,31.2026
2017-12-21,31.3692
2017-12-22,31.4207
2017-12-26,31.4442
2017-12-27,31.5286
2017-12-28,31.6505
2017-12-29,31.688
2018-01-02,31.9881
2018-01-03,32.0631
2018-01-04,32.2882
2018-01-05,32.5226
2018-01-08,32.3913
2018-01-09,32.3632
2018-01-10,32.1569
2018-01-11,32.4007
2018-01-12,32.8227
2018-01-16,32.7477
2018-01-17,32.9259
2018-01-18,32.9071
2018-01-19,32.9915
2018-01-22,33.2447
2018-01-23,33.2916
2018-01-24,33.4792
2018-01-25,33.376
2018-01-26,33.648
2018-01-29,33.3104
2018-01-30,33.0244
2018-01-31,33.0478
2018-02-01,33.2635
2018-02-02,32.532
2018-02-05,31.2285
2018-02-06,31.7724
2018-02-07,31.4348
2018-02-08,30.7877
2018-02-09,30.9378
2018-02-12,31.1816
2018-02-13,31.1628
2018-02-14,31.6786
2018-02-15,31.838
2018-02-16,31.8099
2018-02-20,31.5848
2018-02-21,31.4911
2018-02-22,31.6786
2018-02-23,32.0162
2018-02-26,32.2038
2018-02-27,31.7349
2018-02-28,31.3129
2018-03-01,31.116
2018-03-02,31.1535
2018-03-05,31.2941
2018-03-06,31.4629
2018-03-07,31.5098
2018-03-08,31.5286
2018-03-09,31.7068
2018-03-12,31.7161
2018-03-13,31.5286
2018-03-14,31.5755
2018-03-15,31.4817
2018-03-16,31.4817
2018-03-19,31.4254
2018-03-20,31.3223
2018-03-21,31.4536
2018-03-22,30.8198
2018-03-23,30.6589
2018-03-26,31.2835
2018-03-27,30.886
2018-03-28,31.0989
2018-03-29,31.2362
2018-04-02,30.8103
2018-04-03,31.1131
2018-04-04,31.3213
2018-04-05,31.4065
2018-04-06,31.3119
2018-04-09,31.5768
2018-04-10,31.96
2018-04-11,31.8891
2018-04-12,32.0215
2018-04-13,32.0263
2018-04-16,32.1162
2018-04-17,32.2865
2018-04-18,32.419
2018-04-19,32.296
2018-04-20,32.1162
2018-04-23,32.1919
2018-04-24,32.1351
2018-04-25,32.0973
2018-04-26,32.2392
2018-04-27,32.3906
2018-04-30,32.1824
2018-05-01,32.173
2018-05-02,32.0878
2018-05-03,32.2013
2018-05-04,32.2108
2018-05-07,32.2108
2018-05-08,32.102
2018-05-09,32.2108
2018-05-10,32.3527
2018-05-11,32.3859
2018-05-14,32.3811
2018-05-15,32.173
2018-05-16,32.1351
2018-05-17,32.2108
2018-05-18,32.0499
2018-05-21,32.296
2018-05-22,32.2487
2018-05-23,32.0121
2018-05-24,31.9033
2018-05-25,31.5673
2018-05-29,30.8293
2018-05-30,31.4538
2018-05-31,31.3024
2018-06-01,31.3686
2018-06-04,31.5768
2018-06-05,31.4349
2018-06-06,31.6809
2018-06-07,31.5579
2018-06-08,31.5957
2018-06-11,31.785
2018-06-12,31.6052
2018-06-13,31.5863
2018-06-14,31.5106
2018-06-15,31.3119
2018-06-18,31.2267
2018-06-19,31.0733
2018-06-20,31.0974
2018-06-21,30.8805
2018-06-22,31.2565
2018-06-25,30.8998
2018-06-26,30.9817
2018-06-27,30.6491
2018-06-28,30.8033
2018-06-29,30.8998
2018-07-02,30.678
2018-07-03,30.9046
2018-07-05,31.3625
2018-07-06,31.6228
2018-07-09,31.8253
2018-07-10,31.7482
2018-07-11,31.2179
2018-07-12,31.5457
2018-07-13,31.5216
2018-07-16,31.4493
2018-07-17,31.43
2018-07-18,31.4107
2018-07-19,31.2468
2018-07-20,31.5168
2018-07-23,31.43
2018-07-24,31.5168
2018-07-25,31.7867
2018-07-26,31.5215
2018-07-27,31.7867
2018-07-30,31.941
2018-07-31,32.1338
2018-08-01,31.8687
2018-08-02,31.6903
2018-08-03,31.7192
2018-08-06,31.6614
2018-08-07,31.8831
2018-08-08,31.941
2018-08-09,31.8349
2018-08-10,31.3047
2018-08-13,31.1793
2018-08-14,31.1697
2018-08-15,30.8901
2018-08-16,31.1311
2018-08-17,31.3625
2018-08-20,31.4686
2018-08-21,31.7289
2018-08-22,31.8349
2018-08-23,31.4493
2018-08-24,31.6325
2018-08-27,31.9265
2018-08-28,31.8157
2018-08-29,31.9747
2018-08-30,31.7482
2018-08-31,31.4493
2018-09-04,31.1793
2018-09-05,31.1311
2018-09-06,31.0251
2018-09-07,30.7744
2018-09-10,31.1022
2018-09-11,31.1408
2018-09-12,31.2565
2018-09-13,31.3432
2018-09-14,31.2227
2018-09-17,31.5264
2018-09-18,31.7578
2018-09-19,31.7578
2018-09-20,32.1145
2018-09-21,31.9699
2018-09-24,31.9603
2018-09-25,32.1338
2018-09-26,32.0791
2018-09-27,32.0596
2018-09-28,31.7676
2018-10-01,31.7676
2018-10-02,31.6313
2018-10-03,31.641
2018-10-04,31.3684
2018-10-05,31.2418
2018-10-08,31.0569
2018-10-09,30.9498
2018-10-10,30.5993
2018-10-11,30.1514
2018-10-12,30.2391
2018-10-15,30.3364
2018-10-16,30.8524
2018-10-17,30.6577
2018-10-18,30.2391
2018-10-19,30.5214
2018-10-22,30.278
2018-10-23,30.0736
2018-10-24,29.4018
2018-10-25,29.5478
2018-10-26,29.4505
2018-10-29,29.4505
2018-10-30,29.8594
2018-10-31,29.9178
2018-11-01,30.3559
2018-11-02,30.2683
2018-11-05,30.5214
2018-11-06,30.5993
2018-11-07,31.0082
2018-11-08,30.8135
2018-11-09,30.794
2018-11-12,30.3754
2018-11-13,30.3948
2018-11-14,30.5019
2018-11-15,30.3851
2018-11-16,30.3656
2018-11-19,30.1125
2018-11-20,29.6452
2018-11-21,30.0346
2018-11-23,29.7717
2018-11-26,30.132
2018-11-27,30.1076
2018-11-28,30.4825
2018-11-29,30.3169
2018-11-30,30.1709
2018-12-03,30.3072
2018-12-04,29.6987
2018-12-06,29.4359
2018-12-07,29.2506
2018-12-10,28.8517
2018-12-11,28.9345
2018-12-12,29.3531
2018-12-13,29.3531
2018-12-14,28.9929
2018-12-17,28.6327
2018-12-18,28.5412
2018-12-19,28.4621
2018-12-20,28.3632
2018-12-21,27.8586
2018-12-24,27.6608
2018-12-26,28.3038
2018-12-27,28.0268
2018-12-28,28.3236
2018-12-31,28.4027
2019-01-02,28.3335
2019-01-03,28.383
2019-01-04,29.0458
2019-01-07,29.1645
2019-01-08,29.2981
2019-01-09,29.6641
2019-01-10,29.7581
2019-01-11,29.6295
2019-01-14,29.4811
2019-01-15,29.491
2019-01-16,29.5404
2019-01-17,29.7482
2019-01-18,30.0252
2019-01-22,29.6789
2019-01-23,29.8867
2019-01-24,29.9065
2019-01-25,30.1835
2019-01-28,30.0351
2019-01-29,30.1538
2019-01-30,30.5198
2019-01-31,30.5001
2019-02-01,30.5297
2019-02-04,30.594
2019-02-05,30.8958
2019-02-06,30.7177
2019-02-07,30.4407
2019-02-08,30.3517
2019-02-11,30.1934
2019-02-12,30.4605
2019-02-13,30.4407
2019-02-14,30.4605
2019-02-15,30.7276
2019-02-19,30.9255
2019-02-20,30.8859
2019-02-21,30.8562
2019-02-22,31.0244
2019-02-25,31.0936
2019-02-26,31.2717
2019-02-27,31.2519
2019-02-28,31.2915
2019-03-01,31.43
2019-03-04,31.3311
2019-03-05,31.3311
2019-03-06,31.2717
2019-03-07,30.9057
2019-03-08,30.9353
2019-03-11,31.1629
2019-03-12,31.0936
2019-03-13,31.4003
2019-03-14,31.5091
2019-03-15,31.6378
2019-03-18,31.8257
2019-03-19,31.8158
2019-03-20,31.79
2019-03-21,31.61
2019-03-22,31.02
2019-03-25,30.97
2019-03-26,31.035
2019-03-27,30.98
2019-03-28,30.77
2019-03-29,30.86
2019-04-01,31.15
2019-04-02,31.28
2019-04-03,31.56
2019-04-04,31.59
2019-04-05,31.54
2019-04-08,31.49
2019-04-09,31.32
2019-04-10,31.47
2019-04-11,31.49
2019-04-12,31.82
2019-04-15,31.96
2019-04-16,31.9
2019-04-17,32.04
2019-04-18,31.957
2019-04-22,31.97
2019-04-23,31.87
2019-04-24,31.56
2019-04-25,31.52
2019-04-26,31.505
2019-04-29,31.695
2019-04-30,31.69
2019-05-01,31.5
2019-05-02,31.42
2019-05-03,31.65
2019-05-06,31.325
2019-05-07,30.9
2019-05-08,30.92
2019-05-09,30.78
2019-05-10,31.1
2019-05-13,30.37
2019-05-14,30.595
2019-05-15,30.67
2019-05-16,30.8
2019-05-17,30.55
2019-05-20,30.65
2019-05-21,30.88
2019-05-22,30.61
2019-05-23,30.25
2019-05-24,30.6
2019-05-28,30.28
2019-05-29,30.1
2019-05-30,30.21
2019-05-31,30.06
2019-06-03,30.09
2019-06-04,30.58
2019-06-05,30.6
2019-06-06,30.79
2019-06-07,31.17
2019-06-10,31.21
2019-06-11,31.33
2019-06-12,31.03
2019-06-13,30.995
2019-06-14,30.785
2019-06-17,29.895
2019-06-18,30.18
2019-06-19,30.41
2019-06-20,30.545
2019-06-21,30.58
2019-06-24,30.555
2019-06-25,30.38
2019-06-26,30.445
2019-06-27,30.61
2019-06-28,30.69
2019-07-01,30.705
2019-07-02,30.855
2019-07-03,31.16
2019-07-04,31.16
2019-07-05,31.05
2019-07-08,30.795
2019-07-09,30.675
2019-07-10,30.78
2019-07-11,30.795
2019-07-12,30.99
2019-07-15,30.985
2019-07-16,30.765
2019-07-17,30.605
2019-07-18,30.83
2019-07-19,30.76
2019-07-22,30.665
2019-07-23,30.75
2019-07-24,30.795
2019-07-25,30.665
2019-07-26,30.635
2019-07-29,30.645
2019-07-30,30.105
2019-07-31,29.915
2019-08-01,29.925
2019-08-02,29.775
2019-08-05,29.115
2019-08-06,29.225
2019-08-07,29.205
2019-08-08,29.515
2019-08-09,29.36
2019-08-12,29.055
2019-08-13,29.445
2019-08-14,28.61
2019-08-15,28.53
2019-08-16,28.965
2019-08-19,29.285
2019-08-20,29.095
2019-08-21,29.34
2019-08-22,29.365
2019-08-23,29
2019-08-26,29.17
2019-08-27,29.23
2019-08-28,29.155
2019-08-29,29.405
2019-08-30,29.465
2019-09-02,29.46
2019-09-03,29.34
2019-09-04,29.735
2019-09-05,30.095
2019-09-06,30.125
2019-09-09,30.385
2019-09-10,30.67
2019-09-11,30.81
2019-09-12,31.065
2019-09-13,31.25
2019-09-16,31.065
2019-09-17,31.105
2019-09-18,31.05
2019-09-19,31.175
2019-09-20,31.115
2019-09-23,31.03
2019-09-24,30.645
2019-09-25,30.525
2019-09-26,30.59
2019-09-27,30.64
2019-09-30,30.715
2019-10-01,30.51
2019-10-02,29.83
2019-10-03,29.935
2019-10-04,30.09
2019-10-07,30.14
2019-10-08,29.85
2019-10-09,29.95
2019-10-10,30.275
2019-10-11,31.045
2019-10-14,30.905
2019-10-15,31.38
2019-10-16,31.455
2019-10-17,31.605
2019-10-18,31.72
2019-10-21,31.965
2019-10-22,31.96
2019-10-23,32.055
2019-10-24,32.06
2019-10-25,31.975
2019-10-28,32.09
2019-10-29,31.99
2019-10-30,32.055
2019-10-31,31.86
2019-11-01,32.055
2019-11-04,32.145
2019-11-05,32.2
2019-11-06,32.25
2019-11-07,32.425
2019-11-08,32.36
2019-11-11,32.535
2019-11-12,32.555
2019-11-13,32.31
2019-11-14,32.305
2019-11-15,32.47
2019-11-18,32.505
2019-11-19,32.46
2019-11-20,32.255
2019-11-21,32.245
2019-11-22,32.275
2019-11-25,32.455
