date,close
2014-06-13,82.6257
2014-06-16,82.5686
2014-06-17,82.5717
2014-06-18,82.6953
2014-06-19,82.7107
2014-06-20,82.7339
2014-06-23,82.8497
2014-06-24,82.8806
2014-06-25,82.8034
2014-06-26,82.7339
2014-06-27,82.4636
2014-06-30,82.8201
2014-07-01,82.7193
2014-07-02,82.6806
2014-07-03,82.7271
2014-07-07,82.7116
2014-07-08,82.6263
2014-07-09,82.5101
2014-07-10,82.3938
2014-07-11,82.4403
2014-07-14,82.4481
2014-07-15,82.386
2014-07-16,82.2311
2014-07-17,81.8049
2014-07-18,81.9366
2014-07-21,81.9056
2014-07-22,81.9754
2014-07-23,82.1148
2014-07-24,82.1846
2014-07-25,82.0916
2014-07-28,82.0761
2014-07-29,82.0141
2014-07-30,81.4794
2014-07-31,81.4172
2014-08-01,81.1529
2014-08-04,81.3239
2014-08-05,81.1606
2014-08-06,81.3317
2014-08-07,81.2773
2014-08-08,81.425
2014-08-11,81.6738
2014-08-12,81.7826
2014-08-13,81.8059
2014-08-14,81.9692
2014-08-15,82.2102
2014-08-18,82.2724
2014-08-19,82.467
2014-08-20,82.3191
2014-08-21,82.3424
2014-08-22,82.3113
2014-08-25,82.3444
2014-08-26,82.3657
2014-08-27,82.4124
2014-08-28,82.4124
2014-08-29,82.3968
2014-09-02,82.4982
2014-09-03,82.467
2014-09-04,82.3578
2014-09-05,82.311
2014-09-08,82.194
2014-09-09,82.0302
2014-09-10,81.9054
2014-09-11,81.8586
2014-09-12,81.804
2014-09-15,81.765
2014-09-16,81.7962
2014-09-17,81.7806
2014-09-18,81.8335
2014-09-19,81.9054
2014-09-22,81.921
2014-09-23,81.6948
2014-09-24,81.4999
2014-09-25,81.1254
2014-09-26,81.1254
2014-09-29,80.9616
2014-09-30,81.1104
2014-10-01,81.2317
2014-10-02,81.3451
2014-10-03,81.6347
2014-10-06,81.799
2014-10-07,81.5877
2014-10-08,81.6894
2014-10-09,81.2278
2014-10-10,80.8991
2014-10-13,80.5704
2014-10-14,80.5391
2014-10-15,80.4687
2014-10-16,81.0243
2014-10-17,81.0243
2014-10-20,81.3451
2014-10-21,81.6894
2014-10-22,81.6268
2014-10-23,81.7129
2014-10-24,81.7676
2014-10-27,81.6581
2014-10-28,81.7912
2014-10-29,81.7756
2014-10-30,82.0192
2014-10-31,81.9171
2014-11-03,81.7915
2014-11-04,81.8857
2014-11-05,81.9059
2014-11-06,81.9014
2014-11-07,81.9799
2014-11-10,82.082
2014-11-11,82.0585
2014-11-12,82.0192
2014-11-13,81.8857
2014-11-14,81.6658
2014-11-17,81.6815
2014-11-18,81.5245
2014-11-19,81.3989
2014-11-20,81.3674
2014-11-21,81.6266
2014-11-24,81.6423
2014-11-25,81.7915
2014-11-26,81.87
2014-11-28,81.3972
2014-12-01,80.9952
2014-12-02,81.2908
2014-12-03,81.3578
2014-12-04,81.3735
2014-12-05,81.208
2014-12-08,80.8928
2014-12-09,80.6563
2014-12-10,80.1588
2014-12-11,80.0156
2014-12-12,79.6179
2014-12-15,79.5224
2014-12-16,78.8701
2014-12-17,79.8963
2014-12-18,80.2782
2014-12-19,80.6839
2014-12-22,80.8191
2014-12-23,81.0499
2014-12-24,81.0419
2014-12-26,81.0339
2014-12-29,81.0899
2014-12-30,80.8261
2014-12-31,80.5864
2015-01-02,80.8261
2015-01-05,80.4905
2015-01-06,80.1867
2015-01-07,80.3945
2015-01-08,80.8421
2015-01-09,80.8741
2015-01-12,80.8821
2015-01-13,80.7694
2015-01-14,80.5544
2015-01-15,80.4665
2015-01-16,80.6183
2015-01-20,80.6263
2015-01-21,80.5864
2015-01-22,80.7542
2015-01-23,80.8421
2015-01-26,80.978
2015-01-27,80.8141
2015-01-28,80.8821
2015-01-29,81.0339
2015-01-30,80.8334
2015-02-02,80.9698
2015-02-03,81.2104
2015-02-04,81.2265
2015-02-05,81.3468
2015-02-06,81.5795
2015-02-09,81.6115
2015-02-10,81.6356
2015-02-11,81.5875
2015-02-12,81.4752
2015-02-13,81.6918
2015-02-17,81.7559
2015-02-18,81.788
2015-02-19,81.764
2015-02-20,81.8362
2015-02-23,81.9405
2015-02-24,82.0688
2015-02-25,82.1972
2015-02-26,82.1851
2015-02-27,82.314
2015-03-02,82.4629
2015-03-03,82.3341
2015-03-04,82.2053
2015-03-05,82.2214
2015-03-06,82.0442
2015-03-09,81.9395
2015-03-10,81.9476
2015-03-11,81.9637
2015-03-12,82.0039
2015-03-13,81.7946
2015-03-16,81.7382
2015-03-17,81.4483
2015-03-18,81.7463
2015-03-19,81.6416
2015-03-20,81.706
2015-03-23,81.7382
2015-03-24,81.8912
2015-03-25,81.859
2015-03-26,81.8429
2015-03-27,81.8671
2015-03-30,82.0281
2015-03-31,82.0281
2015-04-01,82.117
2015-04-02,82.1736
2015-04-06,82.3513
2015-04-07,82.4402
2015-04-08,82.5695
2015-04-09,82.5614
2015-04-10,82.5857
2015-04-13,82.5534
2015-04-14,82.5614
2015-04-15,82.6422
2015-04-16,82.5049
2015-04-17,82.416
2015-04-20,82.4726
2015-04-21,82.5695
2015-04-22,82.5938
2015-04-23,82.5614
2015-04-24,82.5857
2015-04-27,82.6584
2015-04-28,82.7392
2015-04-29,82.6746
2015-04-30,82.4474
2015-05-01,82.5853
2015-05-04,82.707
2015-05-05,82.6016
2015-05-06,82.5286
2015-05-07,82.4393
2015-05-08,82.6908
2015-05-11,82.5853
2015-05-12,82.4637
2015-05-13,82.5529
2015-05-14,82.707
2015-05-15,82.8124
2015-05-18,82.7719
2015-05-19,82.7313
2015-05-20,82.6746
2015-05-21,82.7638
2015-05-22,82.8124
2015-05-26,82.7638
2015-05-27,82.8854
2015-05-28,82.8773
2015-05-29,82.9018
2015-06-01,83.0809
2015-06-02,82.975
2015-06-03,82.8448
2015-06-04,82.7389
2015-06-05,82.5435
2015-06-08,82.3482
2015-06-09,82.2342
2015-06-10,82.3156
2015-06-11,82.2912
2015-06-12,82.2423
2015-06-15,82.0144
2015-06-16,82.0307
2015-06-17,81.9818
2015-06-18,82.1283
2015-06-19,82.1772
2015-06-22,82.3319
2015-06-23,82.3156
2015-06-24,82.226
2015-06-25,82.2342
2015-06-26,82.1528
2015-06-29,81.5829
2015-06-30,81.6483
2015-07-01,81.8118
2015-07-02,81.9344
2015-07-06,81.6564
2015-07-07,81.6973
2015-07-08,81.5256
2015-07-09,81.5175
2015-07-10,81.82
2015-07-13,81.9916
2015-07-14,81.9181
2015-07-15,81.9671
2015-07-16,82.0816
2015-07-17,81.8281
2015-07-20,81.7382
2015-07-21,81.6319
2015-07-22,81.2313
2015-07-23,81.2068
2015-07-24,80.9288
2015-07-27,80.6509
2015-07-28,80.9615
2015-07-29,81.2232
2015-07-30,81.4848
2015-07-31,81.2631
2015-08-03,81.14
2015-08-04,81.1154
2015-08-05,81.0087
2015-08-06,80.8281
2015-08-07,80.59
2015-08-10,80.6721
2015-08-11,80.4997
2015-08-12,80.3191
2015-08-13,80.278
2015-08-14,80.3683
2015-08-17,80.3027
2015-08-18,80.2206
2015-08-19,80.0646
2015-08-20,79.8101
2015-08-21,79.6788
2015-08-24,78.9399
2015-08-25,79.3263
2015-08-26,79.728
2015-08-27,80.1385
2015-08-28,80.1139
2015-08-31,80.2869
2015-09-01,80.0314
2015-09-02,80.2539
2015-09-03,80.3116
2015-09-04,80.2869
2015-09-08,80.6001
2015-09-09,80.6166
2015-09-10,80.6743
2015-09-11,80.765
2015-09-14,80.5919
2015-09-15,80.5342
2015-09-16,80.1715
2015-09-17,80.2539
2015-09-18,79.9902
2015-09-21,80.0067
2015-09-22,79.71
2015-09-23,79.6111
2015-09-24,79.3143
2015-09-25,79.1248
2015-09-28,78.3624
2015-09-29,78.1769
2015-09-30,78.326
2015-10-01,78.1521
2015-10-02,78.0445
2015-10-05,78.6985
2015-10-06,79.0213
2015-10-07,79.8077
2015-10-08,79.8491
2015-10-09,80.1223
2015-10-12,80.2299
2015-10-13,79.8325
2015-10-14,79.7167
2015-10-15,79.7663
2015-10-16,80.1719
2015-10-19,80.263
2015-10-20,80.2299
2015-10-21,80.1802
2015-10-22,80.1554
2015-10-23,80.4948
2015-10-26,80.3623
2015-10-27,80.1637
2015-10-28,80.3623
2015-10-29,80.2713
2015-10-30,80.2216
2015-11-02,80.5292
2015-11-03,80.5542
2015-11-04,80.4212
2015-11-05,80.1551
2015-11-06,79.8557
2015-11-09,79.5232
2015-11-10,79.4649
2015-11-11,79.3319
2015-11-12,78.858
2015-11-13,78.5753
2015-11-16,78.7748
2015-11-17,78.9661
2015-11-18,78.8912
2015-11-19,78.3424
2015-11-20,78.2343
2015-11-23,78.2094
2015-11-24,78.2926
2015-11-25,78.3092
2015-11-27,78.4256
2015-11-30,78.4755
2015-12-01,78.9098
2015-12-02,78.8681
2015-12-03,78.3585
2015-12-04,78.417
2015-12-07,77.9158
2015-12-08,77.1474
2015-12-09,77.2727
2015-12-10,77.2142
2015-12-11,76.1283
2015-12-14,75.7357
2015-12-15,76.404
2015-12-16,76.7715
2015-12-17,76.2035
2015-12-18,76.003
2015-12-21,75.6271
2015-12-22,76.2453
2015-12-23,76.688
2015-12-24,76.6997
2015-12-28,76.3789
2015-12-29,76.7061
2015-12-30,76.7313
2015-12-31,76.874
2016-01-04,76.7397
2016-01-05,76.7313
2016-01-06,76.639
2016-01-07,76.3957
2016-01-08,76.2614
2016-01-11,76.2363
2016-01-12,76.2363
2016-01-13,75.5315
2016-01-14,75.7328
2016-01-15,75.0029
2016-01-19,74.7763
2016-01-20,74.0547
2016-01-21,74.5078
2016-01-22,75.4224
2016-01-25,75.1958
2016-01-26,75.3721
2016-01-27,75.1455
2016-01-28,75.5147
2016-01-29,75.6741
2016-02-01,75.3959
2016-02-02,75.0924
2016-02-03,75.1514
2016-02-04,75.2104
2016-02-05,74.7636
2016-02-08,73.8025
2016-02-09,73.4063
2016-02-10,73.2629
2016-02-11,72.8583
2016-02-12,73.4906
2016-02-16,73.7688
2016-02-17,74.1144
2016-02-18,74.2156
2016-02-19,74.5107
2016-02-22,74.9322
2016-02-23,75.1008
2016-02-24,75.2273
2016-02-25,75.4043
2016-02-26,75.7837
2016-02-29,76.3992
2016-03-01,77.1277
2016-03-02,76.9837
2016-03-03,77.1277
2016-03-04,77.5173
2016-03-07,77.602
2016-03-08,77.3564
2016-03-09,77.458
2016-03-10,77.8731
2016-03-11,78.8557
2016-03-14,78.5762
2016-03-15,78.2119
2016-03-16,78.6524
2016-03-17,78.8473
2016-03-18,79.0929
2016-03-21,79.1775
2016-03-22,79.0506
2016-03-23,78.6185
2016-03-24,78.3051
2016-03-28,78.1865
2016-03-29,78.3136
2016-03-30,78.6948
2016-03-31,78.7471
2016-04-01,79.0194
2016-04-04,78.7046
2016-04-05,78.4323
2016-04-06,78.7982
2016-04-07,78.6791
2016-04-08,78.9428
2016-04-11,79.1385
2016-04-12,79.5979
2016-04-13,80.0828
2016-04-14,79.9212
2016-04-15,80.0063
2016-04-18,80.4061
2016-04-19,80.7805
2016-04-20,80.9676
2016-04-21,80.7209
2016-04-22,80.8996
2016-04-25,80.806
2016-04-26,80.9846
2016-04-27,81.2994
2016-04-28,81.1973
2016-04-29,81.0272
2016-05-02,81.6082
2016-05-03,81.1895
2016-05-04,80.9417
2016-05-05,80.9674
2016-05-06,80.7025
2016-05-09,80.6598
2016-05-10,81.1212
2016-05-11,81.0784
2016-05-12,81.3348
2016-05-13,81.1895
2016-05-16,81.3861
2016-05-17,81.3775
2016-05-18,81.275
2016-05-19,81.2066
2016-05-20,81.3433
2016-05-23,81.4459
2016-05-24,81.8218
2016-05-25,82.0782
2016-05-26,82.0782
2016-05-27,82.1208
2016-05-31,82.0764
2016-06-01,82.1965
2016-06-02,82.3338
2016-06-03,82.4968
2016-06-06,82.7542
2016-06-07,82.9602
2016-06-08,83.2176
2016-06-09,83.0374
2016-06-10,82.7371
2016-06-13,82.2394
2016-06-14,82.1708
2016-06-15,82.2652
2016-06-16,82.0507
2016-06-17,82.0335
2016-06-20,82.6084
2016-06-21,82.9516
2016-06-22,82.8057
2016-06-23,83.2433
2016-06-24,82.3853
2016-06-27,81.124
2016-06-28,82.0507
2016-06-29,82.7542
2016-06-30,83.0904
2016-07-01,83.2111
2016-07-05,83.0818
2016-07-06,83.4955
2016-07-07,83.4782
2016-07-08,84.3486
2016-07-11,84.4865
2016-07-12,84.2883
2016-07-13,84.228
2016-07-14,84.1763
2016-07-15,84.1418
2016-07-18,84.3745
2016-07-19,84.1418
2016-07-20,84.4434
2016-07-21,84.2538
2016-07-22,84.452
2016-07-25,84.228
2016-07-26,84.047
2016-07-27,84.1935
2016-07-28,83.9522
2016-07-29,84.1504
2016-08-01,84.0551
2016-08-02,83.7782
2016-08-03,83.8041
2016-08-04,84.3408
2016-08-05,84.5312
2016-08-08,84.687
2016-08-09,85.0159
2016-08-10,84.8515
2016-08-11,85.0419
2016-08-12,85.1544
2016-08-15,85.3189
2016-08-16,85.0765
2016-08-17,85.2929
2016-08-18,85.3795
2016-08-19,85.2237
2016-08-22,85.1371
2016-08-23,85.3535
2016-08-24,85.2929
2016-08-25,85.3189
2016-08-26,85.3795
2016-08-29,85.6478
2016-08-30,85.5699
2016-08-31,85.3293
2016-09-01,85.538
2016-09-02,85.7728
2016-09-06,85.8424
2016-09-07,85.6859
2016-09-08,85.6598
2016-09-09,84.9989
2016-09-12,85.112
2016-09-13,84.7294
2016-09-14,84.7815
2016-09-15,85.1293
2016-09-16,85.0946
2016-09-19,85.3033
2016-09-20,85.2859
2016-09-21,85.8685
2016-09-22,86.2946
2016-09-23,86.1467
2016-09-26,85.7815
2016-09-27,86.0772
2016-09-28,86.4945
2016-09-29,86.1902
2016-09-30,86.5206
2016-10-03,86.5294
2016-10-04,86.4857
2016-10-05,86.5556
2016-10-06,86.6255
2016-10-07,86.7478
2016-10-10,86.8002
2016-10-11,86.7041
2016-10-12,86.739
2016-10-13,86.6953
2016-10-14,86.6342
2016-10-17,86.5643
2016-10-18,86.8526
2016-10-19,87.0797
2016-10-20,86.9662
2016-10-21,87.1147
2016-10-24,87.1933
2016-10-25,87.1496
2016-10-26,86.8089
2016-10-27,86.5643
2016-10-28,86.3197
2016-10-31,86.0052
2016-11-01,85.8736
2016-11-02,85.5664
2016-11-03,85.5664
2016-11-04,85.584
2016-11-07,86.5756
2016-11-08,86.5229
2016-11-09,86.0403
2016-11-10,85.4085
2016-11-11,84.6187
2016-11-14,85.2768
2016-11-15,86.2948
2016-11-16,86.1017
2016-11-17,85.8472
2016-11-18,86.0403
2016-11-21,86.637
2016-11-22,87.1723
2016-11-23,86.7774
2016-11-25,86.9266
2016-11-28,86.8037
2016-11-29,86.7686
2016-11-30,86.9002
2016-12-01,86.7681
2016-12-02,87.2351
2016-12-05,87.4201
2016-12-06,87.7902
2016-12-07,88.0017
2016-12-08,87.9664
2016-12-09,88.0193
2016-12-12,87.9841
2016-12-13,88.2044
2016-12-14,87.6668
2016-12-15,87.6845
2016-12-16,87.7021
2016-12-19,87.9488
2016-12-20,87.8519
2016-12-21,88.1603
2016-12-22,88.266
2016-12-23,88.3982
2016-12-27,88.2308
2016-12-28,88.2219
2016-12-29,88.2573
2016-12-30,88.3901
2017-01-03,88.691
2017-01-04,89.0185
2017-01-05,88.8592
2017-01-06,88.8327
2017-01-09,88.7884
2017-01-10,88.9566
2017-01-11,88.8769
2017-01-12,88.9654
2017-01-13,89.0097
2017-01-17,88.9566
2017-01-18,89.054
2017-01-19,88.815
2017-01-20,89.0451
2017-01-23,89.0451
2017-01-24,89.1867
2017-01-25,89.346
2017-01-26,89.3106
2017-01-27,89.3549
2017-01-30,89.231
2017-01-31,89.2664
2017-02-01,89.4202
2017-02-02,89.3935
2017-02-03,89.5892
2017-02-06,89.518
2017-02-07,89.4736
2017-02-08,89.4825
2017-02-09,89.607
2017-02-10,89.607
2017-02-13,89.7581
2017-02-14,89.8026
2017-02-15,89.8115
2017-02-16,89.687
2017-02-17,89.7581
2017-02-21,90.0249
2017-02-22,89.9893
2017-02-23,90.1494
2017-02-24,90.1316
2017-02-27,90.2027
2017-02-28,90.2561
2017-03-01,90.4722
2017-03-02,90.2311
2017-03-03,90.3383
2017-03-06,90.0256
2017-03-07,89.5612
2017-03-08,88.9806
2017-03-09,88.8287
2017-03-10,88.8019
2017-03-13,89.1771
2017-03-14,88.8823
2017-03-15,89.7666
2017-03-16,89.4183
2017-03-17,89.4986
2017-03-20,89.3877
2017-03-21,88.8645
2017-03-22,89.0342
2017-03-23,89.1235
2017-03-24,89.3468
2017-03-27,89.2753
2017-03-28,89.7219
2017-03-29,89.9631
2017-03-30,90.1328
2017-03-31,90.2668
2017-04-03,90.1726
2017-04-04,90.2623
2017-04-05,89.9841
2017-04-06,90.2623
2017-04-07,90.1546
2017-04-10,90.3879
2017-04-11,90.2982
2017-04-12,90.4507
2017-04-13,90.1905
2017-04-17,90.4776
2017-04-18,90.5315
2017-04-19,90.343
2017-04-20,90.7109
2017-04-21,90.7288
2017-04-24,91.0877
2017-04-25,91.1416
2017-04-26,90.8634
2017-04-27,90.9442
2017-04-28,91.0519
2017-05-01,90.9591
2017-05-02,91.0402
2017-05-03,91.1483
2017-05-04,90.8419
2017-05-05,90.9591
2017-05-08,90.9951
2017-05-09,90.932
2017-05-10,91.2384
2017-05-11,91.2294
2017-05-12,91.2023
2017-05-15,91.4456
2017-05-16,91.5447
2017-05-17,91.1933
2017-05-18,91.1483
2017-05-19,91.2114
2017-05-22,91.5718
2017-05-23,91.5177
2017-05-24,91.6168
2017-05-25,91.5988
2017-05-26,91.5988
2017-05-30,91.77
2017-05-31,91.8421
2017-06-01,91.9715
2017-06-02,91.9715
2017-06-05,91.9172
2017-06-06,91.9443
2017-06-07,91.5914
2017-06-08,91.6638
2017-06-09,91.6819
2017-06-12,91.8177
2017-06-13,92.0439
2017-06-14,91.9805
2017-06-15,91.8267
2017-06-16,91.5281
2017-06-19,91.8267
2017-06-20,91.6005
2017-06-21,91.0485
2017-06-22,91.3652
2017-06-23,91.6095
2017-06-26,91.7543
2017-06-27,91.5824
2017-06-28,91.7995
2017-06-29,91.5552
2017-06-30,91.7181
2017-07-03,91.6999
2017-07-05,91.609
2017-07-06,91.5818
2017-07-07,91.3728
2017-07-10,91.5818
2017-07-11,91.5091
2017-07-12,92.0271
2017-07-13,92.0361
2017-07-14,92.1906
2017-07-17,92.1815
2017-07-18,92.2633
2017-07-19,92.3633
2017-07-20,92.3996
2017-07-21,92.3178
2017-07-24,92.3633
2017-07-25,92.3996
2017-07-26,92.5178
2017-07-27,92.4542
2017-07-28,92.4542
2017-07-31,92.4723
2017-08-01,92.5727
2017-08-02,92.6822
2017-08-03,92.4085
2017-08-04,92.5727
2017-08-07,92.4632
2017-08-08,92.226
2017-08-09,91.9705
2017-08-10,91.4048
2017-08-11,91.8336
2017-08-14,92.1439
2017-08-15,92.1804
2017-08-16,92.1712
2017-08-17,91.715
2017-08-18,91.7971
2017-08-21,91.8975
2017-08-22,92.2077
2017-08-23,92.2625
2017-08-24,92.3263
2017-08-25,92.4176
2017-08-28,92.4906
2017-08-29,92.4449
2017-08-30,92.4541
2017-08-31,92.7643
2017-09-01,92.801
2017-09-05,92.7002
2017-09-06,92.6819
2017-09-07,92.7277
2017-09-08,92.5445
2017-09-11,92.7002
2017-09-12,92.801
2017-09-13,92.6819
2017-09-14,92.8468
2017-09-15,92.9109
2017-09-18,92.8651
2017-09-19,92.9384
2017-09-20,92.8376
2017-09-21,92.7368
2017-09-22,92.8834
2017-09-25,92.8468
2017-09-26,92.9201
2017-09-27,92.9109
2017-09-28,92.9475
2017-09-29,93.0208
2017-10-02,93.1404
2017-10-03,93.2691
2017-10-04,93.0668
2017-10-05,93.2783
2017-10-06,93.0576
2017-10-09,93.122
2017-10-10,93.2967
2017-10-11,93.1955
2017-10-12,93.1036
2017-10-13,93.0944
2017-10-16,93.2047
2017-10-17,93.3243
2017-10-18,93.4255
2017-10-19,93.4347
2017-10-20,93.4991
2017-10-23,93.4071
2017-10-24,93.4899
2017-10-25,93.2415
2017-10-26,93.1772
2017-10-27,93.2323
2017-10-30,93.2047
2017-10-31,93.2875
2017-11-01,93.2782
2017-11-02,93.1952
2017-11-03,93.2598
2017-11-06,93.2506
2017-11-07,93.029
2017-11-08,92.5674
2017-11-09,92.2258
2017-11-10,92.6782
2017-11-13,92.5028
2017-11-14,92.3089
2017-11-15,92.2443
2017-11-16,92.8444
2017-11-17,92.8536
2017-11-20,92.8628
2017-11-21,92.8905
2017-11-22,93.0567
2017-11-24,93.1398
2017-11-27,92.9828
2017-11-28,93.1305
2017-11-29,93.0844
2017-11-30,93.2044
2017-12-01,93.1423
2017-12-04,93.0682
2017-12-05,92.9477
2017-12-06,92.8273
2017-12-07,92.9292
2017-12-08,93.0311
2017-12-11,93.0775
2017-12-12,93.1145
2017-12-13,93.1701
2017-12-14,93.0033
2017-12-15,93.0126
2017-12-18,93.0682
2017-12-19,92.9385
2017-12-20,93.0311
2017-12-21,93.1238
2017-12-22,93.2628
2017-12-26,93.5038
2017-12-27,93.513
2017-12-28,93.7849
2017-12-29,93.8315
2018-01-02,94.009
2018-01-03,94.2985
2018-01-04,94.4385
2018-01-05,94.4292
2018-01-08,94.4759
2018-01-09,94.2424
2018-01-10,94.0463
2018-01-11,94.2144
2018-01-12,94.1957
2018-01-16,94.2518
2018-01-17,94.2611
2018-01-18,94.2798
2018-01-19,94.2611
2018-01-22,94.4292
2018-01-23,94.7
2018-01-24,94.6346
2018-01-25,94.5693
2018-01-26,94.6813
2018-01-29,94.5693
2018-01-30,94.0463
2018-01-31,94.4385
2018-02-01,94.2089
2018-02-02,93.8995
2018-02-05,93.1776
2018-02-06,93.9182
2018-02-07,93.4214
2018-02-08,93.1214
2018-02-09,92.587
2018-02-12,93.3839
2018-02-13,93.0276
2018-02-14,93.3089
2018-02-15,93.7964
2018-02-16,94.1995
2018-02-20,93.8057
2018-02-21,93.6464
2018-02-22,93.4776
2018-02-23,93.9557
2018-02-26,94.1714
2018-02-27,94.0307
2018-02-28,93.8995
2018-03-01,93.8854
2018-03-02,94.0454
2018-03-05,94.0171
2018-03-06,94.2148
2018-03-07,94.0548
2018-03-08,94.1489
2018-03-09,94.6006
2018-03-12,94.3654
2018-03-13,94.196
2018-03-14,94.1301
2018-03-15,94.0548
2018-03-16,94.2054
2018-03-19,93.8572
2018-03-20,94.0548
2018-03-21,93.9513
2018-03-22,93.4901
2018-03-23,93.3584
2018-03-26,93.763
2018-03-27,93.7254
2018-03-28,93.6972
2018-03-29,93.7913
2018-04-02,93.5458
2018-04-03,93.7347
2018-04-04,93.848
2018-04-05,93.9424
2018-04-06,93.848
2018-04-09,94.1313
2018-04-10,94.424
2018-04-11,94.4146
2018-04-12,94.7829
2018-04-13,94.7545
2018-04-16,94.8962
2018-04-17,94.8679
2018-04-18,94.8017
2018-04-19,94.4901
2018-04-20,94.3768
2018-04-23,94.2351
2018-04-24,94.0841
2018-04-25,94.169
2018-04-26,94.6223
2018-04-27,94.4901
2018-04-30,94.3957
2018-05-01,94.5759
2018-05-02,94.6138
2018-05-03,94.6422
2018-05-04,94.6801
2018-05-07,94.7465
2018-05-08,94.6138
2018-05-09,94.7655
2018-05-10,94.9456
2018-05-11,94.9266
2018-05-14,95.0214
2018-05-15,94.6991
2018-05-16,94.6517
2018-05-17,94.6801
2018-05-18,94.6801
2018-05-21,94.8887
2018-05-22,94.9456
2018-05-23,94.9882
2018-05-24,94.9835
2018-05-25,94.8887
2018-05-29,94.4242
2018-05-30,94.8223
2018-05-31,94.6327
2018-06-01,94.8421
2018-06-04,94.9468
2018-06-05,94.9849
2018-06-06,95.1467
2018-06-07,95.1848
2018-06-08,95.1086
2018-06-11,95.2514
2018-06-12,95.3466
2018-06-13,95.3276
2018-06-14,95.556
2018-06-15,95.5941
2018-06-18,95.537
2018-06-19,95.3942
2018-06-20,95.556
2018-06-21,95.3656
2018-06-22,95.3371
2018-06-25,95.2133
2018-06-26,95.2038
2018-06-27,95.0325
2018-06-28,94.7945
2018-06-29,94.7374
2018-07-02,94.6705
2018-07-03,94.7757
2018-07-05,94.9668
2018-07-06,95.2823
2018-07-09,95.4543
2018-07-10,95.4639
2018-07-11,95.3205
2018-07-12,95.5404
2018-07-13,95.5308
2018-07-16,95.5691
2018-07-17,95.5213
2018-07-18,95.5977
2018-07-19,95.5882
2018-07-20,95.6073
2018-07-23,95.6168
2018-07-24,95.7124
2018-07-25,95.8845
2018-07-26,95.9514
2018-07-27,95.8558
2018-07-30,95.9227
2018-07-31,96.0566
2018-08-01,96.0757
2018-08-02,96.0757
2018-08-03,96.1909
2018-08-06,96.258
2018-08-07,96.3156
2018-08-08,96.306
2018-08-09,96.1525
2018-08-10,95.8742
2018-08-13,95.9605
2018-08-14,95.9797
2018-08-15,95.8934
2018-08-16,96.1429
2018-08-17,96.1525
2018-08-20,96.3156
2018-08-21,96.4212
2018-08-22,96.3828
2018-08-23,96.2964
2018-08-24,96.4788
2018-08-27,96.498
2018-08-28,96.5555
2018-08-29,96.4788
2018-08-30,96.3444
2018-08-31,96.546
2018-09-04,96.5074
2018-09-05,96.199
2018-09-06,96.1894
2018-09-07,96.2665
2018-09-10,96.3339
2018-09-11,96.4785
2018-09-12,96.6712
2018-09-13,96.7098
2018-09-14,96.8447
2018-09-17,96.8158
2018-09-18,96.7965
2018-09-19,96.7002
2018-09-20,96.7869
2018-09-21,96.8351
2018-09-24,96.8833
2018-09-25,96.7676
2018-09-26,96.9314
2018-09-27,97.0085
2018-09-28,96.9796
2018-10-01,97.0086
2018-10-02,97.1924
2018-10-03,97.0183
2018-10-04,96.8055
2018-10-05,96.4283
2018-10-08,96.3606
2018-10-09,96.3509
2018-10-10,95.8673
2018-10-11,95.9544
2018-10-12,96.2735
2018-10-15,96.2155
2018-10-16,96.4186
2018-10-17,96.3606
2018-10-18,95.9737
2018-10-19,95.935
2018-10-22,96.0317
2018-10-23,95.9544
2018-10-24,95.5675
2018-10-25,95.6932
2018-10-26,95.4224
2018-10-29,95.3934
2018-10-30,95.3741
2018-10-31,95.4901
2018-11-01,95.7816
2018-11-02,95.8496
2018-11-05,95.8302
2018-11-06,95.9857
2018-11-07,96.384
2018-11-08,96.3354
2018-11-09,95.8011
2018-11-12,95.393
2018-11-13,95.4221
2018-11-14,95.1598
2018-11-15,95.0821
2018-11-16,94.7323
2018-11-19,94.81
2018-11-20,94.538
2018-11-21,94.742
2018-11-23,94.3728
2018-11-26,94.6545
2018-11-27,94.7906
2018-11-28,95.0821
2018-11-29,95.2667
2018-11-30,95.0821
2018-12-03,95.5994
2018-12-04,95.0918
2018-12-06,94.8673
2018-12-07,94.7599
2018-12-10,94.6721
2018-12-11,94.8087
2018-12-12,95.043
2018-12-13,95.1699
2018-12-14,94.9356
2018-12-17,94.428
2018-12-18,94.1157
2018-12-19,93.3641
2018-12-20,92.8956
2018-12-21,92.3294
2018-12-24,91.8902
2018-12-26,92.9639
2018-12-27,92.8467
2018-12-28,93.0034
2018-12-31,93.1601
2019-01-02,93.1308
2019-01-03,93.121
2019-01-04,94.2277
2019-01-07,95.1581
2019-01-08,95.5597
2019-01-09,95.5303
2019-01-10,96.3236
2019-01-11,96.0102
2019-01-14,95.7164
2019-01-15,95.8829
2019-01-16,96.1669
2019-01-17,96.2452
2019-01-18,96.3334
2019-01-22,95.9024
2019-01-23,96.02
2019-01-24,96.1375
2019-01-25,96.1767
2019-01-28,96.255
2019-01-29,96.0689
2019-01-30,96.7153
2019-01-31,96.7251
2019-02-01,96.8039
2019-02-04,97.1186
2019-02-05,97.3153
2019-02-06,97.2858
2019-02-07,96.9809
2019-02-08,96.9219
2019-02-11,96.9809
2019-02-12,97.4235
2019-02-13,97.2071
2019-02-14,97.2661
2019-02-15,97.512
2019-02-19,97.6596
2019-02-20,97.7678
2019-02-21,97.7481
2019-02-22,97.8563
2019-02-25,97.9251
2019-02-26,98.1415
2019-02-27,97.994
2019-02-28,98.1022
2019-03-01,98.033
2019-03-04,98.0133
2019-03-05,98.1021
2019-03-06,97.7861
2019-03-07,97.717
2019-03-08,97.4899
2019-03-11,97.8651
2019-03-12,97.8948
2019-03-13,98.1713
2019-03-14,98.112
2019-03-15,98.0824
2019-03-18,98.1416
2019-03-19,98.2404
2019-03-20,98.507
2019-03-21,98.665
2019-03-22,98.3391
2019-03-25,98.2108
2019-03-26,98.3391
2019-03-27,98.5268
2019-03-28,98.6453
2019-03-29,98.9415
2019-04-01,99.0307
2019-04-02,98.9613
2019-04-03,98.9911
2019-04-04,99.0109
2019-04-05,99.1795
2019-04-08,99.2786
2019-04-09,99.2092
2019-04-10,99.4571
2019-04-11,99.5265
2019-04-12,99.6554
2019-04-15,99.5661
2019-04-16,99.5959
2019-04-17,99.4372
2019-04-18,99.3976
2019-04-22,99.4472
2019-04-23,99.6455
2019-04-24,99.6455
2019-04-25,99.5463
2019-04-26,99.814
2019-04-29,99.7347
2019-04-30,99.8537
2019-05-01,99.4952
2019-05-02,99.5649
2019-05-03,99.7242
2019-05-06,99.7441
2019-05-07,99.2463
2019-05-08,99.3857
2019-05-09,99.2762
2019-05-10,99.3757
2019-05-13,98.8182
2019-05-14,98.9277
2019-05-15,99.0073
2019-05-16,99.3658
2019-05-17,99.2363
2019-05-20,99.1666
2019-05-21,99.316
2019-05-22,99.4852
2019-05-23,99.1567
2019-05-24,98.9874
2019-05-28,99.1766
2019-05-29,98.8182
2019-05-30,98.8381
2019-05-31,98.4
2019-06-03,98.23
2019-06-04,99.06
2019-06-05,99.35
2019-06-06,99.4
2019-06-07,99.51
2019-06-10,99.7
2019-06-11,99.8
2019-06-12,99.53
2019-06-13,99.71
2019-06-14,99.78
2019-06-17,99.575
2019-06-18,99.905
2019-06-19,100.245
2019-06-20,100.675
2019-06-21,100.575
2019-06-24,100.56
2019-06-25,100.26
2019-06-26,100.235
2019-06-27,100.375
2019-06-28,100.57
2019-07-01,100.3
2019-07-02,100.31
2019-07-03,100.52
2019-07-04,100.52
2019-07-05,100.29
2019-07-08,100.23
2019-07-09,100.13
2019-07-10,100.25
2019-07-11,100.235
2019-07-12,100.23
2019-07-15,100.255
2019-07-16,100.13
2019-07-17,100.135
2019-07-18,100.045
2019-07-19,99.875
2019-07-22,100.13
2019-07-23,100.32
2019-07-24,100.45
2019-07-25,100.21
2019-07-26,100.34
2019-07-29,100.205
2019-07-30,100.19
2019-07-31,100.01
2019-08-01,99.575
2019-08-02,99.48
2019-08-05,98.77
2019-08-06,99.07
2019-08-07,98.93
2019-08-08,99.18
2019-08-09,99.155
2019-08-12,98.99
2019-08-13,99.15
2019-08-14,98.535
2019-08-15,98.615
2019-08-16,98.95
2019-08-19,99.34
2019-08-20,99.405
2019-08-21,99.52
2019-08-22,99.86
2019-08-23,99.32
2019-08-26,99.65
2019-08-27,99.61
2019-08-28,99.915
2019-08-29,100.04
2019-08-30,99.855
2019-09-02,99.83
2019-09-03,99.4
2019-09-04,99.385
2019-09-05,99.68
2019-09-06,99.74
2019-09-09,99.88
2019-09-10,99.965
2019-09-11,100.01
2019-09-12,99.995
2019-09-13,100.06
2019-09-16,100.335
2019-09-17,100.295
2019-09-18,100.13
2019-09-19,100.17
2019-09-20,100.415
2019-09-23,100.385
2019-09-24,100.11
2019-09-25,99.97
2019-09-26,99.9
2019-09-27,99.695
2019-09-30,99.8
2019-10-01,99.27
2019-10-02,98.96
2019-10-03,98.925
2019-10-04,99.02
2019-10-07,98.995
2019-10-08,98.795
2019-10-09,98.81
2019-10-10,98.95
2019-10-11,99.285
2019-10-14,99.315
2019-10-15,99.475
2019-10-16,99.45
2019-10-17,99.51
2019-10-18,99.525
2019-10-21,99.51
2019-10-22,99.51
2019-10-23,99.535
2019-10-24,99.565
2019-10-25,99.64
2019-10-28,99.61
2019-10-29,99.535
2019-10-30,99.47
2019-10-31,99.125
2019-11-01,99.12
2019-11-04,99.315
2019-11-05,99.26
2019-11-06,99.13
2019-11-07,99.11
2019-11-08,99.015
2019-11-11,98.875
2019-11-12,98.935
2019-11-13,98.93
2019-11-14,98.695
2019-11-15,98.89
2019-11-18,98.845
2019-11-19,98.775
2019-11-20,98.345
2019-11-21,98.375
2019-11-22,98.375
2019-11-25,98.685
