date,close
2014-06-13,5.96
2014-06-16,6.12
2014-06-17,6.0221
2014-06-18,6.13
2014-06-19,6.0999
2014-06-20,6.04
2014-06-23,5.9138
2014-06-24,6.03
2014-06-25,6.08
2014-06-26,6.05
2014-06-27,6.0184
2014-06-30,6.04
2014-07-01,5.83
2014-07-02,5.917
2014-07-03,6.04
2014-07-07,5.9
2014-07-08,5.9
2014-07-09,5.72
2014-07-10,5.63
2014-07-11,5.64
2014-07-14,5.63
2014-07-15,5.55
2014-07-16,5.61
2014-07-17,5.59
2014-07-18,5.49
2014-07-21,5.53
2014-07-22,5.5
2014-07-23,5.32
2014-07-24,5.26
2014-07-25,5.0785
2014-07-28,5.03
2014-07-29,5.3299
2014-07-30,5.25
2014-07-31,5.23
2014-08-01,5.11
2014-08-04,5.31
2014-08-05,5.17
2014-08-06,5.08
2014-08-07,4.98
2014-08-08,4.99
2014-08-11,5.199
2014-08-12,4.99
2014-08-13,5
2014-08-14,5.1
2014-08-15,5.63
2014-08-18,5.622
2014-08-19,5.51
2014-08-20,5.55
2014-08-21,5.79
2014-08-22,5.54
2014-08-25,5.14
2014-08-26,5.15
2014-08-27,5.2
2014-08-28,5.21
2014-08-29,5.16
2014-09-02,5.3
2014-09-03,5.36
2014-09-04,5.19
2014-09-05,5.3153
2014-09-08,5.32
2014-09-09,5.48
2014-09-10,5.45
2014-09-11,5.3
2014-09-12,5.255
2014-09-15,5.25
2014-09-16,5.21
2014-09-17,5.21
2014-09-18,5.15
2014-09-19,5.18
2014-09-22,5.19
2014-09-23,5.1576
2014-09-24,5.16
2014-09-25,5.18
2014-09-26,5.08
2014-09-29,4.869
2014-09-30,5.05
2014-10-01,4.98
2014-10-02,4.93
2014-10-03,4.9
2014-10-06,4.9
2014-10-07,4.86
2014-10-08,4.851
2014-10-09,4.79
2014-10-10,4.75
2014-10-13,4.75
2014-10-14,4.63
2014-10-15,4.75
2014-10-16,4.82
2014-10-17,4.84
2014-10-20,5.18
2014-10-21,5.02
2014-10-22,5.19
2014-10-23,5.14
2014-10-24,5.15
2014-10-27,5.05
2014-10-28,5.14
2014-10-29,5.1
2014-10-30,5.25
2014-10-31,5.22
2014-11-03,5.19
2014-11-04,5.18
2014-11-05,5.18
2014-11-06,5.15
2014-11-07,5.07
2014-11-10,5.06
2014-11-11,5.05
2014-11-12,4.9001
2014-11-13,5.05
2014-11-14,5.05
2014-11-17,5.01
2014-11-18,5.14
2014-11-19,5.23
2014-11-20,5.1
2014-11-21,5.15
2014-11-24,5.11
2014-11-25,5.15
2014-11-26,5.22
2014-11-28,5.23
2014-12-01,5.0342
2014-12-02,5.0618
2014-12-03,5.23
2014-12-04,5.44
2014-12-05,5.51
2014-12-08,5.46
2014-12-09,5.61
2014-12-10,5.5
2014-12-11,5.58
2014-12-12,5.74
2014-12-15,5.74
2014-12-16,5.73
2014-12-17,5.61
2014-12-18,5.65
2014-12-19,5.52
2014-12-22,5.25
2014-12-23,5.61
2014-12-24,5.49
2014-12-26,5.49
2014-12-29,5.315
2014-12-30,5.28
2014-12-31,5.63
2015-01-02,5.5
2015-01-05,5.3
2015-01-06,5.45
2015-01-07,5.35
2015-01-08,5.58
2015-01-09,5.6299
2015-01-12,5.55
2015-01-13,5.57
2015-01-14,5.52
2015-01-15,5.55
2015-01-16,5.35
2015-01-20,5.34
2015-01-21,5.41
2015-01-22,5.35
2015-01-23,5.46
2015-01-26,5.5
2015-01-27,5.52
2015-01-28,5.47
2015-01-29,5.5
2015-01-30,5.49
2015-02-02,5.52
2015-02-03,5.68
2015-02-04,5.7278
2015-02-05,5.74
2015-02-06,5.93
2015-02-09,5.91
2015-02-10,5.9
2015-02-11,5.9
2015-02-12,5.99
2015-02-13,6.02
2015-02-17,6.09
2015-02-18,6.01
2015-02-19,5.95
2015-02-20,5.93
2015-02-23,5.99
2015-02-24,5.873
2015-02-25,5.94
2015-02-26,5.96
2015-02-27,5.95
2015-03-02,5.826
2015-03-03,5.7
2015-03-04,5.7184
2015-03-05,5.9599
2015-03-06,5.99
2015-03-09,6.05
2015-03-10,6.05
2015-03-11,6.03
2015-03-12,6.11
2015-03-13,5.95
2015-03-16,5.97
2015-03-17,6
2015-03-18,6.081
2015-03-19,6.05
2015-03-20,6.04
2015-03-23,6.03
2015-03-24,6.04
2015-03-25,5.64
2015-03-26,5.56
2015-03-27,5.53
2015-03-30,5.9
2015-03-31,5.76
2015-04-01,5.92
2015-04-02,5.66
2015-04-06,5.672
2015-04-07,5.6
2015-04-08,5.58
2015-04-09,5.61
2015-04-10,5.67
2015-04-13,5.67
2015-04-14,5.66
2015-04-15,5.7
2015-04-16,5.57
2015-04-17,5.6
2015-04-20,5.51
2015-04-21,5.59
2015-04-22,5.59
2015-04-23,5.4
2015-04-24,5.4
2015-04-27,5.48
2015-04-28,5.48
2015-04-29,5.48
2015-04-30,5.4
2015-05-01,5.6
2015-05-04,5.5
2015-05-05,5.58
2015-05-06,5.5
2015-05-07,5.43
2015-05-08,5.79
2015-05-11,5.7
2015-05-12,5.7664
2015-05-13,5.5
2015-05-14,5.59
2015-05-15,5.73
2015-05-18,5.73
2015-05-19,5.73
2015-05-20,5.83
2015-05-21,5.9
2015-05-22,6.19
2015-05-26,6.05
2015-05-27,6.06
2015-05-28,6.05
2015-05-29,6.09
2015-06-01,6.16
2015-06-02,6.19
2015-06-03,6.34
2015-06-04,6.24
2015-06-05,6.31
2015-06-08,6.31
2015-06-09,6.21
2015-06-10,6.33
2015-06-11,6.25
2015-06-12,6.11
2015-06-15,6.12
2015-06-16,6.07
2015-06-17,6.07
2015-06-18,6.1
2015-06-19,6.18
2015-06-22,6.18
2015-06-23,6.13
2015-06-24,6.11
2015-06-25,6.11
2015-06-26,6.15
2015-06-29,6.1
2015-06-30,6.065
2015-07-01,5.92
2015-07-02,6.15
2015-07-06,6.15
2015-07-07,6.108
2015-07-08,5.9534
2015-07-09,6.05
2015-07-10,6.07
2015-07-13,6.19
2015-07-14,6.18
2015-07-15,6.1888
2015-07-16,6.19
2015-07-17,6.19
2015-07-20,6.1399
2015-07-21,6.1399
2015-07-22,6.07
2015-07-23,6.041
2015-07-24,5.92
2015-07-27,5.9
2015-07-28,5.9
2015-07-29,5.9
2015-07-30,5.88
2015-07-31,5.88
2015-08-03,5.89
2015-08-04,5.92
2015-08-05,6
2015-08-06,5.88
2015-08-07,5.88
2015-08-10,5.85
2015-08-11,6.0099
2015-08-12,6.22
2015-08-13,6.17
2015-08-14,5.99
2015-08-17,5.82
2015-08-18,5.95
2015-08-19,5.95
2015-08-20,5.63
2015-08-21,5.66
2015-08-24,5.52
2015-08-25,5.55
2015-08-26,5.5
2015-08-27,5.43
2015-08-28,5.8999
2015-08-31,5.56
2015-09-01,5.542
2015-09-02,5.4
2015-09-03,5.4121
2015-09-04,5.48
2015-09-08,5.67
2015-09-09,5.7899
2015-09-10,5.84
2015-09-11,5.94
2015-09-14,5.91
2015-09-15,5.86
2015-09-16,5.75
2015-09-17,5.81
2015-09-18,5.9
2015-09-21,5.713
2015-09-22,5.75
2015-09-23,5.8
2015-09-24,5.75
2015-09-25,5.8
2015-09-28,5.808
2015-09-29,5.5
2015-09-30,5.622
2015-10-01,5.45
2015-10-02,5.5
2015-10-05,5.41
2015-10-06,5.42
2015-10-07,5.42
2015-10-08,5.6
2015-10-09,5.6
2015-10-12,5.6
2015-10-13,5.43
2015-10-14,5.4501
2015-10-15,5.49
2015-10-16,5.374
2015-10-19,5.374
2015-10-20,5.44
2015-10-21,5.53
2015-10-23,5.5
2015-10-26,5.508
2015-10-27,5.51
2015-10-28,5.5
2015-10-29,5.5
2015-10-30,5.4001
2015-11-02,5.489
2015-11-03,5.39
2015-11-04,5.38
2015-11-05,5.36
2015-11-06,5.36
2015-11-09,5.36
2015-11-11,5.51
2015-11-12,5.51
2015-11-13,5.51
2015-11-16,4.77
2015-11-17,5
2015-11-18,5.4
2015-11-19,5.4
2015-11-20,5.36
2015-11-23,5.39
2015-11-24,5.21
2015-11-25,5.38
2015-11-27,5.38
2015-11-30,5.49
2015-12-01,5.34
2015-12-02,5.3309
2015-12-03,5.321
2015-12-04,5.3
2015-12-07,5.03
2015-12-08,4.88
2015-12-09,4.92
2015-12-10,4.92
2015-12-11,4.98
2015-12-14,4.84
2015-12-15,4.78
2015-12-16,4.71
2015-12-17,4.78
2015-12-18,4.73
2015-12-21,4.74
2015-12-22,4.572
2015-12-23,4.56
2015-12-24,4.56
2015-12-28,4.5
2015-12-29,4.5145
2015-12-30,4.45
2015-12-31,4.51
2016-01-04,4.52
2016-01-05,4.45
2016-01-06,4.45
2016-01-07,4.36
2016-01-08,4.45
2016-01-11,4.63
2016-01-12,5
2016-01-13,5.1
2016-01-14,5.12
2016-01-15,5.1
2016-01-19,5.14
2016-01-20,5.14
2016-01-21,5.14
2016-01-22,5.27
2016-01-25,5.45
2016-01-26,5.38
2016-01-27,5.38
2016-01-28,5.414
2016-01-29,5.37
2016-02-01,5.49
2016-02-02,5.49
2016-02-03,5.4799
2016-02-05,5.51
2016-02-08,5.21
2016-02-09,5.307
2016-02-10,5.37
2016-02-11,5.37
2016-02-12,5.471
2016-02-16,5.2601
2016-02-17,5.44
2016-02-18,5.41
2016-02-19,5.29
2016-02-22,5.3
2016-02-23,5.42
2016-02-24,5.42
2016-02-25,5.42
2016-02-26,5.44
2016-02-29,5.24
2016-03-01,5.6
2016-03-02,5.3193
2016-03-03,5.34
2016-03-04,5.36
2016-03-07,5.49
2016-03-08,5.41
2016-03-09,5.41
2016-03-10,5.47
2016-03-11,5.45
2016-03-14,5.45
2016-03-15,5.47
2016-03-16,5.48
2016-03-17,5.36
2016-03-18,5.6001
2016-03-21,5.6
2016-03-22,5.67
2016-03-23,5.64
2016-03-24,5.5615
2016-03-28,5.6
2016-03-29,5.4
2016-03-30,5.36
2016-03-31,5.36
2016-04-01,5.32
2016-04-04,5.3
2016-04-05,5.3
2016-04-06,5.3
2016-04-07,5.3
2016-04-08,5.3424
2016-04-11,5.3067
2016-04-12,5.3067
2016-04-13,5.22
2016-04-15,5.41
2016-04-18,5.32
2016-04-19,5.3101
2016-04-20,5.454
2016-04-21,5.454
2016-04-22,5.32
2016-04-25,5.32
2016-04-26,5.31
2016-04-27,5.2346
2016-04-28,5.24
2016-04-29,5.22
2016-05-02,5.16
2016-05-04,5.2
2016-05-05,5.23
2016-05-06,5.23
2016-05-09,5.3731
2016-05-10,5.1101
2016-05-11,5.2999
2016-05-12,5
2016-05-13,5.225
2016-05-16,5.225
2016-05-17,5.2
2016-05-18,5.2
2016-05-19,5
2016-05-20,4.98
2016-05-23,4.97
2016-05-24,4.969
2016-05-25,5.04
2016-05-26,5.04
2016-05-27,4.9833
2016-05-31,4.95
2016-06-01,4.95
2016-06-02,4.95
2016-06-03,4.93
2016-06-06,4.9
2016-06-07,4.8
2016-06-08,4.7904
2016-06-09,4.7904
2016-06-10,4.53
2016-06-13,4.53
2016-06-14,4.6045
2016-06-15,4.6045
2016-06-16,4.615
2016-06-17,4.615
2016-06-20,4.6401
2016-06-22,4.6401
2016-06-23,4.93
2016-06-24,4.62
2016-06-27,4.65
2016-06-28,4.86
2016-06-29,4.7438
2016-06-30,4.71
2016-07-01,4.65
2016-07-05,4.6355
2016-07-06,4.71
2016-07-07,4.87
2016-07-08,4.8863
2016-07-11,4.85
2016-07-12,4.85
2016-07-13,4.85
2016-07-14,4.85
2016-07-15,4.685
2016-07-18,4.99
2016-07-19,4.7
2016-07-20,4.7
2016-07-21,4.701
2016-07-22,4.714
2016-07-25,4.714
2016-07-26,4.714
2016-07-27,4.685
2016-07-28,4.8899
2016-07-29,4.99
2016-08-01,5.19
2016-08-02,5.15
2016-08-03,5.1
2016-08-04,4.9055
2016-08-05,4.9055
2016-08-08,4.9055
2016-08-09,4.82
2016-08-10,4.82
2016-08-11,4.82
2016-08-12,4.95
2016-08-15,5.4
2016-08-16,4.98
2016-08-17,4.7
2016-08-18,4.65
2016-08-19,4.7
2016-08-22,4.7661
2016-08-23,5.095
2016-08-24,5.19
2016-08-25,5.2685
2016-08-26,5.24
2016-08-29,5.36
2016-08-30,5.375
2016-08-31,5.2999
2016-09-01,5.29
2016-09-02,5.28
2016-09-06,5.51
2016-09-07,5.45
2016-09-08,5.455
2016-09-09,5.38
2016-09-12,5.5
2016-09-13,5.45
2016-09-14,5.52
2016-09-15,5.6
2016-09-16,5.84
2016-09-19,6.21
2016-09-20,6.27
2016-09-21,6.57
2016-09-22,6.5
2016-09-23,6.35
2016-09-26,6.39
2016-09-27,6.4
2016-09-28,6.41
2016-09-29,6.35
2016-09-30,6.43
2016-10-03,6.67
2016-10-04,6.6
2016-10-05,6.71
2016-10-06,6.77
2016-10-07,6.9
2016-10-10,7.14
2016-10-11,6.77
2016-10-12,6.8
2016-10-13,6.75
2016-10-14,6.88
2016-10-17,6.87
2016-10-18,6.92
2016-10-19,6.79
2016-10-20,6.85
2016-10-21,6.8
2016-10-24,6.82
2016-10-25,6.85
2016-10-26,6.78
2016-10-27,6.66
2016-10-28,6.62
2016-10-31,6.62
2016-11-01,6.65
2016-11-02,6.67
2016-11-03,6.61
2016-11-04,6.52
2016-11-07,6.79
2016-11-08,6.81
2016-11-09,6.811
2016-11-10,6.79
2016-11-11,7.25
2016-11-14,7.53
2016-11-15,7.54
2016-11-16,7.9
2016-11-17,8.46
2016-11-18,8.67
2016-11-21,9.26
2016-11-22,9.55
2016-11-23,9.17
2016-11-25,9.17
2016-11-28,9.22
2016-11-29,9.15
2016-11-30,8.9
2016-12-01,8.27
2016-12-02,8.48
2016-12-05,8.62
2016-12-06,8.01
2016-12-07,8.38
2016-12-08,8.46
2016-12-09,8.42
2016-12-12,8.48
2016-12-13,9.3
2016-12-14,8.98
2016-12-15,9
2016-12-16,8.94
2016-12-19,9.06
2016-12-20,9.04
2016-12-21,9.15
2016-12-22,8.9
2016-12-23,8.88
2016-12-27,9.05
2016-12-28,9.09
2016-12-29,8.93
2016-12-30,8.51
2017-01-03,9
2017-01-04,9.04
2017-01-05,9.42
2017-01-06,9.37
2017-01-09,10.93
2017-01-10,10.84
2017-01-11,10.7
2017-01-12,10.68
2017-01-13,11.05
2017-01-17,11.02
2017-01-18,10.98
2017-01-19,11.27
2017-01-20,11.5
2017-01-23,11.47
2017-01-24,11.31
2017-01-25,11.3
2017-01-26,11.27
2017-01-27,10.86
2017-01-30,10.57
2017-01-31,10.59
2017-02-01,10.34
2017-02-02,10.92
2017-02-03,11.02
2017-02-06,12.43
2017-02-07,12.56
2017-02-08,12.45
2017-02-09,12.5
2017-02-10,12.239
2017-02-13,12.55
2017-02-14,12.44
2017-02-15,11.91
2017-02-16,11.96
2017-02-17,11.33
2017-02-21,11.76
2017-02-22,11.86
2017-02-23,11.47
2017-02-24,11.48
2017-02-27,11.77
2017-02-28,11.06
2017-03-01,11.14
2017-03-02,11
2017-03-03,10.89
2017-03-06,10.62
2017-03-07,10.38
2017-03-08,10.34
2017-03-09,10.1
2017-03-10,10
2017-03-13,10.74
2017-03-14,10.73
2017-03-15,11.43
2017-03-16,11.47
2017-03-17,11.44
2017-03-20,10.66
2017-03-21,9.92
2017-03-22,10.12
2017-03-23,10.09
2017-03-24,9.97
2017-03-27,10.78
2017-03-28,10.53
2017-03-29,10.54
2017-03-30,10.45
2017-03-31,10.28
2017-04-03,10.23
2017-04-04,10.12
2017-04-05,10.27
2017-04-06,9.86
2017-04-07,9.7
2017-04-10,9.81
2017-04-11,9.85
2017-04-12,9.9
2017-04-13,9.92
2017-04-17,9.88
2017-04-18,9.97
2017-04-19,10.17
2017-04-20,10.66
2017-04-21,10.38
2017-04-24,10.62
2017-04-25,10.58
2017-04-26,10.29
2017-04-27,10.35
2017-04-28,10.33
2017-05-01,10.55
2017-05-02,10.39
2017-05-03,10.3499
2017-05-04,10.8
2017-05-05,11.1
2017-05-08,11.68
2017-05-09,11.85
2017-05-10,12.94
2017-05-11,14.54
2017-05-12,14.36
2017-05-15,14.98
2017-05-16,14.38
2017-05-17,13.82
2017-05-18,13.37
2017-05-19,12.96
2017-05-22,13.87
2017-05-23,14.61
2017-05-24,14.78
2017-05-25,14.63
2017-05-26,14.4
2017-05-30,14.95
2017-05-31,15.5
2017-06-01,15.83
2017-06-02,15.82
2017-06-05,16.16
2017-06-06,16.09
2017-06-07,16.44
2017-06-08,15.85
2017-06-09,14.41
2017-06-12,14.29
2017-06-13,14.01
2017-06-14,14.29
2017-06-15,14.05
2017-06-16,14.01
2017-06-19,14.76
2017-06-20,14.59
2017-06-21,14.71
2017-06-22,14.87
2017-06-23,14.97
2017-06-26,14.23
2017-06-27,14.02
2017-06-28,14.31
2017-06-29,14.46
2017-06-30,14.61
2017-07-03,14.26
2017-07-05,14.43
2017-07-06,14.1
2017-07-07,14.19
2017-07-10,14.17
2017-07-11,14.84
2017-07-12,14.85
2017-07-13,15.16
2017-07-14,14.96
2017-07-17,13.76
2017-07-18,13.73
2017-07-19,13.85
2017-07-20,13.67
2017-07-21,13.75
2017-07-24,13.56
2017-07-25,13.76
2017-07-26,13.6
2017-07-27,13.22
2017-07-28,13
2017-07-31,13.12
2017-08-01,13.25
2017-08-02,13.18
2017-08-03,13.33
2017-08-04,13.5
2017-08-07,13.32
2017-08-08,12.96
2017-08-09,12.65
2017-08-10,12.13
2017-08-11,12.26
2017-08-14,11.69
2017-08-15,12.41
2017-08-16,12.38
2017-08-17,12.35
2017-08-18,12.45
2017-08-21,11.94
2017-08-22,11.87
2017-08-23,11.56
2017-08-24,11.32
2017-08-25,11.06
2017-08-28,10.98
2017-08-29,10.86
2017-08-30,11.31
2017-08-31,11.58
2017-09-01,11.53
2017-09-05,10.97
2017-09-06,10.97
2017-09-07,10.5
2017-09-08,10.34
2017-09-11,10.18
2017-09-12,10.4
2017-09-13,10.25
2017-09-14,10.53
2017-09-15,10.62
2017-09-18,11.01
2017-09-19,11.12
2017-09-20,11.02
2017-09-21,10.86
2017-09-22,10.78
2017-09-25,10.96
2017-09-26,11.38
2017-09-27,12.23
2017-09-28,12.38
2017-09-29,12.42
2017-10-02,12.61
2017-10-03,12.52
2017-10-04,12.61
2017-10-05,12.65
2017-10-06,12.73
2017-10-09,12.69
2017-10-10,13.08
2017-10-11,12.67
2017-10-12,12.6
2017-10-13,12.5
2017-10-16,12.05
2017-10-17,12.08
2017-10-18,11.51
2017-10-19,10.75
2017-10-20,11.14
2017-10-23,10.79
2017-10-24,10.83
2017-10-25,10.49
2017-10-26,10.21
2017-10-27,10.8
2017-10-30,10.64
2017-10-31,11.28
2017-11-01,11.18
2017-11-02,11.47
2017-11-03,11.5
2017-11-06,10.92
2017-11-07,10.99
2017-11-08,11.05
2017-11-09,10.93
2017-11-10,11.72
2017-11-13,13.24
2017-11-14,13.15
2017-11-15,13.61
2017-11-16,13.98
2017-11-17,13.98
2017-11-20,14.17
2017-11-21,14.37
2017-11-22,14.75
2017-11-24,14.82
2017-11-27,14.82
2017-11-28,14.4
2017-11-29,14.06
2017-11-30,14.36
2017-12-01,14.11
2017-12-04,13.88
2017-12-05,14.13
2017-12-06,14.48
2017-12-07,14.97
2017-12-08,15.09
2017-12-11,14.84
2017-12-12,14.43
2017-12-13,14.01
2017-12-14,14.02
2017-12-15,14.2
2017-12-18,14.91
2017-12-19,15.78
2017-12-20,15.17
2017-12-21,14.78
2017-12-22,14
2017-12-26,14.04
2017-12-27,13.87
2017-12-28,14.02
2017-12-29,14.12
2018-01-02,14.96
2018-01-03,14.6
2018-01-04,14.68
2018-01-05,14.89
2018-01-08,14.86
2018-01-09,14.62
2018-01-10,14.62
2018-01-11,14.79
2018-01-12,14.87
2018-01-16,14.82
2018-01-17,14.88
2018-01-18,15.06
2018-01-19,15.73
2018-01-22,15.57
2018-01-23,15.15
2018-01-24,15.18
2018-01-25,15.3
2018-01-26,15.31
2018-01-29,15.22
2018-01-30,15.06
2018-01-31,15.2
2018-02-01,15.01
2018-02-02,14.36
2018-02-05,13.66
2018-02-06,13.72
2018-02-07,13.76
2018-02-08,13.61
2018-02-09,13.39
2018-02-12,13.38
2018-02-13,13.16
2018-02-14,13.65
2018-02-15,14.23
2018-02-16,14.1
2018-02-20,14.25
2018-02-21,14.21
2018-02-22,14.2
2018-02-23,14.31
2018-02-26,14.56
2018-02-27,14.71
2018-02-28,14.25
2018-03-01,13.74
2018-03-02,14.37
2018-03-05,14.77
2018-03-06,15.04
2018-03-07,15.22
2018-03-08,15.85
2018-03-09,15.8
2018-03-12,16.47
2018-03-13,16.55
2018-03-14,17.42
2018-03-15,13.67
2018-03-16,15.1
2018-03-19,13.72
2018-03-20,14.12
2018-03-21,13.93
2018-03-22,13.51
2018-03-23,13.52
2018-03-26,14.12
2018-03-27,13.53
2018-03-28,12.71
2018-03-29,12.24
2018-04-02,12.76
2018-04-03,13.48
2018-04-04,14.28
2018-04-05,13.96
2018-04-06,14.09
2018-04-09,14.07
2018-04-10,14.49
2018-04-11,14.18
2018-04-12,14.16
2018-04-13,13.94
2018-04-16,14.24
2018-04-17,14.58
2018-04-18,15.07
2018-04-19,15.18
2018-04-20,15.1
2018-04-23,15.07
2018-04-24,15.15
2018-04-25,14.94
2018-04-26,14.88
2018-04-27,15.07
2018-04-30,15.14
2018-05-01,15.82
2018-05-02,15.96
2018-05-03,15.75
2018-05-04,16.2
2018-05-07,16.18
2018-05-08,16.27
2018-05-09,16.78
2018-05-10,19.06
2018-05-11,18.01
2018-05-14,17.86
2018-05-15,17.67
2018-05-16,17.44
2018-05-17,17.17
2018-05-18,16.73
2018-05-21,16.73
2018-05-22,16.6
2018-05-23,16.66
2018-05-24,16.72
2018-05-25,16.91
2018-05-29,17.02
2018-05-30,17.71
2018-05-31,17.53
2018-06-01,18
2018-06-04,18.16
2018-06-05,18.25
2018-06-06,18.41
2018-06-07,17.95
2018-06-08,18.02
2018-06-11,17.89
2018-06-12,18.18
2018-06-13,18.49
2018-06-14,17.71
2018-06-15,17.95
2018-06-18,18.07
2018-06-19,17.7
2018-06-20,17.89
2018-06-21,17.12
2018-06-22,17.2
2018-06-25,16.7
2018-06-26,16.74
2018-06-27,16.23
2018-06-28,16.19
2018-06-29,15.95
2018-07-02,15.55
2018-07-03,16.21
2018-07-05,16.6
2018-07-06,16.26
2018-07-09,16.11
2018-07-10,16.24
2018-07-11,16.24
2018-07-12,16.14
2018-07-13,16.13
2018-07-16,15.48
2018-07-17,15.73
2018-07-18,15.9
2018-07-19,16.03
2018-07-20,16.01
2018-07-23,16.29
2018-07-24,15.99
2018-07-25,16.02
2018-07-26,15.85
2018-07-27,14.91
2018-07-30,14.51
2018-07-31,14.09
2018-08-01,14.06
2018-08-02,14.33
2018-08-03,14.1
2018-08-06,14.59
2018-08-07,14.59
2018-08-08,14.73
2018-08-09,15.79
2018-08-10,14.71
2018-08-13,13.98
2018-08-14,14.01
2018-08-15,13.69
2018-08-16,13.19
2018-08-17,13.27
2018-08-20,13.27
2018-08-21,14.01
2018-08-22,14.1
2018-08-23,14.18
2018-08-24,14.32
2018-08-27,14.14
2018-08-28,14.44
2018-08-29,15.03
2018-08-30,15.15
2018-08-31,15.03
2018-09-04,14.88
2018-09-05,14.7
2018-09-06,14.11
2018-09-07,14.27
2018-09-10,14.4
2018-09-11,14.25
2018-09-12,14.18
2018-09-13,13.8
2018-09-14,13.76
2018-09-17,13.09
2018-09-18,13.16
2018-09-19,12.99
2018-09-20,13.13
2018-09-21,12.78
2018-09-24,12.29
2018-09-25,12.52
2018-09-26,12.86
2018-09-27,12.64
2018-09-28,12.42
2018-10-01,12.27
2018-10-02,11.46
2018-10-03,11.63
2018-10-04,11.24
2018-10-05,11.27
2018-10-08,10.81
2018-10-09,11.33
2018-10-10,10.79
2018-10-11,10.95
2018-10-12,11.18
2018-10-15,11.28
2018-10-16,12
2018-10-17,12
2018-10-18,11.59
2018-10-19,11.3
2018-10-22,11.29
2018-10-23,10.98
2018-10-24,10.55
2018-10-25,10.25
2018-10-26,9.92
2018-10-29,10.14
2018-10-30,10.68
2018-10-31,11.14
2018-11-01,11.53
2018-11-02,11.16
2018-11-05,11.03
2018-11-06,11.3
2018-11-07,11.49
2018-11-08,11.04
2018-11-09,7.75
2018-11-12,7.115
2018-11-13,6.26
2018-11-14,6.065
2018-11-15,6.28
2018-11-16,6.2
2018-11-19,5.59
2018-11-20,6.09
2018-11-21,6.47
2018-11-23,6.05
2018-11-26,5.95
2018-11-27,5.51
2018-11-28,5.96
2018-11-29,6.17
2018-11-30,5.69
2018-12-03,5.93
2018-12-04,5.85
2018-12-06,6.05
2018-12-07,5.98
2018-12-10,5.93
2018-12-11,5.93
2018-12-12,5.76
2018-12-13,5.62
2018-12-14,5.54
2018-12-17,5.32
2018-12-18,5.2
2018-12-19,5.27
2018-12-20,4.95
2018-12-21,4.53
2018-12-24,4.39
2018-12-26,4.77
2018-12-27,4.88
2018-12-28,5.13
2018-12-31,5.08
2019-01-02,5.27
2019-01-03,4.9
2019-01-04,5.27
2019-01-07,5.38
2019-01-08,5.93
2019-01-09,6.2
2019-01-10,5.83
2019-01-11,5.83
2019-01-14,5.58
2019-01-15,5.53
2019-01-16,5.79
2019-01-17,5.74
2019-01-18,5.84
2019-01-22,5.6
2019-01-23,5.56
2019-01-24,5.7
2019-01-25,5.63
2019-01-28,5.53
2019-01-29,5.51
2019-01-30,5.46
2019-01-31,5.31
2019-02-01,5.27
2019-02-04,5.68
2019-02-05,5.83
2019-02-06,5.59
2019-02-07,5.63
2019-02-08,5.82
2019-02-11,5.8
2019-02-12,5.84
2019-02-13,5.89
2019-02-14,6.02
2019-02-15,6.14
2019-02-19,6.09
2019-02-20,6.56
2019-02-21,6.32
2019-02-22,6.85
2019-02-25,6.36
2019-02-26,6.34
2019-02-27,6.48
2019-02-28,6.46
2019-03-01,6.23
2019-03-04,6.29
2019-03-05,6.14
2019-03-06,6.02
2019-03-07,5.96
2019-03-08,6.06
2019-03-11,6.13
2019-03-12,6.25
2019-03-13,6.18
2019-03-14,6.27
2019-03-15,6.27
2019-03-18,6.21
2019-03-19,6.54
2019-03-20,6.25
2019-03-21,6.37
2019-03-22,6.28
2019-03-25,6.27
2019-03-26,6.23
2019-03-27,6.08
2019-03-28,6.05
2019-03-29,6.11
2019-04-01,6.17
2019-04-02,6.22
2019-04-03,6.21
2019-04-04,6.21
2019-04-05,6.4
2019-04-08,6.42
2019-04-09,6.42
2019-04-10,6.61
2019-04-11,6.46
2019-04-12,6.45
2019-04-15,7.1
2019-04-16,8.26
2019-04-17,7.66
2019-04-18,7.08
2019-04-22,6.88
2019-04-23,6.86
2019-04-24,6.57
2019-04-25,6.42
2019-04-26,6.57
2019-04-29,7.16
2019-04-30,6.96
2019-05-01,6.77
2019-05-02,6.71
2019-05-03,6.93
2019-05-06,7.02
2019-05-07,6.91
2019-05-08,6.94
2019-05-09,7.04
2019-05-10,7.47
2019-05-13,7
2019-05-14,6.88
2019-05-15,6.91
2019-05-16,7.11
2019-05-17,7.44
2019-05-20,7.05
2019-05-21,7.03
2019-05-22,6.78
2019-05-23,6.57
2019-05-24,6.6
2019-05-28,6.67
2019-05-29,6.4
2019-05-30,6.53
2019-05-31,6.43
2019-06-03,6.36
2019-06-04,6.5
2019-06-05,6.38
2019-06-06,6.29
2019-06-07,6.46
2019-06-10,6.87
2019-06-11,6.54
2019-06-12,6.4
2019-06-13,6.725
2019-06-14,6.8
2019-06-17,7.08
2019-06-18,7.47
2019-06-19,7.51
2019-06-20,7.62
2019-06-21,7.865
2019-06-24,7.88
2019-06-25,7.66
2019-06-26,7.67
2019-06-27,7.62
2019-06-28,7.885
2019-07-01,8.3
2019-07-02,8.81
2019-07-03,9.51
2019-07-04,9.51
2019-07-05,9.56
2019-07-08,10
2019-07-09,9.61
2019-07-10,9.53
2019-07-11,9.49
2019-07-12,9.51
2019-07-15,9.75
2019-07-16,9.51
2019-07-17,9.325
2019-07-18,9.01
2019-07-19,8.87
2019-07-22,8.69
2019-07-23,8.57
2019-07-24,9.075
2019-07-25,8.915
2019-07-26,9.135
2019-07-29,9.33
2019-07-30,9.37
2019-07-31,9.005
2019-08-01,8.98
2019-08-02,8.36
2019-08-05,7.96
2019-08-06,8.1
2019-08-07,7.98
2019-08-08,8.28
2019-08-09,6.04
2019-08-12,6.28
2019-08-13,6.415
2019-08-14,6.23
2019-08-15,6.27
2019-08-16,6.425
2019-08-19,6.17
2019-08-20,6.09
2019-08-21,6.25
2019-08-22,6.46
2019-08-23,6.43
2019-08-26,6.425
2019-08-27,6.08
2019-08-28,6.4
2019-08-29,6.6
2019-08-30,6.46
2019-09-02,6.46
2019-09-03,6.58
2019-09-04,6.335
2019-09-05,6.73
2019-09-06,6.69
2019-09-09,6.35
2019-09-10,6.32
2019-09-11,6.5
2019-09-12,6.75
2019-09-13,6.74
2019-09-16,6.74
2019-09-17,6.74
2019-09-18,6.62
2019-09-19,6.6
2019-09-20,6.71
2019-09-23,6.77
2019-09-24,6.57
2019-09-25,6.89
2019-09-26,6.79
2019-09-27,6.6
2019-09-30,6.695
2019-10-01,6.6
2019-10-02,6.29
2019-10-03,6.44
2019-10-04,6.775
2019-10-07,6.78
2019-10-08,8.3
2019-10-09,8.215
2019-10-10,8.695
2019-10-11,8.815
2019-10-14,8.735
2019-10-15,8.72
2019-10-16,8.49
2019-10-17,8.62
2019-10-18,8.395
2019-10-21,8.395
2019-10-22,8.435
2019-10-23,8.49
2019-10-24,8.65
2019-10-25,9
2019-10-28,9.02
2019-10-29,9.02
2019-10-30,9.13
2019-10-31,9.02
2019-11-01,9.19
2019-11-04,9.02
2019-11-05,9.025
2019-11-06,8.97
2019-11-07,9.03
2019-11-08,9.19
2019-11-11,9.26
2019-11-12,8.665
2019-11-13,8.575
2019-11-14,8.56
2019-11-15,8.58
2019-11-18,8.68
2019-11-19,8.62
2019-11-20,8.48
2019-11-21,8.53
2019-11-22,8.56
2019-11-25,8.42
