date,close
2014-06-13,28.7326
2014-06-16,28.7546
2014-06-17,28.7326
2014-06-18,28.9786
2014-06-19,29.1279
2014-06-20,29.0752
2014-06-23,29.0312
2014-06-24,28.8556
2014-06-25,28.838
2014-06-26,28.8205
2014-06-27,28.9215
2014-06-30,28.9698
2014-07-01,29.1982
2014-07-02,29.2509
2014-07-03,29.3124
2014-07-07,29.0752
2014-07-08,28.8292
2014-07-09,28.9303
2014-07-10,28.614
2014-07-11,28.6096
2014-07-14,28.7941
2014-07-15,28.7151
2014-07-16,28.9171
2014-07-17,28.5991
2014-07-18,28.8126
2014-07-21,28.7282
2014-07-22,28.8732
2014-07-23,28.9434
2014-07-24,28.961
2014-07-25,28.8644
2014-07-28,28.8995
2014-07-29,28.838
2014-07-30,28.838
2014-07-31,28.3637
2014-08-01,28.195
2014-08-04,28.3022
2014-08-05,27.9069
2014-08-06,27.9157
2014-08-07,27.6785
2014-08-08,27.8367
2014-08-11,27.9508
2014-08-12,27.9333
2014-08-13,28.0826
2014-08-14,28.2407
2014-08-15,28.1968
2014-08-18,28.3637
2014-08-19,28.4428
2014-08-20,28.3725
2014-08-21,28.4586
2014-08-22,28.3365
2014-08-25,28.5218
2014-08-26,28.535
2014-08-27,28.6096
2014-08-28,28.4515
2014-08-29,28.4691
2014-09-02,28.4603
2014-09-03,28.6703
2014-09-04,28.5394
2014-09-05,28.5569
2014-09-08,28.2671
2014-09-09,28.188
2014-09-10,28.3198
2014-09-11,28.1704
2014-09-12,28.1002
2014-09-15,28.0738
2014-09-16,28.1792
2014-09-17,28.0211
2014-09-18,28.2144
2014-09-19,28.0914
2014-09-22,27.9421
2014-09-23,27.7137
2014-09-24,27.8542
2014-09-25,27.4502
2014-09-26,27.5556
2014-09-29,27.336
2014-09-30,27.2481
2014-10-01,26.9495
2014-10-02,26.6631
2014-10-03,26.6596
2014-10-06,26.8265
2014-10-07,26.4136
2014-10-08,26.8265
2014-10-09,26.0886
2014-10-10,25.7197
2014-10-13,25.6758
2014-10-14,25.6933
2014-10-15,25.5704
2014-10-16,25.79
2014-10-17,25.79
2014-10-20,25.9832
2014-10-21,26.2819
2014-10-22,26.0447
2014-10-23,26.3258
2014-10-24,26.4576
2014-10-27,26.3258
2014-10-28,26.6947
2014-10-29,26.5278
2014-10-30,26.6772
2014-10-31,27.1339
2014-11-03,26.8704
2014-11-04,26.7035
2014-11-05,26.765
2014-11-06,26.6332
2014-11-07,26.6772
2014-11-10,26.765
2014-11-11,26.9398
2014-11-12,26.765
2014-11-13,26.8484
2014-11-14,26.9143
2014-11-17,26.8089
2014-11-18,27.09
2014-11-19,26.9846
2014-11-20,26.888
2014-11-21,27.1076
2014-11-24,27.213
2014-11-25,27.2833
2014-11-26,27.3887
2014-11-28,27.1251
2014-12-01,27.0724
2014-12-02,27.1471
2014-12-03,27.0988
2014-12-04,27.011
2014-12-05,27.0724
2014-12-08,26.7914
2014-12-09,26.642
2014-12-10,26.3082
2014-12-11,26.2819
2014-12-12,25.8163
2014-12-15,25.4386
2014-12-16,25.6406
2014-12-17,25.9217
2014-12-18,26.3785
2014-12-19,26.4312
2014-12-22,26.5025
2014-12-23,26.4393
2014-12-24,26.5658
2014-12-26,26.6471
2014-12-29,26.4935
2014-12-30,26.2676
2014-12-31,26.123
2015-01-02,26.0236
2015-01-05,25.4453
2015-01-06,25.1652
2015-01-07,25.4001
2015-01-08,25.7344
2015-01-09,25.617
2015-01-12,25.5176
2015-01-13,25.6531
2015-01-14,25.5628
2015-01-15,25.6712
2015-01-16,25.9875
2015-01-20,26.0688
2015-01-21,26.2585
2015-01-22,26.367
2015-01-23,26.2134
2015-01-26,26.5296
2015-01-27,26.5748
2015-01-28,26.1862
2015-01-29,26.5025
2015-01-30,26.1411
2015-02-02,26.4844
2015-02-03,26.873
2015-02-04,26.6561
2015-02-05,26.9904
2015-02-06,26.6471
2015-02-09,26.5386
2015-02-10,26.7284
2015-02-11,26.62
2015-02-12,27.0176
2015-02-13,27.1983
2015-02-17,27.2841
2015-02-18,27.4151
2015-02-19,27.4061
2015-02-20,27.6772
2015-02-23,27.5507
2015-02-24,27.7133
2015-02-25,27.7495
2015-02-26,27.6817
2015-02-27,27.6772
2015-03-02,27.7224
2015-03-03,27.5778
2015-03-04,27.4784
2015-03-05,27.5371
2015-03-06,27.162
2015-03-09,27.1802
2015-03-10,26.6109
2015-03-11,26.6652
2015-03-12,26.9814
2015-03-13,26.8278
2015-03-16,27.117
2015-03-17,27.0808
2015-03-18,27.623
2015-03-19,27.3067
2015-03-20,27.885
2015-03-23,28.0206
2015-03-24,28.0025
2015-03-25,27.8579
2015-03-26,27.6139
2015-03-27,27.641
2015-03-30,27.6953
2015-03-31,27.3157
2015-04-01,27.4784
2015-04-02,27.7133
2015-04-06,28.0025
2015-04-07,27.9844
2015-04-08,28.1019
2015-04-09,28.1561
2015-04-10,28.2193
2015-04-13,28.0657
2015-04-14,28.2736
2015-04-15,28.4452
2015-04-16,28.5175
2015-04-17,28.1922
2015-04-20,28.2374
2015-04-21,28.4362
2015-04-22,28.5085
2015-04-23,28.644
2015-04-24,28.7705
2015-04-27,28.9142
2015-04-28,28.9513
2015-04-29,28.7163
2015-04-30,28.4181
2015-05-01,28.6531
2015-05-04,28.6711
2015-05-05,28.2826
2015-05-06,28.2916
2015-05-07,28.2103
2015-05-08,28.8067
2015-05-11,28.5898
2015-05-12,28.5627
2015-05-13,28.7344
2015-05-14,29.0597
2015-05-15,29.0958
2015-05-18,28.9874
2015-05-19,28.888
2015-05-20,28.9332
2015-05-21,29.0778
2015-05-22,28.9061
2015-05-26,28.4362
2015-05-27,28.644
2015-05-28,28.6079
2015-05-29,28.3278
2015-06-01,28.2193
2015-06-02,28.391
2015-06-03,28.5266
2015-06-04,28.2193
2015-06-05,27.9483
2015-06-08,27.8669
2015-06-09,27.7314
2015-06-10,28.2645
2015-06-11,28.3458
2015-06-12,28.129
2015-06-15,27.9754
2015-06-16,27.9483
2015-06-17,27.9212
2015-06-18,28.1561
2015-06-19,28.0657
2015-06-22,28.5537
2015-06-23,28.644
2015-06-24,28.4362
2015-06-25,28.4091
2015-06-26,28.4001
2015-06-29,27.5688
2015-06-30,27.5326
2015-07-01,27.641
2015-07-02,27.7133
2015-07-06,27.1531
2015-07-07,27.1531
2015-07-08,26.5477
2015-07-09,26.9001
2015-07-10,27.6772
2015-07-13,27.8037
2015-07-14,27.9934
2015-07-15,27.885
2015-07-16,28.1109
2015-07-17,28.0477
2015-07-20,28.0657
2015-07-21,28.0007
2015-07-22,27.7766
2015-07-23,27.6953
2015-07-24,27.4061
2015-07-27,27.2073
2015-07-28,27.5507
2015-07-29,27.6681
2015-07-30,27.6456
2015-07-31,27.7675
2015-08-03,27.6862
2015-08-04,27.6953
2015-08-05,27.8669
2015-08-06,27.7314
2015-08-07,27.6772
2015-08-10,28.0115
2015-08-11,27.5868
2015-08-12,27.4332
2015-08-13,27.388
2015-08-14,27.4513
2015-08-17,27.388
2015-08-18,27.2073
2015-08-19,26.9182
2015-08-20,26.2902
2015-08-21,25.6622
2015-08-24,24.7858
2015-08-25,24.9845
2015-08-26,25.6441
2015-08-27,26.0507
2015-08-28,26.0236
2015-08-31,25.8519
2015-09-01,24.9754
2015-09-02,25.3007
2015-09-03,25.382
2015-09-04,24.8399
2015-09-08,25.5357
2015-09-09,25.4272
2015-09-10,25.5944
2015-09-11,25.5718
2015-09-14,25.373
2015-09-15,25.5357
2015-09-16,25.9513
2015-09-17,25.9784
2015-09-18,25.3911
2015-09-21,25.364
2015-09-22,24.7766
2015-09-23,24.6501
2015-09-24,24.5327
2015-09-25,24.7676
2015-09-28,24.2435
2015-09-29,24.2435
2015-09-30,24.7315
2015-10-01,24.8037
2015-10-02,25.2013
2015-10-05,25.6983
2015-10-06,25.7706
2015-10-07,26.0823
2015-10-08,26.3037
2015-10-09,26.3489
2015-10-12,26.2766
2015-10-13,25.9513
2015-10-14,26.0236
2015-10-15,26.4573
2015-10-16,26.4573
2015-10-19,26.3579
2015-10-20,26.2767
2015-10-21,26.2043
2015-10-22,26.5296
2015-10-23,26.7555
2015-10-26,26.638
2015-10-27,26.4212
2015-10-28,26.6019
2015-10-29,26.4121
2015-10-30,26.3579
2015-11-02,26.5658
2015-11-03,26.6109
2015-11-04,26.4302
2015-11-05,26.385
2015-11-06,26.2314
2015-11-09,25.9965
2015-11-10,25.9423
2015-11-11,26.0597
2015-11-12,25.7435
2015-11-13,25.5176
2015-11-16,25.8338
2015-11-17,25.8971
2015-11-18,26.1411
2015-11-19,26.2856
2015-11-20,26.2224
2015-11-23,26.0597
2015-11-24,26.0869
2015-11-25,26.141
2015-11-27,26.132
2015-11-30,26.1049
2015-12-01,26.3715
2015-12-02,26.1049
2015-12-03,25.9423
2015-12-04,26.1501
2015-12-07,25.9332
2015-12-08,25.5266
2015-12-09,25.4814
2015-12-10,25.4543
2015-12-11,25.0206
2015-12-14,25.0387
2015-12-15,25.1833
2015-12-16,25.6802
2015-12-17,25.3459
2015-12-18,25.1019
2015-12-21,25.2149
2015-12-22,25.409
2015-12-23,25.8341
2015-12-24,25.7787
2015-12-28,25.6863
2015-12-29,25.9728
2015-12-30,25.7879
2015-12-31,25.4737
2016-01-04,25.067
2016-01-05,25.0393
2016-01-06,24.5771
2016-01-07,24.1242
2016-01-08,23.8284
2016-01-11,23.9024
2016-01-12,24.004
2016-01-13,23.6343
2016-01-14,23.9116
2016-01-15,23.0834
2016-01-19,23.2738
2016-01-20,22.7747
2016-01-21,22.9411
2016-01-22,23.6251
2016-01-25,23.2646
2016-01-26,23.6898
2016-01-27,23.5604
2016-01-28,23.662
2016-01-29,24.0965
2016-02-01,24.041
2016-02-02,23.4957
2016-02-03,23.699
2016-02-04,23.773
2016-02-05,23.4125
2016-02-08,23.0058
2016-02-09,22.6915
2016-02-10,22.6638
2016-02-11,22.368
2016-02-12,22.7285
2016-02-16,23.1537
2016-02-17,23.5881
2016-02-18,23.4957
2016-02-19,23.4402
2016-02-22,23.7036
2016-02-23,23.3385
2016-02-24,23.3016
2016-02-25,23.5789
2016-02-26,23.4864
2016-02-29,23.3848
2016-03-01,23.9763
2016-03-02,24.1519
2016-03-03,24.4015
2016-03-04,24.5771
2016-03-07,24.5586
2016-03-08,24.3183
2016-03-09,24.4107
2016-03-10,24.4015
2016-03-11,25.0254
2016-03-14,24.9468
2016-03-15,24.6973
2016-03-16,24.9838
2016-03-17,25.1964
2016-03-18,25.1317
2016-03-21,25.0947
2016-03-22,25.0762
2016-03-23,24.8174
2016-03-24,24.6418
2016-03-28,24.8082
2016-03-29,25.0762
2016-03-30,25.2703
2016-03-31,25.0577
2016-04-01,24.7804
2016-04-04,24.725
2016-04-05,24.2444
2016-04-06,24.6326
2016-04-07,24.2906
2016-04-08,24.762
2016-04-11,24.7897
2016-04-12,25.1594
2016-04-13,25.5476
2016-04-14,25.6031
2016-04-15,25.5384
2016-04-18,25.7417
2016-04-19,26.1946
2016-04-20,26.2131
2016-04-21,26.0606
2016-04-22,26.0652
2016-04-25,25.9358
2016-04-26,26.0283
2016-04-27,26.0652
2016-04-28,25.7417
2016-04-29,25.6493
2016-05-02,25.8526
2016-05-03,25.4275
2016-05-04,25.1317
2016-05-05,25.104
2016-05-06,25.1455
2016-05-09,25.0855
2016-05-10,25.4275
2016-05-11,25.2518
2016-05-12,25.2426
2016-05-13,24.9561
2016-05-16,25.2518
2016-05-17,25.104
2016-05-18,25.0855
2016-05-19,24.9468
2016-05-20,25.1224
2016-05-23,25.0485
2016-05-24,25.3812
2016-05-25,25.6308
2016-05-26,25.6863
2016-05-27,25.64
2016-05-31,25.5569
2016-06-01,25.5385
2016-06-02,25.5476
2016-06-03,25.7417
2016-06-06,25.8804
2016-06-07,26.0837
2016-06-08,26.1761
2016-06-09,25.8619
2016-06-10,25.1594
2016-06-13,24.7897
2016-06-14,24.4754
2016-06-15,24.6141
2016-06-16,24.6418
2016-06-17,24.8544
2016-06-20,25.4367
2016-06-21,25.6308
2016-06-22,25.6216
2016-06-23,26.2778
2016-06-24,24.1611
2016-06-27,23.6805
2016-06-28,24.2813
2016-06-29,24.725
2016-06-30,25.0577
2016-07-01,25.1317
2016-07-05,24.6233
2016-07-06,24.6048
2016-07-07,24.5124
2016-07-08,24.8451
2016-07-11,25.2056
2016-07-12,25.5476
2016-07-13,25.5476
2016-07-14,25.751
2016-07-15,25.6308
2016-07-18,25.7047
2016-07-19,25.4829
2016-07-20,25.6955
2016-07-21,25.6031
2016-07-22,25.6031
2016-07-25,25.5753
2016-07-26,25.6678
2016-07-27,25.8064
2016-07-28,25.7879
2016-07-29,26.0745
2016-08-01,25.9081
2016-08-02,25.7879
2016-08-03,25.6955
2016-08-04,25.8341
2016-08-05,25.9543
2016-08-08,26.0283
2016-08-09,26.2501
2016-08-10,26.3333
2016-08-11,26.5274
2016-08-12,26.4627
2016-08-15,26.5736
2016-08-16,26.5274
2016-08-17,26.5181
2016-08-18,26.6383
2016-08-19,26.4534
2016-08-22,26.4719
2016-08-23,26.5828
2016-08-24,26.5274
2016-08-25,26.4442
2016-08-26,26.2593
2016-08-29,26.361
2016-08-30,26.3055
2016-08-31,26.2316
2016-09-01,26.4257
2016-09-02,26.703
2016-09-06,26.9433
2016-09-07,26.971
2016-09-08,26.8971
2016-09-09,26.3425
2016-09-12,26.5459
2016-09-13,25.982
2016-09-14,25.9636
2016-09-15,26.1761
2016-09-16,25.8619
2016-09-19,26.0098
2016-09-20,26.1577
2016-09-21,26.629
2016-09-22,26.9063
2016-09-23,26.6475
2016-09-26,26.398
2016-09-27,26.5274
2016-09-28,26.7677
2016-09-29,26.4349
2016-09-30,26.6106
2016-10-03,26.5551
2016-10-04,26.4812
2016-10-05,26.6383
2016-10-06,26.4904
2016-10-07,26.3333
2016-10-10,26.4349
2016-10-11,26.056
2016-10-12,26.019
2016-10-13,25.9266
2016-10-14,25.9543
2016-10-17,25.9081
2016-10-18,26.1761
2016-10-19,26.2593
2016-10-20,26.2686
2016-10-21,26.1946
2016-10-24,26.2039
2016-10-25,26.1761
2016-10-26,26.056
2016-10-27,26.0375
2016-10-28,26.0283
2016-10-31,26.019
2016-11-01,25.9266
2016-11-02,25.7325
2016-11-03,25.7232
2016-11-04,25.5014
2016-11-07,25.8619
2016-11-08,25.9358
2016-11-09,25.8896
2016-11-10,25.8064
2016-11-11,25.64
2016-11-14,25.5106
2016-11-15,25.6493
2016-11-16,25.409
2016-11-17,25.5846
2016-11-18,25.3443
2016-11-21,25.5753
2016-11-22,25.6493
2016-11-23,25.5476
2016-11-25,25.6216
2016-11-28,25.5291
2016-11-29,25.6678
2016-11-30,25.6216
2016-12-01,25.5569
2016-12-02,25.6216
2016-12-05,25.8434
2016-12-06,25.9913
2016-12-07,26.3795
2016-12-08,26.3795
2016-12-09,26.4812
2016-12-12,26.398
2016-12-13,26.6568
2016-12-14,26.2408
2016-12-15,26.2131
2016-12-16,26.2039
2016-12-19,26.1784
2016-12-20,26.2732
2016-12-21,26.2542
2016-12-22,26.1973
2016-12-23,26.2258
2016-12-27,26.2352
2016-12-28,26.1215
2016-12-29,26.1878
2016-12-30,26.2447
2017-01-03,26.4344
2017-01-04,26.7283
2017-01-05,26.9653
2017-01-06,26.861
2017-01-09,26.8136
2017-01-10,26.8231
2017-01-11,27.0032
2017-01-12,27.0412
2017-01-13,27.1265
2017-01-17,27.0601
2017-01-18,26.9274
2017-01-19,26.8895
2017-01-20,27.0317
2017-01-23,27.0886
2017-01-24,27.1929
2017-01-25,27.4773
2017-01-26,27.373
2017-01-27,27.3161
2017-01-30,27.1265
2017-01-31,27.2024
2017-02-01,27.3066
2017-02-02,27.3066
2017-02-03,27.4394
2017-02-06,27.2498
2017-02-07,27.1929
2017-02-08,27.2687
2017-02-09,27.3635
2017-02-10,27.4489
2017-02-13,27.5532
2017-02-14,27.5247
2017-02-15,27.648
2017-02-16,27.7049
2017-02-17,27.6195
2017-02-21,27.7238
2017-02-22,27.7333
2017-02-23,27.7618
2017-02-24,27.5532
2017-02-27,27.5532
2017-02-28,27.4678
2017-03-01,27.7618
2017-03-02,27.5911
2017-03-03,27.7144
2017-03-06,27.6385
2017-03-07,27.5626
2017-03-08,27.4394
2017-03-09,27.5342
2017-03-10,27.7618
2017-03-13,27.885
2017-03-14,27.6859
2017-03-15,28.1031
2017-03-16,28.2358
2017-03-17,28.2738
2017-03-20,28.2499
2017-03-21,28.0936
2017-03-22,28.1126
2017-03-23,28.1884
2017-03-24,28.2643
2017-03-27,28.3591
2017-03-28,28.4634
2017-03-29,28.4729
2017-03-30,28.3875
2017-03-31,28.3212
2017-04-03,28.3117
2017-04-04,28.3022
2017-04-05,28.1505
2017-04-06,28.141
2017-04-07,28.141
2017-04-10,28.1126
2017-04-11,28.2358
2017-04-12,28.2169
2017-04-13,28.0367
2017-04-17,28.2453
2017-04-18,28.0652
2017-04-19,27.9514
2017-04-20,28.1884
2017-04-21,28.2169
2017-04-24,28.8806
2017-04-25,29.0512
2017-04-26,28.9659
2017-04-27,28.9754
2017-04-28,28.928
2017-05-01,29.0607
2017-05-02,29.2314
2017-05-03,29.1461
2017-05-04,29.3452
2017-05-05,29.6581
2017-05-08,29.5064
2017-05-09,29.44
2017-05-10,29.4874
2017-05-11,29.4115
2017-05-12,29.5538
2017-05-15,29.7244
2017-05-16,29.8856
2017-05-17,29.5158
2017-05-18,29.5822
2017-05-19,29.9235
2017-05-22,29.9899
2017-05-23,29.9804
2017-05-24,30.0183
2017-05-25,30.0183
2017-05-26,29.952
2017-05-30,29.9046
2017-05-31,29.933
2017-06-01,30.1606
2017-06-02,30.445
2017-06-05,30.3123
2017-06-06,30.2459
2017-06-07,30.1985
2017-06-08,30.1795
2017-06-09,30.0847
2017-06-12,29.9804
2017-06-13,30.2459
2017-06-14,30.189
2017-06-15,29.9046
2017-06-16,30.1321
2017-06-19,30.2649
2017-06-20,29.9994
2017-06-21,29.952
2017-06-22,29.9994
2017-06-23,30.0752
2017-06-26,30.1321
2017-06-27,30.1511
2017-06-28,30.3881
2017-06-29,30.1132
2017-06-30,30.1321
2017-07-03,30.0847
2017-07-05,30.0942
2017-07-06,29.9425
2017-07-07,29.9899
2017-07-10,30.0468
2017-07-11,30.1226
2017-07-12,30.3786
2017-07-13,30.4735
2017-07-14,30.6915
2017-07-17,30.6441
2017-07-18,30.6726
2017-07-19,30.8148
2017-07-20,30.9475
2017-07-21,30.8432
2017-07-24,30.7674
2017-07-25,30.7863
2017-07-26,30.9855
2017-07-27,30.8906
2017-07-28,30.9001
2017-07-31,30.9949
2017-08-01,31.1561
2017-08-02,31.1656
2017-08-03,31.1372
2017-08-04,31.1561
2017-08-07,31.1846
2017-08-08,31.0423
2017-08-09,30.9381
2017-08-10,30.5209
2017-08-11,30.4829
2017-08-14,30.7105
2017-08-15,30.6726
2017-08-16,30.8527
2017-08-17,30.5209
2017-08-18,30.5778
2017-08-21,30.5967
2017-08-22,30.7295
2017-08-23,30.7579
2017-08-24,30.72
2017-08-25,30.8906
2017-08-28,30.8717
2017-08-29,30.7769
2017-08-30,30.72
2017-08-31,30.957
2017-09-01,31.0044
2017-09-05,30.7958
2017-09-06,30.9855
2017-09-07,31.232
2017-09-08,31.2415
2017-09-11,31.4785
2017-09-12,31.5543
2017-09-13,31.4121
2017-09-14,31.4785
2017-09-15,31.4975
2017-09-18,31.5828
2017-09-19,31.6966
2017-09-20,31.6681
2017-09-21,31.6112
2017-09-22,31.6776
2017-09-25,31.5354
2017-09-26,31.4406
2017-09-27,31.469
2017-09-28,31.5354
2017-09-29,31.7345
2017-10-02,31.7155
2017-10-03,31.8293
2017-10-04,31.8009
2017-10-05,31.7535
2017-10-06,31.725
2017-10-09,31.7345
2017-10-10,32
2017-10-11,32.1422
2017-10-12,32.1138
2017-10-13,32.2655
2017-10-16,32.256
2017-10-17,32.1896
2017-10-18,32.256
2017-10-19,32.1801
2017-10-20,32.1517
2017-10-23,32.0853
2017-10-24,32.1327
2017-10-25,32.0095
2017-10-26,32.0095
2017-10-27,32.0948
2017-10-30,32.1706
2017-10-31,32.3129
2017-11-01,32.3887
2017-11-02,32.4835
2017-11-03,32.4361
2017-11-06,32.5215
2017-11-07,32.3982
2017-11-08,32.512
2017-11-09,32.3223
2017-11-10,32.1991
2017-11-13,32.1043
2017-11-14,32.0663
2017-11-15,31.9336
2017-11-16,32.2086
2017-11-17,32.1138
2017-11-20,32.1706
2017-11-21,32.3792
2017-11-22,32.4835
2017-11-24,32.7206
2017-11-27,32.5025
2017-11-28,32.6637
2017-11-29,32.5404
2017-11-30,32.5594
2017-12-01,32.5025
2017-12-04,32.3603
2017-12-05,32.3223
2017-12-06,32.1991
2017-12-07,32.3034
2017-12-08,32.4646
2017-12-11,32.5404
2017-12-12,32.5783
2017-12-13,32.7016
2017-12-14,32.5404
2017-12-15,32.512
2017-12-18,32.872
2017-12-19,32.7555
2017-12-20,32.736
2017-12-21,32.8234
2017-12-22,32.9205
2017-12-26,32.9205
2017-12-27,32.9885
2017-12-28,33.0661
2017-12-29,33.0758
2018-01-02,33.3088
2018-01-03,33.5418
2018-01-04,33.8622
2018-01-05,34.0467
2018-01-08,34.0272
2018-01-09,34.0467
2018-01-10,33.969
2018-01-11,34.1826
2018-01-12,34.4932
2018-01-16,34.4738
2018-01-17,34.6486
2018-01-18,34.5903
2018-01-19,34.7456
2018-01-22,34.901
2018-01-23,35.0175
2018-01-24,35.1049
2018-01-25,34.9786
2018-01-26,35.2893
2018-01-29,34.9689
2018-01-30,34.6777
2018-01-31,34.6777
2018-02-01,34.7165
2018-02-02,33.9302
2018-02-05,32.5904
2018-02-06,33.27
2018-02-07,32.7846
2018-02-08,31.9594
2018-02-09,32.1341
2018-02-12,32.6001
2018-02-13,32.5128
2018-02-14,33.0953
2018-02-15,33.338
2018-02-16,33.4642
2018-02-20,33.1147
2018-02-21,32.969
2018-02-22,33.0953
2018-02-23,33.4059
2018-02-26,33.7166
2018-02-27,33.1923
2018-02-28,32.8331
2018-03-01,32.3768
2018-03-02,32.5031
2018-03-05,32.6681
2018-03-06,32.9205
2018-03-07,32.872
2018-03-08,32.9496
2018-03-09,33.202
2018-03-12,33.2409
2018-03-13,33.0273
2018-03-14,33.1147
2018-03-15,33.0758
2018-03-16,33.0467
2018-03-19,32.7652
2018-03-20,32.8137
2018-03-21,32.8914
2018-03-22,32.2603
2018-03-23,31.872
2018-03-26,32.4642
2018-03-27,32.1827
2018-03-28,32.3671
2018-03-29,32.7263
2018-04-02,32.2021
2018-04-03,32.4836
2018-04-04,32.5516
2018-04-05,32.7943
2018-04-06,32.5128
2018-04-09,32.804
2018-04-10,33.1535
2018-04-11,33.0273
2018-04-12,33.1438
2018-04-13,33.1535
2018-04-16,33.2215
2018-04-17,33.3962
2018-04-18,33.5807
2018-04-19,33.435
2018-04-20,33.2797
2018-04-23,33.2312
2018-04-24,33.0855
2018-04-25,33.0467
2018-04-26,33.2312
2018-04-27,33.3088
2018-04-30,33.1923
2018-05-01,33.105
2018-05-02,33.0661
2018-05-03,33.1341
2018-05-04,33.2409
2018-05-07,33.2603
2018-05-08,33.2409
2018-05-09,33.3477
2018-05-10,33.5807
2018-05-11,33.668
2018-05-14,33.7263
2018-05-15,33.4642
2018-05-16,33.5321
2018-05-17,33.5515
2018-05-18,33.4253
2018-05-21,33.668
2018-05-22,33.6292
2018-05-23,33.3283
2018-05-24,33.1923
2018-05-25,33.0079
2018-05-29,32.3671
2018-05-30,32.7943
2018-05-31,32.6293
2018-06-01,32.872
2018-06-04,32.9982
2018-06-05,32.9496
2018-06-06,33.2312
2018-06-07,33.0661
2018-06-08,33.1147
2018-06-11,33.3185
2018-06-12,33.1147
2018-06-13,33.1438
2018-06-14,33.0564
2018-06-15,32.8428
2018-06-18,32.6196
2018-06-19,32.3089
2018-06-20,32.3574
2018-06-21,32.1147
2018-06-22,32.4642
2018-06-25,32.0079
2018-06-26,32.0468
2018-06-27,31.8041
2018-06-28,31.8817
2018-06-29,32.0856
2018-07-02,31.7652
2018-07-03,31.8235
2018-07-05,32.1147
2018-07-06,32.3089
2018-07-09,32.5807
2018-07-10,32.6098
2018-07-11,32.0565
2018-07-12,32.3089
2018-07-13,32.4157
2018-07-16,32.406
2018-07-17,32.4545
2018-07-18,32.4739
2018-07-19,32.3574
2018-07-20,32.5322
2018-07-23,32.4933
2018-07-24,32.6972
2018-07-25,32.9885
2018-07-26,32.8137
2018-07-27,32.8914
2018-07-30,32.8623
2018-07-31,32.8914
2018-08-01,32.804
2018-08-02,32.5419
2018-08-03,32.5904
2018-08-06,32.4448
2018-08-07,32.6487
2018-08-08,32.6584
2018-08-09,32.571
2018-08-10,31.9497
2018-08-13,31.8041
2018-08-14,31.8526
2018-08-15,31.3769
2018-08-16,31.5808
2018-08-17,31.7944
2018-08-20,31.9497
2018-08-21,32.1244
2018-08-22,32.2701
2018-08-23,32.0274
2018-08-24,32.2603
2018-08-27,32.6584
2018-08-28,32.6001
2018-08-29,32.7846
2018-08-30,32.4933
2018-08-31,32.2701
2018-09-04,31.9497
2018-09-05,31.707
2018-09-06,31.6099
2018-09-07,31.3575
2018-09-10,31.5225
2018-09-11,31.5711
2018-09-12,31.6973
2018-09-13,31.9109
2018-09-14,31.9497
2018-09-17,31.9788
2018-09-18,32.3186
2018-09-19,32.4545
2018-09-20,32.7943
2018-09-21,32.8331
2018-09-24,32.6875
2018-09-25,32.8525
2018-09-26,32.8623
2018-09-27,32.7943
2018-09-28,32.5516
2018-10-01,32.639
2018-10-02,32.4157
2018-10-03,32.3671
2018-10-04,31.9691
2018-10-05,31.8041
2018-10-08,31.639
2018-10-09,31.5516
2018-10-10,30.8527
2018-10-11,30.4061
2018-10-12,30.542
2018-10-15,30.5032
2018-10-16,31.008
2018-10-17,30.8138
2018-10-18,30.3284
2018-10-19,30.5032
2018-10-22,30.3478
2018-10-23,30.076
2018-10-24,29.2508
2018-10-25,29.5809
2018-10-26,29.3382
2018-10-29,29.2217
2018-10-30,29.5809
2018-10-31,29.8139
2018-11-01,30.1731
2018-11-02,30.241
2018-11-05,30.2508
2018-11-06,30.4061
2018-11-07,30.7847
2018-11-08,30.474
2018-11-09,30.2799
2018-11-12,29.7848
2018-11-13,29.9013
2018-11-14,29.9013
2018-11-15,30.0372
2018-11-16,30.0566
2018-11-19,29.8139
2018-11-20,29.2605
2018-11-21,29.6683
2018-11-23,29.4838
2018-11-26,29.9207
2018-11-27,29.8139
2018-11-28,30.241
2018-11-29,30.1051
2018-11-30,29.9692
2018-12-03,30.4061
2018-12-04,29.6294
2018-12-06,29.3285
2018-12-07,29.0372
2018-12-10,28.8042
2018-12-11,28.8722
2018-12-12,29.3
2018-12-13,29.25
2018-12-14,28.85
2018-12-17,28.59
2018-12-18,28.62
2018-12-19,28.36
2018-12-20,28.23
2018-12-21,27.76
2018-12-24,27.44
2018-12-26,28.1
2018-12-27,28.11
2018-12-28,28.28
2018-12-31,28.35
2019-01-02,28.27
2019-01-03,28.07
2019-01-04,28.88
2019-01-07,29.02
2019-01-08,29.21
2019-01-09,29.57
2019-01-10,29.67
2019-01-11,29.51
2019-01-14,29.35
2019-01-15,29.54
2019-01-16,29.62
2019-01-17,29.75
2019-01-18,30.04
2019-01-22,29.59
2019-01-23,29.73
2019-01-24,29.8
2019-01-25,30.13
2019-01-28,30.01
2019-01-29,30.09
2019-01-30,30.42
2019-01-31,30.39
2019-02-01,30.39
2019-02-04,30.5
2019-02-05,30.73
2019-02-06,30.55
2019-02-07,30.18
2019-02-08,30.07
2019-02-11,30.02
2019-02-12,30.37
2019-02-13,30.4
2019-02-14,30.38
2019-02-15,30.81
2019-02-19,30.95
2019-02-20,31.07
2019-02-21,30.97
2019-02-22,31.11
2019-02-25,31.2
2019-02-26,31.3
2019-02-27,31.22
2019-02-28,31.12
2019-03-01,31.28
2019-03-04,31.16
2019-03-05,31.19
2019-03-06,31.1
2019-03-07,30.7
2019-03-08,30.68
2019-03-11,30.96
2019-03-12,30.97
2019-03-13,31.2
2019-03-14,31.16
2019-03-15,31.45
2019-03-18,31.61
2019-03-19,31.65
2019-03-20,31.67
2019-03-21,31.69
2019-03-22,31.09
2019-03-25,31.1
2019-03-26,31.27
2019-03-27,31.24
2019-03-28,31.21
2019-03-29,31.31
2019-04-01,31.73
2019-04-02,31.76
2019-04-03,31.96
2019-04-04,31.93
2019-04-05,31.99
2019-04-08,32.02
2019-04-09,31.81
2019-04-10,31.94
2019-04-11,31.89
2019-04-12,32.12
2019-04-15,32.14
2019-04-16,32.19
2019-04-17,32.27
2019-04-18,32.21
2019-04-22,32.19
2019-04-23,32.23
2019-04-24,31.96
2019-04-25,31.92
2019-04-26,32.04
2019-04-29,32.19
2019-04-30,32.21
2019-05-01,32.02
2019-05-02,31.95
2019-05-03,32.27
2019-05-06,31.96
2019-05-07,31.41
2019-05-08,31.44
2019-05-09,31.23
2019-05-10,31.43
2019-05-13,30.74
2019-05-14,31.04
2019-05-15,31.17
2019-05-16,31.36
2019-05-17,31.18
2019-05-20,31.04
2019-05-21,31.26
2019-05-22,31.12
2019-05-23,30.85
2019-05-24,31.12
2019-05-28,30.88
2019-05-29,30.65
2019-05-30,30.79
2019-05-31,30.53
2019-06-03,30.69
2019-06-04,31.06
2019-06-05,31.07
2019-06-06,31.18
2019-06-07,31.57
2019-06-10,31.66
2019-06-11,31.81
2019-06-12,31.56
2019-06-13,31.535
2019-06-14,31.345
2019-06-17,31.365
2019-06-18,31.785
2019-06-19,32.01
2019-06-20,32.315
2019-06-21,32.25
2019-06-24,32.235
2019-06-25,32.09
2019-06-26,31.86
2019-06-27,31.925
2019-06-28,32.035
2019-07-01,32.21
2019-07-02,32.315
2019-07-03,32.51
2019-07-04,32.51
2019-07-05,32.27
2019-07-08,32.085
2019-07-09,31.925
2019-07-10,32.075
2019-07-11,32.045
2019-07-12,32.07
2019-07-15,32.105
2019-07-16,32.015
2019-07-17,31.975
2019-07-18,32.025
2019-07-19,31.97
2019-07-22,32.01
2019-07-23,32.2
2019-07-24,32.175
2019-07-25,31.9
2019-07-26,31.985
2019-07-29,31.985
2019-07-30,31.615
2019-07-31,31.415
2019-08-01,31.285
2019-08-02,31.055
2019-08-05,30.295
2019-08-06,30.47
2019-08-07,30.615
2019-08-08,30.935
2019-08-09,30.805
2019-08-12,30.45
2019-08-13,30.74
2019-08-14,29.96
2019-08-15,30.035
2019-08-16,30.4
2019-08-19,30.555
2019-08-20,30.465
2019-08-21,30.72
2019-08-22,30.61
2019-08-23,30.23
2019-08-26,30.44
2019-08-27,30.51
2019-08-28,30.495
2019-08-29,30.735
2019-08-30,30.81
2019-09-02,30.865
2019-09-03,30.74
2019-09-04,31.16
2019-09-05,31.42
2019-09-06,31.545
2019-09-09,31.57
2019-09-10,31.61
2019-09-11,31.805
2019-09-12,32.025
2019-09-13,32.17
2019-09-16,31.925
2019-09-17,32.04
2019-09-18,32.01
2019-09-19,32.11
2019-09-20,32.045
2019-09-23,31.96
2019-09-24,31.885
2019-09-25,31.795
2019-09-26,31.89
2019-09-27,31.735
2019-09-30,31.835
2019-10-01,31.55
2019-10-02,30.935
2019-10-03,31.12
2019-10-04,31.335
2019-10-07,31.355
2019-10-08,31.05
2019-10-09,31.285
2019-10-10,31.475
2019-10-11,32.06
2019-10-14,31.945
2019-10-15,32.275
2019-10-16,32.295
2019-10-17,32.36
2019-10-18,32.38
2019-10-21,32.555
2019-10-22,32.5
2019-10-23,32.63
2019-10-24,32.715
2019-10-25,32.735
2019-10-28,32.855
2019-10-29,32.83
2019-10-30,32.94
2019-10-31,32.825
2019-11-01,33.135
2019-11-04,33.335
2019-11-05,33.335
2019-11-06,33.315
2019-11-07,33.425
2019-11-08,33.37
2019-11-11,33.325
2019-11-12,33.315
2019-11-13,33.215
2019-11-14,33.17
2019-11-15,33.38
2019-11-18,33.425
2019-11-19,33.375
2019-11-20,33.15
2019-11-21,33.085
2019-11-22,33.145
2019-11-25,33.4
