Hyperlink,URL,Title,Page Power,Size,Words,Modified,Match Words,Match Percentage,Match Pages,Match Words (with common),Match Percentage (with common),Match Pages (with common),Broken Links Out,Links Out,Links In,Skip Reason,Redirected to
https://goofy-euclid-1cd736.netlify.app/,(home page),a/A-Student-Resources,70,20,65,"03:17, 6 Feb, 2021",65,100%,1,65,100%,1,0,3,14,,
https://goofy-euclid-1cd736.netlify.app/core-site/page-contact.html,core-site/page-contact.html,The Good AA,21,16,120,"03:17, 6 Feb, 2021",62,52%,1,62,52%,1,12,25,5,,
https://goofy-euclid-1cd736.netlify.app/core-site/other-pages/Student-Profiles/index.html,core-site/other-pages/Student-Profiles/index.html,https://goofy-euclid-1cd736.netlify.app/core-site/other-pages/student-profiles/,15,0,0,"00:00, 1 Jan, 1970",0,0%,0,0,0%,0,0,0,2,HTTP Header Redirect ,https://goofy-euclid-1cd736.netlify.app/core-site/other-pages/student-profiles/
https://goofy-euclid-1cd736.netlify.app/2-content/core-content/cheat-sheets/pdf/index.html,2-content/core-content/cheat-sheets/pdf/index.html,directory,15,14,434,"03:17, 6 Feb, 2021",0,0%,0,0,0%,0,18,18,2,,
https://goofy-euclid-1cd736.netlify.app/2-content/core-content/cheat-sheets/pdf/database,2-content/core-content/cheat-sheets/pdf/database,,0,0,0,"00:00, 1 Jan, 1970",0,0%,0,0,0%,0,0,0,1,Error 404 - Not Found,
https://goofy-euclid-1cd736.netlify.app/2-content/core-content/cheat-sheets/pdf/engineering,2-content/core-content/cheat-sheets/pdf/engineering,,0,0,0,"00:00, 1 Jan, 1970",0,0%,0,0,0%,0,0,0,1,Error 404 - Not Found,
https://goofy-euclid-1cd736.netlify.app/2-content/core-content/cheat-sheets/pdf/git,2-content/core-content/cheat-sheets/pdf/git,,0,0,0,"00:00, 1 Jan, 1970",0,0%,0,0,0%,0,0,0,1,Error 404 - Not Found,
https://goofy-euclid-1cd736.netlify.app/2-content/core-content/cheat-sheets/pdf/html,2-content/core-content/cheat-sheets/pdf/html,,0,0,0,"00:00, 1 Jan, 1970",0,0%,0,0,0%,0,0,0,1,Error 404 - Not Found,
https://goofy-euclid-1cd736.netlify.app/2-content/core-content/cheat-sheets/pdf/java,2-content/core-content/cheat-sheets/pdf/java,,0,0,0,"00:00, 1 Jan, 1970",0,0%,0,0,0%,0,0,0,1,Error 404 - Not Found,
https://goofy-euclid-1cd736.netlify.app/2-content/core-content/cheat-sheets/pdf/java/JAVA,2-content/core-content/cheat-sheets/pdf/java/JAVA,,0,0,0,"00:00, 1 Jan, 1970",0,0%,0,0,0%,0,0,0,1,Error 404 - Not Found,
https://goofy-euclid-1cd736.netlify.app/2-content/core-content/cheat-sheets/pdf/javascript,2-content/core-content/cheat-sheets/pdf/javascript,,0,0,0,"00:00, 1 Jan, 1970",0,0%,0,0,0%,0,0,0,1,Error 404 - Not Found,
https://goofy-euclid-1cd736.netlify.app/2-content/core-content/cheat-sheets/pdf/linux,2-content/core-content/cheat-sheets/pdf/linux,,0,0,0,"00:00, 1 Jan, 1970",0,0%,0,0,0%,0,0,0,1,Error 404 - Not Found,
https://goofy-euclid-1cd736.netlify.app/2-content/core-content/cheat-sheets/pdf/math/Calculus_Cheat_Sheet_All_Reduced,2-content/core-content/cheat-sheets/pdf/math/Calculus_Cheat_Sheet_All_Reduced,,0,0,0,"00:00, 1 Jan, 1970",0,0%,0,0,0%,0,0,0,1,Error 404 - Not Found,
https://goofy-euclid-1cd736.netlify.app/2-content/core-content/cheat-sheets/pdf/math/Calculus_Cheat_Sheet_Derivatives_Reduced,2-content/core-content/cheat-sheets/pdf/math/Calculus_Cheat_Sheet_Derivatives_Reduced,,0,0,0,"00:00, 1 Jan, 1970",0,0%,0,0,0%,0,0,0,1,Error 404 - Not Found,
https://goofy-euclid-1cd736.netlify.app/2-content/core-content/cheat-sheets/pdf/math/Calculus_Cheat_Sheet_Integrals_Reduced,2-content/core-content/cheat-sheets/pdf/math/Calculus_Cheat_Sheet_Integrals_Reduced,,0,0,0,"00:00, 1 Jan, 1970",0,0%,0,0,0%,0,0,0,1,Error 404 - Not Found,
https://goofy-euclid-1cd736.netlify.app/2-content/core-content/cheat-sheets/pdf/math/Calculus_Cheat_Sheet_Limits_Reduced,2-content/core-content/cheat-sheets/pdf/math/Calculus_Cheat_Sheet_Limits_Reduced,,0,0,0,"00:00, 1 Jan, 1970",0,0%,0,0,0%,0,0,0,1,Error 404 - Not Found,
https://goofy-euclid-1cd736.netlify.app/2-content/core-content/cheat-sheets/pdf/math/Common_Derivatives_Integrals_Reduced,2-content/core-content/cheat-sheets/pdf/math/Common_Derivatives_Integrals_Reduced,,0,0,0,"00:00, 1 Jan, 1970",0,0%,0,0,0%,0,0,0,1,Error 404 - Not Found,
https://goofy-euclid-1cd736.netlify.app/2-content/core-content/cheat-sheets/pdf/misc,2-content/core-content/cheat-sheets/pdf/misc,,0,0,0,"00:00, 1 Jan, 1970",0,0%,0,0,0%,0,0,0,1,Error 404 - Not Found,
https://goofy-euclid-1cd736.netlify.app/2-content/core-content/cheat-sheets/pdf/python,2-content/core-content/cheat-sheets/pdf/python,,0,0,0,"00:00, 1 Jan, 1970",0,0%,0,0,0%,0,0,0,1,Error 404 - Not Found,
https://goofy-euclid-1cd736.netlify.app/2-content/core-content/cheat-sheets/pdf/ruby,2-content/core-content/cheat-sheets/pdf/ruby,,0,0,0,"00:00, 1 Jan, 1970",0,0%,0,0,0%,0,0,0,1,Error 404 - Not Found,
https://goofy-euclid-1cd736.netlify.app/2-content/core-content/cheat-sheets/pdf/ruby/Ruby,2-content/core-content/cheat-sheets/pdf/ruby/Ruby,,0,0,0,"00:00, 1 Jan, 1970",0,0%,0,0,0%,0,0,0,1,Error 404 - Not Found,
https://goofy-euclid-1cd736.netlify.app/2-content/core-content/cheat-sheets/pdf/web,2-content/core-content/cheat-sheets/pdf/web,,0,0,0,"00:00, 1 Jan, 1970",0,0%,0,0,0%,0,0,0,1,Error 404 - Not Found,
https://goofy-euclid-1cd736.netlify.app/core-site/other-pages/student-profiles/,core-site/other-pages/student-profiles/,Bryan Guner,20,15,372,"03:17, 6 Feb, 2021",372,100%,1,372,100%,1,0,3,0,,
https://goofy-euclid-1cd736.netlify.app/core-site/index.html,core-site/index.html,WEB-DEV-Resources,100,20,146,"03:17, 6 Feb, 2021",62,42%,1,62,42%,1,15,36,18,,
https://goofy-euclid-1cd736.netlify.app/core-site/other-pages/weeks/week-1.html,core-site/other-pages/weeks/week-1.html,Week-,10,67,"1,841","03:17, 6 Feb, 2021",0,0%,0,0,0%,0,0,2,2,,
https://goofy-euclid-1cd736.netlify.app/core-site/other-pages/weeks/week-2.html,core-site/other-pages/weeks/week-2.html,Week-,10,3,6,"03:17, 6 Feb, 2021",6,100%,1,6,100%,1,0,1,2,,
https://goofy-euclid-1cd736.netlify.app/core-site/other-pages/weeks/week-3.html,core-site/other-pages/weeks/week-3.html,Week-,10,3,6,"03:17, 6 Feb, 2021",6,100%,2,6,100%,2,0,1,2,,
https://goofy-euclid-1cd736.netlify.app/core-site/other-pages/weeks/week-4.html,core-site/other-pages/weeks/week-4.html,Week-,10,3,6,"03:17, 6 Feb, 2021",6,100%,1,6,100%,1,0,1,2,,
https://goofy-euclid-1cd736.netlify.app/core-site/other-pages/weeks/week-5.html,core-site/other-pages/weeks/week-5.html,Week-,22,3,12,"03:17, 6 Feb, 2021",0,0%,0,0,0%,1,1,3,3,,
https://goofy-euclid-1cd736.netlify.app/core-site/other-pages/weeks/week-6.html,core-site/other-pages/weeks/week-6.html,Week-,22,3,9,"03:17, 6 Feb, 2021",8,89%,2,8,89%,2,0,2,3,,
https://goofy-euclid-1cd736.netlify.app/core-site/other-pages/weeks/week-7.html,core-site/other-pages/weeks/week-7.html,Week-,22,3,9,"03:17, 6 Feb, 2021",8,89%,1,8,89%,1,0,2,3,,
https://goofy-euclid-1cd736.netlify.app/core-site/other-pages/weeks/week-8.html,core-site/other-pages/weeks/week-8.html,Week-,22,20,983,"03:17, 6 Feb, 2021",108,11%,1,108,11%,1,0,2,3,,
https://goofy-euclid-1cd736.netlify.app/core-site/other-pages/weeks/week-9.html,core-site/other-pages/weeks/week-9.html,Week-,15,103,"8,122","03:17, 6 Feb, 2021",708,9%,1,708,9%,1,0,6,3,,
https://goofy-euclid-1cd736.netlify.app/core-site/other-pages/weeks/week-10.html,core-site/other-pages/weeks/week-10.html,Week-,12,864,"48,841","03:17, 6 Feb, 2021",6,0%,1,6,0%,1,0,3,3,,
https://goofy-euclid-1cd736.netlify.app/core-site/other-pages/weeks/week-11.html,core-site/other-pages/weeks/week-11.html,Week-,22,3,9,"03:17, 6 Feb, 2021",8,89%,1,8,89%,1,0,2,3,,
https://goofy-euclid-1cd736.netlify.app/core-site/other-pages/weeks/week-12.html,core-site/other-pages/weeks/week-12.html,Week-,10,7,378,"03:17, 6 Feb, 2021",0,0%,0,0,0%,0,1,2,2,,
https://goofy-euclid-1cd736.netlify.app/core-site/other-pages/weeks/week-13.html,core-site/other-pages/weeks/week-13.html,,0,0,0,"00:00, 1 Jan, 1970",0,0%,0,0,0%,0,0,0,2,Error 404 - Not Found,
https://goofy-euclid-1cd736.netlify.app/core-site/other-pages/weeks/week-14.html,core-site/other-pages/weeks/week-14.html,,0,0,0,"00:00, 1 Jan, 1970",0,0%,0,0,0%,0,0,0,2,Error 404 - Not Found,
https://goofy-euclid-1cd736.netlify.app/core-site/other-pages/weeks/week-15.html,core-site/other-pages/weeks/week-15.html,,0,0,0,"00:00, 1 Jan, 1970",0,0%,0,0,0%,0,0,0,2,Error 404 - Not Found,
https://goofy-euclid-1cd736.netlify.app/core-site/other-pages/weeks/week-16.html,core-site/other-pages/weeks/week-16.html,,0,0,0,"00:00, 1 Jan, 1970",0,0%,0,0,0%,0,0,0,2,Error 404 - Not Found,
https://goofy-euclid-1cd736.netlify.app/core-site/other-pages/weeks/week-17.html,core-site/other-pages/weeks/week-17.html,,0,0,0,"00:00, 1 Jan, 1970",0,0%,0,0,0%,0,0,0,2,Error 404 - Not Found,
https://goofy-euclid-1cd736.netlify.app/core-site/other-pages/weeks/week-18.html,core-site/other-pages/weeks/week-18.html,,0,0,0,"00:00, 1 Jan, 1970",0,0%,0,0,0%,0,0,0,2,Error 404 - Not Found,
https://goofy-euclid-1cd736.netlify.app/core-site/other-pages/weeks/week-19.html,core-site/other-pages/weeks/week-19.html,,0,0,0,"00:00, 1 Jan, 1970",0,0%,0,0,0%,0,0,0,2,Error 404 - Not Found,
https://goofy-euclid-1cd736.netlify.app/core-site/other-pages/weeks/week-20.html,core-site/other-pages/weeks/week-20.html,,0,0,0,"00:00, 1 Jan, 1970",0,0%,0,0,0%,0,0,0,2,Error 404 - Not Found,
https://goofy-euclid-1cd736.netlify.app/core-site/other-pages/weeks/week-21.html,core-site/other-pages/weeks/week-21.html,,0,0,0,"00:00, 1 Jan, 1970",0,0%,0,0,0%,0,0,0,2,Error 404 - Not Found,
https://goofy-euclid-1cd736.netlify.app/core-site/other-pages/weeks/week-22.html,core-site/other-pages/weeks/week-22.html,,0,0,0,"00:00, 1 Jan, 1970",0,0%,0,0,0%,0,0,0,2,Error 404 - Not Found,
https://goofy-euclid-1cd736.netlify.app/core-site/other-pages/weeks/week-23.html,core-site/other-pages/weeks/week-23.html,,0,0,0,"00:00, 1 Jan, 1970",0,0%,0,0,0%,0,0,0,2,Error 404 - Not Found,
https://goofy-euclid-1cd736.netlify.app/core-site/other-pages/weeks/week-24.html,core-site/other-pages/weeks/week-24.html,,0,0,0,"00:00, 1 Jan, 1970",0,0%,0,0,0%,0,0,0,2,Error 404 - Not Found,
https://goofy-euclid-1cd736.netlify.app/core-site/other-pages/weeks/week-8/wk8-quiz.html,core-site/other-pages/weeks/week-8/wk8-quiz.html,week8,15,50,"2,194","03:17, 6 Feb, 2021",0,0%,0,0,0%,0,0,1,1,,
https://goofy-euclid-1cd736.netlify.app/core-site/other-pages/weeks/0-quiz/wk7-quiz.html,core-site/other-pages/weeks/0-quiz/wk7-quiz.html,QUIZ,15,70,"3,089","03:17, 6 Feb, 2021",141,5%,1,141,5%,1,0,1,1,,
https://goofy-euclid-1cd736.netlify.app/0-assets/planning/documentation/portfolio/tree-diagram.html,0-assets/planning/documentation/portfolio/tree-diagram.html,,9,520,0,"03:17, 6 Feb, 2021",0,0%,0,0,0%,0,0,0,1,,
https://goofy-euclid-1cd736.netlify.app/core-site/blog.html,core-site/blog.html,AA-Student-Blog,10,24,411,"03:17, 6 Feb, 2021",74,18%,2,74,18%,2,2,16,2,,
https://goofy-euclid-1cd736.netlify.app/core-site/resources.html,core-site/resources.html,directory,9,90,"5,842","03:17, 6 Feb, 2021",0,0%,0,0,0%,0,2,412,1,,
https://goofy-euclid-1cd736.netlify.app/core-site/other-pages/sandbox.html,core-site/other-pages/sandbox.html,Sandbox,9,16,93,"03:17, 6 Feb, 2021",9,10%,1,9,10%,1,0,2,1,,
https://goofy-euclid-1cd736.netlify.app/2-content/core-content/node-npm/npm-reademe-comp/index.html,2-content/core-content/node-npm/npm-reademe-comp/index.html,,0,0,0,"00:00, 1 Jan, 1970",0,0%,0,0,0%,0,0,0,1,No response,
https://goofy-euclid-1cd736.netlify.app/index.html,index.html,a/A-Student-Resources,9,20,65,"03:17, 6 Feb, 2021",65,100%,1,65,100%,1,0,3,1,,
https://goofy-euclid-1cd736.netlify.app/output.html,output.html,,0,0,0,"00:00, 1 Jan, 1970",0,0%,0,0,0%,0,0,0,1,Error 404 - Not Found,
https://goofy-euclid-1cd736.netlify.app/core-site/other-pages/blog-posts/9-thigs-you-should-know-about/What every computer science major should know.html,core-site/other-pages/blog-posts/9-thigs-you-should-know-about/What every computer science major should know.html,,0,0,0,"00:00, 1 Jan, 1970",0,0%,0,0,0%,0,0,0,1,Non-HTML - Siteliner can only analyze HTML web pages.,
https://goofy-euclid-1cd736.netlify.app/core-site/other-pages/blog-posts/best-prac-extension-guide/js-tools-and-best-prac.html,core-site/other-pages/blog-posts/best-prac-extension-guide/js-tools-and-best-prac.html,,9,0,0,"00:00, 1 Jan, 1970",0,0%,0,0,0%,0,0,0,1,"Siteliner cannot check content over 2MB in size or containing more than 100,000 words.",
https://goofy-euclid-1cd736.netlify.app/other-pages/blog-post,other-pages/blog-post,,0,0,0,"00:00, 1 Jan, 1970",0,0%,0,0,0%,0,0,0,1,Error 404 - Not Found,
https://goofy-euclid-1cd736.netlify.app/core-site/other-pages/blog-posts/best-prac-extension-guide/Design-Principles/HTML-Design-Principles.html,core-site/other-pages/blog-posts/best-prac-extension-guide/Design-Principles/HTML-Design-Principles.html,https://goofy-euclid-1cd736.netlify.app/core-site/other-pages/blog-posts/best-prac-extension-guide/design-principles/html-design-principles,9,0,0,"00:00, 1 Jan, 1970",0,0%,0,0,0%,0,0,0,1,HTTP Header Redirect ,https://goofy-euclid-1cd736.netlify.app/core-site/other-pages/blog-posts/best-prac-extension-guide/design-principles/html-design-principles
https://goofy-euclid-1cd736.netlify.app/core-site/other-pages/weeks/0-quiz/wk6-quiz.html,core-site/other-pages/weeks/0-quiz/wk6-quiz.html,QUIZ,15,57,"2,827","03:17, 6 Feb, 2021",0,0%,0,0,0%,0,0,1,1,,
https://goofy-euclid-1cd736.netlify.app/core-site/other-pages/weeks/0-quiz/wk5-quiz.html,core-site/other-pages/weeks/0-quiz/wk5-quiz.html,,15,101,"5,729","03:17, 6 Feb, 2021",0,0%,0,0,0%,0,0,1,1,,
https://goofy-euclid-1cd736.netlify.app/core-site/other-pages/weeks/week-5\connect-4\index.html,core-site/other-pages/weeks/week-5\connect-4\index.html,,0,0,0,"00:00, 1 Jan, 1970",0,0%,0,0,0%,0,0,0,1,Error 404 - Not Found,
https://goofy-euclid-1cd736.netlify.app/core-site/other-pages/student-profiles/generic.html,core-site/other-pages/student-profiles/generic.html,Generic - Hyperspace by HTML5 UP,10,3,141,"03:17, 6 Feb, 2021",7,5%,1,7,5%,1,0,2,3,,
https://goofy-euclid-1cd736.netlify.app/core-site/other-pages/weeks/week-1/js-array-methods.html,core-site/other-pages/weeks/week-1/js-array-methods.html,js-array-methods,9,109,"5,517","03:17, 6 Feb, 2021",16,0%,1,16,0%,1,0,0,1,,
https://goofy-euclid-1cd736.netlify.app/core-site/other-pages/student-profiles/index.html,core-site/other-pages/student-profiles/index.html,Bryan Guner,11,15,372,"03:17, 6 Feb, 2021",372,100%,1,372,100%,1,0,3,2,,
https://goofy-euclid-1cd736.netlify.app/core-site/other-pages/student-profiles/elements.html,core-site/other-pages/student-profiles/elements.html,Elements - Hyperspace by HTML5 UP,8,16,698,"03:17, 6 Feb, 2021",7,1%,1,7,1%,1,0,2,1,,
https://goofy-euclid-1cd736.netlify.app/core-site/other-pages/weeks/week-9/quiz/wk9-quiz.html,core-site/other-pages/weeks/week-9/quiz/wk9-quiz.html,WEEK-9,6,67,"4,179","03:17, 6 Feb, 2021",708,17%,1,708,17%,1,0,1,1,,
https://goofy-euclid-1cd736.netlify.app/core-site/other-pages/weeks/week-9/w9-projects/css-modernize-craigslist-starter/attributes-project.html,core-site/other-pages/weeks/week-9/w9-projects/css-modernize-craigslist-starter/attributes-project.html,,6,59,670,"03:17, 6 Feb, 2021",8,1%,1,8,1%,1,0,14,1,,
https://goofy-euclid-1cd736.netlify.app/core-site/other-pages/weeks/week-9/w9-projects/trello/flexbox-project.css,core-site/other-pages/weeks/week-9/w9-projects/trello/flexbox-project.css,,6,4,450,"03:17, 6 Feb, 2021",0,0%,0,0,0%,0,0,0,1,,
https://goofy-euclid-1cd736.netlify.app/core-site/other-pages/weeks/week-9/w9-projects/aa-times/index.html,core-site/other-pages/weeks/week-9/w9-projects/aa-times/index.html,App Academy Times,6,11,365,"03:17, 6 Feb, 2021",0,0%,0,0,0%,0,0,0,1,,
https://goofy-euclid-1cd736.netlify.app/core-site/other-pages/weeks/week-9/w9-projects/catstagram/public/index.html,core-site/other-pages/weeks/week-9/w9-projects/catstagram/public/index.html,Catstagram,6,1,10,"03:17, 6 Feb, 2021",0,0%,0,0,0%,0,0,0,1,,
https://goofy-euclid-1cd736.netlify.app/core-site/other-pages/weeks/0-quiz/wk11-quiz.html,core-site/other-pages/weeks/0-quiz/wk11-quiz.html,QUIZ,15,62,"2,560","03:17, 6 Feb, 2021",37,1%,1,37,1%,1,0,1,1,,
https://goofy-euclid-1cd736.netlify.app/core-site/other-pages/blog-posts/best-prac-extension-guide/design-principles/html-design-principles,core-site/other-pages/blog-posts/best-prac-extension-guide/design-principles/html-design-principles,HTML Design Principles,14,26,"2,470","03:17, 6 Feb, 2021",0,0%,0,0,0%,0,0,1,0,,
https://goofy-euclid-1cd736.netlify.app/core-site/other-pages/weeks/index.html,core-site/other-pages/weeks/index.html,,0,0,0,"00:00, 1 Jan, 1970",0,0%,0,0,0%,0,0,0,1,Error 404 - Not Found,
https://goofy-euclid-1cd736.netlify.app/2-content/,2-content/,,8,0,0,"00:00, 1 Jan, 1970",0,0%,0,0,0%,0,0,0,1,"Siteliner cannot check content over 2MB in size or containing more than 100,000 words.",
https://goofy-euclid-1cd736.netlify.app/core-site/git-repos/index.html,core-site/git-repos/index.html,directory,5,2,16,"03:17, 6 Feb, 2021",0,0%,0,0,0%,0,0,4,1,,
https://goofy-euclid-1cd736.netlify.app/core-site/links.html,core-site/links.html,Document,5,99,"5,885","03:17, 6 Feb, 2021",0,0%,0,0,0%,0,0,0,1,,
https://goofy-euclid-1cd736.netlify.app/0-assets/blog-styles/output/bootstrap3/index.html,0-assets/blog-styles/output/bootstrap3/index.html,Strongly connected graph,6,15,"1,219","03:17, 6 Feb, 2021","1,190",98%,2,"1,190",98%,2,0,0,2,,
https://goofy-euclid-1cd736.netlify.app/0-assets/blog-styles/output/index.html,0-assets/blog-styles/output/index.html,https://goofy-euclid-1cd736.netlify.app/0-assets/blog-styles/output/github/index.html,0,0,0,"00:00, 1 Jan, 1970",0,0%,0,0,0%,0,1,0,1,Frame Redirect ,https://goofy-euclid-1cd736.netlify.app/0-assets/blog-styles/output/github/index.html
https://goofy-euclid-1cd736.netlify.app/0-assets/blog-styles/output/jasonm23-dark/index.html,0-assets/blog-styles/output/jasonm23-dark/index.html,Strongly connected graph,6,13,"1,190","03:17, 6 Feb, 2021","1,190",100%,1,"1,190",100%,1,0,0,2,,
https://goofy-euclid-1cd736.netlify.app/0-assets/blog-styles/output/jasonm23-foghorn/index.html,0-assets/blog-styles/output/jasonm23-foghorn/index.html,Strongly connected graph,6,13,"1,190","03:17, 6 Feb, 2021",0,0%,0,"1,190",100%,3,0,0,2,,
https://goofy-euclid-1cd736.netlify.app/0-assets/blog-styles/output/jasonm23-markdown/index.html,0-assets/blog-styles/output/jasonm23-markdown/index.html,Strongly connected graph,6,13,"1,190","03:17, 6 Feb, 2021","1,190",100%,2,"1,190",100%,2,0,0,2,,
https://goofy-euclid-1cd736.netlify.app/0-assets/blog-styles/output/jasonm23-swiss/index.html,0-assets/blog-styles/output/jasonm23-swiss/index.html,Strongly connected graph,6,13,"1,190","03:17, 6 Feb, 2021","1,190",100%,2,"1,190",100%,2,0,0,2,,
https://goofy-euclid-1cd736.netlify.app/0-assets/blog-styles/output/markedapp-byword/index.html,0-assets/blog-styles/output/markedapp-byword/index.html,Strongly connected graph,6,13,"1,190","03:17, 6 Feb, 2021","1,190",100%,2,"1,190",100%,2,0,0,2,,
https://goofy-euclid-1cd736.netlify.app/0-assets/blog-styles/output/menu.html,0-assets/blog-styles/output/menu.html,Menu,5,2,30,"03:17, 6 Feb, 2021",0,0%,0,0,0%,0,2,16,1,,
https://goofy-euclid-1cd736.netlify.app/0-assets/blog-styles/output/mixu-book/index.html,0-assets/blog-styles/output/mixu-book/index.html,Strongly connected graph,6,15,"1,230","03:17, 6 Feb, 2021",40,3%,1,"1,230",100%,3,0,1,2,,
https://goofy-euclid-1cd736.netlify.app/0-assets/blog-styles/output/mixu-bootstrap-2col/index.html,0-assets/blog-styles/output/mixu-bootstrap-2col/index.html,Strongly connected graph,6,14,"1,222","03:17, 6 Feb, 2021",32,3%,2,"1,222",100%,3,0,0,2,,
https://goofy-euclid-1cd736.netlify.app/0-assets/blog-styles/output/mixu-bootstrap/index.html,0-assets/blog-styles/output/mixu-bootstrap/index.html,Strongly connected graph,6,14,"1,195","03:17, 6 Feb, 2021","1,190",100%,1,"1,190",100%,1,0,0,2,,
https://goofy-euclid-1cd736.netlify.app/0-assets/blog-styles/output/mixu-gray/index.html,0-assets/blog-styles/output/mixu-gray/index.html,Strongly connected graph,6,14,"1,222","03:17, 6 Feb, 2021","1,222",100%,1,"1,222",100%,1,0,0,2,,
https://goofy-euclid-1cd736.netlify.app/0-assets/blog-styles/output/mixu-page/index.html,0-assets/blog-styles/output/mixu-page/index.html,Strongly connected graph,6,13,"1,190","03:17, 6 Feb, 2021","1,190",100%,2,"1,190",100%,2,0,0,2,,
https://goofy-euclid-1cd736.netlify.app/0-assets/blog-styles/output/mixu-radar/index.html,0-assets/blog-styles/output/mixu-radar/index.html,Strongly connected graph,6,14,"1,222","03:17, 6 Feb, 2021",32,3%,1,"1,222",100%,4,0,0,2,,
https://goofy-euclid-1cd736.netlify.app/0-assets/blog-styles/output/thomasf-solarizedcssdark/index.html,0-assets/blog-styles/output/thomasf-solarizedcssdark/index.html,Strongly connected graph,6,13,"1,190","03:17, 6 Feb, 2021","1,190",100%,1,"1,190",100%,1,0,0,2,,
https://goofy-euclid-1cd736.netlify.app/0-assets/blog-styles/output/thomasf-solarizedcsslight/index.html,0-assets/blog-styles/output/thomasf-solarizedcsslight/index.html,Strongly connected graph,6,13,"1,190","03:17, 6 Feb, 2021",0,0%,0,"1,190",100%,5,0,0,2,,
https://goofy-euclid-1cd736.netlify.app/1-tools/site-building/convert-multi-line-2-js/multi-2-arr.html,1-tools/site-building/convert-multi-line-2-js/multi-2-arr.html,,0,0,0,"00:00, 1 Jan, 1970",0,0%,0,0,0%,0,0,0,1,Error 404 - Not Found,
https://goofy-euclid-1cd736.netlify.app/1-tools/site-building/html-gen-dir/index.html,1-tools/site-building/html-gen-dir/index.html,,0,0,0,"00:00, 1 Jan, 1970",0,0%,0,0,0%,0,0,0,1,Error 404 - Not Found,
https://goofy-euclid-1cd736.netlify.app/2-content/core-content/Data-Structures/HTML-only/DS-and-Algorithms-Prac/DS-n-Algos/Arrays/flatten/flatten2.html,2-content/core-content/Data-Structures/HTML-only/DS-and-Algorithms-Prac/DS-n-Algos/Arrays/flatten/flatten2.html,https://goofy-euclid-1cd736.netlify.app/2-content/core-content/data-structures/html-only/ds-and-algorithms-prac/ds-n-algos/arrays/flatten/flatten2,5,0,0,"00:00, 1 Jan, 1970",0,0%,0,0,0%,0,0,0,1,HTTP Header Redirect ,https://goofy-euclid-1cd736.netlify.app/2-content/core-content/data-structures/html-only/ds-and-algorithms-prac/ds-n-algos/arrays/flatten/flatten2
https://goofy-euclid-1cd736.netlify.app/2-content/core-content/Data-Structures/HTML-only/DS-and-Algorithms-Prac/DS-n-Algos/Binary-Search-Trees/Binary-Search-Tree/BST.html,2-content/core-content/Data-Structures/HTML-only/DS-and-Algorithms-Prac/DS-n-Algos/Binary-Search-Trees/Binary-Search-Tree/BST.html,https://goofy-euclid-1cd736.netlify.app/2-content/core-content/data-structures/html-only/ds-and-algorithms-prac/ds-n-algos/binary-search-trees/binary-search-tree/bst,5,0,0,"00:00, 1 Jan, 1970",0,0%,0,0,0%,0,0,0,1,HTTP Header Redirect ,https://goofy-euclid-1cd736.netlify.app/2-content/core-content/data-structures/html-only/ds-and-algorithms-prac/ds-n-algos/binary-search-trees/binary-search-tree/bst
https://goofy-euclid-1cd736.netlify.app/2-content/core-content/Data-Structures/HTML-only/DS-and-Algorithms-Prac/DS-n-Algos/Binary-Trees/binary-tree-reading.html,2-content/core-content/Data-Structures/HTML-only/DS-and-Algorithms-Prac/DS-n-Algos/Binary-Trees/binary-tree-reading.html,https://goofy-euclid-1cd736.netlify.app/2-content/core-content/data-structures/html-only/ds-and-algorithms-prac/ds-n-algos/binary-trees/binary-tree-reading,5,0,0,"00:00, 1 Jan, 1970",0,0%,0,0,0%,0,0,0,1,HTTP Header Redirect ,https://goofy-euclid-1cd736.netlify.app/2-content/core-content/data-structures/html-only/ds-and-algorithms-prac/ds-n-algos/binary-trees/binary-tree-reading
https://goofy-euclid-1cd736.netlify.app/2-content/core-content/Data-Structures/HTML-only/DS-and-Algorithms-Prac/DS-n-Algos/Misc/whiteboarding/whiteboarding-problems.html,2-content/core-content/Data-Structures/HTML-only/DS-and-Algorithms-Prac/DS-n-Algos/Misc/whiteboarding/whiteboarding-problems.html,https://goofy-euclid-1cd736.netlify.app/2-content/core-content/data-structures/html-only/ds-and-algorithms-prac/ds-n-algos/misc/whiteboarding/whiteboarding-problems,5,0,0,"00:00, 1 Jan, 1970",0,0%,0,0,0%,0,0,0,1,HTTP Header Redirect ,https://goofy-euclid-1cd736.netlify.app/2-content/core-content/data-structures/html-only/ds-and-algorithms-prac/ds-n-algos/misc/whiteboarding/whiteboarding-problems
https://goofy-euclid-1cd736.netlify.app/2-content/core-content/Data-Structures/HTML-only/DS-and-Algorithms-Prac/DS-n-Algos/POJOs/utils.html,2-content/core-content/Data-Structures/HTML-only/DS-and-Algorithms-Prac/DS-n-Algos/POJOs/utils.html,https://goofy-euclid-1cd736.netlify.app/2-content/core-content/data-structures/html-only/ds-and-algorithms-prac/ds-n-algos/pojos/utils,5,0,0,"00:00, 1 Jan, 1970",0,0%,0,0,0%,0,0,0,1,HTTP Header Redirect ,https://goofy-euclid-1cd736.netlify.app/2-content/core-content/data-structures/html-only/ds-and-algorithms-prac/ds-n-algos/pojos/utils
https://goofy-euclid-1cd736.netlify.app/2-content/core-content/Data-Structures/HTML-only/DS-and-Algorithms-Prac/DS-n-Algos/async/index.html,2-content/core-content/Data-Structures/HTML-only/DS-and-Algorithms-Prac/DS-n-Algos/async/index.html,https://goofy-euclid-1cd736.netlify.app/2-content/core-content/data-structures/html-only/ds-and-algorithms-prac/ds-n-algos/async/,5,0,0,"00:00, 1 Jan, 1970",0,0%,0,0,0%,0,0,0,1,HTTP Header Redirect ,https://goofy-euclid-1cd736.netlify.app/2-content/core-content/data-structures/html-only/ds-and-algorithms-prac/ds-n-algos/async/
https://goofy-euclid-1cd736.netlify.app/2-content/core-content/Data-Structures/HTML-only/DS-and-Algorithms-Prac/DS-n-Algos/functions/MemoizeFunc/advanced-memoize.html,2-content/core-content/Data-Structures/HTML-only/DS-and-Algorithms-Prac/DS-n-Algos/functions/MemoizeFunc/advanced-memoize.html,https://goofy-euclid-1cd736.netlify.app/2-content/core-content/data-structures/html-only/ds-and-algorithms-prac/ds-n-algos/functions/memoizefunc/advanced-memoize,5,0,0,"00:00, 1 Jan, 1970",0,0%,0,0,0%,0,0,0,1,HTTP Header Redirect ,https://goofy-euclid-1cd736.netlify.app/2-content/core-content/data-structures/html-only/ds-and-algorithms-prac/ds-n-algos/functions/memoizefunc/advanced-memoize
https://goofy-euclid-1cd736.netlify.app/2-content/core-content/Data-Structures/HTML-only/DS-and-Algorithms-Prac/DS-n-Algos/functions/bindTo/function.apply().html,2-content/core-content/Data-Structures/HTML-only/DS-and-Algorithms-Prac/DS-n-Algos/functions/bindTo/function.apply().html,https://goofy-euclid-1cd736.netlify.app/2-content/core-content/data-structures/html-only/ds-and-algorithms-prac/ds-n-algos/functions/bindto/function.apply(),5,0,0,"00:00, 1 Jan, 1970",0,0%,0,0,0%,0,0,0,1,HTTP Header Redirect ,https://goofy-euclid-1cd736.netlify.app/2-content/core-content/data-structures/html-only/ds-and-algorithms-prac/ds-n-algos/functions/bindto/function.apply()
https://goofy-euclid-1cd736.netlify.app/2-content/core-content/Data-Structures/HTML-only/DS-and-Algorithms-Prac/DS-n-Algos/functions/bindTo/function.bind().html,2-content/core-content/Data-Structures/HTML-only/DS-and-Algorithms-Prac/DS-n-Algos/functions/bindTo/function.bind().html,https://goofy-euclid-1cd736.netlify.app/2-content/core-content/data-structures/html-only/ds-and-algorithms-prac/ds-n-algos/functions/bindto/function.bind(),5,0,0,"00:00, 1 Jan, 1970",0,0%,0,0,0%,0,0,0,1,HTTP Header Redirect ,https://goofy-euclid-1cd736.netlify.app/2-content/core-content/data-structures/html-only/ds-and-algorithms-prac/ds-n-algos/functions/bindto/function.bind()
https://goofy-euclid-1cd736.netlify.app/2-content/core-content/Data-Structures/HTML-only/DS-and-Algorithms-Prac/DS-n-Algos/java-data-structure-examples/actual-java-code/strings/all-unique/notes.html,2-content/core-content/Data-Structures/HTML-only/DS-and-Algorithms-Prac/DS-n-Algos/java-data-structure-examples/actual-java-code/strings/all-unique/notes.html,https://goofy-euclid-1cd736.netlify.app/2-content/core-content/data-structures/html-only/ds-and-algorithms-prac/ds-n-algos/java-data-structure-examples/actual-java-code/strings/all-unique/notes,5,0,0,"00:00, 1 Jan, 1970",0,0%,0,0,0%,0,0,0,1,HTTP Header Redirect ,https://goofy-euclid-1cd736.netlify.app/2-content/core-content/data-structures/html-only/ds-and-algorithms-prac/ds-n-algos/java-data-structure-examples/actual-java-code/strings/all-unique/notes
https://goofy-euclid-1cd736.netlify.app/2-content/core-content/Data-Structures/HTML-only/DS-and-Algorithms-Prac/DS-n-Algos/java-data-structure-examples/actual-java-code/strings/anagrams/notes.html,2-content/core-content/Data-Structures/HTML-only/DS-and-Algorithms-Prac/DS-n-Algos/java-data-structure-examples/actual-java-code/strings/anagrams/notes.html,https://goofy-euclid-1cd736.netlify.app/2-content/core-content/data-structures/html-only/ds-and-algorithms-prac/ds-n-algos/java-data-structure-examples/actual-java-code/strings/anagrams/notes,5,0,0,"00:00, 1 Jan, 1970",0,0%,0,0,0%,0,0,0,1,HTTP Header Redirect ,https://goofy-euclid-1cd736.netlify.app/2-content/core-content/data-structures/html-only/ds-and-algorithms-prac/ds-n-algos/java-data-structure-examples/actual-java-code/strings/anagrams/notes
https://goofy-euclid-1cd736.netlify.app/2-content/core-content/Data-Structures/HTML-only/DS-and-Algorithms-Prac/DS-n-Algos/java-data-structure-examples/actual-java-code/strings/count-words/notes.html,2-content/core-content/Data-Structures/HTML-only/DS-and-Algorithms-Prac/DS-n-Algos/java-data-structure-examples/actual-java-code/strings/count-words/notes.html,https://goofy-euclid-1cd736.netlify.app/2-content/core-content/data-structures/html-only/ds-and-algorithms-prac/ds-n-algos/java-data-structure-examples/actual-java-code/strings/count-words/notes,5,0,0,"00:00, 1 Jan, 1970",0,0%,0,0,0%,0,0,0,1,HTTP Header Redirect ,https://goofy-euclid-1cd736.netlify.app/2-content/core-content/data-structures/html-only/ds-and-algorithms-prac/ds-n-algos/java-data-structure-examples/actual-java-code/strings/count-words/notes
https://goofy-euclid-1cd736.netlify.app/2-content/core-content/Data-Structures/HTML-only/DS-and-Algorithms-Prac/DS-n-Algos/java-data-structure-examples/actual-java-code/strings/longest-uniform-substring/notes.html,2-content/core-content/Data-Structures/HTML-only/DS-and-Algorithms-Prac/DS-n-Algos/java-data-structure-examples/actual-java-code/strings/longest-uniform-substring/notes.html,https://goofy-euclid-1cd736.netlify.app/2-content/core-content/data-structures/html-only/ds-and-algorithms-prac/ds-n-algos/java-data-structure-examples/actual-java-code/strings/longest-uniform-substring/notes,5,0,0,"00:00, 1 Jan, 1970",0,0%,0,0,0%,0,0,0,1,HTTP Header Redirect ,https://goofy-euclid-1cd736.netlify.app/2-content/core-content/data-structures/html-only/ds-and-algorithms-prac/ds-n-algos/java-data-structure-examples/actual-java-code/strings/longest-uniform-substring/notes
https://goofy-euclid-1cd736.netlify.app/2-content/core-content/Data-Structures/HTML-only/DS-and-Algorithms-Prac/DS-n-Algos/java-data-structure-examples/actual-java-code/strings/palindrome/notes.html,2-content/core-content/Data-Structures/HTML-only/DS-and-Algorithms-Prac/DS-n-Algos/java-data-structure-examples/actual-java-code/strings/palindrome/notes.html,https://goofy-euclid-1cd736.netlify.app/2-content/core-content/data-structures/html-only/ds-and-algorithms-prac/ds-n-algos/java-data-structure-examples/actual-java-code/strings/palindrome/notes,5,0,0,"00:00, 1 Jan, 1970",0,0%,0,0,0%,0,0,0,1,HTTP Header Redirect ,https://goofy-euclid-1cd736.netlify.app/2-content/core-content/data-structures/html-only/ds-and-algorithms-prac/ds-n-algos/java-data-structure-examples/actual-java-code/strings/palindrome/notes
https://goofy-euclid-1cd736.netlify.app/2-content/core-content/Data-Structures/HTML-only/DS-and-Algorithms-Prac/DS-n-Algos/java-data-structure-examples/actual-java-code/strings/reverse-strings/notes.html,2-content/core-content/Data-Structures/HTML-only/DS-and-Algorithms-Prac/DS-n-Algos/java-data-structure-examples/actual-java-code/strings/reverse-strings/notes.html,https://goofy-euclid-1cd736.netlify.app/2-content/core-content/data-structures/html-only/ds-and-algorithms-prac/ds-n-algos/java-data-structure-examples/actual-java-code/strings/reverse-strings/notes,5,0,0,"00:00, 1 Jan, 1970",0,0%,0,0,0%,0,0,0,1,HTTP Header Redirect ,https://goofy-euclid-1cd736.netlify.app/2-content/core-content/data-structures/html-only/ds-and-algorithms-prac/ds-n-algos/java-data-structure-examples/actual-java-code/strings/reverse-strings/notes
https://goofy-euclid-1cd736.netlify.app/2-content/core-content/Data-Structures/HTML-only/DS-and-Algorithms-Prac/DS-n-Algos/java-data-structure-examples/actual-java-code/strings/rotate/notes.html,2-content/core-content/Data-Structures/HTML-only/DS-and-Algorithms-Prac/DS-n-Algos/java-data-structure-examples/actual-java-code/strings/rotate/notes.html,https://goofy-euclid-1cd736.netlify.app/2-content/core-content/data-structures/html-only/ds-and-algorithms-prac/ds-n-algos/java-data-structure-examples/actual-java-code/strings/rotate/notes,5,0,0,"00:00, 1 Jan, 1970",0,0%,0,0,0%,0,0,0,1,HTTP Header Redirect ,https://goofy-euclid-1cd736.netlify.app/2-content/core-content/data-structures/html-only/ds-and-algorithms-prac/ds-n-algos/java-data-structure-examples/actual-java-code/strings/rotate/notes
https://goofy-euclid-1cd736.netlify.app/2-content/core-content/Data-Structures/HTML-only/DS-and-Algorithms-Prac/DS-n-Algos/java-data-structure-examples/actual-java-code/strings/word-distance/notes.html,2-content/core-content/Data-Structures/HTML-only/DS-and-Algorithms-Prac/DS-n-Algos/java-data-structure-examples/actual-java-code/strings/word-distance/notes.html,https://goofy-euclid-1cd736.netlify.app/2-content/core-content/data-structures/html-only/ds-and-algorithms-prac/ds-n-algos/java-data-structure-examples/actual-java-code/strings/word-distance/notes,5,0,0,"00:00, 1 Jan, 1970",0,0%,0,0,0%,0,0,0,1,HTTP Header Redirect ,https://goofy-euclid-1cd736.netlify.app/2-content/core-content/data-structures/html-only/ds-and-algorithms-prac/ds-n-algos/java-data-structure-examples/actual-java-code/strings/word-distance/notes
https://goofy-euclid-1cd736.netlify.app/2-content/core-content/Data-Structures/HTML-only/DS-and-Algorithms-Prac/DS-n-Algos/java-data-structure-examples/java-data-structures/DP+Problems.doc.html,2-content/core-content/Data-Structures/HTML-only/DS-and-Algorithms-Prac/DS-n-Algos/java-data-structure-examples/java-data-structures/DP+Problems.doc.html,,5,0,0,"00:00, 1 Jan, 1970",0,0%,0,0,0%,0,0,0,1,The character set of this page was not recognized.,
https://goofy-euclid-1cd736.netlify.app/2-content/core-content/Data-Structures/HTML-only/DS-and-Algorithms-Prac/DS-n-Algos/java-data-structure-examples/java-data-structures/Graph+Problems.doc.html,2-content/core-content/Data-Structures/HTML-only/DS-and-Algorithms-Prac/DS-n-Algos/java-data-structure-examples/java-data-structures/Graph+Problems.doc.html,,5,0,0,"00:00, 1 Jan, 1970",0,0%,0,0,0%,0,0,0,1,The character set of this page was not recognized.,
https://goofy-euclid-1cd736.netlify.app/2-content/core-content/Data-Structures/HTML-only/DS-and-Algorithms-Prac/DS-n-Algos/java-data-structure-examples/java-data-structures/List+Problems.doc.html,2-content/core-content/Data-Structures/HTML-only/DS-and-Algorithms-Prac/DS-n-Algos/java-data-structure-examples/java-data-structures/List+Problems.doc.html,,5,0,0,"00:00, 1 Jan, 1970",0,0%,0,0,0%,0,0,0,1,The character set of this page was not recognized.,
https://goofy-euclid-1cd736.netlify.app/2-content/core-content/Data-Structures/HTML-only/DS-and-Algorithms-Prac/DS-n-Algos/java-data-structure-examples/java-data-structures/Map+Problems.doc.html,2-content/core-content/Data-Structures/HTML-only/DS-and-Algorithms-Prac/DS-n-Algos/java-data-structure-examples/java-data-structures/Map+Problems.doc.html,,5,0,0,"00:00, 1 Jan, 1970",0,0%,0,0,0%,0,0,0,1,The character set of this page was not recognized.,
https://goofy-euclid-1cd736.netlify.app/2-content/core-content/Data-Structures/HTML-only/DS-and-Algorithms-Prac/DS-n-Algos/java-data-structure-examples/java-data-structures/Strings+Problems.doc.html,2-content/core-content/Data-Structures/HTML-only/DS-and-Algorithms-Prac/DS-n-Algos/java-data-structure-examples/java-data-structures/Strings+Problems.doc.html,,5,0,0,"00:00, 1 Jan, 1970",0,0%,0,0,0%,0,0,0,1,The character set of this page was not recognized.,
https://goofy-euclid-1cd736.netlify.app/2-content/core-content/Data-Structures/HTML-only/DS-and-Algorithms-Prac/DS-n-Algos/web-dev/listenForEvent-s/DOMEventHandlers.html,2-content/core-content/Data-Structures/HTML-only/DS-and-Algorithms-Prac/DS-n-Algos/web-dev/listenForEvent-s/DOMEventHandlers.html,https://goofy-euclid-1cd736.netlify.app/2-content/core-content/data-structures/html-only/ds-and-algorithms-prac/ds-n-algos/web-dev/listenforevent-s/domeventhandlers,5,0,0,"00:00, 1 Jan, 1970",0,0%,0,0,0%,0,0,0,1,HTTP Header Redirect ,https://goofy-euclid-1cd736.netlify.app/2-content/core-content/data-structures/html-only/ds-and-algorithms-prac/ds-n-algos/web-dev/listenforevent-s/domeventhandlers
https://goofy-euclid-1cd736.netlify.app/2-content/core-content/Data-Structures/HTML-only/DS-and-Algorithms-Prac/DS-n-Algos/z-NOTES/async_await/index.html,2-content/core-content/Data-Structures/HTML-only/DS-and-Algorithms-Prac/DS-n-Algos/z-NOTES/async_await/index.html,https://goofy-euclid-1cd736.netlify.app/2-content/core-content/data-structures/html-only/ds-and-algorithms-prac/ds-n-algos/z-notes/async_await/,5,0,0,"00:00, 1 Jan, 1970",0,0%,0,0,0%,0,0,0,1,HTTP Header Redirect ,https://goofy-euclid-1cd736.netlify.app/2-content/core-content/data-structures/html-only/ds-and-algorithms-prac/ds-n-algos/z-notes/async_await/
https://goofy-euclid-1cd736.netlify.app/2-content/core-content/Data-Structures/HTML-only/DS-and-Algorithms-Prac/DS-n-Algos/z-NOTES/choosing_the_right_approach/index.html,2-content/core-content/Data-Structures/HTML-only/DS-and-Algorithms-Prac/DS-n-Algos/z-NOTES/choosing_the_right_approach/index.html,https://goofy-euclid-1cd736.netlify.app/2-content/core-content/data-structures/html-only/ds-and-algorithms-prac/ds-n-algos/z-notes/choosing_the_right_approach/,5,0,0,"00:00, 1 Jan, 1970",0,0%,0,0,0%,0,0,0,1,HTTP Header Redirect ,https://goofy-euclid-1cd736.netlify.app/2-content/core-content/data-structures/html-only/ds-and-algorithms-prac/ds-n-algos/z-notes/choosing_the_right_approach/
https://goofy-euclid-1cd736.netlify.app/2-content/core-content/Data-Structures/HTML-only/DS-and-Algorithms-Prac/Resources/My-Data-Structures-Notes/My-ds-notes.html,2-content/core-content/Data-Structures/HTML-only/DS-and-Algorithms-Prac/Resources/My-Data-Structures-Notes/My-ds-notes.html,https://goofy-euclid-1cd736.netlify.app/2-content/core-content/data-structures/html-only/ds-and-algorithms-prac/resources/my-data-structures-notes/my-ds-notes,5,0,0,"00:00, 1 Jan, 1970",0,0%,0,0,0%,0,0,0,1,HTTP Header Redirect ,https://goofy-euclid-1cd736.netlify.app/2-content/core-content/data-structures/html-only/ds-and-algorithms-prac/resources/my-data-structures-notes/my-ds-notes
https://goofy-euclid-1cd736.netlify.app/2-content/core-content/Data-Structures/HTML-only/DS-and-Algorithms-Prac/Resources/_Articles/algorithmic-thinking/TheLongestPalindromicSubstring.html,2-content/core-content/Data-Structures/HTML-only/DS-and-Algorithms-Prac/Resources/_Articles/algorithmic-thinking/TheLongestPalindromicSubstring.html,https://goofy-euclid-1cd736.netlify.app/2-content/core-content/data-structures/html-only/ds-and-algorithms-prac/resources/_articles/algorithmic-thinking/thelongestpalindromicsubstring,5,0,0,"00:00, 1 Jan, 1970",0,0%,0,0,0%,0,0,0,1,HTTP Header Redirect ,https://goofy-euclid-1cd736.netlify.app/2-content/core-content/data-structures/html-only/ds-and-algorithms-prac/resources/_articles/algorithmic-thinking/thelongestpalindromicsubstring
https://goofy-euclid-1cd736.netlify.app/2-content/core-content/Data-Structures/HTML-only/DS-and-Algorithms-Prac/Resources/_Articles/algorithmic-thinking/Trapping_Rain_Water.html,2-content/core-content/Data-Structures/HTML-only/DS-and-Algorithms-Prac/Resources/_Articles/algorithmic-thinking/Trapping_Rain_Water.html,https://goofy-euclid-1cd736.netlify.app/2-content/core-content/data-structures/html-only/ds-and-algorithms-prac/resources/_articles/algorithmic-thinking/trapping_rain_water,5,0,0,"00:00, 1 Jan, 1970",0,0%,0,0,0%,0,0,0,1,HTTP Header Redirect ,https://goofy-euclid-1cd736.netlify.app/2-content/core-content/data-structures/html-only/ds-and-algorithms-prac/resources/_articles/algorithmic-thinking/trapping_rain_water
https://goofy-euclid-1cd736.netlify.app/2-content/core-content/Data-Structures/HTML-only/DS-and-Algorithms-Prac/Resources/_Articles/algorithmic-thinking/check_palindromic_linkedlist.html,2-content/core-content/Data-Structures/HTML-only/DS-and-Algorithms-Prac/Resources/_Articles/algorithmic-thinking/check_palindromic_linkedlist.html,https://goofy-euclid-1cd736.netlify.app/2-content/core-content/data-structures/html-only/ds-and-algorithms-prac/resources/_articles/algorithmic-thinking/check_palindromic_linkedlist,5,0,0,"00:00, 1 Jan, 1970",0,0%,0,0,0%,0,0,0,1,HTTP Header Redirect ,https://goofy-euclid-1cd736.netlify.app/2-content/core-content/data-structures/html-only/ds-and-algorithms-prac/resources/_articles/algorithmic-thinking/check_palindromic_linkedlist
https://goofy-euclid-1cd736.netlify.app/2-content/core-content/Data-Structures/HTML-only/DS-and-Algorithms-Prac/Resources/_Articles/algorithmic-thinking/findSebesquenceWithBinarySearch.html,2-content/core-content/Data-Structures/HTML-only/DS-and-Algorithms-Prac/Resources/_Articles/algorithmic-thinking/findSebesquenceWithBinarySearch.html,https://goofy-euclid-1cd736.netlify.app/2-content/core-content/data-structures/html-only/ds-and-algorithms-prac/resources/_articles/algorithmic-thinking/findsebesquencewithbinarysearch,5,0,0,"00:00, 1 Jan, 1970",0,0%,0,0,0%,0,0,0,1,HTTP Header Redirect ,https://goofy-euclid-1cd736.netlify.app/2-content/core-content/data-structures/html-only/ds-and-algorithms-prac/resources/_articles/algorithmic-thinking/findsebesquencewithbinarysearch
https://goofy-euclid-1cd736.netlify.app/2-content/core-content/Data-Structures/HTML-only/DS-and-Algorithms-Prac/Resources/_Articles/algorithmic-thinking/missing_elements.html,2-content/core-content/Data-Structures/HTML-only/DS-and-Algorithms-Prac/Resources/_Articles/algorithmic-thinking/missing_elements.html,https://goofy-euclid-1cd736.netlify.app/2-content/core-content/data-structures/html-only/ds-and-algorithms-prac/resources/_articles/algorithmic-thinking/missing_elements,5,0,0,"00:00, 1 Jan, 1970",0,0%,0,0,0%,0,0,0,1,HTTP Header Redirect ,https://goofy-euclid-1cd736.netlify.app/2-content/core-content/data-structures/html-only/ds-and-algorithms-prac/resources/_articles/algorithmic-thinking/missing_elements
https://goofy-euclid-1cd736.netlify.app/2-content/core-content/Data-Structures/HTML-only/DS-and-Algorithms-Prac/Resources/_Articles/data-structures/deque.html,2-content/core-content/Data-Structures/HTML-only/DS-and-Algorithms-Prac/Resources/_Articles/data-structures/deque.html,https://goofy-euclid-1cd736.netlify.app/2-content/core-content/data-structures/html-only/ds-and-algorithms-prac/resources/_articles/data-structures/deque,5,0,0,"00:00, 1 Jan, 1970",0,0%,0,0,0%,0,0,0,1,HTTP Header Redirect ,https://goofy-euclid-1cd736.netlify.app/2-content/core-content/data-structures/html-only/ds-and-algorithms-prac/resources/_articles/data-structures/deque
https://goofy-euclid-1cd736.netlify.app/2-content/core-content/Data-Structures/HTML-only/DS-and-Algorithms-Prac/Resources/_Articles/data-structures/trees.html,2-content/core-content/Data-Structures/HTML-only/DS-and-Algorithms-Prac/Resources/_Articles/data-structures/trees.html,https://goofy-euclid-1cd736.netlify.app/2-content/core-content/data-structures/html-only/ds-and-algorithms-prac/resources/_articles/data-structures/trees,5,0,0,"00:00, 1 Jan, 1970",0,0%,0,0,0%,0,0,0,1,HTTP Header Redirect ,https://goofy-euclid-1cd736.netlify.app/2-content/core-content/data-structures/html-only/ds-and-algorithms-prac/resources/_articles/data-structures/trees
https://goofy-euclid-1cd736.netlify.app/2-content/core-content/Data-Structures/HTML-only/DS-and-Algorithms-Prac/Resources/_Articles/dynamic_programming/AnalysisOfDynamicProgramming.html,2-content/core-content/Data-Structures/HTML-only/DS-and-Algorithms-Prac/Resources/_Articles/dynamic_programming/AnalysisOfDynamicProgramming.html,https://goofy-euclid-1cd736.netlify.app/2-content/core-content/data-structures/html-only/ds-and-algorithms-prac/resources/_articles/dynamic_programming/analysisofdynamicprogramming,5,0,0,"00:00, 1 Jan, 1970",0,0%,0,0,0%,0,0,0,1,HTTP Header Redirect ,https://goofy-euclid-1cd736.netlify.app/2-content/core-content/data-structures/html-only/ds-and-algorithms-prac/resources/_articles/dynamic_programming/analysisofdynamicprogramming
https://goofy-euclid-1cd736.netlify.app/2-content/core-content/Data-Structures/HTML-only/DS-and-Algorithms-Prac/Resources/_Articles/dynamic_programming/FourKeysKeyboard.html,2-content/core-content/Data-Structures/HTML-only/DS-and-Algorithms-Prac/Resources/_Articles/dynamic_programming/FourKeysKeyboard.html,https://goofy-euclid-1cd736.netlify.app/2-content/core-content/data-structures/html-only/ds-and-algorithms-prac/resources/_articles/dynamic_programming/fourkeyskeyboard,5,0,0,"00:00, 1 Jan, 1970",0,0%,0,0,0%,0,0,0,1,HTTP Header Redirect ,https://goofy-euclid-1cd736.netlify.app/2-content/core-content/data-structures/html-only/ds-and-algorithms-prac/resources/_articles/dynamic_programming/fourkeyskeyboard
https://goofy-euclid-1cd736.netlify.app/2-content/core-content/Data-Structures/_0-JS/ds-book/examples/chapter01_02/02-Variables.html,2-content/core-content/Data-Structures/_0-JS/ds-book/examples/chapter01_02/02-Variables.html,https://goofy-euclid-1cd736.netlify.app/2-content/core-content/data-structures/_0-js/ds-book/examples/chapter01_02/02-variables,5,0,0,"00:00, 1 Jan, 1970",0,0%,0,0,0%,0,0,0,1,HTTP Header Redirect ,https://goofy-euclid-1cd736.netlify.app/2-content/core-content/data-structures/_0-js/ds-book/examples/chapter01_02/02-variables
https://goofy-euclid-1cd736.netlify.app/2-content/core-content/Data-Structures/_0-JS/ds-book/examples/chapter01_02/03-Operators.html,2-content/core-content/Data-Structures/_0-JS/ds-book/examples/chapter01_02/03-Operators.html,https://goofy-euclid-1cd736.netlify.app/2-content/core-content/data-structures/_0-js/ds-book/examples/chapter01_02/03-operators,5,0,0,"00:00, 1 Jan, 1970",0,0%,0,0,0%,0,0,0,1,HTTP Header Redirect ,https://goofy-euclid-1cd736.netlify.app/2-content/core-content/data-structures/_0-js/ds-book/examples/chapter01_02/03-operators
https://goofy-euclid-1cd736.netlify.app/2-content/core-content/Data-Structures/_0-JS/ds-book/examples/chapter01_02/11-ES2015-ES6-variableScope.html,2-content/core-content/Data-Structures/_0-JS/ds-book/examples/chapter01_02/11-ES2015-ES6-variableScope.html,https://goofy-euclid-1cd736.netlify.app/2-content/core-content/data-structures/_0-js/ds-book/examples/chapter01_02/11-es2015-es6-variablescope,5,0,0,"00:00, 1 Jan, 1970",0,0%,0,0,0%,0,0,0,1,HTTP Header Redirect ,https://goofy-euclid-1cd736.netlify.app/2-content/core-content/data-structures/_0-js/ds-book/examples/chapter01_02/11-es2015-es6-variablescope
https://goofy-euclid-1cd736.netlify.app/2-content/core-content/Data-Structures/_0-JS/ds-book/examples/chapter01_02/12-ES2015-ES6-StringTemplates.html,2-content/core-content/Data-Structures/_0-JS/ds-book/examples/chapter01_02/12-ES2015-ES6-StringTemplates.html,https://goofy-euclid-1cd736.netlify.app/2-content/core-content/data-structures/_0-js/ds-book/examples/chapter01_02/12-es2015-es6-stringtemplates,5,0,0,"00:00, 1 Jan, 1970",0,0%,0,0,0%,0,0,0,1,HTTP Header Redirect ,https://goofy-euclid-1cd736.netlify.app/2-content/core-content/data-structures/_0-js/ds-book/examples/chapter01_02/12-es2015-es6-stringtemplates
https://goofy-euclid-1cd736.netlify.app/2-content/core-content/Data-Structures/_0-JS/ds-book/examples/chapter13/01-RadixSort.html,2-content/core-content/Data-Structures/_0-JS/ds-book/examples/chapter13/01-RadixSort.html,https://goofy-euclid-1cd736.netlify.app/2-content/core-content/data-structures/_0-js/ds-book/examples/chapter13/01-radixsort,5,0,0,"00:00, 1 Jan, 1970",0,0%,0,0,0%,0,0,0,1,HTTP Header Redirect ,https://goofy-euclid-1cd736.netlify.app/2-content/core-content/data-structures/_0-js/ds-book/examples/chapter13/01-radixsort
https://goofy-euclid-1cd736.netlify.app/2-content/core-content/Data-Structures/_0-JS/ds-book/examples/chapter14/01-DC-BinarySearch.html,2-content/core-content/Data-Structures/_0-JS/ds-book/examples/chapter14/01-DC-BinarySearch.html,https://goofy-euclid-1cd736.netlify.app/2-content/core-content/data-structures/_0-js/ds-book/examples/chapter14/01-dc-binarysearch,5,0,0,"00:00, 1 Jan, 1970",0,0%,0,0,0%,0,0,0,1,HTTP Header Redirect ,https://goofy-euclid-1cd736.netlify.app/2-content/core-content/data-structures/_0-js/ds-book/examples/chapter14/01-dc-binarysearch
https://goofy-euclid-1cd736.netlify.app/2-content/core-content/USEFUL/blog-posts/PUBLIC/docs/HTMLAudioElement.html,2-content/core-content/USEFUL/blog-posts/PUBLIC/docs/HTMLAudioElement.html,https://goofy-euclid-1cd736.netlify.app/2-content/core-content/useful/blog-posts/public/docs/htmlaudioelement,5,0,0,"00:00, 1 Jan, 1970",0,0%,0,0,0%,0,0,0,1,HTTP Header Redirect ,https://goofy-euclid-1cd736.netlify.app/2-content/core-content/useful/blog-posts/public/docs/htmlaudioelement
https://goofy-euclid-1cd736.netlify.app/core-site/other-pages/blog-posts/Student-Profiles/Bryan Guner_LinkedIn.html,core-site/other-pages/blog-posts/Student-Profiles/Bryan Guner_LinkedIn.html,,0,0,0,"00:00, 1 Jan, 1970",0,0%,0,0,0%,0,0,0,1,Non-HTML - Siteliner can only analyze HTML web pages.,
https://goofy-euclid-1cd736.netlify.app/core-site/other-pages/blog-posts/0-projects/projects.html,core-site/other-pages/blog-posts/0-projects/projects.html,AA-Student-Projects,8,13,114,"03:17, 6 Feb, 2021",72,63%,2,72,63%,2,4,9,2,,
https://goofy-euclid-1cd736.netlify.app/Overflow\articles-to-base-topics-off-of\00-other-blog-site\_posts\POSTS.html,Overflow\articles-to-base-topics-off-of\00-other-blog-site\_posts\POSTS.html,,0,0,0,"00:00, 1 Jan, 1970",0,0%,0,0,0%,0,0,0,1,Error 404 - Not Found,
https://goofy-euclid-1cd736.netlify.app/core-site/video-log.html,core-site/video-log.html,Video-Log,6,7,80,"03:17, 6 Feb, 2021",10,13%,2,10,13%,2,0,3,1,,
https://goofy-euclid-1cd736.netlify.app/core-site/other-pages/blog-posts/blog/catagories/Blog-Posts/big-o.html,core-site/other-pages/blog-posts/blog/catagories/Blog-Posts/big-o.html,https://goofy-euclid-1cd736.netlify.app/core-site/other-pages/blog-posts/blog/catagories/blog-posts/big-o,6,0,0,"00:00, 1 Jan, 1970",0,0%,0,0,0%,0,0,0,1,HTTP Header Redirect ,https://goofy-euclid-1cd736.netlify.app/core-site/other-pages/blog-posts/blog/catagories/blog-posts/big-o
https://goofy-euclid-1cd736.netlify.app/core-site/other-pages/blog-posts/blog/catagories/Blog-Posts/data-structures.html,core-site/other-pages/blog-posts/blog/catagories/Blog-Posts/data-structures.html,https://goofy-euclid-1cd736.netlify.app/core-site/other-pages/blog-posts/blog/catagories/blog-posts/data-structures,6,0,0,"00:00, 1 Jan, 1970",0,0%,0,0,0%,0,0,0,1,HTTP Header Redirect ,https://goofy-euclid-1cd736.netlify.app/core-site/other-pages/blog-posts/blog/catagories/blog-posts/data-structures
https://goofy-euclid-1cd736.netlify.app/core-site/other-pages/blog-posts/blog/catagories/Blog-Posts/emmet.html,core-site/other-pages/blog-posts/blog/catagories/Blog-Posts/emmet.html,https://goofy-euclid-1cd736.netlify.app/core-site/other-pages/blog-posts/blog/catagories/blog-posts/emmet,6,0,0,"00:00, 1 Jan, 1970",0,0%,0,0,0%,0,0,0,1,HTTP Header Redirect ,https://goofy-euclid-1cd736.netlify.app/core-site/other-pages/blog-posts/blog/catagories/blog-posts/emmet
https://goofy-euclid-1cd736.netlify.app/core-site/other-pages/blog-posts/blog/catagories/Blog-Posts/express.html,core-site/other-pages/blog-posts/blog/catagories/Blog-Posts/express.html,https://goofy-euclid-1cd736.netlify.app/core-site/other-pages/blog-posts/blog/catagories/blog-posts/express,6,0,0,"00:00, 1 Jan, 1970",0,0%,0,0,0%,0,0,0,1,HTTP Header Redirect ,https://goofy-euclid-1cd736.netlify.app/core-site/other-pages/blog-posts/blog/catagories/blog-posts/express
https://goofy-euclid-1cd736.netlify.app/core-site/other-pages/blog-posts/blog/catagories/Blog-Posts/pug.html,core-site/other-pages/blog-posts/blog/catagories/Blog-Posts/pug.html,https://goofy-euclid-1cd736.netlify.app/core-site/other-pages/blog-posts/blog/catagories/blog-posts/pug,6,0,0,"00:00, 1 Jan, 1970",0,0%,0,0,0%,0,0,0,1,HTTP Header Redirect ,https://goofy-euclid-1cd736.netlify.app/core-site/other-pages/blog-posts/blog/catagories/blog-posts/pug
https://goofy-euclid-1cd736.netlify.app/core-site/other-pages/blog-posts/blog/catagories/Blog-Posts/regex.html,core-site/other-pages/blog-posts/blog/catagories/Blog-Posts/regex.html,https://goofy-euclid-1cd736.netlify.app/core-site/other-pages/blog-posts/blog/catagories/blog-posts/regex,6,0,0,"00:00, 1 Jan, 1970",0,0%,0,0,0%,0,0,0,1,HTTP Header Redirect ,https://goofy-euclid-1cd736.netlify.app/core-site/other-pages/blog-posts/blog/catagories/blog-posts/regex
https://goofy-euclid-1cd736.netlify.app/core-site/other-pages/blog-posts/blog/catagories/Blog-Posts/,core-site/other-pages/blog-posts/blog/catagories/Blog-Posts/,,0,0,0,"00:00, 1 Jan, 1970",0,0%,0,0,0%,0,0,0,2,Error 404 - Not Found,
https://goofy-euclid-1cd736.netlify.app/core-site/other-pages/documentation/Directory-Tree-Graph.html,core-site/other-pages/documentation/Directory-Tree-Graph.html,https://goofy-euclid-1cd736.netlify.app/core-site/other-pages/documentation/directory-tree-graph,6,0,0,"00:00, 1 Jan, 1970",0,0%,0,0,0%,0,0,0,1,HTTP Header Redirect ,https://goofy-euclid-1cd736.netlify.app/core-site/other-pages/documentation/directory-tree-graph
https://goofy-euclid-1cd736.netlify.app/core-site/other-pages/documentation/Force-Directed Crawl Diagram.html,core-site/other-pages/documentation/Force-Directed Crawl Diagram.html,,0,0,0,"00:00, 1 Jan, 1970",0,0%,0,0,0%,0,0,0,1,Non-HTML - Siteliner can only analyze HTML web pages.,
https://goofy-euclid-1cd736.netlify.app/core-site/other-pages/documentation/Force-Directed Directory Tree Diagram.html,core-site/other-pages/documentation/Force-Directed Directory Tree Diagram.html,,0,0,0,"00:00, 1 Jan, 1970",0,0%,0,0,0%,0,0,0,1,Non-HTML - Siteliner can only analyze HTML web pages.,
https://goofy-euclid-1cd736.netlify.app/core-site/other-pages/blog-posts/index.html,core-site/other-pages/blog-posts/index.html,,0,0,0,"00:00, 1 Jan, 1970",0,0%,0,0,0%,0,0,0,1,Error 404 - Not Found,
https://goofy-euclid-1cd736.netlify.app/core-site/other-pages/blog-posts/page-contact.html,core-site/other-pages/blog-posts/page-contact.html,,0,0,0,"00:00, 1 Jan, 1970",0,0%,0,0,0%,0,0,0,1,Error 404 - Not Found,
https://goofy-euclid-1cd736.netlify.app/core-site/other-pages/weeks/week-5/connect-4/index.html,core-site/other-pages/weeks/week-5/connect-4/index.html,App Academy Connect Four,7,4,2,"03:17, 6 Feb, 2021",0,0%,0,0,0%,0,0,0,1,,
https://goofy-euclid-1cd736.netlify.app/core-site/other-pages/blog-posts/0-projects/web-audio-recorder/index.html,core-site/other-pages/blog-posts/0-projects/web-audio-recorder/index.html,Simple Audio Recorder,7,2,19,"03:17, 6 Feb, 2021",0,0%,0,0,0%,1,0,1,1,,
https://goofy-euclid-1cd736.netlify.app/core-site/other-pages/blog-posts/0-projects/0-projects/DynamicTimeWarping-Audio-Triggered/dtw.html,core-site/other-pages/blog-posts/0-projects/0-projects/DynamicTimeWarping-Audio-Triggered/dtw.html,,0,0,0,"00:00, 1 Jan, 1970",0,0%,0,0,0%,0,0,0,1,Error 404 - Not Found,
https://goofy-euclid-1cd736.netlify.app/core-site/other-pages/blog-posts/0-projects/web-audio-api-ajax/dist/index.html,core-site/other-pages/blog-posts/0-projects/web-audio-api-ajax/dist/index.html,Web Audio API and Node.js,7,1,4,"03:17, 6 Feb, 2021",0,0%,0,0,0%,0,0,1,1,,
https://goofy-euclid-1cd736.netlify.app/core-site/other-pages/weeks/0-quiz/wk10-quiz.html,core-site/other-pages/weeks/0-quiz/wk10-quiz.html,QUIZ,5,74,"3,758","03:17, 6 Feb, 2021",6,0%,1,6,0%,1,0,1,1,,
https://goofy-euclid-1cd736.netlify.app/core-site/other-pages/weeks/week-10/Database+Primer.html,core-site/other-pages/weeks/week-10/Database+Primer.html,,5,0,0,"00:00, 1 Jan, 1970",0,0%,0,0,0%,0,0,0,1,The character set of this page was not recognized.,
https://goofy-euclid-1cd736.netlify.app/core-site/other-pages/blog-posts/blog/catagories/blog-posts/emmet,core-site/other-pages/blog-posts/blog/catagories/blog-posts/emmet,emmet,11,39,749,"03:17, 6 Feb, 2021",0,0%,0,0,0%,0,0,1,0,,
https://goofy-euclid-1cd736.netlify.app/core-site/other-pages/blog-posts/blog/catagories/blog-posts/pug,core-site/other-pages/blog-posts/blog/catagories/blog-posts/pug,pug,11,30,"1,427","03:17, 6 Feb, 2021",64,4%,1,64,4%,1,0,1,0,,
https://goofy-euclid-1cd736.netlify.app/core-site/other-pages/blog-posts/blog/catagories/blog-posts/big-o,core-site/other-pages/blog-posts/blog/catagories/blog-posts/big-o,big-O,11,78,"2,801","03:17, 6 Feb, 2021",141,5%,1,141,5%,1,0,1,0,,
https://goofy-euclid-1cd736.netlify.app/core-site/other-pages/blog-posts/blog/catagories/blog-posts/data-structures,core-site/other-pages/blog-posts/blog/catagories/blog-posts/data-structures,data-structures,11,147,"4,037","03:17, 6 Feb, 2021",626,16%,2,626,16%,2,0,1,0,,
https://goofy-euclid-1cd736.netlify.app/core-site/other-pages/blog-posts/blog/catagories/blog-posts/express,core-site/other-pages/blog-posts/blog/catagories/blog-posts/express,express,11,60,"3,093","03:17, 6 Feb, 2021",93,3%,2,93,3%,2,0,1,0,,
https://goofy-euclid-1cd736.netlify.app/core-site/other-pages/blog-posts/blog/catagories/blog-posts/regex,core-site/other-pages/blog-posts/blog/catagories/blog-posts/regex,regex,11,11,318,"03:17, 6 Feb, 2021",66,21%,2,66,21%,2,0,1,0,,
https://goofy-euclid-1cd736.netlify.app/core-site/other-pages/documentation/directory-tree-graph,core-site/other-pages/documentation/directory-tree-graph,,11,316,0,"03:17, 6 Feb, 2021",0,0%,0,0,0%,0,0,0,0,,
https://goofy-euclid-1cd736.netlify.app/2-content/core-content/data-structures/html-only/ds-and-algorithms-prac/ds-n-algos/java-data-structure-examples/actual-java-code/strings/all-unique/notes,2-content/core-content/data-structures/html-only/ds-and-algorithms-prac/ds-n-algos/java-data-structure-examples/actual-java-code/strings/all-unique/notes,,11,0,0,"03:17, 6 Feb, 2021",0,0%,0,0,0%,0,0,0,0,,
https://goofy-euclid-1cd736.netlify.app/2-content/core-content/data-structures/html-only/ds-and-algorithms-prac/ds-n-algos/java-data-structure-examples/actual-java-code/strings/word-distance/notes,2-content/core-content/data-structures/html-only/ds-and-algorithms-prac/ds-n-algos/java-data-structure-examples/actual-java-code/strings/word-distance/notes,,11,0,0,"03:17, 6 Feb, 2021",0,0%,0,0,0%,0,0,0,0,,
https://goofy-euclid-1cd736.netlify.app/2-content/core-content/data-structures/_0-js/ds-book/examples/chapter13/01-radixsort,2-content/core-content/data-structures/_0-js/ds-book/examples/chapter13/01-radixsort,,11,0,0,"03:17, 6 Feb, 2021",0,0%,0,0,0%,0,0,0,0,,
https://goofy-euclid-1cd736.netlify.app/0-assets/blog-styles/output/github/index.html,0-assets/blog-styles/output/github/index.html,,0,0,0,"00:00, 1 Jan, 1970",0,0%,0,0,0%,0,0,0,1,Error 404 - Not Found,
https://goofy-euclid-1cd736.netlify.app/0-assets/blog-styles/output/witex/index.html,0-assets/blog-styles/output/witex/index.html,,0,0,0,"00:00, 1 Jan, 1970",0,0%,0,0,0%,0,0,0,1,Error 404 - Not Found,
https://goofy-euclid-1cd736.netlify.app/2-content/core-content/data-structures/_0-js/ds-book/examples/chapter01_02/12-es2015-es6-stringtemplates,2-content/core-content/data-structures/_0-js/ds-book/examples/chapter01_02/12-es2015-es6-stringtemplates,,11,0,0,"03:17, 6 Feb, 2021",0,0%,0,0,0%,0,0,0,0,,
https://goofy-euclid-1cd736.netlify.app/0-assets/blog-styles/output/mixu-book/.html,0-assets/blog-styles/output/mixu-book/.html,https://goofy-euclid-1cd736.netlify.app/0-assets/blog-styles/output/mixu-book/,6,0,0,"00:00, 1 Jan, 1970",0,0%,0,0,0%,0,0,0,2,HTTP Header Redirect ,https://goofy-euclid-1cd736.netlify.app/0-assets/blog-styles/output/mixu-book/
https://goofy-euclid-1cd736.netlify.app/2-content/core-content/data-structures/_0-js/ds-book/examples/chapter01_02/02-variables,2-content/core-content/data-structures/_0-js/ds-book/examples/chapter01_02/02-variables,,11,0,0,"03:17, 6 Feb, 2021",0,0%,0,0,0%,0,0,0,0,,
https://goofy-euclid-1cd736.netlify.app/0-assets/blog-styles/output/mixu-book/,0-assets/blog-styles/output/mixu-book/,Strongly connected graph,12,15,"1,230","03:17, 6 Feb, 2021","1,230",100%,1,"1,230",100%,1,0,1,0,,
https://goofy-euclid-1cd736.netlify.app/core-site/git-repos/Data-Structures.html,core-site/git-repos/Data-Structures.html,https://goofy-euclid-1cd736.netlify.app/core-site/git-repos/data-structures,7,0,0,"00:00, 1 Jan, 1970",0,0%,0,0,0%,0,0,0,1,HTTP Header Redirect ,https://goofy-euclid-1cd736.netlify.app/core-site/git-repos/data-structures
https://goofy-euclid-1cd736.netlify.app/core-site/git-repos/sorting.html,core-site/git-repos/sorting.html,WEB_DEV_NOTES,7,1,3,"03:17, 6 Feb, 2021",0,0%,0,0,0%,0,0,0,1,,
https://goofy-euclid-1cd736.netlify.app/core-site/git-repos/web-dev-hub.html,core-site/git-repos/web-dev-hub.html,WEB_DEV_NOTES,7,1,3,"03:17, 6 Feb, 2021",0,0%,0,0,0%,0,0,0,1,,
https://goofy-euclid-1cd736.netlify.app/core-site/git-repos/web-dev-notes.html,core-site/git-repos/web-dev-notes.html,WEB_DEV_NOTES,7,1,3,"03:17, 6 Feb, 2021",0,0%,0,0,0%,0,0,0,1,,
https://goofy-euclid-1cd736.netlify.app/2-content/core-content/data-structures/html-only/ds-and-algorithms-prac/ds-n-algos/functions/bindto/function.bind(),2-content/core-content/data-structures/html-only/ds-and-algorithms-prac/ds-n-algos/functions/bindto/function.bind(),Page Title,11,21,"2,053","03:17, 6 Feb, 2021",329,16%,1,329,16%,1,0,0,0,,
https://goofy-euclid-1cd736.netlify.app/2-content/core-content/data-structures/html-only/ds-and-algorithms-prac/ds-n-algos/binary-search-trees/binary-search-tree/bst,2-content/core-content/data-structures/html-only/ds-and-algorithms-prac/ds-n-algos/binary-search-trees/binary-search-tree/bst,,11,12,433,"03:17, 6 Feb, 2021",19,4%,1,19,4%,1,0,0,0,,
https://goofy-euclid-1cd736.netlify.app/core-site/git-repos/data-structures,core-site/git-repos/data-structures,WEB_DEV_NOTES,12,1,3,"03:17, 6 Feb, 2021",0,0%,0,0,0%,0,0,0,0,,
https://goofy-euclid-1cd736.netlify.app/2-content/core-content/data-structures/html-only/ds-and-algorithms-prac/ds-n-algos/java-data-structure-examples/actual-java-code/strings/palindrome/notes,2-content/core-content/data-structures/html-only/ds-and-algorithms-prac/ds-n-algos/java-data-structure-examples/actual-java-code/strings/palindrome/notes,,11,0,0,"03:17, 6 Feb, 2021",0,0%,0,0,0%,0,0,0,0,,
https://goofy-euclid-1cd736.netlify.app/2-content/core-content/data-structures/_0-js/ds-book/examples/chapter01_02/11-es2015-es6-variablescope,2-content/core-content/data-structures/_0-js/ds-book/examples/chapter01_02/11-es2015-es6-variablescope,,11,0,0,"03:17, 6 Feb, 2021",0,0%,0,0,0%,0,0,0,0,,
https://goofy-euclid-1cd736.netlify.app/2-content/core-content/data-structures/html-only/ds-and-algorithms-prac/ds-n-algos/functions/memoizefunc/advanced-memoize,2-content/core-content/data-structures/html-only/ds-and-algorithms-prac/ds-n-algos/functions/memoizefunc/advanced-memoize,,11,7,339,"03:17, 6 Feb, 2021",0,0%,0,0,0%,0,0,0,0,,
https://goofy-euclid-1cd736.netlify.app/2-content/core-content/data-structures/html-only/ds-and-algorithms-prac/ds-n-algos/java-data-structure-examples/actual-java-code/strings/count-words/notes,2-content/core-content/data-structures/html-only/ds-and-algorithms-prac/ds-n-algos/java-data-structure-examples/actual-java-code/strings/count-words/notes,,11,0,0,"03:17, 6 Feb, 2021",0,0%,0,0,0%,0,0,0,0,,
https://goofy-euclid-1cd736.netlify.app/2-content/core-content/data-structures/html-only/ds-and-algorithms-prac/resources/my-data-structures-notes/my-ds-notes,2-content/core-content/data-structures/html-only/ds-and-algorithms-prac/resources/my-data-structures-notes/my-ds-notes,,11,246,"9,310","03:17, 6 Feb, 2021",124,1%,2,124,1%,2,0,0,0,,
https://goofy-euclid-1cd736.netlify.app/2-content/core-content/data-structures/html-only/ds-and-algorithms-prac/ds-n-algos/binary-trees/binary-tree-reading,2-content/core-content/data-structures/html-only/ds-and-algorithms-prac/ds-n-algos/binary-trees/binary-tree-reading,Page Title,11,33,"1,790","03:17, 6 Feb, 2021",607,34%,1,607,34%,1,0,0,0,,
https://goofy-euclid-1cd736.netlify.app/2-content/core-content/data-structures/html-only/ds-and-algorithms-prac/ds-n-algos/functions/bindto/function.apply(),2-content/core-content/data-structures/html-only/ds-and-algorithms-prac/ds-n-algos/functions/bindto/function.apply(),Page Title,11,18,"1,637","03:17, 6 Feb, 2021",329,20%,1,329,20%,1,0,0,0,,
https://goofy-euclid-1cd736.netlify.app/2-content/core-content/data-structures/html-only/ds-and-algorithms-prac/resources/_articles/algorithmic-thinking/missing_elements,2-content/core-content/data-structures/html-only/ds-and-algorithms-prac/resources/_articles/algorithmic-thinking/missing_elements,Page Title,11,7,726,"03:17, 6 Feb, 2021",14,2%,1,14,2%,1,0,0,0,,
https://goofy-euclid-1cd736.netlify.app/2-content/core-content/data-structures/html-only/ds-and-algorithms-prac/resources/_articles/algorithmic-thinking/findsebesquencewithbinarysearch,2-content/core-content/data-structures/html-only/ds-and-algorithms-prac/resources/_articles/algorithmic-thinking/findsebesquencewithbinarysearch,Page Title,11,10,833,"03:17, 6 Feb, 2021",14,2%,1,14,2%,1,2,2,0,,
https://goofy-euclid-1cd736.netlify.app/2-content/core-content/data-structures/html-only/ds-and-algorithms-prac/resources/_articles/dynamic_programming/动态规划设计：最长递增子序列.md,2-content/core-content/data-structures/html-only/ds-and-algorithms-prac/resources/_articles/dynamic_programming/动态规划设计：最长递增子序列.md,,0,0,0,"00:00, 1 Jan, 1970",0,0%,0,0,0%,0,0,0,1,Error 404 - Not Found,
https://goofy-euclid-1cd736.netlify.app/2-content/core-content/data-structures/html-only/ds-and-algorithms-prac/resources/_articles/think_like_computer/DetailedBinarySearch.md,2-content/core-content/data-structures/html-only/ds-and-algorithms-prac/resources/_articles/think_like_computer/DetailedBinarySearch.md,,0,0,0,"00:00, 1 Jan, 1970",0,0%,0,0,0%,0,0,0,1,Error 404 - Not Found,
https://goofy-euclid-1cd736.netlify.app/2-content/core-content/data-structures/html-only/ds-and-algorithms-prac/ds-n-algos/arrays/flatten/flatten2,2-content/core-content/data-structures/html-only/ds-and-algorithms-prac/ds-n-algos/arrays/flatten/flatten2,,11,3,130,"03:17, 6 Feb, 2021",0,0%,0,16,12%,3,0,0,0,,
https://goofy-euclid-1cd736.netlify.app/2-content/core-content/data-structures/html-only/ds-and-algorithms-prac/ds-n-algos/java-data-structure-examples/actual-java-code/strings/anagrams/notes,2-content/core-content/data-structures/html-only/ds-and-algorithms-prac/ds-n-algos/java-data-structure-examples/actual-java-code/strings/anagrams/notes,,11,0,0,"03:17, 6 Feb, 2021",0,0%,0,0,0%,0,0,0,0,,
https://goofy-euclid-1cd736.netlify.app/2-content/core-content/data-structures/html-only/ds-and-algorithms-prac/resources/_articles/data-structures/deque,2-content/core-content/data-structures/html-only/ds-and-algorithms-prac/resources/_articles/data-structures/deque,Page Title,11,6,568,"03:17, 6 Feb, 2021",45,8%,1,45,8%,1,9,9,0,,
https://goofy-euclid-1cd736.netlify.app/2-content/core-content/data-structures/html-only/ds-and-algorithms-prac/resources/_articles/algorithmic-thinking/trapping_rain_water,2-content/core-content/data-structures/html-only/ds-and-algorithms-prac/resources/_articles/algorithmic-thinking/trapping_rain_water,Page Title,11,14,"1,244","03:17, 6 Feb, 2021",47,4%,2,47,4%,2,0,0,0,,
https://goofy-euclid-1cd736.netlify.app/2-content/core-content/data-structures/html-only/ds-and-algorithms-prac/resources/_articles/algorithmic-thinking/thelongestpalindromicsubstring,2-content/core-content/data-structures/html-only/ds-and-algorithms-prac/resources/_articles/algorithmic-thinking/thelongestpalindromicsubstring,Page Title,11,8,657,"03:17, 6 Feb, 2021",26,4%,1,26,4%,1,0,0,0,,
https://goofy-euclid-1cd736.netlify.app/2-content/core-content/data-structures/html-only/ds-and-algorithms-prac/ds-n-algos/java-data-structure-examples/actual-java-code/strings/rotate/notes,2-content/core-content/data-structures/html-only/ds-and-algorithms-prac/ds-n-algos/java-data-structure-examples/actual-java-code/strings/rotate/notes,,11,0,0,"03:17, 6 Feb, 2021",0,0%,0,0,0%,0,0,0,0,,
https://goofy-euclid-1cd736.netlify.app/2-content/core-content/data-structures/html-only/ds-and-algorithms-prac/ds-n-algos/web-dev/listenforevent-s/domeventhandlers,2-content/core-content/data-structures/html-only/ds-and-algorithms-prac/ds-n-algos/web-dev/listenforevent-s/domeventhandlers,Page Title,11,14,"1,100","03:17, 6 Feb, 2021",0,0%,0,0,0%,0,0,0,0,,
https://goofy-euclid-1cd736.netlify.app/data-structures/intro-to-data-structures.md,data-structures/intro-to-data-structures.md,,0,0,0,"00:00, 1 Jan, 1970",0,0%,0,0,0%,0,0,0,2,Error 404 - Not Found,
https://goofy-euclid-1cd736.netlify.app/javascript/javascript-1-variables.md,javascript/javascript-1-variables.md,,0,0,0,"00:00, 1 Jan, 1970",0,0%,0,0,0%,0,0,0,2,Error 404 - Not Found,
https://goofy-euclid-1cd736.netlify.app/javascript/javascript-2-arrays-functions.md,javascript/javascript-2-arrays-functions.md,,0,0,0,"00:00, 1 Jan, 1970",0,0%,0,0,0%,0,0,0,2,Error 404 - Not Found,
https://goofy-euclid-1cd736.netlify.app/javascript/javascript-3-conditionals.md,javascript/javascript-3-conditionals.md,,0,0,0,"00:00, 1 Jan, 1970",0,0%,0,0,0%,0,0,0,2,Error 404 - Not Found,
https://goofy-euclid-1cd736.netlify.app/javascript/javascript-4-loops.md,javascript/javascript-4-loops.md,,0,0,0,"00:00, 1 Jan, 1970",0,0%,0,0,0%,0,0,0,2,Error 404 - Not Found,
https://goofy-euclid-1cd736.netlify.app/javascript/javascript-5-switch.md,javascript/javascript-5-switch.md,,0,0,0,"00:00, 1 Jan, 1970",0,0%,0,0,0%,0,0,0,2,Error 404 - Not Found,
https://goofy-euclid-1cd736.netlify.app/javascript/javascript-6-object-literals.md,javascript/javascript-6-object-literals.md,,0,0,0,"00:00, 1 Jan, 1970",0,0%,0,0,0%,0,0,0,2,Error 404 - Not Found,
https://goofy-euclid-1cd736.netlify.app/javascript/javascript-7-oop.md,javascript/javascript-7-oop.md,,0,0,0,"00:00, 1 Jan, 1970",0,0%,0,0,0%,0,0,0,2,Error 404 - Not Found,
https://goofy-euclid-1cd736.netlify.app/runtime-complexity/runtime-complexity.md,runtime-complexity/runtime-complexity.md,,0,0,0,"00:00, 1 Jan, 1970",0,0%,0,0,0%,0,0,0,2,Error 404 - Not Found,
https://goofy-euclid-1cd736.netlify.app/2-content/core-content/data-structures/html-only/ds-and-algorithms-prac/ds-n-algos/java-data-structure-examples/actual-java-code/strings/longest-uniform-substring/notes,2-content/core-content/data-structures/html-only/ds-and-algorithms-prac/ds-n-algos/java-data-structure-examples/actual-java-code/strings/longest-uniform-substring/notes,,11,0,0,"03:17, 6 Feb, 2021",0,0%,0,0,0%,0,0,0,0,,
https://goofy-euclid-1cd736.netlify.app/2-content/core-content/data-structures/html-only/ds-and-algorithms-prac/ds-n-algos/z-notes/choosing_the_right_approach/,2-content/core-content/data-structures/html-only/ds-and-algorithms-prac/ds-n-algos/z-notes/choosing_the_right_approach/,,11,25,"2,153","03:17, 6 Feb, 2021",325,15%,2,325,15%,2,17,17,0,,
https://goofy-euclid-1cd736.netlify.app/2-content/core-content/data-structures/html-only/ds-and-algorithms-prac/resources/_articles/dynamic_programming/analysisofdynamicprogramming,2-content/core-content/data-structures/html-only/ds-and-algorithms-prac/resources/_articles/dynamic_programming/analysisofdynamicprogramming,Page Title,11,30,"3,453","03:17, 6 Feb, 2021",46,1%,2,46,1%,2,0,0,0,,
https://goofy-euclid-1cd736.netlify.app/en-US/docs/Web/API/XMLHttpRequest,en-US/docs/Web/API/XMLHttpRequest,,0,0,0,"00:00, 1 Jan, 1970",0,0%,0,0,0%,0,0,0,1,Error 404 - Not Found,
https://goofy-euclid-1cd736.netlify.app/en-US/docs/Learn/JavaScript/Asynchronous/Introducing,en-US/docs/Learn/JavaScript/Asynchronous/Introducing,,0,0,0,"00:00, 1 Jan, 1970",0,0%,0,0,0%,0,0,0,3,Error 404 - Not Found,
https://goofy-euclid-1cd736.netlify.app/en-US/docs/Web/API/WindowOrWorkerGlobalScope/setTimeout,en-US/docs/Web/API/WindowOrWorkerGlobalScope/setTimeout,,0,0,0,"00:00, 1 Jan, 1970",0,0%,0,0,0%,0,0,0,2,Error 404 - Not Found,
https://goofy-euclid-1cd736.netlify.app/en-US/docs/Learn/JavaScript/Asynchronous/Timeouts_and_intervals,en-US/docs/Learn/JavaScript/Asynchronous/Timeouts_and_intervals,,0,0,0,"00:00, 1 Jan, 1970",0,0%,0,0,0%,0,0,0,2,Error 404 - Not Found,
https://goofy-euclid-1cd736.netlify.app/en-US/docs/Web/API/WindowOrWorkerGlobalScope/setInterval,en-US/docs/Web/API/WindowOrWorkerGlobalScope/setInterval,,0,0,0,"00:00, 1 Jan, 1970",0,0%,0,0,0%,0,0,0,1,Error 404 - Not Found,
https://goofy-euclid-1cd736.netlify.app/en-US/docs/Web/API/window/requestAnimationFrame,en-US/docs/Web/API/window/requestAnimationFrame,,0,0,0,"00:00, 1 Jan, 1970",0,0%,0,0,0%,0,0,0,1,Error 404 - Not Found,
https://goofy-euclid-1cd736.netlify.app/en-US/docs/Web/JavaScript/Reference/Global_Objects/Date,en-US/docs/Web/JavaScript/Reference/Global_Objects/Date,,0,0,0,"00:00, 1 Jan, 1970",0,0%,0,0,0%,0,0,0,1,Error 404 - Not Found,
https://goofy-euclid-1cd736.netlify.app/en-US/docs/Web/JavaScript/Reference/Global_Objects/Date/toLocaleTimeString,en-US/docs/Web/JavaScript/Reference/Global_Objects/Date/toLocaleTimeString,,0,0,0,"00:00, 1 Jan, 1970",0,0%,0,0,0%,0,0,0,1,Error 404 - Not Found,
https://goofy-euclid-1cd736.netlify.app/en-US/docs/Web/JavaScript/Reference/Global_Objects/Promise,en-US/docs/Web/JavaScript/Reference/Global_Objects/Promise,,0,0,0,"00:00, 1 Jan, 1970",0,0%,0,0,0%,0,0,0,2,Error 404 - Not Found,
https://goofy-euclid-1cd736.netlify.app/en-US/docs/Learn/JavaScript/Asynchronous/Promises,en-US/docs/Learn/JavaScript/Asynchronous/Promises,,0,0,0,"00:00, 1 Jan, 1970",0,0%,0,0,0%,0,0,0,3,Error 404 - Not Found,
https://goofy-euclid-1cd736.netlify.app/en-US/docs/Web/JavaScript/Guide/Using_promises,en-US/docs/Web/JavaScript/Guide/Using_promises,,0,0,0,"00:00, 1 Jan, 1970",0,0%,0,0,0%,0,0,0,1,Error 404 - Not Found,
https://goofy-euclid-1cd736.netlify.app/en-US/docs/Web/JavaScript/Reference/Global_Objects/Promise/all,en-US/docs/Web/JavaScript/Reference/Global_Objects/Promise/all,,0,0,0,"00:00, 1 Jan, 1970",0,0%,0,0,0%,0,0,0,2,Error 404 - Not Found,
https://goofy-euclid-1cd736.netlify.app/en-US/docs/Learn/JavaScript/Asynchronous/Async_await,en-US/docs/Learn/JavaScript/Asynchronous/Async_await,,0,0,0,"00:00, 1 Jan, 1970",0,0%,0,0,0%,0,0,0,3,Error 404 - Not Found,
https://goofy-euclid-1cd736.netlify.app/en-US/docs/Web/JavaScript/Reference/Statements/async_function,en-US/docs/Web/JavaScript/Reference/Statements/async_function,,0,0,0,"00:00, 1 Jan, 1970",0,0%,0,0,0%,0,0,0,2,Error 404 - Not Found,
https://goofy-euclid-1cd736.netlify.app/en-US/docs/Web/JavaScript/Reference/Operators/await,en-US/docs/Web/JavaScript/Reference/Operators/await,,0,0,0,"00:00, 1 Jan, 1970",0,0%,0,0,0%,0,0,0,2,Error 404 - Not Found,
https://goofy-euclid-1cd736.netlify.app/en-US/docs/Learn/JavaScript/Asynchronous/Concepts,en-US/docs/Learn/JavaScript/Asynchronous/Concepts,,0,0,0,"00:00, 1 Jan, 1970",0,0%,0,0,0%,0,0,0,3,Error 404 - Not Found,
https://goofy-euclid-1cd736.netlify.app/en-US/docs/Learn/JavaScript/Asynchronous/Choosing_the_right_approach,en-US/docs/Learn/JavaScript/Asynchronous/Choosing_the_right_approach,,0,0,0,"00:00, 1 Jan, 1970",0,0%,0,0,0%,0,0,0,3,Error 404 - Not Found,
https://goofy-euclid-1cd736.netlify.app/2-content/core-content/data-structures/html-only/ds-and-algorithms-prac/resources/_articles/data-structures/trees,2-content/core-content/data-structures/html-only/ds-and-algorithms-prac/resources/_articles/data-structures/trees,Page Title,11,8,661,"03:17, 6 Feb, 2021",45,7%,1,45,7%,1,9,9,0,,
https://goofy-euclid-1cd736.netlify.app/2-content/core-content/data-structures/html-only/ds-and-algorithms-prac/resources/_articles/dynamic_programming/fourkeyskeyboard,2-content/core-content/data-structures/html-only/ds-and-algorithms-prac/resources/_articles/dynamic_programming/fourkeyskeyboard,Page Title,11,17,"1,699","03:17, 6 Feb, 2021",32,2%,2,32,2%,2,0,0,0,,
https://goofy-euclid-1cd736.netlify.app/2-content/core-content/data-structures/_0-js/ds-book/examples/chapter01_02/03-operators,2-content/core-content/data-structures/_0-js/ds-book/examples/chapter01_02/03-operators,,11,0,0,"03:17, 6 Feb, 2021",0,0%,0,0,0%,0,0,0,0,,
https://goofy-euclid-1cd736.netlify.app/2-content/core-content/data-structures/html-only/ds-and-algorithms-prac/ds-n-algos/java-data-structure-examples/actual-java-code/strings/reverse-strings/notes,2-content/core-content/data-structures/html-only/ds-and-algorithms-prac/ds-n-algos/java-data-structure-examples/actual-java-code/strings/reverse-strings/notes,,11,0,0,"03:17, 6 Feb, 2021",0,0%,0,0,0%,0,0,0,0,,
https://goofy-euclid-1cd736.netlify.app/2-content/core-content/data-structures/html-only/ds-and-algorithms-prac/ds-n-algos/async/,2-content/core-content/data-structures/html-only/ds-and-algorithms-prac/ds-n-algos/async/,,11,5,516,"03:17, 6 Feb, 2021",58,11%,2,58,11%,2,9,9,0,,
https://goofy-euclid-1cd736.netlify.app/2-content/core-content/data-structures/_0-js/ds-book/examples/chapter14/01-dc-binarysearch,2-content/core-content/data-structures/_0-js/ds-book/examples/chapter14/01-dc-binarysearch,,11,1,0,"03:17, 6 Feb, 2021",0,0%,0,0,0%,0,0,0,0,,
https://goofy-euclid-1cd736.netlify.app/2-content/core-content/data-structures/html-only/ds-and-algorithms-prac/ds-n-algos/pojos/utils,2-content/core-content/data-structures/html-only/ds-and-algorithms-prac/ds-n-algos/pojos/utils,,11,19,675,"03:17, 6 Feb, 2021",0,0%,0,0,0%,0,0,0,0,,
https://goofy-euclid-1cd736.netlify.app/2-content/core-content/useful/blog-posts/public/docs/htmlaudioelement,2-content/core-content/useful/blog-posts/public/docs/htmlaudioelement,HTMLAudioElement JavaScript API,11,3,63,"03:17, 6 Feb, 2021",0,0%,0,0,0%,0,3,4,0,,
https://goofy-euclid-1cd736.netlify.app/2-content/core-content/data-structures/html-only/ds-and-algorithms-prac/ds-n-algos/z-notes/async_await/,2-content/core-content/data-structures/html-only/ds-and-algorithms-prac/ds-n-algos/z-notes/async_await/,,11,27,"3,014","03:17, 6 Feb, 2021",307,10%,2,307,10%,2,12,17,0,,
https://goofy-euclid-1cd736.netlify.app/2-content/core-content/data-structures/html-only/ds-and-algorithms-prac/ds-n-algos/misc/whiteboarding/whiteboarding-problems,2-content/core-content/data-structures/html-only/ds-and-algorithms-prac/ds-n-algos/misc/whiteboarding/whiteboarding-problems,Page Title,11,6,299,"03:17, 6 Feb, 2021",0,0%,0,0,0%,1,0,0,0,,
https://goofy-euclid-1cd736.netlify.app/docs/Learn/Front-end_web_developer,docs/Learn/Front-end_web_developer,,0,0,0,"00:00, 1 Jan, 1970",0,0%,0,0,0%,0,0,0,1,Error 404 - Not Found,
https://goofy-euclid-1cd736.netlify.app/en-US/docs/Learn/JavaScript/First_steps,en-US/docs/Learn/JavaScript/First_steps,,0,0,0,"00:00, 1 Jan, 1970",0,0%,0,0,0%,0,0,0,1,Error 404 - Not Found,
https://goofy-euclid-1cd736.netlify.app/en-US/docs/Learn/JavaScript/Building_blocks,en-US/docs/Learn/JavaScript/Building_blocks,,0,0,0,"00:00, 1 Jan, 1970",0,0%,0,0,0%,0,0,0,1,Error 404 - Not Found,
https://goofy-euclid-1cd736.netlify.app/en-US/docs/Learn/JavaScript/Asynchronous/Loops_and_intervals,en-US/docs/Learn/JavaScript/Asynchronous/Loops_and_intervals,,0,0,0,"00:00, 1 Jan, 1970",0,0%,0,0,0%,0,0,0,1,Error 404 - Not Found,
https://goofy-euclid-1cd736.netlify.app/HTMLMediaElement,HTMLMediaElement,,0,0,0,"00:00, 1 Jan, 1970",0,0%,0,0,0%,0,0,0,1,Error 404 - Not Found,
https://goofy-euclid-1cd736.netlify.app/license,license,,0,0,0,"00:00, 1 Jan, 1970",0,0%,0,0,0%,0,0,0,1,Error 404 - Not Found,
https://goofy-euclid-1cd736.netlify.app/feedback,feedback,,0,0,0,"00:00, 1 Jan, 1970",0,0%,0,0,0%,0,0,0,1,Error 404 - Not Found,
https://goofy-euclid-1cd736.netlify.app/2-content/core-content/data-structures/html-only/ds-and-algorithms-prac/resources/_articles/algorithmic-thinking/check_palindromic_linkedlist,2-content/core-content/data-structures/html-only/ds-and-algorithms-prac/resources/_articles/algorithmic-thinking/check_palindromic_linkedlist,,11,13,"1,078","03:17, 6 Feb, 2021",15,1%,1,15,1%,1,0,0,0,,
https://goofy-euclid-1cd736.netlify.app/en-US/docs/Learn/JavaScript/Objects/Inheritance,en-US/docs/Learn/JavaScript/Objects/Inheritance,,0,0,0,"00:00, 1 Jan, 1970",0,0%,0,0,0%,0,0,0,1,Error 404 - Not Found,

