                <!------------------------------------- Blog Post -------------------------------------->
                <div class="card mb-4">
                    <img class="card-img-top" src="http://placehold.it/750x300" alt="Card image cap">
                    <div class="card-body">
                        <h2 class="card-title">Bash Cheat Sheet</h2>
                        <p class="card-text">Placeholder</p>
                        <a class="btn" href="./other-pages/blog-posts/blog/catagories/Blog-Posts/ "
                            class="btn btn-primary">Read
                            More &rarr;</a>
                    </div>
                </div>
                <!------------------------------------- Blog Post -------------------------------------->
                <div class="card mb-4">
                    <img class="card-img-top" src="http://placehold.it/750x300" alt="Card image cap">
                    <div class="card-body">
                        <h2 class="card-title">Bash Cheat Sheet</h2>
                        <p class="card-text">Placeholder</p>
                        <a class="btn" href="./other-pages/blog-posts/blog/catagories/Blog-Posts/ "
                            class="btn btn-primary">Read
                            More &rarr;</a>
                    </div>
                </div>
                <!------------------------------------- Blog Post -------------------------------------->
                <div class="card mb-4">
                    <img class="card-img-top" src="http://placehold.it/750x300" alt="Card image cap">
                    <div class="card-body">
                        <h2 class="card-title">CSS Cheat Sheet</h2>
                        <p class="card-text">Placeholder</p>
                        <a class="btn" href="./other-pages/blog-posts/blog/catagories/Blog-Posts/ "
                            class="btn btn-primary">Read
                            More &rarr;</a>
                    </div>
                </div>
                <!------------------------------------- Blog Post -------------------------------------->
                <div class="card mb-4">
                    <img class="card-img-top" src="http://placehold.it/750x300" alt="Card image cap">
                    <div class="card-body">
                        <h2 class="card-title">Graph Cheat Sheet</h2>
                        <p class="card-text">Placeholder</p>
                        <a class="btn" href="./other-pages/blog-posts/blog/catagories/Blog-Posts/ "
                            class="btn btn-primary">Read
                            More &rarr;</a>
                    </div>
                </div>
                <!------------------------------------- Blog Post -------------------------------------->
                <div class="card mb-4">
                    <img class="card-img-top" src="http://placehold.it/750x300" alt="Card image cap">
                    <div class="card-body">
                        <h2 class="card-title">HTML Cheat Sheet</h2>
                        <p class="card-text">Placeholder</p>
                        <a class="btn" href="./other-pages/blog-posts/blog/catagories/Blog-Posts/ "
                            class="btn btn-primary">Read
                            More &rarr;</a>
                    </div>
                </div>
                <!------------------------------------- Blog Post -------------------------------------->
                <div class="card mb-4">
                    <img class="card-img-top" src="http://placehold.it/750x300" alt="Card image cap">
                    <div class="card-body">
                        <h2 class="card-title">Javascript Cheat Sheet</h2>
                        <p class="card-text">Placeholder</p>
                        <a class="btn" href="./other-pages/blog-posts/blog/catagories/Blog-Posts/ "
                            class="btn btn-primary">Read
                            More &rarr;</a>
                    </div>
                </div>
                <!------------------------------------- Blog Post -------------------------------------->
                <div class="card mb-4">
                    <img class="card-img-top" src="http://placehold.it/750x300" alt="Card image cap">
                    <div class="card-body">
                        <h2 class="card-title">Post Title</h2>
                        <p class="card-text">Placeholder</p>
                        <a class="btn" href="./other-pages/blog-posts/blog/catagories/Blog-Posts/ "
                            class="btn btn-primary">Read
                            More &rarr;</a>
                    </div>
                </div>
                <!------------------------------------- Blog Post -------------------------------------->
                <div class="card mb-4">
                    <img class="card-img-top" src="http://placehold.it/750x300" alt="Card image cap">
                    <div class="card-body">
                        <h2 class="card-title">Post Title</h2>
                        <p class="card-text">Placeholder</p>
                        <a class="btn" href="./other-pages/blog-posts/blog/catagories/Blog-Posts/ "
                            class="btn btn-primary">Read
                            More &rarr;</a>
                    </div>
                </div>
                <!------------------------------------- Blog Post -------------------------------------->
                <div class="card mb-4">
                    <img class="card-img-top" src="http://placehold.it/750x300" alt="Card image cap">
                    <div class="card-body">
                        <h2 class="card-title">Post Title</h2>
                        <p class="card-text">Placeholder</p>
                        <a class="btn" href="./other-pages/blog-posts/blog/catagories/Blog-Posts/ "
                            class="btn btn-primary">Read
                            More &rarr;</a>
                    </div>
                </div>
                <!------------------------------------- Blog Post -------------------------------------->
                <div class="card mb-4">
                    <img class="card-img-top" src="http://placehold.it/750x300" alt="Card image cap">
                    <div class="card-body">
                        <h2 class="card-title">Post Title</h2>
                        <p class="card-text">Placeholder</p>
                        <a class="btn" href="./other-pages/blog-posts/blog/catagories/Blog-Posts/ "
                            class="btn btn-primary">Read
                            More &rarr;</a>
                    </div>
                </div>
                <!------------------------------------- Blog Post -------------------------------------->
                <div class="card mb-4">
                    <img class="card-img-top" src="http://placehold.it/750x300" alt="Card image cap">
                    <div class="card-body">
                        <h2 class="card-title">Post Title</h2>
                        <p class="card-text">Placeholder</p>
                        <a class="btn" href="./other-pages/blog-posts/blog/catagories/Blog-Posts/ "
                            class="btn btn-primary">Read
                            More &rarr;</a>
                    </div>
                </div>
                <!------------------------------------- Blog Post -------------------------------------->
                <div class="card mb-4">
                    <img class="card-img-top" src="http://placehold.it/750x300" alt="Card image cap">
                    <div class="card-body">
                        <h2 class="card-title">Post Title</h2>
                        <p class="card-text">Placeholder</p>
                        <a class="btn" href="./other-pages/blog-posts/blog/catagories/Blog-Posts/ "
                            class="btn btn-primary">Read
                            More &rarr;</a>
                    </div>
                </div>
                <!------------------------------------- Blog Post -------------------------------------->
                <div class="card mb-4">
                    <img class="card-img-top" src="http://placehold.it/750x300" alt="Card image cap">
                    <div class="card-body">
                        <h2 class="card-title">Post Title</h2>
                        <p class="card-text">Placeholder</p>
                        <a class="btn" href="./other-pages/blog-posts/blog/catagories/Blog-Posts/ "
                            class="btn btn-primary">Read
                            More &rarr;</a>
                    </div>
                </div>
                <!------------------------------------- Blog Post -------------------------------------->
                <div class="card mb-4">
                    <img class="card-img-top" src="http://placehold.it/750x300" alt="Card image cap">
                    <div class="card-body">
                        <h2 class="card-title">Post Title</h2>
                        <p class="card-text">Placeholder</p>
                        <a class="btn" href="./other-pages/blog-posts/blog/catagories/Blog-Posts/ "
                            class="btn btn-primary">Read
                            More &rarr;</a>
                    </div>
                </div>
                <!------------------------------------- Blog Post -------------------------------------->
                <div class="card mb-4">
                    <img class="card-img-top" src="http://placehold.it/750x300" alt="Card image cap">
                    <div class="card-body">
                        <h2 class="card-title">Post Title</h2>
                        <p class="card-text">Placeholder</p>
                        <a class="btn" href="./other-pages/blog-posts/blog/catagories/Blog-Posts/ "
                            class="btn btn-primary">Read
                            More &rarr;</a>
                    </div>
                </div>
                <!------------------------------------- Blog Post -------------------------------------->
                <div class="card mb-4">
                    <img class="card-img-top" src="http://placehold.it/750x300" alt="Card image cap">
                    <div class="card-body">
                        <h2 class="card-title">Post Title</h2>
                        <p class="card-text">Placeholder</p>
                        <a class="btn" href="./other-pages/blog-posts/blog/catagories/Blog-Posts/ "
                            class="btn btn-primary">Read
                            More &rarr;</a>
                    </div>
                </div>
                <!------------------------------------- Blog Post -------------------------------------->
                <div class="card mb-4">
                    <img class="card-img-top" src="http://placehold.it/750x300" alt="Card image cap">
                    <div class="card-body">
                        <h2 class="card-title">Post Title</h2>
                        <p class="card-text">Placeholder</p>
                        <a class="btn" href="./other-pages/blog-posts/blog/catagories/Blog-Posts/ "
                            class="btn btn-primary">Read
                            More &rarr;</a>
                    </div>
                </div>
                <!------------------------------------- Blog Post -------------------------------------->
                <div class="card mb-4">
                    <img class="card-img-top" src="http://placehold.it/750x300" alt="Card image cap">
                    <div class="card-body">
                        <h2 class="card-title">Post Title</h2>
                        <p class="card-text">Placeholder</p>
                        <a class="btn" href="./other-pages/blog-posts/blog/catagories/Blog-Posts/ "
                            class="btn btn-primary">Read
                            More &rarr;</a>
                    </div>
                </div>
                <!------------------------------------- Blog Post -------------------------------------->
                <div class="card mb-4">
                    <img class="card-img-top" src="http://placehold.it/750x300" alt="Card image cap">
                    <div class="card-body">
                        <h2 class="card-title">Post Title</h2>
                        <p class="card-text">Placeholder</p>
                        <a class="btn" href="./other-pages/blog-posts/blog/catagories/Blog-Posts/ "
                            class="btn btn-primary">Read
                            More &rarr;</a>
                    </div>
                </div>
                <!------------------------------------- Blog Post -------------------------------------->
                <div class="card mb-4">
                    <img class="card-img-top" src="http://placehold.it/750x300" alt="Card image cap">
                    <div class="card-body">
                        <h2 class="card-title">Post Title</h2>
                        <p class="card-text">Placeholder</p>
                        <a class="btn" href="./other-pages/blog-posts/blog/catagories/Blog-Posts/ "
                            class="btn btn-primary">Read
                            More &rarr;</a>
                    </div>
                </div>
                <!------------------------------------- Blog Post -------------------------------------->
                <div class="card mb-4">
                    <img class="card-img-top" src="http://placehold.it/750x300" alt="Card image cap">
                    <div class="card-body">
                        <h2 class="card-title">Post Title</h2>
                        <p class="card-text">Placeholder</p>
                        <a class="btn" href="./other-pages/blog-posts/blog/catagories/Blog-Posts/ "
                            class="btn btn-primary">Read
                            More &rarr;</a>
                    </div>
                </div>
                <!------------------------------------- Blog Post -------------------------------------->
                <div class="card mb-4">
                    <img class="card-img-top" src="http://placehold.it/750x300" alt="Card image cap">
                    <div class="card-body">
                        <h2 class="card-title">Post Title</h2>
                        <p class="card-text">Placeholder</p>
                        <a class="btn" href="./other-pages/blog-posts/blog/catagories/Blog-Posts/ "
                            class="btn btn-primary">Read
                            More &rarr;</a>
                    </div>
                </div>