﻿{
  "Transactions": [
    
  {
    "DATE":"1/1/2015",
    "MERCHANT":"THE PHONE COMPANY",
    "CATEGORY":"Communications",
    "AMOUNT":"$120"
  },
  {
    "DATE":"1/1/2015",
    "MERCHANT":"SOUTHRIDGE VIDEO",
    "CATEGORY":"Entertainment",
    "AMOUNT":"$40"
  },
  {
    "DATE":"1/1/2015",
    "MERCHANT":"COHO WINERY",
    "CATEGORY":"Restaurant",
    "AMOUNT":"$47"
  },
  {
    "DATE":"1/2/2015",
    "MERCHANT":"CONTOSO, LTD",
    "CATEGORY":"Shopping",
    "AMOUNT":"$56"
  },
  {
    "DATE":"1/2/2015",
    "MERCHANT":"CONTOSO, LTD",
    "CATEGORY":"Shopping",
    "AMOUNT":"$110"
  },
  {
    "DATE":"1/2/2015",
    "MERCHANT":"LIBERTY BAKERY & CAFE",
    "CATEGORY":"Groceries",
    "AMOUNT":"$27"
  },
  {
    "DATE":"1/2/2015",
    "MERCHANT":"LIBERTY BAKERY & CAFE",
    "CATEGORY":"Groceries",
    "AMOUNT":"$38"
  },
  {
    "DATE":"1/2/2015",
    "MERCHANT":"NORTHWIND ELECTRIC CARS",
    "CATEGORY":"Transportation",
    "AMOUNT":"$42"
  },
  {
    "DATE":"1/2/2015",
    "MERCHANT":"BEST FOR YOU ORGANICS COMPANY",
    "CATEGORY":"Groceries",
    "AMOUNT":"$27"
  },
  {
    "DATE":"1/3/2015",
    "MERCHANT":"CONTOSO, LTD",
    "CATEGORY":"Shopping",
    "AMOUNT":"$25"
  },
  {
    "DATE":"1/5/2015",
    "MERCHANT":"MUNSON'S PICKLES AND PRESERVES FARM",
    "CATEGORY":"Groceries",
    "AMOUNT":"$178"
  },
  {
    "DATE":"1/6/2015",
    "MERCHANT":"BELLOWS COLLEGE",
    "CATEGORY":"Education",
    "AMOUNT":"$350"
  },
  {
    "DATE":"1/6/2015",
    "MERCHANT":"ADVENTURE WORKS CYCLES",
    "CATEGORY":"Transportation",
    "AMOUNT":"$35"
  },
  {
    "DATE":"1/7/2015",
    "MERCHANT":"FABRIKAM, INC",
    "CATEGORY":"Shopping",
    "AMOUNT":"$168"
  },
  {
    "DATE":"1/8/2015",
    "MERCHANT":"COHO VINEYARD",
    "CATEGORY":"Restaurant",
    "AMOUNT":"$33"
  },
  {
    "DATE":"1/9/2015",
    "MERCHANT":"FOURTH COFFEE",
    "CATEGORY":"Restaurant",
    "AMOUNT":"$5"
  },
  {
    "DATE":"1/9/2015",
    "MERCHANT":"ADVENTURE WORKS CYCLES",
    "CATEGORY":"Transportation",
    "AMOUNT":"$53"
  },
  {
    "DATE":"1/12/2015",
    "MERCHANT":"WIDE WORLD IMPORTERS",
    "CATEGORY":"Groceries",
    "AMOUNT":"$168"
  },
  {
    "DATE":"1/13/2015",
    "MERCHANT":"LIBERTY'S DELIGHTFUL CAFE",
    "CATEGORY":"Restaurant",
    "AMOUNT":"$55"
  },
  {
    "DATE":"1/15/2015",
    "MERCHANT":"ADVENTURE WORKS CYCLES",
    "CATEGORY":"Transportation",
    "AMOUNT":"$44"
  },
  {
    "DATE":"1/17/2015",
    "MERCHANT":"CONTOSO, LTD",
    "CATEGORY":"Entertainment",
    "AMOUNT":"$11"
  },
  {
    "DATE":"1/17/2015",
    "MERCHANT":"CONTOSO, LTD",
    "CATEGORY":"Entertainment",
    "AMOUNT":"$35"
  },
  {
    "DATE":"1/17/2015",
    "MERCHANT":"BEST FOR YOU ORGANICS",
    "CATEGORY":"Groceries",
    "AMOUNT":"$64"
  },
  {
    "DATE":"1/17/2015",
    "MERCHANT":"MUNSON'S PICKLES AND PRESERVES FARM",
    "CATEGORY":"Groceries",
    "AMOUNT":"$134"
  },
  {
    "DATE":"1/18/2015",
    "MERCHANT":"A. DATUM CORPORATION",
    "CATEGORY":"Shopping",
    "AMOUNT":"$3"
  },
  {
    "DATE":"1/19/2015",
    "MERCHANT":"COHO WINERY",
    "CATEGORY":"Restaurant",
    "AMOUNT":"$39"
  },
  {
    "DATE":"1/19/2015",
    "MERCHANT":"THE PHONE COMPANY",
    "CATEGORY":"Communications",
    "AMOUNT":"$124"
  },
  {
    "DATE":"1/20/2015",
    "MERCHANT":"ADVENTURE WORKS CYCLES",
    "CATEGORY":"Transportation",
    "AMOUNT":"$33"
  },
  {
    "DATE":"1/21/2015",
    "MERCHANT":"CONTOSO, LTD",
    "CATEGORY":"Shopping",
    "AMOUNT":"$18"
  },
  {
    "DATE":"1/21/2015",
    "MERCHANT":"NORTHWIND ELECTRIC CARS",
    "CATEGORY":"Transportation",
    "AMOUNT":"$36"
  },
  {
    "DATE":"1/22/2015",
    "MERCHANT":"BEST FOR YOU ORGANICS",
    "CATEGORY":"Groceries",
    "AMOUNT":"$2"
  },
  {
    "DATE":"1/23/2015",
    "MERCHANT":"CONTOSO, LTD",
    "CATEGORY":"Shopping",
    "AMOUNT":"$16"
  },
  {
    "DATE":"1/24/2015",
    "MERCHANT":"CONTOSO, LTD",
    "CATEGORY":"Shopping",
    "AMOUNT":"$38"
  },
  {
    "DATE":"1/24/2015",
    "MERCHANT":"BEST FOR YOU ORGANICS COMPANY",
    "CATEGORY":"Groceries",
    "AMOUNT":"$68"
  },
  {
    "DATE":"1/25/2015",
    "MERCHANT":"COHO WINERY",
    "CATEGORY":"Restaurant",
    "AMOUNT":"$10"
  },
  {
    "DATE":"1/25/2015",
    "MERCHANT":"COHO WINERY",
    "CATEGORY":"Restaurant",
    "AMOUNT":"$61"
  },
  {
    "DATE":"1/25/2015",
    "MERCHANT":"TREY RESEARCH",
    "CATEGORY":"Other",
    "AMOUNT":"$135"
  },
  {
    "DATE":"1/26/2015",
    "MERCHANT":"NORTHWIND ELECTRIC CARS",
    "CATEGORY":"Transportation",
    "AMOUNT":"$35"
  },
  {
    "DATE":"1/27/2015",
    "MERCHANT":"THE PHONE COMPANY",
    "CATEGORY":"Communications",
    "AMOUNT":"$20"
  },
  {
    "DATE":"1/28/2015",
    "MERCHANT":"COHO WINERY",
    "CATEGORY":"Restaurant",
    "AMOUNT":"$11"
  },
  {
    "DATE":"1/29/2015",
    "MERCHANT":"COHO WINERY",
    "CATEGORY":"Restaurant",
    "AMOUNT":"$12"
  },
  {
    "DATE":"1/30/2015",
    "MERCHANT":"TREY RESEARCH",
    "CATEGORY":"Other",
    "AMOUNT":"$1000"
  },
  {
    "DATE":"1/30/2015",
    "MERCHANT":"NORTHWIND ELECTRIC CARS",
    "CATEGORY":"Transportation",
    "AMOUNT":"$29"
  },
  {
    "DATE":"1/30/2015",
    "MERCHANT":"MUNSON'S PICKLES AND PRESERVES FARM",
    "CATEGORY":"Groceries",
    "AMOUNT":"$111"
  },
  {
    "DATE":"1/31/2015",
    "MERCHANT":"CONTOSO, LTD",
    "CATEGORY":"Shopping",
    "AMOUNT":"$9"
  },
  {
    "DATE":"1/31/2015",
    "MERCHANT":"CONTOSO, LTD",
    "CATEGORY":"Shopping",
    "AMOUNT":"$23"
  },
  {
    "DATE":"2/1/2015",
    "MERCHANT":"THE PHONE COMPANY",
    "CATEGORY":"Communications",
    "AMOUNT":"$117"
  },
  {
    "DATE":"2/1/2015",
    "MERCHANT":"WIDE WORLD IMPORTERS",
    "CATEGORY":"Shopping",
    "AMOUNT":"$24"
  },
  {
    "DATE":"2/1/2015",
    "MERCHANT":"BEST FOR YOU ORGANICS",
    "CATEGORY":"Groceries",
    "AMOUNT":"$27"
  },
  {
    "DATE":"2/1/2015",
    "MERCHANT":"ADVENTURE WORKS CYCLES",
    "CATEGORY":"Transportation",
    "AMOUNT":"$42"
  },
  {
    "DATE":"2/2/2015",
    "MERCHANT":"BELLOWS COLLEGE",
    "CATEGORY":"Education",
    "AMOUNT":"$350"
  },
  {
    "DATE":"2/3/2015",
    "MERCHANT":"WIDE WORLD IMPORTERS",
    "CATEGORY":"Groceries",
    "AMOUNT":"$59"
  },
  {
    "DATE":"2/5/2015",
    "MERCHANT":"COHO WINERY",
    "CATEGORY":"Restaurant",
    "AMOUNT":"$30"
  },
  {
    "DATE":"2/5/2015",
    "MERCHANT":"WIDE WORLD IMPORTERS",
    "CATEGORY":"Groceries",
    "AMOUNT":"$61"
  },
  {
    "DATE":"2/6/2015",
    "MERCHANT":"BEST FOR YOU ORGANICS",
    "CATEGORY":"Groceries",
    "AMOUNT":"$7"
  },
  {
    "DATE":"2/6/2015",
    "MERCHANT":"NORTHWIND ELECTRIC CARS",
    "CATEGORY":"Transportation",
    "AMOUNT":"$27"
  },
  {
    "DATE":"2/7/2015",
    "MERCHANT":"CONTOSO, LTD",
    "CATEGORY":"Shopping",
    "AMOUNT":"$147"
  },
  {
    "DATE":"2/7/2015",
    "MERCHANT":"CONTOSO, LTD",
    "CATEGORY":"Shopping",
    "AMOUNT":"$39"
  },
  {
    "DATE":"2/7/2015",
    "MERCHANT":"CONTOSO PHARMACEUTICALS",
    "CATEGORY":"Shopping",
    "AMOUNT":"$30"
  },
  {
    "DATE":"2/8/2015",
    "MERCHANT":"CONTOSO, LTD",
    "CATEGORY":"Shopping",
    "AMOUNT":"$49"
  },
  {
    "DATE":"2/8/2015",
    "MERCHANT":"BEST FOR YOU ORGANICS",
    "CATEGORY":"Groceries",
    "AMOUNT":"$9"
  },
  {
    "DATE":"2/8/2015",
    "MERCHANT":"BEST FOR YOU ORGANICS",
    "CATEGORY":"Groceries",
    "AMOUNT":"$91"
  },
  {
    "DATE":"2/9/2015",
    "MERCHANT":"ADVENTURE WORKS CYCLES",
    "CATEGORY":"Transportation",
    "AMOUNT":"$30"
  },
  {
    "DATE":"2/12/2015",
    "MERCHANT":"WIDE WORLD IMPORTERS",
    "CATEGORY":"Shopping",
    "AMOUNT":"$87"
  },
  {
    "DATE":"2/12/2015",
    "MERCHANT":"COHO VINEYARD",
    "CATEGORY":"Restaurant",
    "AMOUNT":"$49"
  },
  {
    "DATE":"2/12/2015",
    "MERCHANT":"CONTOSO, LTD",
    "CATEGORY":"Shopping",
    "AMOUNT":"$22"
  },
  {
    "DATE":"2/13/2015",
    "MERCHANT":"LIBERTY'S DELIGHTFUL CAFE",
    "CATEGORY":"Restaurant",
    "AMOUNT":"$19"
  },
  {
    "DATE":"2/13/2015",
    "MERCHANT":"ADVENTURE WORKS CYCLES",
    "CATEGORY":"Transportation",
    "AMOUNT":"$45"
  },
  {
    "DATE":"2/15/2015",
    "MERCHANT":"LIBERTY'S DELIGHTFUL CAFE",
    "CATEGORY":"Restaurant",
    "AMOUNT":"$64"
  },
  {
    "DATE":"2/15/2015",
    "MERCHANT":"WIDE WORLD IMPORTERS",
    "CATEGORY":"Groceries",
    "AMOUNT":"$81"
  },
  {
    "DATE":"2/16/2015",
    "MERCHANT":"WIDE WORLD IMPORTERS",
    "CATEGORY":"Groceries",
    "AMOUNT":"$16"
  },
  {
    "DATE":"2/17/2015",
    "MERCHANT":"CONTOSO, LTD",
    "CATEGORY":"Shopping",
    "AMOUNT":"$15"
  },
  {
    "DATE":"2/17/2015",
    "MERCHANT":"LIBERTY'S DELIGHTFUL CAFE",
    "CATEGORY":"Restaurant",
    "AMOUNT":"$17"
  },
  {
    "DATE":"2/18/2015",
    "MERCHANT":"LIBERTY'S DELIGHTFUL CAFE",
    "CATEGORY":"Restaurant",
    "AMOUNT":"$4"
  },
  {
    "DATE":"2/19/2015",
    "MERCHANT":"THE PHONE COMPANY",
    "CATEGORY":"Communications",
    "AMOUNT":"$126"
  },
  {
    "DATE":"2/19/2015",
    "MERCHANT":"WIDE WORLD IMPORTERS",
    "CATEGORY":"Shopping",
    "AMOUNT":"$57"
  },
  {
    "DATE":"2/20/2015",
    "MERCHANT":"CONTOSO, LTD",
    "CATEGORY":"Shopping",
    "AMOUNT":"$18"
  },
  {
    "DATE":"2/20/2015",
    "MERCHANT":"ADVENTURE WORKS CYCLES",
    "CATEGORY":"Transportation",
    "AMOUNT":"$34"
  },
  {
    "DATE":"2/21/2015",
    "MERCHANT":"MARGIE'S TRAVEL",
    "CATEGORY":"Travel",
    "AMOUNT":"$1334"
  },
  {
    "DATE":"2/21/2015",
    "MERCHANT":"MARGIE'S TRAVEL",
    "CATEGORY":"Travel",
    "AMOUNT":"$1334"
  },
  {
    "DATE":"2/21/2015",
    "MERCHANT":"WIDE WORLD IMPORTERS",
    "CATEGORY":"Groceries",
    "AMOUNT":"$57"
  },
  {
    "DATE":"2/22/2015",
    "MERCHANT":"CONTOSO, LTD",
    "CATEGORY":"Shopping",
    "AMOUNT":"$44"
  },
  {
    "DATE":"2/22/2015",
    "MERCHANT":"CONTOSO, LTD",
    "CATEGORY":"Shopping",
    "AMOUNT":"$11"
  },
  {
    "DATE":"2/22/2015",
    "MERCHANT":"CONTOSO, LTD",
    "CATEGORY":"Shopping",
    "AMOUNT":"$15"
  },
  {
    "DATE":"2/22/2015",
    "MERCHANT":"RELECLOUD",
    "CATEGORY":"Entertainment",
    "AMOUNT":"$12"
  },
  {
    "DATE":"2/22/2015",
    "MERCHANT":"RELECLOUD",
    "CATEGORY":"Entertainment",
    "AMOUNT":"$48"
  },
  {
    "DATE":"2/22/2015",
    "MERCHANT":"TREY RESEARCH",
    "CATEGORY":"Other",
    "AMOUNT":"$1250"
  },
  {
    "DATE":"2/25/2015",
    "MERCHANT":"TREY RESEARCH",
    "CATEGORY":"Other",
    "AMOUNT":"$135"
  },
  {
    "DATE":"2/26/2015",
    "MERCHANT":"NORTHWIND ELECTRIC CARS",
    "CATEGORY":"Transportation",
    "AMOUNT":"$48"
  },
  {
    "DATE":"2/26/2015",
    "MERCHANT":"LIBERTY'S DELIGHTFUL CAFE",
    "CATEGORY":"Restaurant",
    "AMOUNT":"$36"
  },
  {
    "DATE":"2/26/2015",
    "MERCHANT":"LIBERTY'S DELIGHTFUL CAFE",
    "CATEGORY":"Restaurant",
    "AMOUNT":"$190"
  },
  {
    "DATE":"2/27/2015",
    "MERCHANT":"LIBERTY'S DELIGHTFUL CAFE",
    "CATEGORY":"Restaurant",
    "AMOUNT":"$90"
  },
  {
    "DATE":"2/27/2015",
    "MERCHANT":"LIBERTY'S DELIGHTFUL CAFE",
    "CATEGORY":"Restaurant",
    "AMOUNT":"$2"
  },
  {
    "DATE":"2/27/2015",
    "MERCHANT":"LIBERTY BAKERY & CAFE",
    "CATEGORY":"Groceries",
    "AMOUNT":"$61"
  },
  {
    "DATE":"2/27/2015",
    "MERCHANT":"COHO WINERY",
    "CATEGORY":"Restaurant",
    "AMOUNT":"$4"
  },
  {
    "DATE":"2/27/2015",
    "MERCHANT":"COHO WINERY",
    "CATEGORY":"Restaurant",
    "AMOUNT":"$9"
  },
  {
    "DATE":"3/1/2015",
    "MERCHANT":"THE PHONE COMPANY",
    "CATEGORY":"Communications",
    "AMOUNT":"$169"
  },
  {
    "DATE":"3/1/2015",
    "MERCHANT":"MUNSON'S PICKLES AND PRESERVES FARM",
    "CATEGORY":"Groceries",
    "AMOUNT":"$134"
  },
  {
    "DATE":"3/2/2015",
    "MERCHANT":"BELLOWS COLLEGE",
    "CATEGORY":"Education",
    "AMOUNT":"$350"
  },
  {
    "DATE":"3/2/2015",
    "MERCHANT":"LIBERTY'S DELIGHTFUL CAFE",
    "CATEGORY":"Restaurant",
    "AMOUNT":"$33"
  },
  {
    "DATE":"3/2/2015",
    "MERCHANT":"NORTHWIND ELECTRIC CARS",
    "CATEGORY":"Transportation",
    "AMOUNT":"$38"
  },
  {
    "DATE":"3/2/2015",
    "MERCHANT":"MUNSON'S PICKLES AND PRESERVES FARM",
    "CATEGORY":"Groceries",
    "AMOUNT":"$47"
  },
  {
    "DATE":"3/3/2015",
    "MERCHANT":"NORTHWIND ELECTRIC CARS",
    "CATEGORY":"Transportation",
    "AMOUNT":"$525"
  },
  {
    "DATE":"3/5/2015",
    "MERCHANT":"NORTHWIND ELECTRIC CARS",
    "CATEGORY":"Transportation",
    "AMOUNT":"$9"
  },
  {
    "DATE":"3/5/2015",
    "MERCHANT":"NORTHWIND ELECTRIC CARS",
    "CATEGORY":"Transportation",
    "AMOUNT":"$52"
  },
  {
    "DATE":"3/5/2015",
    "MERCHANT":"BEST FOR YOU ORGANICS COMPANY",
    "CATEGORY":"Groceries",
    "AMOUNT":"$9"
  },
  {
    "DATE":"3/5/2015",
    "MERCHANT":"BEST FOR YOU ORGANICS COMPANY",
    "CATEGORY":"Groceries",
    "AMOUNT":"$108"
  },
  {
    "DATE":"3/6/2015",
    "MERCHANT":"LIBERTY'S DELIGHTFUL CAFE",
    "CATEGORY":"Restaurant",
    "AMOUNT":"$17"
  },
  {
    "DATE":"3/7/2015",
    "MERCHANT":"LIBERTY'S DELIGHTFUL CAFE",
    "CATEGORY":"Restaurant",
    "AMOUNT":"$33"
  },
  {
    "DATE":"3/8/2015",
    "MERCHANT":"LIBERTY'S DELIGHTFUL CAFE",
    "CATEGORY":"Restaurant",
    "AMOUNT":"$17"
  },
  {
    "DATE":"3/10/2015",
    "MERCHANT":"NORTHWIND ELECTRIC CARS",
    "CATEGORY":"Transportation",
    "AMOUNT":"$1137"
  },
  {
    "DATE":"3/11/2015",
    "MERCHANT":"LIBERTY'S DELIGHTFUL CAFE",
    "CATEGORY":"Restaurant",
    "AMOUNT":"$139"
  },
  {
    "DATE":"3/11/2015",
    "MERCHANT":"NORTHWIND ELECTRIC CARS",
    "CATEGORY":"Transportation",
    "AMOUNT":"$50"
  },
  {
    "DATE":"3/12/2015",
    "MERCHANT":"LIBERTY'S DELIGHTFUL CAFE",
    "CATEGORY":"Restaurant",
    "AMOUNT":"$34"
  },
  {
    "DATE":"3/14/2015",
    "MERCHANT":"CONTOSO, LTD",
    "CATEGORY":"Shopping",
    "AMOUNT":"$193"
  },
  {
    "DATE":"3/14/2015",
    "MERCHANT":"LIBERTY'S DELIGHTFUL CAFE",
    "CATEGORY":"Restaurant",
    "AMOUNT":"$68"
  },
  {
    "DATE":"3/14/2015",
    "MERCHANT":"LIBERTY'S DELIGHTFUL CAFE",
    "CATEGORY":"Restaurant",
    "AMOUNT":"$37"
  },
  {
    "DATE":"3/15/2015",
    "MERCHANT":"CONTOSO, LTD",
    "CATEGORY":"Shopping",
    "AMOUNT":"$15"
  },
  {
    "DATE":"3/15/2015",
    "MERCHANT":"LIBERTY BAKERY & CAFE",
    "CATEGORY":"Groceries",
    "AMOUNT":"$83"
  },
  {
    "DATE":"3/15/2015",
    "MERCHANT":"NORTHWIND ELECTRIC CARS",
    "CATEGORY":"Transportation",
    "AMOUNT":"$26"
  },
  {
    "DATE":"3/16/2015",
    "MERCHANT":"LIBERTY'S DELIGHTFUL CAFE",
    "CATEGORY":"Restaurant",
    "AMOUNT":"$45"
  },
  {
    "DATE":"3/16/2015",
    "MERCHANT":"CONTOSO, LTD",
    "CATEGORY":"Entertainment",
    "AMOUNT":"$42"
  },
  {
    "DATE":"3/16/2015",
    "MERCHANT":"LIBERTY'S DELIGHTFUL CAFE",
    "CATEGORY":"Restaurant",
    "AMOUNT":"$16"
  },
  {
    "DATE":"3/16/2015",
    "MERCHANT":"ADVENTURE WORKS CYCLES",
    "CATEGORY":"Transportation",
    "AMOUNT":"$33"
  },
  {
    "DATE":"3/17/2015",
    "MERCHANT":"BEST FOR YOU ORGANICS COMPANY",
    "CATEGORY":"Groceries",
    "AMOUNT":"$12"
  },
  {
    "DATE":"3/18/2015",
    "MERCHANT":"CONTOSO, LTD",
    "CATEGORY":"Shopping",
    "AMOUNT":"$33"
  },
  {
    "DATE":"3/20/2015",
    "MERCHANT":"CONTOSO, LTD",
    "CATEGORY":"Shopping",
    "AMOUNT":"$4"
  },
  {
    "DATE":"3/20/2015",
    "MERCHANT":"WIDE WORLD IMPORTERS",
    "CATEGORY":"Groceries",
    "AMOUNT":"$62"
  },
  {
    "DATE":"3/20/2015",
    "MERCHANT":"NORTHWIND ELECTRIC CARS",
    "CATEGORY":"Transportation",
    "AMOUNT":"$41"
  },
  {
    "DATE":"3/21/2015",
    "MERCHANT":"CONTOSO, LTD",
    "CATEGORY":"Shopping",
    "AMOUNT":"$75"
  },
  {
    "DATE":"3/22/2015",
    "MERCHANT":"THE PHONE COMPANY",
    "CATEGORY":"Communications",
    "AMOUNT":"$126"
  },
  {
    "DATE":"3/22/2015",
    "MERCHANT":"LIBERTY BAKERY & CAFE",
    "CATEGORY":"Groceries",
    "AMOUNT":"$54"
  },
  {
    "DATE":"3/23/2015",
    "MERCHANT":"BEST FOR YOU ORGANICS",
    "CATEGORY":"Groceries",
    "AMOUNT":"$31"
  },
  {
    "DATE":"3/23/2015",
    "MERCHANT":"LIBERTY BAKERY & CAFE",
    "CATEGORY":"Groceries",
    "AMOUNT":"$10"
  },
  {
    "DATE":"3/25/2015",
    "MERCHANT":"TREY RESEARCH",
    "CATEGORY":"Other",
    "AMOUNT":"$135"
  },
  {
    "DATE":"3/26/2015",
    "MERCHANT":"LIBERTY'S DELIGHTFUL CAFE",
    "CATEGORY":"Restaurant",
    "AMOUNT":"$2"
  },
  {
    "DATE":"3/26/2015",
    "MERCHANT":"ADVENTURE WORKS CYCLES",
    "CATEGORY":"Transportation",
    "AMOUNT":"$40"
  },
  {
    "DATE":"3/27/2015",
    "MERCHANT":"CONTOSO, LTD",
    "CATEGORY":"Shopping",
    "AMOUNT":"$41"
  },
  {
    "DATE":"3/27/2015",
    "MERCHANT":"LIBERTY BAKERY & CAFE",
    "CATEGORY":"Groceries",
    "AMOUNT":"$129"
  },
  {
    "DATE":"3/27/2015",
    "MERCHANT":"NORTHWIND ELECTRIC CARS",
    "CATEGORY":"Transportation",
    "AMOUNT":"$50"
  },
  {
    "DATE":"3/27/2015",
    "MERCHANT":"MUNSON'S PICKLES AND PRESERVES FARM",
    "CATEGORY":"Groceries",
    "AMOUNT":"$94"
  },
  {
    "DATE":"3/28/2015",
    "MERCHANT":"WIDE WORLD IMPORTERS",
    "CATEGORY":"Shopping",
    "AMOUNT":"$39"
  },
  {
    "DATE":"3/30/2015",
    "MERCHANT":"CONTOSO, LTD",
    "CATEGORY":"Shopping",
    "AMOUNT":"$16"
  },
  {
    "DATE":"3/30/2015",
    "MERCHANT":"WIDE WORLD IMPORTERS",
    "CATEGORY":"Groceries",
    "AMOUNT":"$32"
  },
  {
    "DATE":"4/1/2015",
    "MERCHANT":"THE PHONE COMPANY",
    "CATEGORY":"Communications",
    "AMOUNT":"$119"
  },
  {
    "DATE":"4/1/2015",
    "MERCHANT":"LIBERTY BAKERY & CAFE",
    "CATEGORY":"Groceries",
    "AMOUNT":"$9"
  },
  {
    "DATE":"4/1/2015",
    "MERCHANT":"LIBERTY'S DELIGHTFUL CAFE",
    "CATEGORY":"Restaurant",
    "AMOUNT":"$7"
  },
  {
    "DATE":"4/2/2015",
    "MERCHANT":"WIDE WORLD IMPORTERS",
    "CATEGORY":"Groceries",
    "AMOUNT":"$25"
  },
  {
    "DATE":"4/2/2015",
    "MERCHANT":"CONTOSO, LTD",
    "CATEGORY":"Shopping",
    "AMOUNT":"$328"
  },
  {
    "DATE":"4/3/2015",
    "MERCHANT":"CONTOSO, LTD",
    "CATEGORY":"Shopping",
    "AMOUNT":"$44"
  },
  {
    "DATE":"4/3/2015",
    "MERCHANT":"ADVENTURE WORKS CYCLES",
    "CATEGORY":"Transportation",
    "AMOUNT":"$54"
  },
  {
    "DATE":"4/4/2015",
    "MERCHANT":"LIBERTY'S DELIGHTFUL CAFE",
    "CATEGORY":"Restaurant",
    "AMOUNT":"$19"
  },
  {
    "DATE":"4/4/2015",
    "MERCHANT":"NORTHWIND ELECTRIC CARS",
    "CATEGORY":"Transportation",
    "AMOUNT":"$32"
  },
  {
    "DATE":"4/4/2015",
    "MERCHANT":"MUNSON'S PICKLES AND PRESERVES FARM",
    "CATEGORY":"Groceries",
    "AMOUNT":"$7"
  },
  {
    "DATE":"4/5/2015",
    "MERCHANT":"LIBERTY'S DELIGHTFUL CAFE",
    "CATEGORY":"Restaurant",
    "AMOUNT":"$58"
  },
  {
    "DATE":"4/5/2015",
    "MERCHANT":"NORTHWIND ELECTRIC CARS",
    "CATEGORY":"Transportation",
    "AMOUNT":"$40"
  },
  {
    "DATE":"4/6/2015",
    "MERCHANT":"CONTOSO, LTD",
    "CATEGORY":"Shopping",
    "AMOUNT":"$228"
  },
  {
    "DATE":"4/6/2015",
    "MERCHANT":"CONTOSO, LTD",
    "CATEGORY":"Shopping",
    "AMOUNT":"$31"
  },
  {
    "DATE":"4/6/2015",
    "MERCHANT":"CONTOSO, LTD",
    "CATEGORY":"Shopping",
    "AMOUNT":"$134"
  },
  {
    "DATE":"4/6/2015",
    "MERCHANT":"CONTOSO, LTD",
    "CATEGORY":"Shopping",
    "AMOUNT":"$121"
  },
  {
    "DATE":"4/6/2015",
    "MERCHANT":"CONTOSO, LTD",
    "CATEGORY":"Shopping",
    "AMOUNT":"$90"
  },
  {
    "DATE":"4/6/2015",
    "MERCHANT":"FOURTH COFFEE",
    "CATEGORY":"Restaurant",
    "AMOUNT":"$17"
  },
  {
    "DATE":"4/6/2015",
    "MERCHANT":"TREY RESEARCH",
    "CATEGORY":"Other",
    "AMOUNT":"$6"
  },
  {
    "DATE":"4/6/2015",
    "MERCHANT":"CONTOSO, LTD",
    "CATEGORY":"Shopping",
    "AMOUNT":"$114"
  },
  {
    "DATE":"4/7/2015",
    "MERCHANT":"LIBERTY'S DELIGHTFUL CAFE",
    "CATEGORY":"Restaurant",
    "AMOUNT":"$76"
  },
  {
    "DATE":"4/7/2015",
    "MERCHANT":"CONTOSO, LTD",
    "CATEGORY":"Shopping",
    "AMOUNT":"$83"
  },
  {
    "DATE":"4/7/2015",
    "MERCHANT":"CONTOSO, LTD",
    "CATEGORY":"Shopping",
    "AMOUNT":"$325"
  },
  {
    "DATE":"4/7/2015",
    "MERCHANT":"NORTHWIND ELECTRIC CARS",
    "CATEGORY":"Transportation",
    "AMOUNT":"$51"
  },
  {
    "DATE":"4/7/2015",
    "MERCHANT":"FABRIKAM, INC",
    "CATEGORY":"Shopping",
    "AMOUNT":"$110"
  },
  {
    "DATE":"4/7/2015",
    "MERCHANT":"LIBERTY'S DELIGHTFUL CAFE",
    "CATEGORY":"Restaurant",
    "AMOUNT":"$58"
  },
  {
    "DATE":"4/8/2015",
    "MERCHANT":"MARGIE'S TRAVEL",
    "CATEGORY":"Travel",
    "AMOUNT":"$379"
  },
  {
    "DATE":"4/8/2015",
    "MERCHANT":"FOURTH COFFEE",
    "CATEGORY":"Restaurant",
    "AMOUNT":"$5"
  },
  {
    "DATE":"4/8/2015",
    "MERCHANT":"LIBERTY'S DELIGHTFUL CAFE",
    "CATEGORY":"Restaurant",
    "AMOUNT":"$41"
  },
  {
    "DATE":"4/9/2015",
    "MERCHANT":"MARGIE'S TRAVEL",
    "CATEGORY":"Travel",
    "AMOUNT":"$368"
  },
  {
    "DATE":"4/9/2015",
    "MERCHANT":"ADVENTURE WORKS CYCLES",
    "CATEGORY":"Transportation",
    "AMOUNT":"$38"
  },
  {
    "DATE":"4/9/2015",
    "MERCHANT":"TREY RESEARCH",
    "CATEGORY":"Other",
    "AMOUNT":"$51"
  },
  {
    "DATE":"4/10/2015",
    "MERCHANT":"WIDE WORLD IMPORTERS",
    "CATEGORY":"Groceries",
    "AMOUNT":"$44"
  },
  {
    "DATE":"4/13/2015",
    "MERCHANT":"WIDE WORLD IMPORTERS",
    "CATEGORY":"Groceries",
    "AMOUNT":"$73"
  },
  {
    "DATE":"4/15/2015",
    "MERCHANT":"SCHOOL OF FINE ART",
    "CATEGORY":"Education",
    "AMOUNT":"$22"
  },
  {
    "DATE":"4/15/2015",
    "MERCHANT":"ADVENTURE WORKS CYCLES",
    "CATEGORY":"Transportation",
    "AMOUNT":"$37"
  },
  {
    "DATE":"4/16/2015",
    "MERCHANT":"CONTOSO, LTD",
    "CATEGORY":"Shopping",
    "AMOUNT":"$30"
  },
  {
    "DATE":"4/17/2015",
    "MERCHANT":"CONTOSO, LTD",
    "CATEGORY":"Shopping",
    "AMOUNT":"$91"
  },
  {
    "DATE":"4/17/2015",
    "MERCHANT":"CONTOSO, LTD",
    "CATEGORY":"Shopping",
    "AMOUNT":"$50"
  },
  {
    "DATE":"4/17/2015",
    "MERCHANT":"CONTOSO, LTD",
    "CATEGORY":"Shopping",
    "AMOUNT":"$53"
  },
  {
    "DATE":"4/17/2015",
    "MERCHANT":"CONTOSO, LTD",
    "CATEGORY":"Shopping",
    "AMOUNT":"$51"
  },
  {
    "DATE":"4/18/2015",
    "MERCHANT":"CONTOSO, LTD",
    "CATEGORY":"Shopping",
    "AMOUNT":"$94"
  },
  {
    "DATE":"4/18/2015",
    "MERCHANT":"CONTOSO, LTD",
    "CATEGORY":"Shopping",
    "AMOUNT":"$25"
  },
  {
    "DATE":"4/19/2015",
    "MERCHANT":"THE PHONE COMPANY",
    "CATEGORY":"Communications",
    "AMOUNT":"$126"
  },
  {
    "DATE":"4/19/2015",
    "MERCHANT":"PROSEWARE, INC",
    "CATEGORY":"Shopping",
    "AMOUNT":"$384"
  },
  {
    "DATE":"4/19/2015",
    "MERCHANT":"BEST FOR YOU ORGANICS",
    "CATEGORY":"Groceries",
    "AMOUNT":"$18"
  },
  {
    "DATE":"4/19/2015",
    "MERCHANT":"BEST FOR YOU ORGANICS",
    "CATEGORY":"Groceries",
    "AMOUNT":"$78"
  },
  {
    "DATE":"4/20/2015",
    "MERCHANT":"WIDE WORLD IMPORTERS",
    "CATEGORY":"Groceries",
    "AMOUNT":"$4"
  },
  {
    "DATE":"4/20/2015",
    "MERCHANT":"LIBERTY'S DELIGHTFUL CAFE",
    "CATEGORY":"Restaurant",
    "AMOUNT":"$53"
  },
  {
    "DATE":"4/22/2015",
    "MERCHANT":"LIBERTY BAKERY & CAFE",
    "CATEGORY":"Groceries",
    "AMOUNT":"$6"
  },
  {
    "DATE":"4/22/2015",
    "MERCHANT":"CONTOSO PHARMACEUTICALS",
    "CATEGORY":"Shopping",
    "AMOUNT":"$44"
  },
  {
    "DATE":"4/23/2015",
    "MERCHANT":"ADVENTURE WORKS CYCLES",
    "CATEGORY":"Transportation",
    "AMOUNT":"$52"
  },
  {
    "DATE":"4/23/2015",
    "MERCHANT":"MUNSON'S PICKLES AND PRESERVES FARM",
    "CATEGORY":"Groceries",
    "AMOUNT":"$46"
  },
  {
    "DATE":"4/23/2015",
    "MERCHANT":"MUNSON'S PICKLES AND PRESERVES FARM",
    "CATEGORY":"Groceries",
    "AMOUNT":"$34"
  },
  {
    "DATE":"4/24/2015",
    "MERCHANT":"ADVENTURE WORKS CYCLES",
    "CATEGORY":"Transportation",
    "AMOUNT":"$37"
  },
  {
    "DATE":"4/24/2015",
    "MERCHANT":"TREY RESEARCH",
    "CATEGORY":"Other",
    "AMOUNT":"$64"
  },
  {
    "DATE":"4/25/2015",
    "MERCHANT":"CONTOSO, LTD",
    "CATEGORY":"Shopping",
    "AMOUNT":"$67"
  },
  {
    "DATE":"4/25/2015",
    "MERCHANT":"LIBERTY'S DELIGHTFUL CAFE",
    "CATEGORY":"Restaurant",
    "AMOUNT":"$100"
  },
  {
    "DATE":"4/25/2015",
    "MERCHANT":"TREY RESEARCH",
    "CATEGORY":"Other",
    "AMOUNT":"$135"
  },
  {
    "DATE":"4/26/2015",
    "MERCHANT":"LIBERTY'S DELIGHTFUL CAFE",
    "CATEGORY":"Restaurant",
    "AMOUNT":"$95"
  },
  {
    "DATE":"4/26/2015",
    "MERCHANT":"NORTHWIND ELECTRIC CARS",
    "CATEGORY":"Transportation",
    "AMOUNT":"$39"
  },
  {
    "DATE":"4/26/2015",
    "MERCHANT":"LIBERTY'S DELIGHTFUL CAFE",
    "CATEGORY":"Restaurant",
    "AMOUNT":"$5"
  },
  {
    "DATE":"4/26/2015",
    "MERCHANT":"MARGIE'S TRAVEL",
    "CATEGORY":"Travel",
    "AMOUNT":"$246"
  },
  {
    "DATE":"4/26/2015",
    "MERCHANT":"PROSEWARE, INC",
    "CATEGORY":"Shopping",
    "AMOUNT":"$28"
  },
  {
    "DATE":"4/27/2015",
    "MERCHANT":"TREY RESEARCH",
    "CATEGORY":"Other",
    "AMOUNT":"$250"
  },
  {
    "DATE":"4/27/2015",
    "MERCHANT":"WIDE WORLD IMPORTERS",
    "CATEGORY":"Groceries",
    "AMOUNT":"$25"
  },
  {
    "DATE":"4/27/2015",
    "MERCHANT":"NORTHWIND ELECTRIC CARS",
    "CATEGORY":"Transportation",
    "AMOUNT":"$52"
  },
  {
    "DATE":"4/28/2015",
    "MERCHANT":"PROSEWARE, INC",
    "CATEGORY":"Shopping",
    "AMOUNT":"$34"
  },
  {
    "DATE":"4/29/2015",
    "MERCHANT":"PROSEWARE, INC",
    "CATEGORY":"Shopping",
    "AMOUNT":"$30"
  },
  {
    "DATE":"4/30/2015",
    "MERCHANT":"LIBERTY'S DELIGHTFUL CAFE",
    "CATEGORY":"Restaurant",
    "AMOUNT":"$22"
  },
  {
    "DATE":"4/30/2015",
    "MERCHANT":"MUNSON'S PICKLES AND PRESERVES FARM",
    "CATEGORY":"Groceries",
    "AMOUNT":"$46"
  },
  {
    "DATE":"5/1/2015",
    "MERCHANT":"THE PHONE COMPANY",
    "CATEGORY":"Communications",
    "AMOUNT":"$129"
  },
  {
    "DATE":"5/1/2015",
    "MERCHANT":"PROSEWARE, INC",
    "CATEGORY":"Shopping",
    "AMOUNT":"$138"
  },
  {
    "DATE":"5/1/2015",
    "MERCHANT":"LIBERTY'S DELIGHTFUL CAFE",
    "CATEGORY":"Restaurant",
    "AMOUNT":"$12"
  },
  {
    "DATE":"5/2/2015",
    "MERCHANT":"WIDE WORLD IMPORTERS",
    "CATEGORY":"Shopping",
    "AMOUNT":"$30"
  },
  {
    "DATE":"5/2/2015",
    "MERCHANT":"PROSEWARE, INC",
    "CATEGORY":"Shopping",
    "AMOUNT":"$23"
  },
  {
    "DATE":"5/2/2015",
    "MERCHANT":"PROSEWARE, INC",
    "CATEGORY":"Shopping",
    "AMOUNT":"$13"
  },
  {
    "DATE":"5/2/2015",
    "MERCHANT":"ADVENTURE WORKS CYCLES",
    "CATEGORY":"Transportation",
    "AMOUNT":"$53"
  },
  {
    "DATE":"5/2/2015",
    "MERCHANT":"LIBERTY'S DELIGHTFUL CAFE",
    "CATEGORY":"Restaurant",
    "AMOUNT":"$223"
  },
  {
    "DATE":"5/3/2015",
    "MERCHANT":"BEST FOR YOU ORGANICS",
    "CATEGORY":"Groceries",
    "AMOUNT":"$115"
  },
  {
    "DATE":"5/3/2015",
    "MERCHANT":"MUNSON'S PICKLES AND PRESERVES FARM",
    "CATEGORY":"Groceries",
    "AMOUNT":"$50"
  },
  {
    "DATE":"5/4/2015",
    "MERCHANT":"COHO WINERY",
    "CATEGORY":"Restaurant",
    "AMOUNT":"$43"
  },
  {
    "DATE":"5/4/2015",
    "MERCHANT":"BELLOWS COLLEGE",
    "CATEGORY":"Education",
    "AMOUNT":"$700"
  },
  {
    "DATE":"5/5/2015",
    "MERCHANT":"COHO WINERY",
    "CATEGORY":"Restaurant",
    "AMOUNT":"$9"
  },
  {
    "DATE":"5/6/2015",
    "MERCHANT":"COHO VINEYARD",
    "CATEGORY":"Restaurant",
    "AMOUNT":"$42"
  },
  {
    "DATE":"5/6/2015",
    "MERCHANT":"WIDE WORLD IMPORTERS",
    "CATEGORY":"Groceries",
    "AMOUNT":"$64"
  },
  {
    "DATE":"5/7/2015",
    "MERCHANT":"MARGIE'S TRAVEL",
    "CATEGORY":"Travel",
    "AMOUNT":"$176"
  },
  {
    "DATE":"5/7/2015",
    "MERCHANT":"MARGIE'S TRAVEL",
    "CATEGORY":"Travel",
    "AMOUNT":"$176"
  },
  {
    "DATE":"5/7/2015",
    "MERCHANT":"MARGIE'S TRAVEL",
    "CATEGORY":"Travel",
    "AMOUNT":"$176"
  },
  {
    "DATE":"5/7/2015",
    "MERCHANT":"MARGIE'S TRAVEL",
    "CATEGORY":"Travel",
    "AMOUNT":"$176"
  },
  {
    "DATE":"5/7/2015",
    "MERCHANT":"MARGIE'S TRAVEL",
    "CATEGORY":"Travel",
    "AMOUNT":"$176"
  },
  {
    "DATE":"5/7/2015",
    "MERCHANT":"MARGIE'S TRAVEL",
    "CATEGORY":"Travel",
    "AMOUNT":"$176"
  },
  {
    "DATE":"5/7/2015",
    "MERCHANT":"WIDE WORLD IMPORTERS",
    "CATEGORY":"Groceries",
    "AMOUNT":"$37"
  },
  {
    "DATE":"5/8/2015",
    "MERCHANT":"NORTHWIND ELECTRIC CARS",
    "CATEGORY":"Transportation",
    "AMOUNT":"$51"
  },
  {
    "DATE":"5/8/2015",
    "MERCHANT":"ADVENTURE WORKS CYCLES",
    "CATEGORY":"Transportation",
    "AMOUNT":"$41"
  },
  {
    "DATE":"5/9/2015",
    "MERCHANT":"WIDE WORLD IMPORTERS",
    "CATEGORY":"Groceries",
    "AMOUNT":"$51"
  },
  {
    "DATE":"5/10/2015",
    "MERCHANT":"SOUTHRIDGE VIDEO",
    "CATEGORY":"Entertainment",
    "AMOUNT":"$23"
  },
  {
    "DATE":"5/10/2015",
    "MERCHANT":"LIBERTY'S DELIGHTFUL CAFE",
    "CATEGORY":"Restaurant",
    "AMOUNT":"$25"
  },
  {
    "DATE":"5/10/2015",
    "MERCHANT":"LIBERTY'S DELIGHTFUL CAFE",
    "CATEGORY":"Restaurant",
    "AMOUNT":"$31"
  },
  {
    "DATE":"5/10/2015",
    "MERCHANT":"PROSEWARE, INC",
    "CATEGORY":"Shopping",
    "AMOUNT":"$54"
  },
  {
    "DATE":"5/10/2015",
    "MERCHANT":"PROSEWARE, INC",
    "CATEGORY":"Shopping",
    "AMOUNT":"$291"
  },
  {
    "DATE":"5/10/2015",
    "MERCHANT":"LIBERTY'S DELIGHTFUL CAFE",
    "CATEGORY":"Restaurant",
    "AMOUNT":"$115"
  },
  {
    "DATE":"5/11/2015",
    "MERCHANT":"MARGIE'S TRAVEL",
    "CATEGORY":"Travel",
    "AMOUNT":"$774"
  },
  {
    "DATE":"5/12/2015",
    "MERCHANT":"LIBERTY'S DELIGHTFUL CAFE",
    "CATEGORY":"Restaurant",
    "AMOUNT":"$22"
  },
  {
    "DATE":"5/12/2015",
    "MERCHANT":"BEST FOR YOU ORGANICS",
    "CATEGORY":"Groceries",
    "AMOUNT":"$51"
  },
  {
    "DATE":"5/14/2015",
    "MERCHANT":"CONTOSO, LTD",
    "CATEGORY":"Shopping",
    "AMOUNT":"$136"
  },
  {
    "DATE":"5/14/2015",
    "MERCHANT":"NORTHWIND ELECTRIC CARS",
    "CATEGORY":"Transportation",
    "AMOUNT":"$50"
  },
  {
    "DATE":"5/14/2015",
    "MERCHANT":"WIDE WORLD IMPORTERSS",
    "CATEGORY":"Shopping",
    "AMOUNT":"$8"
  },
  {
    "DATE":"5/15/2015",
    "MERCHANT":"BEST FOR YOU ORGANICS",
    "CATEGORY":"Groceries",
    "AMOUNT":"$43"
  },
  {
    "DATE":"5/15/2015",
    "MERCHANT":"LIBERTY BAKERY & CAFE",
    "CATEGORY":"Groceries",
    "AMOUNT":"$65"
  },
  {
    "DATE":"5/15/2015",
    "MERCHANT":"PROSEWARE, INC",
    "CATEGORY":"Shopping",
    "AMOUNT":"$56"
  },
  {
    "DATE":"5/16/2015",
    "MERCHANT":"CONTOSO, LTD",
    "CATEGORY":"Shopping",
    "AMOUNT":"$216"
  },
  {
    "DATE":"5/16/2015",
    "MERCHANT":"CONTOSO, LTD",
    "CATEGORY":"Shopping",
    "AMOUNT":"$982"
  },
  {
    "DATE":"5/16/2015",
    "MERCHANT":"CONTOSO PHARMACEUTICALS",
    "CATEGORY":"Shopping",
    "AMOUNT":"$16"
  },
  {
    "DATE":"5/16/2015",
    "MERCHANT":"PROSEWARE, INC",
    "CATEGORY":"Shopping",
    "AMOUNT":"$23"
  },
  {
    "DATE":"5/17/2015",
    "MERCHANT":"PROSEWARE, INC",
    "CATEGORY":"Shopping",
    "AMOUNT":"$259"
  },
  {
    "DATE":"5/17/2015",
    "MERCHANT":"PROSEWARE, INC",
    "CATEGORY":"Shopping",
    "AMOUNT":"$117"
  },
  {
    "DATE":"5/18/2015",
    "MERCHANT":"LIBERTY BAKERY & CAFE",
    "CATEGORY":"Groceries",
    "AMOUNT":"$113"
  },
  {
    "DATE":"5/19/2015",
    "MERCHANT":"CONTOSO, LTD",
    "CATEGORY":"Shopping",
    "AMOUNT":"$219"
  },
  {
    "DATE":"5/19/2015",
    "MERCHANT":"COHO WINERY",
    "CATEGORY":"Restaurant",
    "AMOUNT":"$7"
  },
  {
    "DATE":"5/19/2015",
    "MERCHANT":"NORTHWIND ELECTRIC CARS",
    "CATEGORY":"Transportation",
    "AMOUNT":"$41"
  },
  {
    "DATE":"5/19/2015",
    "MERCHANT":"COHO WINERY",
    "CATEGORY":"Restaurant",
    "AMOUNT":"$11"
  },
  {
    "DATE":"5/19/2015",
    "MERCHANT":"COHO WINERY",
    "CATEGORY":"Restaurant",
    "AMOUNT":"$11"
  },
  {
    "DATE":"5/20/2015",
    "MERCHANT":"THE PHONE COMPANY",
    "CATEGORY":"Communications",
    "AMOUNT":"$126"
  },
  {
    "DATE":"5/20/2015",
    "MERCHANT":"NORTHWIND ELECTRIC CARS",
    "CATEGORY":"Transportation",
    "AMOUNT":"$48"
  },
  {
    "DATE":"5/20/2015",
    "MERCHANT":"PROSEWARE, INC",
    "CATEGORY":"Shopping",
    "AMOUNT":"$13"
  },
  {
    "DATE":"5/20/2015",
    "MERCHANT":"COHO WINERY",
    "CATEGORY":"Restaurant",
    "AMOUNT":"$9"
  },
  {
    "DATE":"5/20/2015",
    "MERCHANT":"MUNSON'S PICKLES AND PRESERVES FARM",
    "CATEGORY":"Groceries",
    "AMOUNT":"$6"
  },
  {
    "DATE":"5/21/2015",
    "MERCHANT":"PROSEWARE, INC",
    "CATEGORY":"Shopping",
    "AMOUNT":"$476"
  },
  {
    "DATE":"5/22/2015",
    "MERCHANT":"BEST FOR YOU ORGANICS",
    "CATEGORY":"Groceries",
    "AMOUNT":"$49"
  },
  {
    "DATE":"5/22/2015",
    "MERCHANT":"MUNSON'S PICKLES AND PRESERVES FARM",
    "CATEGORY":"Groceries",
    "AMOUNT":"$60"
  },
  {
    "DATE":"5/23/2015",
    "MERCHANT":"WIDE WORLD IMPORTERS",
    "CATEGORY":"Groceries",
    "AMOUNT":"$7"
  },
  {
    "DATE":"5/23/2015",
    "MERCHANT":"WIDE WORLD IMPORTERS",
    "CATEGORY":"Groceries",
    "AMOUNT":"$11"
  },
  {
    "DATE":"5/24/2015",
    "MERCHANT":"LIBERTY'S DELIGHTFUL CAFE",
    "CATEGORY":"Restaurant",
    "AMOUNT":"$37"
  },
  {
    "DATE":"5/25/2015",
    "MERCHANT":"LIBERTY'S DELIGHTFUL CAFE",
    "CATEGORY":"Restaurant",
    "AMOUNT":"$42"
  },
  {
    "DATE":"5/25/2015",
    "MERCHANT":"TREY RESEARCH",
    "CATEGORY":"Other",
    "AMOUNT":"$135"
  },
  {
    "DATE":"5/26/2015",
    "MERCHANT":"BEST FOR YOU ORGANICS",
    "CATEGORY":"Groceries",
    "AMOUNT":"$61"
  },
  {
    "DATE":"5/27/2015",
    "MERCHANT":"ADVENTURE WORKS CYCLES",
    "CATEGORY":"Transportation",
    "AMOUNT":"$42"
  },
  {
    "DATE":"5/28/2015",
    "MERCHANT":"BEST FOR YOU ORGANICS",
    "CATEGORY":"Groceries",
    "AMOUNT":"$2"
  },
  {
    "DATE":"5/28/2015",
    "MERCHANT":"MARGIE'S TRAVEL",
    "CATEGORY":"Travel",
    "AMOUNT":"$84"
  },
  {
    "DATE":"5/29/2015",
    "MERCHANT":"WIDE WORLD IMPORTERS",
    "CATEGORY":"Groceries",
    "AMOUNT":"$45"
  },
  {
    "DATE":"5/30/2015",
    "MERCHANT":"MARGIE'S TRAVEL",
    "CATEGORY":"Travel",
    "AMOUNT":"$183"
  },
  {
    "DATE":"5/31/2015",
    "MERCHANT":"PROSEWARE, INC",
    "CATEGORY":"Shopping",
    "AMOUNT":"$56"
  },
  {
    "DATE":"6/1/2015",
    "MERCHANT":"THE PHONE COMPANY",
    "CATEGORY":"Communications",
    "AMOUNT":"$152"
  },
  {
    "DATE":"6/1/2015",
    "MERCHANT":"BELLOWS COLLEGE",
    "CATEGORY":"Education",
    "AMOUNT":"$350"
  },
  {
    "DATE":"6/4/2015",
    "MERCHANT":"NORTHWIND ELECTRIC CARS",
    "CATEGORY":"Transportation",
    "AMOUNT":"$42"
  },
  {
    "DATE":"6/4/2015",
    "MERCHANT":"PROSEWARE, INC",
    "CATEGORY":"Shopping",
    "AMOUNT":"$2"
  },
  {
    "DATE":"6/4/2015",
    "MERCHANT":"MUNSON'S PICKLES AND PRESERVES FARM",
    "CATEGORY":"Groceries",
    "AMOUNT":"$108"
  },
  {
    "DATE":"6/5/2015",
    "MERCHANT":"MARGIE'S TRAVEL",
    "CATEGORY":"Travel",
    "AMOUNT":"$774"
  },
  {
    "DATE":"6/5/2015",
    "MERCHANT":"COHO WINERY",
    "CATEGORY":"Restaurant",
    "AMOUNT":"$9"
  },
  {
    "DATE":"6/6/2015",
    "MERCHANT":"PROSEWARE, INC",
    "CATEGORY":"Shopping",
    "AMOUNT":"$58"
  },
  {
    "DATE":"6/6/2015",
    "MERCHANT":"LIBERTY'S DELIGHTFUL CAFE",
    "CATEGORY":"Restaurant",
    "AMOUNT":"$45"
  },
  {
    "DATE":"6/8/2015",
    "MERCHANT":"PROSEWARE, INC",
    "CATEGORY":"Shopping",
    "AMOUNT":"$110"
  },
  {
    "DATE":"6/8/2015",
    "MERCHANT":"LIBERTY BAKERY & CAFE",
    "CATEGORY":"Groceries",
    "AMOUNT":"$62"
  },
  {
    "DATE":"6/8/2015",
    "MERCHANT":"LIBERTY'S DELIGHTFUL CAFE",
    "CATEGORY":"Restaurant",
    "AMOUNT":"$25"
  },
  {
    "DATE":"6/9/2015",
    "MERCHANT":"COHO WINERY",
    "CATEGORY":"Restaurant",
    "AMOUNT":"$27"
  },
  {
    "DATE":"6/10/2015",
    "MERCHANT":"BEST FOR YOU ORGANICS COMPANY",
    "CATEGORY":"Groceries",
    "AMOUNT":"$27"
  },
  {
    "DATE":"6/11/2015",
    "MERCHANT":"WIDE WORLD IMPORTERS",
    "CATEGORY":"Groceries",
    "AMOUNT":"$16"
  },
  {
    "DATE":"6/11/2015",
    "MERCHANT":"NORTHWIND ELECTRIC CARS",
    "CATEGORY":"Transportation",
    "AMOUNT":"$61"
  },
  {
    "DATE":"6/13/2015",
    "MERCHANT":"LIBERTY'S DELIGHTFUL CAFE",
    "CATEGORY":"Restaurant",
    "AMOUNT":"$9"
  },
  {
    "DATE":"6/13/2015",
    "MERCHANT":"COHO VINEYARD",
    "CATEGORY":"Restaurant",
    "AMOUNT":"$84"
  },
  {
    "DATE":"6/14/2015",
    "MERCHANT":"ADVENTURE WORKS CYCLES",
    "CATEGORY":"Transportation",
    "AMOUNT":"$42"
  },
  {
    "DATE":"6/15/2015",
    "MERCHANT":"WIDE WORLD IMPORTERS",
    "CATEGORY":"Groceries",
    "AMOUNT":"$71"
  },
  {
    "DATE":"6/17/2015",
    "MERCHANT":"CONTOSO, LTD",
    "CATEGORY":"Shopping",
    "AMOUNT":"$57"
  },
  {
    "DATE":"6/18/2015",
    "MERCHANT":"CONTOSO, LTD",
    "CATEGORY":"Shopping",
    "AMOUNT":"$12"
  },
  {
    "DATE":"6/19/2015",
    "MERCHANT":"THE PHONE COMPANY",
    "CATEGORY":"Communications",
    "AMOUNT":"$126"
  },
  {
    "DATE":"6/19/2015",
    "MERCHANT":"LIBERTY BAKERY & CAFE",
    "CATEGORY":"Groceries",
    "AMOUNT":"$150"
  },
  {
    "DATE":"6/20/2015",
    "MERCHANT":"SOUTHRIDGE VIDEO",
    "CATEGORY":"Entertainment",
    "AMOUNT":"$30"
  },
  {
    "DATE":"6/20/2015",
    "MERCHANT":"ADVENTURE WORKS CYCLES",
    "CATEGORY":"Transportation",
    "AMOUNT":"$55"
  },
  {
    "DATE":"6/22/2015",
    "MERCHANT":"CONTOSO, LTD",
    "CATEGORY":"Shopping",
    "AMOUNT":"$181"
  },
  {
    "DATE":"6/22/2015",
    "MERCHANT":"CONTOSO, LTD",
    "CATEGORY":"Shopping",
    "AMOUNT":"$181"
  },
  {
    "DATE":"6/22/2015",
    "MERCHANT":"CONTOSO, LTD",
    "CATEGORY":"Shopping",
    "AMOUNT":"$181"
  },
  {
    "DATE":"6/22/2015",
    "MERCHANT":"COHO VINEYARD",
    "CATEGORY":"Restaurant",
    "AMOUNT":"$36"
  },
  {
    "DATE":"6/24/2015",
    "MERCHANT":"WIDE WORLD IMPORTERS",
    "CATEGORY":"Groceries",
    "AMOUNT":"$37"
  },
  {
    "DATE":"6/24/2015",
    "MERCHANT":"ADVENTURE WORKS CYCLES",
    "CATEGORY":"Transportation",
    "AMOUNT":"$43"
  },
  {
    "DATE":"6/25/2015",
    "MERCHANT":"PROSEWARE, INC",
    "CATEGORY":"Shopping",
    "AMOUNT":"$143"
  },
  {
    "DATE":"6/25/2015",
    "MERCHANT":"WIDE WORLD IMPORTERS",
    "CATEGORY":"Groceries",
    "AMOUNT":"$62"
  },
  {
    "DATE":"6/25/2015",
    "MERCHANT":"TREY RESEARCH",
    "CATEGORY":"Other",
    "AMOUNT":"$135"
  },
  {
    "DATE":"6/27/2015",
    "MERCHANT":"CONTOSO, LTD",
    "CATEGORY":"Shopping",
    "AMOUNT":"$18"
  },
  {
    "DATE":"6/27/2015",
    "MERCHANT":"CONTOSO, LTD",
    "CATEGORY":"Shopping",
    "AMOUNT":"$33"
  },
  {
    "DATE":"6/27/2015",
    "MERCHANT":"CONTOSO, LTD",
    "CATEGORY":"Shopping",
    "AMOUNT":"$37"
  },
  {
    "DATE":"6/27/2015",
    "MERCHANT":"ADVENTURE WORKS CYCLES",
    "CATEGORY":"Transportation",
    "AMOUNT":"$62"
  },
  {
    "DATE":"6/30/2015",
    "MERCHANT":"PROSEWARE, INC",
    "CATEGORY":"Shopping",
    "AMOUNT":"$255"
  },
  {
    "DATE":"6/30/2015",
    "MERCHANT":"BEST FOR YOU ORGANICS COMPANY",
    "CATEGORY":"Groceries",
    "AMOUNT":"$62"
  },
  {
    "DATE":"7/1/2015",
    "MERCHANT":"MARGIE'S TRAVEL",
    "CATEGORY":"Travel",
    "AMOUNT":"$50"
  },
  {
    "DATE":"7/1/2015",
    "MERCHANT":"THE PHONE COMPANY",
    "CATEGORY":"Communications",
    "AMOUNT":"$258"
  },
  {
    "DATE":"7/2/2015",
    "MERCHANT":"LIBERTY'S DELIGHTFUL CAFE",
    "CATEGORY":"Restaurant",
    "AMOUNT":"$137"
  },
  {
    "DATE":"7/2/2015",
    "MERCHANT":"LIBERTY'S DELIGHTFUL CAFE",
    "CATEGORY":"Restaurant",
    "AMOUNT":"$9"
  },
  {
    "DATE":"7/2/2015",
    "MERCHANT":"BEST FOR YOU ORGANICS",
    "CATEGORY":"Groceries",
    "AMOUNT":"$11"
  },
  {
    "DATE":"7/2/2015",
    "MERCHANT":"BEST FOR YOU ORGANICS",
    "CATEGORY":"Groceries",
    "AMOUNT":"$28"
  },
  {
    "DATE":"7/2/2015",
    "MERCHANT":"LIBERTY'S DELIGHTFUL CAFE",
    "CATEGORY":"Restaurant",
    "AMOUNT":"$86"
  },
  {
    "DATE":"7/3/2015",
    "MERCHANT":"LIBERTY'S DELIGHTFUL CAFE",
    "CATEGORY":"Restaurant",
    "AMOUNT":"$77"
  },
  {
    "DATE":"7/3/2015",
    "MERCHANT":"NORTHWIND ELECTRIC CARS",
    "CATEGORY":"Transportation",
    "AMOUNT":"$43"
  },
  {
    "DATE":"7/3/2015",
    "MERCHANT":"WIDE WORLD IMPORTERS",
    "CATEGORY":"Groceries",
    "AMOUNT":"$89"
  },
  {
    "DATE":"7/4/2015",
    "MERCHANT":"MARGIE'S TRAVEL",
    "CATEGORY":"Travel",
    "AMOUNT":"$45"
  },
  {
    "DATE":"7/4/2015",
    "MERCHANT":"MARGIE'S TRAVEL",
    "CATEGORY":"Travel",
    "AMOUNT":"$45"
  },
  {
    "DATE":"7/4/2015",
    "MERCHANT":"NORTHWIND ELECTRIC CARS",
    "CATEGORY":"Transportation",
    "AMOUNT":"$48"
  },
  {
    "DATE":"7/4/2015",
    "MERCHANT":"LIBERTY'S DELIGHTFUL CAFE",
    "CATEGORY":"Restaurant",
    "AMOUNT":"$13"
  },
  {
    "DATE":"7/4/2015",
    "MERCHANT":"LIBERTY'S DELIGHTFUL CAFE",
    "CATEGORY":"Restaurant",
    "AMOUNT":"$73"
  },
  {
    "DATE":"7/5/2015",
    "MERCHANT":"LIBERTY'S DELIGHTFUL CAFE",
    "CATEGORY":"Restaurant",
    "AMOUNT":"$24"
  },
  {
    "DATE":"7/5/2015",
    "MERCHANT":"LIBERTY'S DELIGHTFUL CAFE",
    "CATEGORY":"Restaurant",
    "AMOUNT":"$16"
  },
  {
    "DATE":"7/5/2015",
    "MERCHANT":"LIBERTY'S DELIGHTFUL CAFE",
    "CATEGORY":"Restaurant",
    "AMOUNT":"$10"
  },
  {
    "DATE":"7/5/2015",
    "MERCHANT":"LIBERTY'S DELIGHTFUL CAFE",
    "CATEGORY":"Restaurant",
    "AMOUNT":"$128"
  },
  {
    "DATE":"7/6/2015",
    "MERCHANT":"NORTHWIND ELECTRIC CARS",
    "CATEGORY":"Transportation",
    "AMOUNT":"$44"
  },
  {
    "DATE":"7/6/2015",
    "MERCHANT":"NORTHWIND ELECTRIC CARS",
    "CATEGORY":"Transportation",
    "AMOUNT":"$46"
  },
  {
    "DATE":"7/6/2015",
    "MERCHANT":"BEST FOR YOU ORGANICS",
    "CATEGORY":"Groceries",
    "AMOUNT":"$27"
  },
  {
    "DATE":"7/6/2015",
    "MERCHANT":"PROSEWARE, INC",
    "CATEGORY":"Shopping",
    "AMOUNT":"$66"
  },
  {
    "DATE":"7/6/2015",
    "MERCHANT":"BEST FOR YOU ORGANICS",
    "CATEGORY":"Groceries",
    "AMOUNT":"$8"
  },
  {
    "DATE":"7/8/2015",
    "MERCHANT":"LIBERTY'S DELIGHTFUL CAFE",
    "CATEGORY":"Restaurant",
    "AMOUNT":"$8"
  },
  {
    "DATE":"7/8/2015",
    "MERCHANT":"LIBERTY'S DELIGHTFUL CAFE",
    "CATEGORY":"Restaurant",
    "AMOUNT":"$5"
  },
  {
    "DATE":"7/8/2015",
    "MERCHANT":"LIBERTY'S DELIGHTFUL CAFE",
    "CATEGORY":"Restaurant",
    "AMOUNT":"$24"
  },
  {
    "DATE":"7/8/2015",
    "MERCHANT":"LIBERTY'S DELIGHTFUL CAFE",
    "CATEGORY":"Restaurant",
    "AMOUNT":"$4"
  },
  {
    "DATE":"7/8/2015",
    "MERCHANT":"LIBERTY'S DELIGHTFUL CAFE",
    "CATEGORY":"Restaurant",
    "AMOUNT":"$27"
  },
  {
    "DATE":"7/9/2015",
    "MERCHANT":"LIBERTY'S DELIGHTFUL CAFE",
    "CATEGORY":"Restaurant",
    "AMOUNT":"$8"
  },
  {
    "DATE":"7/9/2015",
    "MERCHANT":"LIBERTY'S DELIGHTFUL CAFE",
    "CATEGORY":"Restaurant",
    "AMOUNT":"$32"
  },
  {
    "DATE":"7/9/2015",
    "MERCHANT":"BEST FOR YOU ORGANICS",
    "CATEGORY":"Groceries",
    "AMOUNT":"$8"
  },
  {
    "DATE":"7/9/2015",
    "MERCHANT":"BEST FOR YOU ORGANICS",
    "CATEGORY":"Groceries",
    "AMOUNT":"$18"
  },
  {
    "DATE":"7/9/2015",
    "MERCHANT":"LIBERTY'S DELIGHTFUL CAFE",
    "CATEGORY":"Restaurant",
    "AMOUNT":"$6"
  },
  {
    "DATE":"7/9/2015",
    "MERCHANT":"LIBERTY'S DELIGHTFUL CAFE",
    "CATEGORY":"Restaurant",
    "AMOUNT":"$6"
  },
  {
    "DATE":"7/9/2015",
    "MERCHANT":"LIBERTY'S DELIGHTFUL CAFE",
    "CATEGORY":"Restaurant",
    "AMOUNT":"$3"
  },
  {
    "DATE":"7/9/2015",
    "MERCHANT":"LIBERTY'S DELIGHTFUL CAFE",
    "CATEGORY":"Restaurant",
    "AMOUNT":"$12"
  },
  {
    "DATE":"7/9/2015",
    "MERCHANT":"LIBERTY'S DELIGHTFUL CAFE",
    "CATEGORY":"Restaurant",
    "AMOUNT":"$6"
  },
  {
    "DATE":"7/9/2015",
    "MERCHANT":"LIBERTY'S DELIGHTFUL CAFE",
    "CATEGORY":"Restaurant",
    "AMOUNT":"$8"
  },
  {
    "DATE":"7/9/2015",
    "MERCHANT":"LIBERTY'S DELIGHTFUL CAFE",
    "CATEGORY":"Restaurant",
    "AMOUNT":"$22"
  },
  {
    "DATE":"7/9/2015",
    "MERCHANT":"LIBERTY'S DELIGHTFUL CAFE",
    "CATEGORY":"Restaurant",
    "AMOUNT":"$6"
  },
  {
    "DATE":"7/9/2015",
    "MERCHANT":"LIBERTY'S DELIGHTFUL CAFE",
    "CATEGORY":"Restaurant",
    "AMOUNT":"$23"
  },
  {
    "DATE":"7/9/2015",
    "MERCHANT":"LIBERTY'S DELIGHTFUL CAFE",
    "CATEGORY":"Restaurant",
    "AMOUNT":"$4"
  },
  {
    "DATE":"7/9/2015",
    "MERCHANT":"LIBERTY'S DELIGHTFUL CAFE",
    "CATEGORY":"Restaurant",
    "AMOUNT":"$7"
  },
  {
    "DATE":"7/9/2015",
    "MERCHANT":"LIBERTY'S DELIGHTFUL CAFE",
    "CATEGORY":"Restaurant",
    "AMOUNT":"$9"
  },
  {
    "DATE":"7/10/2015",
    "MERCHANT":"LIBERTY'S DELIGHTFUL CAFE",
    "CATEGORY":"Restaurant",
    "AMOUNT":"$92"
  },
  {
    "DATE":"7/10/2015",
    "MERCHANT":"LIBERTY'S DELIGHTFUL CAFE",
    "CATEGORY":"Restaurant",
    "AMOUNT":"$21"
  },
  {
    "DATE":"7/10/2015",
    "MERCHANT":"LIBERTY'S DELIGHTFUL CAFE",
    "CATEGORY":"Restaurant",
    "AMOUNT":"$43"
  },
  {
    "DATE":"7/11/2015",
    "MERCHANT":"LIBERTY'S DELIGHTFUL CAFE",
    "CATEGORY":"Restaurant",
    "AMOUNT":"$8"
  },
  {
    "DATE":"7/11/2015",
    "MERCHANT":"LIBERTY'S DELIGHTFUL CAFE",
    "CATEGORY":"Restaurant",
    "AMOUNT":"$8"
  },
  {
    "DATE":"7/11/2015",
    "MERCHANT":"LIBERTY'S DELIGHTFUL CAFE",
    "CATEGORY":"Restaurant",
    "AMOUNT":"$4"
  },
  {
    "DATE":"7/11/2015",
    "MERCHANT":"LIBERTY'S DELIGHTFUL CAFE",
    "CATEGORY":"Restaurant",
    "AMOUNT":"$8"
  },
  {
    "DATE":"7/11/2015",
    "MERCHANT":"LIBERTY'S DELIGHTFUL CAFE",
    "CATEGORY":"Restaurant",
    "AMOUNT":"$55"
  },
  {
    "DATE":"7/11/2015",
    "MERCHANT":"LIBERTY'S DELIGHTFUL CAFE",
    "CATEGORY":"Restaurant",
    "AMOUNT":"$11"
  },
  {
    "DATE":"7/11/2015",
    "MERCHANT":"LIBERTY'S DELIGHTFUL CAFE",
    "CATEGORY":"Restaurant",
    "AMOUNT":"$16"
  },
  {
    "DATE":"7/11/2015",
    "MERCHANT":"LIBERTY'S DELIGHTFUL CAFE",
    "CATEGORY":"Restaurant",
    "AMOUNT":"$15"
  },
  {
    "DATE":"7/12/2015",
    "MERCHANT":"NORTHWIND ELECTRIC CARS",
    "CATEGORY":"Transportation",
    "AMOUNT":"$57"
  },
  {
    "DATE":"7/12/2015",
    "MERCHANT":"LIBERTY'S DELIGHTFUL CAFE",
    "CATEGORY":"Restaurant",
    "AMOUNT":"$84"
  },
  {
    "DATE":"7/13/2015",
    "MERCHANT":"LIBERTY'S DELIGHTFUL CAFE",
    "CATEGORY":"Restaurant",
    "AMOUNT":"$56"
  },
  {
    "DATE":"7/14/2015",
    "MERCHANT":"MARGIE'S TRAVEL",
    "CATEGORY":"Travel",
    "AMOUNT":"$50"
  },
  {
    "DATE":"7/14/2015",
    "MERCHANT":"MARGIE'S TRAVEL",
    "CATEGORY":"Travel",
    "AMOUNT":"$1187"
  },
  {
    "DATE":"7/14/2015",
    "MERCHANT":"LIBERTY'S DELIGHTFUL CAFE",
    "CATEGORY":"Restaurant",
    "AMOUNT":"$106"
  },
  {
    "DATE":"7/14/2015",
    "MERCHANT":"BEST FOR YOU ORGANICS",
    "CATEGORY":"Groceries",
    "AMOUNT":"$3"
  },
  {
    "DATE":"7/14/2015",
    "MERCHANT":"BEST FOR YOU ORGANICS",
    "CATEGORY":"Groceries",
    "AMOUNT":"$64"
  },
  {
    "DATE":"7/14/2015",
    "MERCHANT":"ADVENTURE WORKS CYCLES",
    "CATEGORY":"Transportation",
    "AMOUNT":"$48"
  },
  {
    "DATE":"7/15/2015",
    "MERCHANT":"MARGIE'S TRAVEL",
    "CATEGORY":"Travel",
    "AMOUNT":"$14"
  },
  {
    "DATE":"7/15/2015",
    "MERCHANT":"MARGIE'S TRAVEL",
    "CATEGORY":"Travel",
    "AMOUNT":"$154"
  },
  {
    "DATE":"7/16/2015",
    "MERCHANT":"PROSEWARE, INC",
    "CATEGORY":"Shopping",
    "AMOUNT":"$324"
  },
  {
    "DATE":"7/16/2015",
    "MERCHANT":"WIDE WORLD IMPORTERS",
    "CATEGORY":"Groceries",
    "AMOUNT":"$14"
  },
  {
    "DATE":"7/17/2015",
    "MERCHANT":"WIDE WORLD IMPORTERS",
    "CATEGORY":"Groceries",
    "AMOUNT":"$200"
  },
  {
    "DATE":"7/17/2015",
    "MERCHANT":"WIDE WORLD IMPORTERS",
    "CATEGORY":"Transportation",
    "AMOUNT":"$43"
  },
  {
    "DATE":"7/19/2015",
    "MERCHANT":"CONTOSO PHARMACEUTICALS",
    "CATEGORY":"Shopping",
    "AMOUNT":"$73"
  },
  {
    "DATE":"7/20/2015",
    "MERCHANT":"THE PHONE COMPANY",
    "CATEGORY":"Communications",
    "AMOUNT":"$126"
  },
  {
    "DATE":"7/20/2015",
    "MERCHANT":"WIDE WORLD IMPORTERS",
    "CATEGORY":"Shopping",
    "AMOUNT":"$30"
  },
  {
    "DATE":"7/20/2015",
    "MERCHANT":"MARGIE'S TRAVEL",
    "CATEGORY":"Travel",
    "AMOUNT":"$136"
  },
  {
    "DATE":"7/20/2015",
    "MERCHANT":"MUNSON'S PICKLES AND PRESERVES FARM",
    "CATEGORY":"Groceries",
    "AMOUNT":"$45"
  },
  {
    "DATE":"7/20/2015",
    "MERCHANT":"MARGIE'S TRAVEL",
    "CATEGORY":"Travel",
    "AMOUNT":"$87"
  },
  {
    "DATE":"7/21/2015",
    "MERCHANT":"CONTOSO, LTD",
    "CATEGORY":"Shopping",
    "AMOUNT":"$12"
  },
  {
    "DATE":"7/21/2015",
    "MERCHANT":"CONTOSO, LTD",
    "CATEGORY":"Entertainment",
    "AMOUNT":"$21"
  },
  {
    "DATE":"7/22/2015",
    "MERCHANT":"CONTOSO, LTD",
    "CATEGORY":"Shopping",
    "AMOUNT":"$12"
  },
  {
    "DATE":"7/22/2015",
    "MERCHANT":"CONTOSO, LTD",
    "CATEGORY":"Shopping",
    "AMOUNT":"$15"
  },
  {
    "DATE":"7/22/2015",
    "MERCHANT":"CONTOSO, LTD",
    "CATEGORY":"Shopping",
    "AMOUNT":"$15"
  },
  {
    "DATE":"7/22/2015",
    "MERCHANT":"NORTHWIND ELECTRIC CARS",
    "CATEGORY":"Transportation",
    "AMOUNT":"$39"
  },
  {
    "DATE":"7/22/2015",
    "MERCHANT":"BEST FOR YOU ORGANICS COMPANY",
    "CATEGORY":"Groceries",
    "AMOUNT":"$37"
  },
  {
    "DATE":"7/23/2015",
    "MERCHANT":"BEST FOR YOU ORGANICS",
    "CATEGORY":"Groceries",
    "AMOUNT":"$87"
  },
  {
    "DATE":"7/23/2015",
    "MERCHANT":"BEST FOR YOU ORGANICS",
    "CATEGORY":"Groceries",
    "AMOUNT":"$167"
  },
  {
    "DATE":"7/23/2015",
    "MERCHANT":"NORTHWIND ELECTRIC CARS",
    "CATEGORY":"Transportation",
    "AMOUNT":"$57"
  },
  {
    "DATE":"7/24/2015",
    "MERCHANT":"BELLOWS COLLEGE",
    "CATEGORY":"Education",
    "AMOUNT":"$148"
  },
  {
    "DATE":"7/24/2015",
    "MERCHANT":"WIDE WORLD IMPORTERSS",
    "CATEGORY":"Shopping",
    "AMOUNT":"$11"
  },
  {
    "DATE":"7/25/2015",
    "MERCHANT":"PROSEWARE, INC",
    "CATEGORY":"Shopping",
    "AMOUNT":"$4"
  },
  {
    "DATE":"7/25/2015",
    "MERCHANT":"PROSEWARE, INC",
    "CATEGORY":"Shopping",
    "AMOUNT":"$82"
  },
  {
    "DATE":"7/25/2015",
    "MERCHANT":"LIBERTY'S DELIGHTFUL CAFE",
    "CATEGORY":"Restaurant",
    "AMOUNT":"$77"
  },
  {
    "DATE":"7/25/2015",
    "MERCHANT":"BEST FOR YOU ORGANICS",
    "CATEGORY":"Groceries",
    "AMOUNT":"$123"
  },
  {
    "DATE":"7/25/2015",
    "MERCHANT":"BEST FOR YOU ORGANICS",
    "CATEGORY":"Groceries",
    "AMOUNT":"$12"
  },
  {
    "DATE":"7/25/2015",
    "MERCHANT":"BEST FOR YOU ORGANICS",
    "CATEGORY":"Groceries",
    "AMOUNT":"$12"
  },
  {
    "DATE":"7/25/2015",
    "MERCHANT":"TREY RESEARCH",
    "CATEGORY":"Other",
    "AMOUNT":"$135"
  },
  {
    "DATE":"7/27/2015",
    "MERCHANT":"NORTHWIND ELECTRIC CARS",
    "CATEGORY":"Transportation",
    "AMOUNT":"$723"
  },
  {
    "DATE":"7/28/2015",
    "MERCHANT":"CONTOSO, LTD",
    "CATEGORY":"Shopping",
    "AMOUNT":"$10"
  },
  {
    "DATE":"7/29/2015",
    "MERCHANT":"BEST FOR YOU ORGANICS",
    "CATEGORY":"Groceries",
    "AMOUNT":"$30"
  },
  {
    "DATE":"7/30/2015",
    "MERCHANT":"CONTOSO, LTD",
    "CATEGORY":"Shopping",
    "AMOUNT":"$16"
  },
  {
    "DATE":"7/30/2015",
    "MERCHANT":"CONTOSO, LTD",
    "CATEGORY":"Shopping",
    "AMOUNT":"$18"
  },
  {
    "DATE":"7/30/2015",
    "MERCHANT":"CONTOSO, LTD",
    "CATEGORY":"Shopping",
    "AMOUNT":"$265"
  },
  {
    "DATE":"7/30/2015",
    "MERCHANT":"THE PHONE COMPANY",
    "CATEGORY":"Communications",
    "AMOUNT":"$129"
  },
  {
    "DATE":"7/30/2015",
    "MERCHANT":"ADVENTURE WORKS CYCLES",
    "CATEGORY":"Transportation",
    "AMOUNT":"$58"
  },
  {
    "DATE":"7/31/2015",
    "MERCHANT":"A. DATUM CORPORATION",
    "CATEGORY":"Shopping",
    "AMOUNT":"$13"
  },
  {
    "DATE":"7/31/2015",
    "MERCHANT":"MUNSON'S PICKLES AND PRESERVES FARM",
    "CATEGORY":"Groceries",
    "AMOUNT":"$3"
  },
  {
    "DATE":"7/31/2015",
    "MERCHANT":"MUNSON'S PICKLES AND PRESERVES FARM",
    "CATEGORY":"Groceries",
    "AMOUNT":"$167"
  },
  {
    "DATE":"8/2/2015",
    "MERCHANT":"CONTOSO, LTD",
    "CATEGORY":"Shopping",
    "AMOUNT":"$68"
  },
  {
    "DATE":"8/2/2015",
    "MERCHANT":"CONTOSO, LTD",
    "CATEGORY":"Shopping",
    "AMOUNT":"$142"
  },
  {
    "DATE":"8/2/2015",
    "MERCHANT":"PROSEWARE, INC",
    "CATEGORY":"Shopping",
    "AMOUNT":"$55"
  },
  {
    "DATE":"8/2/2015",
    "MERCHANT":"CONTOSO, LTD",
    "CATEGORY":"Entertainment",
    "AMOUNT":"$35"
  },
  {
    "DATE":"8/3/2015",
    "MERCHANT":"CONTOSO, LTD",
    "CATEGORY":"Shopping",
    "AMOUNT":"$36"
  },
  {
    "DATE":"8/3/2015",
    "MERCHANT":"CONTOSO, LTD",
    "CATEGORY":"Shopping",
    "AMOUNT":"$109"
  },
  {
    "DATE":"8/3/2015",
    "MERCHANT":"NORTHWIND ELECTRIC CARS",
    "CATEGORY":"Transportation",
    "AMOUNT":"$4"
  },
  {
    "DATE":"8/3/2015",
    "MERCHANT":"NORTHWIND ELECTRIC CARS",
    "CATEGORY":"Transportation",
    "AMOUNT":"$43"
  },
  {
    "DATE":"8/4/2015",
    "MERCHANT":"CONTOSO, LTD",
    "CATEGORY":"Shopping",
    "AMOUNT":"$10"
  },
  {
    "DATE":"8/4/2015",
    "MERCHANT":"CONTOSO, LTD",
    "CATEGORY":"Shopping",
    "AMOUNT":"$12"
  },
  {
    "DATE":"8/4/2015",
    "MERCHANT":"CONTOSO, LTD",
    "CATEGORY":"Shopping",
    "AMOUNT":"$21"
  },
  {
    "DATE":"8/5/2015",
    "MERCHANT":"NORTHWIND ELECTRIC CARS",
    "CATEGORY":"Transportation",
    "AMOUNT":"$554"
  },
  {
    "DATE":"8/5/2015",
    "MERCHANT":"MARGIE'S TRAVEL",
    "CATEGORY":"Travel",
    "AMOUNT":"$99"
  },
  {
    "DATE":"8/5/2015",
    "MERCHANT":"MARGIE'S TRAVEL",
    "CATEGORY":"Travel",
    "AMOUNT":"$199"
  },
  {
    "DATE":"8/6/2015",
    "MERCHANT":"SCHOOL OF FINE ART",
    "CATEGORY":"Education",
    "AMOUNT":"$26"
  },
  {
    "DATE":"8/7/2015",
    "MERCHANT":"MUNSON'S PICKLES AND PRESERVES FARM",
    "CATEGORY":"Groceries",
    "AMOUNT":"$170"
  },
  {
    "DATE":"8/8/2015",
    "MERCHANT":"ADVENTURE WORKS CYCLES",
    "CATEGORY":"Transportation",
    "AMOUNT":"$54"
  },
  {
    "DATE":"8/9/2015",
    "MERCHANT":"PROSEWARE, INC",
    "CATEGORY":"Shopping",
    "AMOUNT":"$77"
  },
  {
    "DATE":"8/10/2015",
    "MERCHANT":"CONTOSO, LTD",
    "CATEGORY":"Shopping",
    "AMOUNT":"$72"
  },
  {
    "DATE":"8/14/2015",
    "MERCHANT":"WIDE WORLD IMPORTERS",
    "CATEGORY":"Groceries",
    "AMOUNT":"$65"
  },
  {
    "DATE":"8/17/2015",
    "MERCHANT":"NORTHWIND ELECTRIC CARS",
    "CATEGORY":"Transportation",
    "AMOUNT":"$40"
  },
  {
    "DATE":"8/17/2015",
    "MERCHANT":"NORTHWIND ELECTRIC CARS",
    "CATEGORY":"Transportation",
    "AMOUNT":"$49"
  },
  {
    "DATE":"8/17/2015",
    "MERCHANT":"LIBERTY'S DELIGHTFUL CAFE",
    "CATEGORY":"Restaurant",
    "AMOUNT":"$40"
  },
  {
    "DATE":"8/17/2015",
    "MERCHANT":"LIBERTY'S DELIGHTFUL CAFE",
    "CATEGORY":"Restaurant",
    "AMOUNT":"$35"
  },
  {
    "DATE":"8/19/2015",
    "MERCHANT":"THE PHONE COMPANY",
    "CATEGORY":"Communications",
    "AMOUNT":"$126"
  },
  {
    "DATE":"8/19/2015",
    "MERCHANT":"BEST FOR YOU ORGANICS COMPANY",
    "CATEGORY":"Groceries",
    "AMOUNT":"$32"
  },
  {
    "DATE":"8/20/2015",
    "MERCHANT":"BEST FOR YOU ORGANICS",
    "CATEGORY":"Groceries",
    "AMOUNT":"$40"
  },
  {
    "DATE":"8/20/2015",
    "MERCHANT":"PROSEWARE, INC",
    "CATEGORY":"Shopping",
    "AMOUNT":"$32"
  },
  {
    "DATE":"8/21/2015",
    "MERCHANT":"WIDE WORLD IMPORTERS",
    "CATEGORY":"Groceries",
    "AMOUNT":"$39"
  },
  {
    "DATE":"8/21/2015",
    "MERCHANT":"COHO WINERY",
    "CATEGORY":"Restaurant",
    "AMOUNT":"$11"
  },
  {
    "DATE":"8/21/2015",
    "MERCHANT":"LIBERTY'S DELIGHTFUL CAFE",
    "CATEGORY":"Restaurant",
    "AMOUNT":"$69"
  },
  {
    "DATE":"8/22/2015",
    "MERCHANT":"NORTHWIND ELECTRIC CARS",
    "CATEGORY":"Transportation",
    "AMOUNT":"$26"
  },
  {
    "DATE":"8/22/2015",
    "MERCHANT":"TREY RESEARCH",
    "CATEGORY":"Other",
    "AMOUNT":"$20"
  },
  {
    "DATE":"8/24/2015",
    "MERCHANT":"PROSEWARE, INC",
    "CATEGORY":"Shopping",
    "AMOUNT":"$209"
  },
  {
    "DATE":"8/24/2015",
    "MERCHANT":"WIDE WORLD IMPORTERS",
    "CATEGORY":"Groceries",
    "AMOUNT":"$46"
  },
  {
    "DATE":"8/25/2015",
    "MERCHANT":"ADVENTURE WORKS CYCLES",
    "CATEGORY":"Transportation",
    "AMOUNT":"$52"
  },
  {
    "DATE":"8/25/2015",
    "MERCHANT":"TREY RESEARCH",
    "CATEGORY":"Other",
    "AMOUNT":"$135"
  },
  {
    "DATE":"8/26/2015",
    "MERCHANT":"MARGIE'S TRAVEL",
    "CATEGORY":"Travel",
    "AMOUNT":"$107"
  },
  {
    "DATE":"8/26/2015",
    "MERCHANT":"MARGIE'S TRAVEL",
    "CATEGORY":"Travel",
    "AMOUNT":"$107"
  },
  {
    "DATE":"8/27/2015",
    "MERCHANT":"WIDE WORLD IMPORTERS",
    "CATEGORY":"Groceries",
    "AMOUNT":"$118"
  },
  {
    "DATE":"8/27/2015",
    "MERCHANT":"BEST FOR YOU ORGANICS",
    "CATEGORY":"Groceries",
    "AMOUNT":"$15"
  },
  {
    "DATE":"8/29/2015",
    "MERCHANT":"BEST FOR YOU ORGANICS",
    "CATEGORY":"Groceries",
    "AMOUNT":"$190"
  },
  {
    "DATE":"8/30/2015",
    "MERCHANT":"CONTOSO, LTD",
    "CATEGORY":"Shopping",
    "AMOUNT":"$16"
  },
  {
    "DATE":"8/30/2015",
    "MERCHANT":"CONTOSO, LTD",
    "CATEGORY":"Shopping",
    "AMOUNT":"$19"
  },
  {
    "DATE":"8/30/2015",
    "MERCHANT":"CONTOSO, LTD",
    "CATEGORY":"Shopping",
    "AMOUNT":"$22"
  },
  {
    "DATE":"8/30/2015",
    "MERCHANT":"CONTOSO, LTD",
    "CATEGORY":"Shopping",
    "AMOUNT":"$25"
  },
  {
    "DATE":"8/30/2015",
    "MERCHANT":"THE PHONE COMPANY",
    "CATEGORY":"Communications",
    "AMOUNT":"$141"
  },
  {
    "DATE":"8/31/2015",
    "MERCHANT":"BELLOWS COLLEGE",
    "CATEGORY":"Education",
    "AMOUNT":"$28"
  },
  {
    "DATE":"9/2/2015",
    "MERCHANT":"WIDE WORLD IMPORTERS",
    "CATEGORY":"Shopping",
    "AMOUNT":"$117"
  },
  {
    "DATE":"9/2/2015",
    "MERCHANT":"NORTHWIND ELECTRIC CARS",
    "CATEGORY":"Transportation",
    "AMOUNT":"$10"
  },
  {
    "DATE":"9/2/2015",
    "MERCHANT":"ADVENTURE WORKS CYCLES",
    "CATEGORY":"Transportation",
    "AMOUNT":"$40"
  },
  {
    "DATE":"9/3/2015",
    "MERCHANT":"BEST FOR YOU ORGANICS COMPANY",
    "CATEGORY":"Groceries",
    "AMOUNT":"$73"
  },
  {
    "DATE":"9/3/2015",
    "MERCHANT":"ADVENTURE WORKS CYCLES",
    "CATEGORY":"Transportation",
    "AMOUNT":"$57"
  },
  {
    "DATE":"9/5/2015",
    "MERCHANT":"LIBERTY'S DELIGHTFUL CAFE",
    "CATEGORY":"Restaurant",
    "AMOUNT":"$74"
  },
  {
    "DATE":"9/6/2015",
    "MERCHANT":"PROSEWARE, INC",
    "CATEGORY":"Shopping",
    "AMOUNT":"$25"
  },
  {
    "DATE":"9/6/2015",
    "MERCHANT":"PROSEWARE, INC",
    "CATEGORY":"Shopping",
    "AMOUNT":"$443"
  },
  {
    "DATE":"9/7/2015",
    "MERCHANT":"PROSEWARE, INC",
    "CATEGORY":"Shopping",
    "AMOUNT":"$5"
  },
  {
    "DATE":"9/7/2015",
    "MERCHANT":"BEST FOR YOU ORGANICS COMPANY",
    "CATEGORY":"Groceries",
    "AMOUNT":"$29"
  },
  {
    "DATE":"9/8/2015",
    "MERCHANT":"BELLOWS COLLEGE",
    "CATEGORY":"Education",
    "AMOUNT":"$360"
  },
  {
    "DATE":"9/8/2015",
    "MERCHANT":"SCHOOL OF FINE ART",
    "CATEGORY":"Education",
    "AMOUNT":"$7"
  },
  {
    "DATE":"9/9/2015",
    "MERCHANT":"LIBERTY BAKERY & CAFE",
    "CATEGORY":"Groceries",
    "AMOUNT":"$10"
  },
  {
    "DATE":"9/10/2015",
    "MERCHANT":"CONTOSO, LTD",
    "CATEGORY":"Shopping",
    "AMOUNT":"$137"
  },
  {
    "DATE":"9/10/2015",
    "MERCHANT":"ADVENTURE WORKS CYCLES",
    "CATEGORY":"Transportation",
    "AMOUNT":"$55"
  },
  {
    "DATE":"9/11/2015",
    "MERCHANT":"LIBERTY'S DELIGHTFUL CAFE",
    "CATEGORY":"Restaurant",
    "AMOUNT":"$7"
  },
  {
    "DATE":"9/11/2015",
    "MERCHANT":"WIDE WORLD IMPORTERS",
    "CATEGORY":"Groceries",
    "AMOUNT":"$23"
  },
  {
    "DATE":"9/12/2015",
    "MERCHANT":"CONTOSO, LTD",
    "CATEGORY":"Shopping",
    "AMOUNT":"$40"
  },
  {
    "DATE":"9/12/2015",
    "MERCHANT":"LIBERTY'S DELIGHTFUL CAFE",
    "CATEGORY":"Restaurant",
    "AMOUNT":"$60"
  },
  {
    "DATE":"9/16/2015",
    "MERCHANT":"ADVENTURE WORKS CYCLES",
    "CATEGORY":"Transportation",
    "AMOUNT":"$38"
  },
  {
    "DATE":"9/17/2015",
    "MERCHANT":"BEST FOR YOU ORGANICS",
    "CATEGORY":"Groceries",
    "AMOUNT":"$15"
  },
  {
    "DATE":"9/17/2015",
    "MERCHANT":"BEST FOR YOU ORGANICS",
    "CATEGORY":"Groceries",
    "AMOUNT":"$13"
  },
  {
    "DATE":"9/18/2015",
    "MERCHANT":"CONTOSO, LTD",
    "CATEGORY":"Shopping",
    "AMOUNT":"$27"
  },
  {
    "DATE":"9/19/2015",
    "MERCHANT":"CONTOSO, LTD",
    "CATEGORY":"Shopping",
    "AMOUNT":"$20"
  },
  {
    "DATE":"9/19/2015",
    "MERCHANT":"LIBERTY'S DELIGHTFUL CAFE",
    "CATEGORY":"Restaurant",
    "AMOUNT":"$44"
  },
  {
    "DATE":"9/19/2015",
    "MERCHANT":"THE PHONE COMPANY",
    "CATEGORY":"Communications",
    "AMOUNT":"$105"
  },
  {
    "DATE":"9/19/2015",
    "MERCHANT":"LIBERTY'S DELIGHTFUL CAFE",
    "CATEGORY":"Restaurant",
    "AMOUNT":"$7"
  },
  {
    "DATE":"9/19/2015",
    "MERCHANT":"PROSEWARE, INC",
    "CATEGORY":"Shopping",
    "AMOUNT":"$242"
  },
  {
    "DATE":"9/19/2015",
    "MERCHANT":"RELECLOUD",
    "CATEGORY":"Entertainment",
    "AMOUNT":"$30"
  },
  {
    "DATE":"9/19/2015",
    "MERCHANT":"ADVENTURE WORKS CYCLES",
    "CATEGORY":"Transportation",
    "AMOUNT":"$56"
  },
  {
    "DATE":"9/21/2015",
    "MERCHANT":"PROSEWARE, INC",
    "CATEGORY":"Shopping",
    "AMOUNT":"$29"
  },
  {
    "DATE":"9/22/2015",
    "MERCHANT":"LIBERTY'S DELIGHTFUL CAFE",
    "CATEGORY":"Restaurant",
    "AMOUNT":"$35"
  },
  {
    "DATE":"9/22/2015",
    "MERCHANT":"LIBERTY'S DELIGHTFUL CAFE",
    "CATEGORY":"Restaurant",
    "AMOUNT":"$71"
  },
  {
    "DATE":"9/25/2015",
    "MERCHANT":"TREY RESEARCH",
    "CATEGORY":"Other",
    "AMOUNT":"$135"
  },
  {
    "DATE":"9/26/2015",
    "MERCHANT":"NORTHWIND ELECTRIC CARS",
    "CATEGORY":"Transportation",
    "AMOUNT":"$50"
  },
  {
    "DATE":"9/26/2015",
    "MERCHANT":"COHO WINERY",
    "CATEGORY":"Restaurant",
    "AMOUNT":"$72"
  },
  {
    "DATE":"9/28/2015",
    "MERCHANT":"NORTHWIND ELECTRIC CARS",
    "CATEGORY":"Transportation",
    "AMOUNT":"$34"
  },
  {
    "DATE":"9/28/2015",
    "MERCHANT":"WIDE WORLD IMPORTERS",
    "CATEGORY":"Groceries",
    "AMOUNT":"$8"
  },
  {
    "DATE":"9/28/2015",
    "MERCHANT":"BEST FOR YOU ORGANICS COMPANY",
    "CATEGORY":"Groceries",
    "AMOUNT":"$88"
  },
  {
    "DATE":"9/28/2015",
    "MERCHANT":"MUNSON'S PICKLES AND PRESERVES FARM",
    "CATEGORY":"Groceries",
    "AMOUNT":"$30"
  },
  {
    "DATE":"9/29/2015",
    "MERCHANT":"THE PHONE COMPANY",
    "CATEGORY":"Communications",
    "AMOUNT":"$143"
  },
  {
    "DATE":"9/30/2015",
    "MERCHANT":"TREY RESEARCH",
    "CATEGORY":"Other",
    "AMOUNT":"$100"
  },
  {
    "DATE":"10/1/2015",
    "MERCHANT":"LIBERTY'S DELIGHTFUL CAFE",
    "CATEGORY":"Restaurant",
    "AMOUNT":"$20"
  },
  {
    "DATE":"10/2/2015",
    "MERCHANT":"MARGIE'S TRAVEL",
    "CATEGORY":"Travel",
    "AMOUNT":"$504"
  },
  {
    "DATE":"10/2/2015",
    "MERCHANT":"CONTOSO, LTD",
    "CATEGORY":"Shopping",
    "AMOUNT":"$47"
  },
  {
    "DATE":"10/2/2015",
    "MERCHANT":"CONTOSO, LTD",
    "CATEGORY":"Shopping",
    "AMOUNT":"$9"
  },
  {
    "DATE":"10/2/2015",
    "MERCHANT":"BELLOWS COLLEGE",
    "CATEGORY":"Education",
    "AMOUNT":"$405"
  },
  {
    "DATE":"10/2/2015",
    "MERCHANT":"LIBERTY BAKERY & CAFE",
    "CATEGORY":"Groceries",
    "AMOUNT":"$7"
  },
  {
    "DATE":"10/2/2015",
    "MERCHANT":"MARGIE'S TRAVEL",
    "CATEGORY":"Travel",
    "AMOUNT":"$132"
  },
  {
    "DATE":"10/3/2015",
    "MERCHANT":"PROSEWARE, INC",
    "CATEGORY":"Shopping",
    "AMOUNT":"$313"
  },
  {
    "DATE":"10/4/2015",
    "MERCHANT":"LIBERTY'S DELIGHTFUL CAFE",
    "CATEGORY":"Restaurant",
    "AMOUNT":"$59"
  },
  {
    "DATE":"10/4/2015",
    "MERCHANT":"NORTHWIND ELECTRIC CARS",
    "CATEGORY":"Transportation",
    "AMOUNT":"$51"
  },
  {
    "DATE":"10/5/2015",
    "MERCHANT":"COHO VINEYARD",
    "CATEGORY":"Restaurant",
    "AMOUNT":"$18"
  },
  {
    "DATE":"10/5/2015",
    "MERCHANT":"CONTOSO, LTD",
    "CATEGORY":"Entertainment",
    "AMOUNT":"$30"
  },
  {
    "DATE":"10/7/2015",
    "MERCHANT":"BELLOWS COLLEGE",
    "CATEGORY":"Education",
    "AMOUNT":"$28"
  },
  {
    "DATE":"10/7/2015",
    "MERCHANT":"BEST FOR YOU ORGANICS",
    "CATEGORY":"Groceries",
    "AMOUNT":"$3"
  },
  {
    "DATE":"10/7/2015",
    "MERCHANT":"COHO WINERY",
    "CATEGORY":"Restaurant",
    "AMOUNT":"$11"
  },
  {
    "DATE":"10/8/2015",
    "MERCHANT":"ADVENTURE WORKS CYCLES",
    "CATEGORY":"Transportation",
    "AMOUNT":"$36"
  },
  {
    "DATE":"10/10/2015",
    "MERCHANT":"LIBERTY'S DELIGHTFUL CAFE",
    "CATEGORY":"Restaurant",
    "AMOUNT":"$21"
  },
  {
    "DATE":"10/10/2015",
    "MERCHANT":"BEST FOR YOU ORGANICS",
    "CATEGORY":"Groceries",
    "AMOUNT":"$13"
  },
  {
    "DATE":"10/10/2015",
    "MERCHANT":"LIBERTY'S DELIGHTFUL CAFE",
    "CATEGORY":"Restaurant",
    "AMOUNT":"$6"
  },
  {
    "DATE":"10/11/2015",
    "MERCHANT":"LIBERTY'S DELIGHTFUL CAFE",
    "CATEGORY":"Restaurant",
    "AMOUNT":"$47"
  },
  {
    "DATE":"10/11/2015",
    "MERCHANT":"SOUTHRIDGE VIDEO",
    "CATEGORY":"Entertainment",
    "AMOUNT":"$54"
  },
  {
    "DATE":"10/11/2015",
    "MERCHANT":"PROSEWARE, INC",
    "CATEGORY":"Shopping",
    "AMOUNT":"$16"
  },
  {
    "DATE":"10/11/2015",
    "MERCHANT":"PROSEWARE, INC",
    "CATEGORY":"Shopping",
    "AMOUNT":"$437"
  },
  {
    "DATE":"10/11/2015",
    "MERCHANT":"BEST FOR YOU ORGANICS",
    "CATEGORY":"Groceries",
    "AMOUNT":"$13"
  },
  {
    "DATE":"10/11/2015",
    "MERCHANT":"COHO VINEYARD",
    "CATEGORY":"Restaurant",
    "AMOUNT":"$53"
  },
  {
    "DATE":"10/11/2015",
    "MERCHANT":"PROSEWARE, INC",
    "CATEGORY":"Shopping",
    "AMOUNT":"$430"
  },
  {
    "DATE":"10/11/2015",
    "MERCHANT":"NORTHWIND ELECTRIC CARS",
    "CATEGORY":"Transportation",
    "AMOUNT":"$47"
  },
  {
    "DATE":"10/11/2015",
    "MERCHANT":"PROSEWARE, INC",
    "CATEGORY":"Shopping",
    "AMOUNT":"$157"
  },
  {
    "DATE":"10/11/2015",
    "MERCHANT":"PROSEWARE, INC",
    "CATEGORY":"Shopping",
    "AMOUNT":"$58"
  },
  {
    "DATE":"10/15/2015",
    "MERCHANT":"LIBERTY'S DELIGHTFUL CAFE",
    "CATEGORY":"Restaurant",
    "AMOUNT":"$28"
  },
  {
    "DATE":"10/16/2015",
    "MERCHANT":"ADVENTURE WORKS CYCLES",
    "CATEGORY":"Transportation",
    "AMOUNT":"$55"
  },
  {
    "DATE":"10/19/2015",
    "MERCHANT":"COHO WINERY",
    "CATEGORY":"Restaurant",
    "AMOUNT":"$7"
  },
  {
    "DATE":"10/19/2015",
    "MERCHANT":"CONTOSO PHARMACEUTICALS",
    "CATEGORY":"Shopping",
    "AMOUNT":"$5"
  },
  {
    "DATE":"10/20/2015",
    "MERCHANT":"THE PHONE COMPANY",
    "CATEGORY":"Communications",
    "AMOUNT":"$126"
  },
  {
    "DATE":"10/21/2015",
    "MERCHANT":"NORTHWIND ELECTRIC CARS",
    "CATEGORY":"Transportation",
    "AMOUNT":"$4"
  },
  {
    "DATE":"10/21/2015",
    "MERCHANT":"NORTHWIND ELECTRIC CARS",
    "CATEGORY":"Transportation",
    "AMOUNT":"$34"
  },
  {
    "DATE":"10/21/2015",
    "MERCHANT":"COHO WINERY",
    "CATEGORY":"Restaurant",
    "AMOUNT":"$31"
  },
  {
    "DATE":"10/23/2015",
    "MERCHANT":"CONTOSO, LTD",
    "CATEGORY":"Shopping",
    "AMOUNT":"$5"
  },
  {
    "DATE":"10/23/2015",
    "MERCHANT":"BEST FOR YOU ORGANICS",
    "CATEGORY":"Groceries",
    "AMOUNT":"$5"
  },
  {
    "DATE":"10/23/2015",
    "MERCHANT":"WIDE WORLD IMPORTERS",
    "CATEGORY":"Groceries",
    "AMOUNT":"$52"
  },
  {
    "DATE":"10/23/2015",
    "MERCHANT":"ADVENTURE WORKS CYCLES",
    "CATEGORY":"Transportation",
    "AMOUNT":"$47"
  },
  {
    "DATE":"10/25/2015",
    "MERCHANT":"PROSEWARE, INC",
    "CATEGORY":"Shopping",
    "AMOUNT":"$105"
  },
  {
    "DATE":"10/25/2015",
    "MERCHANT":"PROSEWARE, INC",
    "CATEGORY":"Shopping",
    "AMOUNT":"$56"
  },
  {
    "DATE":"10/25/2015",
    "MERCHANT":"BEST FOR YOU ORGANICS COMPANY",
    "CATEGORY":"Groceries",
    "AMOUNT":"$45"
  },
  {
    "DATE":"10/25/2015",
    "MERCHANT":"LIBERTY'S DELIGHTFUL CAFE",
    "CATEGORY":"Restaurant",
    "AMOUNT":"$36"
  },
  {
    "DATE":"10/25/2015",
    "MERCHANT":"TREY RESEARCH",
    "CATEGORY":"Other",
    "AMOUNT":"$135"
  },
  {
    "DATE":"10/28/2015",
    "MERCHANT":"LIBERTY BAKERY & CAFE",
    "CATEGORY":"Groceries",
    "AMOUNT":"$24"
  },
  {
    "DATE":"10/29/2015",
    "MERCHANT":"NORTHWIND ELECTRIC CARS",
    "CATEGORY":"Transportation",
    "AMOUNT":"$47"
  },
  {
    "DATE":"10/30/2015",
    "MERCHANT":"THE PHONE COMPANY",
    "CATEGORY":"Communications",
    "AMOUNT":"$143"
  },
  {
    "DATE":"10/30/2015",
    "MERCHANT":"NORTHWIND ELECTRIC CARS",
    "CATEGORY":"Transportation",
    "AMOUNT":"$34"
  },
  {
    "DATE":"10/30/2015",
    "MERCHANT":"LIBERTY'S DELIGHTFUL CAFE",
    "CATEGORY":"Restaurant",
    "AMOUNT":"$65"
  },
  {
    "DATE":"10/31/2015",
    "MERCHANT":"LIBERTY'S DELIGHTFUL CAFE",
    "CATEGORY":"Restaurant",
    "AMOUNT":"$54"
  },
  {
    "DATE":"11/1/2015",
    "MERCHANT":"PROSEWARE, INC",
    "CATEGORY":"Shopping",
    "AMOUNT":"$239"
  },
  {
    "DATE":"11/1/2015",
    "MERCHANT":"BEST FOR YOU ORGANICS COMPANY",
    "CATEGORY":"Groceries",
    "AMOUNT":"$16"
  },
  {
    "DATE":"11/2/2015",
    "MERCHANT":"CONTOSO, LTD",
    "CATEGORY":"Shopping",
    "AMOUNT":"$27"
  },
  {
    "DATE":"11/4/2015",
    "MERCHANT":"LIBERTY BAKERY & CAFE",
    "CATEGORY":"Groceries",
    "AMOUNT":"$90"
  },
  {
    "DATE":"11/4/2015",
    "MERCHANT":"PROSEWARE, INC",
    "CATEGORY":"Shopping",
    "AMOUNT":"$164"
  },
  {
    "DATE":"11/4/2015",
    "MERCHANT":"CONTOSO PHARMACEUTICALS",
    "CATEGORY":"Shopping",
    "AMOUNT":"$3"
  },
  {
    "DATE":"11/4/2015",
    "MERCHANT":"PROSEWARE, INC",
    "CATEGORY":"Shopping",
    "AMOUNT":"$36"
  },
  {
    "DATE":"11/5/2015",
    "MERCHANT":"SCHOOL OF FINE ART",
    "CATEGORY":"Education",
    "AMOUNT":"$15"
  },
  {
    "DATE":"11/6/2015",
    "MERCHANT":"CONTOSO, LTD",
    "CATEGORY":"Shopping",
    "AMOUNT":"$25"
  },
  {
    "DATE":"11/6/2015",
    "MERCHANT":"CONTOSO, LTD",
    "CATEGORY":"Shopping",
    "AMOUNT":"$40"
  },
  {
    "DATE":"11/6/2015",
    "MERCHANT":"CONTOSO, LTD",
    "CATEGORY":"Shopping",
    "AMOUNT":"$43"
  },
  {
    "DATE":"11/6/2015",
    "MERCHANT":"NORTHWIND ELECTRIC CARS",
    "CATEGORY":"Transportation",
    "AMOUNT":"$45"
  },
  {
    "DATE":"11/6/2015",
    "MERCHANT":"BELLOWS COLLEGE",
    "CATEGORY":"Education",
    "AMOUNT":"$49"
  },
  {
    "DATE":"11/7/2015",
    "MERCHANT":"CONTOSO, LTD",
    "CATEGORY":"Shopping",
    "AMOUNT":"$33"
  },
  {
    "DATE":"11/7/2015",
    "MERCHANT":"COHO WINERY",
    "CATEGORY":"Restaurant",
    "AMOUNT":"$8"
  },
  {
    "DATE":"11/7/2015",
    "MERCHANT":"PROSEWARE, INC",
    "CATEGORY":"Shopping",
    "AMOUNT":"$32"
  },
  {
    "DATE":"11/7/2015",
    "MERCHANT":"BEST FOR YOU ORGANICS",
    "CATEGORY":"Groceries",
    "AMOUNT":"$72"
  },
  {
    "DATE":"11/7/2015",
    "MERCHANT":"WIDE WORLD IMPORTERS",
    "CATEGORY":"Groceries",
    "AMOUNT":"$29"
  },
  {
    "DATE":"11/8/2015",
    "MERCHANT":"WIDE WORLD IMPORTERS",
    "CATEGORY":"Groceries",
    "AMOUNT":"$25"
  },
  {
    "DATE":"11/11/2015",
    "MERCHANT":"BELLOWS COLLEGE",
    "CATEGORY":"Education",
    "AMOUNT":"$36"
  },
  {
    "DATE":"11/12/2015",
    "MERCHANT":"BELLOWS COLLEGE",
    "CATEGORY":"Education",
    "AMOUNT":"$360"
  },
  {
    "DATE":"11/12/2015",
    "MERCHANT":"CONTOSO PHARMACEUTICALS",
    "CATEGORY":"Shopping",
    "AMOUNT":"$23"
  },
  {
    "DATE":"11/12/2015",
    "MERCHANT":"NORTHWIND ELECTRIC CARS",
    "CATEGORY":"Transportation",
    "AMOUNT":"$40"
  },
  {
    "DATE":"11/12/2015",
    "MERCHANT":"LIBERTY'S DELIGHTFUL CAFE",
    "CATEGORY":"Restaurant",
    "AMOUNT":"$130"
  },
  {
    "DATE":"11/12/2015",
    "MERCHANT":"TREY RESEARCH",
    "CATEGORY":"Other",
    "AMOUNT":"$200"
  },
  {
    "DATE":"11/13/2015",
    "MERCHANT":"NORTHWIND ELECTRIC CARS",
    "CATEGORY":"Transportation",
    "AMOUNT":"$712"
  },
  {
    "DATE":"11/13/2015",
    "MERCHANT":"BEST FOR YOU ORGANICS",
    "CATEGORY":"Groceries",
    "AMOUNT":"$66"
  },
  {
    "DATE":"11/14/2015",
    "MERCHANT":"LIBERTY'S DELIGHTFUL CAFE",
    "CATEGORY":"Restaurant",
    "AMOUNT":"$19"
  },
  {
    "DATE":"11/15/2015",
    "MERCHANT":"LIBERTY'S DELIGHTFUL CAFE",
    "CATEGORY":"Restaurant",
    "AMOUNT":"$19"
  },
  {
    "DATE":"11/16/2015",
    "MERCHANT":"ADVENTURE WORKS CYCLES",
    "CATEGORY":"Transportation",
    "AMOUNT":"$31"
  },
  {
    "DATE":"11/18/2015",
    "MERCHANT":"LIBERTY BAKERY & CAFE",
    "CATEGORY":"Groceries",
    "AMOUNT":"$3"
  },
  {
    "DATE":"11/18/2015",
    "MERCHANT":"NORTHWIND ELECTRIC CARS",
    "CATEGORY":"Transportation",
    "AMOUNT":"$44"
  },
  {
    "DATE":"11/19/2015",
    "MERCHANT":"THE PHONE COMPANY",
    "CATEGORY":"Communications",
    "AMOUNT":"$126"
  },
  {
    "DATE":"11/20/2015",
    "MERCHANT":"BELLOWS COLLEGE",
    "CATEGORY":"Education",
    "AMOUNT":"$16"
  },
  {
    "DATE":"11/21/2015",
    "MERCHANT":"PROSEWARE, INC",
    "CATEGORY":"Shopping",
    "AMOUNT":"$5"
  },
  {
    "DATE":"11/21/2015",
    "MERCHANT":"PROSEWARE, INC",
    "CATEGORY":"Shopping",
    "AMOUNT":"$946"
  },
  {
    "DATE":"11/21/2015",
    "MERCHANT":"LIBERTY'S DELIGHTFUL CAFE",
    "CATEGORY":"Restaurant",
    "AMOUNT":"$76"
  },
  {
    "DATE":"11/21/2015",
    "MERCHANT":"PROSEWARE, INC",
    "CATEGORY":"Shopping",
    "AMOUNT":"$69"
  },
  {
    "DATE":"11/21/2015",
    "MERCHANT":"MUNSON'S PICKLES AND PRESERVES FARM",
    "CATEGORY":"Groceries",
    "AMOUNT":"$9"
  },
  {
    "DATE":"11/22/2015",
    "MERCHANT":"CONTOSO, LTD",
    "CATEGORY":"Shopping",
    "AMOUNT":"$12"
  },
  {
    "DATE":"11/22/2015",
    "MERCHANT":"BEST FOR YOU ORGANICS COMPANY",
    "CATEGORY":"Groceries",
    "AMOUNT":"$85"
  },
  {
    "DATE":"11/24/2015",
    "MERCHANT":"BEST FOR YOU ORGANICS",
    "CATEGORY":"Groceries",
    "AMOUNT":"$29"
  },
  {
    "DATE":"11/24/2015",
    "MERCHANT":"COHO WINERY",
    "CATEGORY":"Restaurant",
    "AMOUNT":"$4"
  },
  {
    "DATE":"11/24/2015",
    "MERCHANT":"COHO WINERY",
    "CATEGORY":"Restaurant",
    "AMOUNT":"$9"
  },
  {
    "DATE":"11/24/2015",
    "MERCHANT":"TREY RESEARCH",
    "CATEGORY":"Other",
    "AMOUNT":"$88"
  },
  {
    "DATE":"11/25/2015",
    "MERCHANT":"NORTHWIND ELECTRIC CARS",
    "CATEGORY":"Transportation",
    "AMOUNT":"$43"
  },
  {
    "DATE":"11/26/2015",
    "MERCHANT":"LIBERTY'S DELIGHTFUL CAFE",
    "CATEGORY":"Restaurant",
    "AMOUNT":"$93"
  },
  {
    "DATE":"11/28/2015",
    "MERCHANT":"A. DATUM CORPORATION",
    "CATEGORY":"Shopping",
    "AMOUNT":"$4"
  },
  {
    "DATE":"11/28/2015",
    "MERCHANT":"CONTOSO, LTD",
    "CATEGORY":"Shopping",
    "AMOUNT":"$59"
  },
  {
    "DATE":"11/28/2015",
    "MERCHANT":"LIBERTY'S DELIGHTFUL CAFEE",
    "CATEGORY":"Restaurant",
    "AMOUNT":"$7"
  },
  {
    "DATE":"11/28/2015",
    "MERCHANT":"LIBERTY'S DELIGHTFUL CAFE",
    "CATEGORY":"Restaurant",
    "AMOUNT":"$96"
  },
  {
    "DATE":"11/28/2015",
    "MERCHANT":"BEST FOR YOU ORGANICS COMPANY",
    "CATEGORY":"Groceries",
    "AMOUNT":"$53"
  },
  {
    "DATE":"11/29/2015",
    "MERCHANT":"THE PHONE COMPANY",
    "CATEGORY":"Communications",
    "AMOUNT":"$148"
  },
  {
    "DATE":"11/29/2015",
    "MERCHANT":"PROSEWARE, INC",
    "CATEGORY":"Shopping",
    "AMOUNT":"$8"
  },
  {
    "DATE":"11/30/2015",
    "MERCHANT":"CONTOSO, LTD",
    "CATEGORY":"Shopping",
    "AMOUNT":"$54"
  },
  {
    "DATE":"11/30/2015",
    "MERCHANT":"LIBERTY'S DELIGHTFUL CAFE",
    "CATEGORY":"Restaurant",
    "AMOUNT":"$60"
  },
  {
    "DATE":"11/30/2015",
    "MERCHANT":"BEST FOR YOU ORGANICS",
    "CATEGORY":"Groceries",
    "AMOUNT":"$20"
  },
  {
    "DATE":"12/1/2015",
    "MERCHANT":"BEST FOR YOU ORGANICS",
    "CATEGORY":"Groceries",
    "AMOUNT":"$43"
  },
  {
    "DATE":"12/2/2015",
    "MERCHANT":"CONTOSO, LTD",
    "CATEGORY":"Shopping",
    "AMOUNT":"$46"
  },
  {
    "DATE":"12/3/2015",
    "MERCHANT":"CONTOSO, LTD",
    "CATEGORY":"Shopping",
    "AMOUNT":"$16"
  },
  {
    "DATE":"12/3/2015",
    "MERCHANT":"LIBERTY'S DELIGHTFUL CAFE",
    "CATEGORY":"Restaurant",
    "AMOUNT":"$67"
  },
  {
    "DATE":"12/3/2015",
    "MERCHANT":"NORTHWIND ELECTRIC CARS",
    "CATEGORY":"Transportation",
    "AMOUNT":"$46"
  },
  {
    "DATE":"12/3/2015",
    "MERCHANT":"MARGIE'S TRAVEL",
    "CATEGORY":"Travel",
    "AMOUNT":"$1369"
  },
  {
    "DATE":"12/3/2015",
    "MERCHANT":"MARGIE'S TRAVEL",
    "CATEGORY":"Travel",
    "AMOUNT":"$1369"
  },
  {
    "DATE":"12/3/2015",
    "MERCHANT":"MARGIE'S TRAVEL",
    "CATEGORY":"Travel",
    "AMOUNT":"$1576"
  },
  {
    "DATE":"12/3/2015",
    "MERCHANT":"MARGIE'S TRAVEL",
    "CATEGORY":"Travel",
    "AMOUNT":"$1576"
  },
  {
    "DATE":"12/4/2015",
    "MERCHANT":"CONTOSO, LTD",
    "CATEGORY":"Shopping",
    "AMOUNT":"$40"
  },
  {
    "DATE":"12/4/2015",
    "MERCHANT":"BELLOWS COLLEGE",
    "CATEGORY":"Education",
    "AMOUNT":"$36"
  },
  {
    "DATE":"12/4/2015",
    "MERCHANT":"BEST FOR YOU ORGANICS",
    "CATEGORY":"Groceries",
    "AMOUNT":"$39"
  },
  {
    "DATE":"12/4/2015",
    "MERCHANT":"LIBERTY'S DELIGHTFUL CAFE",
    "CATEGORY":"Restaurant",
    "AMOUNT":"$16"
  },
  {
    "DATE":"12/5/2015",
    "MERCHANT":"CONTOSO, LTD",
    "CATEGORY":"Shopping",
    "AMOUNT":"$18"
  },
  {
    "DATE":"12/5/2015",
    "MERCHANT":"CONTOSO, LTD",
    "CATEGORY":"Shopping",
    "AMOUNT":"$27"
  },
  {
    "DATE":"12/5/2015",
    "MERCHANT":"CONTOSO, LTD",
    "CATEGORY":"Shopping",
    "AMOUNT":"$27"
  },
  {
    "DATE":"12/5/2015",
    "MERCHANT":"CONTOSO, LTD",
    "CATEGORY":"Shopping",
    "AMOUNT":"$105"
  },
  {
    "DATE":"12/5/2015",
    "MERCHANT":"BELLOWS COLLEGE",
    "CATEGORY":"Education",
    "AMOUNT":"$34"
  },
  {
    "DATE":"12/5/2015",
    "MERCHANT":"PROSEWARE, INC",
    "CATEGORY":"Shopping",
    "AMOUNT":"$602"
  },
  {
    "DATE":"12/5/2015",
    "MERCHANT":"PROSEWARE, INC",
    "CATEGORY":"Shopping",
    "AMOUNT":"$357"
  },
  {
    "DATE":"12/5/2015",
    "MERCHANT":"BEST FOR YOU ORGANICS",
    "CATEGORY":"Groceries",
    "AMOUNT":"$12"
  },
  {
    "DATE":"12/5/2015",
    "MERCHANT":"BEST FOR YOU ORGANICS COMPANY",
    "CATEGORY":"Groceries",
    "AMOUNT":"$216"
  },
  {
    "DATE":"12/6/2015",
    "MERCHANT":"CONTOSO, LTD",
    "CATEGORY":"Shopping",
    "AMOUNT":"$5"
  },
  {
    "DATE":"12/6/2015",
    "MERCHANT":"COHO VINEYARD",
    "CATEGORY":"Restaurant",
    "AMOUNT":"$85"
  },
  {
    "DATE":"12/6/2015",
    "MERCHANT":"BELLOWS COLLEGE",
    "CATEGORY":"Education",
    "AMOUNT":"$49"
  },
  {
    "DATE":"12/8/2015",
    "MERCHANT":"TREY RESEARCH",
    "CATEGORY":"Other",
    "AMOUNT":"$1000"
  },
  {
    "DATE":"12/8/2015",
    "MERCHANT":"NORTHWIND ELECTRIC CARS",
    "CATEGORY":"Transportation",
    "AMOUNT":"$45"
  },
  {
    "DATE":"12/8/2015",
    "MERCHANT":"BEST FOR YOU ORGANICS",
    "CATEGORY":"Groceries",
    "AMOUNT":"$35"
  },
  {
    "DATE":"12/10/2015",
    "MERCHANT":"COHO VINEYARD",
    "CATEGORY":"Restaurant",
    "AMOUNT":"$55"
  },
  {
    "DATE":"12/10/2015",
    "MERCHANT":"BEST FOR YOU ORGANICS",
    "CATEGORY":"Groceries",
    "AMOUNT":"$38"
  },
  {
    "DATE":"12/10/2015",
    "MERCHANT":"BEST FOR YOU ORGANICS COMPANY",
    "CATEGORY":"Groceries",
    "AMOUNT":"$160"
  },
  {
    "DATE":"12/12/2015",
    "MERCHANT":"TREY RESEARCH",
    "CATEGORY":"Other",
    "AMOUNT":"$101"
  },
  {
    "DATE":"12/12/2015",
    "MERCHANT":"CONTOSO PHARMACEUTICALS",
    "CATEGORY":"Shopping",
    "AMOUNT":"$167"
  },
  {
    "DATE":"12/13/2015",
    "MERCHANT":"PROSEWARE, INC",
    "CATEGORY":"Shopping",
    "AMOUNT":"$14"
  },
  {
    "DATE":"12/19/2015",
    "MERCHANT":"PROSEWARE, INC",
    "CATEGORY":"Shopping",
    "AMOUNT":"$64"
  },
  {
    "DATE":"12/19/2015",
    "MERCHANT":"PROSEWARE, INC",
    "CATEGORY":"Shopping",
    "AMOUNT":"$906"
  },
  {
    "DATE":"12/20/2015",
    "MERCHANT":"THE PHONE COMPANY",
    "CATEGORY":"Communications",
    "AMOUNT":"$126"
  },
  {
    "DATE":"12/20/2015",
    "MERCHANT":"LIBERTY'S DELIGHTFUL CAFE",
    "CATEGORY":"Restaurant",
    "AMOUNT":"$7"
  },
  {
    "DATE":"12/22/2015",
    "MERCHANT":"MARGIE'S TRAVEL",
    "CATEGORY":"Travel",
    "AMOUNT":"$90"
  },
  {
    "DATE":"12/23/2015",
    "MERCHANT":"MARGIE'S TRAVEL",
    "CATEGORY":"Travel",
    "AMOUNT":"$194"
  },
  {
    "DATE":"12/23/2015",
    "MERCHANT":"PROSEWARE, INC",
    "CATEGORY":"Shopping",
    "AMOUNT":"$834"
  },
  {
    "DATE":"12/24/2015",
    "MERCHANT":"PROSEWARE, INC",
    "CATEGORY":"Shopping",
    "AMOUNT":"$74"
  },
  {
    "DATE":"12/25/2015",
    "MERCHANT":"TREY RESEARCH",
    "CATEGORY":"Other",
    "AMOUNT":"$135"
  },
  {
    "DATE":"12/30/2015",
    "MERCHANT":"THE PHONE COMPANY",
    "CATEGORY":"Communications",
    "AMOUNT":"$143"
  },
  {
    "DATE":"1/6/2016",
    "MERCHANT":"BELLOWS COLLEGE",
    "CATEGORY":"Education",
    "AMOUNT":"$49"
  },
  {
    "DATE":"1/8/2016",
    "MERCHANT":"LIBERTY'S DELIGHTFUL CAFE",
    "CATEGORY":"Restaurant",
    "AMOUNT":"$101"
  },
  {
    "DATE":"1/9/2016",
    "MERCHANT":"A. DATUM CORPORATION",
    "CATEGORY":"Shopping",
    "AMOUNT":"$5"
  },
  {
    "DATE":"1/10/2016",
    "MERCHANT":"CONTOSO, LTD",
    "CATEGORY":"Shopping",
    "AMOUNT":"$27"
  },
  {
    "DATE":"1/11/2016",
    "MERCHANT":"CONTOSO, LTD",
    "CATEGORY":"Shopping",
    "AMOUNT":"$4"
  },
  {
    "DATE":"1/11/2016",
    "MERCHANT":"CONTOSO, LTD",
    "CATEGORY":"Shopping",
    "AMOUNT":"$15"
  },
  {
    "DATE":"1/11/2016",
    "MERCHANT":"CONTOSO, LTD",
    "CATEGORY":"Shopping",
    "AMOUNT":"$42"
  },
  {
    "DATE":"1/11/2016",
    "MERCHANT":"LIBERTY BAKERY & CAFE",
    "CATEGORY":"Groceries",
    "AMOUNT":"$261"
  },
  {
    "DATE":"1/11/2016",
    "MERCHANT":"NORTHWIND ELECTRIC CARS",
    "CATEGORY":"Transportation",
    "AMOUNT":"$30"
  },
  {
    "DATE":"1/12/2016",
    "MERCHANT":"CONTOSO, LTD",
    "CATEGORY":"Shopping",
    "AMOUNT":"$39"
  },
  {
    "DATE":"1/12/2016",
    "MERCHANT":"WIDE WORLD IMPORTERS",
    "CATEGORY":"Groceries",
    "AMOUNT":"$6"
  },
  {
    "DATE":"1/13/2016",
    "MERCHANT":"CONTOSO, LTD",
    "CATEGORY":"Shopping",
    "AMOUNT":"$35"
  },
  {
    "DATE":"1/13/2016",
    "MERCHANT":"CONTOSO, LTD",
    "CATEGORY":"Shopping",
    "AMOUNT":"$61"
  },
  {
    "DATE":"1/14/2016",
    "MERCHANT":"CONTOSO, LTD",
    "CATEGORY":"Shopping",
    "AMOUNT":"$11"
  },
  {
    "DATE":"1/14/2016",
    "MERCHANT":"CONTOSO, LTD",
    "CATEGORY":"Shopping",
    "AMOUNT":"$16"
  },
  {
    "DATE":"1/14/2016",
    "MERCHANT":"CONTOSO, LTD",
    "CATEGORY":"Shopping",
    "AMOUNT":"$21"
  },
  {
    "DATE":"1/14/2016",
    "MERCHANT":"CONTOSO, LTD",
    "CATEGORY":"Shopping",
    "AMOUNT":"$22"
  },
  {
    "DATE":"1/14/2016",
    "MERCHANT":"BEST FOR YOU ORGANICS",
    "CATEGORY":"Groceries",
    "AMOUNT":"$57"
  },
  {
    "DATE":"1/15/2016",
    "MERCHANT":"CONTOSO, LTD",
    "CATEGORY":"Shopping",
    "AMOUNT":"$7"
  },
  {
    "DATE":"1/15/2016",
    "MERCHANT":"CONTOSO, LTD",
    "CATEGORY":"Shopping",
    "AMOUNT":"$25"
  },
  {
    "DATE":"1/15/2016",
    "MERCHANT":"CONTOSO, LTD",
    "CATEGORY":"Shopping",
    "AMOUNT":"$11"
  },
  {
    "DATE":"1/15/2016",
    "MERCHANT":"CONTOSO, LTD",
    "CATEGORY":"Shopping",
    "AMOUNT":"$27"
  },
  {
    "DATE":"1/16/2016",
    "MERCHANT":"CONTOSO, LTD",
    "CATEGORY":"Shopping",
    "AMOUNT":"$17"
  },
  {
    "DATE":"1/16/2016",
    "MERCHANT":"NORTHWIND ELECTRIC CARS",
    "CATEGORY":"Transportation",
    "AMOUNT":"$35"
  },
  {
    "DATE":"1/17/2016",
    "MERCHANT":"CONTOSO, LTD",
    "CATEGORY":"Shopping",
    "AMOUNT":"$13"
  },
  {
    "DATE":"1/18/2016",
    "MERCHANT":"CONTOSO, LTD",
    "CATEGORY":"Shopping",
    "AMOUNT":"$16"
  },
  {
    "DATE":"1/19/2016",
    "MERCHANT":"THE PHONE COMPANY",
    "CATEGORY":"Communications",
    "AMOUNT":"$126"
  },
  {
    "DATE":"1/19/2016",
    "MERCHANT":"LIBERTY BAKERY & CAFE",
    "CATEGORY":"Groceries",
    "AMOUNT":"$178"
  },
  {
    "DATE":"1/19/2016",
    "MERCHANT":"CONTOSO PHARMACEUTICALS",
    "CATEGORY":"Shopping",
    "AMOUNT":"$43"
  },
  {
    "DATE":"1/20/2016",
    "MERCHANT":"CONTOSO, LTD",
    "CATEGORY":"Shopping",
    "AMOUNT":"$14"
  },
  {
    "DATE":"1/22/2016",
    "MERCHANT":"LIBERTY'S DELIGHTFUL CAFE",
    "CATEGORY":"Restaurant",
    "AMOUNT":"$76"
  },
  {
    "DATE":"1/22/2016",
    "MERCHANT":"LIBERTY'S DELIGHTFUL CAFE",
    "CATEGORY":"Restaurant",
    "AMOUNT":"$14"
  },
  {
    "DATE":"1/22/2016",
    "MERCHANT":"MUNSON'S PICKLES AND PRESERVES FARM",
    "CATEGORY":"Groceries",
    "AMOUNT":"$36"
  },
  {
    "DATE":"1/23/2016",
    "MERCHANT":"LIBERTY BAKERY & CAFE",
    "CATEGORY":"Groceries",
    "AMOUNT":"$28"
  },
  {
    "DATE":"1/24/2016",
    "MERCHANT":"FOURTH COFFEE",
    "CATEGORY":"Restaurant",
    "AMOUNT":"$3"
  },
  {
    "DATE":"1/25/2016",
    "MERCHANT":"TREY RESEARCH",
    "CATEGORY":"Other",
    "AMOUNT":"$350"
  },
  {
    "DATE":"1/25/2016",
    "MERCHANT":"ADVENTURE WORKS CYCLES",
    "CATEGORY":"Transportation",
    "AMOUNT":"$31"
  },
  {
    "DATE":"1/25/2016",
    "MERCHANT":"ADVENTURE WORKS CYCLES",
    "CATEGORY":"Transportation",
    "AMOUNT":"$44"
  },
  {
    "DATE":"1/25/2016",
    "MERCHANT":"TREY RESEARCH",
    "CATEGORY":"Other",
    "AMOUNT":"$135"
  },
  {
    "DATE":"1/30/2016",
    "MERCHANT":"THE PHONE COMPANY",
    "CATEGORY":"Communications",
    "AMOUNT":"$144"
  },
  {
    "DATE":"2/4/2016",
    "MERCHANT":"ADVENTURE WORKS CYCLES",
    "CATEGORY":"Transportation",
    "AMOUNT":"$31"
  },
  {
    "DATE":"2/5/2016",
    "MERCHANT":"LIBERTY BAKERY & CAFE",
    "CATEGORY":"Groceries",
    "AMOUNT":"$27"
  },
  {
    "DATE":"2/5/2016",
    "MERCHANT":"MARGIE'S TRAVEL",
    "CATEGORY":"Travel",
    "AMOUNT":"$163"
  },
  {
    "DATE":"2/7/2016",
    "MERCHANT":"BEST FOR YOU ORGANICS COMPANY",
    "CATEGORY":"Groceries",
    "AMOUNT":"$189"
  },
  {
    "DATE":"2/8/2016",
    "MERCHANT":"MARGIE'S TRAVEL",
    "CATEGORY":"Travel",
    "AMOUNT":"$493"
  },
  {
    "DATE":"2/9/2016",
    "MERCHANT":"CONTOSO, LTD",
    "CATEGORY":"Shopping",
    "AMOUNT":"$6"
  },
  {
    "DATE":"2/10/2016",
    "MERCHANT":"BEST FOR YOU ORGANICS",
    "CATEGORY":"Groceries",
    "AMOUNT":"$72"
  },
  {
    "DATE":"2/11/2016",
    "MERCHANT":"BEST FOR YOU ORGANICS",
    "CATEGORY":"Groceries",
    "AMOUNT":"$21"
  },
  {
    "DATE":"2/13/2016",
    "MERCHANT":"NORTHWIND ELECTRIC CARS",
    "CATEGORY":"Transportation",
    "AMOUNT":"$44"
  },
  {
    "DATE":"2/13/2016",
    "MERCHANT":"MUNSON'S PICKLES AND PRESERVES FARM",
    "CATEGORY":"Groceries",
    "AMOUNT":"$18"
  },
  {
    "DATE":"2/17/2016",
    "MERCHANT":"BELLOWS COLLEGE",
    "CATEGORY":"Education",
    "AMOUNT":"$60"
  },
  {
    "DATE":"2/17/2016",
    "MERCHANT":"BELLOWS COLLEGE",
    "CATEGORY":"Education",
    "AMOUNT":"$60"
  },
  {
    "DATE":"2/18/2016",
    "MERCHANT":"BEST FOR YOU ORGANICS",
    "CATEGORY":"Groceries",
    "AMOUNT":"$21"
  },
  {
    "DATE":"2/23/2016",
    "MERCHANT":"RELECLOUD",
    "CATEGORY":"Entertainment",
    "AMOUNT":"$9"
  },
  {
    "DATE":"2/25/2016",
    "MERCHANT":"TREY RESEARCH",
    "CATEGORY":"Other",
    "AMOUNT":"$1500"
  },
  {
    "DATE":"2/27/2016",
    "MERCHANT":"THE PHONE COMPANY",
    "CATEGORY":"Communications",
    "AMOUNT":"$123"
  },
  {
    "DATE":"2/29/2016",
    "MERCHANT":"BEST FOR YOU ORGANICS",
    "CATEGORY":"Groceries",
    "AMOUNT":"$59"
  },
  {
    "DATE":"3/1/2016",
    "MERCHANT":"LIBERTY'S DELIGHTFUL CAFE",
    "CATEGORY":"Restaurant",
    "AMOUNT":"$16"
  },
  {
    "DATE":"3/1/2016",
    "MERCHANT":"ADVENTURE WORKS CYCLES",
    "CATEGORY":"Transportation",
    "AMOUNT":"$33"
  },
  {
    "DATE":"3/3/2016",
    "MERCHANT":"TREY RESEARCH",
    "CATEGORY":"Other",
    "AMOUNT":"$1000"
  },
  {
      "DATE": "3/4/2016",
      "MERCHANT": "BEST FOR YOU ORGANICS COMPANY",
      "CATEGORY": "Groceries",
      "AMOUNT": "$12"
  },
  {
    "DATE":"3/15/2016",
    "MERCHANT":"TREY RESEARCH",
    "CATEGORY":"Other",
    "AMOUNT":"$300"
  },
  {
    "DATE":"3/15/2016",
    "MERCHANT":"PROSEWARE, INC",
    "CATEGORY":"Shopping",
    "AMOUNT":"$33"
  },
  {
    "DATE":"3/18/2016",
    "MERCHANT":"PROSEWARE, INC",
    "CATEGORY":"Shopping",
    "AMOUNT":"$4"
  },
  {
    "DATE":"3/20/2016",
    "MERCHANT":"WIDE WORLD IMPORTERS",
    "CATEGORY":"Groceries",
    "AMOUNT":"$62"
  },
  {
    "DATE":"3/20/2016",
    "MERCHANT":"NORTHWIND ELECTRIC CARS",
    "CATEGORY":"Transportation",
    "AMOUNT":"$41"
  },
  {
    "DATE":"3/21/2016",
    "MERCHANT":"PROSEWARE, INC",
    "CATEGORY":"Shopping",
    "AMOUNT":"$75"
  },
  {
    "DATE":"3/22/2016",
    "MERCHANT":"THE PHONE COMPANY",
    "CATEGORY":"Communications",
    "AMOUNT":"$126"
  },
  {
    "DATE":"3/22/2016",
    "MERCHANT":"LIBERTY BAKERY & CAFE",
    "CATEGORY":"Groceries",
    "AMOUNT":"$54"
  },
  {
      "DATE": "3/23/2016",
      "MERCHANT": "GOOD HEALTH",
      "CATEGORY": "Groceries",
      "AMOUNT": "$31"
  },
  {
    "DATE":"3/23/2016",
    "MERCHANT":"GOOD HEALTH",
    "CATEGORY":"Groceries",
    "AMOUNT":"$31"
  },
  {
    "DATE":"3/23/2016",
    "MERCHANT":"LIBERTY BAKERY & CAFE",
    "CATEGORY":"Groceries",
    "AMOUNT":"$10"
  },
  {
    "DATE":"3/25/2016",
    "MERCHANT":"TREY RESEARCH",
    "CATEGORY":"Other",
    "AMOUNT":"$1500"
  },
  {
    "DATE":"3/26/2016",
    "MERCHANT":"LIBERTY'S DELIGHTFUL CAFE",
    "CATEGORY":"Restaurant",
    "AMOUNT":"$2"
  },
  {
    "DATE":"3/26/2016",
    "MERCHANT":"ADVENTURE WORKS CYCLES",
    "CATEGORY":"Transportation",
    "AMOUNT":"$40"
  }
  ]
}