{
  "development": {
    "username": "express_practice_b_app",
    "password": "password",
    "database": "express_practice_b_app_development",
    "host": "127.0.0.1",
    "dialect": "postgres",
    "seederStorage": "sequelize"
  },
  "test": {
    "username": "root",
    "password": null,
    "database": "database_test",
    "host": "127.0.0.1",
    "dialect": "mysql",
    "operatorsAliases": false
  },
  "production": {
    "username": "root",
    "password": null,
    "database": "database_production",
    "host": "127.0.0.1",
    "dialect": "mysql",
    "operatorsAliases": false
  }
}
