{
	"development": {
		"username": "petrack_app_complete",
		"password": "tf8YXPDF",
		"database": "petrack_complete_development",
		"host": "127.0.0.1",
		"dialect": "postgres",
		"seederStorage": "sequelize"
	},
	"test": {
		"username": "petrack_app_complete",
		"password": "tf8YXPDF",
		"database": "petrack_complete_test",
		"host": "127.0.0.1",
		"dialect": "postgres",
		"seederStorage": "sequelize"
	},
	"production": {
		"username": "petrack_app_complete",
		"password": "tf8YXPDF",
		"database": "petrack_complete_production",
		"host": "127.0.0.1",
		"dialect": "postgres",
		"seederStorage": "sequelize"
	}
}
