{
  "fullyEncodeReservedExpansion": true,
  "schemas": {
    "GoogleCloudAssetV1p4beta1Edge": {
      "description": "A directional edge.",
      "type": "object",
      "id": "GoogleCloudAssetV1p4beta1Edge",
      "properties": {
        "sourceNode": {
          "type": "string",
          "description": "The source node of the edge."
        },
        "targetNode": {
          "description": "The target node of the edge.",
          "type": "string"
        }
      }
    },
    "GoogleCloudAssetV1p4beta1AnalysisState": {
      "id": "GoogleCloudAssetV1p4beta1AnalysisState",
      "type": "object",
      "properties": {
        "code": {
          "enumDescriptions": [
            "Not an error; returned on success HTTP Mapping: 200 OK",
            "The operation was cancelled, typically by the caller. HTTP Mapping: 499 Client Closed Request",
            "Unknown error. For example, this error may be returned when a `Status` value received from another address space belongs to an error space that is not known in this address space. Also errors raised by APIs that do not return enough error information may be converted to this error. HTTP Mapping: 500 Internal Server Error",
            "The client specified an invalid argument. Note that this differs from `FAILED_PRECONDITION`. `INVALID_ARGUMENT` indicates arguments that are problematic regardless of the state of the system (e.g., a malformed file name). HTTP Mapping: 400 Bad Request",
            "The deadline expired before the operation could complete. For operations that change the state of the system, this error may be returned even if the operation has completed successfully. For example, a successful response from a server could have been delayed long enough for the deadline to expire. HTTP Mapping: 504 Gateway Timeout",
            "Some requested entity (e.g., file or directory) was not found. Note to server developers: if a request is denied for an entire class of users, such as gradual feature rollout or undocumented allowlist, `NOT_FOUND` may be used. If a request is denied for some users within a class of users, such as user-based access control, `PERMISSION_DENIED` must be used. HTTP Mapping: 404 Not Found",
            "The entity that a client attempted to create (e.g., file or directory) already exists. HTTP Mapping: 409 Conflict",
            "The caller does not have permission to execute the specified operation. `PERMISSION_DENIED` must not be used for rejections caused by exhausting some resource (use `RESOURCE_EXHAUSTED` instead for those errors). `PERMISSION_DENIED` must not be used if the caller can not be identified (use `UNAUTHENTICATED` instead for those errors). This error code does not imply the request is valid or the requested entity exists or satisfies other pre-conditions. HTTP Mapping: 403 Forbidden",
            "The request does not have valid authentication credentials for the operation. HTTP Mapping: 401 Unauthorized",
            "Some resource has been exhausted, perhaps a per-user quota, or perhaps the entire file system is out of space. HTTP Mapping: 429 Too Many Requests",
            "The operation was rejected because the system is not in a state required for the operation's execution. For example, the directory to be deleted is non-empty, an rmdir operation is applied to a non-directory, etc. Service implementors can use the following guidelines to decide between `FAILED_PRECONDITION`, `ABORTED`, and `UNAVAILABLE`: (a) Use `UNAVAILABLE` if the client can retry just the failing call. (b) Use `ABORTED` if the client should retry at a higher level (e.g., when a client-specified test-and-set fails, indicating the client should restart a read-modify-write sequence). (c) Use `FAILED_PRECONDITION` if the client should not retry until the system state has been explicitly fixed. E.g., if an \"rmdir\" fails because the directory is non-empty, `FAILED_PRECONDITION` should be returned since the client should not retry unless the files are deleted from the directory. HTTP Mapping: 400 Bad Request",
            "The operation was aborted, typically due to a concurrency issue such as a sequencer check failure or transaction abort. See the guidelines above for deciding between `FAILED_PRECONDITION`, `ABORTED`, and `UNAVAILABLE`. HTTP Mapping: 409 Conflict",
            "The operation was attempted past the valid range. E.g., seeking or reading past end-of-file. Unlike `INVALID_ARGUMENT`, this error indicates a problem that may be fixed if the system state changes. For example, a 32-bit file system will generate `INVALID_ARGUMENT` if asked to read at an offset that is not in the range [0,2^32-1], but it will generate `OUT_OF_RANGE` if asked to read from an offset past the current file size. There is a fair bit of overlap between `FAILED_PRECONDITION` and `OUT_OF_RANGE`. We recommend using `OUT_OF_RANGE` (the more specific error) when it applies so that callers who are iterating through a space can easily look for an `OUT_OF_RANGE` error to detect when they are done. HTTP Mapping: 400 Bad Request",
            "The operation is not implemented or is not supported/enabled in this service. HTTP Mapping: 501 Not Implemented",
            "Internal errors. This means that some invariants expected by the underlying system have been broken. This error code is reserved for serious errors. HTTP Mapping: 500 Internal Server Error",
            "The service is currently unavailable. This is most likely a transient condition, which can be corrected by retrying with a backoff. Note that it is not always safe to retry non-idempotent operations. See the guidelines above for deciding between `FAILED_PRECONDITION`, `ABORTED`, and `UNAVAILABLE`. HTTP Mapping: 503 Service Unavailable",
            "Unrecoverable data loss or corruption. HTTP Mapping: 500 Internal Server Error"
          ],
          "description": "The Google standard error code that best describes the state. For example: - OK means the analysis on this entity has been successfully finished; - PERMISSION_DENIED means an access denied error is encountered; - DEADLINE_EXCEEDED means the analysis on this entity hasn't been started in time;",
          "type": "string",
          "enum": [
            "OK",
            "CANCELLED",
            "UNKNOWN",
            "INVALID_ARGUMENT",
            "DEADLINE_EXCEEDED",
            "NOT_FOUND",
            "ALREADY_EXISTS",
            "PERMISSION_DENIED",
            "UNAUTHENTICATED",
            "RESOURCE_EXHAUSTED",
            "FAILED_PRECONDITION",
            "ABORTED",
            "OUT_OF_RANGE",
            "UNIMPLEMENTED",
            "INTERNAL",
            "UNAVAILABLE",
            "DATA_LOSS"
          ]
        },
        "cause": {
          "description": "The human-readable description of the cause of failure.",
          "type": "string"
        }
      },
      "description": "Represents the detailed state of an entity under analysis, such as a resource, an identity or an access."
    },
    "IamPolicyAnalysisResult": {
      "type": "object",
      "description": "IAM Policy analysis result, consisting of one IAM policy binding and derived access control lists.",
      "properties": {
        "fullyExplored": {
          "type": "boolean",
          "description": "Represents whether all analyses on the iam_binding have successfully finished."
        },
        "identityList": {
          "$ref": "GoogleCloudAssetV1p4beta1IdentityList",
          "description": "The identity list derived from members of the iam_binding that match or potentially match identity selector specified in the request."
        },
        "attachedResourceFullName": {
          "description": "The [full resource name](https://cloud.google.com/asset-inventory/docs/resource-name-format) of the resource to which the iam_binding policy attaches.",
          "type": "string"
        },
        "accessControlLists": {
          "items": {
            "$ref": "GoogleCloudAssetV1p4beta1AccessControlList"
          },
          "description": "The access control lists derived from the iam_binding that match or potentially match resource and access selectors specified in the request.",
          "type": "array"
        },
        "iamBinding": {
          "description": "The Cloud IAM policy binding under analysis.",
          "$ref": "Binding"
        }
      },
      "id": "IamPolicyAnalysisResult"
    },
    "GoogleCloudAssetV1p4beta1Access": {
      "type": "object",
      "id": "GoogleCloudAssetV1p4beta1Access",
      "description": "An IAM role or permission under analysis.",
      "properties": {
        "role": {
          "description": "The role.",
          "type": "string"
        },
        "analysisState": {
          "description": "The analysis state of this access.",
          "$ref": "GoogleCloudAssetV1p4beta1AnalysisState"
        },
        "permission": {
          "description": "The permission.",
          "type": "string"
        }
      }
    },
    "GoogleCloudAssetV1p4beta1IdentityList": {
      "type": "object",
      "id": "GoogleCloudAssetV1p4beta1IdentityList",
      "properties": {
        "groupEdges": {
          "description": "Group identity edges of the graph starting from the binding's group members to any node of the identities. The Edge.source_node contains a group, such as \"group:parent@google.com\". The Edge.target_node contains a member of the group, such as \"group:child@google.com\" or \"user:foo@google.com\". This field is present only if the output_group_edges option is enabled in request.",
          "items": {
            "$ref": "GoogleCloudAssetV1p4beta1Edge"
          },
          "type": "array"
        },
        "identities": {
          "description": "Only the identities that match one of the following conditions will be presented: - The identity_selector, if it is specified in request; - Otherwise, identities reachable from the policy binding's members.",
          "type": "array",
          "items": {
            "$ref": "GoogleCloudAssetV1p4beta1Identity"
          }
        }
      }
    },
    "IamPolicyAnalysisOutputConfig": {
      "id": "IamPolicyAnalysisOutputConfig",
      "type": "object",
      "description": "Output configuration for export IAM policy analysis destination.",
      "properties": {
        "gcsDestination": {
          "$ref": "GcsDestination",
          "description": "Destination on Cloud Storage."
        }
      }
    },
    "IdentitySelector": {
      "id": "IdentitySelector",
      "description": "Specifies an identity for which to determine resource access, based on roles assigned either directly to them or to the groups they belong to, directly or indirectly.",
      "type": "object",
      "properties": {
        "identity": {
          "type": "string",
          "description": "Required. The identity appear in the form of members in [IAM policy binding](https://cloud.google.com/iam/reference/rest/v1/Binding). The examples of supported forms are: \"user:mike@example.com\", \"group:admins@example.com\", \"domain:google.com\", \"serviceAccount:my-project-id@appspot.gserviceaccount.com\". Notice that wildcard characters (such as * and ?) are not supported. You must give a specific identity."
        }
      }
    },
    "AnalyzeIamPolicyResponse": {
      "properties": {
        "mainAnalysis": {
          "$ref": "IamPolicyAnalysis",
          "description": "The main analysis that matches the original request."
        },
        "fullyExplored": {
          "type": "boolean",
          "description": "Represents whether all entries in the main_analysis and service_account_impersonation_analysis have been fully explored to answer the query in the request."
        },
        "serviceAccountImpersonationAnalysis": {
          "type": "array",
          "description": "The service account impersonation analysis if AnalyzeIamPolicyRequest.analyze_service_account_impersonation is enabled.",
          "items": {
            "$ref": "IamPolicyAnalysis"
          }
        },
        "nonCriticalErrors": {
          "type": "array",
          "items": {
            "$ref": "GoogleCloudAssetV1p4beta1AnalysisState"
          },
          "description": "A list of non-critical errors happened during the request handling to explain why `fully_explored` is false, or empty if no error happened."
        }
      },
      "id": "AnalyzeIamPolicyResponse",
      "description": "A response message for AssetService.AnalyzeIamPolicy.",
      "type": "object"
    },
    "Options": {
      "properties": {
        "expandRoles": {
          "type": "boolean",
          "description": "Optional. If true, the access section of result will expand any roles appearing in IAM policy bindings to include their permissions. If access_selector is specified, the access section of the result will be determined by the selector, and this flag will have no effect. Default is false."
        },
        "expandResources": {
          "description": "Optional. If true, the resource section of the result will expand any resource attached to an IAM policy to include resources lower in the resource hierarchy. For example, if the request analyzes for which resources user A has permission P, and the results include an IAM policy with P on a GCP folder, the results will also include resources in that folder with permission P. If resource_selector is specified, the resource section of the result will be determined by the selector, and this flag will have no effect. Default is false.",
          "type": "boolean"
        },
        "expandGroups": {
          "type": "boolean",
          "description": "Optional. If true, the identities section of the result will expand any Google groups appearing in an IAM policy binding. If identity_selector is specified, the identity in the result will be determined by the selector, and this flag will have no effect. Default is false."
        },
        "outputGroupEdges": {
          "type": "boolean",
          "description": "Optional. If true, the result will output group identity edges, starting from the binding's group members, to any expanded identities. Default is false."
        },
        "analyzeServiceAccountImpersonation": {
          "type": "boolean",
          "description": "Optional. If true, the response will include access analysis from identities to resources via service account impersonation. This is a very expensive operation, because many derived queries will be executed. For example, if the request analyzes for which resources user A has permission P, and there's an IAM policy states user A has iam.serviceAccounts.getAccessToken permission to a service account SA, and there's another IAM policy states service account SA has permission P to a GCP folder F, then user A potentially has access to the GCP folder F. And those advanced analysis results will be included in AnalyzeIamPolicyResponse.service_account_impersonation_analysis. Another example, if the request analyzes for who has permission P to a GCP folder F, and there's an IAM policy states user A has iam.serviceAccounts.actAs permission to a service account SA, and there's another IAM policy states service account SA has permission P to the GCP folder F, then user A potentially has access to the GCP folder F. And those advanced analysis results will be included in AnalyzeIamPolicyResponse.service_account_impersonation_analysis. Default is false."
        },
        "outputResourceEdges": {
          "description": "Optional. If true, the result will output resource edges, starting from the policy attached resource, to any expanded resources. Default is false.",
          "type": "boolean"
        }
      },
      "id": "Options",
      "type": "object",
      "description": "Contains request options."
    },
    "Operation": {
      "description": "This resource represents a long-running operation that is the result of a network API call.",
      "type": "object",
      "properties": {
        "name": {
          "type": "string",
          "description": "The server-assigned name, which is only unique within the same service that originally returns it. If you use the default HTTP mapping, the `name` should be a resource name ending with `operations/{unique_id}`."
        },
        "done": {
          "description": "If the value is `false`, it means the operation is still in progress. If `true`, the operation is completed, and either `error` or `response` is available.",
          "type": "boolean"
        },
        "response": {
          "additionalProperties": {
            "description": "Properties of the object. Contains field @type with type URL.",
            "type": "any"
          },
          "description": "The normal response of the operation in case of success. If the original method returns no data on success, such as `Delete`, the response is `google.protobuf.Empty`. If the original method is standard `Get`/`Create`/`Update`, the response should be the resource. For other methods, the response should have the type `XxxResponse`, where `Xxx` is the original method name. For example, if the original method name is `TakeSnapshot()`, the inferred response type is `TakeSnapshotResponse`.",
          "type": "object"
        },
        "error": {
          "$ref": "Status",
          "description": "The error result of the operation in case of failure or cancellation."
        },
        "metadata": {
          "type": "object",
          "additionalProperties": {
            "description": "Properties of the object. Contains field @type with type URL.",
            "type": "any"
          },
          "description": "Service-specific metadata associated with the operation. It typically contains progress information and common metadata such as create time. Some services might not provide such metadata. Any method that returns a long-running operation should document the metadata type, if any."
        }
      },
      "id": "Operation"
    },
    "GoogleCloudAssetV1p4beta1Resource": {
      "id": "GoogleCloudAssetV1p4beta1Resource",
      "type": "object",
      "description": "A Google Cloud resource under analysis.",
      "properties": {
        "analysisState": {
          "$ref": "GoogleCloudAssetV1p4beta1AnalysisState",
          "description": "The analysis state of this resource."
        },
        "fullResourceName": {
          "description": "The [full resource name](https://cloud.google.com/asset-inventory/docs/resource-name-format)",
          "type": "string"
        }
      }
    },
    "IamPolicyAnalysisQuery": {
      "id": "IamPolicyAnalysisQuery",
      "type": "object",
      "description": "IAM policy analysis query message.",
      "properties": {
        "accessSelector": {
          "$ref": "AccessSelector",
          "description": "Optional. Specifies roles or permissions for analysis. This is optional."
        },
        "identitySelector": {
          "description": "Optional. Specifies an identity for analysis.",
          "$ref": "IdentitySelector"
        },
        "parent": {
          "description": "Required. The relative name of the root asset. Only resources and IAM policies within the parent will be analyzed. This can only be an organization number (such as \"organizations/123\"), a folder number (such as \"folders/123\"), a project ID (such as \"projects/my-project-id\"), or a project number (such as \"projects/12345\"). To know how to get organization id, visit [here ](https://cloud.google.com/resource-manager/docs/creating-managing-organization#retrieving_your_organization_id). To know how to get folder or project id, visit [here ](https://cloud.google.com/resource-manager/docs/creating-managing-folders#viewing_or_listing_folders_and_projects).",
          "type": "string"
        },
        "resourceSelector": {
          "description": "Optional. Specifies a resource for analysis.",
          "$ref": "ResourceSelector"
        }
      }
    },
    "ResourceSelector": {
      "id": "ResourceSelector",
      "type": "object",
      "properties": {
        "fullResourceName": {
          "type": "string",
          "description": "Required. The [full resource name](https://cloud.google.com/asset-inventory/docs/resource-name-format) of a resource of [supported resource types](https://cloud.google.com/asset-inventory/docs/supported-asset-types#analyzable_asset_types)."
        }
      },
      "description": "Specifies the resource to analyze for access policies, which may be set directly on the resource, or on ancestors such as organizations, folders or projects."
    },
    "Status": {
      "properties": {
        "message": {
          "description": "A developer-facing error message, which should be in English. Any user-facing error message should be localized and sent in the google.rpc.Status.details field, or localized by the client.",
          "type": "string"
        },
        "code": {
          "format": "int32",
          "type": "integer",
          "description": "The status code, which should be an enum value of google.rpc.Code."
        },
        "details": {
          "items": {
            "type": "object",
            "additionalProperties": {
              "type": "any",
              "description": "Properties of the object. Contains field @type with type URL."
            }
          },
          "description": "A list of messages that carry the error details. There is a common set of message types for APIs to use.",
          "type": "array"
        }
      },
      "id": "Status",
      "type": "object",
      "description": "The `Status` type defines a logical error model that is suitable for different programming environments, including REST APIs and RPC APIs. It is used by [gRPC](https://github.com/grpc). Each `Status` message contains three pieces of data: error code, error message, and error details. You can find out more about this error model and how to work with it in the [API Design Guide](https://cloud.google.com/apis/design/errors)."
    },
    "GcsDestination": {
      "type": "object",
      "description": "A Cloud Storage location.",
      "id": "GcsDestination",
      "properties": {
        "uri": {
          "description": "Required. The uri of the Cloud Storage object. It's the same uri that is used by gsutil. For example: \"gs://bucket_name/object_name\". See [Quickstart: Using the gsutil tool] (https://cloud.google.com/storage/docs/quickstart-gsutil) for examples.",
          "type": "string"
        }
      }
    },
    "GoogleCloudAssetV1p4beta1Identity": {
      "description": "An identity under analysis.",
      "type": "object",
      "id": "GoogleCloudAssetV1p4beta1Identity",
      "properties": {
        "name": {
          "description": "The identity name in any form of members appear in [IAM policy binding](https://cloud.google.com/iam/reference/rest/v1/Binding), such as: - user:foo@google.com - group:group1@google.com - serviceAccount:s1@prj1.iam.gserviceaccount.com - projectOwner:some_project_id - domain:google.com - allUsers - etc.",
          "type": "string"
        },
        "analysisState": {
          "description": "The analysis state of this identity.",
          "$ref": "GoogleCloudAssetV1p4beta1AnalysisState"
        }
      }
    },
    "GoogleCloudAssetV1p4beta1AccessControlList": {
      "id": "GoogleCloudAssetV1p4beta1AccessControlList",
      "properties": {
        "resources": {
          "items": {
            "$ref": "GoogleCloudAssetV1p4beta1Resource"
          },
          "description": "The resources that match one of the following conditions: - The resource_selector, if it is specified in request; - Otherwise, resources reachable from the policy attached resource.",
          "type": "array"
        },
        "resourceEdges": {
          "type": "array",
          "description": "Resource edges of the graph starting from the policy attached resource to any descendant resources. The Edge.source_node contains the full resource name of a parent resource and Edge.target_node contains the full resource name of a child resource. This field is present only if the output_resource_edges option is enabled in request.",
          "items": {
            "$ref": "GoogleCloudAssetV1p4beta1Edge"
          }
        },
        "accesses": {
          "type": "array",
          "items": {
            "$ref": "GoogleCloudAssetV1p4beta1Access"
          },
          "description": "The accesses that match one of the following conditions: - The access_selector, if it is specified in request; - Otherwise, access specifiers reachable from the policy binding's role."
        }
      },
      "type": "object",
      "description": "An access control list, derived from the above IAM policy binding, which contains a set of resources and accesses. May include one item from each set to compose an access control entry. NOTICE that there could be multiple access control lists for one IAM policy binding. The access control lists are created based on resource and access combinations. For example, assume we have the following cases in one IAM policy binding: - Permission P1 and P2 apply to resource R1 and R2; - Permission P3 applies to resource R2 and R3; This will result in the following access control lists: - AccessControlList 1: [R1, R2], [P1, P2] - AccessControlList 2: [R2, R3], [P3]"
    },
    "ExportIamPolicyAnalysisRequest": {
      "type": "object",
      "properties": {
        "outputConfig": {
          "description": "Required. Output configuration indicating where the results will be output to.",
          "$ref": "IamPolicyAnalysisOutputConfig"
        },
        "analysisQuery": {
          "$ref": "IamPolicyAnalysisQuery",
          "description": "Required. The request query."
        },
        "options": {
          "description": "Optional. The request options.",
          "$ref": "Options"
        }
      },
      "id": "ExportIamPolicyAnalysisRequest",
      "description": "A request message for AssetService.ExportIamPolicyAnalysis."
    },
    "IamPolicyAnalysis": {
      "properties": {
        "analysisQuery": {
          "description": "The analysis query.",
          "$ref": "IamPolicyAnalysisQuery"
        },
        "analysisResults": {
          "items": {
            "$ref": "IamPolicyAnalysisResult"
          },
          "description": "A list of IamPolicyAnalysisResult that matches the analysis query, or empty if no result is found.",
          "type": "array"
        },
        "fullyExplored": {
          "description": "Represents whether all entries in the analysis_results have been fully explored to answer the query.",
          "type": "boolean"
        }
      },
      "id": "IamPolicyAnalysis",
      "type": "object",
      "description": "An analysis message to group the query and results."
    },
    "AccessSelector": {
      "id": "AccessSelector",
      "properties": {
        "roles": {
          "type": "array",
          "description": "Optional. The roles to appear in result.",
          "items": {
            "type": "string"
          }
        },
        "permissions": {
          "items": {
            "type": "string"
          },
          "description": "Optional. The permissions to appear in result.",
          "type": "array"
        }
      },
      "description": "Specifies roles and/or permissions to analyze, to determine both the identities possessing them and the resources they control. If multiple values are specified, results will include identities and resources matching any of them. The total number of roles and permissions should be equal or less than 10.",
      "type": "object"
    },
    "Binding": {
      "properties": {
        "members": {
          "type": "array",
          "description": "Specifies the identities requesting access for a Cloud Platform resource. `members` can have the following values: * `allUsers`: A special identifier that represents anyone who is on the internet; with or without a Google account. * `allAuthenticatedUsers`: A special identifier that represents anyone who is authenticated with a Google account or a service account. * `user:{emailid}`: An email address that represents a specific Google account. For example, `alice@example.com` . * `serviceAccount:{emailid}`: An email address that represents a service account. For example, `my-other-app@appspot.gserviceaccount.com`. * `group:{emailid}`: An email address that represents a Google group. For example, `admins@example.com`. * `deleted:user:{emailid}?uid={uniqueid}`: An email address (plus unique identifier) representing a user that has been recently deleted. For example, `alice@example.com?uid=123456789012345678901`. If the user is recovered, this value reverts to `user:{emailid}` and the recovered user retains the role in the binding. * `deleted:serviceAccount:{emailid}?uid={uniqueid}`: An email address (plus unique identifier) representing a service account that has been recently deleted. For example, `my-other-app@appspot.gserviceaccount.com?uid=123456789012345678901`. If the service account is undeleted, this value reverts to `serviceAccount:{emailid}` and the undeleted service account retains the role in the binding. * `deleted:group:{emailid}?uid={uniqueid}`: An email address (plus unique identifier) representing a Google group that has been recently deleted. For example, `admins@example.com?uid=123456789012345678901`. If the group is recovered, this value reverts to `group:{emailid}` and the recovered group retains the role in the binding. * `domain:{domain}`: The G Suite domain (primary) that represents all the users of that domain. For example, `google.com` or `example.com`. ",
          "items": {
            "type": "string"
          }
        },
        "role": {
          "description": "Role that is assigned to `members`. For example, `roles/viewer`, `roles/editor`, or `roles/owner`.",
          "type": "string"
        },
        "condition": {
          "description": "The condition that is associated with this binding. If the condition evaluates to `true`, then this binding applies to the current request. If the condition evaluates to `false`, then this binding does not apply to the current request. However, a different role binding might grant the same role to one or more of the members in this binding. To learn which resources support conditions in their IAM policies, see the [IAM documentation](https://cloud.google.com/iam/help/conditions/resource-policies).",
          "$ref": "Expr"
        }
      },
      "id": "Binding",
      "type": "object",
      "description": "Associates `members` with a `role`."
    },
    "Expr": {
      "id": "Expr",
      "type": "object",
      "description": "Represents a textual expression in the Common Expression Language (CEL) syntax. CEL is a C-like expression language. The syntax and semantics of CEL are documented at https://github.com/google/cel-spec. Example (Comparison): title: \"Summary size limit\" description: \"Determines if a summary is less than 100 chars\" expression: \"document.summary.size() \u003c 100\" Example (Equality): title: \"Requestor is owner\" description: \"Determines if requestor is the document owner\" expression: \"document.owner == request.auth.claims.email\" Example (Logic): title: \"Public documents\" description: \"Determine whether the document should be publicly visible\" expression: \"document.type != 'private' && document.type != 'internal'\" Example (Data Manipulation): title: \"Notification string\" description: \"Create a notification string with a timestamp.\" expression: \"'New message received at ' + string(document.create_time)\" The exact variables and functions that may be referenced within an expression are determined by the service that evaluates it. See the service documentation for additional information.",
      "properties": {
        "description": {
          "description": "Optional. Description of the expression. This is a longer text which describes the expression, e.g. when hovered over it in a UI.",
          "type": "string"
        },
        "location": {
          "type": "string",
          "description": "Optional. String indicating the location of the expression for error reporting, e.g. a file name and a position in the file."
        },
        "title": {
          "type": "string",
          "description": "Optional. Title for the expression, i.e. a short string describing its purpose. This can be used e.g. in UIs which allow to enter the expression."
        },
        "expression": {
          "type": "string",
          "description": "Textual representation of an expression in Common Expression Language syntax."
        }
      }
    }
  },
  "documentationLink": "https://cloud.google.com/asset-inventory/docs/quickstart",
  "version": "v1p4beta1",
  "baseUrl": "https://cloudasset.googleapis.com/",
  "servicePath": "",
  "version_module": true,
  "basePath": "",
  "ownerDomain": "google.com",
  "canonicalName": "Cloud Asset",
  "title": "Cloud Asset API",
  "icons": {
    "x32": "http://www.google.com/images/icons/product/search-32.gif",
    "x16": "http://www.google.com/images/icons/product/search-16.gif"
  },
  "discoveryVersion": "v1",
  "batchPath": "batch",
  "auth": {
    "oauth2": {
      "scopes": {
        "https://www.googleapis.com/auth/cloud-platform": {
          "description": "View and manage your data across Google Cloud Platform services"
        }
      }
    }
  },
  "parameters": {
    "upload_protocol": {
      "location": "query",
      "type": "string",
      "description": "Upload protocol for media (e.g. \"raw\", \"multipart\")."
    },
    "fields": {
      "description": "Selector specifying which fields to include in a partial response.",
      "type": "string",
      "location": "query"
    },
    "oauth_token": {
      "location": "query",
      "description": "OAuth 2.0 token for the current user.",
      "type": "string"
    },
    "key": {
      "type": "string",
      "location": "query",
      "description": "API key. Your API key identifies your project and provides you with API access, quota, and reports. Required unless you provide an OAuth 2.0 token."
    },
    "$.xgafv": {
      "description": "V1 error format.",
      "type": "string",
      "enumDescriptions": [
        "v1 error format",
        "v2 error format"
      ],
      "location": "query",
      "enum": [
        "1",
        "2"
      ]
    },
    "callback": {
      "location": "query",
      "description": "JSONP",
      "type": "string"
    },
    "alt": {
      "location": "query",
      "type": "string",
      "description": "Data format for response.",
      "default": "json",
      "enumDescriptions": [
        "Responses with Content-Type of application/json",
        "Media download with context-dependent Content-Type",
        "Responses with Content-Type of application/x-protobuf"
      ],
      "enum": [
        "json",
        "media",
        "proto"
      ]
    },
    "access_token": {
      "location": "query",
      "description": "OAuth access token.",
      "type": "string"
    },
    "prettyPrint": {
      "default": "true",
      "location": "query",
      "description": "Returns response with indentations and line breaks.",
      "type": "boolean"
    },
    "quotaUser": {
      "location": "query",
      "type": "string",
      "description": "Available to use for quota purposes for server-side applications. Can be any arbitrary string assigned to a user, but should not exceed 40 characters."
    },
    "uploadType": {
      "location": "query",
      "description": "Legacy upload protocol for media (e.g. \"media\", \"multipart\").",
      "type": "string"
    }
  },
  "ownerName": "Google",
  "rootUrl": "https://cloudasset.googleapis.com/",
  "description": "The cloud asset API manages the history and inventory of cloud resources.",
  "revision": "20201106",
  "mtlsRootUrl": "https://cloudasset.mtls.googleapis.com/",
  "kind": "discovery#restDescription",
  "id": "cloudasset:v1p4beta1",
  "protocol": "rest",
  "resources": {
    "v1p4beta1": {
      "methods": {
        "exportIamPolicyAnalysis": {
          "path": "v1p4beta1/{+parent}:exportIamPolicyAnalysis",
          "response": {
            "$ref": "Operation"
          },
          "parameterOrder": [
            "parent"
          ],
          "flatPath": "v1p4beta1/{v1p4beta1Id}/{v1p4beta1Id1}:exportIamPolicyAnalysis",
          "id": "cloudasset.exportIamPolicyAnalysis",
          "description": "Exports the answers of which identities have what accesses on which resources to a Google Cloud Storage destination. The output format is the JSON format that represents a AnalyzeIamPolicyResponse in the JSON format. This method implements the google.longrunning.Operation, which allows you to keep track of the export. We recommend intervals of at least 2 seconds with exponential retry to poll the export operation result. The metadata contains the request to help callers to map responses to requests.",
          "scopes": [
            "https://www.googleapis.com/auth/cloud-platform"
          ],
          "request": {
            "$ref": "ExportIamPolicyAnalysisRequest"
          },
          "httpMethod": "POST",
          "parameters": {
            "parent": {
              "type": "string",
              "required": true,
              "description": "Required. The relative name of the root asset. Only resources and IAM policies within the parent will be analyzed. This can only be an organization number (such as \"organizations/123\"), a folder number (such as \"folders/123\"), a project ID (such as \"projects/my-project-id\"), or a project number (such as \"projects/12345\"). To know how to get organization id, visit [here ](https://cloud.google.com/resource-manager/docs/creating-managing-organization#retrieving_your_organization_id). To know how to get folder or project id, visit [here ](https://cloud.google.com/resource-manager/docs/creating-managing-folders#viewing_or_listing_folders_and_projects).",
              "pattern": "^[^/]+/[^/]+$",
              "location": "path"
            }
          }
        },
        "analyzeIamPolicy": {
          "flatPath": "v1p4beta1/{v1p4beta1Id}/{v1p4beta1Id1}:analyzeIamPolicy",
          "scopes": [
            "https://www.googleapis.com/auth/cloud-platform"
          ],
          "description": "Analyzes IAM policies to answer which identities have what accesses on which resources.",
          "response": {
            "$ref": "AnalyzeIamPolicyResponse"
          },
          "path": "v1p4beta1/{+parent}:analyzeIamPolicy",
          "parameterOrder": [
            "parent"
          ],
          "httpMethod": "GET",
          "parameters": {
            "analysisQuery.accessSelector.permissions": {
              "repeated": true,
              "description": "Optional. The permissions to appear in result.",
              "type": "string",
              "location": "query"
            },
            "options.expandRoles": {
              "description": "Optional. If true, the access section of result will expand any roles appearing in IAM policy bindings to include their permissions. If access_selector is specified, the access section of the result will be determined by the selector, and this flag will have no effect. Default is false.",
              "type": "boolean",
              "location": "query"
            },
            "analysisQuery.identitySelector.identity": {
              "type": "string",
              "description": "Required. The identity appear in the form of members in [IAM policy binding](https://cloud.google.com/iam/reference/rest/v1/Binding). The examples of supported forms are: \"user:mike@example.com\", \"group:admins@example.com\", \"domain:google.com\", \"serviceAccount:my-project-id@appspot.gserviceaccount.com\". Notice that wildcard characters (such as * and ?) are not supported. You must give a specific identity.",
              "location": "query"
            },
            "options.expandGroups": {
              "location": "query",
              "description": "Optional. If true, the identities section of the result will expand any Google groups appearing in an IAM policy binding. If identity_selector is specified, the identity in the result will be determined by the selector, and this flag will have no effect. Default is false.",
              "type": "boolean"
            },
            "analysisQuery.resourceSelector.fullResourceName": {
              "description": "Required. The [full resource name](https://cloud.google.com/asset-inventory/docs/resource-name-format) of a resource of [supported resource types](https://cloud.google.com/asset-inventory/docs/supported-asset-types#analyzable_asset_types).",
              "type": "string",
              "location": "query"
            },
            "analysisQuery.accessSelector.roles": {
              "description": "Optional. The roles to appear in result.",
              "type": "string",
              "location": "query",
              "repeated": true
            },
            "options.outputGroupEdges": {
              "description": "Optional. If true, the result will output group identity edges, starting from the binding's group members, to any expanded identities. Default is false.",
              "type": "boolean",
              "location": "query"
            },
            "options.expandResources": {
              "description": "Optional. If true, the resource section of the result will expand any resource attached to an IAM policy to include resources lower in the resource hierarchy. For example, if the request analyzes for which resources user A has permission P, and the results include an IAM policy with P on a GCP folder, the results will also include resources in that folder with permission P. If resource_selector is specified, the resource section of the result will be determined by the selector, and this flag will have no effect. Default is false.",
              "type": "boolean",
              "location": "query"
            },
            "parent": {
              "required": true,
              "pattern": "^[^/]+/[^/]+$",
              "description": "Required. The relative name of the root asset. Only resources and IAM policies within the parent will be analyzed. This can only be an organization number (such as \"organizations/123\"), a folder number (such as \"folders/123\"), a project ID (such as \"projects/my-project-id\"), or a project number (such as \"projects/12345\"). To know how to get organization id, visit [here ](https://cloud.google.com/resource-manager/docs/creating-managing-organization#retrieving_your_organization_id). To know how to get folder or project id, visit [here ](https://cloud.google.com/resource-manager/docs/creating-managing-folders#viewing_or_listing_folders_and_projects).",
              "type": "string",
              "location": "path"
            },
            "options.analyzeServiceAccountImpersonation": {
              "description": "Optional. If true, the response will include access analysis from identities to resources via service account impersonation. This is a very expensive operation, because many derived queries will be executed. We highly recommend you use AssetService.ExportIamPolicyAnalysis rpc instead. For example, if the request analyzes for which resources user A has permission P, and there's an IAM policy states user A has iam.serviceAccounts.getAccessToken permission to a service account SA, and there's another IAM policy states service account SA has permission P to a GCP folder F, then user A potentially has access to the GCP folder F. And those advanced analysis results will be included in AnalyzeIamPolicyResponse.service_account_impersonation_analysis. Another example, if the request analyzes for who has permission P to a GCP folder F, and there's an IAM policy states user A has iam.serviceAccounts.actAs permission to a service account SA, and there's another IAM policy states service account SA has permission P to the GCP folder F, then user A potentially has access to the GCP folder F. And those advanced analysis results will be included in AnalyzeIamPolicyResponse.service_account_impersonation_analysis. Default is false.",
              "type": "boolean",
              "location": "query"
            },
            "options.outputResourceEdges": {
              "description": "Optional. If true, the result will output resource edges, starting from the policy attached resource, to any expanded resources. Default is false.",
              "location": "query",
              "type": "boolean"
            },
            "options.executionTimeout": {
              "location": "query",
              "description": "Optional. Amount of time executable has to complete. See JSON representation of [Duration](https://developers.google.com/protocol-buffers/docs/proto3#json). If this field is set with a value less than the RPC deadline, and the execution of your query hasn't finished in the specified execution timeout, you will get a response with partial result. Otherwise, your query's execution will continue until the RPC deadline. If it's not finished until then, you will get a DEADLINE_EXCEEDED error. Default is empty.",
              "type": "string",
              "format": "google-duration"
            }
          },
          "id": "cloudasset.analyzeIamPolicy"
        }
      }
    }
  },
  "name": "cloudasset"
}
