{
  "ownerDomain": "google.com",
  "schemas": {
    "SourceProvenance": {
      "properties": {
        "resolvedRepoSource": {
          "description": "A copy of the build's `source.repo_source`, if exists, with any revisions resolved.",
          "$ref": "RepoSource"
        },
        "resolvedStorageSource": {
          "description": "A copy of the build's `source.storage_source`, if exists, with any generations resolved.",
          "$ref": "StorageSource"
        },
        "fileHashes": {
          "additionalProperties": {
            "$ref": "FileHashes"
          },
          "type": "object",
          "readOnly": true,
          "description": "Output only. Hash(es) of the build source, which can be used to verify that the original source integrity was maintained in the build. Note that `FileHashes` will only be populated if `BuildOptions` has requested a `SourceProvenanceHash`. The keys to this map are file paths used as build source and the values contain the hash values for those files. If the build source came in a single package such as a gzipped tarfile (`.tar.gz`), the `FileHash` will be for the single path to that file."
        }
      },
      "description": "Provenance of the source. Ways to find the original source, or verify that some source was used for this build.",
      "id": "SourceProvenance",
      "type": "object"
    },
    "BuildOperationMetadata": {
      "properties": {
        "build": {
          "description": "The build that the operation is tracking.",
          "$ref": "Build"
        }
      },
      "id": "BuildOperationMetadata",
      "description": "Metadata for build operations.",
      "type": "object"
    },
    "Operation": {
      "type": "object",
      "description": "This resource represents a long-running operation that is the result of a network API call.",
      "properties": {
        "error": {
          "$ref": "Status",
          "description": "The error result of the operation in case of failure or cancellation."
        },
        "response": {
          "description": "The normal response of the operation in case of success. If the original method returns no data on success, such as `Delete`, the response is `google.protobuf.Empty`. If the original method is standard `Get`/`Create`/`Update`, the response should be the resource. For other methods, the response should have the type `XxxResponse`, where `Xxx` is the original method name. For example, if the original method name is `TakeSnapshot()`, the inferred response type is `TakeSnapshotResponse`.",
          "type": "object",
          "additionalProperties": {
            "description": "Properties of the object. Contains field @type with type URL.",
            "type": "any"
          }
        },
        "name": {
          "description": "The server-assigned name, which is only unique within the same service that originally returns it. If you use the default HTTP mapping, the `name` should be a resource name ending with `operations/{unique_id}`.",
          "type": "string"
        },
        "metadata": {
          "description": "Service-specific metadata associated with the operation. It typically contains progress information and common metadata such as create time. Some services might not provide such metadata. Any method that returns a long-running operation should document the metadata type, if any.",
          "additionalProperties": {
            "description": "Properties of the object. Contains field @type with type URL.",
            "type": "any"
          },
          "type": "object"
        },
        "done": {
          "type": "boolean",
          "description": "If the value is `false`, it means the operation is still in progress. If `true`, the operation is completed, and either `error` or `response` is available."
        }
      },
      "id": "Operation"
    },
    "NotifierConfig": {
      "properties": {
        "apiVersion": {
          "type": "string",
          "description": "The API version of this configuration format."
        },
        "kind": {
          "description": "The type of notifier to use (e.g. SMTPNotifier).",
          "type": "string"
        },
        "metadata": {
          "$ref": "NotifierMetadata",
          "description": "Metadata for referring to/handling/deploying this notifier."
        },
        "spec": {
          "$ref": "NotifierSpec",
          "description": "The actual configuration for this notifier."
        }
      },
      "description": "NotifierConfig is the top-level configuration message.",
      "type": "object",
      "id": "NotifierConfig"
    },
    "WorkerConfig": {
      "type": "object",
      "properties": {
        "diskSizeGb": {
          "format": "int64",
          "type": "string",
          "description": "Size of the disk attached to the worker, in GB. See https://cloud.google.com/compute/docs/disks/ If `0` is specified, Cloud Build will use a standard disk size."
        },
        "machineType": {
          "type": "string",
          "description": "Machine Type of the worker, such as n1-standard-1. See https://cloud.google.com/compute/docs/machine-types. If left blank, Cloud Build will use a standard unspecified machine to create the worker pool."
        }
      },
      "id": "WorkerConfig",
      "description": "WorkerConfig defines the configuration to be used for a creating workers in the pool."
    },
    "Status": {
      "type": "object",
      "description": "The `Status` type defines a logical error model that is suitable for different programming environments, including REST APIs and RPC APIs. It is used by [gRPC](https://github.com/grpc). Each `Status` message contains three pieces of data: error code, error message, and error details. You can find out more about this error model and how to work with it in the [API Design Guide](https://cloud.google.com/apis/design/errors).",
      "id": "Status",
      "properties": {
        "details": {
          "items": {
            "type": "object",
            "additionalProperties": {
              "description": "Properties of the object. Contains field @type with type URL.",
              "type": "any"
            }
          },
          "type": "array",
          "description": "A list of messages that carry the error details. There is a common set of message types for APIs to use."
        },
        "code": {
          "type": "integer",
          "description": "The status code, which should be an enum value of google.rpc.Code.",
          "format": "int32"
        },
        "message": {
          "description": "A developer-facing error message, which should be in English. Any user-facing error message should be localized and sent in the google.rpc.Status.details field, or localized by the client.",
          "type": "string"
        }
      }
    },
    "HTTPDelivery": {
      "properties": {
        "uri": {
          "description": "The URI to which JSON-containing HTTP POST requests should be sent.",
          "type": "string"
        }
      },
      "type": "object",
      "description": "HTTPDelivery is the delivery configuration for an HTTP notification.",
      "id": "HTTPDelivery"
    },
    "WorkerPool": {
      "type": "object",
      "description": "Configuration for a WorkerPool to run the builds. Workers are machines that Cloud Build uses to run your builds. By default, all workers run in a project owned by Cloud Build. To have full control over the workers that execute your builds -- such as enabling them to access private resources on your private network -- you can request Cloud Build to run the workers in your own project by creating a custom workers pool.",
      "properties": {
        "name": {
          "readOnly": true,
          "description": "Output only. The resource name of the `WorkerPool`. Format of the name is `projects/{project_id}/workerPools/{worker_pool_id}`, where the value of {worker_pool_id} is provided in the CreateWorkerPool request.",
          "type": "string"
        },
        "deleteTime": {
          "readOnly": true,
          "format": "google-datetime",
          "type": "string",
          "description": "Output only. Time at which the request to delete the `WorkerPool` was received."
        },
        "region": {
          "type": "string",
          "description": "Required. Immutable. The region where the `WorkerPool` runs. Only \"us-central1\" is currently supported. Note that `region` cannot be changed once the `WorkerPool` is created."
        },
        "state": {
          "type": "string",
          "enumDescriptions": [
            "State of the `WorkerPool` is unknown.",
            "`WorkerPool` is being created.",
            "`WorkerPool` is running.",
            "`WorkerPool` is being deleted: cancelling builds and draining workers.",
            "`WorkerPool` is deleted."
          ],
          "readOnly": true,
          "enum": [
            "STATE_UNSPECIFIED",
            "CREATING",
            "RUNNING",
            "DELETING",
            "DELETED"
          ],
          "description": "Output only. WorkerPool state."
        },
        "workerConfig": {
          "description": "Worker configuration for the `WorkerPool`.",
          "$ref": "WorkerConfig"
        },
        "createTime": {
          "format": "google-datetime",
          "type": "string",
          "description": "Output only. Time at which the request to create the `WorkerPool` was received.",
          "readOnly": true
        },
        "updateTime": {
          "description": "Output only. Time at which the request to update the `WorkerPool` was received.",
          "format": "google-datetime",
          "readOnly": true,
          "type": "string"
        },
        "networkConfig": {
          "description": "Network configuration for the `WorkerPool`.",
          "$ref": "NetworkConfig"
        }
      },
      "id": "WorkerPool"
    },
    "Build": {
      "properties": {
        "source": {
          "$ref": "Source",
          "description": "The location of the source files to build."
        },
        "createTime": {
          "readOnly": true,
          "description": "Output only. Time at which the request to create the build was received.",
          "format": "google-datetime",
          "type": "string"
        },
        "serviceAccount": {
          "type": "string",
          "description": "IAM service account whose credentials will be used at build runtime. Must be of the format `projects/{PROJECT_ID}/serviceAccounts/{ACCOUNT}`. ACCOUNT can be email address or uniqueId of the service account. This field is in alpha and is not publicly available."
        },
        "secrets": {
          "type": "array",
          "items": {
            "$ref": "Secret"
          },
          "description": "Secrets to decrypt using Cloud Key Management Service."
        },
        "steps": {
          "type": "array",
          "description": "Required. The operations to be performed on the workspace.",
          "items": {
            "$ref": "BuildStep"
          }
        },
        "buildTriggerId": {
          "description": "Output only. The ID of the `BuildTrigger` that triggered this build, if it was triggered automatically.",
          "type": "string",
          "readOnly": true
        },
        "logsBucket": {
          "type": "string",
          "description": "Google Cloud Storage bucket where logs should be written (see [Bucket Name Requirements](https://cloud.google.com/storage/docs/bucket-naming#requirements)). Logs file names will be of the format `${logs_bucket}/log-${build_id}.txt`."
        },
        "substitutions": {
          "type": "object",
          "additionalProperties": {
            "type": "string"
          },
          "description": "Substitutions data for `Build` resource."
        },
        "artifacts": {
          "description": "Artifacts produced by the build that should be uploaded upon successful completion of all build steps.",
          "$ref": "Artifacts"
        },
        "statusDetail": {
          "type": "string",
          "readOnly": true,
          "description": "Output only. Customer-readable message about the current status."
        },
        "tags": {
          "description": "Tags for annotation of a `Build`. These are not docker tags.",
          "type": "array",
          "items": {
            "type": "string"
          }
        },
        "sourceProvenance": {
          "readOnly": true,
          "$ref": "SourceProvenance",
          "description": "Output only. A permanent fixed identifier for source."
        },
        "timeout": {
          "format": "google-duration",
          "description": "Amount of time that this build should be allowed to run, to second granularity. If this amount of time elapses, work on the build will cease and the build status will be `TIMEOUT`. `timeout` starts ticking from `startTime`. Default time is ten minutes.",
          "type": "string"
        },
        "logUrl": {
          "type": "string",
          "readOnly": true,
          "description": "Output only. URL to logs for this build in Google Cloud Console."
        },
        "projectId": {
          "description": "Output only. ID of the project.",
          "readOnly": true,
          "type": "string"
        },
        "images": {
          "description": "A list of images to be pushed upon the successful completion of all build steps. The images are pushed using the builder service account's credentials. The digests of the pushed images will be stored in the `Build` resource's results field. If any of the images fail to be pushed, the build status is marked `FAILURE`.",
          "type": "array",
          "items": {
            "type": "string"
          }
        },
        "queueTtl": {
          "format": "google-duration",
          "type": "string",
          "description": "TTL in queue for this build. If provided and the build is enqueued longer than this value, the build will expire and the build status will be `EXPIRED`. The TTL starts ticking from create_time."
        },
        "name": {
          "readOnly": true,
          "description": "Output only. The 'Build' name with format: `projects/{project}/locations/{location}/builds/{build}`, where {build} is a unique identifier generated by the service.",
          "type": "string"
        },
        "timing": {
          "readOnly": true,
          "additionalProperties": {
            "$ref": "TimeSpan"
          },
          "type": "object",
          "description": "Output only. Stores timing information for phases of the build. Valid keys are: * BUILD: time to execute all build steps * PUSH: time to push all specified images. * FETCHSOURCE: time to fetch source. If the build does not specify source or images, these keys will not be included."
        },
        "status": {
          "readOnly": true,
          "enumDescriptions": [
            "Status of the build is unknown.",
            "Build or step is queued; work has not yet begun.",
            "Build or step is being executed.",
            "Build or step finished successfully.",
            "Build or step failed to complete successfully.",
            "Build or step failed due to an internal cause.",
            "Build or step took longer than was allowed.",
            "Build or step was canceled by a user.",
            "Build was enqueued for longer than the value of `queue_ttl`."
          ],
          "enum": [
            "STATUS_UNKNOWN",
            "QUEUED",
            "WORKING",
            "SUCCESS",
            "FAILURE",
            "INTERNAL_ERROR",
            "TIMEOUT",
            "CANCELLED",
            "EXPIRED"
          ],
          "type": "string",
          "description": "Output only. Status of the build."
        },
        "finishTime": {
          "readOnly": true,
          "description": "Output only. Time at which execution of the build was finished. The difference between finish_time and start_time is the duration of the build's execution.",
          "format": "google-datetime",
          "type": "string"
        },
        "startTime": {
          "description": "Output only. Time at which execution of the build was started.",
          "type": "string",
          "format": "google-datetime",
          "readOnly": true
        },
        "options": {
          "description": "Special options for this build.",
          "$ref": "BuildOptions"
        },
        "results": {
          "description": "Output only. Results of the build.",
          "readOnly": true,
          "$ref": "Results"
        },
        "id": {
          "description": "Output only. Unique identifier of the build.",
          "type": "string",
          "readOnly": true
        }
      },
      "id": "Build",
      "description": "A build resource in the Cloud Build API. At a high level, a `Build` describes where to find source code, how to build it (for example, the builder image to run on the source), and where to store the built artifacts. Fields can include the following variables, which will be expanded when the build is created: - $PROJECT_ID: the project ID of the build. - $BUILD_ID: the autogenerated ID of the build. - $REPO_NAME: the source repository name specified by RepoSource. - $BRANCH_NAME: the branch name specified by RepoSource. - $TAG_NAME: the tag name specified by RepoSource. - $REVISION_ID or $COMMIT_SHA: the commit SHA specified by RepoSource or resolved from the specified branch or tag. - $SHORT_SHA: first 7 characters of $REVISION_ID or $COMMIT_SHA.",
      "type": "object"
    },
    "BuiltImage": {
      "type": "object",
      "description": "An image built by the pipeline.",
      "properties": {
        "digest": {
          "type": "string",
          "description": "Docker Registry 2.0 digest."
        },
        "pushTiming": {
          "description": "Output only. Stores timing information for pushing the specified image.",
          "readOnly": true,
          "$ref": "TimeSpan"
        },
        "name": {
          "type": "string",
          "description": "Name used to push the container image to Google Container Registry, as presented to `docker push`."
        }
      },
      "id": "BuiltImage"
    },
    "NotifierSecretRef": {
      "properties": {
        "secretRef": {
          "description": "The value of `secret_ref` should be a `name` that is registered in a `Secret` in the `secrets` list of the `Spec`.",
          "type": "string"
        }
      },
      "id": "NotifierSecretRef",
      "description": "NotifierSecretRef contains the reference to a secret stored in the corresponding NotifierSpec.",
      "type": "object"
    },
    "NotifierSecret": {
      "description": "NotifierSecret is the container that maps a secret name (reference) to its Google Cloud Secret Manager resource path.",
      "id": "NotifierSecret",
      "type": "object",
      "properties": {
        "name": {
          "description": "Name is the local name of the secret, such as the verbatim string \"my-smtp-password\".",
          "type": "string"
        },
        "value": {
          "description": "Value is interpreted to be a resource path for fetching the actual (versioned) secret data for this secret. For example, this would be a Google Cloud Secret Manager secret version resource path like: \"projects/my-project/secrets/my-secret/versions/latest\".",
          "type": "string"
        }
      }
    },
    "BuildOptions": {
      "properties": {
        "logging": {
          "enum": [
            "LOGGING_UNSPECIFIED",
            "LEGACY",
            "GCS_ONLY",
            "STACKDRIVER_ONLY",
            "CLOUD_LOGGING_ONLY",
            "NONE"
          ],
          "enumDescriptions": [
            "The service determines the logging mode. The default is `LEGACY`. Do not rely on the default logging behavior as it may change in the future.",
            "Cloud Logging and Cloud Storage logging are enabled.",
            "Only Cloud Storage logging is enabled.",
            "This option is the same as CLOUD_LOGGING_ONLY.",
            "Only Cloud Logging is enabled. Note that logs for both the Cloud Console UI and Cloud SDK are based on Cloud Storage logs, so neither will provide logs if this option is chosen.",
            "Turn off all logging. No build logs will be captured. Next ID: 6"
          ],
          "type": "string",
          "description": "Option to specify the logging mode, which determines if and where build logs are stored."
        },
        "logStreamingOption": {
          "enumDescriptions": [
            "Service may automatically determine build log streaming behavior.",
            "Build logs should be streamed to Google Cloud Storage.",
            "Build logs should not be streamed to Google Cloud Storage; they will be written when the build is completed."
          ],
          "description": "Option to define build log streaming behavior to Google Cloud Storage.",
          "enum": [
            "STREAM_DEFAULT",
            "STREAM_ON",
            "STREAM_OFF"
          ],
          "type": "string"
        },
        "secretEnv": {
          "type": "array",
          "description": "A list of global environment variables, which are encrypted using a Cloud Key Management Service crypto key. These values must be specified in the build's `Secret`. These variables will be available to all build steps in this build.",
          "items": {
            "type": "string"
          }
        },
        "workerPool": {
          "type": "string",
          "description": "Option to specify a `WorkerPool` for the build. Format: projects/{project}/locations/{location}/workerPools/{workerPool} This field is experimental."
        },
        "dynamicSubstitutions": {
          "description": "Option to specify whether or not to apply bash style string operations to the substitutions. NOTE: this is always enabled for triggered builds and cannot be overridden in the build configuration file.",
          "type": "boolean"
        },
        "env": {
          "description": "A list of global environment variable definitions that will exist for all build steps in this build. If a variable is defined in both globally and in a build step, the variable will use the build step value. The elements are of the form \"KEY=VALUE\" for the environment variable \"KEY\" being given the value \"VALUE\".",
          "type": "array",
          "items": {
            "type": "string"
          }
        },
        "requestedVerifyOption": {
          "enumDescriptions": [
            "Not a verifiable build. (default)",
            "Verified build."
          ],
          "type": "string",
          "description": "Requested verifiability options.",
          "enum": [
            "NOT_VERIFIED",
            "VERIFIED"
          ]
        },
        "diskSizeGb": {
          "type": "string",
          "format": "int64",
          "description": "Requested disk size for the VM that runs the build. Note that this is *NOT* \"disk free\"; some of the space will be used by the operating system and build utilities. Also note that this is the minimum disk size that will be allocated for the build -- the build may run with a larger disk than requested. At present, the maximum disk size is 1000GB; builds that request more than the maximum are rejected with an error."
        },
        "volumes": {
          "items": {
            "$ref": "Volume"
          },
          "description": "Global list of volumes to mount for ALL build steps Each volume is created as an empty volume prior to starting the build process. Upon completion of the build, volumes and their contents are discarded. Global volume names and paths cannot conflict with the volumes defined a build step. Using a global volume in a build with only one step is not valid as it is indicative of a build request with an incorrect configuration.",
          "type": "array"
        },
        "machineType": {
          "enum": [
            "UNSPECIFIED",
            "N1_HIGHCPU_8",
            "N1_HIGHCPU_32"
          ],
          "type": "string",
          "description": "Compute Engine machine type on which to run the build.",
          "enumDescriptions": [
            "Standard machine type.",
            "Highcpu machine with 8 CPUs.",
            "Highcpu machine with 32 CPUs."
          ]
        },
        "sourceProvenanceHash": {
          "description": "Requested hash for SourceProvenance.",
          "type": "array",
          "items": {
            "enumDescriptions": [
              "No hash requested.",
              "Use a sha256 hash.",
              "Use a md5 hash."
            ],
            "type": "string",
            "enum": [
              "NONE",
              "SHA256",
              "MD5"
            ]
          }
        },
        "substitutionOption": {
          "enum": [
            "MUST_MATCH",
            "ALLOW_LOOSE"
          ],
          "enumDescriptions": [
            "Fails the build if error in substitutions checks, like missing a substitution in the template or in the map.",
            "Do not fail the build if error in substitutions checks."
          ],
          "description": "Option to specify behavior when there is an error in the substitution checks. NOTE: this is always set to ALLOW_LOOSE for triggered builds and cannot be overridden in the build configuration file.",
          "type": "string"
        }
      },
      "id": "BuildOptions",
      "description": "Optional arguments to enable specific features of builds.",
      "type": "object"
    },
    "Results": {
      "type": "object",
      "properties": {
        "numArtifacts": {
          "format": "int64",
          "description": "Number of artifacts uploaded. Only populated when artifacts are uploaded.",
          "type": "string"
        },
        "images": {
          "type": "array",
          "items": {
            "$ref": "BuiltImage"
          },
          "description": "Container images that were built as a part of the build."
        },
        "artifactManifest": {
          "type": "string",
          "description": "Path to the artifact manifest. Only populated when artifacts are uploaded."
        },
        "buildStepImages": {
          "type": "array",
          "items": {
            "type": "string"
          },
          "description": "List of build step digests, in the order corresponding to build step indices."
        },
        "buildStepOutputs": {
          "type": "array",
          "items": {
            "format": "byte",
            "type": "string"
          },
          "description": "List of build step outputs, produced by builder images, in the order corresponding to build step indices. [Cloud Builders](https://cloud.google.com/cloud-build/docs/cloud-builders) can produce this output by writing to `$BUILDER_OUTPUT/output`. Only the first 4KB of data is stored."
        },
        "artifactTiming": {
          "description": "Time to push all non-container artifacts.",
          "$ref": "TimeSpan"
        }
      },
      "id": "Results",
      "description": "Artifacts created by the build pipeline."
    },
    "RepoSource": {
      "id": "RepoSource",
      "properties": {
        "commitSha": {
          "type": "string",
          "description": "Explicit commit SHA to build."
        },
        "branchName": {
          "type": "string",
          "description": "Regex matching branches to build. The syntax of the regular expressions accepted is the syntax accepted by RE2 and described at https://github.com/google/re2/wiki/Syntax"
        },
        "tagName": {
          "description": "Regex matching tags to build. The syntax of the regular expressions accepted is the syntax accepted by RE2 and described at https://github.com/google/re2/wiki/Syntax",
          "type": "string"
        },
        "substitutions": {
          "description": "Substitutions to use in a triggered build. Should only be used with RunBuildTrigger",
          "additionalProperties": {
            "type": "string"
          },
          "type": "object"
        },
        "dir": {
          "description": "Directory, relative to the source root, in which to run the build. This must be a relative path. If a step's `dir` is specified and is an absolute path, this value is ignored for that step's execution.",
          "type": "string"
        },
        "repoName": {
          "description": "Required. Name of the Cloud Source Repository.",
          "type": "string"
        },
        "projectId": {
          "type": "string",
          "description": "ID of the project that owns the Cloud Source Repository. If omitted, the project ID requesting the build is assumed."
        },
        "invertRegex": {
          "description": "Only trigger a build if the revision regex does NOT match the revision regex.",
          "type": "boolean"
        }
      },
      "type": "object",
      "description": "Location of the source in a Google Cloud Source Repository."
    },
    "ArtifactResult": {
      "description": "An artifact that was uploaded during a build. This is a single record in the artifact manifest JSON file.",
      "id": "ArtifactResult",
      "type": "object",
      "properties": {
        "location": {
          "description": "The path of an artifact in a Google Cloud Storage bucket, with the generation number. For example, `gs://mybucket/path/to/output.jar#generation`.",
          "type": "string"
        },
        "fileHash": {
          "type": "array",
          "description": "The file hash of the artifact.",
          "items": {
            "$ref": "FileHashes"
          }
        }
      }
    },
    "Empty": {
      "properties": {},
      "description": "A generic empty message that you can re-use to avoid defining duplicated empty messages in your APIs. A typical example is to use it as the request or the response type of an API method. For instance: service Foo { rpc Bar(google.protobuf.Empty) returns (google.protobuf.Empty); } The JSON representation for `Empty` is empty JSON object `{}`.",
      "type": "object",
      "id": "Empty"
    },
    "SMTPDelivery": {
      "id": "SMTPDelivery",
      "description": "SMTPDelivery is the delivery configuration for an SMTP (email) notification.",
      "properties": {
        "senderAddress": {
          "description": "This is the SMTP account/email that is used to send the message.",
          "type": "string"
        },
        "fromAddress": {
          "description": "This is the SMTP account/email that appears in the `From:` of the email. If empty, it is assumed to be sender.",
          "type": "string"
        },
        "recipientAddresses": {
          "items": {
            "type": "string"
          },
          "type": "array",
          "description": "This is the list of addresses to which we send the email (i.e. in the `To:` of the email)."
        },
        "password": {
          "description": "The SMTP sender's password.",
          "$ref": "NotifierSecretRef"
        },
        "port": {
          "description": "The SMTP port of the server.",
          "type": "string"
        },
        "server": {
          "description": "The address of the SMTP server.",
          "type": "string"
        }
      },
      "type": "object"
    },
    "Artifacts": {
      "properties": {
        "images": {
          "items": {
            "type": "string"
          },
          "description": "A list of images to be pushed upon the successful completion of all build steps. The images will be pushed using the builder service account's credentials. The digests of the pushed images will be stored in the Build resource's results field. If any of the images fail to be pushed, the build is marked FAILURE.",
          "type": "array"
        },
        "objects": {
          "$ref": "ArtifactObjects",
          "description": "A list of objects to be uploaded to Cloud Storage upon successful completion of all build steps. Files in the workspace matching specified paths globs will be uploaded to the specified Cloud Storage location using the builder service account's credentials. The location and generation of the uploaded objects will be stored in the Build resource's results field. If any objects fail to be pushed, the build is marked FAILURE."
        }
      },
      "type": "object",
      "description": "Artifacts produced by a build that should be uploaded upon successful completion of all build steps.",
      "id": "Artifacts"
    },
    "StorageSource": {
      "type": "object",
      "properties": {
        "bucket": {
          "type": "string",
          "description": "Google Cloud Storage bucket containing the source (see [Bucket Name Requirements](https://cloud.google.com/storage/docs/bucket-naming#requirements))."
        },
        "object": {
          "type": "string",
          "description": "Google Cloud Storage object containing the source. This object must be a gzipped archive file (`.tar.gz`) containing source to build."
        },
        "generation": {
          "format": "int64",
          "description": "Google Cloud Storage generation for the object. If the generation is omitted, the latest generation will be used.",
          "type": "string"
        }
      },
      "id": "StorageSource",
      "description": "Location of the source in an archive file in Google Cloud Storage."
    },
    "FileHashes": {
      "properties": {
        "fileHash": {
          "description": "Collection of file hashes.",
          "items": {
            "$ref": "Hash"
          },
          "type": "array"
        }
      },
      "type": "object",
      "id": "FileHashes",
      "description": "Container message for hashes of byte content of files, used in SourceProvenance messages to verify integrity of source input to the build."
    },
    "ArtifactObjects": {
      "type": "object",
      "description": "Files in the workspace to upload to Cloud Storage upon successful completion of all build steps.",
      "properties": {
        "paths": {
          "items": {
            "type": "string"
          },
          "description": "Path globs used to match files in the build's workspace.",
          "type": "array"
        },
        "location": {
          "description": "Cloud Storage bucket and optional object path, in the form \"gs://bucket/path/to/somewhere/\". (see [Bucket Name Requirements](https://cloud.google.com/storage/docs/bucket-naming#requirements)). Files in the workspace matching any path pattern will be uploaded to Cloud Storage with this location as a prefix.",
          "type": "string"
        },
        "timing": {
          "description": "Output only. Stores timing information for pushing all artifact objects.",
          "$ref": "TimeSpan",
          "readOnly": true
        }
      },
      "id": "ArtifactObjects"
    },
    "Source": {
      "id": "Source",
      "properties": {
        "repoSource": {
          "$ref": "RepoSource",
          "description": "If provided, get the source from this location in a Cloud Source Repository."
        },
        "storageSource": {
          "description": "If provided, get the source from this location in Google Cloud Storage.",
          "$ref": "StorageSource"
        }
      },
      "type": "object",
      "description": "Location of the source in a supported storage service."
    },
    "ListWorkerPoolsResponse": {
      "description": "Response containing existing `WorkerPools`.",
      "id": "ListWorkerPoolsResponse",
      "type": "object",
      "properties": {
        "workerPools": {
          "items": {
            "$ref": "WorkerPool"
          },
          "description": "`WorkerPools` for the specified project.",
          "type": "array"
        }
      }
    },
    "SlackDelivery": {
      "type": "object",
      "id": "SlackDelivery",
      "properties": {
        "webhookUri": {
          "$ref": "NotifierSecretRef",
          "description": "The secret reference for the Slack webhook URI for sending messages to a channel."
        }
      },
      "description": "SlackDelivery is the delivery configuration for delivering Slack messages via webhooks. See Slack webhook documentation at: https://api.slack.com/messaging/webhooks."
    },
    "NetworkConfig": {
      "properties": {
        "peeredNetwork": {
          "description": "Required. Immutable. The network definition that the workers are peered to. If this section is left empty, the workers will be peered to WorkerPool.project_id on the default network. Must be in the format `projects/{project}/global/networks/{network}`, where {project} is a project number, such as `12345`, and {network} is the name of a VPC network in the project.",
          "type": "string"
        }
      },
      "type": "object",
      "id": "NetworkConfig",
      "description": "Network describes the network configuration for a `WorkerPool`."
    },
    "Hash": {
      "properties": {
        "type": {
          "enum": [
            "NONE",
            "SHA256",
            "MD5"
          ],
          "enumDescriptions": [
            "No hash requested.",
            "Use a sha256 hash.",
            "Use a md5 hash."
          ],
          "type": "string",
          "description": "The type of hash that was performed."
        },
        "value": {
          "format": "byte",
          "type": "string",
          "description": "The hash value."
        }
      },
      "id": "Hash",
      "type": "object",
      "description": "Container message for hash values."
    },
    "NotifierMetadata": {
      "type": "object",
      "description": "NotifierMetadata contains the data which can be used to reference or describe this notifier.",
      "id": "NotifierMetadata",
      "properties": {
        "notifier": {
          "description": "The string representing the name and version of notifier to deploy. Expected to be of the form of \"/:\". For example: \"gcr.io/my-project/notifiers/smtp:1.2.34\".",
          "type": "string"
        },
        "name": {
          "description": "The human-readable and user-given name for the notifier. For example: \"repo-merge-email-notifier\".",
          "type": "string"
        }
      }
    },
    "NotifierSpec": {
      "type": "object",
      "properties": {
        "notification": {
          "$ref": "Notification",
          "description": "The configuration of this particular notifier."
        },
        "secrets": {
          "description": "Configurations for secret resources used by this particular notifier.",
          "type": "array",
          "items": {
            "$ref": "NotifierSecret"
          }
        }
      },
      "id": "NotifierSpec",
      "description": "NotifierSpec is the configuration container for notifications."
    },
    "Notification": {
      "type": "object",
      "description": "Notification is the container which holds the data that is relevant to this particular notification.",
      "id": "Notification",
      "properties": {
        "filter": {
          "description": "The filter string to use for notification filtering. Currently, this is assumed to be a CEL program. See https://opensource.google/projects/cel for more.",
          "type": "string"
        },
        "smtpDelivery": {
          "$ref": "SMTPDelivery",
          "description": "Configuration for SMTP (email) delivery."
        },
        "structDelivery": {
          "type": "object",
          "additionalProperties": {
            "type": "any",
            "description": "Properties of the object."
          },
          "description": "Escape hatch for users to supply custom delivery configs."
        },
        "slackDelivery": {
          "$ref": "SlackDelivery",
          "description": "Configuration for Slack delivery."
        },
        "httpDelivery": {
          "$ref": "HTTPDelivery",
          "description": "Configuration for HTTP delivery."
        }
      }
    },
    "BuildStep": {
      "description": "A step in the build pipeline.",
      "properties": {
        "status": {
          "description": "Output only. Status of the build step. At this time, build step status is only updated on build completion; step status is not updated in real-time as the build progresses.",
          "readOnly": true,
          "enumDescriptions": [
            "Status of the build is unknown.",
            "Build or step is queued; work has not yet begun.",
            "Build or step is being executed.",
            "Build or step finished successfully.",
            "Build or step failed to complete successfully.",
            "Build or step failed due to an internal cause.",
            "Build or step took longer than was allowed.",
            "Build or step was canceled by a user.",
            "Build was enqueued for longer than the value of `queue_ttl`."
          ],
          "type": "string",
          "enum": [
            "STATUS_UNKNOWN",
            "QUEUED",
            "WORKING",
            "SUCCESS",
            "FAILURE",
            "INTERNAL_ERROR",
            "TIMEOUT",
            "CANCELLED",
            "EXPIRED"
          ]
        },
        "id": {
          "type": "string",
          "description": "Unique identifier for this build step, used in `wait_for` to reference this build step as a dependency."
        },
        "waitFor": {
          "items": {
            "type": "string"
          },
          "description": "The ID(s) of the step(s) that this build step depends on. This build step will not start until all the build steps in `wait_for` have completed successfully. If `wait_for` is empty, this build step will start when all previous build steps in the `Build.Steps` list have completed successfully.",
          "type": "array"
        },
        "name": {
          "description": "Required. The name of the container image that will run this particular build step. If the image is available in the host's Docker daemon's cache, it will be run directly. If not, the host will attempt to pull the image first, using the builder service account's credentials if necessary. The Docker daemon's cache will already have the latest versions of all of the officially supported build steps ([https://github.com/GoogleCloudPlatform/cloud-builders](https://github.com/GoogleCloudPlatform/cloud-builders)). The Docker daemon will also have cached many of the layers for some popular images, like \"ubuntu\", \"debian\", but they will be refreshed at the time you attempt to use them. If you built an image in a previous build step, it will be stored in the host's Docker daemon's cache and is available to use as the name for a later build step.",
          "type": "string"
        },
        "timeout": {
          "type": "string",
          "description": "Time limit for executing this build step. If not defined, the step has no time limit and will be allowed to continue to run until either it completes or the build itself times out.",
          "format": "google-duration"
        },
        "timing": {
          "description": "Output only. Stores timing information for executing this build step.",
          "readOnly": true,
          "$ref": "TimeSpan"
        },
        "secretEnv": {
          "description": "A list of environment variables which are encrypted using a Cloud Key Management Service crypto key. These values must be specified in the build's `Secret`.",
          "items": {
            "type": "string"
          },
          "type": "array"
        },
        "volumes": {
          "description": "List of volumes to mount into the build step. Each volume is created as an empty volume prior to execution of the build step. Upon completion of the build, volumes and their contents are discarded. Using a named volume in only one step is not valid as it is indicative of a build request with an incorrect configuration.",
          "items": {
            "$ref": "Volume"
          },
          "type": "array"
        },
        "env": {
          "description": "A list of environment variable definitions to be used when running a step. The elements are of the form \"KEY=VALUE\" for the environment variable \"KEY\" being given the value \"VALUE\".",
          "type": "array",
          "items": {
            "type": "string"
          }
        },
        "entrypoint": {
          "description": "Entrypoint to be used instead of the build step image's default entrypoint. If unset, the image's default entrypoint is used.",
          "type": "string"
        },
        "args": {
          "description": "A list of arguments that will be presented to the step when it is started. If the image used to run the step's container has an entrypoint, the `args` are used as arguments to that entrypoint. If the image does not define an entrypoint, the first element in args is used as the entrypoint, and the remainder will be used as arguments.",
          "type": "array",
          "items": {
            "type": "string"
          }
        },
        "dir": {
          "description": "Working directory to use when running this step's container. If this value is a relative path, it is relative to the build's working directory. If this value is absolute, it may be outside the build's working directory, in which case the contents of the path may not be persisted across build step executions, unless a `volume` for that path is specified. If the build specifies a `RepoSource` with `dir` and a step with a `dir`, which specifies an absolute path, the `RepoSource` `dir` is ignored for the step's execution.",
          "type": "string"
        },
        "pullTiming": {
          "$ref": "TimeSpan",
          "description": "Output only. Stores timing information for pulling this build step's builder image only.",
          "readOnly": true
        }
      },
      "type": "object",
      "id": "BuildStep"
    },
    "Volume": {
      "description": "Volume describes a Docker container volume which is mounted into build steps in order to persist files across build step execution.",
      "type": "object",
      "properties": {
        "name": {
          "description": "Name of the volume to mount. Volume names must be unique per build step and must be valid names for Docker volumes. Each named volume must be used by at least two build steps.",
          "type": "string"
        },
        "path": {
          "type": "string",
          "description": "Path at which to mount the volume. Paths must be absolute and cannot conflict with other volume paths on the same build step or with certain reserved volume paths."
        }
      },
      "id": "Volume"
    },
    "TimeSpan": {
      "type": "object",
      "description": "Start and end times for a build execution phase.",
      "properties": {
        "startTime": {
          "format": "google-datetime",
          "description": "Start of time span.",
          "type": "string"
        },
        "endTime": {
          "description": "End of time span.",
          "type": "string",
          "format": "google-datetime"
        }
      },
      "id": "TimeSpan"
    },
    "CancelOperationRequest": {
      "type": "object",
      "properties": {},
      "id": "CancelOperationRequest",
      "description": "The request message for Operations.CancelOperation."
    },
    "Secret": {
      "description": "Pairs a set of secret environment variables containing encrypted values with the Cloud KMS key to use to decrypt the value.",
      "id": "Secret",
      "properties": {
        "kmsKeyName": {
          "type": "string",
          "description": "Cloud KMS key name to use to decrypt these envs."
        },
        "secretEnv": {
          "description": "Map of environment variable name to its encrypted value. Secret environment variables must be unique across all of a build's secrets, and must be used by at least one build step. Values can be at most 64 KB in size. There can be at most 100 secret values across all of a build's secrets.",
          "type": "object",
          "additionalProperties": {
            "type": "string",
            "format": "byte"
          }
        }
      },
      "type": "object"
    }
  },
  "discoveryVersion": "v1",
  "version": "v1alpha2",
  "canonicalName": "Cloud Build",
  "servicePath": "",
  "documentationLink": "https://cloud.google.com/cloud-build/docs/",
  "id": "cloudbuild:v1alpha2",
  "version_module": true,
  "icons": {
    "x16": "http://www.google.com/images/icons/product/search-16.gif",
    "x32": "http://www.google.com/images/icons/product/search-32.gif"
  },
  "kind": "discovery#restDescription",
  "revision": "20200831",
  "mtlsRootUrl": "https://cloudbuild.mtls.googleapis.com/",
  "fullyEncodeReservedExpansion": true,
  "rootUrl": "https://cloudbuild.googleapis.com/",
  "title": "Cloud Build API",
  "resources": {
    "projects": {
      "resources": {
        "workerPools": {
          "methods": {
            "delete": {
              "flatPath": "v1alpha2/projects/{projectsId}/workerPools/{workerPoolsId}",
              "id": "cloudbuild.projects.workerPools.delete",
              "scopes": [
                "https://www.googleapis.com/auth/cloud-platform"
              ],
              "parameterOrder": [
                "name"
              ],
              "response": {
                "$ref": "Empty"
              },
              "description": "Deletes a `WorkerPool`.",
              "httpMethod": "DELETE",
              "parameters": {
                "name": {
                  "type": "string",
                  "description": "Required. The name of the `WorkerPool` to delete. Format: projects/{project}/workerPools/{workerPool}",
                  "pattern": "^projects/[^/]+/workerPools/[^/]+$",
                  "required": true,
                  "location": "path"
                }
              },
              "path": "v1alpha2/{+name}"
            },
            "create": {
              "response": {
                "$ref": "WorkerPool"
              },
              "request": {
                "$ref": "WorkerPool"
              },
              "id": "cloudbuild.projects.workerPools.create",
              "flatPath": "v1alpha2/projects/{projectsId}/workerPools",
              "parameterOrder": [
                "parent"
              ],
              "scopes": [
                "https://www.googleapis.com/auth/cloud-platform"
              ],
              "description": "Creates a `WorkerPool` to run the builds, and returns the new worker pool.",
              "httpMethod": "POST",
              "parameters": {
                "parent": {
                  "required": true,
                  "description": "Required. The parent resource where this book will be created. Format: projects/{project}",
                  "pattern": "^projects/[^/]+$",
                  "location": "path",
                  "type": "string"
                },
                "workerPoolId": {
                  "description": "Required. Immutable. The ID to use for the `WorkerPool`, which will become the final component of the resource name. This value should be 1-63 characters, and valid characters are /a-z-/.",
                  "location": "query",
                  "type": "string"
                }
              },
              "path": "v1alpha2/{+parent}/workerPools"
            },
            "list": {
              "scopes": [
                "https://www.googleapis.com/auth/cloud-platform"
              ],
              "id": "cloudbuild.projects.workerPools.list",
              "parameters": {
                "parent": {
                  "required": true,
                  "description": "Required. The parent, which owns this collection of `WorkerPools`. Format: projects/{project}",
                  "location": "path",
                  "pattern": "^projects/[^/]+$",
                  "type": "string"
                }
              },
              "httpMethod": "GET",
              "response": {
                "$ref": "ListWorkerPoolsResponse"
              },
              "flatPath": "v1alpha2/projects/{projectsId}/workerPools",
              "parameterOrder": [
                "parent"
              ],
              "path": "v1alpha2/{+parent}/workerPools",
              "description": "Lists `WorkerPool`s by project."
            },
            "get": {
              "scopes": [
                "https://www.googleapis.com/auth/cloud-platform"
              ],
              "path": "v1alpha2/{+name}",
              "flatPath": "v1alpha2/projects/{projectsId}/workerPools/{workerPoolsId}",
              "description": "Returns details of a `WorkerPool`.",
              "parameters": {
                "name": {
                  "location": "path",
                  "description": "Required. The name of the `WorkerPool` to retrieve. Format: projects/{project}/workerPools/{workerPool}",
                  "required": true,
                  "pattern": "^projects/[^/]+/workerPools/[^/]+$",
                  "type": "string"
                }
              },
              "response": {
                "$ref": "WorkerPool"
              },
              "id": "cloudbuild.projects.workerPools.get",
              "parameterOrder": [
                "name"
              ],
              "httpMethod": "GET"
            },
            "patch": {
              "response": {
                "$ref": "WorkerPool"
              },
              "scopes": [
                "https://www.googleapis.com/auth/cloud-platform"
              ],
              "path": "v1alpha2/{+name}",
              "parameterOrder": [
                "name"
              ],
              "id": "cloudbuild.projects.workerPools.patch",
              "request": {
                "$ref": "WorkerPool"
              },
              "flatPath": "v1alpha2/projects/{projectsId}/workerPools/{workerPoolsId}",
              "description": "Updates a `WorkerPool`.",
              "httpMethod": "PATCH",
              "parameters": {
                "updateMask": {
                  "description": "A mask specifying which fields in `WorkerPool` should be updated.",
                  "format": "google-fieldmask",
                  "location": "query",
                  "type": "string"
                },
                "name": {
                  "pattern": "^projects/[^/]+/workerPools/[^/]+$",
                  "required": true,
                  "type": "string",
                  "location": "path",
                  "description": "Output only. The resource name of the `WorkerPool`. Format of the name is `projects/{project_id}/workerPools/{worker_pool_id}`, where the value of {worker_pool_id} is provided in the CreateWorkerPool request."
                }
              }
            }
          }
        },
        "locations": {
          "resources": {
            "operations": {
              "methods": {
                "cancel": {
                  "description": "Starts asynchronous cancellation on a long-running operation. The server makes a best effort to cancel the operation, but success is not guaranteed. If the server doesn't support this method, it returns `google.rpc.Code.UNIMPLEMENTED`. Clients can use Operations.GetOperation or other methods to check whether the cancellation succeeded or whether the operation completed despite cancellation. On successful cancellation, the operation is not deleted; instead, it becomes an operation with an Operation.error value with a google.rpc.Status.code of 1, corresponding to `Code.CANCELLED`.",
                  "parameters": {
                    "name": {
                      "type": "string",
                      "pattern": "^projects/[^/]+/locations/[^/]+/operations/[^/]+$",
                      "location": "path",
                      "description": "The name of the operation resource to be cancelled.",
                      "required": true
                    }
                  },
                  "request": {
                    "$ref": "CancelOperationRequest"
                  },
                  "flatPath": "v1alpha2/projects/{projectsId}/locations/{locationsId}/operations/{operationsId}:cancel",
                  "scopes": [
                    "https://www.googleapis.com/auth/cloud-platform"
                  ],
                  "path": "v1alpha2/{+name}:cancel",
                  "response": {
                    "$ref": "Empty"
                  },
                  "id": "cloudbuild.projects.locations.operations.cancel",
                  "parameterOrder": [
                    "name"
                  ],
                  "httpMethod": "POST"
                },
                "get": {
                  "scopes": [
                    "https://www.googleapis.com/auth/cloud-platform"
                  ],
                  "path": "v1alpha2/{+name}",
                  "flatPath": "v1alpha2/projects/{projectsId}/locations/{locationsId}/operations/{operationsId}",
                  "parameters": {
                    "name": {
                      "required": true,
                      "description": "The name of the operation resource.",
                      "pattern": "^projects/[^/]+/locations/[^/]+/operations/[^/]+$",
                      "type": "string",
                      "location": "path"
                    }
                  },
                  "description": "Gets the latest state of a long-running operation. Clients can use this method to poll the operation result at intervals as recommended by the API service.",
                  "response": {
                    "$ref": "Operation"
                  },
                  "id": "cloudbuild.projects.locations.operations.get",
                  "httpMethod": "GET",
                  "parameterOrder": [
                    "name"
                  ]
                }
              }
            }
          }
        }
      }
    }
  },
  "basePath": "",
  "description": "Creates and manages builds on Google Cloud Platform.",
  "ownerName": "Google",
  "parameters": {
    "quotaUser": {
      "description": "Available to use for quota purposes for server-side applications. Can be any arbitrary string assigned to a user, but should not exceed 40 characters.",
      "location": "query",
      "type": "string"
    },
    "oauth_token": {
      "description": "OAuth 2.0 token for the current user.",
      "location": "query",
      "type": "string"
    },
    "access_token": {
      "location": "query",
      "description": "OAuth access token.",
      "type": "string"
    },
    "fields": {
      "description": "Selector specifying which fields to include in a partial response.",
      "location": "query",
      "type": "string"
    },
    "$.xgafv": {
      "description": "V1 error format.",
      "type": "string",
      "enumDescriptions": [
        "v1 error format",
        "v2 error format"
      ],
      "location": "query",
      "enum": [
        "1",
        "2"
      ]
    },
    "prettyPrint": {
      "default": "true",
      "location": "query",
      "description": "Returns response with indentations and line breaks.",
      "type": "boolean"
    },
    "uploadType": {
      "location": "query",
      "type": "string",
      "description": "Legacy upload protocol for media (e.g. \"media\", \"multipart\")."
    },
    "alt": {
      "location": "query",
      "enumDescriptions": [
        "Responses with Content-Type of application/json",
        "Media download with context-dependent Content-Type",
        "Responses with Content-Type of application/x-protobuf"
      ],
      "default": "json",
      "description": "Data format for response.",
      "enum": [
        "json",
        "media",
        "proto"
      ],
      "type": "string"
    },
    "callback": {
      "description": "JSONP",
      "location": "query",
      "type": "string"
    },
    "upload_protocol": {
      "description": "Upload protocol for media (e.g. \"raw\", \"multipart\").",
      "location": "query",
      "type": "string"
    },
    "key": {
      "description": "API key. Your API key identifies your project and provides you with API access, quota, and reports. Required unless you provide an OAuth 2.0 token.",
      "location": "query",
      "type": "string"
    }
  },
  "auth": {
    "oauth2": {
      "scopes": {
        "https://www.googleapis.com/auth/cloud-platform": {
          "description": "View and manage your data across Google Cloud Platform services"
        }
      }
    }
  },
  "batchPath": "batch",
  "name": "cloudbuild",
  "protocol": "rest",
  "baseUrl": "https://cloudbuild.googleapis.com/"
}
