{
  "icons": {
    "x16": "http://www.google.com/images/icons/product/search-16.gif",
    "x32": "http://www.google.com/images/icons/product/search-32.gif"
  },
  "name": "file",
  "mtlsRootUrl": "https://file.mtls.googleapis.com/",
  "documentationLink": "https://cloud.google.com/filestore/",
  "fullyEncodeReservedExpansion": true,
  "revision": "20201029",
  "resources": {
    "projects": {
      "resources": {
        "locations": {
          "methods": {
            "list": {
              "path": "v1/{+name}/locations",
              "description": "Lists information about the supported locations for this service.",
              "id": "file.projects.locations.list",
              "parameters": {
                "pageSize": {
                  "format": "int32",
                  "description": "The standard list page size.",
                  "location": "query",
                  "type": "integer"
                },
                "filter": {
                  "type": "string",
                  "description": "The standard list filter.",
                  "location": "query"
                },
                "pageToken": {
                  "description": "The standard list page token.",
                  "type": "string",
                  "location": "query"
                },
                "includeUnrevealedLocations": {
                  "location": "query",
                  "type": "boolean",
                  "description": "If true, the returned list will include locations which are not yet revealed."
                },
                "name": {
                  "pattern": "^projects/[^/]+$",
                  "location": "path",
                  "required": true,
                  "description": "The resource that owns the locations collection, if applicable.",
                  "type": "string"
                }
              },
              "flatPath": "v1/projects/{projectsId}/locations",
              "httpMethod": "GET",
              "parameterOrder": [
                "name"
              ],
              "scopes": [
                "https://www.googleapis.com/auth/cloud-platform"
              ],
              "response": {
                "$ref": "ListLocationsResponse"
              }
            },
            "get": {
              "flatPath": "v1/projects/{projectsId}/locations/{locationsId}",
              "httpMethod": "GET",
              "response": {
                "$ref": "Location"
              },
              "id": "file.projects.locations.get",
              "scopes": [
                "https://www.googleapis.com/auth/cloud-platform"
              ],
              "parameterOrder": [
                "name"
              ],
              "parameters": {
                "name": {
                  "location": "path",
                  "type": "string",
                  "required": true,
                  "description": "Resource name for the location.",
                  "pattern": "^projects/[^/]+/locations/[^/]+$"
                }
              },
              "description": "Gets information about a location.",
              "path": "v1/{+name}"
            }
          },
          "resources": {
            "operations": {
              "methods": {
                "cancel": {
                  "parameterOrder": [
                    "name"
                  ],
                  "description": "Starts asynchronous cancellation on a long-running operation. The server makes a best effort to cancel the operation, but success is not guaranteed. If the server doesn't support this method, it returns `google.rpc.Code.UNIMPLEMENTED`. Clients can use Operations.GetOperation or other methods to check whether the cancellation succeeded or whether the operation completed despite cancellation. On successful cancellation, the operation is not deleted; instead, it becomes an operation with an Operation.error value with a google.rpc.Status.code of 1, corresponding to `Code.CANCELLED`.",
                  "response": {
                    "$ref": "Empty"
                  },
                  "scopes": [
                    "https://www.googleapis.com/auth/cloud-platform"
                  ],
                  "httpMethod": "POST",
                  "id": "file.projects.locations.operations.cancel",
                  "path": "v1/{+name}:cancel",
                  "flatPath": "v1/projects/{projectsId}/locations/{locationsId}/operations/{operationsId}:cancel",
                  "request": {
                    "$ref": "CancelOperationRequest"
                  },
                  "parameters": {
                    "name": {
                      "type": "string",
                      "location": "path",
                      "description": "The name of the operation resource to be cancelled.",
                      "required": true,
                      "pattern": "^projects/[^/]+/locations/[^/]+/operations/[^/]+$"
                    }
                  }
                },
                "delete": {
                  "httpMethod": "DELETE",
                  "path": "v1/{+name}",
                  "parameterOrder": [
                    "name"
                  ],
                  "description": "Deletes a long-running operation. This method indicates that the client is no longer interested in the operation result. It does not cancel the operation. If the server doesn't support this method, it returns `google.rpc.Code.UNIMPLEMENTED`.",
                  "scopes": [
                    "https://www.googleapis.com/auth/cloud-platform"
                  ],
                  "response": {
                    "$ref": "Empty"
                  },
                  "id": "file.projects.locations.operations.delete",
                  "flatPath": "v1/projects/{projectsId}/locations/{locationsId}/operations/{operationsId}",
                  "parameters": {
                    "name": {
                      "location": "path",
                      "required": true,
                      "type": "string",
                      "description": "The name of the operation resource to be deleted.",
                      "pattern": "^projects/[^/]+/locations/[^/]+/operations/[^/]+$"
                    }
                  }
                },
                "list": {
                  "id": "file.projects.locations.operations.list",
                  "parameterOrder": [
                    "name"
                  ],
                  "httpMethod": "GET",
                  "path": "v1/{+name}/operations",
                  "parameters": {
                    "pageSize": {
                      "type": "integer",
                      "location": "query",
                      "description": "The standard list page size.",
                      "format": "int32"
                    },
                    "filter": {
                      "type": "string",
                      "location": "query",
                      "description": "The standard list filter."
                    },
                    "pageToken": {
                      "description": "The standard list page token.",
                      "type": "string",
                      "location": "query"
                    },
                    "name": {
                      "type": "string",
                      "pattern": "^projects/[^/]+/locations/[^/]+$",
                      "required": true,
                      "location": "path",
                      "description": "The name of the operation's parent resource."
                    }
                  },
                  "flatPath": "v1/projects/{projectsId}/locations/{locationsId}/operations",
                  "description": "Lists operations that match the specified filter in the request. If the server doesn't support this method, it returns `UNIMPLEMENTED`. NOTE: the `name` binding allows API services to override the binding to use different resource name schemes, such as `users/*/operations`. To override the binding, API services can add a binding such as `\"/v1/{name=users/*}/operations\"` to their service configuration. For backwards compatibility, the default name includes the operations collection id, however overriding users must ensure the name binding is the parent resource, without the operations collection id.",
                  "response": {
                    "$ref": "ListOperationsResponse"
                  },
                  "scopes": [
                    "https://www.googleapis.com/auth/cloud-platform"
                  ]
                },
                "get": {
                  "description": "Gets the latest state of a long-running operation. Clients can use this method to poll the operation result at intervals as recommended by the API service.",
                  "parameterOrder": [
                    "name"
                  ],
                  "scopes": [
                    "https://www.googleapis.com/auth/cloud-platform"
                  ],
                  "flatPath": "v1/projects/{projectsId}/locations/{locationsId}/operations/{operationsId}",
                  "parameters": {
                    "name": {
                      "location": "path",
                      "type": "string",
                      "pattern": "^projects/[^/]+/locations/[^/]+/operations/[^/]+$",
                      "description": "The name of the operation resource.",
                      "required": true
                    }
                  },
                  "path": "v1/{+name}",
                  "httpMethod": "GET",
                  "response": {
                    "$ref": "Operation"
                  },
                  "id": "file.projects.locations.operations.get"
                }
              }
            },
            "backups": {
              "methods": {
                "delete": {
                  "parameterOrder": [
                    "name"
                  ],
                  "response": {
                    "$ref": "Operation"
                  },
                  "scopes": [
                    "https://www.googleapis.com/auth/cloud-platform"
                  ],
                  "path": "v1/{+name}",
                  "description": "Deletes a backup.",
                  "flatPath": "v1/projects/{projectsId}/locations/{locationsId}/backups/{backupsId}",
                  "parameters": {
                    "name": {
                      "type": "string",
                      "description": "Required. The backup resource name, in the format projects/{project_number}/locations/{location}/backups/{backup_id}",
                      "location": "path",
                      "pattern": "^projects/[^/]+/locations/[^/]+/backups/[^/]+$",
                      "required": true
                    }
                  },
                  "id": "file.projects.locations.backups.delete",
                  "httpMethod": "DELETE"
                },
                "create": {
                  "description": "Creates a backup.",
                  "parameters": {
                    "backupId": {
                      "location": "query",
                      "type": "string",
                      "description": "Required. The ID to use for the backup. The ID must be unique within the specified project and location. This value must start with a lowercase letter followed by up to 62 lowercase letters, numbers, or hyphens, and cannot end with a hyphen. Values that do not match this pattern will trigger an INVALID_ARGUMENT error."
                    },
                    "parent": {
                      "type": "string",
                      "location": "path",
                      "pattern": "^projects/[^/]+/locations/[^/]+$",
                      "required": true,
                      "description": "Required. The backup's project and location, in the format projects/{project_number}/locations/{location}. In Cloud Filestore, backup locations map to GCP regions, for example **us-west1**."
                    }
                  },
                  "httpMethod": "POST",
                  "scopes": [
                    "https://www.googleapis.com/auth/cloud-platform"
                  ],
                  "path": "v1/{+parent}/backups",
                  "parameterOrder": [
                    "parent"
                  ],
                  "response": {
                    "$ref": "Operation"
                  },
                  "request": {
                    "$ref": "Backup"
                  },
                  "id": "file.projects.locations.backups.create",
                  "flatPath": "v1/projects/{projectsId}/locations/{locationsId}/backups"
                },
                "patch": {
                  "request": {
                    "$ref": "Backup"
                  },
                  "httpMethod": "PATCH",
                  "id": "file.projects.locations.backups.patch",
                  "description": "Updates the settings of a specific backup.",
                  "path": "v1/{+name}",
                  "parameters": {
                    "updateMask": {
                      "location": "query",
                      "description": "Required. Mask of fields to update. At least one path must be supplied in this field.",
                      "format": "google-fieldmask",
                      "type": "string"
                    },
                    "name": {
                      "description": "Output only. The resource name of the backup, in the format projects/{project_number}/locations/{location_id}/backups/{backup_id}.",
                      "type": "string",
                      "required": true,
                      "location": "path",
                      "pattern": "^projects/[^/]+/locations/[^/]+/backups/[^/]+$"
                    }
                  },
                  "response": {
                    "$ref": "Operation"
                  },
                  "scopes": [
                    "https://www.googleapis.com/auth/cloud-platform"
                  ],
                  "parameterOrder": [
                    "name"
                  ],
                  "flatPath": "v1/projects/{projectsId}/locations/{locationsId}/backups/{backupsId}"
                },
                "get": {
                  "parameterOrder": [
                    "name"
                  ],
                  "parameters": {
                    "name": {
                      "type": "string",
                      "pattern": "^projects/[^/]+/locations/[^/]+/backups/[^/]+$",
                      "description": "Required. The backup resource name, in the format projects/{project_number}/locations/{location}/backups/{backup_id}.",
                      "location": "path",
                      "required": true
                    }
                  },
                  "path": "v1/{+name}",
                  "httpMethod": "GET",
                  "scopes": [
                    "https://www.googleapis.com/auth/cloud-platform"
                  ],
                  "flatPath": "v1/projects/{projectsId}/locations/{locationsId}/backups/{backupsId}",
                  "id": "file.projects.locations.backups.get",
                  "response": {
                    "$ref": "Backup"
                  },
                  "description": "Gets the details of a specific backup."
                },
                "list": {
                  "parameterOrder": [
                    "parent"
                  ],
                  "scopes": [
                    "https://www.googleapis.com/auth/cloud-platform"
                  ],
                  "httpMethod": "GET",
                  "path": "v1/{+parent}/backups",
                  "flatPath": "v1/projects/{projectsId}/locations/{locationsId}/backups",
                  "id": "file.projects.locations.backups.list",
                  "parameters": {
                    "pageToken": {
                      "description": "The next_page_token value to use if there are additional results to retrieve for this list request.",
                      "location": "query",
                      "type": "string"
                    },
                    "parent": {
                      "description": "Required. The project and location for which to retrieve backup information, in the format projects/{project_number}/locations/{location}. In Cloud Filestore, backup locations map to GCP regions, for example **us-west1**. To retrieve backup information for all locations, use \"-\" for the {location} value.",
                      "type": "string",
                      "required": true,
                      "pattern": "^projects/[^/]+/locations/[^/]+$",
                      "location": "path"
                    },
                    "pageSize": {
                      "format": "int32",
                      "type": "integer",
                      "description": "The maximum number of items to return.",
                      "location": "query"
                    },
                    "filter": {
                      "location": "query",
                      "description": "List filter.",
                      "type": "string"
                    },
                    "orderBy": {
                      "location": "query",
                      "description": "Sort results. Supported values are \"name\", \"name desc\" or \"\" (unsorted).",
                      "type": "string"
                    }
                  },
                  "response": {
                    "$ref": "ListBackupsResponse"
                  },
                  "description": "Lists all backups in a project for either a specified location or for all locations."
                }
              }
            },
            "instances": {
              "methods": {
                "get": {
                  "parameters": {
                    "name": {
                      "description": "Required. The instance resource name, in the format projects/{project_id}/locations/{location}/instances/{instance_id}.",
                      "required": true,
                      "pattern": "^projects/[^/]+/locations/[^/]+/instances/[^/]+$",
                      "location": "path",
                      "type": "string"
                    }
                  },
                  "parameterOrder": [
                    "name"
                  ],
                  "path": "v1/{+name}",
                  "response": {
                    "$ref": "Instance"
                  },
                  "description": "Gets the details of a specific instance.",
                  "flatPath": "v1/projects/{projectsId}/locations/{locationsId}/instances/{instancesId}",
                  "httpMethod": "GET",
                  "scopes": [
                    "https://www.googleapis.com/auth/cloud-platform"
                  ],
                  "id": "file.projects.locations.instances.get"
                },
                "delete": {
                  "path": "v1/{+name}",
                  "scopes": [
                    "https://www.googleapis.com/auth/cloud-platform"
                  ],
                  "response": {
                    "$ref": "Operation"
                  },
                  "id": "file.projects.locations.instances.delete",
                  "parameterOrder": [
                    "name"
                  ],
                  "description": "Deletes an instance.",
                  "flatPath": "v1/projects/{projectsId}/locations/{locationsId}/instances/{instancesId}",
                  "parameters": {
                    "name": {
                      "type": "string",
                      "required": true,
                      "pattern": "^projects/[^/]+/locations/[^/]+/instances/[^/]+$",
                      "location": "path",
                      "description": "Required. The instance resource name, in the format projects/{project_id}/locations/{location}/instances/{instance_id}"
                    }
                  },
                  "httpMethod": "DELETE"
                },
                "patch": {
                  "request": {
                    "$ref": "Instance"
                  },
                  "id": "file.projects.locations.instances.patch",
                  "response": {
                    "$ref": "Operation"
                  },
                  "scopes": [
                    "https://www.googleapis.com/auth/cloud-platform"
                  ],
                  "path": "v1/{+name}",
                  "description": "Updates the settings of a specific instance.",
                  "httpMethod": "PATCH",
                  "parameters": {
                    "updateMask": {
                      "format": "google-fieldmask",
                      "location": "query",
                      "type": "string",
                      "description": "Mask of fields to update. At least one path must be supplied in this field. The elements of the repeated paths field may only include these fields: * \"description\" * \"file_shares\" * \"labels\""
                    },
                    "name": {
                      "required": true,
                      "description": "Output only. The resource name of the instance, in the format projects/{project}/locations/{location}/instances/{instance}.",
                      "type": "string",
                      "pattern": "^projects/[^/]+/locations/[^/]+/instances/[^/]+$",
                      "location": "path"
                    }
                  },
                  "parameterOrder": [
                    "name"
                  ],
                  "flatPath": "v1/projects/{projectsId}/locations/{locationsId}/instances/{instancesId}"
                },
                "create": {
                  "httpMethod": "POST",
                  "parameters": {
                    "parent": {
                      "description": "Required. The instance's project and location, in the format projects/{project_id}/locations/{location}. In Cloud Filestore, locations map to GCP zones, for example **us-west1-b**.",
                      "pattern": "^projects/[^/]+/locations/[^/]+$",
                      "location": "path",
                      "required": true,
                      "type": "string"
                    },
                    "instanceId": {
                      "description": "Required. The name of the instance to create. The name must be unique for the specified project and location.",
                      "type": "string",
                      "location": "query"
                    }
                  },
                  "response": {
                    "$ref": "Operation"
                  },
                  "flatPath": "v1/projects/{projectsId}/locations/{locationsId}/instances",
                  "scopes": [
                    "https://www.googleapis.com/auth/cloud-platform"
                  ],
                  "id": "file.projects.locations.instances.create",
                  "request": {
                    "$ref": "Instance"
                  },
                  "path": "v1/{+parent}/instances",
                  "parameterOrder": [
                    "parent"
                  ],
                  "description": "Creates an instance. When creating from a backup, the capacity of the new instance needs to be equal to or larger than the capacity of the backup (and also equal to or larger than the minimum capacity of the tier)."
                },
                "list": {
                  "path": "v1/{+parent}/instances",
                  "parameters": {
                    "orderBy": {
                      "description": "Sort results. Supported values are \"name\", \"name desc\" or \"\" (unsorted).",
                      "location": "query",
                      "type": "string"
                    },
                    "filter": {
                      "description": "List filter.",
                      "location": "query",
                      "type": "string"
                    },
                    "parent": {
                      "type": "string",
                      "description": "Required. The project and location for which to retrieve instance information, in the format projects/{project_id}/locations/{location}. In Cloud Filestore, locations map to GCP zones, for example **us-west1-b**. To retrieve instance information for all locations, use \"-\" for the {location} value.",
                      "required": true,
                      "pattern": "^projects/[^/]+/locations/[^/]+$",
                      "location": "path"
                    },
                    "pageToken": {
                      "location": "query",
                      "description": "The next_page_token value to use if there are additional results to retrieve for this list request.",
                      "type": "string"
                    },
                    "pageSize": {
                      "format": "int32",
                      "description": "The maximum number of items to return.",
                      "type": "integer",
                      "location": "query"
                    }
                  },
                  "httpMethod": "GET",
                  "parameterOrder": [
                    "parent"
                  ],
                  "description": "Lists all instances in a project for either a specified location or for all locations.",
                  "id": "file.projects.locations.instances.list",
                  "flatPath": "v1/projects/{projectsId}/locations/{locationsId}/instances",
                  "scopes": [
                    "https://www.googleapis.com/auth/cloud-platform"
                  ],
                  "response": {
                    "$ref": "ListInstancesResponse"
                  }
                },
                "restore": {
                  "request": {
                    "$ref": "RestoreInstanceRequest"
                  },
                  "description": "Restores an existing instance's file share from a backup. The instance's file share capacity will be set to the backup's capacity or the minimum capacity of the tier, whichever is larger.",
                  "httpMethod": "POST",
                  "parameters": {
                    "name": {
                      "required": true,
                      "pattern": "^projects/[^/]+/locations/[^/]+/instances/[^/]+$",
                      "type": "string",
                      "location": "path",
                      "description": "Required. The resource name of the instance, in the format projects/{project_number}/locations/{location_id}/instances/{instance_id}."
                    }
                  },
                  "path": "v1/{+name}:restore",
                  "flatPath": "v1/projects/{projectsId}/locations/{locationsId}/instances/{instancesId}:restore",
                  "parameterOrder": [
                    "name"
                  ],
                  "id": "file.projects.locations.instances.restore",
                  "scopes": [
                    "https://www.googleapis.com/auth/cloud-platform"
                  ],
                  "response": {
                    "$ref": "Operation"
                  }
                }
              }
            }
          }
        }
      }
    }
  },
  "discoveryVersion": "v1",
  "batchPath": "batch",
  "auth": {
    "oauth2": {
      "scopes": {
        "https://www.googleapis.com/auth/cloud-platform": {
          "description": "View and manage your data across Google Cloud Platform services"
        }
      }
    }
  },
  "version_module": true,
  "baseUrl": "https://file.googleapis.com/",
  "basePath": "",
  "description": "The Cloud Filestore API is used for creating and managing cloud file servers.",
  "canonicalName": "Cloud Filestore",
  "rootUrl": "https://file.googleapis.com/",
  "title": "Cloud Filestore API",
  "protocol": "rest",
  "servicePath": "",
  "version": "v1",
  "schemas": {
    "MaintenancePolicy": {
      "id": "MaintenancePolicy",
      "type": "object",
      "description": "Defines policies to service maintenance events.",
      "properties": {
        "labels": {
          "additionalProperties": {
            "type": "string"
          },
          "type": "object",
          "description": "Optional. Resource labels to represent user provided metadata. Each label is a key-value pair, where both the key and the value are arbitrary strings provided by the user."
        },
        "updateTime": {
          "type": "string",
          "description": "Output only. The time when the resource was updated.",
          "format": "google-datetime"
        },
        "description": {
          "description": "Optional. Description of what this policy is for. Create/Update methods return INVALID_ARGUMENT if the length is greater than 512.",
          "type": "string"
        },
        "name": {
          "type": "string",
          "description": "Required. MaintenancePolicy name using the form: `projects/{project_id}/locations/{location_id}/maintenancePolicies/{maintenance_policy_id}` where {project_id} refers to a GCP consumer project ID, {location_id} refers to a GCP region/zone, {maintenance_policy_id} must be 1-63 characters long and match the regular expression `[a-z0-9]([-a-z0-9]*[a-z0-9])?`."
        },
        "createTime": {
          "type": "string",
          "format": "google-datetime",
          "description": "Output only. The time when the resource was created."
        },
        "updatePolicy": {
          "description": "Maintenance policy applicable to instance update.",
          "$ref": "UpdatePolicy"
        },
        "state": {
          "description": "Optional. The state of the policy.",
          "enum": [
            "STATE_UNSPECIFIED",
            "READY",
            "DELETING"
          ],
          "type": "string",
          "enumDescriptions": [
            "Unspecified state.",
            "Resource is ready to be used.",
            "Resource is being deleted. It can no longer be attached to instances."
          ]
        }
      }
    },
    "OperationMetadata": {
      "type": "object",
      "properties": {
        "apiVersion": {
          "type": "string",
          "description": "[Output only] API version used to start the operation."
        },
        "cancelRequested": {
          "description": "[Output only] Identifies whether the user has requested cancellation of the operation. Operations that have successfully been cancelled have Operation.error value with a google.rpc.Status.code of 1, corresponding to `Code.CANCELLED`.",
          "type": "boolean"
        },
        "createTime": {
          "description": "[Output only] The time the operation was created.",
          "type": "string",
          "format": "google-datetime"
        },
        "statusDetail": {
          "type": "string",
          "description": "[Output only] Human-readable status of the operation, if any."
        },
        "target": {
          "description": "[Output only] Server-defined resource path for the target of the operation.",
          "type": "string"
        },
        "verb": {
          "description": "[Output only] Name of the verb executed by the operation.",
          "type": "string"
        },
        "endTime": {
          "description": "[Output only] The time the operation finished running.",
          "type": "string",
          "format": "google-datetime"
        }
      },
      "description": "Represents the metadata of the long-running operation.",
      "id": "OperationMetadata"
    },
    "ListOperationsResponse": {
      "type": "object",
      "properties": {
        "operations": {
          "items": {
            "$ref": "Operation"
          },
          "description": "A list of operations that matches the specified filter in the request.",
          "type": "array"
        },
        "nextPageToken": {
          "type": "string",
          "description": "The standard List next-page token."
        }
      },
      "id": "ListOperationsResponse",
      "description": "The response message for Operations.ListOperations."
    },
    "TimeOfDay": {
      "type": "object",
      "description": "Represents a time of day. The date and time zone are either not significant or are specified elsewhere. An API may choose to allow leap seconds. Related types are google.type.Date and `google.protobuf.Timestamp`.",
      "properties": {
        "seconds": {
          "type": "integer",
          "format": "int32",
          "description": "Seconds of minutes of the time. Must normally be from 0 to 59. An API may allow the value 60 if it allows leap-seconds."
        },
        "nanos": {
          "format": "int32",
          "type": "integer",
          "description": "Fractions of seconds in nanoseconds. Must be from 0 to 999,999,999."
        },
        "minutes": {
          "description": "Minutes of hour of day. Must be from 0 to 59.",
          "format": "int32",
          "type": "integer"
        },
        "hours": {
          "type": "integer",
          "format": "int32",
          "description": "Hours of day in 24 hour format. Should be from 0 to 23. An API may choose to allow the value \"24:00:00\" for scenarios like business closing time."
        }
      },
      "id": "TimeOfDay"
    },
    "Backup": {
      "properties": {
        "sourceFileShare": {
          "type": "string",
          "description": "Name of the file share in the source Cloud Filestore instance that the backup is created from."
        },
        "sourceInstanceTier": {
          "enum": [
            "TIER_UNSPECIFIED",
            "STANDARD",
            "PREMIUM",
            "BASIC_HDD",
            "BASIC_SSD",
            "HIGH_SCALE_SSD"
          ],
          "description": "Output only. The service tier of the source Cloud Filestore instance that this backup is created from.",
          "readOnly": true,
          "enumDescriptions": [
            "Not set.",
            "STANDARD tier.",
            "PREMIUM tier.",
            "BASIC instances offer a maximum capacity of 63.9 TB. BASIC_HDD is an alias for STANDARD Tier, offering economical performance backed by HDD.",
            "BASIC instances offer a maximum capacity of 63.9 TB. BASIC_SSD is an alias for PREMIUM Tier, and offers improved performance backed by SSD.",
            "HIGH_SCALE instances offer expanded capacity and performance scaling capabilities."
          ],
          "type": "string"
        },
        "sourceInstance": {
          "description": "The resource name of the source Cloud Filestore instance, in the format projects/{project_number}/locations/{location_id}/instances/{instance_id}, used to create this backup.",
          "type": "string"
        },
        "labels": {
          "description": "Resource labels to represent user provided metadata.",
          "type": "object",
          "additionalProperties": {
            "type": "string"
          }
        },
        "storageBytes": {
          "readOnly": true,
          "type": "string",
          "description": "Output only. The size of the storage used by the backup. As backups share storage, this number is expected to change with backup creation/deletion.",
          "format": "int64"
        },
        "downloadBytes": {
          "format": "int64",
          "type": "string",
          "readOnly": true,
          "description": "Output only. Amount of bytes that will be downloaded if the backup is restored. This may be different than storage bytes, since sequential backups of the same disk will share storage."
        },
        "createTime": {
          "format": "google-datetime",
          "type": "string",
          "description": "Output only. The time when the backup was created.",
          "readOnly": true
        },
        "name": {
          "readOnly": true,
          "type": "string",
          "description": "Output only. The resource name of the backup, in the format projects/{project_number}/locations/{location_id}/backups/{backup_id}."
        },
        "state": {
          "enumDescriptions": [
            "State not set.",
            "Backup is being created.",
            "Backup has been taken and the operation is being finalized. At this point, changes to the file share will not be reflected in the backup.",
            "Backup is available for use.",
            "Backup is being deleted."
          ],
          "enum": [
            "STATE_UNSPECIFIED",
            "CREATING",
            "FINALIZING",
            "READY",
            "DELETING"
          ],
          "type": "string",
          "readOnly": true,
          "description": "Output only. The backup state."
        },
        "description": {
          "type": "string",
          "description": "A description of the backup with 2048 characters or less. Requests with longer descriptions will be rejected."
        },
        "capacityGb": {
          "readOnly": true,
          "description": "Output only. Capacity of the source file share when the backup was created.",
          "type": "string",
          "format": "int64"
        }
      },
      "type": "object",
      "id": "Backup",
      "description": "A Cloud Filestore backup."
    },
    "UpdatePolicy": {
      "properties": {
        "denyMaintenancePeriods": {
          "description": "Deny Maintenance Period that is applied to resource to indicate when maintenance is forbidden. User can specify zero or more non-overlapping deny periods. For V1, Maximum number of deny_maintenance_periods is expected to be one.",
          "type": "array",
          "items": {
            "$ref": "DenyMaintenancePeriod"
          }
        },
        "window": {
          "description": "Optional. Maintenance window that is applied to resources covered by this policy.",
          "$ref": "MaintenanceWindow"
        },
        "channel": {
          "type": "string",
          "enumDescriptions": [
            "Unspecified channel.",
            "Early channel within a customer project.",
            "Later channel within a customer project."
          ],
          "enum": [
            "UPDATE_CHANNEL_UNSPECIFIED",
            "EARLIER",
            "LATER"
          ],
          "description": "Optional. Relative scheduling channel applied to resource."
        }
      },
      "type": "object",
      "id": "UpdatePolicy",
      "description": "Maintenance policy applicable to instance updates."
    },
    "Operation": {
      "description": "This resource represents a long-running operation that is the result of a network API call.",
      "properties": {
        "done": {
          "type": "boolean",
          "description": "If the value is `false`, it means the operation is still in progress. If `true`, the operation is completed, and either `error` or `response` is available."
        },
        "response": {
          "description": "The normal response of the operation in case of success. If the original method returns no data on success, such as `Delete`, the response is `google.protobuf.Empty`. If the original method is standard `Get`/`Create`/`Update`, the response should be the resource. For other methods, the response should have the type `XxxResponse`, where `Xxx` is the original method name. For example, if the original method name is `TakeSnapshot()`, the inferred response type is `TakeSnapshotResponse`.",
          "additionalProperties": {
            "description": "Properties of the object. Contains field @type with type URL.",
            "type": "any"
          },
          "type": "object"
        },
        "metadata": {
          "type": "object",
          "description": "Service-specific metadata associated with the operation. It typically contains progress information and common metadata such as create time. Some services might not provide such metadata. Any method that returns a long-running operation should document the metadata type, if any.",
          "additionalProperties": {
            "description": "Properties of the object. Contains field @type with type URL.",
            "type": "any"
          }
        },
        "error": {
          "description": "The error result of the operation in case of failure or cancellation.",
          "$ref": "Status"
        },
        "name": {
          "description": "The server-assigned name, which is only unique within the same service that originally returns it. If you use the default HTTP mapping, the `name` should be a resource name ending with `operations/{unique_id}`.",
          "type": "string"
        }
      },
      "id": "Operation",
      "type": "object"
    },
    "DenyMaintenancePeriod": {
      "type": "object",
      "properties": {
        "endDate": {
          "description": "Deny period end date. This can be: * A full date, with non-zero year, month and day values. * A month and day value, with a zero year. Allows recurring deny periods each year. Date matching this period will have to be before the end.",
          "$ref": "Date"
        },
        "startDate": {
          "description": "Deny period start date. This can be: * A full date, with non-zero year, month and day values. * A month and day value, with a zero year. Allows recurring deny periods each year. Date matching this period will have to be the same or after the start.",
          "$ref": "Date"
        },
        "time": {
          "description": "Time in UTC when the Blackout period starts on start_date and ends on end_date. This can be: * Full time. * All zeros for 00:00:00 UTC",
          "$ref": "TimeOfDay"
        }
      },
      "id": "DenyMaintenancePeriod",
      "description": "DenyMaintenancePeriod definition. Maintenance is forbidden within the deny period. The start_date must be less than the end_date."
    },
    "RestoreInstanceRequest": {
      "properties": {
        "fileShare": {
          "description": "Required. Name of the file share in the Cloud Filestore instance that the backup is being restored to.",
          "type": "string"
        },
        "sourceBackup": {
          "type": "string",
          "description": "The resource name of the backup, in the format projects/{project_number}/locations/{location_id}/backups/{backup_id}."
        }
      },
      "description": "RestoreInstanceRequest restores an existing instances's file share from a backup.",
      "id": "RestoreInstanceRequest",
      "type": "object"
    },
    "MaintenanceWindow": {
      "type": "object",
      "id": "MaintenanceWindow",
      "description": "MaintenanceWindow definition.",
      "properties": {
        "dailyCycle": {
          "$ref": "DailyCycle",
          "description": "Daily cycle."
        },
        "weeklyCycle": {
          "$ref": "WeeklyCycle",
          "description": "Weekly cycle."
        }
      }
    },
    "Date": {
      "properties": {
        "day": {
          "type": "integer",
          "format": "int32",
          "description": "Day of a month. Must be from 1 to 31 and valid for the year and month, or 0 to specify a year by itself or a year and month where the day isn't significant."
        },
        "year": {
          "description": "Year of the date. Must be from 1 to 9999, or 0 to specify a date without a year.",
          "format": "int32",
          "type": "integer"
        },
        "month": {
          "description": "Month of a year. Must be from 1 to 12, or 0 to specify a year without a month and day.",
          "format": "int32",
          "type": "integer"
        }
      },
      "description": "Represents a whole or partial calendar date, such as a birthday. The time of day and time zone are either specified elsewhere or are insignificant. The date is relative to the Gregorian Calendar. This can represent one of the following: * A full date, with non-zero year, month, and day values * A month and day value, with a zero year, such as an anniversary * A year on its own, with zero month and day values * A year and month value, with a zero day, such as a credit card expiration date Related types are google.type.TimeOfDay and `google.protobuf.Timestamp`.",
      "id": "Date",
      "type": "object"
    },
    "GoogleCloudSaasacceleratorManagementProvidersV1ProvisionedResource": {
      "description": "Describes provisioned dataplane resources.",
      "id": "GoogleCloudSaasacceleratorManagementProvidersV1ProvisionedResource",
      "properties": {
        "resourceType": {
          "description": "Type of the resource. This can be either a GCP resource or a custom one (e.g. another cloud provider's VM). For GCP compute resources use singular form of the names listed in GCP compute API documentation (https://cloud.google.com/compute/docs/reference/rest/v1/), prefixed with 'compute-', for example: 'compute-instance', 'compute-disk', 'compute-autoscaler'.",
          "type": "string"
        },
        "resourceUrl": {
          "type": "string",
          "description": "URL identifying the resource, e.g. \"https://www.googleapis.com/compute/v1/projects/...)\"."
        }
      },
      "type": "object"
    },
    "WeeklyCycle": {
      "description": "Time window specified for weekly operations.",
      "id": "WeeklyCycle",
      "properties": {
        "schedule": {
          "type": "array",
          "items": {
            "$ref": "Schedule"
          },
          "description": "User can specify multiple windows in a week. Minimum of 1 window."
        }
      },
      "type": "object"
    },
    "CancelOperationRequest": {
      "type": "object",
      "description": "The request message for Operations.CancelOperation.",
      "properties": {},
      "id": "CancelOperationRequest"
    },
    "Location": {
      "id": "Location",
      "properties": {
        "locationId": {
          "description": "The canonical id for this location. For example: `\"us-east1\"`.",
          "type": "string"
        },
        "metadata": {
          "additionalProperties": {
            "type": "any",
            "description": "Properties of the object. Contains field @type with type URL."
          },
          "description": "Service-specific metadata. For example the available capacity at the given location.",
          "type": "object"
        },
        "labels": {
          "type": "object",
          "additionalProperties": {
            "type": "string"
          },
          "description": "Cross-service attributes for the location. For example {\"cloud.googleapis.com/region\": \"us-east1\"}"
        },
        "name": {
          "type": "string",
          "description": "Resource name for the location, which may vary between implementations. For example: `\"projects/example-project/locations/us-east1\"`"
        },
        "displayName": {
          "type": "string",
          "description": "The friendly name for this location, typically a nearby city name. For example, \"Tokyo\"."
        }
      },
      "description": "A resource that represents Google Cloud Platform location.",
      "type": "object"
    },
    "GoogleCloudSaasacceleratorManagementProvidersV1Instance": {
      "id": "GoogleCloudSaasacceleratorManagementProvidersV1Instance",
      "type": "object",
      "properties": {
        "maintenanceSchedules": {
          "description": "The MaintenanceSchedule contains the scheduling information of published maintenance schedule with same key as software_versions.",
          "additionalProperties": {
            "$ref": "GoogleCloudSaasacceleratorManagementProvidersV1MaintenanceSchedule"
          },
          "type": "object"
        },
        "sloMetadata": {
          "readOnly": true,
          "description": "Output only. SLO metadata for instance classification in the Standardized dataplane SLO platform. See go/cloud-ssa-standard-slo for feature description.",
          "$ref": "GoogleCloudSaasacceleratorManagementProvidersV1SloMetadata"
        },
        "maintenanceSettings": {
          "$ref": "GoogleCloudSaasacceleratorManagementProvidersV1MaintenanceSettings",
          "description": "Optional. The MaintenanceSettings associated with instance."
        },
        "provisionedResources": {
          "readOnly": true,
          "description": "Output only. The list of data plane resources provisioned for this instance, e.g. compute VMs. See go/get-instance-metadata.",
          "type": "array",
          "items": {
            "$ref": "GoogleCloudSaasacceleratorManagementProvidersV1ProvisionedResource"
          }
        },
        "maintenancePolicyNames": {
          "description": "Deprecated. The MaintenancePolicies that have been attached to the instance. The key must be of the type name of the oneof policy name defined in MaintenancePolicy, and the referenced policy must define the same policy type. For complete details of MaintenancePolicy, please refer to go/cloud-saas-mw-ug.",
          "additionalProperties": {
            "type": "string"
          },
          "type": "object"
        },
        "softwareVersions": {
          "description": "Software versions that are used to deploy this instance. This can be mutated by rollout services.",
          "type": "object",
          "additionalProperties": {
            "type": "string"
          }
        },
        "consumerDefinedName": {
          "type": "string",
          "description": "consumer_defined_name is the name that is set by the consumer. On the other hand Name field represents system-assigned id of an instance so consumers are not necessarily aware of it. consumer_defined_name is used for notification/UI purposes for consumer to recognize their instances."
        },
        "name": {
          "description": "Unique name of the resource. It uses the form: `projects/{project_id}/locations/{location_id}/instances/{instance_id}`",
          "type": "string"
        },
        "updateTime": {
          "readOnly": true,
          "format": "google-datetime",
          "type": "string",
          "description": "Output only. Timestamp when the resource was last modified."
        },
        "createTime": {
          "format": "google-datetime",
          "type": "string",
          "readOnly": true,
          "description": "Output only. Timestamp when the resource was created."
        },
        "slmInstanceTemplate": {
          "description": "Link to the SLM instance template. Only populated when updating SLM instances via SSA's Actuation service adaptor. Service producers with custom control plane (e.g. Cloud SQL) doesn't need to populate this field. Instead they should use software_versions.",
          "type": "string"
        },
        "tenantProjectId": {
          "readOnly": true,
          "type": "string",
          "description": "Output only. ID of the associated GCP tenant project. See go/get-instance-metadata."
        },
        "labels": {
          "type": "object",
          "additionalProperties": {
            "type": "string"
          },
          "description": "Optional. Resource labels to represent user provided metadata. Each label is a key-value pair, where both the key and the value are arbitrary strings provided by the user."
        },
        "producerMetadata": {
          "readOnly": true,
          "description": "Output only. Custom string attributes used primarily to expose producer-specific information in monitoring dashboards. See go/get-instance-metadata.",
          "type": "object",
          "additionalProperties": {
            "type": "string"
          }
        },
        "state": {
          "enum": [
            "STATE_UNSPECIFIED",
            "CREATING",
            "READY",
            "UPDATING",
            "REPAIRING",
            "DELETING",
            "ERROR"
          ],
          "description": "Output only. Current lifecycle state of the resource (e.g. if it's being created or ready to use).",
          "readOnly": true,
          "enumDescriptions": [
            "Unspecified state.",
            "Instance is being created.",
            "Instance has been created and is ready to use.",
            "Instance is being updated.",
            "Instance is unheathy and under repair.",
            "Instance is being deleted.",
            "Instance encountered an error and is in indeterministic state."
          ],
          "type": "string"
        }
      }
    },
    "Status": {
      "id": "Status",
      "description": "The `Status` type defines a logical error model that is suitable for different programming environments, including REST APIs and RPC APIs. It is used by [gRPC](https://github.com/grpc). Each `Status` message contains three pieces of data: error code, error message, and error details. You can find out more about this error model and how to work with it in the [API Design Guide](https://cloud.google.com/apis/design/errors).",
      "properties": {
        "message": {
          "description": "A developer-facing error message, which should be in English. Any user-facing error message should be localized and sent in the google.rpc.Status.details field, or localized by the client.",
          "type": "string"
        },
        "details": {
          "description": "A list of messages that carry the error details. There is a common set of message types for APIs to use.",
          "items": {
            "additionalProperties": {
              "type": "any",
              "description": "Properties of the object. Contains field @type with type URL."
            },
            "type": "object"
          },
          "type": "array"
        },
        "code": {
          "format": "int32",
          "description": "The status code, which should be an enum value of google.rpc.Code.",
          "type": "integer"
        }
      },
      "type": "object"
    },
    "ListLocationsResponse": {
      "id": "ListLocationsResponse",
      "properties": {
        "locations": {
          "description": "A list of locations that matches the specified filter in the request.",
          "items": {
            "$ref": "Location"
          },
          "type": "array"
        },
        "nextPageToken": {
          "description": "The standard List next-page token.",
          "type": "string"
        }
      },
      "type": "object",
      "description": "The response message for Locations.ListLocations."
    },
    "FileShareConfig": {
      "type": "object",
      "properties": {
        "sourceBackup": {
          "description": "The resource name of the backup, in the format projects/{project_number}/locations/{location_id}/backups/{backup_id}, that this file share has been restored from.",
          "type": "string"
        },
        "capacityGb": {
          "description": "File share capacity in gigabytes (GB). Cloud Filestore defines 1 GB as 1024^3 bytes.",
          "format": "int64",
          "type": "string"
        },
        "name": {
          "description": "The name of the file share (must be 16 characters or less).",
          "type": "string"
        }
      },
      "description": "File share configuration for the instance.",
      "id": "FileShareConfig"
    },
    "ListBackupsResponse": {
      "properties": {
        "unreachable": {
          "description": "Locations that could not be reached.",
          "items": {
            "type": "string"
          },
          "type": "array"
        },
        "nextPageToken": {
          "type": "string",
          "description": "The token you can use to retrieve the next page of results. Not returned if there are no more results in the list."
        },
        "backups": {
          "items": {
            "$ref": "Backup"
          },
          "description": "A list of backups in the project for the specified location. If the {location} value in the request is \"-\", the response contains a list of backups from all locations. If any location is unreachable, the response will only return backups in reachable locations and the \"unreachable\" field will be populated with a list of unreachable locations.",
          "type": "array"
        }
      },
      "description": "ListBackupsResponse is the result of ListBackupsRequest.",
      "id": "ListBackupsResponse",
      "type": "object"
    },
    "Empty": {
      "type": "object",
      "description": "A generic empty message that you can re-use to avoid defining duplicated empty messages in your APIs. A typical example is to use it as the request or the response type of an API method. For instance: service Foo { rpc Bar(google.protobuf.Empty) returns (google.protobuf.Empty); } The JSON representation for `Empty` is empty JSON object `{}`.",
      "properties": {},
      "id": "Empty"
    },
    "GoogleCloudSaasacceleratorManagementProvidersV1SloExclusion": {
      "description": "SloExclusion represents an exclusion in SLI calculation applies to all SLOs.",
      "properties": {
        "startTime": {
          "format": "google-datetime",
          "description": "Start time of the exclusion. No alignment (e.g. to a full minute) needed.",
          "type": "string"
        },
        "sliName": {
          "type": "string",
          "description": "Name of an SLI that this exclusion applies to. Can be left empty, signaling that the instance should be excluded from all SLIs defined in the service SLO configuration."
        },
        "duration": {
          "description": "Exclusion duration. No restrictions on the possible values. When an ongoing operation is taking longer than initially expected, an existing entry in the exclusion list can be updated by extending the duration. This is supported by the subsystem exporting eligibility data as long as such extension is committed at least 10 minutes before the original exclusion expiration - otherwise it is possible that there will be \"gaps\" in the exclusion application in the exported timeseries.",
          "type": "string",
          "format": "google-duration"
        },
        "reason": {
          "type": "string",
          "description": "Human-readable reason for the exclusion. This should be a static string (e.g. \"Disruptive update in progress\") and should not contain dynamically generated data (e.g. instance name). Can be left empty."
        }
      },
      "id": "GoogleCloudSaasacceleratorManagementProvidersV1SloExclusion",
      "type": "object"
    },
    "DailyCycle": {
      "description": "Time window specified for daily operations.",
      "properties": {
        "duration": {
          "type": "string",
          "format": "google-duration",
          "description": "Output only. Duration of the time window, set by service producer."
        },
        "startTime": {
          "description": "Time within the day to start the operations.",
          "$ref": "TimeOfDay"
        }
      },
      "id": "DailyCycle",
      "type": "object"
    },
    "GoogleCloudSaasacceleratorManagementProvidersV1SloEligibility": {
      "type": "object",
      "id": "GoogleCloudSaasacceleratorManagementProvidersV1SloEligibility",
      "description": "SloEligibility is a tuple containing eligibility value: true if an instance is eligible for SLO calculation or false if it should be excluded from all SLO-related calculations along with a user-defined reason.",
      "properties": {
        "eligible": {
          "type": "boolean",
          "description": "Whether an instance is eligible or ineligible."
        },
        "reason": {
          "type": "string",
          "description": "User-defined reason for the current value of instance eligibility. Usually, this can be directly mapped to the internal state. An empty reason is allowed."
        }
      }
    },
    "GoogleCloudSaasacceleratorManagementProvidersV1MaintenanceSchedule": {
      "properties": {
        "endTime": {
          "description": "The scheduled end time for the maintenance.",
          "type": "string",
          "format": "google-datetime"
        },
        "startTime": {
          "type": "string",
          "format": "google-datetime",
          "description": "The scheduled start time for the maintenance."
        },
        "canReschedule": {
          "description": "Can this scheduled update be rescheduled? By default, it's true and API needs to do explicitly check whether it's set, if it's set as false explicitly, it's false",
          "type": "boolean"
        },
        "rolloutManagementPolicy": {
          "type": "string",
          "description": "The rollout management policy this maintenance schedule is associated with. When doing reschedule update request, the reschedule should be against this given policy."
        }
      },
      "id": "GoogleCloudSaasacceleratorManagementProvidersV1MaintenanceSchedule",
      "description": "Maintenance schedule which is exposed to customer and potentially end user, indicating published upcoming future maintenance schedule",
      "type": "object"
    },
    "GoogleCloudSaasacceleratorManagementProvidersV1MaintenanceSettings": {
      "description": "Maintenance settings associated with instance. Allows service producers and end users to assign settings that controls maintenance on this instance.",
      "type": "object",
      "properties": {
        "maintenancePolicies": {
          "additionalProperties": {
            "$ref": "MaintenancePolicy"
          },
          "type": "object",
          "description": "Optional. The MaintenancePolicies that have been attached to the instance. The key must be of the type name of the oneof policy name defined in MaintenancePolicy, and the embedded policy must define the same policy type. For complete details of MaintenancePolicy, please refer to go/cloud-saas-mw-ug. If only the name is needed (like in the deprecated Instance.maintenance_policy_names field) then only populate MaintenancePolicy.name."
        },
        "exclude": {
          "type": "boolean",
          "description": "Optional. Exclude instance from maintenance. When true, rollout service will not attempt maintenance on the instance. Rollout service will include the instance in reported rollout progress as not attempted."
        }
      },
      "id": "GoogleCloudSaasacceleratorManagementProvidersV1MaintenanceSettings"
    },
    "NetworkConfig": {
      "description": "Network configuration for the instance.",
      "id": "NetworkConfig",
      "type": "object",
      "properties": {
        "reservedIpRange": {
          "description": "A /29 CIDR block in one of the [internal IP address ranges](https://www.arin.net/knowledge/address_filters.html) that identifies the range of IP addresses reserved for this instance. For example, 10.0.0.0/29 or 192.168.0.0/29. The range you specify can't overlap with either existing subnets or assigned IP address ranges for other Cloud Filestore instances in the selected VPC network.",
          "type": "string"
        },
        "network": {
          "type": "string",
          "description": "The name of the Google Compute Engine [VPC network](/compute/docs/networks-and-firewalls#networks) to which the instance is connected."
        },
        "modes": {
          "description": "Internet protocol versions for which the instance has IP addresses assigned. For this version, only MODE_IPV4 is supported.",
          "items": {
            "enumDescriptions": [
              "Internet protocol not set.",
              "Use the IPv4 internet protocol."
            ],
            "type": "string",
            "enum": [
              "ADDRESS_MODE_UNSPECIFIED",
              "MODE_IPV4"
            ]
          },
          "type": "array"
        },
        "ipAddresses": {
          "readOnly": true,
          "items": {
            "type": "string"
          },
          "type": "array",
          "description": "Output only. IPv4 addresses in the format {octet 1}.{octet 2}.{octet 3}.{octet 4} or IPv6 addresses in the format {block 1}:{block 2}:{block 3}:{block 4}:{block 5}:{block 6}:{block 7}:{block 8}."
        }
      }
    },
    "Instance": {
      "type": "object",
      "properties": {
        "etag": {
          "description": "Server-specified ETag for the instance resource to prevent simultaneous updates from overwriting each other.",
          "type": "string"
        },
        "networks": {
          "type": "array",
          "items": {
            "$ref": "NetworkConfig"
          },
          "description": "VPC networks to which the instance is connected. For this version, only a single network is supported."
        },
        "statusMessage": {
          "type": "string",
          "readOnly": true,
          "description": "Output only. Additional information about the instance state, if available."
        },
        "state": {
          "type": "string",
          "enumDescriptions": [
            "State not set.",
            "The instance is being created.",
            "The instance is available for use.",
            "Work is being done on the instance. You can get further details from the `statusMessage` field of the `Instance` resource.",
            "The instance is shutting down.",
            "The instance is experiencing an issue and might be unusable. You can get further details from the `statusMessage` field of the `Instance` resource."
          ],
          "enum": [
            "STATE_UNSPECIFIED",
            "CREATING",
            "READY",
            "REPAIRING",
            "DELETING",
            "ERROR"
          ],
          "readOnly": true,
          "description": "Output only. The instance state."
        },
        "name": {
          "description": "Output only. The resource name of the instance, in the format projects/{project}/locations/{location}/instances/{instance}.",
          "type": "string",
          "readOnly": true
        },
        "labels": {
          "type": "object",
          "description": "Resource labels to represent user provided metadata.",
          "additionalProperties": {
            "type": "string"
          }
        },
        "description": {
          "description": "The description of the instance (2048 characters or less).",
          "type": "string"
        },
        "tier": {
          "enum": [
            "TIER_UNSPECIFIED",
            "STANDARD",
            "PREMIUM",
            "BASIC_HDD",
            "BASIC_SSD",
            "HIGH_SCALE_SSD"
          ],
          "type": "string",
          "enumDescriptions": [
            "Not set.",
            "STANDARD tier.",
            "PREMIUM tier.",
            "BASIC instances offer a maximum capacity of 63.9 TB. BASIC_HDD is an alias for STANDARD Tier, offering economical performance backed by HDD.",
            "BASIC instances offer a maximum capacity of 63.9 TB. BASIC_SSD is an alias for PREMIUM Tier, and offers improved performance backed by SSD.",
            "HIGH_SCALE instances offer expanded capacity and performance scaling capabilities."
          ],
          "description": "The service tier of the instance."
        },
        "createTime": {
          "format": "google-datetime",
          "readOnly": true,
          "type": "string",
          "description": "Output only. The time when the instance was created."
        },
        "fileShares": {
          "items": {
            "$ref": "FileShareConfig"
          },
          "type": "array",
          "description": "File system shares on the instance. For this version, only a single file share is supported."
        }
      },
      "description": "A Cloud Filestore instance.",
      "id": "Instance"
    },
    "ListInstancesResponse": {
      "type": "object",
      "description": "ListInstancesResponse is the result of ListInstancesRequest.",
      "id": "ListInstancesResponse",
      "properties": {
        "nextPageToken": {
          "description": "The token you can use to retrieve the next page of results. Not returned if there are no more results in the list.",
          "type": "string"
        },
        "unreachable": {
          "items": {
            "type": "string"
          },
          "description": "Locations that could not be reached.",
          "type": "array"
        },
        "instances": {
          "items": {
            "$ref": "Instance"
          },
          "type": "array",
          "description": "A list of instances in the project for the specified location. If the {location} value in the request is \"-\", the response contains a list of instances from all locations. If any location is unreachable, the response will only return instances in reachable locations and the \"unreachable\" field will be populated with a list of unreachable locations."
        }
      }
    },
    "Schedule": {
      "id": "Schedule",
      "properties": {
        "duration": {
          "description": "Output only. Duration of the time window, set by service producer.",
          "type": "string",
          "format": "google-duration"
        },
        "day": {
          "enumDescriptions": [
            "The day of the week is unspecified.",
            "Monday",
            "Tuesday",
            "Wednesday",
            "Thursday",
            "Friday",
            "Saturday",
            "Sunday"
          ],
          "description": "Allows to define schedule that runs specified day of the week.",
          "enum": [
            "DAY_OF_WEEK_UNSPECIFIED",
            "MONDAY",
            "TUESDAY",
            "WEDNESDAY",
            "THURSDAY",
            "FRIDAY",
            "SATURDAY",
            "SUNDAY"
          ],
          "type": "string"
        },
        "startTime": {
          "$ref": "TimeOfDay",
          "description": "Time within the window to start the operations."
        }
      },
      "description": "Configure the schedule.",
      "type": "object"
    },
    "GoogleCloudSaasacceleratorManagementProvidersV1NodeSloMetadata": {
      "description": "Node information for custom per-node SLO implementations. SSA does not support per-node SLO, but producers can populate per-node information in SloMetadata for custom precomputations. SSA Eligibility Exporter will emit per-node metric based on this information.",
      "type": "object",
      "id": "GoogleCloudSaasacceleratorManagementProvidersV1NodeSloMetadata",
      "properties": {
        "exclusions": {
          "type": "array",
          "description": "By default node is eligible if instance is eligible. But individual node might be excluded from SLO by adding entry here. For semantic see SloMetadata.exclusions. If both instance and node level exclusions are present for time period, the node level's reason will be reported by Eligibility Exporter.",
          "items": {
            "$ref": "GoogleCloudSaasacceleratorManagementProvidersV1SloExclusion"
          }
        },
        "nodeId": {
          "description": "The id of the node. This should be equal to SaasInstanceNode.node_id.",
          "type": "string"
        },
        "location": {
          "description": "The location of the node, if different from instance location.",
          "type": "string"
        }
      }
    },
    "GoogleCloudSaasacceleratorManagementProvidersV1SloMetadata": {
      "type": "object",
      "properties": {
        "tier": {
          "description": "Name of the SLO tier the Instance belongs to. This name will be expected to match the tiers specified in the service SLO configuration. Field is mandatory and must not be empty.",
          "type": "string"
        },
        "eligibility": {
          "description": "Optional. User-defined instance eligibility.",
          "$ref": "GoogleCloudSaasacceleratorManagementProvidersV1SloEligibility"
        },
        "exclusions": {
          "items": {
            "$ref": "GoogleCloudSaasacceleratorManagementProvidersV1SloExclusion"
          },
          "description": "List of SLO exclusion windows. When multiple entries in the list match (matching the exclusion time-window against current time point) the exclusion reason used in the first matching entry will be published. It is not needed to include expired exclusion in this list, as only the currently applicable exclusions are taken into account by the eligibility exporting subsystem (the historical state of exclusions will be reflected in the historically produced timeseries regardless of the current state). This field can be used to mark the instance as temporary ineligible for the purpose of SLO calculation. For permanent instance SLO exclusion, use of custom instance eligibility is recommended. See 'eligibility' field below.",
          "type": "array"
        },
        "nodes": {
          "items": {
            "$ref": "GoogleCloudSaasacceleratorManagementProvidersV1NodeSloMetadata"
          },
          "description": "Optional. List of nodes. Some producers need to use per-node metadata to calculate SLO. This field allows such producers to publish per-node SLO meta data, which will be consumed by SSA Eligibility Exporter and published in the form of per node metric to Monarch.",
          "type": "array"
        }
      },
      "description": "SloMetadata contains resources required for proper SLO classification of the instance.",
      "id": "GoogleCloudSaasacceleratorManagementProvidersV1SloMetadata"
    }
  },
  "ownerName": "Google",
  "parameters": {
    "$.xgafv": {
      "enumDescriptions": [
        "v1 error format",
        "v2 error format"
      ],
      "location": "query",
      "enum": [
        "1",
        "2"
      ],
      "type": "string",
      "description": "V1 error format."
    },
    "fields": {
      "type": "string",
      "location": "query",
      "description": "Selector specifying which fields to include in a partial response."
    },
    "upload_protocol": {
      "description": "Upload protocol for media (e.g. \"raw\", \"multipart\").",
      "type": "string",
      "location": "query"
    },
    "uploadType": {
      "location": "query",
      "description": "Legacy upload protocol for media (e.g. \"media\", \"multipart\").",
      "type": "string"
    },
    "alt": {
      "enum": [
        "json",
        "media",
        "proto"
      ],
      "enumDescriptions": [
        "Responses with Content-Type of application/json",
        "Media download with context-dependent Content-Type",
        "Responses with Content-Type of application/x-protobuf"
      ],
      "default": "json",
      "location": "query",
      "type": "string",
      "description": "Data format for response."
    },
    "quotaUser": {
      "type": "string",
      "location": "query",
      "description": "Available to use for quota purposes for server-side applications. Can be any arbitrary string assigned to a user, but should not exceed 40 characters."
    },
    "callback": {
      "location": "query",
      "type": "string",
      "description": "JSONP"
    },
    "prettyPrint": {
      "type": "boolean",
      "description": "Returns response with indentations and line breaks.",
      "location": "query",
      "default": "true"
    },
    "key": {
      "type": "string",
      "description": "API key. Your API key identifies your project and provides you with API access, quota, and reports. Required unless you provide an OAuth 2.0 token.",
      "location": "query"
    },
    "access_token": {
      "description": "OAuth access token.",
      "location": "query",
      "type": "string"
    },
    "oauth_token": {
      "description": "OAuth 2.0 token for the current user.",
      "location": "query",
      "type": "string"
    }
  },
  "kind": "discovery#restDescription",
  "ownerDomain": "google.com",
  "id": "file:v1"
}
