﻿{
    "$schema": "http://json.schemastore.org/template",
    "author": "Microsoft Community",
    "classifications": [
      "Universal"
    ],
    "name": "Page.Vue.AddNavigateHome",
    "shortName": "Page.Vue.AddNavigateHome",
    "identity": "Page.Vue.AddNavigateHome",
  "tags": {
    "language": "Any",
    "type": "item",
    "wts.type": "composition",
    "wts.platform": "Web",
    "wts.version": "1.0.0",
    "wts.compositionFilter": "$frontendframework == Vue & wts.type == page & $ishomepage == true"
  },
    "sourceName": "wts.ItemName",
    "preferNameDirectory": true,
    "PrimaryOutputs": [
    ],
    "symbols": {
    }
  }
