﻿{
  "$schema": "http://json.schemastore.org/template",
  "author": "Microsoft",
  "classifications": ["Universal"],
  "name": "App Service",
  "shortName": "App Service",
  "groupIdentity": "wts.Feature.Azure.AppService",
  "identity": "wts.Feature.Azure.AppService",
  "description": "Quickly build, deploy, and scale your web apps with confidence.",
  "tags": {
    "language": "Any",
    "type": "item",
    "wts.type": "feature",
    "wts.platform": "Web",
    "wts.projecttype": "FullStackWebApp",
    "wts.frontendframework": "all",
    "wts.backendframework": "all",
    "wts.version": "1.0.0",
    "wts.displayOrder": "0",
    "wts.multipleInstance": "false",
    "wts.group": "CloudHosting"
  },
  "sourceName": "AzureAppService",
  "preferNameDirectory": true,
  "PrimaryOutputs": [],
  "symbols": {
  }
}
