﻿{
  "$schema": "http://json.schemastore.org/template",
  "author": "Microsoft",
  "classifications": ["Universal"],
  "name": "Master Detail",
  "shortName": "Master Detail",
  "groupIdentity": "wts.Page.MasterDetail",
  "identity": "wts.Page.Vue.MasterDetail",
  "description": "A master pane and a details pane for content.",
  "tags": {
    "language": "Any",
    "type": "item",
    "wts.type": "page",
    "wts.platform": "Web",
    "wts.projecttype": "FullStackWebApp",
    "wts.frontendframework": "Vue",
    "wts.backendframework": "all",
    "wts.version": "1.0.0",
    "wts.displayOrder": "3"
  },
  "sourceName": "VueMasterDetail",
  "preferNameDirectory": true,
  "PrimaryOutputs": [],
  "symbols": {
  }
}
