﻿{
  "$schema": "http://json.schemastore.org/template",
  "author": "Microsoft",
  "classifications": ["Universal"],
  "name": "Project.Vue.ConfigProxy",
  "shortName": "Project.Vue.ConfigProxy",
  "identity": "wts.Project.Vue.ConfigProxy",
  "tags": {
    "language": "Any",
    "type": "item",
    "wts.type": "composition",
    "wts.platform": "Web",
    "wts.version": "1.0.0",
    "wts.compositionFilter": "identity == wts.Proj.VueDefault & $backendframework == Node|Flask|Moleculer"
  },
  "sourceName": "wts.ItemName",
  "preferNameDirectory": true,
  "PrimaryOutputs": [],
  "symbols": {
  }
}