<svg alt="collapse menu" width="12" height="12" viewBox="0 0 12 12" fill="none" xmlns="http://www.w3.org/2000/svg">
<path d="M6.53369 5.99938L11.8904 11.3594L11.3604 11.8894L6.00035 6.53271L0.640352 11.8894L0.110352 11.3594L5.46702 5.99938L0.110352 0.639375L0.640352 0.109375L6.00035 5.46604L11.3604 0.109375L11.8904 0.639375L6.53369 5.99938Z" fill="white"/>
</svg>
