/HEAD
    <meta name="generator" content="HTML Tidy for Linux (vers 25 March 2009), see www.w3.org" />
    <meta http-equiv="Content-Type" content="text/html; charset=us-ascii" />

    <title>Stable</title>
    <!-- Optional theme -->
    <link rel="stylesheet" href="https://maxcdn.bootstrapcdn.com/bootstrap/3.3.7/css/bootstrap-theme.min.css"
        integrity="sha384-rHyoN1iRsVXV4nD0JutlnGaslCJuC7uwjduW9SVrLvRYooPp2bWYgmgJQIXwl/Sp" crossorigin="anonymous"
        type="text/css" />
    <!-- Latest compiled and minified JavaScript -->

    <script src="https://maxcdn.bootstrapcdn.com/bootstrap/3.3.7/js/bootstrap.min.js"
        integrity="sha384-Tc5IQib027qvyjSMfHjOMaLkfuWVxZxUPnCJA7l2mCWNIpG9mGCD8wGNIcPD7Txa" crossorigin="anonymous"
        type="text/javascript"></script>
    
<style type="text/css">
        /*<![CDATA[*/
        /* Basic */

        @-ms-viewport {
            width: device-width;
        }

  
a {

  text-transform: inherit;

  box-shadow: 0 5px 0 gold;
  color: white;
  padding: 1em 1.em;
  position: relative;

  text-transform: uppercase;
}

a:hover {
  background-color: yellow;
}

a:active {
  box-shadow: none;
  top: 8px;
}

/* Non-Demo Styles */
body {
  justify-content: center;
  align-items: center;
}



body {
  background: url(https://i.gifer.com/76YS.gif);
  padding: 2em;
  zoom: 1.4;
  font-family: 'Raleway', sans-serif;
  padding: 1em 2em;
  font-size: 18px;
  color: #aaa
}

.btn {
  font: bold 11px Arial;
  text-decoration: none;
  background-color: transparent;
  color: #ffffff;
  padding: 2px 6px 2px 6px;
  border-radius: 10px;
  border-top: 1px solid #CCCCCC;
  border-right: 1px solid #333333;
  border-bottom: 1px solid #333333;
  border-left: 1px solid #18047a;
}

iframe.animate {
  overflow-y: scroll;
  border-radius: 2px;
  min-width: 45em;
  /* padding: 1.2em 1em 0; */
  box-shadow: 0 0 9px;
  margin: 0.5em;
  /* display: grid; */
  -webkit-border-radius: 10px;
  -moz-border-radius: 10px;
  -ms-border-radius: 10px;
  -o-border-radius: 10px;
}

iframe.embed {
  overflow-y: scroll;
  padding: 2em;
  margin: auto;
  overflow: auto;
  border: solid 4px rgb(41, 54, 204);
  -moz-border-radius: 6px 6px 4px 4px;
  -webkit-border-radius: 6px 6px 4px 4px;
  border-radius: 6px 6px 6px 6px;
}


h1,
h2 {
  font-weight: 900;
  margin: 0.4em 0;
}

h1 {
  font-size: 3.5em;
}

h2 {
  color: #888;
  font-size: 2em;
}



        html {
            box-sizing: border-box;
        }

        *,
        *:before,
        *:after {
            box-sizing: inherit;
        }

        body {
            background-color: whitesmoke;
        }

        body.is-preload *,
        body.is-preload *:before,
        body.is-preload *:after {
            -moz-animation: none !important;
            -webkit-animation: none !important;
            -ms-animation: none !important;
            animation: none !important;
            -moz-transition: none !important;
            -webkit-transition: none !important;
            -ms-transition: none !important;
            transition: none !important;
        }

        /* Type */

        html {
            font-size: 11pt;
        }

       
        body {
            color: whitesmoke;
        }

        body,
        input,
        select,
        textarea {
            font-family: "Merriweather", Georgia, serif;
            font-weight: 200;
            font-size: 0.8rem;
          
        }

        a {
            -moz-transition: color 0.2s ease-in-out, background-color 0.2s ease-in-out, border-color 0.2s ease-in-out, box-shadow 0.2s ease-in-out;
            -webkit-transition: color 0.2s ease-in-out, background-color 0.2s ease-in-out, border-color 0.2s ease-in-out, box-shadow 0.2s ease-in-out;
            -ms-transition: color 0.2s ease-in-out, background-color 0.2s ease-in-out, border-color 0.2s ease-in-out, box-shadow 0.2s ease-in-out;
            transition: color 0.2s ease-in-out, background-color 0.2s ease-in-out, border-color 0.2s ease-in-out, box-shadow 0.2s ease-in-out;
            border-bottom: dotted 1px;
            text-decoration: none;
        }

        a:hover {
            border-bottom-color: transparent;
        }

        @charset "UTF-8";
        @import url(https://fonts.googleapis.com/css?family=Open+Sans:300,400,700);

        HTML {
            font-size: medium;
            font-family: Garamond
        }

        BODY {
            background: black font-family: 'Open Sans', sans-serif;
            font-weight: 150;
         
            color: #A7A1AE;
            background-color: #1F2739;
        }

        h1 {
            font-size: 2em;
            font-weight: 300;
         
            text-align: left;
            color: #4DC3FA;
        }

        p {
            color: grey;
        }

        A {
            text-decoration: none color:black;
         overflow-wrap: anywhere;

        }

        A:hover {
            color: red;
            background: whitesmoke;
            border-radius: 8px;
            padding-left: 3px;
            padding-right: 3px;
        }

        TABLE.fancy {
           background: url(https://i.gifer.com/76YS.gif);
  padding: 2em;
  zoom: 0.85;
  font-family: 'Raleway', sans-serif;
  padding: 1em 2em;
  font-size: 18px;
  color: #aaa
            border-left: 3px solid;
            border-collapse: collapse;
            margin: 15px 0;
            font-size: 0.8em;
            font-family: sans-serif;
            min-width: 150px;
            box-shadow: 0 0 20px rgba(0, 0, 0, 0.15);
            border-top: 1px solid;
            border-bottom: 0px solid;
            border-color: #FFF;
            overflow-y: scroll;
            width: 80%;
            display: table;
            padding: 0 0 8em 0;
overflow:ellipsis-word;
        }

        TABLE.fancy TD {
  background: url(https://i.gifer.com/76YS.gif);
  padding: 2em;
  zoom: 0.78;
  font-family: 'Raleway', sans-serif;
  padding: 1em 2em;
  font-size: 18px;
  color: #aaa
            border-right: 1px solid;
            border-bottom: 1px solid;
            border-color: #FFF;
            text-align: left;
            padding-right: 4%;
            padding-bottom: 4%;
            padding-top: 4%;
            padding-left: 4%;
            border: 2px solid gold !important;
         
                font-weight: 370;
            line-height: 14px;
            text-decoration: none !important;
            text-transform: uppercase;
     
           
            cursor: pointer;
            justify-content: left;
            padding: 20px 30px;
            height: 59px;
            text-align:left;
         
            border-radius: 10px;
                    padding: .1em .1em 0;
            box-shadow: 0 0 5px;
            margin: 1em;

            -webkit-border-radius: 10px;
            -moz-border-radius: 10px;
            -ms-border-radius: 10px;
            -o-border-radius: 20px;


        TABLE.fancy tr:nth-child(odd) {
            background-color: #323C50;
        }

        TABLE.fancy tr:nth-child(even) {
            background-color: #2C3446;
        }

        TABLE.fancy th {
            background-color: #1F2739;
        }

        TABLE.fancy td,
        TABLE.fancy th {
            padding-bottom: 2%;
            padding-top: 2%;
            padding-left: 2%;
        }

        TABLE.fancy tr:hover {
            background-color: #464A52;
            -webkit-box-shadow: 0 6px 6px -6px #0E1119;
            -moz-box-shadow: 0 6px 6px -6px #0E1119;
            box-shadow: 0 6px 6px -6px #0E1119;
        }

        TABLE.fancy td:hover {
            background-color: #FFF842;
            color: #403E10;
            font-weight: bold;
            box-shadow: #7F7C21 -1px 1px, #7F7C21 -2px 2px, #7F7C21 -3px 3px, #7F7C21 -4px 4px, #7F7C21 -5px 5px, #7F7C21 -6px 6px;
            transform: translate3d(6px, -6px, 0);
            transition-delay: 0s;
            transition-duration: 0.4s;
            transition-property: all;
            transition-timing-function: line;
        }

        @media (max-width: 800px) {

            TABLE.fancy td:nth-child(4),
            TABLE.fancy th:nth-child(4) {
                display: none;
            }
        }

        TABLE.fancy TD.no-right {
            border-right: 0px
        }

        TABLE.fancy TD.right {
            text-align: left
        }

        TABLE.fancy TD.left {
            text-align: center
        }

        TABLE.fancy a {
            color: yellow;
        }

        TABLE.fancy TH {
            border-right: 1px solid;
            border-bottom: 1px solid;
            text-align: left;
            background: black;
            color: #FFF;
            border-color: #FFF;
            font-weight: bold;
            padding: 12px 15px;
        }

        .anchor {
            font-weight: bold;
            border-top: 0px solid;
            text-align: left;
            border-bottom: 1px solid;
            background: black;
            color: #FFF
        }

        .dark-blue {
            font-weight: bold;
            border-top: 0px solid;
            text-align: left;
            border-bottom: 1px solid;
            background: url(https://i.gifer.com/76YS.gif);
  padding: 2em;
  zoom: 0.75;
  font-family: 'Raleway', sans-serif;
  padding: 1em 2em;
  font-size: 18px;
  color: #aaa  
        }

        .no-top-border {
            border-top: 0px
        }

        .centered {
            margin: auto
        }

        .rZ {
            text-align: right
        }

        .row2 {
            background: #D3D3E1







        }

@import url(//fonts.googleapis.com/css?family=PT+Sans);

body {
    margin: 0px;

    font-family: 'PT Sans', Helvetica, 'Helvetica Neuve', Arial, Tahoma, sans-serif;
    font-size: 17px;

    color: #333;
}
}

h1,
h2,
h3,
h4,
h5,
h6 {
    color: #222;
    margin: 0 0 20px;
}

p,
ul,
ol,
table,
pre,
dl {
    margin: 0 0 20px;
}

h1,
h2,
h3 {
    line-height: 1.1;
}

h1 {
    font-size: 28px;
}

h2 {
    color: #393939;
}

h3,
h4,
h5,
h6 {
    color: #494949;
}

a {
    color: #39c;
    font-weight: 400;
    text-decoration: none;
}

a small {
    font-size: 11px;
    color: #777;
    margin-top: -0.6em;
  
}

.wrapper {
    width: 860px;
    margin: 0 auto;
}

blockquote {
    border-left: 1px solid #e5e5e5;
    margin: 0;
    padding: 0 0 0 20px;
    font-style: italic;
}


table {
    width: 100%;
    border-collapse: collapse;
}

th,
td {
    text-align: left;
    padding: 5px 10px;
    border-bottom: 1px solid #e5e5e5;
}

dt {
    color: #444;
    font-weight: 700;
}

th {
    color: #444;
}

img {
    max-width: 100%;
}

header {
    width: 370px;
    float: left;
    position: fixed;
}

header ul {
    list-style: none;
    height: 40px;

    padding: 0;

    background: #eee;
    background: -moz-linear-gradient(top, #f8f8f8 0%, #dddddd 100%);
    background: -webkit-gradient(linear, left top, left bottom, color-stop(0%, #f8f8f8), color-stop(100%, #dddddd));
    background: -webkit-linear-gradient(top, #f8f8f8 0%, #dddddd 100%);
    background: -o-linear-gradient(top, #f8f8f8 0%, #dddddd 100%);
    background: -ms-linear-gradient(top, #f8f8f8 0%, #dddddd 100%);
    background: linear-gradient(top, #f8f8f8 0%, #dddddd 100%);

    border-radius: 5px;
    border: 1px solid #d2d2d2;
    box-shadow: inset #fff 0 1px 0,
    inset rgba(0, 0, 0, 0.03) 0 -1px 0;
    width: 270px;
}

header li {
    width: 89px;
    float: left;
    border-right: 1px solid #d2d2d2;
    height: 40px;
}

header ul a {
    line-height: 1;
    font-size: 11px;
    color: #999;
    display: block;
    text-align: center;
    padding-top: 6px;
    height: 40px;
}

strong {
    color: #222;
    font-weight: 700;
}

header ul li+li {
    width: 88px;
    border-left: 1px solid #fff;
}

header ul li+li+li {
    border-right: none;
    width: 89px;
}

header ul a strong {
    font-size: 14px;
    display: block;
    color: #222;
}

section {
    width: 500px;
    float: right;
    padding-bottom: 50px;
}

small {
    font-size: 11px;
}

hr {
    border: 0;
    background: #e5e5e5;
    height: 1px;
    margin: 0 0 20px;
}

footer {
    width: 270px;
    float: left;
    position: fixed;
    bottom: 50px;
}

@media print,
screen and (max-width: 960px) {

    div.wrapper {
        width: auto;
        margin: 0;
    }

    header,
    section,
    footer {
        float: none;
        position: static;
        width: auto;
    }

    header {
        padding-right: 320px;
    }

    section {
        border: 1px solid #e5e5e5;
        border-width: 1px 0;
        padding: 20px 0;
        margin: 0 0 20px;
    }

    header a small {
        display: inline;
    }

    header ul {
        position: absolute;
        right: 50px;
        top: 52px;
    }
}

@media print,
screen and (max-width: 720px) {
 

    header {
        padding: 0;
    }

    header ul,
    header p.view {
        position: static;
    }

   
}

@media print,
screen and (max-width: 480px) {
    body {
        padding: 15px;
    }

    header ul {
        display: none;
    }
}

@media print {
    body {
        padding: 0.4in;
        font-size: 12pt;
        color: #444;
    }
}


#wrapper {
    padding: 1em;
}

.ca-menu {
    list-style: none;
    padding: 0;
    margin: 20px auto;
}


.nav-list {
    height: 50%;
    margin: auto 0;
}

div.clear {
    clear: both;
}



        /*]]>*/
    </style>

/TABLEHEADER
<table border="0" cellspacing="0" cellpadding="3" summary="file table" class="fancy centered">
/FILE_TABLE_ROW2
class="row2"
/FILE_TD
class="left"
/SIZE_TD
class="right"
/DATE_TD
class="no-right"

/FOLDER_TABLE_HEADER
<table border="0" cellspacing="0" cellpadding="3" summary="folder table" class="fancy centered no-top-border">
/FOLDER_TABLE_ROW2
class="row2"
/FOLDER_HEADER
class="dark-blue" style="text-align: center"

/ANCHOR_TABLE_HEADER
<table border="0" cellspacing="0" cellpadding="3" summary="anchor table" class="fancy centered">
/ANCHOR_TABLE_ROW2
class="row2"
/ANCHOR_TD
class="anchor center"
/SUMMARY_STYLE
style="font-weight: bold; margin-bottom: 0px"
/HEADER_STYLE
class="dark-blue" style="text-align: center"

