{
  "pageContext": {
    "isCreatedByStatefulCreatePages": false,
    "posts": [
      {
        "frontmatter": {
          "path": "/Algorithm-Design-Manual--Chapter-Seven",
          "title": "Algorithm Design Manual:",
          "tags": [
            "algorithms",
            "heuristics",
            "search",
            "Algorithm Design Manual"
          ],
          "subtitle": "Combinatorial Search and Heuristic Methods",
          "chapter": "Chapter Seven"
        }
      }
    ],
    "tagName": "search"
  }
}
