{
  "data": {
    "allMarkdownRemark": {
      "edges": [
        {
          "node": {
            "id": "9d76a428-4d81-5e36-83a0-7a8b9fe2c167",
            "excerpt": "Authentication Verifying the identity of a user of…",
            "frontmatter": {
              "title": "M310 - MongoDB Security",
              "chapter": null,
              "subtitle": "Part I",
              "path": "/M310-MongoDB-Security-Pt-1",
              "tags": ["security", "MongoDB"],
              "date": "06.23.2019"
            }
          }
        },
        {
          "node": {
            "id": "47c8028f-4943-511d-a423-e8b241a8022e",
            "excerpt": "4 Programming Padigms in 40 Minutes Link to…",
            "frontmatter": {
              "title": "4 Programming Paradigms in 40 Minutes",
              "chapter": null,
              "subtitle": null,
              "path": "/4-Programming-Paradigms",
              "tags": [
                "languages",
                "programming",
                "object-oriented",
                "functional",
                "logic/constraint",
                "procedural"
              ],
              "date": "05.07.2019"
            }
          }
        },
        {
          "node": {
            "id": "2f9ddd8c-0fd5-5038-97e6-2b8f5fc07e48",
            "excerpt": "Space complexity Aamount of storage space for the…",
            "frontmatter": {
              "title": "Big O Notation",
              "chapter": null,
              "subtitle": null,
              "path": "/Big-O-Notation",
              "tags": ["Big O Notation", "time complexity"],
              "date": "04.20.2019"
            }
          }
        },
        {
          "node": {
            "id": "0b5eb736-bdc3-5a00-b532-c3a4609a1bfd",
            "excerpt": "Technical Interviews Steps Listen Carefully…",
            "frontmatter": {
              "title": "Cracking the Coding Interview",
              "chapter": "Chapter 7",
              "subtitle": "Technical Interviews",
              "path": "/Cracking-The-Coding-Interview--Technical-Interviews",
              "tags": [
                "Cracking the Coding Interview",
                "technical interviews",
                "algorithms",
                "data structures"
              ],
              "date": "03.15.2019"
            }
          }
        },
        {
          "node": {
            "id": "45293c5f-cfdf-5c36-a1ac-0e12b9b30b1b",
            "excerpt": "A Tour of Go Packages, Variables, and Functions…",
            "frontmatter": {
              "title": "A Tour Of Go",
              "chapter": null,
              "subtitle": "Basics I & II",
              "path": "/A-Tour-Of-Go",
              "tags": ["Go"],
              "date": "03.04.2019"
            }
          }
        },
        {
          "node": {
            "id": "230ed69f-8710-57d7-a176-110341a7dbfd",
            "excerpt": "Time complexity is written  T(n)  and gives the…",
            "frontmatter": {
              "title": "Computer Science Distilled",
              "chapter": "Chapter Two",
              "subtitle": "Complexity",
              "path": "/Computer-Science-Distilled-Chapter-II",
              "tags": [
                "computer science",
                "Computer Science Distilled",
                "Big O Notation",
                "time complexity",
                "space complexity"
              ],
              "date": "01.30.2019"
            }
          }
        },
        {
          "node": {
            "id": "589697e4-4721-52ca-921a-b2eff079028b",
            "excerpt": "Logic in Computing Logic gates perform logic…",
            "frontmatter": {
              "title": "Computer Science Distilled",
              "chapter": "Chapter One",
              "subtitle": "1.2 Logic, 1.3 Counting && 1.4 Probability",
              "path": "/Computer-Science-Distilled-Chapter-I-Continued",
              "tags": [
                "computer science",
                "Computer Science Distilled",
                "logic",
                "probability",
                "counting"
              ],
              "date": "01.29.2019"
            }
          }
        },
        {
          "node": {
            "id": "6e44fd93-a9bc-5879-880b-66139fea230c",
            "excerpt": "The key to algorithm design and problem solving in…",
            "frontmatter": {
              "title": "Algorithm Design Manual:",
              "chapter": "Chapter Ten",
              "subtitle": "How to Design Algorithms",
              "path": "/Algorithm-Design-Manual--Chapter-Ten",
              "tags": [
                "algorithms",
                "algorithm design",
                "Algorithm Design Manual"
              ],
              "date": "01.28.2019"
            }
          }
        },
        {
          "node": {
            "id": "46eeda91-1ba4-5a7d-9d8b-326776f0f9a3",
            "excerpt": "Reductions  are operations that convert one…",
            "frontmatter": {
              "title": "Algorithm Design Manual:",
              "chapter": "Chapter Nine",
              "subtitle": "Intractable Problems and Approximation Algorithms",
              "path": "/Algorithm-Design-Manual--Chapter-Nine",
              "tags": ["algorithms", "NP-complete", "Algorithm Design Manual"],
              "date": "01.27.2019"
            }
          }
        },
        {
          "node": {
            "id": "287baab3-5473-5de3-ad1f-92136e35d3b9",
            "excerpt": "Dynamic Programming  is a technique for…",
            "frontmatter": {
              "title": "Algorithm Design Manual:",
              "chapter": "Chapter Eight",
              "subtitle": "Dynamic Programming",
              "path": "/Algorithm-Design-Manual--Chapter-Eight",
              "tags": [
                "algorithms",
                "dynamic programming",
                "Algorithm Design Manual"
              ],
              "date": "01.27.2019"
            }
          }
        },
        {
          "node": {
            "id": "f74f7f45-2a82-5c57-a6d6-24d28f9d9fea",
            "excerpt": "Backtracking: Backtracking is a systematic way to…",
            "frontmatter": {
              "title": "Algorithm Design Manual:",
              "chapter": "Chapter Seven",
              "subtitle": "Combinatorial Search and Heuristic Methods",
              "path": "/Algorithm-Design-Manual--Chapter-Seven",
              "tags": [
                "algorithms",
                "heuristics",
                "search",
                "Algorithm Design Manual"
              ],
              "date": "01.23.2019"
            }
          }
        },
        {
          "node": {
            "id": "5b48417a-0241-5218-a15a-cc5a33246721",
            "excerpt": "Chapter 5's graph data structure quietly supported…",
            "frontmatter": {
              "title": "Algorithm Design Manual:",
              "chapter": "Chapter Six",
              "subtitle": "Weighted Graph Algorithms",
              "path": "/Algorithm-Design-Manual--Chapter-Six",
              "tags": ["algorithms", "graphs", "Algorithm Design Manual"],
              "date": "01.18.2019"
            }
          }
        },
        {
          "node": {
            "id": "2c5945c1-bd77-569b-842d-318832210219",
            "excerpt": "A graph  G  =  (V, E)  consists of vertex  V…",
            "frontmatter": {
              "title": "Algorithm Design Manual:",
              "chapter": "Chapter Five",
              "subtitle": "Graph Traversal",
              "path": "/Algorithm-Design-Manual--Chapter-Five",
              "tags": ["algorithms", "graphs", "Algorithm Design Manual"],
              "date": "01.16.2019"
            }
          }
        },
        {
          "node": {
            "id": "b79fa6b1-dd0d-5587-8c21-2425116e40dd",
            "excerpt": "Applications of Sorting: Searching : Binary search…",
            "frontmatter": {
              "title": "Algorithm Design Manual:",
              "chapter": "Chapter Four",
              "subtitle": "Sorting and Searching",
              "path": "/Algorithm-Design-Manual--Chapter-Four",
              "tags": [
                "algorithms",
                "sorting",
                "searching",
                "Algorithm Design Manual"
              ],
              "date": "01.15.2019"
            }
          }
        },
        {
          "node": {
            "id": "b7b0b773-1b8f-5f09-a2d6-167e9226f3b7",
            "excerpt": "Contiguous vs. Linked Data Structures: Contiguous…",
            "frontmatter": {
              "title": "Algorithm Design Manual:",
              "chapter": "Chapter Three",
              "subtitle": "Data Structures",
              "path": "/Algorithm-Design-Manual--Chapter-Three",
              "tags": [
                "algorithms",
                "data structures",
                "Algorithm Design Manual"
              ],
              "date": "01.13.2019"
            }
          }
        },
        {
          "node": {
            "id": "dd4b6796-748f-5fe5-9a07-2b282ed4e905",
            "excerpt": "Random Access Memory (RAM) Computation Model: Each…",
            "frontmatter": {
              "title": "Algorithm Design Manual:",
              "chapter": "Chapter Two",
              "subtitle": "Algorithm Analysis",
              "path": "/Algorithm-Design-Manual--Chapter-Two",
              "tags": [
                "algorithms",
                "algorithm analysis",
                "Algorithm Design Manual"
              ],
              "date": "01.11.2019"
            }
          }
        },
        {
          "node": {
            "id": "87a2ef99-779a-58ca-8e9b-8a7fe7b185f3",
            "excerpt": "Designing good algorithms for real-world problems…",
            "frontmatter": {
              "title": "Algorithm Design Manual:",
              "chapter": "Chapter One",
              "subtitle": "Introduction to Algorithm Design",
              "path": "/Algorithm-Design-Manual--Chapter-One",
              "tags": ["algorithms", "Algorithm Design Manual"],
              "date": "12.18.2018"
            }
          }
        },
        {
          "node": {
            "id": "5215ce22-bc70-528f-890d-0a0a790f3ddd",
            "excerpt": "1.1 Ideas Guidelines for Flowcharts: Write states…",
            "frontmatter": {
              "title": "Computer Science Distilled",
              "chapter": "Chapter One",
              "subtitle": "1.1 Basics & 1.2 Logic",
              "path": "/Computer-Science-Distilled-Chapter-I",
              "tags": [
                "computer science",
                "Computer Science Distilled",
                "logic"
              ],
              "date": "12.09.2018"
            }
          }
        },
        {
          "node": {
            "id": "fe6e0c94-5ed7-553f-9607-e0960367865d",
            "excerpt": "We'll primarily deal with actual arrays, that is…",
            "frontmatter": {
              "title": "Think Like a Programmer:",
              "chapter": "Chapter Three",
              "subtitle": "Solving Problems with Arrays",
              "path": "/Think-Like-a-Programmer-Chapter-III",
              "tags": ["problem solving", "Think Like a Programmer"],
              "date": "12.07.2018"
            }
          }
        },
        {
          "node": {
            "id": "9810493d-2bea-5666-bdd3-af1931b230ed",
            "excerpt": "Problem: Half of a Square Write a program that…",
            "frontmatter": {
              "title": "Think Like a Programmer:",
              "chapter": "Chapter Two",
              "subtitle": "Pure Puzzles",
              "path": "/Think-Like-a-Programmer-Chapter-II",
              "tags": ["problem solving", "Think Like a Programmer"],
              "date": "11.29.2018"
            }
          }
        },
        {
          "node": {
            "id": "e41e303b-cdea-5868-adef-a533f79c2288",
            "excerpt": "Problem solving  - writing an original program…",
            "frontmatter": {
              "title": "Think Like a Programmer:",
              "chapter": "Chapter One",
              "subtitle": "Strategies for Problem Solving",
              "path": "/Think-Like-a-Programmer-Chapter-I",
              "tags": ["problem solving", "Think Like a Programmer"],
              "date": "11.26.2018"
            }
          }
        },
        {
          "node": {
            "id": "00d51dd9-a1b0-5a07-99bf-7d49e2e8708d",
            "excerpt": "Introduction: Data Structure  - An intentional…",
            "frontmatter": {
              "title": "Programming Foundations:",
              "chapter": null,
              "subtitle": "Data Structures",
              "path": "/Programming-Foundations--Data-Structures",
              "tags": ["foundations", "data structures"],
              "date": "11.22.2018"
            }
          }
        },
        {
          "node": {
            "id": "68e5fcfd-21bb-562b-b633-89da14cd5a90",
            "excerpt": "Algorithm Characteristics: Algorithm complexity…",
            "frontmatter": {
              "title": "Programming Foundations:",
              "chapter": null,
              "subtitle": "Algorithms",
              "path": "/Programming-Foundations--Algorithms",
              "tags": ["foundations", "algorithms", "sorting"],
              "date": "11.21.2018"
            }
          }
        },
        {
          "node": {
            "id": "27a7fc3e-a75b-5e6e-97d2-c656abbf8cd0",
            "excerpt": "Rules of Coding Efficency: First, do nothing You…",
            "frontmatter": {
              "title": "Programming Foundations:",
              "chapter": null,
              "subtitle": "Coding Efficiency",
              "path": "/Programming-Foundations--Coding-Efficiency",
              "tags": ["foundations", "efficiency"],
              "date": "11.20.2018"
            }
          }
        },
        {
          "node": {
            "id": "11bd09ee-16df-5373-97da-436424666deb",
            "excerpt": "Subroutines: Functions as you know them from…",
            "frontmatter": {
              "title": "Computer Architecture: Subroutines",
              "chapter": null,
              "subtitle": null,
              "path": "/Computer-Architecture-Subroutines",
              "tags": ["computer architecture", "subroutines"],
              "date": "08.23.2018"
            }
          }
        },
        {
          "node": {
            "id": "f8d879ac-8058-5a7e-9063-9e103950e290",
            "excerpt": "Convert between and understand decimal, binary…",
            "frontmatter": {
              "title": "Binary Conversion",
              "chapter": null,
              "subtitle": null,
              "path": "/Binary-Conversion",
              "tags": ["binary conversion"],
              "date": "08.19.2018"
            }
          }
        },
        {
          "node": {
            "id": "7bed6d37-a64b-563e-9444-f463fa208b22",
            "excerpt": "Transitors: Basic element of computation that…",
            "frontmatter": {
              "title": "Introduction to Computer Architecture",
              "chapter": null,
              "subtitle": null,
              "path": "/Intro-to-Computer-Architecture",
              "tags": ["computer architecture"],
              "date": "08.19.2018"
            }
          }
        },
        {
          "node": {
            "id": "480c2a94-5216-54c1-a0b6-947285137235",
            "excerpt": "Operating Systems: interface with hardware so that…",
            "frontmatter": {
              "title": "CS8: Operating Systems I",
              "chapter": null,
              "subtitle": null,
              "path": "/CS8-Operating-Systems-I",
              "tags": ["CS8", "operating systems"],
              "date": "08.12.2018"
            }
          }
        },
        {
          "node": {
            "id": "0e588b98-b74a-5f29-8c0b-58012a8ecf94",
            "excerpt": "Drivers Special programs the OS runs that can talk…",
            "frontmatter": {
              "title": "Operating Systems",
              "chapter": null,
              "subtitle": null,
              "path": "/Operating-Systems",
              "tags": ["operating systems"],
              "date": "08.12.2018"
            }
          }
        },
        {
          "node": {
            "id": "7a8b404c-23fd-58a8-a0f8-2e3fc7b79fe6",
            "excerpt": " <- literal string!\n \n test () checks if string…",
            "frontmatter": {
              "title": "Regex",
              "chapter": null,
              "subtitle": null,
              "path": "/Regex",
              "tags": ["regex", "theory of computation"],
              "date": "08.01.2018"
            }
          }
        },
        {
          "node": {
            "id": "bd0b27a1-afa2-5e57-bd5d-afeb1c292a80",
            "excerpt": "State Machine: Collection of states\nCollection of…",
            "frontmatter": {
              "title": "State Machines",
              "chapter": null,
              "subtitle": null,
              "path": "/State-Machines",
              "tags": ["state machines", "theory of computation"],
              "date": "08.01.2018"
            }
          }
        },
        {
          "node": {
            "id": "a12ab1ae-bfca-5ae5-816f-cc124f0598e7",
            "excerpt": "Threat model What is the context of security that…",
            "frontmatter": {
              "title": "Lambda School: Introduction to Security & Cryptography",
              "chapter": null,
              "subtitle": null,
              "path": "/Intro-to-Security-and-Cryptography",
              "tags": ["security", "cryptography"],
              "date": "07.30.2018"
            }
          }
        },
        {
          "node": {
            "id": "ca79e2f7-0ecf-5fb0-9a33-804f21301a9a",
            "excerpt": "What is a graph? A series of nodes (vertices…",
            "frontmatter": {
              "title": "CS5: Graphs I",
              "chapter": null,
              "subtitle": null,
              "path": "/CS5-Graphs-I",
              "tags": ["CS5", "graphs"],
              "date": "07.22.2018"
            }
          }
        },
        {
          "node": {
            "id": "fbeccd34-bd90-5df8-8470-01eba16b733a",
            "excerpt": "Algorithms: Something that gives you a recipe step…",
            "frontmatter": {
              "title": "Lambda School: Overview of Algorithmic Techniques",
              "chapter": null,
              "subtitle": null,
              "path": "/Overview-of-Algorithmic-Techniques",
              "tags": ["algorithms"],
              "date": "07.17.2018"
            }
          }
        },
        {
          "node": {
            "id": "7348c733-8265-504c-bcf2-7752812cff9c",
            "excerpt": "Data structures are like cookware: The tools you…",
            "frontmatter": {
              "title": "CS10: Data Structures & Algorithms",
              "chapter": null,
              "subtitle": "Day One",
              "path": "/CS10-Data-Structures-And-Algorithms-Day-One",
              "tags": ["data structures", "algorithms", "CS10"],
              "date": "07.16.2018"
            }
          }
        },
        {
          "node": {
            "id": "332cf452-cd95-5e1e-8042-96c600e62b7e",
            "excerpt": "Some of the problems that we have faced in the…",
            "frontmatter": {
              "title": "CS5: Docker",
              "chapter": null,
              "subtitle": null,
              "path": "/CS5-Docker",
              "tags": ["CS5", "docker", "DevOps"],
              "date": "06.23.2018"
            }
          }
        },
        {
          "node": {
            "id": "c04cdfc1-e6e4-503f-872f-44c9d118f082",
            "excerpt": "Heroku Takes your code and runs it in a specific…",
            "frontmatter": {
              "title": "CS5: Heroku",
              "chapter": null,
              "subtitle": null,
              "path": "/CS5-Heroku",
              "tags": ["CS5", "Heroku", "DevOps"],
              "date": "06.23.2018"
            }
          }
        },
        {
          "node": {
            "id": "f02b06dc-079f-5f64-98b9-aa09d30f2775",
            "excerpt": "Front-end engineering: Putting together a bunch of…",
            "frontmatter": {
              "title": "CS5: Netlify",
              "chapter": null,
              "subtitle": null,
              "path": "/CS5-Netlify",
              "tags": ["CS5", "Netlify", "DevOps"],
              "date": "06.23.2018"
            }
          }
        },
        {
          "node": {
            "id": "e86aed3e-2de7-5edc-8381-7dc0129ef2f4",
            "excerpt": "DevOps and Deployment: Not CS, not software…",
            "frontmatter": {
              "title": "CS5: Ngrok",
              "chapter": null,
              "subtitle": null,
              "path": "/CS5-Ngrok",
              "tags": ["CS5", "Ngrok", "DevOps"],
              "date": "06.23.2018"
            }
          }
        },
        {
          "node": {
            "id": "4aedaeee-2166-5a24-829a-28458b9aa3fd",
            "excerpt": "Repo Walkthrough for setting up Kubernetes Google…",
            "frontmatter": {
              "title": "CS5: Google Cloud Platform + Docker",
              "chapter": null,
              "subtitle": null,
              "path": "/CS5-Solution-GCP-Docker",
              "tags": ["CS5", "docker", "DevOps", "Google Cloud Platform"],
              "date": "06.23.2018"
            }
          }
        },
        {
          "node": {
            "id": "145b43b9-9175-5a46-a4c8-195509b3c1d1",
            "excerpt": "What is DevOps/Deployment? DevOps and Deployment…",
            "frontmatter": {
              "title": "DevOps:",
              "chapter": null,
              "subtitle": "Deployment Mini Sprint",
              "path": "/DevOps-Deployment-Mini-Sprint",
              "tags": ["DevOps"],
              "date": "06.23.2018"
            }
          }
        },
        {
          "node": {
            "id": "48c26e99-91ec-53a8-9dce-a2d7fd1eca18",
            "excerpt": "Domain knowledge Understanding what problem you're…",
            "frontmatter": {
              "title": "CS9: Server Testing",
              "chapter": null,
              "subtitle": null,
              "path": "/CS9-Server-Testing",
              "tags": ["server testing", "testing"],
              "date": "06.20.2018"
            }
          }
        },
        {
          "node": {
            "id": "bef15937-389d-5476-8dc5-b1f80b6307e3",
            "excerpt": "Jest Matchers (assertions or expectations…",
            "frontmatter": {
              "title": "CS9: Client Testing II",
              "chapter": null,
              "subtitle": null,
              "path": "/CS9-Client-Testing-II",
              "tags": ["client testing", "testing"],
              "date": "06.16.2018"
            }
          }
        },
        {
          "node": {
            "id": "ea7f4372-ff2b-5565-88d0-e432bb8590f9",
            "excerpt": "How can we verify that our code is correct? Mocha…",
            "frontmatter": {
              "title": "CS9: Client Testing I",
              "chapter": null,
              "subtitle": null,
              "path": "/CS9-Client-Testing-I",
              "tags": ["client testing", "testing"],
              "date": "06.15.2018"
            }
          }
        },
        {
          "node": {
            "id": "b3462cb2-692b-579a-a66a-4f10fa7ab5d2",
            "excerpt": "Client Auth Routes: / /signup /signin /users…",
            "frontmatter": {
              "title": "CS9: Auth II",
              "chapter": null,
              "subtitle": "Guided Demo II",
              "path": "/CS9-Auth-II-Guided-Demo-II",
              "tags": ["authentication", "CS9"],
              "date": "06.14.2018"
            }
          }
        },
        {
          "node": {
            "id": "766547ef-4299-520b-8651-390fefa1a315",
            "excerpt": "We want to allow users to log in to our websites…",
            "frontmatter": {
              "title": "Authentication Notes",
              "chapter": null,
              "subtitle": null,
              "path": "/Authentication-Notes",
              "tags": ["authentication"],
              "date": "06.13.2018"
            }
          }
        },
        {
          "node": {
            "id": "470f5bcf-fc37-55d6-bcc5-0cb8ebbc430a",
            "excerpt": "morgan: method/ Route/ status / time / Cookies are…",
            "frontmatter": {
              "title": "CS9: Auth II",
              "chapter": null,
              "subtitle": "Guided Demo I",
              "path": "/CS9-Auth-II-Guided-Demo-I",
              "tags": ["authentication", "CS9"],
              "date": "06.13.2018"
            }
          }
        },
        {
          "node": {
            "id": "d3f72244-5c9a-50b9-ac68-480e99714aae",
            "excerpt": "When you log in, what do you send to server…",
            "frontmatter": {
              "title": "CS9: Auth I",
              "chapter": null,
              "subtitle": "Guided Demo II",
              "path": "/CS9-Auth-I-Guided-Demo-II",
              "tags": ["authentication", "CS9"],
              "date": "06.11.2018"
            }
          }
        },
        {
          "node": {
            "id": "a5ae56ca-878b-5a21-9e85-93e2a920ae6d",
            "excerpt": "MongoDB Week 2 Part I: Creating Documents, the…",
            "frontmatter": {
              "title": "M101JS:",
              "chapter": null,
              "subtitle": "MongoDB for Node.JS Developers",
              "path": "/M101JS-MongoDB-for-NodeJS-Developers",
              "tags": ["MongoDB"],
              "date": "06.11.2018"
            }
          }
        },
        {
          "node": {
            "id": "fd1e03f6-2ea6-5c06-9cb0-0fa1e456dcdf",
            "excerpt": "\nOpen up terminal\nnpm/yarn init\ntouch server.js…",
            "frontmatter": {
              "title": "CS9: Auth I",
              "chapter": null,
              "subtitle": "Guided Demo I",
              "path": "/CS9-Auth-I-Guided-Demo-I",
              "tags": ["authentication", "CS9"],
              "date": "06.10.2018"
            }
          }
        },
        {
          "node": {
            "id": "10b29218-e8f2-5035-8941-398ce4d1422b",
            "excerpt": "Review: Example of one to one relation: User and…",
            "frontmatter": {
              "title": "CS9 Mongo Day 4",
              "chapter": null,
              "subtitle": null,
              "path": "/CS9-Mongo-Day-4",
              "tags": ["MongoDB", "CS9"],
              "date": "06.09.2018"
            }
          }
        },
        {
          "node": {
            "id": "5c197fb4-1ed2-5d75-aad0-3c0caccb5240",
            "excerpt": "Side Note: Robo 3T - Better than Compass Topics…",
            "frontmatter": {
              "title": "CS9 Mongo Day 3",
              "chapter": null,
              "subtitle": null,
              "path": "/CS9-Mongo-Day-3",
              "tags": ["MongoDB", "CS9"],
              "date": "06.08.2018"
            }
          }
        },
        {
          "node": {
            "id": "f68acb16-fbd3-5d7b-a7e4-336583fb0d7e",
            "excerpt": "Mongod: mongod is a database server Database A…",
            "frontmatter": {
              "title": "CS9 Mongo Day 1",
              "chapter": null,
              "subtitle": null,
              "path": "/CS9-Mongo-Day-1",
              "tags": ["MongoDB", "CS9"],
              "date": "06.07.2018"
            }
          }
        },
        {
          "node": {
            "id": "334efb14-734c-5da4-aa18-a14d5f5c6b95",
            "excerpt": "Mongoose: Library that wraps mongo DB native…",
            "frontmatter": {
              "title": "CS9 Mongo Day 2",
              "chapter": null,
              "subtitle": null,
              "path": "/CS9-Mongo-Day-2",
              "tags": ["MongoDB", "CS9"],
              "date": "06.07.2018"
            }
          }
        }
      ]
    }
  },
  "pageContext": { "isCreatedByStatefulCreatePages": true }
}
