{
  "pageContext": {
    "isCreatedByStatefulCreatePages": false,
    "posts": [
      {
        "frontmatter": {
          "path": "/CS8-Operating-Systems-I",
          "title": "CS8: Operating Systems I",
          "tags": ["CS8", "operating systems"],
          "subtitle": null,
          "chapter": null
        }
      }
    ],
    "tagName": "CS8"
  }
}
