// Work through this problem on https://leetcode.com/problems/minimum-path-sum/ and use the specs given there.
// Feel free to use this file for scratch work.

function minPathSum(grid) {
    let m = grid.length;
    let n = grid[0].length;
    let table = new Array(m).fill().map(() => new Array(n).fill(Infinity));
    table[0][0] = grid[0][0];

    for (let i = 0; i < m; i++) {
        for (let j = 0; j < n; j++) {
            if (i < m - 1) {
                table[i + 1][j] = Math.min(table[i][j] + grid[i + 1][j], table[i + 1][j]);
            }
            if (j < n - 1) {
                table[i][j + 1] = Math.min(table[i][j] + grid[i][j + 1], table[i][j + 1]);
            }
        }
    }

    return table[m - 1][n - 1];
}



-----------------------------------------------------------------------------------------------------
// Work through this problem on https://leetcode.com/problems/climbing-stairs/ and use the specs given there.
// Feel free to use this file for scratch work.

function climbStairs(n) {
    let table = new Array(n + 1);
    table[0] = 1;
    table[1] = 1;

    for (let i = 2; i < table.length; i++) {
        table[i] = table[i - 1] + table[i - 2];
    }

    return table[table.length - 1];
}

------------------------------------------------------------------------------------------------------
// Write a function, stepper(nums), that takes in an array of non negative numbers.
// Each element of the array represents the maximum number of steps you can take from that position in the array.
// The function should return a boolean indicating if it is possible to travel from the 
// first position of the array to the last position.
//
// For Example:
//
// Given [3, 1, 0, 5, 10]
//      - We begin at first position, 3. 
//      - Since the element is 3 we can take up to 3 steps from this position.
//      - This means we can step to the 1, 0, or 5
//      - Say we step to 1
//      - Since the element is 1, now the only option is to take 1 step to land on 0
//      - etc...
//
// Try to solve this in two ways, using tabulation and memoization.
//
// Examples:
//
// stepper([3, 1, 0, 5, 10]);           // => true, because we can step through elements 3 -> 5 -> 10
// stepper([3, 4, 1, 0, 10]);           // => true, because we can step through elements 3 -> 4 -> 10
// stepper([2, 3, 1, 1, 0, 4, 7, 8])    // => false, there is no way to step to the end

// tabulated solution
function stepper(nums) {
    let table = new Array(nums.length).fill(false);
    table[0] = true;

    for (let i = 0; i < table.length; i++) {
        if (table[i] === true) {
            let range = nums[i];
            for (let step = 1; step <= range; step++) {
                table[i + step] = true;
            }
        }
    }

    return table[table.length - 1];
}

// memoized solution
function stepper(nums, memo = {}) {
    if (nums.length in memo) return memo[nums.length];

    if (nums.length === 1) return true;
    if (nums.length === 0) return false;

    let range = nums[0];

    for (let i = 1; i <= range; i++) {
        if (stepper(nums.slice(i), memo)) {
            memo[nums.length] = true;
            return true;
        }
    }

    memo[nums.length] = false;
    return false;
}


// Write a function, maxNonAdjacentSum(nums), that takes in an array of nonnegative numbers.
// The function should return the maximum sum of elements in the array we can get if we cannot take
// adjacent elements into the sum.
//
// Try to solve this in two ways, using tabulation and memoization.
//
// Examples:
//
// maxNonAdjacentSum([2, 7, 9, 3, 4])   // => 15, because 2 + 9 + 4
// maxNonAdjacentSum([4,2,1,6])         // => 10, because 4 + 6 

// tabulated
function maxNonAdjacentSum(nums) {
    if (nums.length === 0) return 0;

    let table = new Array(nums.length).fill(0);
    table[0] = nums[0];

    for (let i = 1; i < table.length; i++) {
/*
if (let skipLeftNeighbor = table[i - 2] === undefined) {
	0
} else {
	table[i - 2];
        let bestWithThisNum = nums[i] + skipLeftNeighbor;
        let bestWithoutThisNum = table[i - 1];
}
*/
        let skipLeftNeighbor = table[i - 2] === undefined ? 0 : table[i - 2];
        let bestWithThisNum = nums[i] + skipLeftNeighbor;
        let bestWithoutThisNum = table[i - 1];
        table[i] = Math.max(bestWithThisNum, bestWithoutThisNum);
    }

    return table[table.length - 1];
}

// memoized
function maxNonAdjacentSum(nums, start = 0, end = nums.length - 1, memo = {}) {
    let key = start + ',' + end;
    if (key in memo) return memo[key];
    if (start > end) return 0;

    let ways = [];
    for (let i = start; i <= end; i++) {
        let amt = nums[i];
        ways.push(amt + maxNonAdjacentSum(nums, start, i - 2, memo) + maxNonAdjacentSum(nums, i + 2, end, memo));
    }

    memo[key] = Math.max(...ways);
    return memo[key];
}

function maxNonAdjacentSum(nums, memo = {}) {
    if (nums.length in memo) return memo[nums.length];
    if (nums.length === 0) return 0;

    memo[nums.length] = Math.max(
        maxNonAdjacentSum(nums.slice(1), memo),
        nums[0] + maxNonAdjacentSum(nums.slice(2), memo)
    );

    return memo[nums.length];
}

// Write a function, minChange(coins, amount), that accepts an array of coin values
// and a target amount as arguments. The method should the minimum number of coins needed
// to make the target amount. A coin value can be used multiple times.
//
// You've seen this problem before with memoization, but now solve it using the Tabulation strategy!
//
// Examples:
//
// minChange([1, 2, 5], 11)         // => 3, because 5 + 5 + 1 = 11
// minChange([1, 4, 5], 8))         // => 2, because 4 + 4 = 8
// minChange([1, 5, 10, 25], 15)    // => 2, because 10 + 5 = 15
// minChange([1, 5, 10, 25], 100)   // => 4, because 25 + 25 + 25 + 25 = 100

function minChange(coins, amount) {
    let table = new Array(amount + 1).fill(Infinity);
    table[0] = 0;

    coins.forEach((val) => {
        for (let amt = 0; amt < table.length; amt++) {
            for (let qty = 0; qty * val <= amt; qty++) {
                remainder = amt - qty * val;
                attempt = table[remainder] + qty;
                if (attempt < table[amt]) table[amt] = attempt;
            }
        }
    });

    return table[amount];
}


module.exports = {
    stepper,
    maxNonAdjacentSum,
    minChange
};