{
  "pageContext": {
    "isCreatedByStatefulCreatePages": false,
    "posts": [
      {
        "frontmatter": {
          "path": "/CS5-Heroku",
          "title": "CS5: Heroku",
          "tags": ["CS5", "Heroku", "DevOps"],
          "subtitle": null,
          "chapter": null
        }
      }
    ],
    "tagName": "Heroku"
  }
}
