{
  "pageContext": {
    "isCreatedByStatefulCreatePages": false,
    "posts": [
      {
        "frontmatter": {
          "path": "/CS5-Ngrok",
          "title": "CS5: Ngrok",
          "tags": ["CS5", "Ngrok", "DevOps"],
          "subtitle": null,
          "chapter": null
        }
      }
    ],
    "tagName": "Ngrok"
  }
}
