{
  "pageContext": {
    "isCreatedByStatefulCreatePages": false,
    "posts": [
      {
        "frontmatter": {
          "path": "/Regex",
          "title": "Regex",
          "tags": ["regex", "theory of computation"],
          "subtitle": null,
          "chapter": null
        }
      }
    ],
    "tagName": "regex"
  }
}
