﻿https://github.com/bgoonz/03-fetch-data,https://github.com/bgoonz/gatsby-netlify-cms-norwex,https://hub.com/bgoonz/React-movie-app,https://github.com/bgoonz/Exploring-Promises,https://hub.com/bgoonz/vscode-customized-config
https://github.com/bgoonz/a-whole-bunch-o-gatsby-templates,https://github.com/bgoonz/gatsby-react-portfolio,https://hub.com/bgoonz/react-redux-medium-clone,https://github.com/bgoonz/express-API-template,https://hub.com/bgoonz/vscode-Extension-readmes
https://github.com/bgoonz/activity-box,https://github.com/bgoonz/GIT-CDN-FILES,https://hub.com/bgoonz/react-redux-notes-v5,https://github.com/bgoonz/Express-basic-server-template,https://hub.com/bgoonz/web-crawler-node
https://github.com/bgoonz/All-Undergrad-Archive,https://github.com/bgoonz/GIT-HTML-PREVIEW-TOOL,https://hub.com/bgoonz/react-redux-registration-login-example,https://github.com/bgoonz/express-knex-postgres-boilerplate,https://hub.com/bgoonz/web-dev-interview-prep-quiz-website
https://github.com/bgoonz/alternate-blog-theme,https://github.com/bgoonz/gitbook,https://hub.com/bgoonz/React_Notes_V3,https://github.com/bgoonz/EXPRESS-NOTES,https://hub.com/bgoonz/web-dev-notes-resource-site
https://github.com/bgoonz/anki-cards,https://github.com/bgoonz/github-readme-stats,https://hub.com/bgoonz/Recursion-Practice-Website,https://github.com/bgoonz/fast-fourier-transform-,https://hub.com/bgoonz/web-dev-setup-checker
https://github.com/bgoonz/ask-me-anything,https://github.com/bgoonz/github-reference-repo,https://hub.com/bgoonz/Regex-and-Express-JS,https://github.com/bgoonz/form-builder-vanilla-js,https://hub.com/bgoonz/WEB-DEV-TOOLS-HUB
https://github.com/bgoonz/atlassian-templates,https://github.com/bgoonz/GoalsTracker,https://hub.com/bgoonz/repo-utils,https://github.com/bgoonz/Front-End-Frameworks-Practice,https://hub.com/bgoonz/web-dev-utils-package
https://github.com/bgoonz/Authentication-Notes,https://github.com/bgoonz/graphql-experimentation,https://hub.com/bgoonz/resume-cv-portfolio-samples,https://github.com/bgoonz/full-stack-react-redux,https://hub.com/bgoonz/WebAudioDaw
https://github.com/bgoonz/bash-commands-walkthrough,https://github.com/bgoonz/https*__mihirbeg.com*,https://hub.com/bgoonz/Revamped-Automatic-Guitar-Effect-Triggering,https://github.com/bgoonz/Full-Text-Search,https://hub.com/bgoonz/website
https://github.com/bgoonz/bash-config-backup,https://github.com/bgoonz/iframe-showcase,https://hub.com/bgoonz/scope-closure-context,https://github.com/bgoonz/Games,https://github.com/bgoonz/Data-Structures-Algos-Codebase
https://github.com/bgoonz/bash-shell-utility-functions,https://github.com/bgoonz/Image-Archive-Traning-Data,https://hub.com/bgoonz/Shell-Script-Practice,https://github.com/bgoonz/MihirBegMusicV3,https://github.com/bgoonz/DATA_STRUC_PYTHON_NOTES
https://github.com/bgoonz/bass-station,https://github.com/bgoonz/Independent-Blog-Entries,https://hub.com/bgoonz/site-analysis,https://github.com/bgoonz/Mihir_Beg_Final,https://github.com/bgoonz/design-home-page-with-routes-bq5v7k
https://github.com/bgoonz/bgoonz,https://github.com/bgoonz/INTERVIEW-PREP-COMPLETE,https://hub.com/bgoonz/sorting-algorithms,https://github.com/bgoonz/mini-project-showcase,https://github.com/bgoonz/docs-collection
https://github.com/bgoonz/BGOONZBLOG2.0STABLE,https://github.com/bgoonz/JAMSTACK-TEMPLATES,https://hub.com/bgoonz/sorting-algos,https://github.com/bgoonz/Music-Theory-n-Web-Synth-Keyboard,https://github.com/bgoonz/Documentation-site-react
https://github.com/bgoonz/BGOONZ_BLOG_2.0,https://github.com/bgoonz/Javascript-Best-Practices_--Tools,https://hub.com/bgoonz/sqlite3-nodejs-demo,https://github.com/bgoonz/my-gists,https://github.com/bgoonz/DS-ALGO-OFFICIAL
https://github.com/bgoonz/Binary-Search,https://github.com/bgoonz/jsanimate,https://hub.com/bgoonz/stalk-photos-web-assets,https://github.com/bgoonz/My-Medium-Blog,https://github.com/bgoonz/DS-AND-ALGO-Notes-P2
https://github.com/bgoonz/blog-2.o-versions,https://github.com/bgoonz/Jupyter-Notebooks,https://hub.com/bgoonz/Standalone-Metranome,https://github.com/bgoonz/nextjs-netlify-blog-template,https://github.com/bgoonz/ecommerce-interactive
https://github.com/bgoonz/blog-templates,https://github.com/bgoonz/Lambda,https://hub.com/bgoonz/Star-wars-API-Promise-take2,https://github.com/bgoonz/norwex-coff-ecom,https://github.com/bgoonz/embedable-repl-and-integrated-code-space-playground
https://github.com/bgoonz/blog-w-comments,https://github.com/bgoonz/Lambda-Resource-Static-Assets,https://hub.com/bgoonz/Static-Study-Site,https://github.com/bgoonz/old-c-and-cpp-repos-from-undergrad,https://github.com/bgoonz/excel2html-table
https://github.com/bgoonz/Blog2.0-August-Super-Stable,https://github.com/bgoonz/learning-nextjs,https://hub.com/bgoonz/styling-templates,https://github.com/bgoonz/old-code-from-undergrad,
https://github.com/bgoonz/bootstrap-sidebar-template,https://github.com/bgoonz/Learning-Redux,https://hub.com/bgoonz/supertemp,https://github.com/bgoonz/picture-man-bob-v2,
https://github.com/bgoonz/callbacks,https://github.com/bgoonz/Links-Shortcut-Site,https://hub.com/bgoonz/Ternary-converter,https://github.com/bgoonz/Project-Showcase,
https://github.com/bgoonz/Comments,https://github.com/bgoonz/live-examples,https://hub.com/bgoonz/TetrisJS,https://github.com/bgoonz/promises-with-async-and-await,
https://github.com/bgoonz/commercejs-nextjs-demo-store,https://github.com/bgoonz/live-form,https://hub.com/bgoonz/TexTools,https://github.com/bgoonz/psql-practice,
https://github.com/bgoonz/Common-npm-Readme-Compilation,https://github.com/bgoonz/loadash-es6-refactor,https://hub.com/bgoonz/The-Algorithms,https://github.com/bgoonz/python-playground-embed,
https://github.com/bgoonz/Comparing-Web-Development-Bootcamps-2021,https://github.com/bgoonz/markdown-css,https://hub.com/bgoonz/TRASH,https://github.com/bgoonz/python-practice-notes,
https://github.com/bgoonz/Connect-Four-Final-Version,https://github.com/bgoonz/Markdown-Templates,https://hub.com/bgoonz/Triggered-Guitar-Effects-Platform,https://github.com/bgoonz/python-scripts,
https://github.com/bgoonz/convert-folder-contents-2-website,https://github.com/bgoonz/meditation-app,https://hub.com/bgoonz/Useful-Snippets-js,https://github.com/bgoonz/PYTHON_PRAC,
https://github.com/bgoonz/Copy-2-Clipboard-jQuery,https://github.com/bgoonz/MihirBegMusicLab,https://hub.com/bgoonz/UsefulResourceRepo2.0,https://github.com/bgoonz/random-list-of-embedable-content,
