{
  "pageContext": {
    "isCreatedByStatefulCreatePages": false,
    "posts": [
      {
        "frontmatter": {
          "path": "/Computer-Science-Distilled-Chapter-II",
          "title": "Computer Science Distilled",
          "tags": [
            "computer science",
            "Computer Science Distilled",
            "Big O Notation",
            "time complexity",
            "space complexity"
          ],
          "subtitle": "Complexity",
          "chapter": "Chapter Two"
        }
      },
      {
        "frontmatter": {
          "path": "/Big-O-Notation",
          "title": "Big O Notation",
          "tags": ["Big O Notation", "time complexity"],
          "subtitle": null,
          "chapter": null
        }
      }
    ],
    "tagName": "Big O Notation"
  }
}
