{
  "pageContext": {
    "isCreatedByStatefulCreatePages": false,
    "posts": [
      {
        "frontmatter": {
          "path": "/Computer-Science-Distilled-Chapter-I-Continued",
          "title": "Computer Science Distilled",
          "tags": [
            "computer science",
            "Computer Science Distilled",
            "logic",
            "probability",
            "counting"
          ],
          "subtitle": "1.2 Logic, 1.3 Counting && 1.4 Probability",
          "chapter": "Chapter One"
        }
      }
    ],
    "tagName": "counting"
  }
}
