﻿{
  "$schema": "http://json.schemastore.org/template",
  "author": "Microsoft Community",
  "classifications": ["Universal"],
  "name": "Page.Node.AddSampleData.ForAllExceptList",
  "shortName": "Page.Node.AddSampleData.ForAllExceptList",
  "identity": "Page.Node.AddSampleData.ForAllExceptList",
  "tags": {
    "language": "Any",
    "type": "item",
    "wts.type": "composition",
    "wts.platform": "Web",
    "wts.version": "1.0.0",
    "wts.compositionFilter": "$backendframework == Node & groupIdentity == wts.Page.Grid|wts.Page.MasterDetail"
  },
  "sourceName": "wts.ItemName",
  "preferNameDirectory": true,
  "PrimaryOutputs": [],
  "symbols": {}
}
