C:\project\personal\gitlab\zallpy\spring-java-react-challenge\src\main\java\br\com\zallpy\util\DateTimeUtil.java
C:\project\personal\gitlab\zallpy\spring-java-react-challenge\src\main\java\br\com\zallpy\domain\Test.java
C:\project\personal\gitlab\zallpy\spring-java-react-challenge\src\main\java\br\com\zallpy\response\EmployeeResponse.java
C:\project\personal\gitlab\zallpy\spring-java-react-challenge\src\main\java\br\com\zallpy\exception\EmployeeTypeNotFoundException.java
C:\project\personal\gitlab\zallpy\spring-java-react-challenge\src\main\java\br\com\zallpy\controller\ProjectController.java
C:\project\personal\gitlab\zallpy\spring-java-react-challenge\src\main\java\br\com\zallpy\exception\ProjectNotFoundExceptionDetails.java
C:\project\personal\gitlab\zallpy\spring-java-react-challenge\src\main\java\br\com\zallpy\request\ProjectRequest.java
C:\project\personal\gitlab\zallpy\spring-java-react-challenge\src\main\java\br\com\zallpy\service\ProjectService.java
C:\project\personal\gitlab\zallpy\spring-java-react-challenge\src\main\java\br\com\zallpy\mapper\ProjectMapper.java
C:\project\personal\gitlab\zallpy\spring-java-react-challenge\src\main\java\br\com\zallpy\exception\ProjectNotFoundException.java
C:\project\personal\gitlab\zallpy\spring-java-react-challenge\src\main\java\br\com\zallpy\handler\RestExceptionHandler.java
C:\project\personal\gitlab\zallpy\spring-java-react-challenge\src\main\java\br\com\zallpy\service\EmployeeService.java
C:\project\personal\gitlab\zallpy\spring-java-react-challenge\src\main\java\br\com\zallpy\mapper\EmployeeMapper.java
C:\project\personal\gitlab\zallpy\spring-java-react-challenge\src\main\java\br\com\zallpy\exception\BadRequestExceptionDetails.java
C:\project\personal\gitlab\zallpy\spring-java-react-challenge\src\main\java\br\com\zallpy\repository\EmployeeRepository.java
C:\project\personal\gitlab\zallpy\spring-java-react-challenge\src\main\java\br\com\zallpy\enums\ProjectTypeEnum.java
C:\project\personal\gitlab\zallpy\spring-java-react-challenge\src\main\java\br\com\zallpy\controller\EmployeeController.java
C:\project\personal\gitlab\zallpy\spring-java-react-challenge\src\main\java\br\com\zallpy\exception\EmployeeTypeNotFoundExceptionDetails.java
C:\project\personal\gitlab\zallpy\spring-java-react-challenge\src\main\java\br\com\zallpy\enums\EmployeeTypeEnum.java
C:\project\personal\gitlab\zallpy\spring-java-react-challenge\src\main\java\br\com\zallpy\request\EmployeeRequest.java
C:\project\personal\gitlab\zallpy\spring-java-react-challenge\src\main\java\br\com\zallpy\domain\Employee.java
C:\project\personal\gitlab\zallpy\spring-java-react-challenge\src\main\java\br\com\zallpy\domain\Project.java
C:\project\personal\gitlab\zallpy\spring-java-react-challenge\src\main\java\br\com\zallpy\response\ProjectTotalsResponse.java
C:\project\personal\gitlab\zallpy\spring-java-react-challenge\src\main\java\br\com\zallpy\response\ProjectResponse.java
C:\project\personal\gitlab\zallpy\spring-java-react-challenge\src\main\java\br\com\zallpy\security\InMemoryAuthentication.java
C:\project\personal\gitlab\zallpy\spring-java-react-challenge\src\main\java\br\com\zallpy\ApplicationStart.java
C:\project\personal\gitlab\zallpy\spring-java-react-challenge\src\main\java\br\com\zallpy\exception\BusinessException.java
C:\project\personal\gitlab\zallpy\spring-java-react-challenge\src\main\java\br\com\zallpy\repository\ProjectRepository.java
