<?xml version="1.0" encoding="UTF-8" standalone="no"?>
<!-- Generator: Adobe Illustrator 25.0.0, SVG Export Plug-In . SVG Version: 6.00 Build 0)  -->

<svg
   version="1.1"
   id="Layer_1"
   x="0px"
   y="0px"
   viewBox="0 0 1276 71.199997"
   xml:space="preserve"
   sodipodi:docname="1.svg"
   width="1276"
   height="71.199997"
   inkscape:version="1.2.2 (b0a8486541, 2022-12-01)"
   xmlns:inkscape="http://www.inkscape.org/namespaces/inkscape"
   xmlns:sodipodi="http://sodipodi.sourceforge.net/DTD/sodipodi-0.dtd"
   xmlns="http://www.w3.org/2000/svg"
   xmlns:svg="http://www.w3.org/2000/svg"><defs
   id="defs93" /><sodipodi:namedview
   id="namedview91"
   pagecolor="#505050"
   bordercolor="#ffffff"
   borderopacity="1"
   inkscape:showpageshadow="0"
   inkscape:pageopacity="0"
   inkscape:pagecheckerboard="1"
   inkscape:deskcolor="#505050"
   showgrid="false"
   inkscape:zoom="4.4500587"
   inkscape:cx="91.234752"
   inkscape:cy="51.909428"
   inkscape:window-width="1536"
   inkscape:window-height="923"
   inkscape:window-x="0"
   inkscape:window-y="0"
   inkscape:window-maximized="1"
   inkscape:current-layer="Layer_1" />
<style
   type="text/css"
   id="style2">
	.st0{fill:#0055A9;}
</style>
<path
   class="st0"
   d="m 27,0.2 c 0,20.6 0,41.2 0,61.9 -2.8,0 -5.2,0 -7.8,0 0,-2.8 0,-5.6 0,-8.7 -1.7,-0.1 -3.3,-0.2 -5,-0.3 0,-2.5 0,-5 0,-7.8 -1.1,-0.1 -2,-0.1 -3.1,-0.2 0,2.7 0,5.2 0,7.8 -0.9,0 -1.7,0 -2.8,0 -0.7,3 0.1,6 -0.5,9.2 -2.5,0 -5.2,0 -7.8,0 0,-20.7 0,-41.3 0,-62 2.7,0 5.3,0 8,0 0,11.9 0,23.9 0,36 1.2,-0.1 2.1,-0.1 3.2,-0.2 0,-3.1 0,-5.9 0,-8.7 1,0 1.7,0 2.9,0 0,3 0,5.9 0,8.8 1.8,0 3.2,0 5,0 0,-12 0,-24 0,-35.9 2.6,0.1 5.2,0.1 7.9,0.1 z"
   id="path4" />
<path
   class="st0"
   d="m 907,0.2 c 0,2.9 0,5.9 0,8.8 1.1,0.1 1.9,0.2 2.8,0.3 0,14.6 0,29.1 0,43.7 -0.9,0.1 -1.7,0.2 -2.7,0.3 0,2.8 0,5.6 0,8.7 -2.7,0.4 -5.3,0.1 -7.9,0.2 -2.6,0 -5.3,0 -8.1,0 0,-2.9 0,-5.7 0,-8.7 -1,-0.2 -2,-0.4 -3,-0.6 0,-14.4 0,-28.8 0,-43.5 0.7,-0.1 1.6,-0.3 2.8,-0.5 0,-2.9 0,-5.8 0,-8.8 5.4,0.1 10.8,0.1 16.1,0.1 z m -11.9,9.1 c 0,6.2 0,11.9 0,17.7 1.4,0 2.6,0 4,0 0,-3 0,-5.8 0,-8.5 1.1,-0.2 2,-0.4 2.7,-0.5 0,-3 0,-5.8 0,-8.6 -2.2,-0.1 -4.3,-0.1 -6.7,-0.1 z m 6.8,27.1 c -1.2,0 -2,0 -2.8,0 -0.5,3 0.2,6 -0.4,9 -1.4,0 -2.5,0 -3.8,0 0.1,2.7 -0.1,5.3 0.1,7.6 2.6,0 4.7,0 6.8,0 0.1,-5.6 0.1,-11 0.1,-16.6 z"
   id="path6" />
<path
   class="st0"
   d="m 754,0.2 c 0,2.8 0,5.7 0,8.8 1.2,0.1 2.5,0.3 3.8,0.4 0,5.8 0,11.6 0,17.7 -1.1,0.1 -2.3,0.2 -3.7,0.3 0,2.9 0,5.7 0,8.8 1.2,0 2.4,0 3.8,0 0,5.8 0,11.2 0,16.9 -1.1,0 -2.2,0 -3.7,0 -0.1,1.6 -0.2,3 -0.2,4.4 0,1.5 0,3 0,4.6 -4.9,0 -9.7,0 -14.8,0 0,-1.2 -0.1,-2.7 -0.2,-4.1 0,-1.5 0,-2.9 0,-4.6 -1.3,0 -2.4,0 -3.8,0 0,-5.7 0,-11.3 0,-17 1.1,-0.1 2.2,-0.1 3.6,-0.2 0,-2.9 0,-5.8 0,-8.8 -1.2,-0.1 -2.3,-0.1 -3.6,-0.2 0,-5.8 0,-11.6 0,-17.7 1,-0.1 2.2,-0.2 3.8,-0.4 0,-2.9 0,-5.9 0,-8.8 5,-0.1 10,-0.1 15,-0.1 z M 742.1,27 c 2.9,0 5.3,0 7.9,0 0,-5.8 0,-11.4 0,-17 0,-0.1 -0.1,-0.3 -0.2,-0.4 -0.1,-0.1 -0.2,-0.2 -0.2,-0.2 -2.6,0 -5.1,0 -7.6,0 0.1,5.9 0.1,11.7 0.1,17.6 z m 0,26 c 2.9,0 5.3,0 7.9,0 0,-3 0,-5.8 0,-8.6 0,-2.8 0.1,-5.5 -0.1,-8.1 -2.9,0 -5.4,0 -7.9,0 0.1,5.7 0.1,11.1 0.1,16.7 z"
   id="path8" />
<path
   class="st0"
   d="m 103,0.2 c 0,11.9 0,23.9 0,35.9 1.1,0 1.9,0 2.9,0 0,-2.9 0,-5.7 0,-8.7 1.4,-0.1 2.7,-0.2 4.1,-0.3 0,-2.9 0,-5.7 0,-8.7 2.7,0 5.3,0 8,0 0,2.9 0,5.7 0,8.6 -1.2,0 -2.3,0 -3.8,0 0,3.1 0,6 0,9.1 -1.5,0.1 -2.6,0.1 -3.9,0.2 0,2.9 0,5.8 0,8.8 1.2,0.1 2.3,0.1 3.6,0.2 0,2.5 0,4.9 0,7.6 1.4,0.2 2.6,0.3 4,0.5 0,2.8 0,5.6 0,8.6 -2.4,0 -5,0 -7.8,0 0,-2.8 0,-5.6 0,-8.7 -1.4,0 -2.6,0 -4.1,0 0,-2.8 0,-5.3 0,-7.9 -1,0 -1.7,0 -2.7,0 0.1,-0.1 -0.1,0 -0.1,0.2 0,5.5 0,10.9 0,16.5 -3.8,0 -7.2,0 -10.9,0 0,-2.8 0,-5.7 0,-8.7 0.8,-0.1 1.6,-0.2 2.6,-0.3 0,-14.5 0,-29.1 0,-43.7 C 94,9.3 93.2,9.2 92.1,9.1 c 0,-2.9 0,-5.9 0,-8.8 3.6,-0.1 7.2,-0.1 10.9,-0.1 z"
   id="path10" />
<path
   class="st0"
   d="m 136.9,27.2 c 0.1,-2.8 0.1,-5.7 0.1,-8.7 2.2,0 4.5,0 6.9,0 0,2.7 0,5.5 0,8.7 1.4,0 2.6,0 4,0 0,8.8 0,17.3 0,25.9 -1.1,0 -2.2,0 -3.6,0 -0.7,3 0.1,6 -0.5,9 -4.8,0 -9.6,0 -14.7,0 0,-2.8 0,-5.7 0,-8.7 -1.5,-0.1 -2.6,-0.1 -4.1,-0.2 0,-14.6 0,-29.1 0,-43.7 -1.1,-0.1 -1.9,-0.2 -3.1,-0.3 0,-2.9 0,-5.9 0,-8.8 3.7,0 7.3,0 11,0 0,8.9 0,17.8 0,27 1.5,-0.2 2.8,-0.2 4,-0.2 -0.1,2.9 -0.1,5.9 -0.1,8.8 -1.4,0.1 -2.6,0.3 -3.7,0.4 0,5.7 0,11.1 0,16.6 2.7,0 5.3,0 7.9,0 0,-8.5 0,-16.8 0,-25 0,-0.1 -0.1,-0.3 -0.2,-0.4 -0.1,-0.1 -0.2,-0.2 -0.4,-0.3 -1.1,-0.1 -2.2,-0.1 -3.5,-0.1 z"
   id="path12" />
<path
   class="st0"
   d="m 876,0.2 c 0,2.8 0,5.7 0,8.8 1.2,0.1 2.5,0.2 3.9,0.4 0,5.8 0,11.6 0,17.7 -1.1,0.1 -2.4,0.1 -3.8,0.2 0,3 0,5.7 0,8.9 -2.4,0 -4.6,0 -7.1,0 0,3.1 0,5.9 0,8.9 -1.6,0 -3.1,0 -4.8,0 0,2.7 0,5.3 0,8 2.4,0 4.9,0 7.7,0 0,-2.5 0,-5.1 0,-7.7 2.8,0 5.3,0 7.9,0 0,5.5 0,10.9 0,16.8 -7.4,0.1 -14.9,0 -22.6,0.1 0,-5.6 0,-11.1 0,-16.8 1.1,-0.1 2.3,-0.2 3.7,-0.3 0,-2.9 0,-5.7 0,-8.6 1.1,-0.2 2,-0.3 3.1,-0.5 0,-2.8 0,-5.6 0,-8.6 2.6,0 5.1,0 7.3,0 0.3,-0.3 0.5,-0.4 0.5,-0.5 0.1,-0.1 0.2,-0.3 0.2,-0.4 0,-5.6 0,-11.3 0,-17.1 -2.6,0 -5.1,0 -7.9,0 0,2.8 0,5.7 0,8.7 -2.5,0 -4.6,0 -6.9,0 0,-2.7 0,-5.5 0,-8.7 1,-0.1 2.2,-0.2 3.8,-0.4 0,-2.9 0,-5.9 0,-8.8 5,-0.1 10,-0.1 15,-0.1 z"
   id="path14" />
<path
   class="st0"
   d="m 785,0.2 c 0,2.8 0,5.7 0,8.7 0.9,0.2 1.8,0.3 2.8,0.5 0,11.7 0,23.5 0,35.5 -0.7,0.1 -1.6,0.3 -2.7,0.5 0,2.4 0,4.9 0,7.7 -1.7,0 -3.3,0 -5,0 0,3.1 0,5.9 0,8.9 -3.7,0 -7.3,0 -11,0 0,-2.9 0,-5.7 0,-8.6 2.5,0 4.9,0 7.7,0 0,-2.7 0,-5.3 0,-8 1.1,0 1.9,0 2.9,0 0,-3.1 0,-6 0,-9 -3.4,0 -6.9,0 -10.7,0 0,-3.1 0,-6 0,-8.9 -1.1,-0.1 -1.9,-0.2 -2.9,-0.3 0,-5.9 0,-11.8 0,-17.7 0.9,-0.1 1.7,-0.2 2.8,-0.3 0,-2.9 0,-5.9 0,-8.8 5.4,-0.2 10.8,-0.2 16.1,-0.2 z m -11.8,9.1 c 0,6.2 0,12 0,18 2.4,-0.2 4.7,0.2 6.7,-0.3 0,-6.1 0,-11.9 0,-17.7 -2.4,0 -4.5,0 -6.7,0 z"
   id="path16" />
<path
   class="st0"
   d="m 815,0.2 c 0,2.8 0,5.7 0,8.7 0.9,0.2 1.8,0.3 2.9,0.5 0,5.8 0,11.5 0,17.5 -0.8,0.1 -1.7,0.3 -2.8,0.5 0,2.8 0,5.6 0,8.7 -2.7,0 -5.3,0 -8.1,0 0,3.1 0,5.9 0,8.9 -1,0 -1.7,0 -2.8,0 0,2.7 0,5.3 0,8 2.4,0 4.9,0 7.7,0 0,-2.5 0,-5.1 0,-7.7 2.1,0 3.9,0 5.9,0 0,5.5 0,10.9 0,16.6 0.1,-0.1 0,0.1 -0.1,0.2 -0.1,0.1 -0.3,0.2 -0.4,0.2 -7,0 -13.9,0 -21.1,0 0,-5.6 0,-11.1 0,-16.7 0.7,-0.1 1.7,-0.3 2.7,-0.5 0,-2.8 0,-5.6 0,-8.7 1.7,0 3.3,0 5.1,0 0,-3.1 0,-5.9 0,-8.9 2.6,0 5.1,0 8,0 0.1,-6.1 0,-12 0.1,-18 -2.6,0 -5.1,0 -7.9,0 0,2.8 0,5.7 0,8.7 -2.8,0 -5.2,0 -7.9,0 0,-2.9 0,-5.8 0,-8.7 0.9,-0.1 1.7,-0.2 2.8,-0.3 0,-2.9 0,-5.9 0,-8.8 5.2,-0.2 10.6,-0.2 15.9,-0.2 z"
   id="path18" />
<path
   class="st0"
   d="m 845,0.2 c 0,2.8 0,5.7 0,8.8 1.6,0.1 3.1,0.2 4.9,0.3 0,5.9 0,11.6 0,17.8 -1.5,0 -3,0 -4.7,0 0,3.1 0,5.9 0,9.1 1.5,0 3.1,0 4.8,0 0,5.8 0,11.3 0,16.9 -1.5,0 -3,0 -4.8,0 0,3.1 0,6 0,9 -4.8,0 -9.2,0 -14.1,0 0,-2.8 0,-5.7 0,-8.8 -1.8,0 -3.3,0 -4.9,0 0,-2.6 0,-5.1 0,-7.9 2.3,-0.4 4.9,0 7.7,-0.2 0,2.7 0,5.2 0,7.8 2.7,0 5.3,0 8,0 0,-5.4 0,-10.9 0,-16.7 -2.5,0 -5.1,0 -7.8,0 0,-3.1 0,-5.9 0,-8.9 2.5,0 4.9,0 7.9,0 0.1,-6.1 0,-12 0.1,-18 -2.6,0 -5.1,0 -7.9,0 0,2.8 0,5.7 0,8.7 -2.8,0 -5.2,0 -7.9,0 0,-2.9 0,-5.8 0,-8.8 1.5,0 3,0 4.8,0 0,-3.1 0,-6.1 0,-9 4.6,-0.1 9.2,-0.1 13.9,-0.1 z"
   id="path20" />
<path
   class="st0"
   d="m 967,0.2 c 0,2.8 0,5.7 0,8.8 1.2,0.1 2.4,0.3 3.8,0.4 0,2.8 0,5.6 0,8.6 -2.4,0 -5,0 -7.7,0 0,-2.8 0,-5.5 0,-8.7 -1.1,0 -2,-0.1 -3,-0.1 0,6.1 0,11.8 0,17.8 0.9,0.1 1.8,0.3 2.8,0.4 0,2.8 0,5.6 0,8.6 -0.8,0 -1.6,0 -2.2,0 -0.3,0.3 -0.5,0.4 -0.6,0.5 0,5.4 0,10.9 0,16.5 0.8,0 1.5,0 2.6,0 0,3.1 0,6 0,9 -4.7,0 -9.5,0 -14.5,0 0,-2.8 0,-5.7 0,-8.8 1.1,-0.1 2.2,-0.1 3.5,-0.2 0,-5.5 0,-11.1 0,-16.8 -1.1,-0.1 -2.3,-0.1 -3.6,-0.2 0,-2.9 0,-5.8 0,-8.8 1.2,-0.1 2.3,-0.1 3.6,-0.2 0,-5.8 0,-11.6 0,-17.7 1.4,-0.2 2.6,-0.3 4.2,-0.5 0,-2.9 0,-5.9 0,-8.8 3.8,0.2 7.4,0.2 11.1,0.2 z"
   id="path22" />
<path
   class="st0"
   d="m 1253,71.2 c 0,-2.8 0,-5.7 0,-8.8 2.2,0 4.5,0 6.8,0 0,-3.1 0,-5.9 0,-8.9 -0.8,-0.1 -1.7,-0.3 -2.8,-0.5 0,-2.5 0,-4.9 0,-7.7 -1.4,0 -2.6,0 -4,0 0,-9.1 0,-17.9 0,-26.9 2.2,0 4.5,0 6.9,0 0,8.9 0,17.7 0,26.6 2.6,0 5,0 7.7,0 -0.1,0.1 0.1,0 0.2,-0.2 0.1,-0.1 0.2,-0.3 0.2,-0.4 0,-8.6 0,-17.3 0,-26.2 2.8,0 5.4,0 8,0 0,9 0,18 0,27 -1.3,0 -2.5,0 -4.1,0 0,2.9 0,5.4 0,8.1 -1.4,0 -2.5,0 -4,0 0,3 0,5.9 0,8.8 -1.1,0.1 -1.9,0.2 -2.9,0.3 0,3 0,5.9 0,8.8 -4,0 -8,0 -12,0 z"
   id="path24" />
<path
   class="st0"
   d="m 255,0.2 c 0,8.9 0,17.8 0,27 1.4,0 2.7,0 4,0 0,2.8 0,5.7 0,8.8 -1.2,0.1 -2.4,0.3 -3.8,0.4 0,8.4 0,16.9 0,25.7 -2.1,0 -4,0.1 -5.9,0.1 -2,0 -3.9,0 -6.1,0 0,-2.9 0,-5.7 0,-8.8 1.4,-0.1 3,-0.2 4.7,-0.3 0,-14.5 0,-28.9 0,-43.7 -1.4,-0.1 -3,-0.2 -4.9,-0.3 0,-2.9 0,-5.9 0,-8.8 4,-0.1 8,-0.1 12,-0.1 z"
   id="path26" />
<path
   class="st0"
   d="m 384,0.2 c 0,17.6 0,35.2 0,52.9 1.4,0.1 2.5,0.1 3.8,0.2 0,2.9 0,5.8 0,8.8 -4.9,0 -9.7,0 -14.6,0 0,-2.8 0,-5.6 0,-8.7 1,-0.1 2.3,-0.3 3.7,-0.4 0,-14.4 0,-28.8 0,-43.6 -1,-0.1 -2.3,-0.2 -3.8,-0.4 0,-2.9 0,-5.9 0,-8.8 3.6,0 7.2,0 10.9,0 z"
   id="path28" />
<path
   class="st0"
   d="m 56.8,53.1 c -1,0.1 -1.7,0.2 -2.7,0.3 0,2.8 0,5.6 0,8.6 -5.4,0 -10.6,0 -16.1,0 0,-2.8 0,-5.6 0,-8.7 -1.7,0 -3.3,0 -5,0 0,-8.8 0,-17.3 0,-25.9 1.5,0 3,0 4.8,0 0,-3.1 0,-6 0,-9 5.5,0 10.6,0 16.1,0 0,2.8 0,5.8 0,8.7 1.1,0.1 1.9,0.2 2.9,0.3 0,8.4 0,16.8 0,25.7 z M 41.2,27.3 c 0,8.8 0,17.3 0,25.7 2.7,0 5.3,0 7.7,0 0,-8.7 0,-17.1 0,-25.7 -2.7,0 -5.1,0 -7.7,0 z"
   id="path30" />
<path
   class="st0"
   d="m 202.2,27.3 c -2.9,0 -5.4,0 -8,0 0,11.5 0,22.9 0,34.8 -2.7,0.3 -5.3,0.1 -8,0.2 0,-14.6 0,-29 0,-43.8 6,-0.4 12.3,-0.1 18.7,-0.2 0,2.9 0,5.7 0,8.8 1.4,0.2 2.6,0.3 4,0.4 0,11.4 0,22.9 0,34.6 -2,0.5 -4.3,0 -6.7,0.3 0,-11.8 0,-23.2 0,-35.1 z"
   id="path32" />
<path
   class="st0"
   d="m 338.2,27.2 c 1.6,0 3.1,0 4.7,0 0,-3 0,-5.7 0,-8.8 5.1,0 10,0 15,0 0,2.8 0,5.6 0,8.7 1.4,0 2.6,0 4,0 0,6.1 0,11.9 0,17.9 -5.2,0 -10.3,0 -15.7,0 -0.3,2.7 -0.1,5.3 -0.2,8 4,0 7.8,0 11.8,0 0,3.1 0,6 0,9 -4.8,0 -9.6,0 -14.7,0 0,-2.9 0,-5.8 0,-8.9 -1.8,0 -3.3,0 -4.9,0 0,-8.5 0,-16.9 0,-25.9 z m 7.9,8.8 c 2.9,0 5.3,0 7.7,0 0,-3.1 0,-6 0,-8.7 -2.7,0 -5.1,0 -7.7,0 0,3 0,5.8 0,8.7 z"
   id="path34" />
<path
   class="st0"
   d="m 1192.2,27.2 c 1.3,0 2.4,0 3.7,0 0,-3 0,-5.7 0,-8.7 5.1,0 10,0 15.1,0 0,2.8 0,5.6 0,8.6 1.3,0 2.4,0 3.3,0 0.3,0.3 0.5,0.4 0.6,0.5 0.1,0.1 0.2,0.3 0.2,0.4 0,8.3 0,16.6 0,25.1 -1.3,0 -2.4,0 -3.9,0 0,3.1 0,6 0,9 -5.1,0 -9.9,0 -14.9,0 0,-2.7 0,-5.5 0,-8.6 -1.4,-0.1 -2.6,-0.3 -4,-0.4 -0.1,-8.5 -0.1,-16.9 -0.1,-25.9 z m 8.3,0 c -0.7,4.1 -0.7,22 0,25.8 2.1,0 4.3,0 6.5,0 0,-8.5 0,-16.8 0,-25 0,-0.1 -0.1,-0.3 -0.2,-0.4 -0.1,-0.1 -0.2,-0.2 -0.4,-0.3 -1.9,-0.1 -3.9,-0.1 -5.9,-0.1 z"
   id="path36" />
<path
   class="st0"
   d="m 400.2,27.3 c 1,-0.1 1.7,-0.2 2.7,-0.3 0,-2.8 0,-5.6 0,-8.6 5.4,0 10.6,0 16,0 0,2.8 0,5.6 0,8.7 1.4,0 2.6,0 4,0 0,6.1 0,11.9 0,17.9 -5.2,0 -10.3,0 -15.7,0 0,2.7 0,5.3 0,8.1 3.7,0 7.5,0 11.5,0 0,3.1 0,6 0,9 -5.1,0 -10.3,0 -15.7,0 0,-2.9 0,-5.8 0,-8.7 -1.1,-0.1 -1.9,-0.2 -2.9,-0.3 0.1,-8.5 0.1,-16.9 0.1,-25.8 z m 6.9,8.7 c 2.9,0 5.3,0 7.9,0 -0.1,-3.1 0.1,-6 -0.1,-8.7 -2.9,0 -5.3,0 -7.8,0 0,3 0,5.8 0,8.7 z"
   id="path38" />
<path
   class="st0"
   d="m 1031.8,45.2 c -5,0 -9.7,0 -14.7,0 0,2.6 0,5.1 0,7.9 3.4,0 7,0 10.7,0 0,3.1 0,5.9 0,8.9 -4.9,0 -9.8,0 -14.8,0 0,-2.9 0,-5.7 0,-8.6 -1.3,0 -2.4,0 -3.4,0 -0.3,-0.3 -0.4,-0.4 -0.5,-0.5 -0.1,-0.1 -0.1,-0.3 -0.1,-0.4 0,-8.3 0,-16.6 0,-25.1 1.3,0 2.4,0 3.9,0 0,-3.1 0,-6 0,-9 5.1,0 9.9,0 14.9,0 0,2.7 0,5.5 0,8.6 1.4,0.1 2.6,0.3 4,0.4 0,5.7 0,11.5 0,17.8 z m -14.6,-17.9 c 0,3.2 0,6 0,8.9 2.7,-0.1 5.3,0.1 7.7,-0.1 0,-3.2 0,-6 0,-8.8 -2.7,0 -5.1,0 -7.7,0 z"
   id="path40" />
<path
   class="st0"
   d="m 1057.8,62.1 c -4.6,0 -9.1,0 -13.7,0 0,-2.9 0,-5.7 0,-8.8 -1.7,0 -3.3,0 -5,0 0,-8.8 0,-17.2 0,-26 1.5,0 3.1,0 4.9,0 0,-3.1 0,-5.9 0,-8.9 4.6,0 9.1,0 13.9,0 0,2.7 0,5.6 0,8.7 1.8,0 3.2,0 4.9,0 0,6.1 0,12 0,18 -5.1,0 -10.3,0 -15.6,0 0,2.7 0,5.3 0,8.1 3.5,0 7,0 10.6,0 0,2.9 0,5.7 0,8.9 z m -3,-26 c 0,-3.2 0,-6 0,-9 -2.7,0.1 -5.3,-0.1 -7.7,0.1 0,3.2 0,6 0,8.8 2.7,0.1 5.1,0.1 7.7,0.1 z"
   id="path42" />
<path
   class="st0"
   d="m 1149.8,62.1 c -5,0 -9.7,0 -14.7,0 0,-2.9 0,-5.7 0,-8.8 -1.4,-0.1 -2.6,-0.1 -4,-0.2 0,-8.6 0,-17.1 0,-25.9 1.2,0 2.4,0 3.9,0 0,-3.1 0,-5.9 0,-8.9 5,0 9.7,0 14.9,0 0,1.2 0.1,2.7 0.1,4.1 0,1.5 0,2.9 0,4.6 1.3,0 2.4,0 3.8,0 0,6.1 0,12 0,18 -4.8,0 -9.6,0 -14.6,0 0,2.7 0,5.3 0,8.1 3.5,0 7,0 10.6,0 0,3 0,5.8 0,9 z m -3,-26 c 0,-3.2 0,-6 0,-8.9 -2.7,0.1 -5.3,-0.1 -7.7,0.1 0,3.2 0,6 0,8.8 2.7,0 5.1,0 7.7,0 z"
   id="path44" />
<path
   class="st0"
   d="m 495.2,53.2 c -1.6,0 -2.8,0 -4,0 0,-8.6 0,-17.1 0,-25.8 1.1,-0.1 2.4,-0.2 3.8,-0.3 0,-2.9 0,-5.7 0,-8.7 5.1,0 10,0 15,0 0,2.9 0,5.7 0,8.6 1.3,0 2.4,0 3.8,0 0,6.1 0,12 0,18 -4.7,0 -9.5,0 -14.5,0 0,2.7 0,5.3 0,8.1 3.5,0 6.9,0 10.6,0 0,3.1 0,6 0,9 -4.9,0 -9.7,0 -14.6,0 -0.1,-2.8 -0.1,-5.6 -0.1,-8.9 z m 4,-25.9 c 0,3.2 0,6 0,8.9 2.7,-0.1 5.3,0.1 7.7,-0.1 0,-3.2 0,-6 0,-8.8 -2.7,0 -5.1,0 -7.7,0 z"
   id="path46" />
<path
   class="st0"
   d="m 174.9,53 c 0,3.3 0,6.1 0,9 -4.9,0 -9.7,0 -14.8,0 0,-2.8 0,-5.7 0,-8.7 -1.5,-0.1 -2.6,-0.1 -3.9,-0.2 0,-8.4 0,-16.9 0,-25.7 1,-0.1 2.2,-0.2 3.6,-0.4 0,-2.8 0,-5.5 0,-8.6 5.1,0 10,0 15,0 0,2.7 0,5.5 0,8.6 1.4,0.1 2.6,0.1 4,0.2 0,6 0,11.7 0,17.9 -5.2,0 -10.4,0 -15.8,0 0,2.8 0,5.2 0,7.9 3.9,0 7.7,0 11.9,0 z m -4.1,-16.9 c 0,-3.2 0,-6 0,-8.9 -2.7,0.1 -5.3,-0.1 -7.7,0.1 0,3.2 0,6 0,8.8 2.7,0 5.1,0 7.7,0 z"
   id="path48" />
<path
   class="st0"
   d="m 479.8,45 c 1.3,0.1 2.1,0.2 3,0.3 0,2.5 0,4.9 0,7.6 -0.8,0.1 -1.7,0.3 -2.8,0.5 0,2.8 0,5.6 0,8.6 -6.4,0 -12.6,0 -19,0 0,-2.8 0,-5.6 0,-8.7 4.9,0 9.8,0 14.8,0 0,-2.8 0,-5.2 0,-7.9 -3.8,0 -7.6,0 -11.6,0 -0.7,-3 0.1,-6 -0.5,-9 -0.8,0 -1.5,0 -2.6,0 0,-3.1 0,-6 0,-9.1 0.7,0 1.5,-0.1 2.7,-0.2 0,-2.9 0,-5.8 0,-8.8 6.5,0 12.6,0 18.9,0 0,2.9 0,5.8 0,8.8 -4.9,0 -9.6,0 -14.6,0 0,3.1 0,6 0,9 3.9,0 7.7,0 11.6,0 0.1,3 0.1,5.8 0.1,8.9 z"
   id="path50" />
<path
   class="st0"
   d="m 232,36 c 0,-3 0,-5.7 0,-8.7 -2.6,0 -5.1,0 -7.7,0 0,8.4 0,17 0,25.7 2.4,0 4.9,0 7.7,0 0,-2.5 0,-5 0,-7.7 2.8,0 5.2,0 7.9,0 0,2.5 0,5.1 0,7.8 -1.2,0 -2.3,0 -3.6,0 0,2.9 0,5.7 0,8.8 -2.6,0.4 -5,0.2 -7.4,0.2 -2.5,0.1 -4.9,0 -7.6,0 0,-2.9 0,-5.7 0,-8.8 -1.4,-0.1 -2.6,-0.2 -4,-0.4 0,-8.5 0,-17 0,-25.7 1.1,-0.1 2.4,-0.2 3.8,-0.3 0,-2.9 0,-5.7 0,-8.7 5.1,0 10,0 15,0 0,2.8 0,5.6 0,8.6 1.3,0 2.4,0 4,0 0.2,3.1 0,6 0.1,9 C 237.4,36 235,36 232,36 Z"
   id="path52" />
<path
   class="st0"
   d="m 76,27 c 0,3 0,5.8 0,8.9 -0.9,0.2 -1.8,0.3 -2.8,0.5 0,5.4 0,10.9 0,16.5 0.7,0.1 1.7,0.3 2.7,0.5 0,2.8 0,5.5 0,8.6 -5.1,0 -10.4,0 -15.7,0 0,-2.8 0,-5.6 0,-8.7 1.5,0 3.1,0 4.8,0 0,-8.8 0,-17.2 0,-26 -1.5,0 -3.1,0 -4.8,0 0,-3.1 0,-5.9 0,-8.9 4.2,0 8.5,0 12.9,0 0,2.9 0,5.7 0,8.6 1,0 2,0 2.9,0 z"
   id="path54" />
<path
   class="st0"
   d="m 1234,27 c 0,3 0,5.8 0,8.9 -1.2,0.1 -2.4,0.3 -3.8,0.4 0,5.5 0,10.9 0,16.6 1.1,0.1 2.3,0.2 3.7,0.3 0,2.8 0,5.6 0,8.6 -4.8,0 -9.7,0 -14.7,0 0,-2.8 0,-5.6 0,-8.6 0.8,-0.1 1.7,-0.3 2.8,-0.4 0,-8.5 0,-16.9 0,-25.6 -0.9,-0.1 -1.8,-0.3 -2.8,-0.4 0,-2.8 0,-5.6 0,-8.6 3.4,0 6.9,0 10.8,0 0.1,2.7 0,5.6 0.1,8.6 1.3,0.2 2.6,0.2 3.9,0.2 z"
   id="path56" />
<path
   class="st0"
   d="m 990,27 c 0,3 0,5.8 0,8.9 -0.9,0.2 -1.8,0.3 -2.8,0.5 0,5.4 0,10.9 0,16.5 0.7,0.1 1.6,0.3 2.7,0.5 0,2.8 0,5.5 0,8.6 -4.8,0 -9.7,0 -14.7,0 0,-2.8 0,-5.6 0,-8.7 1.2,0 2.4,0 3.8,0 0,-8.8 0,-17.2 0,-26 -1.2,0 -2.4,0 -3.8,0 0,-3.1 0,-5.9 0,-8.9 3.9,0 7.8,0 11.9,0 0,2.9 0,5.7 0,8.6 1,0 2,0 2.9,0 z"
   id="path58" />
<path
   class="st0"
   d="m 438,45.2 c 0,-2.8 0,-5.7 0,-8.8 2.2,0 4.5,0 6.8,0 0,-3.1 0,-5.9 0,-9 -3.4,0 -7,0 -10.7,0 0,-3.1 0,-5.9 0,-8.9 4.8,0 9.7,0 14.8,0 0,2.8 0,5.6 0,8.7 1.4,0 2.6,0 4,0 0,8.8 0,17.2 0,26 1.4,0 2.6,0 4,0 0,3.1 0,5.9 0,8.9 -2.4,0 -4.9,0 -7.7,0 -0.6,-2.6 0.1,-5.6 -0.4,-8.8 -1.2,0 -2.5,0 -3.8,0 0,-2.6 0,-5.2 0,-8 -2.5,-0.1 -4.7,-0.1 -7,-0.1 z"
   id="path60" />
<path
   class="st0"
   d="m 319,27 c 0,3 0,5.8 0,8.9 -0.9,0.2 -1.8,0.3 -2.8,0.5 0,5.4 0,10.9 0,16.5 0.7,0.1 1.6,0.3 2.7,0.5 0,2.8 0,5.5 0,8.6 -4.5,0 -9,0 -13.7,0 0,-2.8 0,-5.6 0,-8.6 0.8,-0.1 1.7,-0.3 2.8,-0.4 0,-8.5 0,-16.9 0,-25.6 -0.9,-0.1 -1.8,-0.3 -2.8,-0.4 0,-2.8 0,-5.6 0,-8.6 3.6,0 7.1,0 10.9,0 0,2.9 0,5.7 0,8.6 1,0 1.9,0 2.9,0 z"
   id="path62" />
<path
   class="st0"
   d="m 1172.8,36.2 c -1,0 -2.2,0 -3.8,0 0,8.6 0,17.1 0,25.8 -2.6,0 -5.1,0 -7.8,0 0,-14.5 0,-29 0,-43.7 2.5,0 4.9,0 7.6,0 0,2.7 0,5.5 0,8.6 1.4,0.1 2.6,0.3 4,0.4 0,3 0,5.9 0,8.9 z"
   id="path64" />
<path
   class="st0"
   d="m 1116,36.4 c 0,-6 0,-11.8 0,-17.9 2.2,0 4.5,0 6.9,0 0,2.7 0,5.5 0,8.6 1.7,0 3.3,0 5,0 0,11.8 0,23.2 0,34.9 -2.5,0 -5.1,0 -7.9,0 0,-8.5 0,-17 0,-25.6 -1.4,0 -2.7,0 -4,0 z"
   id="path66" />
<path
   class="st0"
   d="m 1111.8,36.2 c -0.7,0 -1.5,0 -2.8,0 0,8.6 0,17.1 0,25.8 -2.6,0 -5.1,0 -7.8,0 0,-14.5 0,-29 0,-43.7 2.5,0 4.9,0 7.7,0 0,2.9 0,5.8 0,8.7 1.1,0.1 1.9,0.2 2.9,0.3 0,3 0,5.9 0,8.9 z"
   id="path68" />
<path
   class="st0"
   d="m 1177,36.4 c 0,-6 0,-11.8 0,-18 2.5,-0.3 5.1,-0.1 7.9,-0.2 0,3 0,5.8 0,8.8 1.1,0.2 2,0.3 3,0.5 0,11.5 0,22.9 0,34.6 -2.2,0 -4.4,0 -6.9,0 0,-8.5 0,-17 0,-25.6 -1.4,-0.1 -2.7,-0.1 -4,-0.1 z"
   id="path70" />
<path
   class="st0"
   d="m 259,27.4 c 0,-3 0,-5.8 0,-8.9 2.6,0 5.1,0 7.9,0 0,2.7 0,5.5 0,8.5 1.1,0.2 2,0.3 3,0.5 0,11.5 0,22.9 0,34.6 -2.5,0 -5.1,0 -7.9,0 0,-11.6 0,-23 0,-34.6 -1.1,-0.1 -2,-0.1 -3,-0.1 z"
   id="path72" />
<path
   class="st0"
   d="m 76,27.4 c 0,-3 0,-5.8 0,-9 2.5,-0.3 5.1,-0.1 7.9,-0.2 0,3 0,5.8 0,8.7 1.1,0.2 2,0.3 3,0.5 0,5.8 0,11.6 0,17.6 -2.5,0 -5.1,0 -7.9,0 0,-5.9 0,-11.7 0,-17.6 -1.1,0 -2,0 -3,0 z"
   id="path74" />
<path
   class="st0"
   d="m 319,27.4 c 0,-3 0,-5.8 0,-9 2.5,-0.3 5.1,-0.1 7.9,-0.2 0,3 0,5.8 0,8.9 1.7,0 3.3,0 5,0 0,6.1 0,11.9 0,17.9 -2.5,0 -5.1,0 -7.9,0 0,-5.9 0,-11.7 0,-17.6 -1.7,0 -3.4,0 -5,0 z"
   id="path76" />
<path
   class="st0"
   d="m 1234,27.4 c 0,-3 0,-5.8 0,-8.9 2.2,0 4.5,0 6.9,0 0,2.7 0,5.5 0,8.6 1.7,0 3.3,0 5,0 0,6.1 0,11.9 0,17.9 -2.5,0 -5.1,0 -7.9,0 0,-5.9 0,-11.7 0,-17.6 -1.4,0 -2.7,0 -4,0 z"
   id="path78" />
<path
   class="st0"
   d="m 990,27.4 c 0,-3 0,-5.8 0,-9 2.5,-0.3 5.1,0 7.9,-0.2 0,3 0,5.8 0,8.8 1.1,0.2 2,0.3 3,0.5 0,5.8 0,11.6 0,17.6 -2.2,0 -4.4,0 -6.9,0 0,-5.9 0,-11.7 0,-17.6 -1.4,-0.1 -2.7,-0.1 -4,-0.1 z"
   id="path80" />
<path
   class="st0"
   d="m 445,53.2 c 0,2.9 0,5.9 0,8.9 -3.7,0 -7.1,0 -10.9,0 0,-2.8 0,-5.7 0,-8.8 -1.4,0 -2.5,0 -3.9,0 0,-2.7 0,-5.3 0,-8.1 2.6,0 5.2,0 7.8,0 0,2.6 0,5.2 0,8 2.5,0 4.7,0 7,0 z"
   id="path82" />
<path
   class="st0"
   d="m 536.8,62.1 c -2.6,0 -5.1,0 -7.7,0 0,-5.5 0,-11 0,-16.8 2.4,-0.3 4.9,0 7.7,-0.1 0,5.6 0,11 0,16.9 z"
   id="path84" />
<path
   class="st0"
   d="m 1116,36.2 c 0,2.8 0,5.6 0,8.8 -1.2,0.1 -2.4,0.1 -4,0.2 0,-3.1 0,-6.1 0,-9 1.3,0 2.7,0 4,0 z"
   id="path86" />
<path
   class="st0"
   d="m 1177,36.2 c 0,2.8 0,5.6 0,8.8 -1.2,0.1 -2.4,0.1 -4,0.2 0,-3.1 0,-6.1 0,-9 1.3,0 2.7,0 4,0 z"
   id="path88" />
</svg>
