<?xml version="1.0" encoding="UTF-8" standalone="no"?>
<!-- Generator: Adobe Illustrator 25.0.0, SVG Export Plug-In . SVG Version: 6.00 Build 0)  -->

<svg
   version="1.1"
   id="Layer_1"
   x="0px"
   y="0px"
   viewBox="0 0 85.699997 98.900002"
   xml:space="preserve"
   sodipodi:docname="Pointer.svg"
   width="85.699997"
   height="98.900002"
   inkscape:version="1.2.2 (b0a8486541, 2022-12-01)"
   xmlns:inkscape="http://www.inkscape.org/namespaces/inkscape"
   xmlns:sodipodi="http://sodipodi.sourceforge.net/DTD/sodipodi-0.dtd"
   xmlns="http://www.w3.org/2000/svg"
   xmlns:svg="http://www.w3.org/2000/svg"><defs
   id="defs61" /><sodipodi:namedview
   id="namedview59"
   pagecolor="#505050"
   bordercolor="#ffffff"
   borderopacity="1"
   inkscape:showpageshadow="0"
   inkscape:pageopacity="0"
   inkscape:pagecheckerboard="1"
   inkscape:deskcolor="#505050"
   showgrid="false"
   inkscape:zoom="1.0181848"
   inkscape:cx="62.856959"
   inkscape:cy="49.107"
   inkscape:window-width="1536"
   inkscape:window-height="923"
   inkscape:window-x="0"
   inkscape:window-y="0"
   inkscape:window-maximized="1"
   inkscape:current-layer="Layer_1" />
<style
   type="text/css"
   id="style2">
	.st0{fill:#FEFEFE;}
	.st1{fill:#DC2222;}
	.st2{fill:#FECBA9;}
</style>


<path
   d="M 8,53 C 5.3,53 2.7,53 0,53 0,35.3 0,17.7 0,0 15.3,0 30.7,0 46,0 46,3 46,6 46,9 39.7,9 33.4,9 27.1,9 20.7,9.1 14.3,8.8 8,9.2 c 0,3.2 0,6 0,8.8 0,11.7 0,23.3 0,35 z"
   id="path8" />



<path
   d="m 46,9 c 2.2,0 4.3,0 6.5,0 0.1,0.1 0.3,0.2 0.4,0.3 0.1,0.1 0.2,0.3 0.2,0.4 0,5.6 0,11.3 0,17.2 -2.4,0 -4.7,0 -7,0 C 46,21 46,15 46,9 Z"
   id="path16" />

<path
   d="m 45.934587,34.942878 c 2.6,0 5.2,0 8,0 0,3.2 0,6.1 0,9 -2.7,0 -5.3,0 -8,0 0,-3 0,-6 0,-9 z"
   id="path20" />
<path
   d="m 61,53 c 2.6,0 5.2,0 8,0 0,3.2 0,6.1 0,9 -2.7,0 -5.3,0 -8,0 0,-3 0,-6 0,-9 z"
   id="path22" />

<path
   d="m 37.983328,26.086398 c 2.628571,0 5.142857,0 8,0 0,3.15 0,6.075 0,9 -2.628571,0 -5.371429,0 -8,0 0,-3.0375 0,-5.9625 0,-9 z"
   id="path26"
   style="stroke-width:1.13389" />
<path
   d="m 23,53 c 0,2.8 0,5.7 0,8.8 -2.4,0.4 -4.8,0.1 -7.3,0.2 -2.5,0.1 -4.9,0 -7.7,0 0,-3.1 0,-6.1 0,-9 5,0 10,0 15,0 z"
   id="path28" />
<path
   d="m 38,62 c -2.6,0 -5.2,0 -8,0 0,-3.2 0,-6.1 0,-9 2.6,0 5.2,0 8,0 0,3.2 0,6.1 0,9 z"
   id="path30" />
<path
   d="m 46,71 c -2.6,0 -5.2,0 -8,0 0,-3.2 0,-6.1 0,-9 2.6,0 5.2,0 8,0 0,3.2 0,6.1 0,9 z"
   id="path32" />
<path
   d="m 61,88 c -2.6,0 -5.2,0 -8,0 0,-3.2 0,-6.1 0,-9 2.6,0 5.2,0 8,0 0,3.2 0,6.1 0,9 z"
   id="path34" />
<path
   d="m 29.678836,53.151796 c -2.3,0 -4.7,0 -7,0 0,-2.9 0,-5.9 0,-9.1 2.6,0.2 4.8,-0.2 7,0.3 0,3.2 0,6 0,8.8 z"
   id="path36" />
<path
   d="m 53,79 c -2.3,0 -4.5,0 -7,0 0,-2.8 0,-5.4 0,-8 2.3,0 4.5,0 7,0 0,2.8 0,5.4 0,8 z"
   id="path38" />
<path
   class="st1"
   d="m 53,79 c 0,-2.6 0,-5.2 0,-8 -2.5,0 -4.7,0 -7,0 0,-2.9 0,-5.8 0,-9 -2.8,0 -5.4,0 -8,0 0,-2.9 0,-5.8 0,-9 -2.8,0 -5.4,0 -8,0 0,-2.8 0,-5.6 0,-8.8 -2.2,-0.5 -4.4,-0.1 -7,-0.3 0,3.2 0,6.1 0,9.1 -5,0 -10,0 -15,0 0,-11.7 0,-23.3 0,-35 9.9,0 19.8,0 30,0 0,3.1 0,6.1 0,9 -2.6,0 -5.2,0 -8,0 0.1,3.2 -0.1,6.1 0.1,9 2.9,0 5.4,0 7.9,0 0,2.6 0,5.2 0,8 2.8,0 5.4,0 8,0 0,2.9 0,5.8 0,9 2.5,0 4.7,0 7,0 0,2.9 0,5.8 0,9 2.8,0 5.4,0 8,0 0,2.9 0,5.8 0,9 2.8,0 5.4,0 8,0 0,2.7 0,5.3 0,8 0,3 0,6 0,9 -2.7,0 -5.3,0 -8,0 0,-2.9 0,-5.8 0,-9 -2.8,0 -5.4,0 -8,0 z"
   id="path40" />
<path
   class="st2"
   d="m 38,27 c 0,-2.9 0,-5.9 0,-9 C 27.8,18 17.9,18 8,18 8,15.2 8,12.4 8,9.2 14.4,8.8 20.7,9.1 27.1,9 33.4,8.9 39.7,9 46,9 c 0,6 0,12 0,18 -2.7,0 -5.3,0 -8,0 z"
   id="path42" />
<path
   d="m 68.970299,89.204053 c 0,-3 0,-6 0,-9 2.628571,0 5.371429,0 8,0 0,2.9 0,5.8 0,9 -2.857143,0 -5.371429,0 -8,0 z"
   id="path44"
   style="stroke-width:1.06904" />

<path
   class="st2"
   d="m 38,36 c -2.5,0 -5,0 -7.9,0 -0.2,-2.9 0,-5.8 -0.1,-9 2.8,0 5.4,0 8,0 0,3 0,6 0,9 z"
   id="path48" />
<path
   class="st2"
   d="m 45.994899,43.944225 c -2.6,0 -5.2,0 -8,0 0,-3.15 0,-6.075 0,-9 2.7,0 5.3,0 8,0 0,3.0375 0,5.9625 0,9 z"
   id="path50"
   style="stroke-width:1.06066" />
<path
   class="st2"
   d="m 61,62 c -2.6,0 -5.2,0 -8,0 0,-3.2 0,-6.1 0,-9 2.7,0 5.3,0 8,0 0,3 0,6 0,9 z"
   id="path52" />
<path
   class="st2"
   d="m 54,53 c -2.628571,0 -5.142857,0 -8,0 0,-3.2 0,-6.1 0,-9 2.628571,0 5.371429,0 8,0 0,3 0,6 0,9 z"
   id="path54"
   style="stroke-width:1.06904" />
<path
   class="st2"
   d="m 69,71 c -2.6,0 -5.2,0 -8,0 0,-3.2 0,-6.1 0,-9 2.7,0 5.3,0 8,0 0,3 0,6 0,9 z"
   id="path56" />
<path
   class="st2"
   d="m 77,80.111387 c -2.6,0 -5.2,0 -8,0 0,-3.2 0,-6.1 0,-9 2.7,0 5.3,0 8,0 0,3 0,6 0,9 z"
   id="path56-3"
   style="fill:#fecba9" /><path
   d="m 68.961488,97.035766 c -2.6,0 -5.2,0 -8,0 0,-3.2 0,-6.1 0,-9 2.6,0 5.2,0 8,0 0,3.2 0,6.1 0,9 z"
   id="path34-6" /><path
   d="m 69.045412,61.932838 c 2.6,0 5.2,0 8,0 0,3.263388 0,6.220833 0,9.178278 -2.7,0 -5.3,0 -8,0 0,-3.059426 0,-6.118852 0,-9.178278 z"
   id="path22-5"
   style="stroke-width:1.00986" /><path
   d="m 53.864175,43.878974 c 2.326715,0 4.653429,0 7.159122,0 0,3.1949 0,6.090278 0,8.985656 -2.416204,0 -4.742918,0 -7.159122,0 0,-2.995219 0,-5.990437 0,-8.985656 z"
   id="path20-3"
   style="stroke-width:0.945232" /><path
   d="m 77.001631,70.967254 c 2.6,0 5.2,0 8,0 0,3.289744 0,6.271075 0,9.252406 -2.7,0 -5.3,0 -8,0 0,-3.084136 0,-6.168271 0,-9.252406 z"
   id="path20-5"
   style="stroke-width:1.01393" /></svg>
