<?xml version="1.0" encoding="UTF-8" standalone="no"?>
<!-- Generator: Adobe Illustrator 25.0.0, SVG Export Plug-In . SVG Version: 6.00 Build 0)  -->

<svg
   version="1.1"
   id="Layer_1"
   x="0px"
   y="0px"
   viewBox="0 0 163.5 84"
   xml:space="preserve"
   sodipodi:docname="AmigaOSButtonDown.svg"
   width="163.5"
   height="84"
   inkscape:version="1.2.2 (b0a8486541, 2022-12-01)"
   xmlns:inkscape="http://www.inkscape.org/namespaces/inkscape"
   xmlns:sodipodi="http://sodipodi.sourceforge.net/DTD/sodipodi-0.dtd"
   xmlns="http://www.w3.org/2000/svg"
   xmlns:svg="http://www.w3.org/2000/svg"><defs
   id="defs13" /><sodipodi:namedview
   id="namedview11"
   pagecolor="#505050"
   bordercolor="#ffffff"
   borderopacity="1"
   inkscape:showpageshadow="0"
   inkscape:pageopacity="0"
   inkscape:pagecheckerboard="1"
   inkscape:deskcolor="#505050"
   showgrid="false"
   inkscape:zoom="2.9110629"
   inkscape:cx="72.310357"
   inkscape:cy="57.710879"
   inkscape:window-width="1536"
   inkscape:window-height="923"
   inkscape:window-x="0"
   inkscape:window-y="0"
   inkscape:window-maximized="1"
   inkscape:current-layer="Layer_1" />
<style
   type="text/css"
   id="style2">
	.st0{fill:#FEFEFE;}
	.st1{fill:#87A9CB;}
</style>


<g
   id="g270"
   transform="translate(-19.709621,-14.919701)"><path
     class="st0"
     d="m 180.3,15 c 0.7,0 1.5,0 2.2,0 0,28 0,56 0,84 -53.8,0 -107.5,0 -161.3,0 -0.1,-1 -0.4,-2.1 -0.4,-3.1 0,-1 0.5,-2 0.7,-2.9 1,0 1.9,0 2.7,0 50.9,0 101.9,0 153,0 0,-24.1 0,-48.1 0,-72 0.9,0 1.9,0 3,0 0.1,-2.1 0.1,-4.1 0.1,-6 z"
     id="path4" /><path
     d="m 24.2,93 c -0.8,0 -1.7,0 -2.7,0 -0.2,0.9 -0.6,1.9 -0.7,2.9 0,1 0.3,2 0.4,3.1 -0.7,0 -1.5,0 -2.2,0 0,-28 0,-56 0,-84 53.8,0 107.5,0 161.3,0 0,1.9 0,3.9 0,6 -1.1,0 -2,0 -3,0 -50.9,0 -101.9,0 -153,0 -0.1,24.1 -0.1,48.1 -0.1,72 z"
     id="path6" /><path
     class="st1"
     d="m 24.2,93 c 0,-23.9 0,-47.9 0,-72 51.2,0 102.1,0 153,0 0,23.9 0,47.9 0,72 -51.1,0 -102,0 -153,0 z"
     id="path8" /></g>
</svg>
