<?xml version="1.0" encoding="UTF-8" standalone="no"?>
<!-- Generator: Adobe Illustrator 25.0.0, SVG Export Plug-In . SVG Version: 6.00 Build 0)  -->

<svg
   version="1.1"
   id="Layer_1"
   x="0px"
   y="0px"
   viewBox="0 0 1220 453"
   xml:space="preserve"
   sodipodi:docname="AmigaOSDBox-DefaultColor.svg"
   width="1220"
   height="453"
   inkscape:version="1.2.2 (b0a8486541, 2022-12-01)"
   xmlns:inkscape="http://www.inkscape.org/namespaces/inkscape"
   xmlns:sodipodi="http://sodipodi.sourceforge.net/DTD/sodipodi-0.dtd"
   xmlns="http://www.w3.org/2000/svg"
   xmlns:svg="http://www.w3.org/2000/svg"><defs
   id="defs17" /><sodipodi:namedview
   id="namedview15"
   pagecolor="#505050"
   bordercolor="#ffffff"
   borderopacity="1"
   inkscape:showpageshadow="0"
   inkscape:pageopacity="0"
   inkscape:pagecheckerboard="1"
   inkscape:deskcolor="#505050"
   showgrid="false"
   inkscape:zoom="0.70737049"
   inkscape:cx="615.66041"
   inkscape:cy="65.029572"
   inkscape:window-width="1536"
   inkscape:window-height="923"
   inkscape:window-x="0"
   inkscape:window-y="0"
   inkscape:window-maximized="1"
   inkscape:current-layer="Layer_1" />
<style
   type="text/css"
   id="style2">
	.st0{fill:#FDCA97;}
	.st1{fill:#87A9CB;}
	.st2{fill:#FEFEFE;}
</style>





<g
   id="g927"><path
     d="M 8.9970225,50 C 412.69803,50 816.29904,50 1220,50 c 0,134.3 0,268.7 0,403 -405.70096,0 -811.30198,0 -1217.0029925,0 0,-2 0,-4 0,-6 2.000005,0 3.9000097,0 6.000015,0 0,-132.6 0,-264.8 0,-397 z M 1211,447 c 2,0 3.9,0 5.8,0 0.8,-20.2 0.4,-385.4 -0.3,-390 -1.8,0 -3.7,0 -5.5,0 -1,0 -2,0 -3,0 -398.60098,0 -797.10197,0 -1196.00297,0 0,127.8 0,255.4 0,383 0,2.3 0,4.6 0,7 399.901,0 799.502,0 1199.00297,0 z"
     id="path4"
     style="stroke-width:1" /><path
     class="st0"
     d="m 8.9970225,50 c 0,132.2 0,264.4 0,397 -2.1000053,0 -4.00001,0 -6.000015,0 0,-132.3 0,-264.7 0,-397 2.000005,0 4.00001,0 6.000015,0 z"
     id="path6"
     style="stroke-width:1;fill:#6688bb;fill-opacity:1" /><path
     class="st1"
     d="m 11.99703,440 c 0,-127.6 0,-255.2 0,-383 398.901,0 797.40199,0 1196.00297,0 0,127.6 0,255.2 0,383 -398.90098,0 -797.40197,0 -1196.00297,0 z"
     id="path8"
     style="stroke-width:1" /><path
     class="st2"
     d="m 11.99703,440 c 398.601,0 797.10199,0 1196.00297,0 0,-127.8 0,-255.4 0,-383 1,0 2,0 3,0 0,130 0,260 0,390 -399.50097,0 -799.10197,0 -1199.00297,0 0,-2.4 0,-4.7 0,-7 z"
     id="path10"
     style="stroke-width:1" /><path
     class="st0"
     d="m 1211,447 c 0,-130 0,-260 0,-390 1.8,0 3.7,0 5.5,0 0.8,4.6 1.1,369.8 0.3,390 -1.9,0 -3.8,0 -5.8,0 z"
     id="path12"
     style="stroke-width:1;fill:#6688bb;fill-opacity:1" /><rect
     style="fill:#ffffff;fill-opacity:1;stroke-width:2.9685"
     id="rect917"
     width="2.9970074"
     height="403"
     x="0"
     y="50" /></g></svg>
