{
  "ec76f5ba9afec745abb662bbaab9432f" : {
    "statistic" : {
      "failed" : 0,
      "broken" : 0,
      "skipped" : 0,
      "passed" : 1,
      "unknown" : 0,
      "total" : 1
    },
    "items" : [ {
      "uid" : "44306852948e356d",
      "status" : "passed",
      "time" : {
        "start" : 1613122221339,
        "stop" : 1613122224246,
        "duration" : 2907
      }
    } ]
  }
}