PassengerId,score
1,0.3170538218411705
2,0.4508543950248747
3,0.3170538218411705
4,0.3651131558898697
5,0.3170538218411705
6,0.3170538218411705
7,0.3651131558898697
8,0.3170538218411705
9,0.3170538218411705
10,0.42726139923561723
11,0.3170538218411705
12,0.3651131558898697
13,0.3170538218411705
14,0.3170538218411705
15,0.3170538218411705
16,0.3415201601006122
17,0.3170538218411705
18,0.3415201601006122
19,0.3170538218411705
20,0.3800450609761755
21,0.3415201601006122
22,0.3415201601006122
23,0.3170538218411705
24,0.3651131558898697
25,0.3170538218411705
26,0.3170538218411705
27,0.3800450609761755
28,0.3651131558898697
29,0.3170538218411705
30,0.3170538218411705
31,0.4508543950248747
32,0.4508543950248747
33,0.3170538218411705
34,0.3415201601006122
35,0.4508543950248747
36,0.3651131558898697
37,0.3800450609761755
38,0.3170538218411705
39,0.3170538218411705
40,0.3800450609761755
41,0.3170538218411705
42,0.3415201601006122
43,0.3800450609761755
44,0.42726139923561723
45,0.3170538218411705
46,0.3170538218411705
47,0.3170538218411705
48,0.3170538218411705
49,0.3800450609761755
50,0.3170538218411705
51,0.3170538218411705
52,0.3170538218411705
53,0.4508543950248747
54,0.3415201601006122
55,0.4508543950248747
56,0.3651131558898697
57,0.3415201601006122
58,0.3800450609761755
59,0.3415201601006122
60,0.3170538218411705
61,0.3800450609761755
62,0.3651131558898697
63,0.3651131558898697
64,0.3170538218411705
65,0.4508543950248747
66,0.3800450609761755
67,0.3415201601006122
68,0.3170538218411705
69,0.3170538218411705
70,0.3170538218411705
71,0.3415201601006122
72,0.3170538218411705
73,0.3415201601006122
74,0.3800450609761755
75,0.3170538218411705
76,0.3170538218411705
77,0.3170538218411705
78,0.3170538218411705
79,0.3415201601006122
80,0.3170538218411705
81,0.3170538218411705
82,0.3170538218411705
83,0.3170538218411705
84,0.3651131558898697
85,0.3415201601006122
86,0.3170538218411705
87,0.3170538218411705
88,0.3170538218411705
89,0.3651131558898697
90,0.3170538218411705
91,0.3170538218411705
92,0.3170538218411705
93,0.3651131558898697
94,0.3170538218411705
95,0.3170538218411705
96,0.3170538218411705
97,0.4508543950248747
98,0.4508543950248747
99,0.3415201601006122
100,0.3415201601006122
101,0.3170538218411705
102,0.3170538218411705
103,0.3651131558898697
104,0.3170538218411705
105,0.3170538218411705
106,0.3170538218411705
107,0.3170538218411705
108,0.3170538218411705
109,0.3170538218411705
110,0.3170538218411705
111,0.3651131558898697
112,0.3800450609761755
113,0.3170538218411705
114,0.3170538218411705
115,0.3800450609761755
116,0.3170538218411705
117,0.3170538218411705
118,0.3415201601006122
119,0.4508543950248747
120,0.3170538218411705
121,0.3415201601006122
122,0.3170538218411705
123,0.42726139923561723
124,0.3415201601006122
125,0.3651131558898697
126,0.3800450609761755
127,0.3170538218411705
128,0.3170538218411705
129,0.3800450609761755
130,0.3170538218411705
131,0.3800450609761755
132,0.3170538218411705
133,0.3170538218411705
134,0.3415201601006122
135,0.3415201601006122
136,0.42726139923561723
137,0.3651131558898697
138,0.3651131558898697
139,0.3170538218411705
140,0.4508543950248747
141,0.3800450609761755
142,0.3170538218411705
143,0.3170538218411705
144,0.3170538218411705
145,0.3415201601006122
146,0.3415201601006122
147,0.3170538218411705
148,0.3170538218411705
149,0.3415201601006122
150,0.3415201601006122
151,0.3415201601006122
152,0.3651131558898697
153,0.3170538218411705
154,0.3170538218411705
155,0.3170538218411705
156,0.4508543950248747
157,0.3170538218411705
158,0.3170538218411705
159,0.3170538218411705
160,0.3170538218411705
161,0.3170538218411705
162,0.3415201601006122
163,0.3170538218411705
164,0.3170538218411705
165,0.3170538218411705
166,0.3170538218411705
167,0.3651131558898697
168,0.3170538218411705
169,0.3651131558898697
170,0.3170538218411705
171,0.3651131558898697
172,0.3170538218411705
173,0.3170538218411705
174,0.3170538218411705
175,0.4508543950248747
176,0.3170538218411705
177,0.3170538218411705
178,0.4508543950248747
179,0.3415201601006122
180,0.5735582397139702
181,0.3170538218411705
182,0.42726139923561723
183,0.3170538218411705
184,0.3415201601006122
185,0.3170538218411705
186,0.3651131558898697
187,0.3170538218411705
188,0.3651131558898697
189,0.3170538218411705
190,0.3170538218411705
191,0.3415201601006122
192,0.3415201601006122
193,0.3170538218411705
194,0.3415201601006122
195,0.4508543950248747
196,0.4508543950248747
197,0.3170538218411705
198,0.3170538218411705
199,0.3170538218411705
200,0.3415201601006122
201,0.3170538218411705
202,0.3170538218411705
203,0.3170538218411705
204,0.3800450609761755
205,0.3170538218411705
206,0.3170538218411705
207,0.3170538218411705
208,0.3800450609761755
209,0.3170538218411705
210,0.4508543950248747
211,0.3170538218411705
212,0.3415201601006122
213,0.3170538218411705
214,0.3415201601006122
215,0.3170538218411705
216,0.4508543950248747
217,0.3170538218411705
218,0.3415201601006122
219,0.4508543950248747
220,0.3415201601006122
221,0.3170538218411705
222,0.3415201601006122
223,0.3170538218411705
224,0.3170538218411705
225,0.3651131558898697
226,0.3170538218411705
227,0.3415201601006122
228,0.3170538218411705
229,0.3415201601006122
230,0.3170538218411705
231,0.3651131558898697
232,0.3170538218411705
233,0.3415201601006122
234,0.3170538218411705
235,0.3415201601006122
236,0.3170538218411705
237,0.3415201601006122
238,0.3415201601006122
239,0.3415201601006122
240,0.3415201601006122
241,0.3800450609761755
242,0.3170538218411705
243,0.3415201601006122
244,0.3170538218411705
245,0.3800450609761755
246,0.3651131558898697
247,0.3170538218411705
248,0.3415201601006122
249,0.3651131558898697
250,0.3415201601006122
251,0.3170538218411705
252,0.3170538218411705
253,0.3651131558898697
254,0.3170538218411705
255,0.3170538218411705
256,0.3800450609761755
257,0.4508543950248747
258,0.3651131558898697
259,0.4508543950248747
260,0.3415201601006122
261,0.3170538218411705
262,0.3170538218411705
263,0.3651131558898697
264,0.598024577973412
265,0.3170538218411705
266,0.3415201601006122
267,0.3170538218411705
268,0.3170538218411705
269,0.3651131558898697
270,0.3651131558898697
271,0.3651131558898697
272,0.5735582397139702
273,0.3415201601006122
274,0.4508543950248747
275,0.3170538218411705
276,0.3651131558898697
277,0.3170538218411705
278,0.598024577973412
279,0.3170538218411705
280,0.3170538218411705
281,0.3170538218411705
282,0.3170538218411705
283,0.3170538218411705
284,0.3170538218411705
285,0.3651131558898697
286,0.3800450609761755
287,0.3170538218411705
288,0.3170538218411705
289,0.3415201601006122
290,0.3170538218411705
291,0.3651131558898697
292,0.4508543950248747
293,0.42726139923561723
294,0.3170538218411705
295,0.3170538218411705
296,0.4508543950248747
297,0.3800450609761755
298,0.3651131558898697
299,0.3651131558898697
300,0.4508543950248747
301,0.3170538218411705
302,0.3170538218411705
303,0.5735582397139702
304,0.3415201601006122
305,0.3170538218411705
306,0.3651131558898697
307,0.4508543950248747
308,0.4508543950248747
309,0.42726139923561723
310,0.4508543950248747
311,0.4508543950248747
312,0.4508543950248747
313,0.3415201601006122
314,0.3170538218411705
315,0.3415201601006122
316,0.3170538218411705
317,0.3415201601006122
318,0.3415201601006122
319,0.3651131558898697
320,0.4508543950248747
321,0.3170538218411705
322,0.3170538218411705
323,0.3415201601006122
324,0.3415201601006122
325,0.3170538218411705
326,0.4508543950248747
327,0.3170538218411705
328,0.3415201601006122
329,0.3170538218411705
330,0.4508543950248747
331,0.3170538218411705
332,0.3651131558898697
333,0.3651131558898697
334,0.3170538218411705
335,0.3651131558898697
336,0.3170538218411705
337,0.3651131558898697
338,0.4508543950248747
339,0.3170538218411705
340,0.3651131558898697
341,0.3415201601006122
342,0.3651131558898697
343,0.3415201601006122
344,0.3415201601006122
345,0.3415201601006122
346,0.3415201601006122
347,0.3415201601006122
348,0.3170538218411705
349,0.3170538218411705
350,0.3170538218411705
351,0.3170538218411705
352,0.3651131558898697
353,0.3800450609761755
354,0.3170538218411705
355,0.3800450609761755
356,0.3170538218411705
357,0.3651131558898697
358,0.3415201601006122
359,0.3170538218411705
360,0.3170538218411705
361,0.3170538218411705
362,0.42726139923561723
363,0.3800450609761755
364,0.3170538218411705
365,0.3170538218411705
366,0.3170538218411705
367,0.4508543950248747
368,0.3800450609761755
369,0.3170538218411705
370,0.4508543950248747
371,0.4508543950248747
372,0.3170538218411705
373,0.3170538218411705
374,0.4508543950248747
375,0.3170538218411705
376,0.4508543950248747
377,0.3170538218411705
378,0.4508543950248747
379,0.3800450609761755
380,0.3170538218411705
381,0.4508543950248747
382,0.3800450609761755
383,0.3170538218411705
384,0.3651131558898697
385,0.3170538218411705
386,0.3415201601006122
387,0.3170538218411705
388,0.3415201601006122
389,0.3170538218411705
390,0.42726139923561723
391,0.3651131558898697
392,0.3170538218411705
393,0.3170538218411705
394,0.4508543950248747
395,0.3170538218411705
396,0.3170538218411705
397,0.3170538218411705
398,0.3415201601006122
399,0.3415201601006122
400,0.3415201601006122
401,0.3170538218411705
402,0.3170538218411705
403,0.3170538218411705
404,0.3170538218411705
405,0.3170538218411705
406,0.3415201601006122
407,0.3170538218411705
408,0.3415201601006122
409,0.3170538218411705
410,0.3170538218411705
411,0.3170538218411705
412,0.3170538218411705
413,0.3651131558898697
414,0.598024577973412
415,0.3170538218411705
416,0.3170538218411705
417,0.3415201601006122
418,0.3415201601006122
419,0.3415201601006122
420,0.3170538218411705
421,0.3800450609761755
422,0.3170538218411705
423,0.3170538218411705
424,0.3170538218411705
425,0.3170538218411705
426,0.3170538218411705
427,0.3415201601006122
428,0.3415201601006122
429,0.3170538218411705
430,0.3170538218411705
431,0.3651131558898697
432,0.3170538218411705
433,0.3415201601006122
434,0.3170538218411705
435,0.3651131558898697
436,0.3651131558898697
437,0.3170538218411705
438,0.3415201601006122
439,0.3651131558898697
440,0.3415201601006122
441,0.3415201601006122
442,0.3170538218411705
443,0.3170538218411705
444,0.3415201601006122
445,0.3170538218411705
446,0.3651131558898697
447,0.3415201601006122
448,0.3651131558898697
449,0.3800450609761755
450,0.3651131558898697
451,0.3415201601006122
452,0.3170538218411705
453,0.4508543950248747
454,0.4508543950248747
455,0.3170538218411705
456,0.3800450609761755
457,0.3651131558898697
458,0.3651131558898697
459,0.3415201601006122
460,0.3170538218411705
461,0.3651131558898697
462,0.3170538218411705
463,0.3651131558898697
464,0.3415201601006122
465,0.3170538218411705
466,0.3170538218411705
467,0.598024577973412
468,0.3651131558898697
469,0.3170538218411705
470,0.3800450609761755
471,0.3170538218411705
472,0.3170538218411705
473,0.3415201601006122
474,0.42726139923561723
475,0.3170538218411705
476,0.3651131558898697
477,0.3415201601006122
478,0.3170538218411705
479,0.3170538218411705
480,0.3170538218411705
481,0.3170538218411705
482,0.598024577973412
483,0.3170538218411705
484,0.3170538218411705
485,0.4508543950248747
486,0.3170538218411705
487,0.3651131558898697
488,0.4508543950248747
489,0.3170538218411705
490,0.3170538218411705
491,0.3170538218411705
492,0.3170538218411705
493,0.3651131558898697
494,0.4508543950248747
495,0.3170538218411705
496,0.3800450609761755
497,0.4508543950248747
498,0.3170538218411705
499,0.3651131558898697
500,0.3170538218411705
501,0.3170538218411705
502,0.3170538218411705
503,0.3170538218411705
504,0.3170538218411705
505,0.3651131558898697
506,0.4508543950248747
507,0.3415201601006122
508,0.3651131558898697
509,0.3170538218411705
510,0.3170538218411705
511,0.3170538218411705
512,0.3170538218411705
513,0.3651131558898697
514,0.4508543950248747
515,0.3170538218411705
516,0.3651131558898697
517,0.3415201601006122
518,0.3170538218411705
519,0.3415201601006122
520,0.3170538218411705
521,0.3651131558898697
522,0.3170538218411705
523,0.3800450609761755
524,0.4508543950248747
525,0.3800450609761755
526,0.3170538218411705
527,0.3415201601006122
528,0.3651131558898697
529,0.3170538218411705
530,0.3415201601006122
531,0.3415201601006122
532,0.3800450609761755
533,0.3800450609761755
534,0.3800450609761755
535,0.3170538218411705
536,0.3415201601006122
537,0.3651131558898697
538,0.4508543950248747
539,0.3170538218411705
540,0.4508543950248747
541,0.3651131558898697
542,0.3170538218411705
543,0.3170538218411705
544,0.3415201601006122
545,0.4508543950248747
546,0.3651131558898697
547,0.3415201601006122
548,0.42726139923561723
549,0.3170538218411705
550,0.3415201601006122
551,0.4508543950248747
552,0.3415201601006122
553,0.3170538218411705
554,0.3800450609761755
555,0.3170538218411705
556,0.3651131558898697
557,0.4508543950248747
558,0.4508543950248747
559,0.3651131558898697
560,0.3170538218411705
561,0.3170538218411705
562,0.3170538218411705
563,0.3415201601006122
564,0.3170538218411705
565,0.3170538218411705
566,0.3170538218411705
567,0.3170538218411705
568,0.3170538218411705
569,0.3800450609761755
570,0.3170538218411705
571,0.3415201601006122
572,0.3651131558898697
573,0.3651131558898697
574,0.3170538218411705
575,0.3170538218411705
576,0.3170538218411705
577,0.3415201601006122
578,0.3651131558898697
579,0.3800450609761755
580,0.3170538218411705
581,0.3415201601006122
582,0.4508543950248747
583,0.3415201601006122
584,0.4508543950248747
585,0.3800450609761755
586,0.3651131558898697
587,0.3415201601006122
588,0.4508543950248747
589,0.3170538218411705
590,0.3170538218411705
591,0.3170538218411705
592,0.4508543950248747
593,0.3170538218411705
594,0.3170538218411705
595,0.3415201601006122
596,0.3170538218411705
597,0.3415201601006122
598,0.5735582397139702
599,0.3800450609761755
600,0.4508543950248747
601,0.3415201601006122
602,0.3170538218411705
603,0.3651131558898697
604,0.3170538218411705
605,0.4508543950248747
606,0.3170538218411705
607,0.3170538218411705
608,0.3651131558898697
609,0.42726139923561723
610,0.3651131558898697
611,0.3170538218411705
612,0.3170538218411705
613,0.3170538218411705
614,0.3170538218411705
615,0.3170538218411705
616,0.3415201601006122
617,0.3170538218411705
618,0.3170538218411705
619,0.3415201601006122
620,0.3415201601006122
621,0.3800450609761755
622,0.3651131558898697
623,0.3800450609761755
624,0.3170538218411705
625,0.3170538218411705
626,0.3651131558898697
627,0.3415201601006122
628,0.3651131558898697
629,0.3170538218411705
630,0.3170538218411705
631,0.3651131558898697
632,0.3170538218411705
633,0.4508543950248747
634,0.598024577973412
635,0.3170538218411705
636,0.3415201601006122
637,0.3170538218411705
638,0.3415201601006122
639,0.3170538218411705
640,0.3170538218411705
641,0.3170538218411705
642,0.4508543950248747
643,0.3170538218411705
644,0.3170538218411705
645,0.3800450609761755
646,0.4508543950248747
647,0.3170538218411705
648,0.4508543950248747
649,0.3170538218411705
650,0.3170538218411705
651,0.3170538218411705
652,0.3415201601006122
653,0.3170538218411705
654,0.3170538218411705
655,0.3170538218411705
656,0.3415201601006122
657,0.3170538218411705
658,0.3170538218411705
659,0.3415201601006122
660,0.4508543950248747
661,0.3651131558898697
662,0.3800450609761755
663,0.3651131558898697
664,0.3170538218411705
665,0.3170538218411705
666,0.3415201601006122
667,0.3415201601006122
668,0.3170538218411705
669,0.3170538218411705
670,0.3651131558898697
671,0.3415201601006122
672,0.3651131558898697
673,0.3415201601006122
674,0.3415201601006122
675,0.598024577973412
676,0.3170538218411705
677,0.3170538218411705
678,0.3170538218411705
679,0.3170538218411705
680,0.4508543950248747
681,0.3170538218411705
682,0.4508543950248747
683,0.3170538218411705
684,0.3170538218411705
685,0.3415201601006122
686,0.42726139923561723
687,0.3170538218411705
688,0.3170538218411705
689,0.3170538218411705
690,0.3651131558898697
691,0.3651131558898697
692,0.3800450609761755
693,0.3170538218411705
694,0.3800450609761755
695,0.3651131558898697
696,0.3415201601006122
697,0.3170538218411705
698,0.3170538218411705
699,0.4508543950248747
700,0.3170538218411705
701,0.4508543950248747
702,0.3651131558898697
703,0.3800450609761755
704,0.3170538218411705
705,0.3170538218411705
706,0.3415201601006122
707,0.3415201601006122
708,0.3651131558898697
709,0.3651131558898697
710,0.3800450609761755
711,0.4508543950248747
712,0.3651131558898697
713,0.3651131558898697
714,0.3170538218411705
715,0.3415201601006122
716,0.3170538218411705
717,0.4508543950248747
718,0.3415201601006122
719,0.3170538218411705
720,0.3170538218411705
721,0.3415201601006122
722,0.3170538218411705
723,0.3415201601006122
724,0.3415201601006122
725,0.3651131558898697
726,0.3170538218411705
727,0.3415201601006122
728,0.3170538218411705
729,0.3415201601006122
730,0.3170538218411705
731,0.3651131558898697
732,0.3800450609761755
733,0.598024577973412
734,0.3415201601006122
735,0.3415201601006122
736,0.3170538218411705
737,0.3170538218411705
738,0.4508543950248747
739,0.3170538218411705
740,0.3170538218411705
741,0.3651131558898697
742,0.3651131558898697
743,0.4508543950248747
744,0.3170538218411705
745,0.3170538218411705
746,0.3651131558898697
747,0.3170538218411705
748,0.3415201601006122
749,0.3651131558898697
750,0.3170538218411705
751,0.3415201601006122
752,0.3170538218411705
753,0.3170538218411705
754,0.3170538218411705
755,0.3415201601006122
756,0.3415201601006122
757,0.3170538218411705
758,0.3415201601006122
759,0.3170538218411705
760,0.3651131558898697
761,0.3170538218411705
762,0.3170538218411705
763,0.3800450609761755
764,0.3651131558898697
765,0.3170538218411705
766,0.3651131558898697
767,0.4508543950248747
768,0.3170538218411705
769,0.3170538218411705
770,0.3170538218411705
771,0.3170538218411705
772,0.3170538218411705
773,0.3415201601006122
774,0.3800450609761755
775,0.3415201601006122
776,0.3170538218411705
777,0.3170538218411705
778,0.3170538218411705
779,0.3170538218411705
780,0.3651131558898697
781,0.3800450609761755
782,0.3651131558898697
783,0.3651131558898697
784,0.3170538218411705
785,0.3170538218411705
786,0.3170538218411705
787,0.3170538218411705
788,0.3170538218411705
789,0.3170538218411705
790,0.4508543950248747
791,0.3170538218411705
792,0.3415201601006122
793,0.3170538218411705
794,0.4508543950248747
795,0.3170538218411705
796,0.3415201601006122
797,0.3651131558898697
798,0.3170538218411705
799,0.3800450609761755
800,0.3170538218411705
801,0.3415201601006122
802,0.3415201601006122
803,0.3651131558898697
804,0.3800450609761755
805,0.3170538218411705
806,0.3170538218411705
807,0.598024577973412
808,0.3170538218411705
809,0.3415201601006122
810,0.3651131558898697
811,0.3170538218411705
812,0.3170538218411705
813,0.3415201601006122
814,0.3170538218411705
815,0.3170538218411705
816,0.598024577973412
817,0.3170538218411705
818,0.42726139923561723
819,0.3170538218411705
820,0.3170538218411705
821,0.3651131558898697
822,0.3170538218411705
823,0.598024577973412
824,0.3170538218411705
825,0.3170538218411705
826,0.3170538218411705
827,0.3170538218411705
828,0.42726139923561723
829,0.3170538218411705
830,0.3651131558898697
831,0.3800450609761755
832,0.3415201601006122
833,0.3800450609761755
834,0.3170538218411705
835,0.3170538218411705
836,0.4508543950248747
837,0.3170538218411705
838,0.3170538218411705
839,0.3170538218411705
840,0.4508543950248747
841,0.3170538218411705
842,0.3415201601006122
843,0.4508543950248747
844,0.3800450609761755
845,0.3170538218411705
846,0.3170538218411705
847,0.3170538218411705
848,0.3800450609761755
849,0.3415201601006122
850,0.4508543950248747
851,0.3170538218411705
852,0.3170538218411705
853,0.3800450609761755
854,0.3651131558898697
855,0.3415201601006122
856,0.3170538218411705
857,0.3651131558898697
858,0.3651131558898697
859,0.3800450609761755
860,0.3800450609761755
861,0.3170538218411705
862,0.3415201601006122
863,0.3651131558898697
864,0.3170538218411705
865,0.3415201601006122
866,0.3415201601006122
867,0.42726139923561723
868,0.3651131558898697
869,0.3170538218411705
870,0.3170538218411705
871,0.3170538218411705
872,0.3651131558898697
873,0.3651131558898697
874,0.3170538218411705
875,0.42726139923561723
876,0.3800450609761755
877,0.3170538218411705
878,0.3170538218411705
879,0.3170538218411705
880,0.4508543950248747
881,0.3415201601006122
882,0.3170538218411705
883,0.3170538218411705
884,0.3415201601006122
885,0.3170538218411705
886,0.3170538218411705
887,0.3415201601006122
888,0.3651131558898697
889,0.3170538218411705
890,0.4508543950248747
891,0.3170538218411705
