Copyright 1986-2021 Xilinx, Inc. All Rights Reserved.
------------------------------------------------------------------------------------
| Tool Version : Vivado v.2021.1 (lin64) Build 3247384 Thu Jun 10 19:36:07 MDT 2021
| Date         : Tue Jul 13 15:55:05 2021
| Host         : printer running 64-bit Ubuntu 20.04 LTS
| Command      : report_control_sets -verbose -file main_control_sets_placed.rpt
| Design       : main
| Device       : xc7s25
------------------------------------------------------------------------------------

Control Set Information

Table of Contents
-----------------
1. Summary
2. Histogram
3. Flip-Flop Distribution
4. Detailed Control Set Information

1. Summary
----------

+----------------------------------------------------------+-------+
|                          Status                          | Count |
+----------------------------------------------------------+-------+
| Total control sets                                       |    22 |
|    Minimum number of control sets                        |    22 |
|    Addition due to synthesis replication                 |     0 |
|    Addition due to physical synthesis replication        |     0 |
| Unused register locations in slices containing registers |    33 |
+----------------------------------------------------------+-------+
* Control sets can be merged at opt_design using control_set_merge or merge_equivalent_drivers
** Run report_qor_suggestions for automated merging and remapping suggestions


2. Histogram
------------

+--------------------+-------+
|       Fanout       | Count |
+--------------------+-------+
| Total control sets |    22 |
| >= 0 to < 4        |     2 |
| >= 4 to < 6        |     0 |
| >= 6 to < 8        |     0 |
| >= 8 to < 10       |     1 |
| >= 10 to < 12      |     1 |
| >= 12 to < 14      |     0 |
| >= 14 to < 16      |     1 |
| >= 16              |    17 |
+--------------------+-------+
* Control sets can be remapped at either synth_design or opt_design


3. Flip-Flop Distribution
-------------------------

+--------------+-----------------------+------------------------+-----------------+--------------+
| Clock Enable | Synchronous Set/Reset | Asynchronous Set/Reset | Total Registers | Total Slices |
+--------------+-----------------------+------------------------+-----------------+--------------+
| No           | No                    | No                     |              23 |           20 |
| No           | No                    | Yes                    |               0 |            0 |
| No           | Yes                   | No                     |              11 |            6 |
| Yes          | No                    | No                     |             307 |          256 |
| Yes          | No                    | Yes                    |               0 |            0 |
| Yes          | Yes                   | No                     |              10 |            3 |
+--------------+-----------------------+------------------------+-----------------+--------------+


4. Detailed Control Set Information
-----------------------------------

+----------------+-----------------------------------------+-------------------------------------+------------------+----------------+--------------+
|  Clock Signal  |              Enable Signal              |           Set/Reset Signal          | Slice Load Count | Bel Load Count | Bels / Slice |
+----------------+-----------------------------------------+-------------------------------------+------------------+----------------+--------------+
|  clk_IBUF_BUFG |                                         | nolabel_line20/hsync_i_1_n_0        |                1 |              1 |         1.00 |
|  clk_IBUF_BUFG |                                         | nolabel_line20/vsync_i_1_n_0        |                1 |              1 |         1.00 |
|  clk_IBUF_BUFG |                                         | nolabel_line20/width_idx[8]_i_1_n_0 |                4 |              9 |         2.25 |
|  clk_IBUF_BUFG | nolabel_line20/width_idx[8]_i_1_n_0     | nolabel_line20/height_idx           |                3 |             10 |         3.33 |
|  clk_IBUF_BUFG | nolabel_line43/register[15][15]_i_1_n_0 |                                     |               12 |             14 |         1.17 |
|  clk_IBUF_BUFG | nolabel_line43/register_reg[6]0         |                                     |               14 |             16 |         1.14 |
|  clk_IBUF_BUFG | nolabel_line43/register_reg[5]0         |                                     |               14 |             16 |         1.14 |
|  clk_IBUF_BUFG | nolabel_line43/register_reg[0]0         |                                     |               15 |             16 |         1.07 |
|  clk_IBUF_BUFG | nolabel_line43/register_reg[13]0        |                                     |               15 |             16 |         1.07 |
|  clk_IBUF_BUFG | nolabel_line43/register_reg[12]0        |                                     |               15 |             16 |         1.07 |
|  clk_IBUF_BUFG | nolabel_line43/register_reg[11]0        |                                     |               15 |             16 |         1.07 |
|  clk_IBUF_BUFG | nolabel_line43/register_reg[9]0         |                                     |               16 |             16 |         1.00 |
|  clk_IBUF_BUFG | nolabel_line43/register_reg[7]0         |                                     |               15 |             16 |         1.07 |
|  clk_IBUF_BUFG | nolabel_line43/register_reg[8]0         |                                     |               14 |             16 |         1.14 |
|  clk_IBUF_BUFG | nolabel_line43/register_reg[10]0        |                                     |               15 |             16 |         1.07 |
|  clk_IBUF_BUFG | nolabel_line43/register_reg[2]0         |                                     |               14 |             16 |         1.14 |
|  clk_IBUF_BUFG | nolabel_line43/register_reg[4]0         |                                     |               14 |             16 |         1.14 |
|  clk_IBUF_BUFG | nolabel_line43/register_reg[3]0         |                                     |               14 |             16 |         1.14 |
|  clk_IBUF_BUFG | nolabel_line43/register_reg[1]0         |                                     |               15 |             16 |         1.07 |
|  clk_IBUF_BUFG | nolabel_line43/register_reg[14]0        |                                     |               14 |             16 |         1.14 |
|  clk_IBUF_BUFG |                                         |                                     |               20 |             23 |         1.15 |
|  clk_IBUF_BUFG | nolabel_line43/color                    |                                     |               25 |             53 |         2.12 |
+----------------+-----------------------------------------+-------------------------------------+------------------+----------------+--------------+


