rpc/alpha.proxy.delegates.out

./tezos-client --mode proxy rpc get /chains/main/blocks/head/context/contracts
[ "[CONTRACT_HASH]",
  "[CONTRACT_HASH]",
  "[CONTRACT_HASH]",
  "[PUBLIC_KEY_HASH]",
  "[PUBLIC_KEY_HASH]",
  "[PUBLIC_KEY_HASH]",
  "[PUBLIC_KEY_HASH]",
  "[PUBLIC_KEY_HASH]" ]
protocol of proxy unspecified, using the node's protocol: ProtoGenesisGenesisGenesisGenesisGenesisGenesk612im

./tezos-client --mode proxy rpc get /chains/main/blocks/head/context/delegates
[ "[PUBLIC_KEY_HASH]",
  "[PUBLIC_KEY_HASH]",
  "[PUBLIC_KEY_HASH]",
  "[PUBLIC_KEY_HASH]",
  "[PUBLIC_KEY_HASH]" ]
protocol of proxy unspecified, using the node's protocol: ProtoGenesisGenesisGenesisGenesisGenesisGenesk612im

./tezos-client --mode proxy rpc get '/chains/main/blocks/head/context/delegates/[PUBLIC_KEY_HASH]'
{ "full_balance": "4000000000000", "current_frozen_deposits": "200000000000",
  "frozen_deposits": "200000000000", "staking_balance": "4000000000000",
  "delegated_contracts": [ "[PUBLIC_KEY_HASH]" ],
  "delegated_balance": "0", "deactivated": false, "grace_period": 5,
  "voting_power": "4000000000000" }
protocol of proxy unspecified, using the node's protocol: ProtoGenesisGenesisGenesisGenesisGenesisGenesk612im

./tezos-client --mode proxy rpc get '/chains/main/blocks/head/context/delegates/[PUBLIC_KEY_HASH]/full_balance'
"4000000000000"
protocol of proxy unspecified, using the node's protocol: ProtoGenesisGenesisGenesisGenesisGenesisGenesk612im

./tezos-client --mode proxy rpc get '/chains/main/blocks/head/context/delegates/[PUBLIC_KEY_HASH]/frozen_deposits'
"200000000000"
protocol of proxy unspecified, using the node's protocol: ProtoGenesisGenesisGenesisGenesisGenesisGenesk612im

./tezos-client --mode proxy rpc get '/chains/main/blocks/head/context/delegates/[PUBLIC_KEY_HASH]/deactivated'
false
protocol of proxy unspecified, using the node's protocol: ProtoGenesisGenesisGenesisGenesisGenesisGenesk612im

./tezos-client --mode proxy rpc get '/chains/main/blocks/head/context/delegates/[PUBLIC_KEY_HASH]/delegated_balance'
"0"
protocol of proxy unspecified, using the node's protocol: ProtoGenesisGenesisGenesisGenesisGenesisGenesk612im

./tezos-client --mode proxy rpc get '/chains/main/blocks/head/context/delegates/[PUBLIC_KEY_HASH]/delegated_contracts'
[ "[PUBLIC_KEY_HASH]" ]
protocol of proxy unspecified, using the node's protocol: ProtoGenesisGenesisGenesisGenesisGenesisGenesk612im

./tezos-client --mode proxy rpc get '/chains/main/blocks/head/context/delegates/[PUBLIC_KEY_HASH]/grace_period'
5
protocol of proxy unspecified, using the node's protocol: ProtoGenesisGenesisGenesisGenesisGenesisGenesk612im

./tezos-client --mode proxy rpc get '/chains/main/blocks/head/context/delegates/[PUBLIC_KEY_HASH]/staking_balance'
"4000000000000"
protocol of proxy unspecified, using the node's protocol: ProtoGenesisGenesisGenesisGenesisGenesisGenesk612im

./tezos-client --mode proxy rpc get '/chains/main/blocks/head/context/delegates/[PUBLIC_KEY_HASH]/voting_power'
"4000000000000"
protocol of proxy unspecified, using the node's protocol: ProtoGenesisGenesisGenesisGenesisGenesisGenesk612im

./tezos-client --mode proxy rpc get '/chains/main/blocks/head/context/delegates/[PUBLIC_KEY_HASH]'
protocol of proxy unspecified, using the node's protocol: ProtoGenesisGenesisGenesisGenesisGenesisGenesk612im
Fatal error:
  Command failed: The provided public key hash ([PUBLIC_KEY_HASH]) is not the address of a registered delegate. If you own this account and want to register it as a delegate, use a delegation operation to delegate the account to itself.
  

./tezos-client --mode proxy rpc get '/chains/main/blocks/head/context/delegates/[PUBLIC_KEY_HASH]/full_balance'
protocol of proxy unspecified, using the node's protocol: ProtoGenesisGenesisGenesisGenesisGenesisGenesk612im
Fatal error:
  Command failed: The implicit account ([PUBLIC_KEY_HASH]) whose balance was requested is not a registered delegate. To get the balance of this account you can use the ../context/contracts/[PUBLIC_KEY_HASH]/balance RPC.
                  The provided public key hash ([PUBLIC_KEY_HASH]) is not the address of a registered delegate. If you own this account and want to register it as a delegate, use a delegation operation to delegate the account to itself.
  

./tezos-client --mode proxy rpc get '/chains/main/blocks/head/context/delegates/[PUBLIC_KEY_HASH]/frozen_deposits'
protocol of proxy unspecified, using the node's protocol: ProtoGenesisGenesisGenesisGenesisGenesisGenesk612im
Fatal error:
  Command failed: The provided public key hash ([PUBLIC_KEY_HASH]) is not the address of a registered delegate. If you own this account and want to register it as a delegate, use a delegation operation to delegate the account to itself.
  

./tezos-client --mode proxy rpc get '/chains/main/blocks/head/context/delegates/[PUBLIC_KEY_HASH]/deactivated'
protocol of proxy unspecified, using the node's protocol: ProtoGenesisGenesisGenesisGenesisGenesisGenesk612im
Fatal error:
  Command failed: The provided public key hash ([PUBLIC_KEY_HASH]) is not the address of a registered delegate. If you own this account and want to register it as a delegate, use a delegation operation to delegate the account to itself.
  

./tezos-client --mode proxy rpc get '/chains/main/blocks/head/context/delegates/[PUBLIC_KEY_HASH]/delegated_balance'
protocol of proxy unspecified, using the node's protocol: ProtoGenesisGenesisGenesisGenesisGenesisGenesk612im
Fatal error:
  Command failed: The provided public key hash ([PUBLIC_KEY_HASH]) is not the address of a registered delegate. If you own this account and want to register it as a delegate, use a delegation operation to delegate the account to itself.
  

./tezos-client --mode proxy rpc get '/chains/main/blocks/head/context/delegates/[PUBLIC_KEY_HASH]/delegated_contracts'
protocol of proxy unspecified, using the node's protocol: ProtoGenesisGenesisGenesisGenesisGenesisGenesk612im
Fatal error:
  Command failed: The provided public key hash ([PUBLIC_KEY_HASH]) is not the address of a registered delegate. If you own this account and want to register it as a delegate, use a delegation operation to delegate the account to itself.
  

./tezos-client --mode proxy rpc get '/chains/main/blocks/head/context/delegates/[PUBLIC_KEY_HASH]/grace_period'
protocol of proxy unspecified, using the node's protocol: ProtoGenesisGenesisGenesisGenesisGenesisGenesk612im
Fatal error:
  Command failed: The provided public key hash ([PUBLIC_KEY_HASH]) is not the address of a registered delegate. If you own this account and want to register it as a delegate, use a delegation operation to delegate the account to itself.
  

./tezos-client --mode proxy rpc get '/chains/main/blocks/head/context/delegates/[PUBLIC_KEY_HASH]/staking_balance'
protocol of proxy unspecified, using the node's protocol: ProtoGenesisGenesisGenesisGenesisGenesisGenesk612im
Fatal error:
  Command failed: The provided public key hash ([PUBLIC_KEY_HASH]) is not the address of a registered delegate. If you own this account and want to register it as a delegate, use a delegation operation to delegate the account to itself.
  

./tezos-client --mode proxy rpc get '/chains/main/blocks/head/context/delegates/[PUBLIC_KEY_HASH]/voting_power'
protocol of proxy unspecified, using the node's protocol: ProtoGenesisGenesisGenesisGenesisGenesisGenesk612im
Fatal error:
  Command failed: The provided public key hash ([PUBLIC_KEY_HASH]) is not the address of a registered delegate. If you own this account and want to register it as a delegate, use a delegation operation to delegate the account to itself.
  
