<?xml version="1.0" encoding="UTF-8" ?>
<testsuite errors="0" failures="1" hostname="DTT-777-PC" name="com.minhnd.unit.test.location.LocationUnitTest" tests="1" time="0.045" timestamp="2014-09-15T04:32:09">
  <properties>
    <property name="file.encoding.pkg" value="sun.io" />
    <property name="env.PROMPT" value="$P$G" />
    <property name="java.home" value="G:\liferay-portal-6.1.0-ce-ga1\tomcat-7.0.23\jre1.6.0_20\win" />
    <property name="plugin-package.page-url" value="http://www.liferay.com" />
    <property name="env.PROCESSOR_ARCHITEW6432" value="AMD64" />
    <property name="app.server.type" value="tomcat" />
    <property name="java.endorsed.dirs" value="G:\liferay-portal-6.1.0-ce-ga1\tomcat-7.0.23\jre1.6.0_20\win\lib\endorsed" />
    <property name="env.USERNAME" value="DTT-777" />
    <property name="sun.os.patch.level" value="" />
    <property name="java.vendor.url" value="http://java.sun.com/" />
    <property name="env.COMPUTERNAME" value="DTT-777-PC" />
    <property name="env.ProgramFiles(x86)" value="C:\Program Files (x86)" />
    <property name="java.version" value="1.6.0_20" />
    <property name="eclipse.pdebuild.home" value="/G:/liferay -eclipse/plugins/org.eclipse.pde.build_3.7.0.v20111116-2009/./" />
    <property name="plugin.file" value="../../dist/eProject-SemIV-6.1.0.1.war" />
    <property name="javac.debug" value="on" />
    <property name="java.vendor.url.bug" value="http://java.sun.com/cgi-bin/bugreport.cgi" />
    <property name="env.USERPROFILE" value="C:\Users\DTT-777" />
    <property name="ant.project.invoked-targets" value="test" />
    <property name="env.SystemRoot" value="C:\Windows" />
    <property name="user.name" value="DTT-777" />
    <property name="sun.io.unicode.encoding" value="UnicodeLittle" />
    <property name="sun.jnu.encoding" value="Cp1252" />
    <property name="java.runtime.name" value="Java(TM) SE Runtime Environment" />
    <property name="env.LOCALAPPDATA" value="C:\Users\DTT-777\AppData\Local" />
    <property name="app.server.portal.dir" value="G:\liferay-portal-6.1.0-ce-ga1\tomcat-7.0.23\webapps\ROOT" />
    <property name="plugins.excludes" value="" />
    <property name="plugin-package.module-group-id" value="liferay" />
    <property name="java.specification.name" value="Java Platform API Specification" />
    <property name="user.timezone" value="GMT" />
    <property name="path.separator" value=";" />
    <property name="plugins.ear.excludes" value="" />
    <property name="ant.file.build-common-portlet" value="G:\liferay-plugins-sdk-6.1.0-ce-b4-20111118\portlets\build-common-portlet.xml" />
    <property name="plugin.tlds" value="${plugin-package.portal-dependency-tlds}" />
    <property name="env.PROCESSOR_IDENTIFIER" value="Intel64 Family 6 Model 60 Stepping 3, GenuineIntel" />
    <property name="file.encoding" value="Cp1252" />
    <property name="ant.project.default-target" value="deploy" />
    <property name="auto.deploy.custom.portlet.xml" value="false" />
    <property name="env.HOME" value="C:\Users\DTT-777" />
    <property name="env.NUMBER_OF_PROCESSORS" value="4" />
    <property name="env.APPDATA" value="C:\Users\DTT-777\AppData\Roaming" />
    <property name="ant.file" value="G:\liferay-plugins-sdk-6.1.0-ce-b4-20111118\portlets\eProject-SemIV\build.xml" />
    <property name="plugin-package.tags" value="" />
    <property name="java.io.tmpdir" value="C:\Users\DTT-777\AppData\Local\Temp\" />
    <property name="user.language" value="en" />
    <property name="app.server.lib.portal.dir" value="G:\liferay-portal-6.1.0-ce-ga1\tomcat-7.0.23\webapps\ROOT/WEB-INF/lib" />
    <property name="env.SystemDrive" value="C:" />
    <property name="line.separator" value="&#xd;&#xa;" />
    <property name="app.server.deploy.dir" value="G:\liferay-portal-6.1.0-ce-ga1\tomcat-7.0.23\webapps" />
    <property name="ecj.compiler" value="jar:file:/G:/liferay-plugins-sdk-6.1.0-ce-b4-20111118/lib/ecj.jar!/org/eclipse/jdt/core/JDTCompilerAdapter.class" />
    <property name="javac.compiler" value="org.eclipse.jdt.core.JDTCompilerAdapter" />
    <property name="java.vm.info" value="mixed mode" />
    <property name="sun.desktop" value="windows" />
    <property name="java.vm.specification.name" value="Java Virtual Machine Specification" />
    <property name="junit.debug.jpda" value="" />
    <property name="env.PATHEXT" value=".COM;.EXE;.BAT;.CMD;.VBS;.VBE;.JS;.JSE;.WSF;.WSH;.MSC" />
    <property name="env.MOZ_PLUGIN_PATH" value="C:\Program Files (x86)\Foxit Software\Foxit Reader\plugins\" />
    <property name="ant.file.build-common-plugin" value="G:\liferay-plugins-sdk-6.1.0-ce-b4-20111118\build-common-plugin.xml" />
    <property name="javac.encoding" value="ISO-8859-1" />
    <property name="env.LOGONSERVER" value="\\DTT-777-PC" />
    <property name="eclipse.pdebuild.templates" value="/G:/liferay -eclipse/plugins/org.eclipse.pde.build_3.7.0.v20111116-2009/templates/" />
    <property name="lp.version" value="6.1.0" />
    <property name="database.name" value="lportal" />
    <property name="java.awt.printerjob" value="sun.awt.windows.WPrinterJob" />
    <property name="env.PUBLIC" value="C:\Users\Public" />
    <property name="ant.version" value="Apache Ant(TM) version 1.8.2 compiled on December 20 2010" />
    <property name="env.USERDOMAIN" value="DTT-777-PC" />
    <property name="env.PROCESSOR_LEVEL" value="6" />
    <property name="ant.file.type.build-common" value="file" />
    <property name="env.windir" value="C:\Windows" />
    <property name="env.CommonProgramFiles(x86)" value="C:\Program Files (x86)\Common Files" />
    <property name="os.name" value="Windows 7" />
    <property name="java.specification.vendor" value="Sun Microsystems Inc." />
    <property name="env.TMP" value="C:\Users\DTT-777\AppData\Local\Temp" />
    <property name="java.vm.name" value="Java HotSpot(TM) Client VM" />
    <property name="env.ProgramData" value="C:\ProgramData" />
    <property name="ant.file.eProject-SemIV-portlet" value="G:\liferay-plugins-sdk-6.1.0-ce-b4-20111118\portlets\eProject-SemIV\build.xml" />
    <property name="plugin.jars" value="${plugin-package.portal-dependency-jars}" />
    <property name="env.OS" value="Windows_NT" />
    <property name="os.apple" value="Mac OS X" />
    <property name="plugin-package.author" value="Liferay, Inc." />
    <property name="java.library.path" value="G:\liferay-portal-6.1.0-ce-ga1\tomcat-7.0.23\jre1.6.0_20\win\bin;.;C:\Windows\Sun\Java\bin;C:\Windows\system32;C:\Windows;C:/Program Files (x86)/Java/jre7/bin/client;C:/Program Files (x86)/Java/jre7/bin;C:/Program Files (x86)/Java/jre7/lib/i386;C:\Windows\system32;C:\Windows;C:\Windows\System32\Wbem;C:\Windows\System32\WindowsPowerShell\v1.0\;C:\Program Files\TortoiseSVN\bin;C:\Program Files\TortoiseGit\bin;F:\apache-maven-3.2.2\bin;G:\apache-ant-1.9.4\bin;C:\Program Files (x86)\Java\jdk1.7.0_67\bin;G:\liferay -eclipse;" />
    <property name="correct.ant.version" value="true" />
    <property name="plugin-package.name" value="EProject SemIV" />
    <property name="eclipse.pdebuild.scripts" value="/G:/liferay -eclipse/plugins/org.eclipse.pde.build_3.7.0.v20111116-2009/scripts/" />
    <property name="ant.java.version" value="1.6" />
    <property name="external-properties" value="${test.properties}" />
    <property name="basedir" value="G:\liferay-plugins-sdk-6.1.0-ce-b4-20111118\portlets\eProject-SemIV" />
    <property name="java.class.version" value="50.0" />
    <property name="database.types" value="db2,derby,firebird,hypersonic,informix,ingres,interbase,jdatastore,mysql,oracle,postgresql,sap,sqlserver,sybase" />
    <property name="javac.nowarn" value="on" />
    <property name="ant.home" value="G:\liferay -eclipse\plugins\org.apache.ant_1.8.2.v20120109-1030" />
    <property name="env.Path" value="C:/Program Files (x86)/Java/jre7/bin/client;C:/Program Files (x86)/Java/jre7/bin;C:/Program Files (x86)/Java/jre7/lib/i386;C:\Windows\system32;C:\Windows;C:\Windows\System32\Wbem;C:\Windows\System32\WindowsPowerShell\v1.0\;C:\Program Files\TortoiseSVN\bin;C:\Program Files\TortoiseGit\bin;F:\apache-maven-3.2.2\bin;G:\apache-ant-1.9.4\bin;C:\Program Files (x86)\Java\jdk1.7.0_67\bin;G:\liferay -eclipse;" />
    <property name="plugin-package.module-incremental-version" value="1" />
    <property name="env.HOMEDRIVE" value="C:" />
    <property name="plugin-package.change-log" value="" />
    <property name="sun.boot.library.path" value="G:\liferay-portal-6.1.0-ce-ga1\tomcat-7.0.23\jre1.6.0_20\win\bin" />
    <property name="plugins.includes" value="*" />
    <property name="env.PROCESSOR_REVISION" value="3c03" />
    <property name="sun.management.compiler" value="HotSpot Client Compiler" />
    <property name="java.awt.graphicsenv" value="sun.awt.Win32GraphicsEnvironment" />
    <property name="user.variant" value="" />
    <property name="plugins.ear.includes" value="tunnel-web" />
    <property name="os.unix" value="Linux,FreeBSD,Solaris,SunOS" />
    <property name="required.portal.jars" value="commons-logging.jar,log4j.jar,util-bridges.jar,util-java.jar,util-taglib.jar" />
    <property name="ant.project.name" value="eProject-SemIV-portlet" />
    <property name="java.vm.specification.version" value="1.0" />
    <property name="auto.deploy.dir" value="G:\liferay-portal-6.1.0-ce-ga1\tomcat-7.0.23/../deploy" />
    <property name="awt.toolkit" value="sun.awt.windows.WToolkit" />
    <property name="env.MAVEN_HOME" value="F:\apache-maven-3.2.2" />
    <property name="sun.cpu.isalist" value="pentium_pro+mmx pentium_pro pentium+mmx pentium i486 i386 i86" />
    <property name="java.ext.dirs" value="G:\liferay-portal-6.1.0-ce-ga1\tomcat-7.0.23\jre1.6.0_20\win\lib\ext;C:\Windows\Sun\Java\lib\ext" />
    <property name="os.version" value="6.1" />
    <property name="user.home" value="C:\Users\DTT-777" />
    <property name="java.vm.vendor" value="Sun Microsystems Inc." />
    <property name="env.CommonProgramW6432" value="C:\Program Files\Common Files" />
    <property name="env.JAVA_HOME" value="C:\Program Files (x86)\Java\jdk1.7.0_67" />
    <property name="env.ProgramW6432" value="C:\Program Files" />
    <property name="plugin-package.licenses" value="LGPL" />
    <property name="user.dir" value="G:\liferay-plugins-sdk-6.1.0-ce-b4-20111118" />
    <property name="auto.deploy.unpack.war" value="true" />
    <property name="env.FP_NO_HOST_CHECK" value="NO" />
    <property name="sun.cpu.endian" value="little" />
    <property name="ant.file.type.build-common-plugin" value="file" />
    <property name="env.ALLUSERSPROFILE" value="C:\ProgramData" />
    <property name="project.dir" value="../.." />
    <property name="ant.build.javac.target" value="1.6" />
    <property name="env.PROCESSOR_ARCHITECTURE" value="x86" />
    <property name="java.vm.version" value="16.3-b01" />
    <property name="java.class.path" value="G:\liferay-plugins-sdk-6.1.0-ce-b4-20111118\portlets\eProject-SemIV\docroot\WEB-INF\lib\commons-logging.jar;G:\liferay-plugins-sdk-6.1.0-ce-b4-20111118\portlets\eProject-SemIV\docroot\WEB-INF\lib\eProject-SemIV-portlet-service.jar;G:\liferay-plugins-sdk-6.1.0-ce-b4-20111118\portlets\eProject-SemIV\docroot\WEB-INF\lib\jstl-api.jar;G:\liferay-plugins-sdk-6.1.0-ce-b4-20111118\portlets\eProject-SemIV\docroot\WEB-INF\lib\jstl-impl.jar;G:\liferay-plugins-sdk-6.1.0-ce-b4-20111118\portlets\eProject-SemIV\docroot\WEB-INF\lib\jstl.jar;G:\liferay-plugins-sdk-6.1.0-ce-b4-20111118\portlets\eProject-SemIV\docroot\WEB-INF\lib\log4j.jar;G:\liferay-plugins-sdk-6.1.0-ce-b4-20111118\portlets\eProject-SemIV\docroot\WEB-INF\lib\portal-compat-client.jar;G:\liferay-plugins-sdk-6.1.0-ce-b4-20111118\portlets\eProject-SemIV\docroot\WEB-INF\lib\util-bridges.jar;G:\liferay-plugins-sdk-6.1.0-ce-b4-20111118\portlets\eProject-SemIV\docroot\WEB-INF\lib\util-java.jar;G:\liferay-plugins-sdk-6.1.0-ce-b4-20111118\portlets\eProject-SemIV\docroot\WEB-INF\lib\util-taglib.jar;G:\liferay-plugins-sdk-6.1.0-ce-b4-20111118\portlets\eProject-SemIV\docroot\WEB-INF\classes;G:\liferay-portal-6.1.0-ce-ga1\tomcat-7.0.23\lib\ext\activation.jar;G:\liferay-portal-6.1.0-ce-ga1\tomcat-7.0.23\lib\ext\ccpp.jar;G:\liferay-portal-6.1.0-ce-ga1\tomcat-7.0.23\lib\ext\hsql.jar;G:\liferay-portal-6.1.0-ce-ga1\tomcat-7.0.23\lib\ext\jms.jar;G:\liferay-portal-6.1.0-ce-ga1\tomcat-7.0.23\lib\ext\jta.jar;G:\liferay-portal-6.1.0-ce-ga1\tomcat-7.0.23\lib\ext\jtds.jar;G:\liferay-portal-6.1.0-ce-ga1\tomcat-7.0.23\lib\ext\jutf7.jar;G:\liferay-portal-6.1.0-ce-ga1\tomcat-7.0.23\lib\ext\mail.jar;G:\liferay-portal-6.1.0-ce-ga1\tomcat-7.0.23\lib\ext\mysql.jar;G:\liferay-portal-6.1.0-ce-ga1\tomcat-7.0.23\lib\ext\persistence.jar;G:\liferay-portal-6.1.0-ce-ga1\tomcat-7.0.23\lib\ext\portal-service.jar;G:\liferay-portal-6.1.0-ce-ga1\tomcat-7.0.23\lib\ext\portlet.jar;G:\liferay-portal-6.1.0-ce-ga1\tomcat-7.0.23\lib\ext\postgresql.jar;G:\liferay-portal-6.1.0-ce-ga1\tomcat-7.0.23\lib\ext\support-tomcat.jar;G:\liferay-portal-6.1.0-ce-ga1\tomcat-7.0.23\webapps\ROOT\WEB-INF\lib\commons-logging.jar;G:\liferay-portal-6.1.0-ce-ga1\tomcat-7.0.23\webapps\ROOT\WEB-INF\lib\log4j.jar;G:\liferay-portal-6.1.0-ce-ga1\tomcat-7.0.23\webapps\ROOT\WEB-INF\lib\util-bridges.jar;G:\liferay-portal-6.1.0-ce-ga1\tomcat-7.0.23\webapps\ROOT\WEB-INF\lib\util-java.jar;G:\liferay-portal-6.1.0-ce-ga1\tomcat-7.0.23\webapps\ROOT\WEB-INF\lib\util-taglib.jar;G:\liferay-plugins-sdk-6.1.0-ce-b4-20111118\lib\activation.jar;G:\liferay-plugins-sdk-6.1.0-ce-b4-20111118\lib\jsp-api.jar;G:\liferay-plugins-sdk-6.1.0-ce-b4-20111118\lib\mail.jar;G:\liferay-plugins-sdk-6.1.0-ce-b4-20111118\lib\servlet-api.jar;G:\liferay-portal-6.1.0-ce-ga1\tomcat-7.0.23\webapps\ROOT\WEB-INF\lib\commons-io.jar;G:\liferay-plugins-sdk-6.1.0-ce-b4-20111118\lib\junit.jar;G:\liferay-plugins-sdk-6.1.0-ce-b4-20111118\portlets\eProject-SemIV\test-classes;G:\liferay -eclipse\plugins\org.apache.ant_1.8.2.v20120109-1030\lib\ant-launcher.jar;G:\liferay -eclipse\plugins\org.apache.ant_1.8.2.v20120109-1030\lib\ant.jar;G:\liferay -eclipse\plugins\org.apache.ant_1.8.2.v20120109-1030\lib\ant-junit.jar;G:\liferay -eclipse\plugins\org.apache.ant_1.8.2.v20120109-1030\lib\ant-junit4.jar" />
    <property name="env.HOMEPATH" value="\Users\DTT-777" />
    <property name="ant.library.dir" value="G:\liferay -eclipse\plugins\org.apache.ant_1.8.2.v20120109-1030\lib" />
    <property name="os.arch" value="x86" />
    <property name="plugin.name" value="eProject-SemIV" />
    <property name="javac.deprecation" value="off" />
    <property name="os.windows" value="Windows 95,Windows 98,Windows NT,Windows 2000,Windows 2003,Windows XP,Windows Vista,Windows 7" />
    <property name="ant.build.javac.source" value="1.6" />
    <property name="env.SESSIONNAME" value="Console" />
    <property name="sun.java.launcher" value="SUN_STANDARD" />
    <property name="env.CommonProgramFiles" value="C:\Program Files (x86)\Common Files" />
    <property name="ant.core.lib" value="G:\liferay -eclipse\plugins\org.apache.ant_1.8.2.v20120109-1030\lib\ant.jar" />
    <property name="env.ProgramFiles" value="C:\Program Files (x86)" />
    <property name="app.server.dir" value="G:\liferay-portal-6.1.0-ce-ga1\tomcat-7.0.23" />
    <property name="java.vm.specification.vendor" value="Sun Microsystems Inc." />
    <property name="ant.file.build-common" value="G:\liferay-plugins-sdk-6.1.0-ce-b4-20111118\build-common.xml" />
    <property name="file.separator" value="\" />
    <property name="java.runtime.version" value="1.6.0_20-b02" />
    <property name="sun.boot.class.path" value="G:\liferay-portal-6.1.0-ce-ga1\tomcat-7.0.23\jre1.6.0_20\win\lib\resources.jar;G:\liferay-portal-6.1.0-ce-ga1\tomcat-7.0.23\jre1.6.0_20\win\lib\rt.jar;G:\liferay-portal-6.1.0-ce-ga1\tomcat-7.0.23\jre1.6.0_20\win\lib\sunrsasign.jar;G:\liferay-portal-6.1.0-ce-ga1\tomcat-7.0.23\jre1.6.0_20\win\lib\jsse.jar;G:\liferay-portal-6.1.0-ce-ga1\tomcat-7.0.23\jre1.6.0_20\win\lib\jce.jar;G:\liferay-portal-6.1.0-ce-ga1\tomcat-7.0.23\jre1.6.0_20\win\lib\charsets.jar;G:\liferay-portal-6.1.0-ce-ga1\tomcat-7.0.23\jre1.6.0_20\win\classes" />
    <property name="plugin.version" value="1" />
    <property name="env.ComSpec" value="C:\Windows\system32\cmd.exe" />
    <property name="app.server.classes.portal.dir" value="G:\liferay-portal-6.1.0-ce-ga1\tomcat-7.0.23\webapps\ROOT/WEB-INF/classes" />
    <property name="plugin.name.beginindex" value="53" />
    <property name="ant.file.type.build-common-portlet" value="file" />
    <property name="env.TEMP" value="C:\Users\DTT-777\AppData\Local\Temp" />
    <property name="user.country" value="US" />
    <property name="env.ANT_HOME" value="G:\liferay -eclipse\plugins\org.apache.ant_1.8.2.v20120109-1030" />
    <property name="java.vendor" value="Sun Microsystems Inc." />
    <property name="javac.memoryMaximumSize" value="3072M" />
    <property name="plugin-package.short-description" value="" />
    <property name="env.PSModulePath" value="C:\Windows\system32\WindowsPowerShell\v1.0\Modules\" />
    <property name="ant.file.type.eProject-SemIV-portlet" value="file" />
    <property name="java.specification.version" value="1.6" />
    <property name="app.server.lib.global.dir" value="G:\liferay-portal-6.1.0-ce-ga1\tomcat-7.0.23\lib\ext" />
    <property name="sun.arch.data.model" value="32" />
  </properties>
  <testcase classname="com.minhnd.unit.test.location.LocationUnitTest" name="testLocation" time="0.016">
    <failure message="Init failed..." type="junit.framework.AssertionFailedError">junit.framework.AssertionFailedError: Init failed...
	at com.minhnd.unit.test.location.LocationUnitTest.setUp(LocationUnitTest.java:41)
</failure>
  </testcase>
  <system-out><![CDATA[>>>SET UP
]]></system-out>
  <system-err><![CDATA[Sep 15, 2014 4:32:09 AM com.liferay.portal.kernel.log.Jdk14LogImpl info
INFO: Unable to locate deployment context from portlet properties
Sep 15, 2014 4:32:09 AM com.liferay.portal.kernel.log.Jdk14LogImpl error
SEVERE: java.lang.NullPointerException
java.lang.NullPointerException
	at com.liferay.portal.kernel.util.MethodCache._get(MethodCache.java:110)
	at com.liferay.portal.kernel.util.MethodCache.get(MethodCache.java:62)
	at com.liferay.portal.kernel.util.MethodHandler.invoke(MethodHandler.java:63)
	at com.liferay.portal.kernel.util.PortalClassInvoker.invoke(PortalClassInvoker.java:42)
	at com.liferay.portal.kernel.util.PropsUtil.get(PropsUtil.java:32)
	at com.minhnd.service.ClpSerializer.getServletContextName(ClpSerializer.java:74)
	at com.minhnd.service.LocationLocalServiceUtil.getService(LocationLocalServiceUtil.java:343)
	at com.minhnd.unit.test.location.LocationUnitTest.setUp(LocationUnitTest.java:35)
	at junit.framework.TestCase.runBare(TestCase.java:132)
	at junit.framework.TestResult$1.protect(TestResult.java:110)
	at junit.framework.TestResult.runProtected(TestResult.java:128)
	at junit.framework.TestResult.run(TestResult.java:113)
	at junit.framework.TestCase.run(TestCase.java:124)
	at junit.framework.TestSuite.runTest(TestSuite.java:232)
	at junit.framework.TestSuite.run(TestSuite.java:227)
	at org.apache.tools.ant.taskdefs.optional.junit.JUnitTestRunner.run(JUnitTestRunner.java:518)
	at org.apache.tools.ant.taskdefs.optional.junit.JUnitTestRunner.launch(JUnitTestRunner.java:1052)
	at org.apache.tools.ant.taskdefs.optional.junit.JUnitTestRunner.main(JUnitTestRunner.java:906)
Sep 15, 2014 4:32:09 AM com.liferay.portal.kernel.log.Jdk14LogImpl error
SEVERE: BeanLocator is null for servlet context eProject-SemIV-portlet
com.liferay.portal.kernel.bean.BeanLocatorException: BeanLocator has not been set for servlet context eProject-SemIV-portlet
	at com.liferay.portal.kernel.bean.PortletBeanLocatorUtil.locate(PortletBeanLocatorUtil.java:42)
	at com.minhnd.service.LocationLocalServiceUtil.getService(LocationLocalServiceUtil.java:343)
	at com.minhnd.unit.test.location.LocationUnitTest.setUp(LocationUnitTest.java:35)
	at junit.framework.TestCase.runBare(TestCase.java:132)
	at junit.framework.TestResult$1.protect(TestResult.java:110)
	at junit.framework.TestResult.runProtected(TestResult.java:128)
	at junit.framework.TestResult.run(TestResult.java:113)
	at junit.framework.TestCase.run(TestCase.java:124)
	at junit.framework.TestSuite.runTest(TestSuite.java:232)
	at junit.framework.TestSuite.run(TestSuite.java:227)
	at org.apache.tools.ant.taskdefs.optional.junit.JUnitTestRunner.run(JUnitTestRunner.java:518)
	at org.apache.tools.ant.taskdefs.optional.junit.JUnitTestRunner.launch(JUnitTestRunner.java:1052)
	at org.apache.tools.ant.taskdefs.optional.junit.JUnitTestRunner.main(JUnitTestRunner.java:906)
]]></system-err>
</testsuite>
