module gitlab.com/brownfield-dev/public/meep-meep

go 1.14

require (
	github.com/coreos/pkg v0.0.0-20180928190104-399ea9e2e55f
	github.com/dghubble/go-twitter v0.0.0-20190719072343-39e5462e111f
	github.com/dghubble/oauth1 v0.6.0
)
