{
  "REACT_APP_AUTH0_DOMAIN": "dev-ffi5wgu5.eu.auth0.com",
  "REACT_APP_AUTH0_CLIENT_ID": "bLoVBnJCDPDAEsDwdUsYNYIXlhSgoKg6",
  "REACT_APP_AUTH0_AUDIENCE": "https://doggobox.fr",
  "REACT_APP_AUTH0_CONNECTION": "doggobox",
  "REACT_APP_DOGGOBOX_URL": "https://review-doggobox.dogride.fr",
  "REACT_APP_APM_URL": "https://apm.broken.fr",
  "REACT_APP_APM_ENV": "dev"
}

