run_id,platform,workload_type,workload_size,rep_id,startup_time_us,completion_time_us,running_time_us,stop_time_us,http_metrics
1,CONTAINERED_WASMER,FIB_RECURSIVE,SMALL,0,323020,440507,117487,,
2,CONTAINERED_WASMER,FIB_RECURSIVE,SMALL,1,315813,464216,148403,,
3,CONTAINERED_WASMER,FIB_RECURSIVE,SMALL,2,323275,467875,144600,,
4,CONTAINERED_WASMER,FIB_RECURSIVE,SMALL,3,353655,496708,143053,,
5,CONTAINERED_WASMER,FIB_RECURSIVE,SMALL,4,339034,502747,163713,,
6,CONTAINERED_WASMER,FIB_RECURSIVE,SMALL,5,340162,465628,125466,,
7,CONTAINERED_WASMER,FIB_RECURSIVE,SMALL,6,417941,555330,137389,,
8,CONTAINERED_WASMER,FIB_RECURSIVE,SMALL,7,352138,515286,163148,,
9,CONTAINERED_WASMER,FIB_RECURSIVE,SMALL,8,355433,504532,149099,,
10,CONTAINERED_WASMER,FIB_RECURSIVE,SMALL,9,342912,490868,147956,,
11,CONTAINERED_WASMER,FIB_RECURSIVE,SMALL,10,366364,508523,142159,,
12,CONTAINERED_WASMER,FIB_RECURSIVE,SMALL,11,376066,506914,130848,,
13,CONTAINERED_WASMER,FIB_RECURSIVE,SMALL,12,354208,501413,147205,,
14,CONTAINERED_WASMER,FIB_RECURSIVE,SMALL,13,376574,539618,163044,,
15,CONTAINERED_WASMER,FIB_RECURSIVE,SMALL,14,351604,491206,139602,,
16,CONTAINERED_WASMER,FIB_RECURSIVE,SMALL,15,350823,503805,152982,,
17,CONTAINERED_WASMER,FIB_RECURSIVE,SMALL,16,342817,475563,132746,,
18,CONTAINERED_WASMER,FIB_RECURSIVE,SMALL,17,361645,530378,168733,,
19,CONTAINERED_WASMER,FIB_RECURSIVE,SMALL,18,371897,516990,145093,,
20,CONTAINERED_WASMER,FIB_RECURSIVE,SMALL,19,357373,508505,151132,,
21,CONTAINERED_WASMER,FIB_RECURSIVE,SMALL,20,388917,525444,136527,,
22,CONTAINERED_WASMER,FIB_RECURSIVE,SMALL,21,360131,500317,140186,,
23,CONTAINERED_WASMER,FIB_RECURSIVE,SMALL,22,399354,540221,140867,,
24,CONTAINERED_WASMER,FIB_RECURSIVE,SMALL,23,379895,534944,155049,,
25,CONTAINERED_WASMER,FIB_RECURSIVE,SMALL,24,362548,517305,154757,,
26,CONTAINERED_WASMER,FIB_RECURSIVE,MEDIUM,0,365703,805960,440257,,
27,CONTAINERED_WASMER,FIB_RECURSIVE,MEDIUM,1,380174,790828,410654,,
28,CONTAINERED_WASMER,FIB_RECURSIVE,MEDIUM,2,362130,807291,445161,,
29,CONTAINERED_WASMER,FIB_RECURSIVE,MEDIUM,3,360186,787266,427080,,
30,CONTAINERED_WASMER,FIB_RECURSIVE,MEDIUM,4,342243,770242,427999,,
31,CONTAINERED_WASMER,FIB_RECURSIVE,MEDIUM,5,348745,782834,434089,,
32,CONTAINERED_WASMER,FIB_RECURSIVE,MEDIUM,6,391933,800776,408843,,
33,CONTAINERED_WASMER,FIB_RECURSIVE,MEDIUM,7,376289,810677,434388,,
34,CONTAINERED_WASMER,FIB_RECURSIVE,MEDIUM,8,332072,737079,405007,,
35,CONTAINERED_WASMER,FIB_RECURSIVE,MEDIUM,9,389865,785281,395416,,
36,CONTAINERED_WASMER,FIB_RECURSIVE,MEDIUM,10,404990,830247,425257,,
37,CONTAINERED_WASMER,FIB_RECURSIVE,MEDIUM,11,335729,745992,410263,,
38,CONTAINERED_WASMER,FIB_RECURSIVE,MEDIUM,12,346858,771732,424874,,
39,CONTAINERED_WASMER,FIB_RECURSIVE,MEDIUM,13,367219,772784,405565,,
40,CONTAINERED_WASMER,FIB_RECURSIVE,MEDIUM,14,347857,770690,422833,,
41,CONTAINERED_WASMER,FIB_RECURSIVE,MEDIUM,15,370479,766776,396297,,
42,CONTAINERED_WASMER,FIB_RECURSIVE,MEDIUM,16,356294,785719,429425,,
43,CONTAINERED_WASMER,FIB_RECURSIVE,MEDIUM,17,358012,803904,445892,,
44,CONTAINERED_WASMER,FIB_RECURSIVE,MEDIUM,18,334740,753387,418647,,
45,CONTAINERED_WASMER,FIB_RECURSIVE,MEDIUM,19,383160,802853,419693,,
46,CONTAINERED_WASMER,FIB_RECURSIVE,MEDIUM,20,354986,763790,408804,,
47,CONTAINERED_WASMER,FIB_RECURSIVE,MEDIUM,21,363414,792312,428898,,
48,CONTAINERED_WASMER,FIB_RECURSIVE,MEDIUM,22,335507,736036,400529,,
49,CONTAINERED_WASMER,FIB_RECURSIVE,MEDIUM,23,362164,767058,404894,,
50,CONTAINERED_WASMER,FIB_RECURSIVE,MEDIUM,24,345726,779816,434090,,
51,CONTAINERED_WASMER,FIB_RECURSIVE,LARGE,0,396798,3514031,3117233,,
52,CONTAINERED_WASMER,FIB_RECURSIVE,LARGE,1,367298,3459427,3092129,,
53,CONTAINERED_WASMER,FIB_RECURSIVE,LARGE,2,386714,3498347,3111633,,
54,CONTAINERED_WASMER,FIB_RECURSIVE,LARGE,3,352596,3507666,3155070,,
55,CONTAINERED_WASMER,FIB_RECURSIVE,LARGE,4,396438,3568615,3172177,,
56,CONTAINERED_WASMER,FIB_RECURSIVE,LARGE,5,341995,3460473,3118478,,
57,CONTAINERED_WASMER,FIB_RECURSIVE,LARGE,6,371137,3541512,3170375,,
58,CONTAINERED_WASMER,FIB_RECURSIVE,LARGE,7,343272,3477522,3134250,,
59,CONTAINERED_WASMER,FIB_RECURSIVE,LARGE,8,407885,3545296,3137411,,
60,CONTAINERED_WASMER,FIB_RECURSIVE,LARGE,9,351560,3475841,3124281,,
61,CONTAINERED_WASMER,FIB_RECURSIVE,LARGE,10,378779,3565615,3186836,,
62,CONTAINERED_WASMER,FIB_RECURSIVE,LARGE,11,335816,3541966,3206150,,
63,CONTAINERED_WASMER,FIB_RECURSIVE,LARGE,12,332575,3496344,3163769,,
64,CONTAINERED_WASMER,FIB_RECURSIVE,LARGE,13,347150,3487167,3140017,,
65,CONTAINERED_WASMER,FIB_RECURSIVE,LARGE,14,364933,3514962,3150029,,
66,CONTAINERED_WASMER,FIB_RECURSIVE,LARGE,15,372203,3517650,3145447,,
67,CONTAINERED_WASMER,FIB_RECURSIVE,LARGE,16,353526,3544246,3190720,,
68,CONTAINERED_WASMER,FIB_RECURSIVE,LARGE,17,391630,3523398,3131768,,
69,CONTAINERED_WASMER,FIB_RECURSIVE,LARGE,18,344258,3460369,3116111,,
70,CONTAINERED_WASMER,FIB_RECURSIVE,LARGE,19,396486,3557157,3160671,,
71,CONTAINERED_WASMER,FIB_RECURSIVE,LARGE,20,361989,3461915,3099926,,
72,CONTAINERED_WASMER,FIB_RECURSIVE,LARGE,21,380164,3633569,3253405,,
73,CONTAINERED_WASMER,FIB_RECURSIVE,LARGE,22,362084,3539066,3176982,,
74,CONTAINERED_WASMER,FIB_RECURSIVE,LARGE,23,383720,3604212,3220492,,
75,CONTAINERED_WASMER,FIB_RECURSIVE,LARGE,24,336830,3571982,3235152,,
76,CONTAINERED_WASMER,FIB_ITERATIVE,SMALL,0,370417,522631,152214,,
77,CONTAINERED_WASMER,FIB_ITERATIVE,SMALL,1,365841,514042,148201,,
78,CONTAINERED_WASMER,FIB_ITERATIVE,SMALL,2,323911,477446,153535,,
79,CONTAINERED_WASMER,FIB_ITERATIVE,SMALL,3,331009,465007,133998,,
80,CONTAINERED_WASMER,FIB_ITERATIVE,SMALL,4,369008,516970,147962,,
81,CONTAINERED_WASMER,FIB_ITERATIVE,SMALL,5,366927,510038,143111,,
82,CONTAINERED_WASMER,FIB_ITERATIVE,SMALL,6,366226,500759,134533,,
83,CONTAINERED_WASMER,FIB_ITERATIVE,SMALL,7,338326,484459,146133,,
84,CONTAINERED_WASMER,FIB_ITERATIVE,SMALL,8,332914,484200,151286,,
85,CONTAINERED_WASMER,FIB_ITERATIVE,SMALL,9,387361,535621,148260,,
86,CONTAINERED_WASMER,FIB_ITERATIVE,SMALL,10,346173,499256,153083,,
87,CONTAINERED_WASMER,FIB_ITERATIVE,SMALL,11,377013,510207,133194,,
88,CONTAINERED_WASMER,FIB_ITERATIVE,SMALL,12,383977,536893,152916,,
89,CONTAINERED_WASMER,FIB_ITERATIVE,SMALL,13,358965,520483,161518,,
90,CONTAINERED_WASMER,FIB_ITERATIVE,SMALL,14,395220,535737,140517,,
91,CONTAINERED_WASMER,FIB_ITERATIVE,SMALL,15,342745,536886,194141,,
92,CONTAINERED_WASMER,FIB_ITERATIVE,SMALL,16,319412,471103,151691,,
93,CONTAINERED_WASMER,FIB_ITERATIVE,SMALL,17,345599,497500,151901,,
94,CONTAINERED_WASMER,FIB_ITERATIVE,SMALL,18,357511,498013,140502,,
95,CONTAINERED_WASMER,FIB_ITERATIVE,SMALL,19,361201,505535,144334,,
96,CONTAINERED_WASMER,FIB_ITERATIVE,SMALL,20,368536,518353,149817,,
97,CONTAINERED_WASMER,FIB_ITERATIVE,SMALL,21,347804,484863,137059,,
98,CONTAINERED_WASMER,FIB_ITERATIVE,SMALL,22,369522,525973,156451,,
99,CONTAINERED_WASMER,FIB_ITERATIVE,SMALL,23,333455,488207,154752,,
100,CONTAINERED_WASMER,FIB_ITERATIVE,SMALL,24,364703,507762,143059,,
101,CONTAINERED_WASMER,FIB_ITERATIVE,MEDIUM,0,344061,495421,151360,,
102,CONTAINERED_WASMER,FIB_ITERATIVE,MEDIUM,1,343450,479395,135945,,
103,CONTAINERED_WASMER,FIB_ITERATIVE,MEDIUM,2,366968,522449,155481,,
104,CONTAINERED_WASMER,FIB_ITERATIVE,MEDIUM,3,382322,517441,135119,,
105,CONTAINERED_WASMER,FIB_ITERATIVE,MEDIUM,4,343805,505391,161586,,
106,CONTAINERED_WASMER,FIB_ITERATIVE,MEDIUM,5,328857,478280,149423,,
107,CONTAINERED_WASMER,FIB_ITERATIVE,MEDIUM,6,365889,510445,144556,,
108,CONTAINERED_WASMER,FIB_ITERATIVE,MEDIUM,7,337313,502404,165091,,
109,CONTAINERED_WASMER,FIB_ITERATIVE,MEDIUM,8,342061,479426,137365,,
110,CONTAINERED_WASMER,FIB_ITERATIVE,MEDIUM,9,357503,517024,159521,,
111,CONTAINERED_WASMER,FIB_ITERATIVE,MEDIUM,10,366682,516715,150033,,
112,CONTAINERED_WASMER,FIB_ITERATIVE,MEDIUM,11,335828,502665,166837,,
113,CONTAINERED_WASMER,FIB_ITERATIVE,MEDIUM,12,336282,480747,144465,,
114,CONTAINERED_WASMER,FIB_ITERATIVE,MEDIUM,13,356303,522487,166184,,
115,CONTAINERED_WASMER,FIB_ITERATIVE,MEDIUM,14,364821,509319,144498,,
116,CONTAINERED_WASMER,FIB_ITERATIVE,MEDIUM,15,334041,487880,153839,,
117,CONTAINERED_WASMER,FIB_ITERATIVE,MEDIUM,16,346659,499788,153129,,
118,CONTAINERED_WASMER,FIB_ITERATIVE,MEDIUM,17,377114,527586,150472,,
119,CONTAINERED_WASMER,FIB_ITERATIVE,MEDIUM,18,521703,676191,154488,,
120,CONTAINERED_WASMER,FIB_ITERATIVE,MEDIUM,19,348455,496376,147921,,
121,CONTAINERED_WASMER,FIB_ITERATIVE,MEDIUM,20,366111,515093,148982,,
122,CONTAINERED_WASMER,FIB_ITERATIVE,MEDIUM,21,344068,503502,159434,,
123,CONTAINERED_WASMER,FIB_ITERATIVE,MEDIUM,22,345298,499619,154321,,
124,CONTAINERED_WASMER,FIB_ITERATIVE,MEDIUM,23,355051,507988,152937,,
125,CONTAINERED_WASMER,FIB_ITERATIVE,MEDIUM,24,377441,534421,156980,,
126,CONTAINERED_WASMER,FIB_ITERATIVE,LARGE,0,360752,515785,155033,,
127,CONTAINERED_WASMER,FIB_ITERATIVE,LARGE,1,319209,487450,168241,,
128,CONTAINERED_WASMER,FIB_ITERATIVE,LARGE,2,320308,472794,152486,,
129,CONTAINERED_WASMER,FIB_ITERATIVE,LARGE,3,357551,523699,166148,,
130,CONTAINERED_WASMER,FIB_ITERATIVE,LARGE,4,340424,493217,152793,,
131,CONTAINERED_WASMER,FIB_ITERATIVE,LARGE,5,364466,508146,143680,,
132,CONTAINERED_WASMER,FIB_ITERATIVE,LARGE,6,341335,494956,153621,,
133,CONTAINERED_WASMER,FIB_ITERATIVE,LARGE,7,390506,549899,159393,,
134,CONTAINERED_WASMER,FIB_ITERATIVE,LARGE,8,343690,494991,151301,,
135,CONTAINERED_WASMER,FIB_ITERATIVE,LARGE,9,320936,472340,151404,,
136,CONTAINERED_WASMER,FIB_ITERATIVE,LARGE,10,344084,489839,145755,,
137,CONTAINERED_WASMER,FIB_ITERATIVE,LARGE,11,334457,497262,162805,,
138,CONTAINERED_WASMER,FIB_ITERATIVE,LARGE,12,351719,507715,155996,,
139,CONTAINERED_WASMER,FIB_ITERATIVE,LARGE,13,372227,559661,187434,,
140,CONTAINERED_WASMER,FIB_ITERATIVE,LARGE,14,353589,490848,137259,,
141,CONTAINERED_WASMER,FIB_ITERATIVE,LARGE,15,366101,523299,157198,,
142,CONTAINERED_WASMER,FIB_ITERATIVE,LARGE,16,366798,511336,144538,,
143,CONTAINERED_WASMER,FIB_ITERATIVE,LARGE,17,348841,511923,163082,,
144,CONTAINERED_WASMER,FIB_ITERATIVE,LARGE,18,354108,504484,150376,,
145,CONTAINERED_WASMER,FIB_ITERATIVE,LARGE,19,362582,521980,159398,,
146,CONTAINERED_WASMER,FIB_ITERATIVE,LARGE,20,352400,509584,157184,,
147,CONTAINERED_WASMER,FIB_ITERATIVE,LARGE,21,360248,498485,138237,,
148,CONTAINERED_WASMER,FIB_ITERATIVE,LARGE,22,328691,490648,161957,,
149,CONTAINERED_WASMER,FIB_ITERATIVE,LARGE,23,335610,473821,138211,,
150,CONTAINERED_WASMER,FIB_ITERATIVE,LARGE,24,350743,492280,141537,,
151,CONTAINERED_WASMTIME,FIB_RECURSIVE,SMALL,0,326602,469660,143058,,
152,CONTAINERED_WASMTIME,FIB_RECURSIVE,SMALL,1,357460,527828,170368,,
153,CONTAINERED_WASMTIME,FIB_RECURSIVE,SMALL,2,366899,500933,134034,,
154,CONTAINERED_WASMTIME,FIB_RECURSIVE,SMALL,3,355569,498111,142542,,
155,CONTAINERED_WASMTIME,FIB_RECURSIVE,SMALL,4,367236,493729,126493,,
156,CONTAINERED_WASMTIME,FIB_RECURSIVE,SMALL,5,354700,500614,145914,,
157,CONTAINERED_WASMTIME,FIB_RECURSIVE,SMALL,6,349082,511353,162271,,
158,CONTAINERED_WASMTIME,FIB_RECURSIVE,SMALL,7,365948,510581,144633,,
159,CONTAINERED_WASMTIME,FIB_RECURSIVE,SMALL,8,359096,504616,145520,,
160,CONTAINERED_WASMTIME,FIB_RECURSIVE,SMALL,9,374541,514451,139910,,
161,CONTAINERED_WASMTIME,FIB_RECURSIVE,SMALL,10,384416,524411,139995,,
162,CONTAINERED_WASMTIME,FIB_RECURSIVE,SMALL,11,362028,513696,151668,,
163,CONTAINERED_WASMTIME,FIB_RECURSIVE,SMALL,12,351107,495416,144309,,
164,CONTAINERED_WASMTIME,FIB_RECURSIVE,SMALL,13,342060,474498,132438,,
165,CONTAINERED_WASMTIME,FIB_RECURSIVE,SMALL,14,364323,524681,160358,,
166,CONTAINERED_WASMTIME,FIB_RECURSIVE,SMALL,15,352545,504997,152452,,
167,CONTAINERED_WASMTIME,FIB_RECURSIVE,SMALL,16,378647,525616,146969,,
168,CONTAINERED_WASMTIME,FIB_RECURSIVE,SMALL,17,356522,496619,140097,,
169,CONTAINERED_WASMTIME,FIB_RECURSIVE,SMALL,18,337515,511347,173832,,
170,CONTAINERED_WASMTIME,FIB_RECURSIVE,SMALL,19,325676,465695,140019,,
171,CONTAINERED_WASMTIME,FIB_RECURSIVE,SMALL,20,361549,511479,149930,,
172,CONTAINERED_WASMTIME,FIB_RECURSIVE,SMALL,21,329056,522667,193611,,
173,CONTAINERED_WASMTIME,FIB_RECURSIVE,SMALL,22,389952,539166,149214,,
174,CONTAINERED_WASMTIME,FIB_RECURSIVE,SMALL,23,345636,500931,155295,,
175,CONTAINERED_WASMTIME,FIB_RECURSIVE,SMALL,24,343839,507693,163854,,
176,CONTAINERED_WASMTIME,FIB_RECURSIVE,MEDIUM,0,379866,847149,467283,,
177,CONTAINERED_WASMTIME,FIB_RECURSIVE,MEDIUM,1,356232,816578,460346,,
178,CONTAINERED_WASMTIME,FIB_RECURSIVE,MEDIUM,2,374262,824468,450206,,
179,CONTAINERED_WASMTIME,FIB_RECURSIVE,MEDIUM,3,386670,835254,448584,,
180,CONTAINERED_WASMTIME,FIB_RECURSIVE,MEDIUM,4,350403,871442,521039,,
181,CONTAINERED_WASMTIME,FIB_RECURSIVE,MEDIUM,5,356899,840490,483591,,
182,CONTAINERED_WASMTIME,FIB_RECURSIVE,MEDIUM,6,368659,824163,455504,,
183,CONTAINERED_WASMTIME,FIB_RECURSIVE,MEDIUM,7,342774,807547,464773,,
184,CONTAINERED_WASMTIME,FIB_RECURSIVE,MEDIUM,8,379886,853560,473674,,
185,CONTAINERED_WASMTIME,FIB_RECURSIVE,MEDIUM,9,357828,834170,476342,,
186,CONTAINERED_WASMTIME,FIB_RECURSIVE,MEDIUM,10,344845,812269,467424,,
187,CONTAINERED_WASMTIME,FIB_RECURSIVE,MEDIUM,11,334198,798541,464343,,
188,CONTAINERED_WASMTIME,FIB_RECURSIVE,MEDIUM,12,360152,830663,470511,,
189,CONTAINERED_WASMTIME,FIB_RECURSIVE,MEDIUM,13,367977,823384,455407,,
190,CONTAINERED_WASMTIME,FIB_RECURSIVE,MEDIUM,14,371967,877538,505571,,
191,CONTAINERED_WASMTIME,FIB_RECURSIVE,MEDIUM,15,360635,840552,479917,,
192,CONTAINERED_WASMTIME,FIB_RECURSIVE,MEDIUM,16,318393,809356,490963,,
193,CONTAINERED_WASMTIME,FIB_RECURSIVE,MEDIUM,17,352311,817879,465568,,
194,CONTAINERED_WASMTIME,FIB_RECURSIVE,MEDIUM,18,339364,811941,472577,,
195,CONTAINERED_WASMTIME,FIB_RECURSIVE,MEDIUM,19,342776,810758,467982,,
196,CONTAINERED_WASMTIME,FIB_RECURSIVE,MEDIUM,20,353942,817757,463815,,
197,CONTAINERED_WASMTIME,FIB_RECURSIVE,MEDIUM,21,373715,834120,460405,,
198,CONTAINERED_WASMTIME,FIB_RECURSIVE,MEDIUM,22,350862,812293,461431,,
199,CONTAINERED_WASMTIME,FIB_RECURSIVE,MEDIUM,23,350929,824821,473892,,
200,CONTAINERED_WASMTIME,FIB_RECURSIVE,MEDIUM,24,344027,796679,452652,,
201,CONTAINERED_WASMTIME,FIB_RECURSIVE,LARGE,0,400107,4093679,3693572,,
202,CONTAINERED_WASMTIME,FIB_RECURSIVE,LARGE,1,386037,4100342,3714305,,
203,CONTAINERED_WASMTIME,FIB_RECURSIVE,LARGE,2,366856,4027744,3660888,,
204,CONTAINERED_WASMTIME,FIB_RECURSIVE,LARGE,3,436709,4124316,3687607,,
205,CONTAINERED_WASMTIME,FIB_RECURSIVE,LARGE,4,369244,4120842,3751598,,
206,CONTAINERED_WASMTIME,FIB_RECURSIVE,LARGE,5,365033,4092174,3727141,,
207,CONTAINERED_WASMTIME,FIB_RECURSIVE,LARGE,6,395326,4105232,3709906,,
208,CONTAINERED_WASMTIME,FIB_RECURSIVE,LARGE,7,358579,4081090,3722511,,
209,CONTAINERED_WASMTIME,FIB_RECURSIVE,LARGE,8,380816,4042345,3661529,,
210,CONTAINERED_WASMTIME,FIB_RECURSIVE,LARGE,9,380294,4114766,3734472,,
211,CONTAINERED_WASMTIME,FIB_RECURSIVE,LARGE,10,351306,4061888,3710582,,
212,CONTAINERED_WASMTIME,FIB_RECURSIVE,LARGE,11,378195,4037854,3659659,,
213,CONTAINERED_WASMTIME,FIB_RECURSIVE,LARGE,12,367078,4077105,3710027,,
214,CONTAINERED_WASMTIME,FIB_RECURSIVE,LARGE,13,382859,4147659,3764800,,
215,CONTAINERED_WASMTIME,FIB_RECURSIVE,LARGE,14,354871,4081144,3726273,,
216,CONTAINERED_WASMTIME,FIB_RECURSIVE,LARGE,15,402590,4157307,3754717,,
217,CONTAINERED_WASMTIME,FIB_RECURSIVE,LARGE,16,356520,4058190,3701670,,
218,CONTAINERED_WASMTIME,FIB_RECURSIVE,LARGE,17,343631,4122696,3779065,,
219,CONTAINERED_WASMTIME,FIB_RECURSIVE,LARGE,18,380865,4082056,3701191,,
220,CONTAINERED_WASMTIME,FIB_RECURSIVE,LARGE,19,387064,4080013,3692949,,
221,CONTAINERED_WASMTIME,FIB_RECURSIVE,LARGE,20,373902,4081107,3707205,,
222,CONTAINERED_WASMTIME,FIB_RECURSIVE,LARGE,21,372805,4135333,3762528,,
223,CONTAINERED_WASMTIME,FIB_RECURSIVE,LARGE,22,357793,4140187,3782394,,
224,CONTAINERED_WASMTIME,FIB_RECURSIVE,LARGE,23,363507,4096316,3732809,,
225,CONTAINERED_WASMTIME,FIB_RECURSIVE,LARGE,24,400260,4141715,3741455,,
226,CONTAINERED_WASMTIME,FIB_ITERATIVE,SMALL,0,334719,492262,157543,,
227,CONTAINERED_WASMTIME,FIB_ITERATIVE,SMALL,1,367968,515061,147093,,
228,CONTAINERED_WASMTIME,FIB_ITERATIVE,SMALL,2,361142,509050,147908,,
229,CONTAINERED_WASMTIME,FIB_ITERATIVE,SMALL,3,338451,477581,139130,,
230,CONTAINERED_WASMTIME,FIB_ITERATIVE,SMALL,4,361721,517586,155865,,
231,CONTAINERED_WASMTIME,FIB_ITERATIVE,SMALL,5,355138,503450,148312,,
232,CONTAINERED_WASMTIME,FIB_ITERATIVE,SMALL,6,327207,476558,149351,,
233,CONTAINERED_WASMTIME,FIB_ITERATIVE,SMALL,7,361729,509019,147290,,
234,CONTAINERED_WASMTIME,FIB_ITERATIVE,SMALL,8,351932,487786,135854,,
235,CONTAINERED_WASMTIME,FIB_ITERATIVE,SMALL,9,369045,511356,142311,,
236,CONTAINERED_WASMTIME,FIB_ITERATIVE,SMALL,10,384034,526797,142763,,
237,CONTAINERED_WASMTIME,FIB_ITERATIVE,SMALL,11,354200,516014,161814,,
238,CONTAINERED_WASMTIME,FIB_ITERATIVE,SMALL,12,355017,510070,155053,,
239,CONTAINERED_WASMTIME,FIB_ITERATIVE,SMALL,13,364608,509940,145332,,
240,CONTAINERED_WASMTIME,FIB_ITERATIVE,SMALL,14,365507,517029,151522,,
241,CONTAINERED_WASMTIME,FIB_ITERATIVE,SMALL,15,369619,515570,145951,,
242,CONTAINERED_WASMTIME,FIB_ITERATIVE,SMALL,16,343243,496427,153184,,
243,CONTAINERED_WASMTIME,FIB_ITERATIVE,SMALL,17,363460,509466,146006,,
244,CONTAINERED_WASMTIME,FIB_ITERATIVE,SMALL,18,357531,497011,139480,,
245,CONTAINERED_WASMTIME,FIB_ITERATIVE,SMALL,19,357872,509404,151532,,
246,CONTAINERED_WASMTIME,FIB_ITERATIVE,SMALL,20,360611,515144,154533,,
247,CONTAINERED_WASMTIME,FIB_ITERATIVE,SMALL,21,344291,479704,135413,,
248,CONTAINERED_WASMTIME,FIB_ITERATIVE,SMALL,22,363953,510385,146432,,
249,CONTAINERED_WASMTIME,FIB_ITERATIVE,SMALL,23,342183,500606,158423,,
250,CONTAINERED_WASMTIME,FIB_ITERATIVE,SMALL,24,321803,458601,136798,,
251,CONTAINERED_WASMTIME,FIB_ITERATIVE,MEDIUM,0,333436,482166,148730,,
252,CONTAINERED_WASMTIME,FIB_ITERATIVE,MEDIUM,1,335121,490081,154960,,
253,CONTAINERED_WASMTIME,FIB_ITERATIVE,MEDIUM,2,340010,485271,145261,,
254,CONTAINERED_WASMTIME,FIB_ITERATIVE,MEDIUM,3,337349,487388,150039,,
255,CONTAINERED_WASMTIME,FIB_ITERATIVE,MEDIUM,4,341727,499479,157752,,
256,CONTAINERED_WASMTIME,FIB_ITERATIVE,MEDIUM,5,338700,495239,156539,,
257,CONTAINERED_WASMTIME,FIB_ITERATIVE,MEDIUM,6,355686,504331,148645,,
258,CONTAINERED_WASMTIME,FIB_ITERATIVE,MEDIUM,7,345461,503480,158019,,
259,CONTAINERED_WASMTIME,FIB_ITERATIVE,MEDIUM,8,366593,510197,143604,,
260,CONTAINERED_WASMTIME,FIB_ITERATIVE,MEDIUM,9,354542,514988,160446,,
261,CONTAINERED_WASMTIME,FIB_ITERATIVE,MEDIUM,10,333343,485522,152179,,
262,CONTAINERED_WASMTIME,FIB_ITERATIVE,MEDIUM,11,356744,489968,133224,,
263,CONTAINERED_WASMTIME,FIB_ITERATIVE,MEDIUM,12,425425,584128,158703,,
264,CONTAINERED_WASMTIME,FIB_ITERATIVE,MEDIUM,13,364205,507631,143426,,
265,CONTAINERED_WASMTIME,FIB_ITERATIVE,MEDIUM,14,364256,514766,150510,,
266,CONTAINERED_WASMTIME,FIB_ITERATIVE,MEDIUM,15,361316,509934,148618,,
267,CONTAINERED_WASMTIME,FIB_ITERATIVE,MEDIUM,16,339430,494679,155249,,
268,CONTAINERED_WASMTIME,FIB_ITERATIVE,MEDIUM,17,360567,512932,152365,,
269,CONTAINERED_WASMTIME,FIB_ITERATIVE,MEDIUM,18,372379,528408,156029,,
270,CONTAINERED_WASMTIME,FIB_ITERATIVE,MEDIUM,19,339646,482820,143174,,
271,CONTAINERED_WASMTIME,FIB_ITERATIVE,MEDIUM,20,345026,503036,158010,,
272,CONTAINERED_WASMTIME,FIB_ITERATIVE,MEDIUM,21,381049,531579,150530,,
273,CONTAINERED_WASMTIME,FIB_ITERATIVE,MEDIUM,22,369512,537511,167999,,
274,CONTAINERED_WASMTIME,FIB_ITERATIVE,MEDIUM,23,366800,517372,150572,,
275,CONTAINERED_WASMTIME,FIB_ITERATIVE,MEDIUM,24,349335,488198,138863,,
276,CONTAINERED_WASMTIME,FIB_ITERATIVE,LARGE,0,337691,487239,149548,,
277,CONTAINERED_WASMTIME,FIB_ITERATIVE,LARGE,1,384847,546843,161996,,
278,CONTAINERED_WASMTIME,FIB_ITERATIVE,LARGE,2,379681,514379,134698,,
279,CONTAINERED_WASMTIME,FIB_ITERATIVE,LARGE,3,387318,530466,143148,,
280,CONTAINERED_WASMTIME,FIB_ITERATIVE,LARGE,4,380310,529092,148782,,
281,CONTAINERED_WASMTIME,FIB_ITERATIVE,LARGE,5,400665,557557,156892,,
282,CONTAINERED_WASMTIME,FIB_ITERATIVE,LARGE,6,324249,472942,148693,,
283,CONTAINERED_WASMTIME,FIB_ITERATIVE,LARGE,7,329994,497302,167308,,
284,CONTAINERED_WASMTIME,FIB_ITERATIVE,LARGE,8,365437,516950,151513,,
285,CONTAINERED_WASMTIME,FIB_ITERATIVE,LARGE,9,333073,493716,160643,,
286,CONTAINERED_WASMTIME,FIB_ITERATIVE,LARGE,10,331261,482768,151507,,
287,CONTAINERED_WASMTIME,FIB_ITERATIVE,LARGE,11,352450,534544,182094,,
288,CONTAINERED_WASMTIME,FIB_ITERATIVE,LARGE,12,347908,529406,181498,,
289,CONTAINERED_WASMTIME,FIB_ITERATIVE,LARGE,13,350146,519779,169633,,
290,CONTAINERED_WASMTIME,FIB_ITERATIVE,LARGE,14,379309,542312,163003,,
291,CONTAINERED_WASMTIME,FIB_ITERATIVE,LARGE,15,373444,517511,144067,,
292,CONTAINERED_WASMTIME,FIB_ITERATIVE,LARGE,16,351049,506510,155461,,
293,CONTAINERED_WASMTIME,FIB_ITERATIVE,LARGE,17,366377,510367,143990,,
294,CONTAINERED_WASMTIME,FIB_ITERATIVE,LARGE,18,377532,538581,161049,,
295,CONTAINERED_WASMTIME,FIB_ITERATIVE,LARGE,19,379380,528643,149263,,
296,CONTAINERED_WASMTIME,FIB_ITERATIVE,LARGE,20,399366,545990,146624,,
297,CONTAINERED_WASMTIME,FIB_ITERATIVE,LARGE,21,344219,493291,149072,,
298,CONTAINERED_WASMTIME,FIB_ITERATIVE,LARGE,22,349978,497435,147457,,
299,CONTAINERED_WASMTIME,FIB_ITERATIVE,LARGE,23,400063,565596,165533,,
300,CONTAINERED_WASMTIME,FIB_ITERATIVE,LARGE,24,365751,519270,153519,,
301,CLI_WASMER,FIB_RECURSIVE,SMALL,0,24686,25600,914,,
302,CLI_WASMER,FIB_RECURSIVE,SMALL,1,28839,34326,5487,,
303,CLI_WASMER,FIB_RECURSIVE,SMALL,2,24680,25429,749,,
304,CLI_WASMER,FIB_RECURSIVE,SMALL,3,20944,21894,950,,
305,CLI_WASMER,FIB_RECURSIVE,SMALL,4,21787,22577,790,,
306,CLI_WASMER,FIB_RECURSIVE,SMALL,5,20552,21549,997,,
307,CLI_WASMER,FIB_RECURSIVE,SMALL,6,27269,35440,8171,,
308,CLI_WASMER,FIB_RECURSIVE,SMALL,7,32917,33911,994,,
309,CLI_WASMER,FIB_RECURSIVE,SMALL,8,29438,30472,1034,,
310,CLI_WASMER,FIB_RECURSIVE,SMALL,9,20945,21796,851,,
311,CLI_WASMER,FIB_RECURSIVE,SMALL,10,21205,22035,830,,
312,CLI_WASMER,FIB_RECURSIVE,SMALL,11,16639,17444,805,,
313,CLI_WASMER,FIB_RECURSIVE,SMALL,12,27150,27909,759,,
314,CLI_WASMER,FIB_RECURSIVE,SMALL,13,24622,25562,940,,
315,CLI_WASMER,FIB_RECURSIVE,SMALL,14,19264,23346,4082,,
316,CLI_WASMER,FIB_RECURSIVE,SMALL,15,34763,39539,4776,,
317,CLI_WASMER,FIB_RECURSIVE,SMALL,16,32232,33915,1683,,
318,CLI_WASMER,FIB_RECURSIVE,SMALL,17,26334,31078,4744,,
319,CLI_WASMER,FIB_RECURSIVE,SMALL,18,27720,28413,693,,
320,CLI_WASMER,FIB_RECURSIVE,SMALL,19,21843,22607,764,,
321,CLI_WASMER,FIB_RECURSIVE,SMALL,20,21163,22154,991,,
322,CLI_WASMER,FIB_RECURSIVE,SMALL,21,19647,20314,667,,
323,CLI_WASMER,FIB_RECURSIVE,SMALL,22,16329,17177,848,,
324,CLI_WASMER,FIB_RECURSIVE,SMALL,23,19796,20534,738,,
325,CLI_WASMER,FIB_RECURSIVE,SMALL,24,19953,22245,2292,,
326,CLI_WASMER,FIB_RECURSIVE,MEDIUM,0,19657,311314,291657,,
327,CLI_WASMER,FIB_RECURSIVE,MEDIUM,1,15800,301354,285554,,
328,CLI_WASMER,FIB_RECURSIVE,MEDIUM,2,18242,300004,281762,,
329,CLI_WASMER,FIB_RECURSIVE,MEDIUM,3,18291,301310,283019,,
330,CLI_WASMER,FIB_RECURSIVE,MEDIUM,4,16378,300663,284285,,
331,CLI_WASMER,FIB_RECURSIVE,MEDIUM,5,18268,291958,273690,,
332,CLI_WASMER,FIB_RECURSIVE,MEDIUM,6,16835,294317,277482,,
333,CLI_WASMER,FIB_RECURSIVE,MEDIUM,7,17232,289386,272154,,
334,CLI_WASMER,FIB_RECURSIVE,MEDIUM,8,21700,287516,265816,,
335,CLI_WASMER,FIB_RECURSIVE,MEDIUM,9,14858,299424,284566,,
336,CLI_WASMER,FIB_RECURSIVE,MEDIUM,10,15020,293283,278263,,
337,CLI_WASMER,FIB_RECURSIVE,MEDIUM,11,16500,321251,304751,,
338,CLI_WASMER,FIB_RECURSIVE,MEDIUM,12,14661,298319,283658,,
339,CLI_WASMER,FIB_RECURSIVE,MEDIUM,13,22516,291699,269183,,
340,CLI_WASMER,FIB_RECURSIVE,MEDIUM,14,15013,309398,294385,,
341,CLI_WASMER,FIB_RECURSIVE,MEDIUM,15,16987,314590,297603,,
342,CLI_WASMER,FIB_RECURSIVE,MEDIUM,16,22700,293968,271268,,
343,CLI_WASMER,FIB_RECURSIVE,MEDIUM,17,16222,301129,284907,,
344,CLI_WASMER,FIB_RECURSIVE,MEDIUM,18,14462,306047,291585,,
345,CLI_WASMER,FIB_RECURSIVE,MEDIUM,19,18275,314128,295853,,
346,CLI_WASMER,FIB_RECURSIVE,MEDIUM,20,25621,295562,269941,,
347,CLI_WASMER,FIB_RECURSIVE,MEDIUM,21,22031,291049,269018,,
348,CLI_WASMER,FIB_RECURSIVE,MEDIUM,22,15624,300921,285297,,
349,CLI_WASMER,FIB_RECURSIVE,MEDIUM,23,18294,294655,276361,,
350,CLI_WASMER,FIB_RECURSIVE,MEDIUM,24,43067,298907,255840,,
351,CLI_WASMER,FIB_RECURSIVE,LARGE,0,23762,3018832,2995070,,
352,CLI_WASMER,FIB_RECURSIVE,LARGE,1,14833,3077887,3063054,,
353,CLI_WASMER,FIB_RECURSIVE,LARGE,2,24045,3032110,3008065,,
354,CLI_WASMER,FIB_RECURSIVE,LARGE,3,20659,3092860,3072201,,
355,CLI_WASMER,FIB_RECURSIVE,LARGE,4,15476,3090737,3075261,,
356,CLI_WASMER,FIB_RECURSIVE,LARGE,5,14924,3049143,3034219,,
357,CLI_WASMER,FIB_RECURSIVE,LARGE,6,22575,3090575,3068000,,
358,CLI_WASMER,FIB_RECURSIVE,LARGE,7,15624,3049936,3034312,,
359,CLI_WASMER,FIB_RECURSIVE,LARGE,8,37120,3035689,2998569,,
360,CLI_WASMER,FIB_RECURSIVE,LARGE,9,14975,3027522,3012547,,
361,CLI_WASMER,FIB_RECURSIVE,LARGE,10,14953,3076314,3061361,,
362,CLI_WASMER,FIB_RECURSIVE,LARGE,11,28558,3047200,3018642,,
363,CLI_WASMER,FIB_RECURSIVE,LARGE,12,19327,3025942,3006615,,
364,CLI_WASMER,FIB_RECURSIVE,LARGE,13,14971,3061728,3046757,,
365,CLI_WASMER,FIB_RECURSIVE,LARGE,14,21900,3082618,3060718,,
366,CLI_WASMER,FIB_RECURSIVE,LARGE,15,14837,3003866,2989029,,
367,CLI_WASMER,FIB_RECURSIVE,LARGE,16,17051,3024738,3007687,,
368,CLI_WASMER,FIB_RECURSIVE,LARGE,17,16477,3026115,3009638,,
369,CLI_WASMER,FIB_RECURSIVE,LARGE,18,16028,2997562,2981534,,
370,CLI_WASMER,FIB_RECURSIVE,LARGE,19,16018,2971705,2955687,,
371,CLI_WASMER,FIB_RECURSIVE,LARGE,20,20014,2971598,2951584,,
372,CLI_WASMER,FIB_RECURSIVE,LARGE,21,28437,3007867,2979430,,
373,CLI_WASMER,FIB_RECURSIVE,LARGE,22,14434,2995389,2980955,,
374,CLI_WASMER,FIB_RECURSIVE,LARGE,23,26646,2987328,2960682,,
375,CLI_WASMER,FIB_RECURSIVE,LARGE,24,16199,2975077,2958878,,
376,CLI_WASMER,FIB_ITERATIVE,SMALL,0,27604,29392,1788,,
377,CLI_WASMER,FIB_ITERATIVE,SMALL,1,31645,32457,812,,
378,CLI_WASMER,FIB_ITERATIVE,SMALL,2,60633,61595,962,,
379,CLI_WASMER,FIB_ITERATIVE,SMALL,3,26139,27380,1241,,
380,CLI_WASMER,FIB_ITERATIVE,SMALL,4,49394,50639,1245,,
381,CLI_WASMER,FIB_ITERATIVE,SMALL,5,30982,31872,890,,
382,CLI_WASMER,FIB_ITERATIVE,SMALL,6,33595,34543,948,,
383,CLI_WASMER,FIB_ITERATIVE,SMALL,7,27153,28013,860,,
384,CLI_WASMER,FIB_ITERATIVE,SMALL,8,18136,18872,736,,
385,CLI_WASMER,FIB_ITERATIVE,SMALL,9,28073,29262,1189,,
386,CLI_WASMER,FIB_ITERATIVE,SMALL,10,19488,20291,803,,
387,CLI_WASMER,FIB_ITERATIVE,SMALL,11,24049,25138,1089,,
388,CLI_WASMER,FIB_ITERATIVE,SMALL,12,16395,19802,3407,,
389,CLI_WASMER,FIB_ITERATIVE,SMALL,13,18617,19476,859,,
390,CLI_WASMER,FIB_ITERATIVE,SMALL,14,22692,23638,946,,
391,CLI_WASMER,FIB_ITERATIVE,SMALL,15,18661,19939,1278,,
392,CLI_WASMER,FIB_ITERATIVE,SMALL,16,22623,23435,812,,
393,CLI_WASMER,FIB_ITERATIVE,SMALL,17,23369,24594,1225,,
394,CLI_WASMER,FIB_ITERATIVE,SMALL,18,17648,24167,6519,,
395,CLI_WASMER,FIB_ITERATIVE,SMALL,19,22141,23527,1386,,
396,CLI_WASMER,FIB_ITERATIVE,SMALL,20,21889,24426,2537,,
397,CLI_WASMER,FIB_ITERATIVE,SMALL,21,17169,18260,1091,,
398,CLI_WASMER,FIB_ITERATIVE,SMALL,22,30453,31604,1151,,
399,CLI_WASMER,FIB_ITERATIVE,SMALL,23,18186,18974,788,,
400,CLI_WASMER,FIB_ITERATIVE,SMALL,24,24460,25286,826,,
401,CLI_WASMER,FIB_ITERATIVE,MEDIUM,0,39507,40316,809,,
402,CLI_WASMER,FIB_ITERATIVE,MEDIUM,1,36032,36833,801,,
403,CLI_WASMER,FIB_ITERATIVE,MEDIUM,2,25454,26508,1054,,
404,CLI_WASMER,FIB_ITERATIVE,MEDIUM,3,20960,21796,836,,
405,CLI_WASMER,FIB_ITERATIVE,MEDIUM,4,17927,18872,945,,
406,CLI_WASMER,FIB_ITERATIVE,MEDIUM,5,21375,22389,1014,,
407,CLI_WASMER,FIB_ITERATIVE,MEDIUM,6,31897,33140,1243,,
408,CLI_WASMER,FIB_ITERATIVE,MEDIUM,7,35330,36384,1054,,
409,CLI_WASMER,FIB_ITERATIVE,MEDIUM,8,22183,27754,5571,,
410,CLI_WASMER,FIB_ITERATIVE,MEDIUM,9,31584,32488,904,,
411,CLI_WASMER,FIB_ITERATIVE,MEDIUM,10,23906,25041,1135,,
412,CLI_WASMER,FIB_ITERATIVE,MEDIUM,11,25987,30392,4405,,
413,CLI_WASMER,FIB_ITERATIVE,MEDIUM,12,21701,23600,1899,,
414,CLI_WASMER,FIB_ITERATIVE,MEDIUM,13,16531,17439,908,,
415,CLI_WASMER,FIB_ITERATIVE,MEDIUM,14,21939,23181,1242,,
416,CLI_WASMER,FIB_ITERATIVE,MEDIUM,15,19824,20883,1059,,
417,CLI_WASMER,FIB_ITERATIVE,MEDIUM,16,15389,17320,1931,,
418,CLI_WASMER,FIB_ITERATIVE,MEDIUM,17,24689,25685,996,,
419,CLI_WASMER,FIB_ITERATIVE,MEDIUM,18,21994,23207,1213,,
420,CLI_WASMER,FIB_ITERATIVE,MEDIUM,19,15439,16294,855,,
421,CLI_WASMER,FIB_ITERATIVE,MEDIUM,20,21737,23026,1289,,
422,CLI_WASMER,FIB_ITERATIVE,MEDIUM,21,35680,37247,1567,,
423,CLI_WASMER,FIB_ITERATIVE,MEDIUM,22,30229,33025,2796,,
424,CLI_WASMER,FIB_ITERATIVE,MEDIUM,23,27033,27786,753,,
425,CLI_WASMER,FIB_ITERATIVE,MEDIUM,24,28121,29115,994,,
426,CLI_WASMER,FIB_ITERATIVE,LARGE,0,22824,23837,1013,,
427,CLI_WASMER,FIB_ITERATIVE,LARGE,1,41145,42876,1731,,
428,CLI_WASMER,FIB_ITERATIVE,LARGE,2,23604,25307,1703,,
429,CLI_WASMER,FIB_ITERATIVE,LARGE,3,18941,19939,998,,
430,CLI_WASMER,FIB_ITERATIVE,LARGE,4,28057,28921,864,,
431,CLI_WASMER,FIB_ITERATIVE,LARGE,5,24479,25346,867,,
432,CLI_WASMER,FIB_ITERATIVE,LARGE,6,21382,23009,1627,,
433,CLI_WASMER,FIB_ITERATIVE,LARGE,7,18701,19597,896,,
434,CLI_WASMER,FIB_ITERATIVE,LARGE,8,24721,25799,1078,,
435,CLI_WASMER,FIB_ITERATIVE,LARGE,9,15720,16461,741,,
436,CLI_WASMER,FIB_ITERATIVE,LARGE,10,19521,20558,1037,,
437,CLI_WASMER,FIB_ITERATIVE,LARGE,11,23637,24633,996,,
438,CLI_WASMER,FIB_ITERATIVE,LARGE,12,30974,32020,1046,,
439,CLI_WASMER,FIB_ITERATIVE,LARGE,13,16384,23125,6741,,
440,CLI_WASMER,FIB_ITERATIVE,LARGE,14,26449,27421,972,,
441,CLI_WASMER,FIB_ITERATIVE,LARGE,15,20532,21412,880,,
442,CLI_WASMER,FIB_ITERATIVE,LARGE,16,14902,15679,777,,
443,CLI_WASMER,FIB_ITERATIVE,LARGE,17,23127,26091,2964,,
444,CLI_WASMER,FIB_ITERATIVE,LARGE,18,40879,41802,923,,
445,CLI_WASMER,FIB_ITERATIVE,LARGE,19,26353,27024,671,,
446,CLI_WASMER,FIB_ITERATIVE,LARGE,20,28216,31314,3098,,
447,CLI_WASMER,FIB_ITERATIVE,LARGE,21,32247,33232,985,,
448,CLI_WASMER,FIB_ITERATIVE,LARGE,22,27227,28612,1385,,
449,CLI_WASMER,FIB_ITERATIVE,LARGE,23,24092,25914,1822,,
450,CLI_WASMER,FIB_ITERATIVE,LARGE,24,22163,24476,2313,,
451,CLI_WASMTIME,FIB_RECURSIVE,SMALL,0,25683,26497,814,,
452,CLI_WASMTIME,FIB_RECURSIVE,SMALL,1,19181,19860,679,,
453,CLI_WASMTIME,FIB_RECURSIVE,SMALL,2,24113,24957,844,,
454,CLI_WASMTIME,FIB_RECURSIVE,SMALL,3,20264,21095,831,,
455,CLI_WASMTIME,FIB_RECURSIVE,SMALL,4,29884,30747,863,,
456,CLI_WASMTIME,FIB_RECURSIVE,SMALL,5,32271,35070,2799,,
457,CLI_WASMTIME,FIB_RECURSIVE,SMALL,6,29276,30021,745,,
458,CLI_WASMTIME,FIB_RECURSIVE,SMALL,7,20700,21363,663,,
459,CLI_WASMTIME,FIB_RECURSIVE,SMALL,8,55778,60308,4530,,
460,CLI_WASMTIME,FIB_RECURSIVE,SMALL,9,22161,22914,753,,
461,CLI_WASMTIME,FIB_RECURSIVE,SMALL,10,22003,23154,1151,,
462,CLI_WASMTIME,FIB_RECURSIVE,SMALL,11,58857,62854,3997,,
463,CLI_WASMTIME,FIB_RECURSIVE,SMALL,12,29639,34191,4552,,
464,CLI_WASMTIME,FIB_RECURSIVE,SMALL,13,24499,27385,2886,,
465,CLI_WASMTIME,FIB_RECURSIVE,SMALL,14,37138,39199,2061,,
466,CLI_WASMTIME,FIB_RECURSIVE,SMALL,15,21939,22734,795,,
467,CLI_WASMTIME,FIB_RECURSIVE,SMALL,16,35562,36525,963,,
468,CLI_WASMTIME,FIB_RECURSIVE,SMALL,17,18738,19513,775,,
469,CLI_WASMTIME,FIB_RECURSIVE,SMALL,18,16519,17226,707,,
470,CLI_WASMTIME,FIB_RECURSIVE,SMALL,19,23396,24298,902,,
471,CLI_WASMTIME,FIB_RECURSIVE,SMALL,20,20211,21064,853,,
472,CLI_WASMTIME,FIB_RECURSIVE,SMALL,21,21645,22445,800,,
473,CLI_WASMTIME,FIB_RECURSIVE,SMALL,22,27886,28680,794,,
474,CLI_WASMTIME,FIB_RECURSIVE,SMALL,23,21612,22432,820,,
475,CLI_WASMTIME,FIB_RECURSIVE,SMALL,24,21197,22370,1173,,
476,CLI_WASMTIME,FIB_RECURSIVE,MEDIUM,0,15264,361248,345984,,
477,CLI_WASMTIME,FIB_RECURSIVE,MEDIUM,1,25293,350695,325402,,
478,CLI_WASMTIME,FIB_RECURSIVE,MEDIUM,2,23872,359678,335806,,
479,CLI_WASMTIME,FIB_RECURSIVE,MEDIUM,3,17432,354703,337271,,
480,CLI_WASMTIME,FIB_RECURSIVE,MEDIUM,4,24140,357195,333055,,
481,CLI_WASMTIME,FIB_RECURSIVE,MEDIUM,5,15367,355967,340600,,
482,CLI_WASMTIME,FIB_RECURSIVE,MEDIUM,6,14847,364803,349956,,
483,CLI_WASMTIME,FIB_RECURSIVE,MEDIUM,7,15771,368762,352991,,
484,CLI_WASMTIME,FIB_RECURSIVE,MEDIUM,8,15338,354723,339385,,
485,CLI_WASMTIME,FIB_RECURSIVE,MEDIUM,9,15504,360493,344989,,
486,CLI_WASMTIME,FIB_RECURSIVE,MEDIUM,10,25811,354538,328727,,
487,CLI_WASMTIME,FIB_RECURSIVE,MEDIUM,11,32266,380403,348137,,
488,CLI_WASMTIME,FIB_RECURSIVE,MEDIUM,12,17264,372782,355518,,
489,CLI_WASMTIME,FIB_RECURSIVE,MEDIUM,13,14514,375679,361165,,
490,CLI_WASMTIME,FIB_RECURSIVE,MEDIUM,14,16792,360363,343571,,
491,CLI_WASMTIME,FIB_RECURSIVE,MEDIUM,15,14943,361851,346908,,
492,CLI_WASMTIME,FIB_RECURSIVE,MEDIUM,16,23755,367788,344033,,
493,CLI_WASMTIME,FIB_RECURSIVE,MEDIUM,17,15084,360697,345613,,
494,CLI_WASMTIME,FIB_RECURSIVE,MEDIUM,18,17541,357847,340306,,
495,CLI_WASMTIME,FIB_RECURSIVE,MEDIUM,19,16910,355215,338305,,
496,CLI_WASMTIME,FIB_RECURSIVE,MEDIUM,20,24634,357416,332782,,
497,CLI_WASMTIME,FIB_RECURSIVE,MEDIUM,21,15321,365780,350459,,
498,CLI_WASMTIME,FIB_RECURSIVE,MEDIUM,22,15613,355104,339491,,
499,CLI_WASMTIME,FIB_RECURSIVE,MEDIUM,23,14642,395642,381000,,
500,CLI_WASMTIME,FIB_RECURSIVE,MEDIUM,24,14149,390234,376085,,
501,CLI_WASMTIME,FIB_RECURSIVE,LARGE,0,15065,3720938,3705873,,
502,CLI_WASMTIME,FIB_RECURSIVE,LARGE,1,15578,3735282,3719704,,
503,CLI_WASMTIME,FIB_RECURSIVE,LARGE,2,15854,3719299,3703445,,
504,CLI_WASMTIME,FIB_RECURSIVE,LARGE,3,15325,3796994,3781669,,
505,CLI_WASMTIME,FIB_RECURSIVE,LARGE,4,15628,3761041,3745413,,
506,CLI_WASMTIME,FIB_RECURSIVE,LARGE,5,15420,3794250,3778830,,
507,CLI_WASMTIME,FIB_RECURSIVE,LARGE,6,35310,3718667,3683357,,
508,CLI_WASMTIME,FIB_RECURSIVE,LARGE,7,15504,3800975,3785471,,
509,CLI_WASMTIME,FIB_RECURSIVE,LARGE,8,15160,3775421,3760261,,
510,CLI_WASMTIME,FIB_RECURSIVE,LARGE,9,31442,3725596,3694154,,
511,CLI_WASMTIME,FIB_RECURSIVE,LARGE,10,15372,3749976,3734604,,
512,CLI_WASMTIME,FIB_RECURSIVE,LARGE,11,16793,3706404,3689611,,
513,CLI_WASMTIME,FIB_RECURSIVE,LARGE,12,17555,3715109,3697554,,
514,CLI_WASMTIME,FIB_RECURSIVE,LARGE,13,19125,3727967,3708842,,
515,CLI_WASMTIME,FIB_RECURSIVE,LARGE,14,15947,3789309,3773362,,
516,CLI_WASMTIME,FIB_RECURSIVE,LARGE,15,26655,3769758,3743103,,
517,CLI_WASMTIME,FIB_RECURSIVE,LARGE,16,34335,3767394,3733059,,
518,CLI_WASMTIME,FIB_RECURSIVE,LARGE,17,24354,3735343,3710989,,
519,CLI_WASMTIME,FIB_RECURSIVE,LARGE,18,14224,3759567,3745343,,
520,CLI_WASMTIME,FIB_RECURSIVE,LARGE,19,19909,3782146,3762237,,
521,CLI_WASMTIME,FIB_RECURSIVE,LARGE,20,16306,3771805,3755499,,
522,CLI_WASMTIME,FIB_RECURSIVE,LARGE,21,29487,3761671,3732184,,
523,CLI_WASMTIME,FIB_RECURSIVE,LARGE,22,20614,3738900,3718286,,
524,CLI_WASMTIME,FIB_RECURSIVE,LARGE,23,16554,3822996,3806442,,
525,CLI_WASMTIME,FIB_RECURSIVE,LARGE,24,18779,3832867,3814088,,
526,CLI_WASMTIME,FIB_ITERATIVE,SMALL,0,44247,45171,924,,
527,CLI_WASMTIME,FIB_ITERATIVE,SMALL,1,20895,21863,968,,
528,CLI_WASMTIME,FIB_ITERATIVE,SMALL,2,22374,23438,1064,,
529,CLI_WASMTIME,FIB_ITERATIVE,SMALL,3,15852,16770,918,,
530,CLI_WASMTIME,FIB_ITERATIVE,SMALL,4,29906,36276,6370,,
531,CLI_WASMTIME,FIB_ITERATIVE,SMALL,5,28060,29396,1336,,
532,CLI_WASMTIME,FIB_ITERATIVE,SMALL,6,19882,20846,964,,
533,CLI_WASMTIME,FIB_ITERATIVE,SMALL,7,18665,19685,1020,,
534,CLI_WASMTIME,FIB_ITERATIVE,SMALL,8,16827,18332,1505,,
535,CLI_WASMTIME,FIB_ITERATIVE,SMALL,9,29552,30490,938,,
536,CLI_WASMTIME,FIB_ITERATIVE,SMALL,10,27940,28896,956,,
537,CLI_WASMTIME,FIB_ITERATIVE,SMALL,11,15658,16573,915,,
538,CLI_WASMTIME,FIB_ITERATIVE,SMALL,12,20212,21100,888,,
539,CLI_WASMTIME,FIB_ITERATIVE,SMALL,13,32595,33561,966,,
540,CLI_WASMTIME,FIB_ITERATIVE,SMALL,14,25585,26482,897,,
541,CLI_WASMTIME,FIB_ITERATIVE,SMALL,15,23246,24690,1444,,
542,CLI_WASMTIME,FIB_ITERATIVE,SMALL,16,22267,23223,956,,
543,CLI_WASMTIME,FIB_ITERATIVE,SMALL,17,26977,27954,977,,
544,CLI_WASMTIME,FIB_ITERATIVE,SMALL,18,18696,19485,789,,
545,CLI_WASMTIME,FIB_ITERATIVE,SMALL,19,45088,46109,1021,,
546,CLI_WASMTIME,FIB_ITERATIVE,SMALL,20,26508,27604,1096,,
547,CLI_WASMTIME,FIB_ITERATIVE,SMALL,21,24813,26031,1218,,
548,CLI_WASMTIME,FIB_ITERATIVE,SMALL,22,19115,19993,878,,
549,CLI_WASMTIME,FIB_ITERATIVE,SMALL,23,22384,23339,955,,
550,CLI_WASMTIME,FIB_ITERATIVE,SMALL,24,19773,21970,2197,,
551,CLI_WASMTIME,FIB_ITERATIVE,MEDIUM,0,37703,38550,847,,
552,CLI_WASMTIME,FIB_ITERATIVE,MEDIUM,1,21843,22905,1062,,
553,CLI_WASMTIME,FIB_ITERATIVE,MEDIUM,2,19647,20796,1149,,
554,CLI_WASMTIME,FIB_ITERATIVE,MEDIUM,3,32334,33204,870,,
555,CLI_WASMTIME,FIB_ITERATIVE,MEDIUM,4,20579,21584,1005,,
556,CLI_WASMTIME,FIB_ITERATIVE,MEDIUM,5,39017,40195,1178,,
557,CLI_WASMTIME,FIB_ITERATIVE,MEDIUM,6,32307,33501,1194,,
558,CLI_WASMTIME,FIB_ITERATIVE,MEDIUM,7,40888,41816,928,,
559,CLI_WASMTIME,FIB_ITERATIVE,MEDIUM,8,43285,44330,1045,,
560,CLI_WASMTIME,FIB_ITERATIVE,MEDIUM,9,29827,30935,1108,,
561,CLI_WASMTIME,FIB_ITERATIVE,MEDIUM,10,23714,24591,877,,
562,CLI_WASMTIME,FIB_ITERATIVE,MEDIUM,11,24548,25880,1332,,
563,CLI_WASMTIME,FIB_ITERATIVE,MEDIUM,12,16343,21426,5083,,
564,CLI_WASMTIME,FIB_ITERATIVE,MEDIUM,13,36419,39322,2903,,
565,CLI_WASMTIME,FIB_ITERATIVE,MEDIUM,14,24311,25207,896,,
566,CLI_WASMTIME,FIB_ITERATIVE,MEDIUM,15,31980,32866,886,,
567,CLI_WASMTIME,FIB_ITERATIVE,MEDIUM,16,30273,31195,922,,
568,CLI_WASMTIME,FIB_ITERATIVE,MEDIUM,17,28579,29489,910,,
569,CLI_WASMTIME,FIB_ITERATIVE,MEDIUM,18,27055,27845,790,,
570,CLI_WASMTIME,FIB_ITERATIVE,MEDIUM,19,25156,25985,829,,
571,CLI_WASMTIME,FIB_ITERATIVE,MEDIUM,20,25660,28821,3161,,
572,CLI_WASMTIME,FIB_ITERATIVE,MEDIUM,21,22490,23320,830,,
573,CLI_WASMTIME,FIB_ITERATIVE,MEDIUM,22,24113,25056,943,,
574,CLI_WASMTIME,FIB_ITERATIVE,MEDIUM,23,21377,22379,1002,,
575,CLI_WASMTIME,FIB_ITERATIVE,MEDIUM,24,22830,23780,950,,
576,CLI_WASMTIME,FIB_ITERATIVE,LARGE,0,17648,18489,841,,
577,CLI_WASMTIME,FIB_ITERATIVE,LARGE,1,23479,24322,843,,
578,CLI_WASMTIME,FIB_ITERATIVE,LARGE,2,15742,17031,1289,,
579,CLI_WASMTIME,FIB_ITERATIVE,LARGE,3,22282,23282,1000,,
580,CLI_WASMTIME,FIB_ITERATIVE,LARGE,4,25457,26727,1270,,
581,CLI_WASMTIME,FIB_ITERATIVE,LARGE,5,22373,23643,1270,,
582,CLI_WASMTIME,FIB_ITERATIVE,LARGE,6,19955,20750,795,,
583,CLI_WASMTIME,FIB_ITERATIVE,LARGE,7,21467,22394,927,,
584,CLI_WASMTIME,FIB_ITERATIVE,LARGE,8,23749,25115,1366,,
585,CLI_WASMTIME,FIB_ITERATIVE,LARGE,9,15527,16384,857,,
586,CLI_WASMTIME,FIB_ITERATIVE,LARGE,10,20393,21755,1362,,
587,CLI_WASMTIME,FIB_ITERATIVE,LARGE,11,21775,22725,950,,
588,CLI_WASMTIME,FIB_ITERATIVE,LARGE,12,22121,23052,931,,
589,CLI_WASMTIME,FIB_ITERATIVE,LARGE,13,19224,20179,955,,
590,CLI_WASMTIME,FIB_ITERATIVE,LARGE,14,22991,24739,1748,,
591,CLI_WASMTIME,FIB_ITERATIVE,LARGE,15,19497,20362,865,,
592,CLI_WASMTIME,FIB_ITERATIVE,LARGE,16,33393,34192,799,,
593,CLI_WASMTIME,FIB_ITERATIVE,LARGE,17,19772,20827,1055,,
594,CLI_WASMTIME,FIB_ITERATIVE,LARGE,18,18355,19229,874,,
595,CLI_WASMTIME,FIB_ITERATIVE,LARGE,19,21940,22891,951,,
596,CLI_WASMTIME,FIB_ITERATIVE,LARGE,20,16680,17436,756,,
597,CLI_WASMTIME,FIB_ITERATIVE,LARGE,21,19911,21008,1097,,
598,CLI_WASMTIME,FIB_ITERATIVE,LARGE,22,29957,30997,1040,,
599,CLI_WASMTIME,FIB_ITERATIVE,LARGE,23,31088,31833,745,,
600,CLI_WASMTIME,FIB_ITERATIVE,LARGE,24,16997,18089,1092,,
601,WASMCLOUD,FIB_RECURSIVE,SMALL,0,3861364,4283746,422382,221034,
602,WASMCLOUD,FIB_RECURSIVE,SMALL,1,3479077,4603617,1124540,246238,
603,WASMCLOUD,FIB_RECURSIVE,SMALL,2,3738596,5607382,1868786,373669,
604,WASMCLOUD,FIB_RECURSIVE,SMALL,3,3556900,5804010,2247110,560311,
605,WASMCLOUD,FIB_RECURSIVE,SMALL,4,3681983,4938080,1256097,844615,
606,WASMCLOUD,FIB_RECURSIVE,SMALL,5,3060720,4014285,953565,305683,
607,WASMCLOUD,FIB_RECURSIVE,SMALL,6,3923546,4429298,505752,75009,
608,WASMCLOUD,FIB_RECURSIVE,SMALL,7,2633461,4044938,1411477,875807,
609,WASMCLOUD,FIB_RECURSIVE,SMALL,8,3854682,5881132,2026450,698640,
610,WASMCLOUD,FIB_RECURSIVE,SMALL,9,3921674,5274672,1352998,350199,
611,WASMCLOUD,FIB_RECURSIVE,SMALL,10,2719878,4514296,1794418,409524,
612,WASMCLOUD,FIB_RECURSIVE,SMALL,11,4165172,5769251,1604079,780536,
613,WASMCLOUD,FIB_RECURSIVE,SMALL,12,3094760,5481644,2386884,478288,
614,WASMCLOUD,FIB_RECURSIVE,SMALL,13,3019472,4789669,1770197,596978,
615,WASMCLOUD,FIB_RECURSIVE,SMALL,14,3847106,5761775,1914669,665352,
616,WASMCLOUD,FIB_RECURSIVE,SMALL,15,3759495,4526389,766894,254280,
617,WASMCLOUD,FIB_RECURSIVE,SMALL,16,2658922,4694084,2035162,818391,
618,WASMCLOUD,FIB_RECURSIVE,SMALL,17,3454105,5413729,1959624,776607,
619,WASMCLOUD,FIB_RECURSIVE,SMALL,18,3351227,4448489,1097262,56096,
620,WASMCLOUD,FIB_RECURSIVE,SMALL,19,2750336,5572217,2821881,941738,
621,WASMCLOUD,FIB_RECURSIVE,SMALL,20,3169630,5812719,2643089,674985,
622,WASMCLOUD,FIB_RECURSIVE,SMALL,21,2621084,4236641,1615557,116084,
623,WASMCLOUD,FIB_RECURSIVE,SMALL,22,3712663,5093924,1381261,483102,
624,WASMCLOUD,FIB_RECURSIVE,SMALL,23,,,,,
625,WASMCLOUD,FIB_RECURSIVE,SMALL,24,2478633,4484402,2005769,974413,
626,WASMCLOUD,FIB_RECURSIVE,MEDIUM,0,2827028,5594857,2767829,965292,
627,WASMCLOUD,FIB_RECURSIVE,MEDIUM,1,3162709,5609745,2447036,1017439,
628,WASMCLOUD,FIB_RECURSIVE,MEDIUM,2,3613088,6241471,2628383,905484,
629,WASMCLOUD,FIB_RECURSIVE,MEDIUM,3,3813183,5388678,1575495,743747,
630,WASMCLOUD,FIB_RECURSIVE,MEDIUM,4,2696369,4837939,2141570,367665,
631,WASMCLOUD,FIB_RECURSIVE,MEDIUM,5,3665220,5207338,1542118,571627,
632,WASMCLOUD,FIB_RECURSIVE,MEDIUM,6,2677486,4068079,1390593,330032,
633,WASMCLOUD,FIB_RECURSIVE,MEDIUM,7,3195530,5229880,2034350,639253,
634,WASMCLOUD,FIB_RECURSIVE,MEDIUM,8,2899204,4654394,1755190,745070,
635,WASMCLOUD,FIB_RECURSIVE,MEDIUM,9,2808571,4032611,1224040,719371,
636,WASMCLOUD,FIB_RECURSIVE,MEDIUM,10,3170651,4650275,1479624,234267,
637,WASMCLOUD,FIB_RECURSIVE,MEDIUM,11,3395079,4752245,1357166,137849,
638,WASMCLOUD,FIB_RECURSIVE,MEDIUM,12,3812436,5597867,1785431,556632,
639,WASMCLOUD,FIB_RECURSIVE,MEDIUM,13,3977674,5768456,1790782,646445,
640,WASMCLOUD,FIB_RECURSIVE,MEDIUM,14,2946181,4969971,2023790,574485,
641,WASMCLOUD,FIB_RECURSIVE,MEDIUM,15,2599045,5065613,2466568,499670,
642,WASMCLOUD,FIB_RECURSIVE,MEDIUM,16,3165474,4297489,1132015,525302,
643,WASMCLOUD,FIB_RECURSIVE,MEDIUM,17,3735062,5262603,1527541,495170,
644,WASMCLOUD,FIB_RECURSIVE,MEDIUM,18,2574627,5238537,2663910,990998,
645,WASMCLOUD,FIB_RECURSIVE,MEDIUM,19,2688366,5221539,2533173,1011527,
646,WASMCLOUD,FIB_RECURSIVE,MEDIUM,20,3859647,5968127,2108480,398119,
647,WASMCLOUD,FIB_RECURSIVE,MEDIUM,21,2789294,4064026,1274732,152212,
648,WASMCLOUD,FIB_RECURSIVE,MEDIUM,22,3244338,4643613,1399275,464606,
649,WASMCLOUD,FIB_RECURSIVE,MEDIUM,23,2922050,5457939,2535889,434657,
650,WASMCLOUD,FIB_RECURSIVE,MEDIUM,24,2984475,5590435,2605960,659573,
651,WASMCLOUD,FIB_RECURSIVE,LARGE,0,2993522,8812959,5819437,816241,
652,WASMCLOUD,FIB_RECURSIVE,LARGE,1,3548723,8258204,4709481,649496,
653,WASMCLOUD,FIB_RECURSIVE,LARGE,2,2438391,7060771,4622380,317392,
654,WASMCLOUD,FIB_RECURSIVE,LARGE,3,2907622,7455332,4547710,466857,
655,WASMCLOUD,FIB_RECURSIVE,LARGE,4,3144768,8505566,5360798,911256,
656,WASMCLOUD,FIB_RECURSIVE,LARGE,5,3501439,8333933,4832494,487052,
657,WASMCLOUD,FIB_RECURSIVE,LARGE,6,3593064,8848388,5255324,1005781,
658,WASMCLOUD,FIB_RECURSIVE,LARGE,7,3475290,7631672,4156382,86424,
659,WASMCLOUD,FIB_RECURSIVE,LARGE,8,2419197,7129168,4709971,190338,
660,WASMCLOUD,FIB_RECURSIVE,LARGE,9,3592218,8668833,5076615,314988,
661,WASMCLOUD,FIB_RECURSIVE,LARGE,10,3383886,8164688,4780802,608666,
662,WASMCLOUD,FIB_RECURSIVE,LARGE,11,3268750,7784250,4515500,59800,
663,WASMCLOUD,FIB_RECURSIVE,LARGE,12,2623051,7791050,5167999,159095,
664,WASMCLOUD,FIB_RECURSIVE,LARGE,13,3732386,8207889,4475503,23567,
665,WASMCLOUD,FIB_RECURSIVE,LARGE,14,3543948,7974497,4430549,118292,
666,WASMCLOUD,FIB_RECURSIVE,LARGE,15,3453050,8222725,4769675,848690,
667,WASMCLOUD,FIB_RECURSIVE,LARGE,16,3282970,8629603,5346633,930842,
668,WASMCLOUD,FIB_RECURSIVE,LARGE,17,3586424,8148598,4562174,852301,
669,WASMCLOUD,FIB_RECURSIVE,LARGE,18,3251579,7885648,4634069,376436,
670,WASMCLOUD,FIB_RECURSIVE,LARGE,19,3306478,8422454,5115976,612211,
671,WASMCLOUD,FIB_RECURSIVE,LARGE,20,3031183,8231573,5200390,359074,
672,WASMCLOUD,FIB_RECURSIVE,LARGE,21,2655800,7759302,5103502,604816,
673,WASMCLOUD,FIB_RECURSIVE,LARGE,22,3322110,9391432,6069322,701351,
674,WASMCLOUD,FIB_RECURSIVE,LARGE,23,2475767,7116323,4640556,602397,
675,WASMCLOUD,FIB_RECURSIVE,LARGE,24,2933017,8131481,5198464,230191,
676,WASMCLOUD,FIB_ITERATIVE,SMALL,0,3417518,4394886,977368,121206,
677,WASMCLOUD,FIB_ITERATIVE,SMALL,1,2352765,3410380,1057615,246349,
678,WASMCLOUD,FIB_ITERATIVE,SMALL,2,,,,,
679,WASMCLOUD,FIB_ITERATIVE,SMALL,3,3094084,4939045,1844961,944238,
680,WASMCLOUD,FIB_ITERATIVE,SMALL,4,3475784,5148836,1673052,613055,
681,WASMCLOUD,FIB_ITERATIVE,SMALL,5,3123766,5394033,2270267,614698,
682,WASMCLOUD,FIB_ITERATIVE,SMALL,6,3235914,5038780,1802866,401924,
683,WASMCLOUD,FIB_ITERATIVE,SMALL,7,3263787,4536252,1272465,420643,
684,WASMCLOUD,FIB_ITERATIVE,SMALL,8,2878899,4754924,1876025,776120,
685,WASMCLOUD,FIB_ITERATIVE,SMALL,9,2698555,4059249,1360694,788292,
686,WASMCLOUD,FIB_ITERATIVE,SMALL,10,3535659,5122320,1586661,77739,
687,WASMCLOUD,FIB_ITERATIVE,SMALL,11,,,,,
688,WASMCLOUD,FIB_ITERATIVE,SMALL,12,,,,,
689,WASMCLOUD,FIB_ITERATIVE,SMALL,13,3366699,4728525,1361826,84114,
690,WASMCLOUD,FIB_ITERATIVE,SMALL,14,3630878,4563309,932431,534745,
691,WASMCLOUD,FIB_ITERATIVE,SMALL,15,4029673,6635479,2605806,940719,
692,WASMCLOUD,FIB_ITERATIVE,SMALL,16,3212247,4562324,1350077,494939,
693,WASMCLOUD,FIB_ITERATIVE,SMALL,17,2517670,4710258,2192588,655131,
694,WASMCLOUD,FIB_ITERATIVE,SMALL,18,3378061,4915989,1537928,804065,
695,WASMCLOUD,FIB_ITERATIVE,SMALL,19,3736133,4615444,879311,466190,
696,WASMCLOUD,FIB_ITERATIVE,SMALL,20,2652880,4610406,1957526,789991,
697,WASMCLOUD,FIB_ITERATIVE,SMALL,21,3807077,5869524,2062447,806529,
698,WASMCLOUD,FIB_ITERATIVE,SMALL,22,3622626,5060203,1437577,377643,
699,WASMCLOUD,FIB_ITERATIVE,SMALL,23,3584155,5472514,1888359,997467,
700,WASMCLOUD,FIB_ITERATIVE,SMALL,24,3792479,5142986,1350507,102016,
701,WASMCLOUD,FIB_ITERATIVE,MEDIUM,0,2747335,4598042,1850707,648828,
702,WASMCLOUD,FIB_ITERATIVE,MEDIUM,1,3155384,4876248,1720864,121157,
703,WASMCLOUD,FIB_ITERATIVE,MEDIUM,2,2392723,4259220,1866497,553652,
704,WASMCLOUD,FIB_ITERATIVE,MEDIUM,3,2995757,4923563,1927806,858575,
705,WASMCLOUD,FIB_ITERATIVE,MEDIUM,4,3571057,5738888,2167831,804140,
706,WASMCLOUD,FIB_ITERATIVE,MEDIUM,5,2286603,4373425,2086822,883017,
707,WASMCLOUD,FIB_ITERATIVE,MEDIUM,6,,,,,
708,WASMCLOUD,FIB_ITERATIVE,MEDIUM,7,3320223,4583106,1262883,852745,
709,WASMCLOUD,FIB_ITERATIVE,MEDIUM,8,3524353,4953941,1429588,64947,
710,WASMCLOUD,FIB_ITERATIVE,MEDIUM,9,3504753,5091761,1587008,645564,
711,WASMCLOUD,FIB_ITERATIVE,MEDIUM,10,3508316,5349879,1841563,516797,
712,WASMCLOUD,FIB_ITERATIVE,MEDIUM,11,3398230,4554371,1156141,185724,
713,WASMCLOUD,FIB_ITERATIVE,MEDIUM,12,3279609,5155251,1875642,954560,
714,WASMCLOUD,FIB_ITERATIVE,MEDIUM,13,3100234,4841092,1740858,789556,
715,WASMCLOUD,FIB_ITERATIVE,MEDIUM,14,3661704,5677790,2016086,619727,
716,WASMCLOUD,FIB_ITERATIVE,MEDIUM,15,3266503,5262801,1996298,881852,
717,WASMCLOUD,FIB_ITERATIVE,MEDIUM,16,2906130,4167080,1260950,340280,
718,WASMCLOUD,FIB_ITERATIVE,MEDIUM,17,2970410,4308055,1337645,685017,
719,WASMCLOUD,FIB_ITERATIVE,MEDIUM,18,2623594,4363102,1739508,656090,
720,WASMCLOUD,FIB_ITERATIVE,MEDIUM,19,3067311,4986165,1918854,802302,
721,WASMCLOUD,FIB_ITERATIVE,MEDIUM,20,3053869,4685502,1631633,726365,
722,WASMCLOUD,FIB_ITERATIVE,MEDIUM,21,2856673,4729796,1873123,923076,
723,WASMCLOUD,FIB_ITERATIVE,MEDIUM,22,3371834,5279320,1907486,170172,
724,WASMCLOUD,FIB_ITERATIVE,MEDIUM,23,,,,,
725,WASMCLOUD,FIB_ITERATIVE,MEDIUM,24,3739075,4595323,856248,680328,
726,WASMCLOUD,FIB_ITERATIVE,LARGE,0,2558524,4043424,1484900,478995,
727,WASMCLOUD,FIB_ITERATIVE,LARGE,1,2460347,4239693,1779346,270319,
728,WASMCLOUD,FIB_ITERATIVE,LARGE,2,3340197,5498755,2158558,577030,
729,WASMCLOUD,FIB_ITERATIVE,LARGE,3,3707564,4460906,753342,222609,
730,WASMCLOUD,FIB_ITERATIVE,LARGE,4,3067313,4868782,1801469,56437,
731,WASMCLOUD,FIB_ITERATIVE,LARGE,5,2802473,5229386,2426913,890984,
732,WASMCLOUD,FIB_ITERATIVE,LARGE,6,3326170,5006622,1680452,606549,
733,WASMCLOUD,FIB_ITERATIVE,LARGE,7,3563572,5392538,1828966,870023,
734,WASMCLOUD,FIB_ITERATIVE,LARGE,8,3229725,4858593,1628868,374873,
735,WASMCLOUD,FIB_ITERATIVE,LARGE,9,3016234,3548994,532760,138296,
736,WASMCLOUD,FIB_ITERATIVE,LARGE,10,3418436,5390041,1971605,869802,
737,WASMCLOUD,FIB_ITERATIVE,LARGE,11,3325839,4782249,1456410,893178,
738,WASMCLOUD,FIB_ITERATIVE,LARGE,12,2997082,4877168,1880086,1012408,
739,WASMCLOUD,FIB_ITERATIVE,LARGE,13,2848549,3383684,535135,315121,
740,WASMCLOUD,FIB_ITERATIVE,LARGE,14,3847065,5371181,1524116,241494,
741,WASMCLOUD,FIB_ITERATIVE,LARGE,15,3608404,5589239,1980835,774625,
742,WASMCLOUD,FIB_ITERATIVE,LARGE,16,3521283,4192632,671349,85111,
743,WASMCLOUD,FIB_ITERATIVE,LARGE,17,3419192,4738315,1319123,208871,
744,WASMCLOUD,FIB_ITERATIVE,LARGE,18,2711779,3692875,981096,427308,
745,WASMCLOUD,FIB_ITERATIVE,LARGE,19,3658585,5860560,2201975,525097,
746,WASMCLOUD,FIB_ITERATIVE,LARGE,20,3088704,4295657,1206953,99072,
747,WASMCLOUD,FIB_ITERATIVE,LARGE,21,3680862,5368092,1687230,762330,
748,WASMCLOUD,FIB_ITERATIVE,LARGE,22,3122570,4928463,1805893,270608,
749,WASMCLOUD,FIB_ITERATIVE,LARGE,23,2896033,4466377,1570344,406808,
750,WASMCLOUD,FIB_ITERATIVE,LARGE,24,2543221,4152453,1609232,448959,
751,VINO,FIB_RECURSIVE,SMALL,0,23685,29828,6143,,
752,VINO,FIB_RECURSIVE,SMALL,1,23933,30559,6626,,
753,VINO,FIB_RECURSIVE,SMALL,2,29030,35785,6755,,
754,VINO,FIB_RECURSIVE,SMALL,3,24094,27986,3892,,
755,VINO,FIB_RECURSIVE,SMALL,4,24056,29675,5619,,
756,VINO,FIB_RECURSIVE,SMALL,5,24324,34505,10181,,
757,VINO,FIB_RECURSIVE,SMALL,6,22886,28594,5708,,
758,VINO,FIB_RECURSIVE,SMALL,7,24047,30561,6514,,
759,VINO,FIB_RECURSIVE,SMALL,8,27942,33109,5167,,
760,VINO,FIB_RECURSIVE,SMALL,9,29383,40049,10666,,
761,VINO,FIB_RECURSIVE,SMALL,10,29828,40898,11070,,
762,VINO,FIB_RECURSIVE,SMALL,11,26709,34484,7775,,
763,VINO,FIB_RECURSIVE,SMALL,12,23713,27319,3606,,
764,VINO,FIB_RECURSIVE,SMALL,13,24483,28956,4473,,
765,VINO,FIB_RECURSIVE,SMALL,14,25692,34499,8807,,
766,VINO,FIB_RECURSIVE,SMALL,15,35232,42873,7641,,
767,VINO,FIB_RECURSIVE,SMALL,16,23830,30190,6360,,
768,VINO,FIB_RECURSIVE,SMALL,17,23571,27177,3606,,
769,VINO,FIB_RECURSIVE,SMALL,18,25343,29585,4242,,
770,VINO,FIB_RECURSIVE,SMALL,19,24445,32818,8373,,
771,VINO,FIB_RECURSIVE,SMALL,20,29275,38623,9348,,
772,VINO,FIB_RECURSIVE,SMALL,21,26488,30713,4225,,
773,VINO,FIB_RECURSIVE,SMALL,22,30890,38270,7380,,
774,VINO,FIB_RECURSIVE,SMALL,23,32192,37808,5616,,
775,VINO,FIB_RECURSIVE,SMALL,24,24334,30545,6211,,
776,VINO,FIB_RECURSIVE,MEDIUM,0,23855,408462,384607,,
777,VINO,FIB_RECURSIVE,MEDIUM,1,25908,430947,405039,,
778,VINO,FIB_RECURSIVE,MEDIUM,2,29042,409896,380854,,
779,VINO,FIB_RECURSIVE,MEDIUM,3,24500,404177,379677,,
780,VINO,FIB_RECURSIVE,MEDIUM,4,42509,443870,401361,,
781,VINO,FIB_RECURSIVE,MEDIUM,5,24737,436710,411973,,
782,VINO,FIB_RECURSIVE,MEDIUM,6,23656,482761,459105,,
783,VINO,FIB_RECURSIVE,MEDIUM,7,29752,437159,407407,,
784,VINO,FIB_RECURSIVE,MEDIUM,8,23091,425992,402901,,
785,VINO,FIB_RECURSIVE,MEDIUM,9,26497,418792,392295,,
786,VINO,FIB_RECURSIVE,MEDIUM,10,37910,430848,392938,,
787,VINO,FIB_RECURSIVE,MEDIUM,11,27632,450879,423247,,
788,VINO,FIB_RECURSIVE,MEDIUM,12,28845,421748,392903,,
789,VINO,FIB_RECURSIVE,MEDIUM,13,22696,452323,429627,,
790,VINO,FIB_RECURSIVE,MEDIUM,14,23287,436157,412870,,
791,VINO,FIB_RECURSIVE,MEDIUM,15,23379,421917,398538,,
792,VINO,FIB_RECURSIVE,MEDIUM,16,22514,408573,386059,,
793,VINO,FIB_RECURSIVE,MEDIUM,17,25601,433374,407773,,
794,VINO,FIB_RECURSIVE,MEDIUM,18,29916,438266,408350,,
795,VINO,FIB_RECURSIVE,MEDIUM,19,32484,434656,402172,,
796,VINO,FIB_RECURSIVE,MEDIUM,20,24683,479536,454853,,
797,VINO,FIB_RECURSIVE,MEDIUM,21,30659,427294,396635,,
798,VINO,FIB_RECURSIVE,MEDIUM,22,23956,414600,390644,,
799,VINO,FIB_RECURSIVE,MEDIUM,23,24000,426749,402749,,
800,VINO,FIB_RECURSIVE,MEDIUM,24,32045,494042,461997,,
801,VINO,FIB_RECURSIVE,LARGE,0,34128,4196417,4162289,,
802,VINO,FIB_RECURSIVE,LARGE,1,23563,4206686,4183123,,
803,VINO,FIB_RECURSIVE,LARGE,2,25516,4317690,4292174,,
804,VINO,FIB_RECURSIVE,LARGE,3,32073,4254930,4222857,,
805,VINO,FIB_RECURSIVE,LARGE,4,39999,4221886,4181887,,
806,VINO,FIB_RECURSIVE,LARGE,5,34606,4190567,4155961,,
807,VINO,FIB_RECURSIVE,LARGE,6,23854,4238589,4214735,,
808,VINO,FIB_RECURSIVE,LARGE,7,28718,4229275,4200557,,
809,VINO,FIB_RECURSIVE,LARGE,8,24174,4177104,4152930,,
810,VINO,FIB_RECURSIVE,LARGE,9,23688,4160011,4136323,,
811,VINO,FIB_RECURSIVE,LARGE,10,35265,4254535,4219270,,
812,VINO,FIB_RECURSIVE,LARGE,11,37010,4187302,4150292,,
813,VINO,FIB_RECURSIVE,LARGE,12,34974,4183317,4148343,,
814,VINO,FIB_RECURSIVE,LARGE,13,23424,4242992,4219568,,
815,VINO,FIB_RECURSIVE,LARGE,14,30353,4314974,4284621,,
816,VINO,FIB_RECURSIVE,LARGE,15,22901,4241949,4219048,,
817,VINO,FIB_RECURSIVE,LARGE,16,28028,4239891,4211863,,
818,VINO,FIB_RECURSIVE,LARGE,17,22959,4254044,4231085,,
819,VINO,FIB_RECURSIVE,LARGE,18,23725,4273187,4249462,,
820,VINO,FIB_RECURSIVE,LARGE,19,24544,4241190,4216646,,
821,VINO,FIB_RECURSIVE,LARGE,20,23698,4203215,4179517,,
822,VINO,FIB_RECURSIVE,LARGE,21,23947,4190685,4166738,,
823,VINO,FIB_RECURSIVE,LARGE,22,24201,4174316,4150115,,
824,VINO,FIB_RECURSIVE,LARGE,23,32802,4222997,4190195,,
825,VINO,FIB_RECURSIVE,LARGE,24,24233,4226911,4202678,,
826,VINO,FIB_ITERATIVE,SMALL,0,23334,33220,9886,,
827,VINO,FIB_ITERATIVE,SMALL,1,27271,33353,6082,,
828,VINO,FIB_ITERATIVE,SMALL,2,29244,33860,4616,,
829,VINO,FIB_ITERATIVE,SMALL,3,25293,31618,6325,,
830,VINO,FIB_ITERATIVE,SMALL,4,25124,33310,8186,,
831,VINO,FIB_ITERATIVE,SMALL,5,31678,39236,7558,,
832,VINO,FIB_ITERATIVE,SMALL,6,23535,28888,5353,,
833,VINO,FIB_ITERATIVE,SMALL,7,24884,30449,5565,,
834,VINO,FIB_ITERATIVE,SMALL,8,27262,35928,8666,,
835,VINO,FIB_ITERATIVE,SMALL,9,28905,34027,5122,,
836,VINO,FIB_ITERATIVE,SMALL,10,22612,30205,7593,,
837,VINO,FIB_ITERATIVE,SMALL,11,22230,27393,5163,,
838,VINO,FIB_ITERATIVE,SMALL,12,24256,29211,4955,,
839,VINO,FIB_ITERATIVE,SMALL,13,38806,46396,7590,,
840,VINO,FIB_ITERATIVE,SMALL,14,27958,35913,7955,,
841,VINO,FIB_ITERATIVE,SMALL,15,31182,36245,5063,,
842,VINO,FIB_ITERATIVE,SMALL,16,26686,33643,6957,,
843,VINO,FIB_ITERATIVE,SMALL,17,26702,32660,5958,,
844,VINO,FIB_ITERATIVE,SMALL,18,25357,33409,8052,,
845,VINO,FIB_ITERATIVE,SMALL,19,25340,31031,5691,,
846,VINO,FIB_ITERATIVE,SMALL,20,28535,33318,4783,,
847,VINO,FIB_ITERATIVE,SMALL,21,23411,30436,7025,,
848,VINO,FIB_ITERATIVE,SMALL,22,22639,29299,6660,,
849,VINO,FIB_ITERATIVE,SMALL,23,32309,38400,6091,,
850,VINO,FIB_ITERATIVE,SMALL,24,26748,34891,8143,,
851,VINO,FIB_ITERATIVE,MEDIUM,0,26343,31611,5268,,
852,VINO,FIB_ITERATIVE,MEDIUM,1,23015,26637,3622,,
853,VINO,FIB_ITERATIVE,MEDIUM,2,25391,33013,7622,,
854,VINO,FIB_ITERATIVE,MEDIUM,3,22693,31682,8989,,
855,VINO,FIB_ITERATIVE,MEDIUM,4,30871,37881,7010,,
856,VINO,FIB_ITERATIVE,MEDIUM,5,22860,28250,5390,,
857,VINO,FIB_ITERATIVE,MEDIUM,6,22763,26013,3250,,
858,VINO,FIB_ITERATIVE,MEDIUM,7,35593,40908,5315,,
859,VINO,FIB_ITERATIVE,MEDIUM,8,25596,29680,4084,,
860,VINO,FIB_ITERATIVE,MEDIUM,9,32810,40696,7886,,
861,VINO,FIB_ITERATIVE,MEDIUM,10,24957,30367,5410,,
862,VINO,FIB_ITERATIVE,MEDIUM,11,25895,32912,7017,,
863,VINO,FIB_ITERATIVE,MEDIUM,12,24006,33865,9859,,
864,VINO,FIB_ITERATIVE,MEDIUM,13,23340,28409,5069,,
865,VINO,FIB_ITERATIVE,MEDIUM,14,26931,34882,7951,,
866,VINO,FIB_ITERATIVE,MEDIUM,15,25035,34180,9145,,
867,VINO,FIB_ITERATIVE,MEDIUM,16,23223,32074,8851,,
868,VINO,FIB_ITERATIVE,MEDIUM,17,26256,31807,5551,,
869,VINO,FIB_ITERATIVE,MEDIUM,18,40861,48091,7230,,
870,VINO,FIB_ITERATIVE,MEDIUM,19,46769,59712,12943,,
871,VINO,FIB_ITERATIVE,MEDIUM,20,24706,33587,8881,,
872,VINO,FIB_ITERATIVE,MEDIUM,21,24945,35020,10075,,
873,VINO,FIB_ITERATIVE,MEDIUM,22,39740,45341,5601,,
874,VINO,FIB_ITERATIVE,MEDIUM,23,28246,33720,5474,,
875,VINO,FIB_ITERATIVE,MEDIUM,24,32142,37060,4918,,
876,VINO,FIB_ITERATIVE,LARGE,0,23004,109743,86739,,
877,VINO,FIB_ITERATIVE,LARGE,1,26441,92224,65783,,
878,VINO,FIB_ITERATIVE,LARGE,2,23988,79387,55399,,
879,VINO,FIB_ITERATIVE,LARGE,3,22461,76976,54515,,
880,VINO,FIB_ITERATIVE,LARGE,4,22174,69660,47486,,
881,VINO,FIB_ITERATIVE,LARGE,5,27286,81851,54565,,
882,VINO,FIB_ITERATIVE,LARGE,6,35656,111010,75354,,
883,VINO,FIB_ITERATIVE,LARGE,7,24292,90276,65984,,
884,VINO,FIB_ITERATIVE,LARGE,8,29679,80307,50628,,
885,VINO,FIB_ITERATIVE,LARGE,9,26492,95736,69244,,
886,VINO,FIB_ITERATIVE,LARGE,10,24088,84477,60389,,
887,VINO,FIB_ITERATIVE,LARGE,11,26784,83629,56845,,
888,VINO,FIB_ITERATIVE,LARGE,12,35595,99872,64277,,
889,VINO,FIB_ITERATIVE,LARGE,13,23600,87031,63431,,
890,VINO,FIB_ITERATIVE,LARGE,14,39187,106294,67107,,
891,VINO,FIB_ITERATIVE,LARGE,15,25086,89359,64273,,
892,VINO,FIB_ITERATIVE,LARGE,16,24540,88579,64039,,
893,VINO,FIB_ITERATIVE,LARGE,17,27634,76115,48481,,
894,VINO,FIB_ITERATIVE,LARGE,18,23768,79560,55792,,
895,VINO,FIB_ITERATIVE,LARGE,19,24476,77997,53521,,
896,VINO,FIB_ITERATIVE,LARGE,20,23692,81186,57494,,
897,VINO,FIB_ITERATIVE,LARGE,21,43381,100081,56700,,
898,VINO,FIB_ITERATIVE,LARGE,22,22045,83479,61434,,
899,VINO,FIB_ITERATIVE,LARGE,23,22902,84586,61684,,
900,VINO,FIB_ITERATIVE,LARGE,24,22889,100089,77200,,
901,KRUSTLET,FIB_RECURSIVE,SMALL,0,1213788,1278186,64398,,
902,KRUSTLET,FIB_RECURSIVE,SMALL,1,1224901,1292981,68080,,
903,KRUSTLET,FIB_RECURSIVE,SMALL,2,1246109,1290724,44615,,
904,KRUSTLET,FIB_RECURSIVE,SMALL,3,1221982,1279646,57664,,
905,KRUSTLET,FIB_RECURSIVE,SMALL,4,1239689,1279226,39537,,
906,KRUSTLET,FIB_RECURSIVE,SMALL,5,1220983,1291304,70321,,
907,KRUSTLET,FIB_RECURSIVE,SMALL,6,1240859,1275564,34705,,
908,KRUSTLET,FIB_RECURSIVE,SMALL,7,1230960,1286942,55982,,
909,KRUSTLET,FIB_RECURSIVE,SMALL,8,1225733,1282276,56543,,
910,KRUSTLET,FIB_RECURSIVE,SMALL,9,1231040,1277929,46889,,
911,KRUSTLET,FIB_RECURSIVE,SMALL,10,1277039,1325382,48343,,
912,KRUSTLET,FIB_RECURSIVE,SMALL,11,1235519,1279613,44094,,
913,KRUSTLET,FIB_RECURSIVE,SMALL,12,1296790,1343987,47197,,
914,KRUSTLET,FIB_RECURSIVE,SMALL,13,284738,315942,31204,,
915,KRUSTLET,FIB_RECURSIVE,SMALL,14,1237067,1281479,44412,,
916,KRUSTLET,FIB_RECURSIVE,SMALL,15,317883,372220,54337,,
917,KRUSTLET,FIB_RECURSIVE,SMALL,16,273786,317646,43860,,
918,KRUSTLET,FIB_RECURSIVE,SMALL,17,1254866,1280035,25169,,
919,KRUSTLET,FIB_RECURSIVE,SMALL,18,304368,368972,64604,,
920,KRUSTLET,FIB_RECURSIVE,SMALL,19,289351,366837,77486,,
921,KRUSTLET,FIB_RECURSIVE,SMALL,20,279056,318588,39532,,
922,KRUSTLET,FIB_RECURSIVE,SMALL,21,264604,317062,52458,,
923,KRUSTLET,FIB_RECURSIVE,SMALL,22,1311942,1331592,19650,,
924,KRUSTLET,FIB_RECURSIVE,SMALL,23,1285107,1350510,65403,,
925,KRUSTLET,FIB_RECURSIVE,SMALL,24,270732,318316,47584,,
926,KRUSTLET,FIB_RECURSIVE,MEDIUM,0,272810,971345,698535,,
927,KRUSTLET,FIB_RECURSIVE,MEDIUM,1,1250128,1903780,653652,,
928,KRUSTLET,FIB_RECURSIVE,MEDIUM,2,1234895,1884644,649749,,
929,KRUSTLET,FIB_RECURSIVE,MEDIUM,3,270808,973705,702897,,
930,KRUSTLET,FIB_RECURSIVE,MEDIUM,4,1248420,1885685,637265,,
931,KRUSTLET,FIB_RECURSIVE,MEDIUM,5,252458,969488,717030,,
932,KRUSTLET,FIB_RECURSIVE,MEDIUM,6,1252869,1931457,678588,,
933,KRUSTLET,FIB_RECURSIVE,MEDIUM,7,1283483,1936858,653375,,
934,KRUSTLET,FIB_RECURSIVE,MEDIUM,8,233257,921410,688153,,
935,KRUSTLET,FIB_RECURSIVE,MEDIUM,9,270772,922110,651338,,
936,KRUSTLET,FIB_RECURSIVE,MEDIUM,10,1227618,1882045,654427,,
937,KRUSTLET,FIB_RECURSIVE,MEDIUM,11,257630,1021305,763675,,
938,KRUSTLET,FIB_RECURSIVE,MEDIUM,12,1261608,1926035,664427,,
939,KRUSTLET,FIB_RECURSIVE,MEDIUM,13,288930,1022779,733849,,
940,KRUSTLET,FIB_RECURSIVE,MEDIUM,14,296495,1028509,732014,,
941,KRUSTLET,FIB_RECURSIVE,MEDIUM,15,1291971,1932872,640901,,
942,KRUSTLET,FIB_RECURSIVE,MEDIUM,16,1246088,1878656,632568,,
943,KRUSTLET,FIB_RECURSIVE,MEDIUM,17,271888,972064,700176,,
944,KRUSTLET,FIB_RECURSIVE,MEDIUM,18,1231395,1884408,653013,,
945,KRUSTLET,FIB_RECURSIVE,MEDIUM,19,1295838,1940255,644417,,
946,KRUSTLET,FIB_RECURSIVE,MEDIUM,20,1306092,1948194,642102,,
947,KRUSTLET,FIB_RECURSIVE,MEDIUM,21,1225663,1878931,653268,,
948,KRUSTLET,FIB_RECURSIVE,MEDIUM,22,1212406,1887196,674790,,
949,KRUSTLET,FIB_RECURSIVE,MEDIUM,23,1236653,1886242,649589,,
950,KRUSTLET,FIB_RECURSIVE,MEDIUM,24,1262362,1891880,629518,,
951,KRUSTLET,FIB_RECURSIVE,LARGE,0,303582,7008407,6704825,,
952,KRUSTLET,FIB_RECURSIVE,LARGE,1,1248367,7881138,6632771,,
953,KRUSTLET,FIB_RECURSIVE,LARGE,2,295941,6956830,6660889,,
954,KRUSTLET,FIB_RECURSIVE,LARGE,3,299908,6967791,6667883,,
955,KRUSTLET,FIB_RECURSIVE,LARGE,4,329531,7060992,6731461,,
956,KRUSTLET,FIB_RECURSIVE,LARGE,5,1239846,7822603,6582757,,
957,KRUSTLET,FIB_RECURSIVE,LARGE,6,278698,6960509,6681811,,
958,KRUSTLET,FIB_RECURSIVE,LARGE,7,1263825,7887346,6623521,,
959,KRUSTLET,FIB_RECURSIVE,LARGE,8,1234169,7840790,6606621,,
960,KRUSTLET,FIB_RECURSIVE,LARGE,9,1237697,7820067,6582370,,
961,KRUSTLET,FIB_RECURSIVE,LARGE,10,240636,6810600,6569964,,
962,KRUSTLET,FIB_RECURSIVE,LARGE,11,1214736,7824225,6609489,,
963,KRUSTLET,FIB_RECURSIVE,LARGE,12,1230416,7825201,6594785,,
964,KRUSTLET,FIB_RECURSIVE,LARGE,13,300763,6980733,6679970,,
965,KRUSTLET,FIB_RECURSIVE,LARGE,14,1258703,7827733,6569030,,
966,KRUSTLET,FIB_RECURSIVE,LARGE,15,280738,6962807,6682069,,
967,KRUSTLET,FIB_RECURSIVE,LARGE,16,1296303,7945186,6648883,,
968,KRUSTLET,FIB_RECURSIVE,LARGE,17,1269993,7811244,6541251,,
969,KRUSTLET,FIB_RECURSIVE,LARGE,18,1221774,7808953,6587179,,
970,KRUSTLET,FIB_RECURSIVE,LARGE,19,259620,6905160,6645540,,
971,KRUSTLET,FIB_RECURSIVE,LARGE,20,1264945,7775211,6510266,,
972,KRUSTLET,FIB_RECURSIVE,LARGE,21,1235868,7826503,6590635,,
973,KRUSTLET,FIB_RECURSIVE,LARGE,22,1301903,7886955,6585052,,
974,KRUSTLET,FIB_RECURSIVE,LARGE,23,1304910,7926755,6621845,,
975,KRUSTLET,FIB_RECURSIVE,LARGE,24,1268410,7868863,6600453,,
976,KRUSTLET,FIB_ITERATIVE,SMALL,0,1244412,1288489,44077,,
977,KRUSTLET,FIB_ITERATIVE,SMALL,1,1264914,1330628,65714,,
978,KRUSTLET,FIB_ITERATIVE,SMALL,2,1225583,1282932,57349,,
979,KRUSTLET,FIB_ITERATIVE,SMALL,3,1261006,1331292,70286,,
980,KRUSTLET,FIB_ITERATIVE,SMALL,4,1240415,1290812,50397,,
981,KRUSTLET,FIB_ITERATIVE,SMALL,5,1234861,1281349,46488,,
982,KRUSTLET,FIB_ITERATIVE,SMALL,6,1292595,1326015,33420,,
983,KRUSTLET,FIB_ITERATIVE,SMALL,7,298070,368658,70588,,
984,KRUSTLET,FIB_ITERATIVE,SMALL,8,1249902,1283907,34005,,
985,KRUSTLET,FIB_ITERATIVE,SMALL,9,1252307,1282872,30565,,
986,KRUSTLET,FIB_ITERATIVE,SMALL,10,290908,317200,26292,,
987,KRUSTLET,FIB_ITERATIVE,SMALL,11,1229213,1282889,53676,,
988,KRUSTLET,FIB_ITERATIVE,SMALL,12,1272661,1336048,63387,,
989,KRUSTLET,FIB_ITERATIVE,SMALL,13,1267746,1334057,66311,,
990,KRUSTLET,FIB_ITERATIVE,SMALL,14,265375,316694,51319,,
991,KRUSTLET,FIB_ITERATIVE,SMALL,15,1268010,1328957,60947,,
992,KRUSTLET,FIB_ITERATIVE,SMALL,16,1285195,1334846,49651,,
993,KRUSTLET,FIB_ITERATIVE,SMALL,17,267231,320004,52773,,
994,KRUSTLET,FIB_ITERATIVE,SMALL,18,326619,371503,44884,,
995,KRUSTLET,FIB_ITERATIVE,SMALL,19,299457,366684,67227,,
996,KRUSTLET,FIB_ITERATIVE,SMALL,20,1272256,1333350,61094,,
997,KRUSTLET,FIB_ITERATIVE,SMALL,21,1244776,1288315,43539,,
998,KRUSTLET,FIB_ITERATIVE,SMALL,22,1290388,1329001,38613,,
999,KRUSTLET,FIB_ITERATIVE,SMALL,23,251311,322886,71575,,
1000,KRUSTLET,FIB_ITERATIVE,SMALL,24,1244707,1279184,34477,,
1001,KRUSTLET,FIB_ITERATIVE,MEDIUM,0,1223643,1287277,63634,,
1002,KRUSTLET,FIB_ITERATIVE,MEDIUM,1,1224240,1275663,51423,,
1003,KRUSTLET,FIB_ITERATIVE,MEDIUM,2,270598,323035,52437,,
1004,KRUSTLET,FIB_ITERATIVE,MEDIUM,3,1251506,1282008,30502,,
1005,KRUSTLET,FIB_ITERATIVE,MEDIUM,4,1262384,1334386,72002,,
1006,KRUSTLET,FIB_ITERATIVE,MEDIUM,5,1247743,1281555,33812,,
1007,KRUSTLET,FIB_ITERATIVE,MEDIUM,6,280729,319843,39114,,
1008,KRUSTLET,FIB_ITERATIVE,MEDIUM,7,311703,365526,53823,,
1009,KRUSTLET,FIB_ITERATIVE,MEDIUM,8,293443,317311,23868,,
1010,KRUSTLET,FIB_ITERATIVE,MEDIUM,9,330512,366437,35925,,
1011,KRUSTLET,FIB_ITERATIVE,MEDIUM,10,1233046,1282134,49088,,
1012,KRUSTLET,FIB_ITERATIVE,MEDIUM,11,279786,320821,41035,,
1013,KRUSTLET,FIB_ITERATIVE,MEDIUM,12,1274534,1334027,59493,,
1014,KRUSTLET,FIB_ITERATIVE,MEDIUM,13,1287475,1327228,39753,,
1015,KRUSTLET,FIB_ITERATIVE,MEDIUM,14,1258464,1290585,32121,,
1016,KRUSTLET,FIB_ITERATIVE,MEDIUM,15,1255348,1282575,27227,,
1017,KRUSTLET,FIB_ITERATIVE,MEDIUM,16,1275995,1344200,68205,,
1018,KRUSTLET,FIB_ITERATIVE,MEDIUM,17,1221290,1279830,58540,,
1019,KRUSTLET,FIB_ITERATIVE,MEDIUM,18,1279618,1333244,53626,,
1020,KRUSTLET,FIB_ITERATIVE,MEDIUM,19,1255154,1282744,27590,,
1021,KRUSTLET,FIB_ITERATIVE,MEDIUM,20,1233781,1284533,50752,,
1022,KRUSTLET,FIB_ITERATIVE,MEDIUM,21,1289283,1332658,43375,,
1023,KRUSTLET,FIB_ITERATIVE,MEDIUM,22,267230,318997,51767,,
1024,KRUSTLET,FIB_ITERATIVE,MEDIUM,23,1238685,1287889,49204,,
1025,KRUSTLET,FIB_ITERATIVE,MEDIUM,24,1234368,1291030,56662,,
1026,KRUSTLET,FIB_ITERATIVE,LARGE,0,237641,266883,29242,,
1027,KRUSTLET,FIB_ITERATIVE,LARGE,1,1246427,1282545,36118,,
1028,KRUSTLET,FIB_ITERATIVE,LARGE,2,1272199,1334301,62102,,
1029,KRUSTLET,FIB_ITERATIVE,LARGE,3,299960,370934,70974,,
1030,KRUSTLET,FIB_ITERATIVE,LARGE,4,1244791,1295619,50828,,
1031,KRUSTLET,FIB_ITERATIVE,LARGE,5,1234290,1284454,50164,,
1032,KRUSTLET,FIB_ITERATIVE,LARGE,6,1257107,1277965,20858,,
1033,KRUSTLET,FIB_ITERATIVE,LARGE,7,1256316,1286326,30010,,
1034,KRUSTLET,FIB_ITERATIVE,LARGE,8,236978,268083,31105,,
1035,KRUSTLET,FIB_ITERATIVE,LARGE,9,1288929,1336799,47870,,
1036,KRUSTLET,FIB_ITERATIVE,LARGE,10,1263217,1324522,61305,,
1037,KRUSTLET,FIB_ITERATIVE,LARGE,11,1262788,1292657,29869,,
1038,KRUSTLET,FIB_ITERATIVE,LARGE,12,1219743,1279473,59730,,
1039,KRUSTLET,FIB_ITERATIVE,LARGE,13,1238249,1279201,40952,,
1040,KRUSTLET,FIB_ITERATIVE,LARGE,14,1235583,1278617,43034,,
1041,KRUSTLET,FIB_ITERATIVE,LARGE,15,1243382,1279867,36485,,
1042,KRUSTLET,FIB_ITERATIVE,LARGE,16,1286621,1329299,42678,,
1043,KRUSTLET,FIB_ITERATIVE,LARGE,17,1264296,1327357,63061,,
1044,KRUSTLET,FIB_ITERATIVE,LARGE,18,1244707,1295966,51259,,
1045,KRUSTLET,FIB_ITERATIVE,LARGE,19,302876,366536,63660,,
1046,KRUSTLET,FIB_ITERATIVE,LARGE,20,300835,371836,71001,,
1047,KRUSTLET,FIB_ITERATIVE,LARGE,21,1253961,1332291,78330,,
1048,KRUSTLET,FIB_ITERATIVE,LARGE,22,1243221,1287790,44569,,
1049,KRUSTLET,FIB_ITERATIVE,LARGE,23,1231332,1282612,51280,,
1050,KRUSTLET,FIB_ITERATIVE,LARGE,24,1247583,1288400,40817,,
1051,WASMEDGE_ON_K8S,FIB_RECURSIVE,SMALL,0,722082,1730103,1008021,,
1052,WASMEDGE_ON_K8S,FIB_RECURSIVE,SMALL,1,1192196,1733181,540985,,
1053,WASMEDGE_ON_K8S,FIB_RECURSIVE,SMALL,2,698794,1739026,1040232,,
1054,WASMEDGE_ON_K8S,FIB_RECURSIVE,SMALL,3,772038,1746971,974933,,
1055,WASMEDGE_ON_K8S,FIB_RECURSIVE,SMALL,4,1245117,1788751,543634,,
1056,WASMEDGE_ON_K8S,FIB_RECURSIVE,SMALL,5,802778,1732852,930074,,
1057,WASMEDGE_ON_K8S,FIB_RECURSIVE,SMALL,6,1304573,1783724,479151,,
1058,WASMEDGE_ON_K8S,FIB_RECURSIVE,SMALL,7,686382,1750484,1064102,,
1059,WASMEDGE_ON_K8S,FIB_RECURSIVE,SMALL,8,746251,1732369,986118,,
1060,WASMEDGE_ON_K8S,FIB_RECURSIVE,SMALL,9,749867,1805189,1055322,,
1061,WASMEDGE_ON_K8S,FIB_RECURSIVE,SMALL,10,1222699,1781558,558859,,
1062,WASMEDGE_ON_K8S,FIB_RECURSIVE,SMALL,11,1258089,1642195,384106,,
1063,WASMEDGE_ON_K8S,FIB_RECURSIVE,SMALL,12,774319,1740503,966184,,
1064,WASMEDGE_ON_K8S,FIB_RECURSIVE,SMALL,13,1229603,1758836,529233,,
1065,WASMEDGE_ON_K8S,FIB_RECURSIVE,SMALL,14,735931,1738645,1002714,,
1066,WASMEDGE_ON_K8S,FIB_RECURSIVE,SMALL,15,793162,1786796,993634,,
1067,WASMEDGE_ON_K8S,FIB_RECURSIVE,SMALL,16,726878,778614,51736,,
1068,WASMEDGE_ON_K8S,FIB_RECURSIVE,SMALL,17,1170237,1789196,618959,,
1069,WASMEDGE_ON_K8S,FIB_RECURSIVE,SMALL,18,1251247,2808390,1557143,,
1070,WASMEDGE_ON_K8S,FIB_RECURSIVE,SMALL,19,790050,1796516,1006466,,
1071,WASMEDGE_ON_K8S,FIB_RECURSIVE,SMALL,20,737965,1795446,1057481,,
1072,WASMEDGE_ON_K8S,FIB_RECURSIVE,SMALL,21,731078,778953,47875,,
1073,WASMEDGE_ON_K8S,FIB_RECURSIVE,SMALL,22,706964,825245,118281,,
1074,WASMEDGE_ON_K8S,FIB_RECURSIVE,SMALL,23,1232874,1788872,555998,,
1075,WASMEDGE_ON_K8S,FIB_RECURSIVE,SMALL,24,744582,1779392,1034810,,
1076,WASMEDGE_ON_K8S,FIB_RECURSIVE,MEDIUM,0,788494,25839574,25051080,,
1077,WASMEDGE_ON_K8S,FIB_RECURSIVE,MEDIUM,1,1192850,26800085,25607235,,
1078,WASMEDGE_ON_K8S,FIB_RECURSIVE,MEDIUM,2,723855,26831864,26108009,,
1079,WASMEDGE_ON_K8S,FIB_RECURSIVE,MEDIUM,3,1223961,26855744,25631783,,
1080,WASMEDGE_ON_K8S,FIB_RECURSIVE,MEDIUM,4,723426,25857562,25134136,,
1081,WASMEDGE_ON_K8S,FIB_RECURSIVE,MEDIUM,5,718933,26880145,26161212,,
1082,WASMEDGE_ON_K8S,FIB_RECURSIVE,MEDIUM,6,715464,28860748,28145284,,
1083,WASMEDGE_ON_K8S,FIB_RECURSIVE,MEDIUM,7,786455,26830291,26043836,,
1084,WASMEDGE_ON_K8S,FIB_RECURSIVE,MEDIUM,8,813508,26873537,26060029,,
1085,WASMEDGE_ON_K8S,FIB_RECURSIVE,MEDIUM,9,762769,26872957,26110188,,
1086,WASMEDGE_ON_K8S,FIB_RECURSIVE,MEDIUM,10,767086,26852293,26085207,,
1087,WASMEDGE_ON_K8S,FIB_RECURSIVE,MEDIUM,11,747168,26852566,26105398,,
1088,WASMEDGE_ON_K8S,FIB_RECURSIVE,MEDIUM,12,754409,25836313,25081904,,
1089,WASMEDGE_ON_K8S,FIB_RECURSIVE,MEDIUM,13,765683,25847553,25081870,,
1090,WASMEDGE_ON_K8S,FIB_RECURSIVE,MEDIUM,14,695814,25842081,25146267,,
1091,WASMEDGE_ON_K8S,FIB_RECURSIVE,MEDIUM,15,750423,26895502,26145079,,
1092,WASMEDGE_ON_K8S,FIB_RECURSIVE,MEDIUM,16,782810,25849753,25066943,,
1093,WASMEDGE_ON_K8S,FIB_RECURSIVE,MEDIUM,17,709570,25850346,25140776,,
1094,WASMEDGE_ON_K8S,FIB_RECURSIVE,MEDIUM,18,800348,25860926,25060578,,
1095,WASMEDGE_ON_K8S,FIB_RECURSIVE,MEDIUM,19,745577,26866982,26121405,,
1096,WASMEDGE_ON_K8S,FIB_RECURSIVE,MEDIUM,20,1258184,26848536,25590352,,
1097,WASMEDGE_ON_K8S,FIB_RECURSIVE,MEDIUM,21,749210,26853377,26104167,,
1098,WASMEDGE_ON_K8S,FIB_RECURSIVE,MEDIUM,22,741507,25852372,25110865,,
1099,WASMEDGE_ON_K8S,FIB_RECURSIVE,MEDIUM,23,1221648,26834365,25612717,,
1100,WASMEDGE_ON_K8S,FIB_RECURSIVE,MEDIUM,24,1210250,26775646,25565396,,
1101,WASMEDGE_ON_K8S,FIB_ITERATIVE,SMALL,0,856929,1637311,780382,,
1102,WASMEDGE_ON_K8S,FIB_ITERATIVE,SMALL,1,700903,1734939,1034036,,
1103,WASMEDGE_ON_K8S,FIB_ITERATIVE,SMALL,2,799694,1681174,881480,,
1104,WASMEDGE_ON_K8S,FIB_ITERATIVE,SMALL,3,752834,1696174,943340,,
1105,WASMEDGE_ON_K8S,FIB_ITERATIVE,SMALL,4,735700,1680674,944974,,
1106,WASMEDGE_ON_K8S,FIB_ITERATIVE,SMALL,5,758267,1685744,927477,,
1107,WASMEDGE_ON_K8S,FIB_ITERATIVE,SMALL,6,1321841,1686690,364849,,
1108,WASMEDGE_ON_K8S,FIB_ITERATIVE,SMALL,7,1363808,1741248,377440,,
1109,WASMEDGE_ON_K8S,FIB_ITERATIVE,SMALL,8,1218099,1739340,521241,,
1110,WASMEDGE_ON_K8S,FIB_ITERATIVE,SMALL,9,1315504,1792452,476948,,
1111,WASMEDGE_ON_K8S,FIB_ITERATIVE,SMALL,10,1238023,1700141,462118,,
1112,WASMEDGE_ON_K8S,FIB_ITERATIVE,SMALL,11,796042,1683285,887243,,
1113,WASMEDGE_ON_K8S,FIB_ITERATIVE,SMALL,12,810050,1691832,881782,,
1114,WASMEDGE_ON_K8S,FIB_ITERATIVE,SMALL,13,740144,1734566,994422,,
1115,WASMEDGE_ON_K8S,FIB_ITERATIVE,SMALL,14,1285131,1685687,400556,,
1116,WASMEDGE_ON_K8S,FIB_ITERATIVE,SMALL,15,727882,1740217,1012335,,
1117,WASMEDGE_ON_K8S,FIB_ITERATIVE,SMALL,16,868616,1637297,768681,,
1118,WASMEDGE_ON_K8S,FIB_ITERATIVE,SMALL,17,762966,1738954,975988,,
1119,WASMEDGE_ON_K8S,FIB_ITERATIVE,SMALL,18,787825,1729316,941491,,
1120,WASMEDGE_ON_K8S,FIB_ITERATIVE,SMALL,19,748556,1703879,955323,,
1121,WASMEDGE_ON_K8S,FIB_ITERATIVE,SMALL,20,815323,1794523,979200,,
1122,WASMEDGE_ON_K8S,FIB_ITERATIVE,SMALL,21,812262,1735291,923029,,
1123,WASMEDGE_ON_K8S,FIB_ITERATIVE,SMALL,22,806699,1735220,928521,,
1124,WASMEDGE_ON_K8S,FIB_ITERATIVE,SMALL,23,792464,1686158,893694,,
1125,WASMEDGE_ON_K8S,FIB_ITERATIVE,SMALL,24,797027,1735300,938273,,
1126,WASMEDGE_ON_K8S,FIB_ITERATIVE,MEDIUM,0,1233773,1693814,460041,,
1127,WASMEDGE_ON_K8S,FIB_ITERATIVE,MEDIUM,1,807729,1680967,873238,,
1128,WASMEDGE_ON_K8S,FIB_ITERATIVE,MEDIUM,2,748067,1651494,903427,,
1129,WASMEDGE_ON_K8S,FIB_ITERATIVE,MEDIUM,3,828040,1691017,862977,,
1130,WASMEDGE_ON_K8S,FIB_ITERATIVE,MEDIUM,4,795815,1751151,955336,,
1131,WASMEDGE_ON_K8S,FIB_ITERATIVE,MEDIUM,5,775507,1698103,922596,,
1132,WASMEDGE_ON_K8S,FIB_ITERATIVE,MEDIUM,6,1264504,1691433,426929,,
1133,WASMEDGE_ON_K8S,FIB_ITERATIVE,MEDIUM,7,787825,1691193,903368,,
1134,WASMEDGE_ON_K8S,FIB_ITERATIVE,MEDIUM,8,738360,1703741,965381,,
1135,WASMEDGE_ON_K8S,FIB_ITERATIVE,MEDIUM,9,1183610,1576326,392716,,
1136,WASMEDGE_ON_K8S,FIB_ITERATIVE,MEDIUM,10,769069,1741560,972491,,
1137,WASMEDGE_ON_K8S,FIB_ITERATIVE,MEDIUM,11,1224444,2655817,1431373,,
1138,WASMEDGE_ON_K8S,FIB_ITERATIVE,MEDIUM,12,763482,1688259,924777,,
1139,WASMEDGE_ON_K8S,FIB_ITERATIVE,MEDIUM,13,1248129,1698706,450577,,
1140,WASMEDGE_ON_K8S,FIB_ITERATIVE,MEDIUM,14,1219283,2714123,1494840,,
1141,WASMEDGE_ON_K8S,FIB_ITERATIVE,MEDIUM,15,733121,1688800,955679,,
1142,WASMEDGE_ON_K8S,FIB_ITERATIVE,MEDIUM,16,821320,1711658,890338,,
1143,WASMEDGE_ON_K8S,FIB_ITERATIVE,MEDIUM,17,1301025,2711006,1409981,,
1144,WASMEDGE_ON_K8S,FIB_ITERATIVE,MEDIUM,18,782234,1682888,900654,,
1145,WASMEDGE_ON_K8S,FIB_ITERATIVE,MEDIUM,19,751170,1709563,958393,,
1146,WASMEDGE_ON_K8S,FIB_ITERATIVE,MEDIUM,20,737067,1739440,1002373,,
1147,WASMEDGE_ON_K8S,FIB_ITERATIVE,MEDIUM,21,699567,1692949,993382,,
1148,WASMEDGE_ON_K8S,FIB_ITERATIVE,MEDIUM,22,834686,1692096,857410,,
1149,WASMEDGE_ON_K8S,FIB_ITERATIVE,MEDIUM,23,730425,1699339,968914,,
1150,WASMEDGE_ON_K8S,FIB_ITERATIVE,MEDIUM,24,1325796,1692492,366696,,
1151,WASMEDGE_ON_K8S,FIB_ITERATIVE,LARGE,0,773648,1693413,919765,,
1152,WASMEDGE_ON_K8S,FIB_ITERATIVE,LARGE,1,810204,1692458,882254,,
1153,WASMEDGE_ON_K8S,FIB_ITERATIVE,LARGE,2,1225639,1691026,465387,,
1154,WASMEDGE_ON_K8S,FIB_ITERATIVE,LARGE,3,752999,1795439,1042440,,
1155,WASMEDGE_ON_K8S,FIB_ITERATIVE,LARGE,4,1296818,2672992,1376174,,
1156,WASMEDGE_ON_K8S,FIB_ITERATIVE,LARGE,5,749697,1760068,1010371,,
1157,WASMEDGE_ON_K8S,FIB_ITERATIVE,LARGE,6,738669,1684524,945855,,
1158,WASMEDGE_ON_K8S,FIB_ITERATIVE,LARGE,7,859544,1752804,893260,,
1159,WASMEDGE_ON_K8S,FIB_ITERATIVE,LARGE,8,819424,1537885,718461,,
1160,WASMEDGE_ON_K8S,FIB_ITERATIVE,LARGE,9,763657,1739111,975454,,
1161,WASMEDGE_ON_K8S,FIB_ITERATIVE,LARGE,10,1318234,2646336,1328102,,
1162,WASMEDGE_ON_K8S,FIB_ITERATIVE,LARGE,11,753468,1795068,1041600,,
1163,WASMEDGE_ON_K8S,FIB_ITERATIVE,LARGE,12,757933,1749145,991212,,
1164,WASMEDGE_ON_K8S,FIB_ITERATIVE,LARGE,13,1219916,1740124,520208,,
1165,WASMEDGE_ON_K8S,FIB_ITERATIVE,LARGE,14,756167,1595204,839037,,
1166,WASMEDGE_ON_K8S,FIB_ITERATIVE,LARGE,15,789984,1717776,927792,,
1167,WASMEDGE_ON_K8S,FIB_ITERATIVE,LARGE,16,850929,1691350,840421,,
1168,WASMEDGE_ON_K8S,FIB_ITERATIVE,LARGE,17,801033,1696658,895625,,
1169,WASMEDGE_ON_K8S,FIB_ITERATIVE,LARGE,18,757011,1658824,901813,,
1170,WASMEDGE_ON_K8S,FIB_ITERATIVE,LARGE,19,792179,1682866,890687,,
1171,WASMEDGE_ON_K8S,FIB_ITERATIVE,LARGE,20,1310642,1678217,367575,,
1172,WASMEDGE_ON_K8S,FIB_ITERATIVE,LARGE,21,774811,1691946,917135,,
1173,WASMEDGE_ON_K8S,FIB_ITERATIVE,LARGE,22,1258370,1740047,481677,,
1174,WASMEDGE_ON_K8S,FIB_ITERATIVE,LARGE,23,2153636,2702009,548373,,
1175,WASMEDGE_ON_K8S,FIB_ITERATIVE,LARGE,24,812714,1747870,935156,,
1176,K8S_WASMER,FIB_RECURSIVE,SMALL,0,774360,1751666,977306,,
1177,K8S_WASMER,FIB_RECURSIVE,SMALL,1,778288,1796676,1018388,,
1178,K8S_WASMER,FIB_RECURSIVE,SMALL,2,756635,1750691,994056,,
1179,K8S_WASMER,FIB_RECURSIVE,SMALL,3,755481,1754238,998757,,
1180,K8S_WASMER,FIB_RECURSIVE,SMALL,4,723168,1749025,1025857,,
1181,K8S_WASMER,FIB_RECURSIVE,SMALL,5,822728,1649414,826686,,
1182,K8S_WASMER,FIB_RECURSIVE,SMALL,6,719191,1786490,1067299,,
1183,K8S_WASMER,FIB_RECURSIVE,SMALL,7,733094,1790345,1057251,,
1184,K8S_WASMER,FIB_RECURSIVE,SMALL,8,706978,1751418,1044440,,
1185,K8S_WASMER,FIB_RECURSIVE,SMALL,9,715741,1795545,1079804,,
1186,K8S_WASMER,FIB_RECURSIVE,SMALL,10,731859,1744377,1012518,,
1187,K8S_WASMER,FIB_RECURSIVE,SMALL,11,765819,1738983,973164,,
1188,K8S_WASMER,FIB_RECURSIVE,SMALL,12,744418,1797654,1053236,,
1189,K8S_WASMER,FIB_RECURSIVE,SMALL,13,694443,781384,86941,,
1190,K8S_WASMER,FIB_RECURSIVE,SMALL,14,760361,1782814,1022453,,
1191,K8S_WASMER,FIB_RECURSIVE,SMALL,15,724392,1749228,1024836,,
1192,K8S_WASMER,FIB_RECURSIVE,SMALL,16,746328,1748925,1002597,,
1193,K8S_WASMER,FIB_RECURSIVE,SMALL,17,813209,1789320,976111,,
1194,K8S_WASMER,FIB_RECURSIVE,SMALL,18,804022,1762375,958353,,
1195,K8S_WASMER,FIB_RECURSIVE,SMALL,19,820539,1772194,951655,,
1196,K8S_WASMER,FIB_RECURSIVE,SMALL,20,800142,1792021,991879,,
1197,K8S_WASMER,FIB_RECURSIVE,SMALL,21,747394,1769528,1022134,,
1198,K8S_WASMER,FIB_RECURSIVE,SMALL,22,745183,1760027,1014844,,
1199,K8S_WASMER,FIB_RECURSIVE,SMALL,23,743366,1754027,1010661,,
1200,K8S_WASMER,FIB_RECURSIVE,SMALL,24,776612,1793839,1017227,,
1201,K8S_WASMER,FIB_RECURSIVE,MEDIUM,0,741289,1791938,1050649,,
1202,K8S_WASMER,FIB_RECURSIVE,MEDIUM,1,791945,1837119,1045174,,
1203,K8S_WASMER,FIB_RECURSIVE,MEDIUM,2,781002,1789830,1008828,,
1204,K8S_WASMER,FIB_RECURSIVE,MEDIUM,3,761812,1751461,989649,,
1205,K8S_WASMER,FIB_RECURSIVE,MEDIUM,4,729174,1782248,1053074,,
1206,K8S_WASMER,FIB_RECURSIVE,MEDIUM,5,809015,1762713,953698,,
1207,K8S_WASMER,FIB_RECURSIVE,MEDIUM,6,797707,1642718,845011,,
1208,K8S_WASMER,FIB_RECURSIVE,MEDIUM,7,738130,1798720,1060590,,
1209,K8S_WASMER,FIB_RECURSIVE,MEDIUM,8,775374,1786030,1010656,,
1210,K8S_WASMER,FIB_RECURSIVE,MEDIUM,9,742101,1792289,1050188,,
1211,K8S_WASMER,FIB_RECURSIVE,MEDIUM,10,819787,1793166,973379,,
1212,K8S_WASMER,FIB_RECURSIVE,MEDIUM,11,791742,1791856,1000114,,
1213,K8S_WASMER,FIB_RECURSIVE,MEDIUM,12,763719,1741519,977800,,
1214,K8S_WASMER,FIB_RECURSIVE,MEDIUM,13,757016,1807456,1050440,,
1215,K8S_WASMER,FIB_RECURSIVE,MEDIUM,14,762229,1739067,976838,,
1216,K8S_WASMER,FIB_RECURSIVE,MEDIUM,15,740195,1738666,998471,,
1217,K8S_WASMER,FIB_RECURSIVE,MEDIUM,16,758519,1741255,982736,,
1218,K8S_WASMER,FIB_RECURSIVE,MEDIUM,17,772285,1792474,1020189,,
1219,K8S_WASMER,FIB_RECURSIVE,MEDIUM,18,724349,1749520,1025171,,
1220,K8S_WASMER,FIB_RECURSIVE,MEDIUM,19,787042,1797940,1010898,,
1221,K8S_WASMER,FIB_RECURSIVE,MEDIUM,20,762669,1802242,1039573,,
1222,K8S_WASMER,FIB_RECURSIVE,MEDIUM,21,786995,1735069,948074,,
1223,K8S_WASMER,FIB_RECURSIVE,MEDIUM,22,701670,1780213,1078543,,
1224,K8S_WASMER,FIB_RECURSIVE,MEDIUM,23,776261,1732114,955853,,
1225,K8S_WASMER,FIB_RECURSIVE,MEDIUM,24,763837,1756313,992476,,
1226,K8S_WASMER,FIB_RECURSIVE,LARGE,0,767468,4757717,3990249,,
1227,K8S_WASMER,FIB_RECURSIVE,LARGE,1,754449,4827948,4073499,,
1228,K8S_WASMER,FIB_RECURSIVE,LARGE,2,755766,4764709,4008943,,
1229,K8S_WASMER,FIB_RECURSIVE,LARGE,3,750329,4809041,4058712,,
1230,K8S_WASMER,FIB_RECURSIVE,LARGE,4,724545,4820096,4095551,,
1231,K8S_WASMER,FIB_RECURSIVE,LARGE,5,771603,4755366,3983763,,
1232,K8S_WASMER,FIB_RECURSIVE,LARGE,6,799332,4769867,3970535,,
1233,K8S_WASMER,FIB_RECURSIVE,LARGE,7,744927,4766661,4021734,,
1234,K8S_WASMER,FIB_RECURSIVE,LARGE,8,780473,4820108,4039635,,
1235,K8S_WASMER,FIB_RECURSIVE,LARGE,9,754928,4713335,3958407,,
1236,K8S_WASMER,FIB_RECURSIVE,LARGE,10,728244,4815799,4087555,,
1237,K8S_WASMER,FIB_RECURSIVE,LARGE,11,763233,4785885,4022652,,
1238,K8S_WASMER,FIB_RECURSIVE,LARGE,12,760044,4764420,4004376,,
1239,K8S_WASMER,FIB_RECURSIVE,LARGE,13,767029,4817355,4050326,,
1240,K8S_WASMER,FIB_RECURSIVE,LARGE,14,759739,4775090,4015351,,
1241,K8S_WASMER,FIB_RECURSIVE,LARGE,15,759876,4762372,4002496,,
1242,K8S_WASMER,FIB_RECURSIVE,LARGE,16,726309,4772707,4046398,,
1243,K8S_WASMER,FIB_RECURSIVE,LARGE,17,787157,4756754,3969597,,
1244,K8S_WASMER,FIB_RECURSIVE,LARGE,18,738878,4819181,4080303,,
1245,K8S_WASMER,FIB_RECURSIVE,LARGE,19,746117,4796377,4050260,,
1246,K8S_WASMER,FIB_RECURSIVE,LARGE,20,731711,4807164,4075453,,
1247,K8S_WASMER,FIB_RECURSIVE,LARGE,21,764625,4757156,3992531,,
1248,K8S_WASMER,FIB_RECURSIVE,LARGE,22,795508,4764362,3968854,,
1249,K8S_WASMER,FIB_RECURSIVE,LARGE,23,864878,4811287,3946409,,
1250,K8S_WASMER,FIB_RECURSIVE,LARGE,24,730708,4803797,4073089,,
1251,K8S_WASMER,FIB_ITERATIVE,SMALL,0,730730,825369,94639,,
1252,K8S_WASMER,FIB_ITERATIVE,SMALL,1,768430,1743649,975219,,
1253,K8S_WASMER,FIB_ITERATIVE,SMALL,2,785387,1794476,1009089,,
1254,K8S_WASMER,FIB_ITERATIVE,SMALL,3,742796,1809409,1066613,,
1255,K8S_WASMER,FIB_ITERATIVE,SMALL,4,774843,1779724,1004881,,
1256,K8S_WASMER,FIB_ITERATIVE,SMALL,5,770821,1812315,1041494,,
1257,K8S_WASMER,FIB_ITERATIVE,SMALL,6,746598,1757386,1010788,,
1258,K8S_WASMER,FIB_ITERATIVE,SMALL,7,747452,1792886,1045434,,
1259,K8S_WASMER,FIB_ITERATIVE,SMALL,8,774217,1818819,1044602,,
1260,K8S_WASMER,FIB_ITERATIVE,SMALL,9,734284,1743698,1009414,,
1261,K8S_WASMER,FIB_ITERATIVE,SMALL,10,750736,1790300,1039564,,
1262,K8S_WASMER,FIB_ITERATIVE,SMALL,11,757804,1755287,997483,,
1263,K8S_WASMER,FIB_ITERATIVE,SMALL,12,725439,1783456,1058017,,
1264,K8S_WASMER,FIB_ITERATIVE,SMALL,13,759243,1792876,1033633,,
1265,K8S_WASMER,FIB_ITERATIVE,SMALL,14,721373,1804551,1083178,,
1266,K8S_WASMER,FIB_ITERATIVE,SMALL,15,768894,1745152,976258,,
1267,K8S_WASMER,FIB_ITERATIVE,SMALL,16,763947,1750657,986710,,
1268,K8S_WASMER,FIB_ITERATIVE,SMALL,17,762654,1799456,1036802,,
1269,K8S_WASMER,FIB_ITERATIVE,SMALL,18,711745,1805936,1094191,,
1270,K8S_WASMER,FIB_ITERATIVE,SMALL,19,754871,1688111,933240,,
1271,K8S_WASMER,FIB_ITERATIVE,SMALL,20,724819,1809841,1085022,,
1272,K8S_WASMER,FIB_ITERATIVE,SMALL,21,805181,1732084,926903,,
1273,K8S_WASMER,FIB_ITERATIVE,SMALL,22,929784,1783725,853941,,
1274,K8S_WASMER,FIB_ITERATIVE,SMALL,23,733699,1684434,950735,,
1275,K8S_WASMER,FIB_ITERATIVE,SMALL,24,769650,1788903,1019253,,
1276,K8S_WASMER,FIB_ITERATIVE,MEDIUM,0,757225,1788612,1031387,,
1277,K8S_WASMER,FIB_ITERATIVE,MEDIUM,1,869089,1775186,906097,,
1278,K8S_WASMER,FIB_ITERATIVE,MEDIUM,2,753969,1785696,1031727,,
1279,K8S_WASMER,FIB_ITERATIVE,MEDIUM,3,719737,1794169,1074432,,
1280,K8S_WASMER,FIB_ITERATIVE,MEDIUM,4,741645,1755918,1014273,,
1281,K8S_WASMER,FIB_ITERATIVE,MEDIUM,5,729323,1750113,1020790,,
1282,K8S_WASMER,FIB_ITERATIVE,MEDIUM,6,731752,790964,59212,,
1283,K8S_WASMER,FIB_ITERATIVE,MEDIUM,7,727635,1742672,1015037,,
1284,K8S_WASMER,FIB_ITERATIVE,MEDIUM,8,735172,1783560,1048388,,
1285,K8S_WASMER,FIB_ITERATIVE,MEDIUM,9,755999,1736983,980984,,
1286,K8S_WASMER,FIB_ITERATIVE,MEDIUM,10,752064,1741641,989577,,
1287,K8S_WASMER,FIB_ITERATIVE,MEDIUM,11,801680,1781992,980312,,
1288,K8S_WASMER,FIB_ITERATIVE,MEDIUM,12,766415,1797070,1030655,,
1289,K8S_WASMER,FIB_ITERATIVE,MEDIUM,13,752163,1795532,1043369,,
1290,K8S_WASMER,FIB_ITERATIVE,MEDIUM,14,782427,1787790,1005363,,
1291,K8S_WASMER,FIB_ITERATIVE,MEDIUM,15,720720,1688369,967649,,
1292,K8S_WASMER,FIB_ITERATIVE,MEDIUM,16,824502,1741270,916768,,
1293,K8S_WASMER,FIB_ITERATIVE,MEDIUM,17,746346,1800226,1053880,,
1294,K8S_WASMER,FIB_ITERATIVE,MEDIUM,18,745507,1692396,946889,,
1295,K8S_WASMER,FIB_ITERATIVE,MEDIUM,19,747432,1742564,995132,,
1296,K8S_WASMER,FIB_ITERATIVE,MEDIUM,20,734337,1792872,1058535,,
1297,K8S_WASMER,FIB_ITERATIVE,MEDIUM,21,769920,1804488,1034568,,
1298,K8S_WASMER,FIB_ITERATIVE,MEDIUM,22,812680,1767644,954964,,
1299,K8S_WASMER,FIB_ITERATIVE,MEDIUM,23,923740,1798048,874308,,
1300,K8S_WASMER,FIB_ITERATIVE,MEDIUM,24,760931,1757915,996984,,
1301,K8S_WASMER,FIB_ITERATIVE,LARGE,0,702077,1789055,1086978,,
1302,K8S_WASMER,FIB_ITERATIVE,LARGE,1,789506,1796798,1007292,,
1303,K8S_WASMER,FIB_ITERATIVE,LARGE,2,773668,1747454,973786,,
1304,K8S_WASMER,FIB_ITERATIVE,LARGE,3,770000,1782933,1012933,,
1305,K8S_WASMER,FIB_ITERATIVE,LARGE,4,2241943,2766993,525050,,
1306,K8S_WASMER,FIB_ITERATIVE,LARGE,5,756055,1794138,1038083,,
1307,K8S_WASMER,FIB_ITERATIVE,LARGE,6,805699,1791229,985530,,
1308,K8S_WASMER,FIB_ITERATIVE,LARGE,7,754026,1789970,1035944,,
1309,K8S_WASMER,FIB_ITERATIVE,LARGE,8,724376,1790081,1065705,,
1310,K8S_WASMER,FIB_ITERATIVE,LARGE,9,723161,1786570,1063409,,
1311,K8S_WASMER,FIB_ITERATIVE,LARGE,10,758726,1755233,996507,,
1312,K8S_WASMER,FIB_ITERATIVE,LARGE,11,734854,1743720,1008866,,
1313,K8S_WASMER,FIB_ITERATIVE,LARGE,12,777113,1787349,1010236,,
1314,K8S_WASMER,FIB_ITERATIVE,LARGE,13,859814,1795126,935312,,
1315,K8S_WASMER,FIB_ITERATIVE,LARGE,14,733359,1786244,1052885,,
1316,K8S_WASMER,FIB_ITERATIVE,LARGE,15,765224,1794358,1029134,,
1317,K8S_WASMER,FIB_ITERATIVE,LARGE,16,745847,1735482,989635,,
1318,K8S_WASMER,FIB_ITERATIVE,LARGE,17,730353,1789515,1059162,,
1319,K8S_WASMER,FIB_ITERATIVE,LARGE,18,764329,1792678,1028349,,
1320,K8S_WASMER,FIB_ITERATIVE,LARGE,19,747109,1754457,1007348,,
1321,K8S_WASMER,FIB_ITERATIVE,LARGE,20,758079,1758528,1000449,,
1322,K8S_WASMER,FIB_ITERATIVE,LARGE,21,814154,1786679,972525,,
1323,K8S_WASMER,FIB_ITERATIVE,LARGE,22,747673,1764517,1016844,,
1324,K8S_WASMER,FIB_ITERATIVE,LARGE,23,910650,1797203,886553,,
1325,K8S_WASMER,FIB_ITERATIVE,LARGE,24,793944,1700035,906091,,
1326,K8S_WASMTIME,FIB_RECURSIVE,SMALL,0,2317165,2766164,448999,,
1327,K8S_WASMTIME,FIB_RECURSIVE,SMALL,1,734750,1757087,1022337,,
1328,K8S_WASMTIME,FIB_RECURSIVE,SMALL,2,766864,1801958,1035094,,
1329,K8S_WASMTIME,FIB_RECURSIVE,SMALL,3,787618,1795722,1008104,,
1330,K8S_WASMTIME,FIB_RECURSIVE,SMALL,4,790365,1796183,1005818,,
1331,K8S_WASMTIME,FIB_RECURSIVE,SMALL,5,1020623,1793848,773225,,
1332,K8S_WASMTIME,FIB_RECURSIVE,SMALL,6,762924,1791699,1028775,,
1333,K8S_WASMTIME,FIB_RECURSIVE,SMALL,7,738777,1747802,1009025,,
1334,K8S_WASMTIME,FIB_RECURSIVE,SMALL,8,734118,1745858,1011740,,
1335,K8S_WASMTIME,FIB_RECURSIVE,SMALL,9,1775455,2808229,1032774,,
1336,K8S_WASMTIME,FIB_RECURSIVE,SMALL,10,782051,1744343,962292,,
1337,K8S_WASMTIME,FIB_RECURSIVE,SMALL,11,761997,1824673,1062676,,
1338,K8S_WASMTIME,FIB_RECURSIVE,SMALL,12,761652,1803022,1041370,,
1339,K8S_WASMTIME,FIB_RECURSIVE,SMALL,13,1400584,1797361,396777,,
1340,K8S_WASMTIME,FIB_RECURSIVE,SMALL,14,748367,1739713,991346,,
1341,K8S_WASMTIME,FIB_RECURSIVE,SMALL,15,806101,1849959,1043858,,
1342,K8S_WASMTIME,FIB_RECURSIVE,SMALL,16,806278,1780496,974218,,
1343,K8S_WASMTIME,FIB_RECURSIVE,SMALL,17,699576,794336,94760,,
1344,K8S_WASMTIME,FIB_RECURSIVE,SMALL,18,747069,1767693,1020624,,
1345,K8S_WASMTIME,FIB_RECURSIVE,SMALL,19,707674,828234,120560,,
1346,K8S_WASMTIME,FIB_RECURSIVE,SMALL,20,745524,1648804,903280,,
1347,K8S_WASMTIME,FIB_RECURSIVE,SMALL,21,743888,1797305,1053417,,
1348,K8S_WASMTIME,FIB_RECURSIVE,SMALL,22,766459,1798344,1031885,,
1349,K8S_WASMTIME,FIB_RECURSIVE,SMALL,23,770618,1746387,975769,,
1350,K8S_WASMTIME,FIB_RECURSIVE,SMALL,24,731342,1749229,1017887,,
1351,K8S_WASMTIME,FIB_RECURSIVE,MEDIUM,0,821116,1743415,922299,,
1352,K8S_WASMTIME,FIB_RECURSIVE,MEDIUM,1,750167,1743598,993431,,
1353,K8S_WASMTIME,FIB_RECURSIVE,MEDIUM,2,712478,1754993,1042515,,
1354,K8S_WASMTIME,FIB_RECURSIVE,MEDIUM,3,798766,1789856,991090,,
1355,K8S_WASMTIME,FIB_RECURSIVE,MEDIUM,4,806266,1744648,938382,,
1356,K8S_WASMTIME,FIB_RECURSIVE,MEDIUM,5,750776,1820880,1070104,,
1357,K8S_WASMTIME,FIB_RECURSIVE,MEDIUM,6,786411,1787158,1000747,,
1358,K8S_WASMTIME,FIB_RECURSIVE,MEDIUM,7,725585,1746191,1020606,,
1359,K8S_WASMTIME,FIB_RECURSIVE,MEDIUM,8,804036,1731934,927898,,
1360,K8S_WASMTIME,FIB_RECURSIVE,MEDIUM,9,721012,1753722,1032710,,
1361,K8S_WASMTIME,FIB_RECURSIVE,MEDIUM,10,767891,1798793,1030902,,
1362,K8S_WASMTIME,FIB_RECURSIVE,MEDIUM,11,800502,1603740,803238,,
1363,K8S_WASMTIME,FIB_RECURSIVE,MEDIUM,12,1639513,2696962,1057449,,
1364,K8S_WASMTIME,FIB_RECURSIVE,MEDIUM,13,764999,1792174,1027175,,
1365,K8S_WASMTIME,FIB_RECURSIVE,MEDIUM,14,798689,1803036,1004347,,
1366,K8S_WASMTIME,FIB_RECURSIVE,MEDIUM,15,778956,1805930,1026974,,
1367,K8S_WASMTIME,FIB_RECURSIVE,MEDIUM,16,738279,1788109,1049830,,
1368,K8S_WASMTIME,FIB_RECURSIVE,MEDIUM,17,763321,1759329,996008,,
1369,K8S_WASMTIME,FIB_RECURSIVE,MEDIUM,18,728851,1782022,1053171,,
1370,K8S_WASMTIME,FIB_RECURSIVE,MEDIUM,19,778209,1752757,974548,,
1371,K8S_WASMTIME,FIB_RECURSIVE,MEDIUM,20,763518,1799362,1035844,,
1372,K8S_WASMTIME,FIB_RECURSIVE,MEDIUM,21,734526,1737249,1002723,,
1373,K8S_WASMTIME,FIB_RECURSIVE,MEDIUM,22,730735,1788566,1057831,,
1374,K8S_WASMTIME,FIB_RECURSIVE,MEDIUM,23,794852,1798296,1003444,,
1375,K8S_WASMTIME,FIB_RECURSIVE,MEDIUM,24,754646,1791367,1036721,,
1376,K8S_WASMTIME,FIB_RECURSIVE,LARGE,0,780680,4754212,3973532,,
1377,K8S_WASMTIME,FIB_RECURSIVE,LARGE,1,752573,4829476,4076903,,
1378,K8S_WASMTIME,FIB_RECURSIVE,LARGE,2,745396,4748156,4002760,,
1379,K8S_WASMTIME,FIB_RECURSIVE,LARGE,3,757072,4771296,4014224,,
1380,K8S_WASMTIME,FIB_RECURSIVE,LARGE,4,720490,4750365,4029875,,
1381,K8S_WASMTIME,FIB_RECURSIVE,LARGE,5,784870,4801268,4016398,,
1382,K8S_WASMTIME,FIB_RECURSIVE,LARGE,6,772246,4816152,4043906,,
1383,K8S_WASMTIME,FIB_RECURSIVE,LARGE,7,746742,4704148,3957406,,
1384,K8S_WASMTIME,FIB_RECURSIVE,LARGE,8,762685,4812526,4049841,,
1385,K8S_WASMTIME,FIB_RECURSIVE,LARGE,9,722929,4800710,4077781,,
1386,K8S_WASMTIME,FIB_RECURSIVE,LARGE,10,798474,4803291,4004817,,
1387,K8S_WASMTIME,FIB_RECURSIVE,LARGE,11,730614,4760845,4030231,,
1388,K8S_WASMTIME,FIB_RECURSIVE,LARGE,12,779186,4822996,4043810,,
1389,K8S_WASMTIME,FIB_RECURSIVE,LARGE,13,784008,4762345,3978337,,
1390,K8S_WASMTIME,FIB_RECURSIVE,LARGE,14,751181,4807043,4055862,,
1391,K8S_WASMTIME,FIB_RECURSIVE,LARGE,15,721413,4713411,3991998,,
1392,K8S_WASMTIME,FIB_RECURSIVE,LARGE,16,730369,4814540,4084171,,
1393,K8S_WASMTIME,FIB_RECURSIVE,LARGE,17,721401,4703181,3981780,,
1394,K8S_WASMTIME,FIB_RECURSIVE,LARGE,18,767948,4754284,3986336,,
1395,K8S_WASMTIME,FIB_RECURSIVE,LARGE,19,739381,4803410,4064029,,
1396,K8S_WASMTIME,FIB_RECURSIVE,LARGE,20,727925,4709701,3981776,,
1397,K8S_WASMTIME,FIB_RECURSIVE,LARGE,21,773439,4805204,4031765,,
1398,K8S_WASMTIME,FIB_RECURSIVE,LARGE,22,739173,4781642,4042469,,
1399,K8S_WASMTIME,FIB_RECURSIVE,LARGE,23,789408,4774193,3984785,,
1400,K8S_WASMTIME,FIB_RECURSIVE,LARGE,24,729743,4812361,4082618,,
1401,K8S_WASMTIME,FIB_ITERATIVE,SMALL,0,843745,1753111,909366,,
1402,K8S_WASMTIME,FIB_ITERATIVE,SMALL,1,759777,1796655,1036878,,
1403,K8S_WASMTIME,FIB_ITERATIVE,SMALL,2,744502,1788793,1044291,,
1404,K8S_WASMTIME,FIB_ITERATIVE,SMALL,3,721180,772512,51332,,
1405,K8S_WASMTIME,FIB_ITERATIVE,SMALL,4,715867,1749212,1033345,,
1406,K8S_WASMTIME,FIB_ITERATIVE,SMALL,5,700536,771804,71268,,
1407,K8S_WASMTIME,FIB_ITERATIVE,SMALL,6,780340,1785559,1005219,,
1408,K8S_WASMTIME,FIB_ITERATIVE,SMALL,7,752751,1742128,989377,,
1409,K8S_WASMTIME,FIB_ITERATIVE,SMALL,8,2236174,2802962,566788,,
1410,K8S_WASMTIME,FIB_ITERATIVE,SMALL,9,727774,1785860,1058086,,
1411,K8S_WASMTIME,FIB_ITERATIVE,SMALL,10,773589,1794334,1020745,,
1412,K8S_WASMTIME,FIB_ITERATIVE,SMALL,11,793350,1796979,1003629,,
1413,K8S_WASMTIME,FIB_ITERATIVE,SMALL,12,742291,1735920,993629,,
1414,K8S_WASMTIME,FIB_ITERATIVE,SMALL,13,717831,1754940,1037109,,
1415,K8S_WASMTIME,FIB_ITERATIVE,SMALL,14,795115,1759020,963905,,
1416,K8S_WASMTIME,FIB_ITERATIVE,SMALL,15,758201,1794890,1036689,,
1417,K8S_WASMTIME,FIB_ITERATIVE,SMALL,16,762702,1737155,974453,,
1418,K8S_WASMTIME,FIB_ITERATIVE,SMALL,17,778002,1745542,967540,,
1419,K8S_WASMTIME,FIB_ITERATIVE,SMALL,18,743785,1797653,1053868,,
1420,K8S_WASMTIME,FIB_ITERATIVE,SMALL,19,764864,1749968,985104,,
1421,K8S_WASMTIME,FIB_ITERATIVE,SMALL,20,776473,1802137,1025664,,
1422,K8S_WASMTIME,FIB_ITERATIVE,SMALL,21,761165,1800264,1039099,,
1423,K8S_WASMTIME,FIB_ITERATIVE,SMALL,22,762058,1746816,984758,,
1424,K8S_WASMTIME,FIB_ITERATIVE,SMALL,23,782749,1788573,1005824,,
1425,K8S_WASMTIME,FIB_ITERATIVE,SMALL,24,786699,1813256,1026557,,
1426,K8S_WASMTIME,FIB_ITERATIVE,MEDIUM,0,751851,1695914,944063,,
1427,K8S_WASMTIME,FIB_ITERATIVE,MEDIUM,1,770841,1809540,1038699,,
1428,K8S_WASMTIME,FIB_ITERATIVE,MEDIUM,2,721247,1787903,1066656,,
1429,K8S_WASMTIME,FIB_ITERATIVE,MEDIUM,3,787552,1740591,953039,,
1430,K8S_WASMTIME,FIB_ITERATIVE,MEDIUM,4,763170,1688120,924950,,
1431,K8S_WASMTIME,FIB_ITERATIVE,MEDIUM,5,769548,1800583,1031035,,
1432,K8S_WASMTIME,FIB_ITERATIVE,MEDIUM,6,732666,1793288,1060622,,
1433,K8S_WASMTIME,FIB_ITERATIVE,MEDIUM,7,778192,1797553,1019361,,
1434,K8S_WASMTIME,FIB_ITERATIVE,MEDIUM,8,776642,1740849,964207,,
1435,K8S_WASMTIME,FIB_ITERATIVE,MEDIUM,9,738827,1794726,1055899,,
1436,K8S_WASMTIME,FIB_ITERATIVE,MEDIUM,10,810996,1748954,937958,,
1437,K8S_WASMTIME,FIB_ITERATIVE,MEDIUM,11,749269,1755255,1005986,,
1438,K8S_WASMTIME,FIB_ITERATIVE,MEDIUM,12,747639,1783342,1035703,,
1439,K8S_WASMTIME,FIB_ITERATIVE,MEDIUM,13,725881,1782583,1056702,,
1440,K8S_WASMTIME,FIB_ITERATIVE,MEDIUM,14,751687,1796130,1044443,,
1441,K8S_WASMTIME,FIB_ITERATIVE,MEDIUM,15,796031,1789626,993595,,
1442,K8S_WASMTIME,FIB_ITERATIVE,MEDIUM,16,751689,1798409,1046720,,
1443,K8S_WASMTIME,FIB_ITERATIVE,MEDIUM,17,776458,1792115,1015657,,
1444,K8S_WASMTIME,FIB_ITERATIVE,MEDIUM,18,776228,1750794,974566,,
1445,K8S_WASMTIME,FIB_ITERATIVE,MEDIUM,19,735222,1804141,1068919,,
1446,K8S_WASMTIME,FIB_ITERATIVE,MEDIUM,20,730634,1750698,1020064,,
1447,K8S_WASMTIME,FIB_ITERATIVE,MEDIUM,21,762419,1745769,983350,,
1448,K8S_WASMTIME,FIB_ITERATIVE,MEDIUM,22,761035,1793742,1032707,,
1449,K8S_WASMTIME,FIB_ITERATIVE,MEDIUM,23,1077995,1762639,684644,,
1450,K8S_WASMTIME,FIB_ITERATIVE,MEDIUM,24,809607,1752462,942855,,
1451,K8S_WASMTIME,FIB_ITERATIVE,LARGE,0,747164,1755006,1007842,,
1452,K8S_WASMTIME,FIB_ITERATIVE,LARGE,1,755127,1746344,991217,,
1453,K8S_WASMTIME,FIB_ITERATIVE,LARGE,2,792288,1796300,1004012,,
1454,K8S_WASMTIME,FIB_ITERATIVE,LARGE,3,767394,1736177,968783,,
1455,K8S_WASMTIME,FIB_ITERATIVE,LARGE,4,735302,1789329,1054027,,
1456,K8S_WASMTIME,FIB_ITERATIVE,LARGE,5,749276,1743375,994099,,
1457,K8S_WASMTIME,FIB_ITERATIVE,LARGE,6,741931,1791612,1049681,,
1458,K8S_WASMTIME,FIB_ITERATIVE,LARGE,7,722790,1782743,1059953,,
1459,K8S_WASMTIME,FIB_ITERATIVE,LARGE,8,743232,1791046,1047814,,
1460,K8S_WASMTIME,FIB_ITERATIVE,LARGE,9,808703,1757354,948651,,
1461,K8S_WASMTIME,FIB_ITERATIVE,LARGE,10,743528,1809578,1066050,,
1462,K8S_WASMTIME,FIB_ITERATIVE,LARGE,11,752291,1759912,1007621,,
1463,K8S_WASMTIME,FIB_ITERATIVE,LARGE,12,740925,1807634,1066709,,
1464,K8S_WASMTIME,FIB_ITERATIVE,LARGE,13,772911,1753536,980625,,
1465,K8S_WASMTIME,FIB_ITERATIVE,LARGE,14,807683,1729028,921345,,
1466,K8S_WASMTIME,FIB_ITERATIVE,LARGE,15,784574,1810246,1025672,,
1467,K8S_WASMTIME,FIB_ITERATIVE,LARGE,16,734624,1785220,1050596,,
1468,K8S_WASMTIME,FIB_ITERATIVE,LARGE,17,752500,1782663,1030163,,
1469,K8S_WASMTIME,FIB_ITERATIVE,LARGE,18,773686,1742980,969294,,
1470,K8S_WASMTIME,FIB_ITERATIVE,LARGE,19,762000,1764000,1002000,,
1471,K8S_WASMTIME,FIB_ITERATIVE,LARGE,20,767316,1786679,1019363,,
1472,K8S_WASMTIME,FIB_ITERATIVE,LARGE,21,742811,1788071,1045260,,
1473,K8S_WASMTIME,FIB_ITERATIVE,LARGE,22,794243,1747279,953036,,
1474,K8S_WASMTIME,FIB_ITERATIVE,LARGE,23,805872,1752360,946488,,
1475,K8S_WASMTIME,FIB_ITERATIVE,LARGE,24,753148,1752004,998856,,
