%YAML 1.1
%TAG !u! tag:unity3d.com,2011:
--- !u!1 &648005445663655670
GameObject:
  m_ObjectHideFlags: 0
  m_CorrespondingSourceObject: {fileID: 0}
  m_PrefabInstance: {fileID: 0}
  m_PrefabAsset: {fileID: 0}
  serializedVersion: 6
  m_Component:
  - component: {fileID: 1101055877808153414}
  - component: {fileID: 4861604554718066619}
  m_Layer: 31
  m_Name: floor
  m_TagString: Untagged
  m_Icon: {fileID: 0}
  m_NavMeshLayer: 0
  m_StaticEditorFlags: 0
  m_IsActive: 1
--- !u!4 &1101055877808153414
Transform:
  m_ObjectHideFlags: 0
  m_CorrespondingSourceObject: {fileID: 0}
  m_PrefabInstance: {fileID: 0}
  m_PrefabAsset: {fileID: 0}
  m_GameObject: {fileID: 648005445663655670}
  m_LocalRotation: {x: 0, y: 0, z: 0, w: 1}
  m_LocalPosition: {x: 0, y: 0, z: 0}
  m_LocalScale: {x: 1, y: 1, z: 1}
  m_Children:
  - {fileID: 4447907334972773828}
  m_Father: {fileID: 0}
  m_RootOrder: 0
  m_LocalEulerAnglesHint: {x: 0, y: 0, z: 0}
--- !u!156049354 &4861604554718066619
Grid:
  m_ObjectHideFlags: 0
  m_CorrespondingSourceObject: {fileID: 0}
  m_PrefabInstance: {fileID: 0}
  m_PrefabAsset: {fileID: 0}
  m_GameObject: {fileID: 648005445663655670}
  m_Enabled: 1
  m_CellSize: {x: 1, y: 1, z: 0}
  m_CellGap: {x: 0, y: 0, z: 0}
  m_CellLayout: 0
  m_CellSwizzle: 0
--- !u!1 &1761711022309969100
GameObject:
  m_ObjectHideFlags: 0
  m_CorrespondingSourceObject: {fileID: 0}
  m_PrefabInstance: {fileID: 0}
  m_PrefabAsset: {fileID: 0}
  serializedVersion: 6
  m_Component:
  - component: {fileID: 4447907334972773828}
  - component: {fileID: 4090048754418214164}
  - component: {fileID: 9031933915763805264}
  m_Layer: 31
  m_Name: Layer1
  m_TagString: Untagged
  m_Icon: {fileID: 0}
  m_NavMeshLayer: 0
  m_StaticEditorFlags: 0
  m_IsActive: 1
--- !u!4 &4447907334972773828
Transform:
  m_ObjectHideFlags: 0
  m_CorrespondingSourceObject: {fileID: 0}
  m_PrefabInstance: {fileID: 0}
  m_PrefabAsset: {fileID: 0}
  m_GameObject: {fileID: 1761711022309969100}
  m_LocalRotation: {x: -0, y: -0, z: -0, w: 1}
  m_LocalPosition: {x: 0, y: 0, z: 0}
  m_LocalScale: {x: 1, y: 1, z: 1}
  m_Children: []
  m_Father: {fileID: 1101055877808153414}
  m_RootOrder: 0
  m_LocalEulerAnglesHint: {x: 0, y: 0, z: 0}
--- !u!1839735485 &4090048754418214164
Tilemap:
  m_ObjectHideFlags: 0
  m_CorrespondingSourceObject: {fileID: 0}
  m_PrefabInstance: {fileID: 0}
  m_PrefabAsset: {fileID: 0}
  m_GameObject: {fileID: 1761711022309969100}
  m_Enabled: 1
  m_Tiles:
  - first: {x: -7, y: -2, z: 0}
    second:
      m_TileIndex: 8
      m_TileSpriteIndex: 26
      m_TileMatrixIndex: 0
      m_TileColorIndex: 0
      m_ObjectToInstantiate: {fileID: 0}
      m_TileFlags: 1
      m_ColliderType: 1
  - first: {x: -8, y: -1, z: 0}
    second:
      m_TileIndex: 6
      m_TileSpriteIndex: 19
      m_TileMatrixIndex: 0
      m_TileColorIndex: 0
      m_ObjectToInstantiate: {fileID: 0}
      m_TileFlags: 1
      m_ColliderType: 1
  - first: {x: -7, y: -1, z: 0}
    second:
      m_TileIndex: 7
      m_TileSpriteIndex: 12
      m_TileMatrixIndex: 0
      m_TileColorIndex: 0
      m_ObjectToInstantiate: {fileID: 0}
      m_TileFlags: 1
      m_ColliderType: 1
  - first: {x: -16, y: 0, z: 0}
    second:
      m_TileIndex: 27
      m_TileSpriteIndex: 4294967295
      m_TileMatrixIndex: 0
      m_TileColorIndex: 0
      m_ObjectToInstantiate: {fileID: 0}
      m_TileFlags: 1
      m_ColliderType: 1
  - first: {x: -15, y: 0, z: 0}
    second:
      m_TileIndex: 28
      m_TileSpriteIndex: 4294967295
      m_TileMatrixIndex: 0
      m_TileColorIndex: 0
      m_ObjectToInstantiate: {fileID: 0}
      m_TileFlags: 1
      m_ColliderType: 1
  - first: {x: -8, y: 0, z: 0}
    second:
      m_TileIndex: 4
      m_TileSpriteIndex: 27
      m_TileMatrixIndex: 0
      m_TileColorIndex: 0
      m_ObjectToInstantiate: {fileID: 0}
      m_TileFlags: 1
      m_ColliderType: 1
  - first: {x: -7, y: 0, z: 0}
    second:
      m_TileIndex: 5
      m_TileSpriteIndex: 25
      m_TileMatrixIndex: 0
      m_TileColorIndex: 0
      m_ObjectToInstantiate: {fileID: 0}
      m_TileFlags: 1
      m_ColliderType: 1
  - first: {x: -5, y: 0, z: 0}
    second:
      m_TileIndex: 29
      m_TileSpriteIndex: 23
      m_TileMatrixIndex: 0
      m_TileColorIndex: 0
      m_ObjectToInstantiate: {fileID: 0}
      m_TileFlags: 1
      m_ColliderType: 1
  - first: {x: -4, y: 0, z: 0}
    second:
      m_TileIndex: 30
      m_TileSpriteIndex: 24
      m_TileMatrixIndex: 0
      m_TileColorIndex: 0
      m_ObjectToInstantiate: {fileID: 0}
      m_TileFlags: 1
      m_ColliderType: 1
  - first: {x: -2, y: 0, z: 0}
    second:
      m_TileIndex: 0
      m_TileSpriteIndex: 11
      m_TileMatrixIndex: 0
      m_TileColorIndex: 0
      m_ObjectToInstantiate: {fileID: 0}
      m_TileFlags: 0
      m_ColliderType: 0
  - first: {x: -1, y: 0, z: 0}
    second:
      m_TileIndex: 9
      m_TileSpriteIndex: 10
      m_TileMatrixIndex: 0
      m_TileColorIndex: 0
      m_ObjectToInstantiate: {fileID: 0}
      m_TileFlags: 0
      m_ColliderType: 0
  - first: {x: -8, y: 1, z: 0}
    second:
      m_TileIndex: 2
      m_TileSpriteIndex: 30
      m_TileMatrixIndex: 0
      m_TileColorIndex: 0
      m_ObjectToInstantiate: {fileID: 0}
      m_TileFlags: 1
      m_ColliderType: 1
  - first: {x: -7, y: 1, z: 0}
    second:
      m_TileIndex: 1
      m_TileSpriteIndex: 29
      m_TileMatrixIndex: 0
      m_TileColorIndex: 0
      m_ObjectToInstantiate: {fileID: 0}
      m_TileFlags: 1
      m_ColliderType: 1
  - first: {x: -5, y: 1, z: 0}
    second:
      m_TileIndex: 3
      m_TileSpriteIndex: 28
      m_TileMatrixIndex: 0
      m_TileColorIndex: 0
      m_ObjectToInstantiate: {fileID: 0}
      m_TileFlags: 1
      m_ColliderType: 1
  - first: {x: -3, y: 1, z: 0}
    second:
      m_TileIndex: 12
      m_TileSpriteIndex: 6
      m_TileMatrixIndex: 0
      m_TileColorIndex: 0
      m_ObjectToInstantiate: {fileID: 0}
      m_TileFlags: 0
      m_ColliderType: 0
  - first: {x: -2, y: 1, z: 0}
    second:
      m_TileIndex: 10
      m_TileSpriteIndex: 5
      m_TileMatrixIndex: 0
      m_TileColorIndex: 0
      m_ObjectToInstantiate: {fileID: 0}
      m_TileFlags: 0
      m_ColliderType: 0
  - first: {x: -1, y: 1, z: 0}
    second:
      m_TileIndex: 11
      m_TileSpriteIndex: 4
      m_TileMatrixIndex: 0
      m_TileColorIndex: 0
      m_ObjectToInstantiate: {fileID: 0}
      m_TileFlags: 0
      m_ColliderType: 0
  m_AnimatedTiles:
  - first: {x: -2, y: 0, z: 0}
    second:
      m_AnimatedSprites:
      - {fileID: 4947687914600587929, guid: 0cb0b7f91a7d0ce499519837e49077d2, type: 3}
      - {fileID: -6186147825915501110, guid: 0cb0b7f91a7d0ce499519837e49077d2, type: 3}
      - {fileID: -2652700819387658533, guid: 0cb0b7f91a7d0ce499519837e49077d2, type: 3}
      - {fileID: 8345506015398940840, guid: 0cb0b7f91a7d0ce499519837e49077d2, type: 3}
      m_AnimationSpeed: 1
      m_AnimationTimeOffset: 0
      m_IsLooping: 1
  - first: {x: -1, y: 0, z: 0}
    second:
      m_AnimatedSprites:
      - {fileID: -211911132740012330, guid: 0cb0b7f91a7d0ce499519837e49077d2, type: 3}
      - {fileID: -7686265958506072872, guid: 0cb0b7f91a7d0ce499519837e49077d2, type: 3}
      - {fileID: -3183896127576799233, guid: 0cb0b7f91a7d0ce499519837e49077d2, type: 3}
      - {fileID: -661607197025741119, guid: 0cb0b7f91a7d0ce499519837e49077d2, type: 3}
      m_AnimationSpeed: 1
      m_AnimationTimeOffset: 0
      m_IsLooping: 1
  - first: {x: -3, y: 1, z: 0}
    second:
      m_AnimatedSprites:
      - {fileID: 2652665228572520863, guid: 0cb0b7f91a7d0ce499519837e49077d2, type: 3}
      - {fileID: 3137530157647413697, guid: 0cb0b7f91a7d0ce499519837e49077d2, type: 3}
      - {fileID: -5892812033551229265, guid: 0cb0b7f91a7d0ce499519837e49077d2, type: 3}
      - {fileID: -8070268699172959200, guid: 0cb0b7f91a7d0ce499519837e49077d2, type: 3}
      m_AnimationSpeed: 1
      m_AnimationTimeOffset: 0
      m_IsLooping: 1
  - first: {x: -2, y: 1, z: 0}
    second:
      m_AnimatedSprites:
      - {fileID: -2779397031312258671, guid: 0cb0b7f91a7d0ce499519837e49077d2, type: 3}
      - {fileID: 4098764165990340305, guid: 0cb0b7f91a7d0ce499519837e49077d2, type: 3}
      - {fileID: -1332457892899033290, guid: 0cb0b7f91a7d0ce499519837e49077d2, type: 3}
      - {fileID: -1849032620008504417, guid: 0cb0b7f91a7d0ce499519837e49077d2, type: 3}
      m_AnimationSpeed: 1
      m_AnimationTimeOffset: 0
      m_IsLooping: 1
  - first: {x: -1, y: 1, z: 0}
    second:
      m_AnimatedSprites:
      - {fileID: -106193126860678446, guid: 0cb0b7f91a7d0ce499519837e49077d2, type: 3}
      - {fileID: 7138735152395267548, guid: 0cb0b7f91a7d0ce499519837e49077d2, type: 3}
      - {fileID: 4887277228303598148, guid: 0cb0b7f91a7d0ce499519837e49077d2, type: 3}
      - {fileID: 1579998928857598921, guid: 0cb0b7f91a7d0ce499519837e49077d2, type: 3}
      m_AnimationSpeed: 1
      m_AnimationTimeOffset: 0
      m_IsLooping: 1
  m_TileAssetArray:
  - m_RefCount: 1
    m_Data: {fileID: 11400000, guid: 984145e080b299d4cbfaeded9a09938f, type: 2}
  - m_RefCount: 1
    m_Data: {fileID: 11400000, guid: 8d4cf2af7fbebb944b1991967525278b, type: 2}
  - m_RefCount: 1
    m_Data: {fileID: 11400000, guid: 5e7510027915cbe448f0ad4235db633d, type: 2}
  - m_RefCount: 1
    m_Data: {fileID: 11400000, guid: 72206aa4f6e61c34fa06318e638c7f81, type: 2}
  - m_RefCount: 1
    m_Data: {fileID: 11400000, guid: 9cb37025cf7d22944a191d9b03fd2ea8, type: 2}
  - m_RefCount: 1
    m_Data: {fileID: 11400000, guid: 3ffcf93a8b92b9748ba087710d30f982, type: 2}
  - m_RefCount: 1
    m_Data: {fileID: 11400000, guid: 2defb73281fdc4f4ebcc007fc6b02501, type: 2}
  - m_RefCount: 1
    m_Data: {fileID: 11400000, guid: 5868108c6e5947a45aba5c2da8ca8817, type: 2}
  - m_RefCount: 1
    m_Data: {fileID: 11400000, guid: 4826248461717e643a5ac0f914a9f0f8, type: 2}
  - m_RefCount: 1
    m_Data: {fileID: 11400000, guid: c0a7f29edf7e20e42af29ef591d92f2b, type: 2}
  - m_RefCount: 1
    m_Data: {fileID: 11400000, guid: 25a777b851e703a4e9cb156b64f6183e, type: 2}
  - m_RefCount: 1
    m_Data: {fileID: 11400000, guid: 7b2443295da0dbe4897e2cce1af53366, type: 2}
  - m_RefCount: 1
    m_Data: {fileID: 11400000, guid: a9ebc14304cf30a469de18b821e84cbe, type: 2}
  - m_RefCount: 0
    m_Data: {fileID: 0}
  - m_RefCount: 0
    m_Data: {fileID: 0}
  - m_RefCount: 0
    m_Data: {fileID: 0}
  - m_RefCount: 0
    m_Data: {fileID: 0}
  - m_RefCount: 0
    m_Data: {fileID: 0}
  - m_RefCount: 0
    m_Data: {fileID: 0}
  - m_RefCount: 0
    m_Data: {fileID: 0}
  - m_RefCount: 0
    m_Data: {fileID: 0}
  - m_RefCount: 0
    m_Data: {fileID: 0}
  - m_RefCount: 0
    m_Data: {fileID: 0}
  - m_RefCount: 0
    m_Data: {fileID: 0}
  - m_RefCount: 0
    m_Data: {fileID: 0}
  - m_RefCount: 0
    m_Data: {fileID: 0}
  - m_RefCount: 0
    m_Data: {fileID: 0}
  - m_RefCount: 1
    m_Data: {fileID: 11400000, guid: 629ae9e774879c844b37066b3eaff297, type: 2}
  - m_RefCount: 1
    m_Data: {fileID: 11400000, guid: c807c23f479af6c42a0de657560eb1e5, type: 2}
  - m_RefCount: 1
    m_Data: {fileID: 11400000, guid: 9131db6d4ad5a3544b9527bf1849475f, type: 2}
  - m_RefCount: 1
    m_Data: {fileID: 11400000, guid: c7a174fe491634347a902bc0409a3a2f, type: 2}
  m_TileSpriteArray:
  - m_RefCount: 0
    m_Data: {fileID: 0}
  - m_RefCount: 0
    m_Data: {fileID: 0}
  - m_RefCount: 0
    m_Data: {fileID: 0}
  - m_RefCount: 0
    m_Data: {fileID: 0}
  - m_RefCount: 1
    m_Data: {fileID: 1579998928857598921, guid: 0cb0b7f91a7d0ce499519837e49077d2,
      type: 3}
  - m_RefCount: 1
    m_Data: {fileID: -1849032620008504417, guid: 0cb0b7f91a7d0ce499519837e49077d2,
      type: 3}
  - m_RefCount: 1
    m_Data: {fileID: -8070268699172959200, guid: 0cb0b7f91a7d0ce499519837e49077d2,
      type: 3}
  - m_RefCount: 0
    m_Data: {fileID: 0}
  - m_RefCount: 0
    m_Data: {fileID: 0}
  - m_RefCount: 0
    m_Data: {fileID: 0}
  - m_RefCount: 1
    m_Data: {fileID: -661607197025741119, guid: 0cb0b7f91a7d0ce499519837e49077d2,
      type: 3}
  - m_RefCount: 1
    m_Data: {fileID: 8345506015398940840, guid: 0cb0b7f91a7d0ce499519837e49077d2,
      type: 3}
  - m_RefCount: 1
    m_Data: {fileID: 2062103178921966458, guid: 377a97c70bee16d4fb662234dda057c6,
      type: 3}
  - m_RefCount: 0
    m_Data: {fileID: 0}
  - m_RefCount: 0
    m_Data: {fileID: 0}
  - m_RefCount: 0
    m_Data: {fileID: 0}
  - m_RefCount: 0
    m_Data: {fileID: 0}
  - m_RefCount: 0
    m_Data: {fileID: 0}
  - m_RefCount: 0
    m_Data: {fileID: 0}
  - m_RefCount: 1
    m_Data: {fileID: 3934660436298291567, guid: 377a97c70bee16d4fb662234dda057c6,
      type: 3}
  - m_RefCount: 0
    m_Data: {fileID: 0}
  - m_RefCount: 0
    m_Data: {fileID: 0}
  - m_RefCount: 0
    m_Data: {fileID: 0}
  - m_RefCount: 1
    m_Data: {fileID: -2929768693928686596, guid: 3b63b772058ed084e88bd4eb47203ff6,
      type: 3}
  - m_RefCount: 1
    m_Data: {fileID: 5932812199817169402, guid: 3b63b772058ed084e88bd4eb47203ff6,
      type: 3}
  - m_RefCount: 1
    m_Data: {fileID: 7597566436490905996, guid: 377a97c70bee16d4fb662234dda057c6,
      type: 3}
  - m_RefCount: 1
    m_Data: {fileID: 6238069489489956581, guid: 377a97c70bee16d4fb662234dda057c6,
      type: 3}
  - m_RefCount: 1
    m_Data: {fileID: 1522616405118650996, guid: 377a97c70bee16d4fb662234dda057c6,
      type: 3}
  - m_RefCount: 1
    m_Data: {fileID: -9187671301678041260, guid: 377a97c70bee16d4fb662234dda057c6,
      type: 3}
  - m_RefCount: 1
    m_Data: {fileID: -3110822946972646829, guid: 377a97c70bee16d4fb662234dda057c6,
      type: 3}
  - m_RefCount: 1
    m_Data: {fileID: -3472959249965539058, guid: 377a97c70bee16d4fb662234dda057c6,
      type: 3}
  m_TileMatrixArray:
  - m_RefCount: 17
    m_Data:
      e00: 1
      e01: 0
      e02: 0
      e03: 0
      e10: 0
      e11: 1
      e12: 0
      e13: 0
      e20: 0
      e21: 0
      e22: 1
      e23: 0
      e30: 0
      e31: 0
      e32: 0
      e33: 1
  m_TileColorArray:
  - m_RefCount: 17
    m_Data: {r: 1, g: 1, b: 1, a: 1}
  - m_RefCount: 0
    m_Data: {r: -5.9976502e+29, g: -5.9976502e+29, b: -5.9976502e+29, a: -5.9976502e+29}
  - m_RefCount: 0
    m_Data: {r: -6.065737e+29, g: -6.065737e+29, b: -6.065737e+29, a: -6.065737e+29}
  - m_RefCount: 0
    m_Data: {r: -6.274198e+29, g: -6.274198e+29, b: -6.274198e+29, a: -6.274198e+29}
  - m_RefCount: 0
    m_Data: {r: -5.8929875e+29, g: -5.8929875e+29, b: -5.8929875e+29, a: -5.8929875e+29}
  - m_RefCount: 0
    m_Data: {r: -3.0642461e+29, g: -3.0642461e+29, b: -3.0642461e+29, a: -3.0642461e+29}
  - m_RefCount: 0
    m_Data: {r: -6.66835e+29, g: -6.66835e+29, b: -6.66835e+29, a: -6.66835e+29}
  - m_RefCount: 0
    m_Data: {r: -6.1362475e+29, g: -6.1362475e+29, b: -6.1362475e+29, a: -6.1362475e+29}
  - m_RefCount: 0
    m_Data: {r: -5.8948915e+29, g: -5.8948915e+29, b: -5.8948915e+29, a: -5.8948915e+29}
  - m_RefCount: 0
    m_Data: {r: -8.027884e+29, g: -8.027884e+29, b: -8.027884e+29, a: -8.027884e+29}
  - m_RefCount: 0
    m_Data: {r: -6.2707284e+29, g: -6.2707284e+29, b: -6.2707284e+29, a: -6.2707284e+29}
  - m_RefCount: 0
    m_Data: {r: -6.1357398e+29, g: -6.1357398e+29, b: -6.1357398e+29, a: -6.1357398e+29}
  - m_RefCount: 0
    m_Data: {r: -7.3611735e+29, g: -7.3611735e+29, b: -7.3611735e+29, a: -7.3611735e+29}
  - m_RefCount: 0
    m_Data: {r: -8.0565355e+29, g: -8.0565355e+29, b: -8.0565355e+29, a: -8.0565355e+29}
  m_AnimationFrameRate: 1
  m_Color: {r: 1, g: 1, b: 1, a: 1}
  m_Origin: {x: -16, y: -2, z: 0}
  m_Size: {x: 16, y: 4, z: 1}
  m_TileAnchor: {x: 0.5, y: 0.5, z: 0}
  m_TileOrientation: 0
  m_TileOrientationMatrix:
    e00: 1
    e01: 0
    e02: 0
    e03: 0
    e10: 0
    e11: 1
    e12: 0
    e13: 0
    e20: 0
    e21: 0
    e22: 1
    e23: 0
    e30: 0
    e31: 0
    e32: 0
    e33: 1
--- !u!483693784 &9031933915763805264
TilemapRenderer:
  m_ObjectHideFlags: 0
  m_CorrespondingSourceObject: {fileID: 0}
  m_PrefabInstance: {fileID: 0}
  m_PrefabAsset: {fileID: 0}
  m_GameObject: {fileID: 1761711022309969100}
  m_Enabled: 0
  m_CastShadows: 0
  m_ReceiveShadows: 0
  m_DynamicOccludee: 0
  m_MotionVectors: 1
  m_LightProbeUsage: 0
  m_ReflectionProbeUsage: 0
  m_RenderingLayerMask: 1
  m_RendererPriority: 0
  m_Materials:
  - {fileID: 2100000, guid: a97c105638bdf8b4a8650670310a4cd3, type: 2}
  m_StaticBatchInfo:
    firstSubMesh: 0
    subMeshCount: 0
  m_StaticBatchRoot: {fileID: 0}
  m_ProbeAnchor: {fileID: 0}
  m_LightProbeVolumeOverride: {fileID: 0}
  m_ScaleInLightmap: 1
  m_ReceiveGI: 1
  m_PreserveUVs: 0
  m_IgnoreNormalsForChartDetection: 0
  m_ImportantGI: 0
  m_StitchLightmapSeams: 1
  m_SelectedEditorRenderState: 0
  m_MinimumChartSize: 4
  m_AutoUVMaxDistance: 0.5
  m_AutoUVMaxAngle: 89
  m_LightmapParameters: {fileID: 0}
  m_SortingLayerID: 0
  m_SortingLayer: 0
  m_SortingOrder: 0
  m_ChunkSize: {x: 32, y: 32, z: 32}
  m_ChunkCullingBounds: {x: 0, y: 0, z: 0}
  m_MaxChunkCount: 16
  m_MaxFrameAge: 16
  m_SortOrder: 0
  m_Mode: 0
  m_DetectChunkCullingBounds: 0
  m_MaskInteraction: 0
--- !u!114 &-8794193033164923380
MonoBehaviour:
  m_ObjectHideFlags: 0
  m_CorrespondingSourceObject: {fileID: 0}
  m_PrefabInstance: {fileID: 0}
  m_PrefabAsset: {fileID: 0}
  m_GameObject: {fileID: 0}
  m_Enabled: 1
  m_EditorHideFlags: 0
  m_Script: {fileID: 12395, guid: 0000000000000000e000000000000000, type: 0}
  m_Name: Palette Settings
  m_EditorClassIdentifier: 
  cellSizing: 0
