{
    "_id": "tLNsmY90aN668PMG",
    "data": {
        "armor": {
            "label": "AC Bonus",
            "type": "Number",
            "value": 6
        },
        "armorType": {
            "label": "Armor Category",
            "type": "String",
            "value": "heavy"
        },
        "brokenThreshold": {
            "value": null
        },
        "bulkCapacity": {
            "value": ""
        },
        "check": {
            "label": "Check Penalty",
            "type": "String",
            "value": "-3"
        },
        "collapsed": {
            "value": false
        },
        "containerId": {
            "value": ""
        },
        "description": {
            "chat": "",
            "label": "Description",
            "type": "String",
            "unidentified": "",
            "value": "<p>This elegant full plate is embossed with heraldic imagery and never tarnishes or loses its shine. <em>Glorious plate</em> is <em>+2 resilient full plate</em>.</p>\n<p>In battle, <em>glorious plate</em> sheds bright light in a 10-foot radius, which enemies see as a blinding halo that obscures creatures other than the wearer. When an enemy looks at the wearer, it must attempt a DC 33 Will saving throw. The enemy is then temporarily immune for 1 minute.</p>\n<p><strong>Success</strong> The enemy is unaffected.<br /><strong>Failure</strong> For 1 minute, the wearer's allies within the glorious plate's 10-foot radius of light are concealed to the enemy. Allies are concealed only while they remain within the light; if allies enter the light later, they are concealed as well.<br /><strong>Critical Failure</strong> As failure, except the wearer's allies are hidden to the enemy instead of concealed.</p>\n<p><strong>Activate</strong> <span style=\"font-family: 'Pathfinder2eActions'; font-size: 1.8em; display: inline;\">D</span> command, Interact</p>\n<p><strong>Effect</strong> The armor casts @Compendium[pf2e.spells-srd.Sanctuary]{Sanctuary} on you.</p>"
        },
        "dex": {
            "label": "Dex Modifier Cap",
            "type": "String",
            "value": "0"
        },
        "equipped": {
            "label": "Equipped",
            "type": "Boolean",
            "value": false
        },
        "equippedBulk": {
            "value": "4"
        },
        "group": {
            "label": "Group",
            "type": "String",
            "value": "plate"
        },
        "hardness": {
            "value": null
        },
        "hp": {
            "value": null
        },
        "identified": {
            "value": true
        },
        "invested": {
            "value": false
        },
        "level": {
            "label": "Item Level",
            "type": "Number",
            "value": 14
        },
        "maxHp": {
            "value": null
        },
        "negateBulk": {
            "value": "0"
        },
        "potency": {
            "label": "Armor Potency",
            "type": "String"
        },
        "potencyRune": {
            "value": "2"
        },
        "preciousMaterial": {
            "value": ""
        },
        "preciousMaterialGrade": {
            "value": ""
        },
        "price": {
            "label": "Price",
            "type": "String",
            "value": "4,500 gp"
        },
        "propertyRune1": {
            "value": ""
        },
        "propertyRune2": {
            "value": ""
        },
        "propertyRune3": {
            "value": ""
        },
        "propertyRune4": {
            "value": ""
        },
        "quantity": {
            "label": "Quantity",
            "type": "Number",
            "value": 1
        },
        "rarity": {
            "value": "common"
        },
        "resiliencyRune": {
            "value": "resilient"
        },
        "resilient": {
            "label": "Resilient",
            "type": "String"
        },
        "rules": [
            {
                "key": "PF2E.RuleElement.FlatModifier",
                "label": "Bulwark (vs. damaging effects)",
                "predicate": {
                    "all": [
                        "damage"
                    ]
                },
                "selector": "reflex",
                "type": "ability",
                "value": 3
            }
        ],
        "size": {
            "value": "med"
        },
        "source": {
            "label": "Source",
            "type": "String",
            "value": ""
        },
        "speed": {
            "label": "Speed Penalty",
            "type": "String",
            "value": "-10 ft"
        },
        "stackGroup": {
            "value": ""
        },
        "strength": {
            "label": "Required Strength",
            "type": "String",
            "value": "18"
        },
        "traits": {
            "custom": "",
            "label": "Traits",
            "rarity": {
                "value": "rare"
            },
            "type": "String",
            "value": [
                "bulwark",
                "evocation",
                "good",
                "light",
                "magical"
            ]
        },
        "usage": {
            "value": "wornarmor"
        },
        "weight": {
            "label": "Bulk",
            "type": "Number",
            "value": "5"
        }
    },
    "effects": [],
    "flags": {},
    "img": "systems/pf2e/icons/equipment/armor/specific-magic-armor/glorious-plate.jpg",
    "name": "Glorious Plate",
    "permission": {
        "default": 0
    },
    "type": "armor"
}
