[
  {
    "datasetid": "pupils-classed-as-disadvantaged-in-bristol",
    "recordid": "a42143fdf0c374e7cad0bbc23d95339781a55cb8",
    "fields": {
      "ward_code": "E05010890",
      "ward_name": "Brislington East",
      "disadvantaged_of_all_pupils": 27.6073619632,
      "year": "2016",
      "total_number_of_pupils_classed_as_disadvantaged": 405
    },
    "geometry": {
      "type": "Point",
      "coordinates": [
        -2.53865369047,
        51.4402835576
      ]
    },
    "record_timestamp": "2019-11-28T13:31:12.664Z"
  },
  {
    "datasetid": "pupils-classed-as-disadvantaged-in-bristol",
    "recordid": "b239b9f7ad314590231388837498e2a376144dd7",
    "fields": {
      "ward_code": "E05010893",
      "ward_name": "Clifton",
      "disadvantaged_of_all_pupils": 16.5755919854,
      "year": "2016",
      "total_number_of_pupils_classed_as_disadvantaged": 91
    },
    "geometry": {
      "type": "Point",
      "coordinates": [
        -2.61996331305,
        51.4565158032
      ]
    },
    "record_timestamp": "2019-11-28T13:31:12.664Z"
  },
  {
    "datasetid": "pupils-classed-as-disadvantaged-in-bristol",
    "recordid": "c3fd653a6d3ee989c2e57669aaaec6d848da901e",
    "fields": {
      "ward_code": "E05010895",
      "ward_name": "Cotham",
      "disadvantaged_of_all_pupils": 7.70465489567,
      "year": "2016",
      "total_number_of_pupils_classed_as_disadvantaged": 48
    },
    "geometry": {
      "type": "Point",
      "coordinates": [
        -2.59991083361,
        51.4659633898
      ]
    },
    "record_timestamp": "2019-11-28T13:31:12.664Z"
  },
  {
    "datasetid": "pupils-classed-as-disadvantaged-in-bristol",
    "recordid": "ef7846cadb23b0d5eec8c7285c252a5c0ef2b365",
    "fields": {
      "ward_code": "E05010888",
      "ward_name": "Bishopston & Ashley Down",
      "total_number_of_pupils": 1546,
      "disadvantaged_of_all_pupils": 7.24450194049,
      "year": "2017",
      "total_number_of_pupils_classed_as_disadvantaged": 112
    },
    "geometry": {
      "type": "Point",
      "coordinates": [
        -2.58646340656,
        51.4814532715
      ]
    },
    "record_timestamp": "2019-11-28T13:31:12.664Z"
  },
  {
    "datasetid": "pupils-classed-as-disadvantaged-in-bristol",
    "recordid": "02f93caea6dba3670c4da79d875b3b7ae652722a",
    "fields": {
      "ward_code": "E05010906",
      "ward_name": "Knowle",
      "total_number_of_pupils": 2161,
      "disadvantaged_of_all_pupils": 28.7366959741,
      "year": "2017",
      "total_number_of_pupils_classed_as_disadvantaged": 621
    },
    "geometry": {
      "type": "Point",
      "coordinates": [
        -2.57233440569,
        51.4327773874
      ]
    },
    "record_timestamp": "2019-11-28T13:31:12.664Z"
  },
  {
    "datasetid": "pupils-classed-as-disadvantaged-in-bristol",
    "recordid": "6a5e1860bc5620d5b5c6b306e8e05d42356046c9",
    "fields": {
      "ward_code": "E05010907",
      "ward_name": "Lawrence Hill",
      "total_number_of_pupils": 3430,
      "disadvantaged_of_all_pupils": 48.0174927114,
      "year": "2017",
      "total_number_of_pupils_classed_as_disadvantaged": 1647
    },
    "geometry": {
      "type": "Point",
      "coordinates": [
        -2.57123424149,
        51.4545929175
      ]
    },
    "record_timestamp": "2019-11-28T13:31:12.664Z"
  },
  {
    "datasetid": "pupils-classed-as-disadvantaged-in-bristol",
    "recordid": "3d750169103e27e315f86799aa7666647e3045db",
    "fields": {
      "ward_code": "E05010913",
      "ward_name": "Southmead",
      "total_number_of_pupils": 2253,
      "disadvantaged_of_all_pupils": 36.4403018198,
      "year": "2017",
      "total_number_of_pupils_classed_as_disadvantaged": 821
    },
    "geometry": {
      "type": "Point",
      "coordinates": [
        -2.60111790007,
        51.5030620845
      ]
    },
    "record_timestamp": "2019-11-28T13:31:12.664Z"
  },
  {
    "datasetid": "pupils-classed-as-disadvantaged-in-bristol",
    "recordid": "676f7350678418bed10cdc3b448a12a514ad197f",
    "fields": {
      "ward_code": "E05010887",
      "ward_name": "Bedminster",
      "total_number_of_pupils": 1280,
      "disadvantaged_of_all_pupils": 15.703125,
      "year": "2018",
      "total_number_of_pupils_classed_as_disadvantaged": 201
    },
    "geometry": {
      "type": "Point",
      "coordinates": [
        -2.62187227821,
        51.4371603671
      ]
    },
    "record_timestamp": "2019-11-28T13:31:12.664Z"
  },
  {
    "datasetid": "pupils-classed-as-disadvantaged-in-bristol",
    "recordid": "2f48770af629af68d0de21a32db927e30359d5d3",
    "fields": {
      "ward_code": "E05010910",
      "ward_name": "St George Central",
      "total_number_of_pupils": 1470,
      "disadvantaged_of_all_pupils": 26.5986394558,
      "year": "2018",
      "total_number_of_pupils_classed_as_disadvantaged": 391
    },
    "geometry": {
      "type": "Point",
      "coordinates": [
        -2.52638340272,
        51.4621405804
      ]
    },
    "record_timestamp": "2019-11-28T13:31:12.664Z"
  },
  {
    "datasetid": "pupils-classed-as-disadvantaged-in-bristol",
    "recordid": "e6c0f5b09d399858a4869f46391e712295188db0",
    "fields": {
      "ward_code": "E05010918",
      "ward_name": "Windmill Hill",
      "total_number_of_pupils": 1569,
      "disadvantaged_of_all_pupils": 20.9050350542,
      "year": "2018",
      "total_number_of_pupils_classed_as_disadvantaged": 328
    },
    "geometry": {
      "type": "Point",
      "coordinates": [
        -2.58594427096,
        51.4390971799
      ]
    },
    "record_timestamp": "2019-11-28T13:31:12.664Z"
  },
  {
    "datasetid": "pupils-classed-as-disadvantaged-in-bristol",
    "recordid": "942abe6d59dbe0c50d294019298d5d8d3d4c1678",
    "fields": {
      "ward_code": "E05010889",
      "ward_name": "Bishopsworth",
      "total_number_of_pupils": 1721,
      "disadvantaged_of_all_pupils": 20.5,
      "year": "2019",
      "total_number_of_pupils_classed_as_disadvantaged": 352
    },
    "geometry": {
      "type": "Point",
      "coordinates": [
        -2.61645553985,
        51.4217884041
      ]
    },
    "record_timestamp": "2019-11-28T13:31:12.664Z"
  },
  {
    "datasetid": "pupils-classed-as-disadvantaged-in-bristol",
    "recordid": "382c6347c8d0ef3b24cd7dde3c89c6ca785f84fc",
    "fields": {
      "ward_code": "E05010893",
      "ward_name": "Clifton",
      "total_number_of_pupils": 538,
      "disadvantaged_of_all_pupils": 13.9,
      "year": "2019",
      "total_number_of_pupils_classed_as_disadvantaged": 75
    },
    "geometry": {
      "type": "Point",
      "coordinates": [
        -2.61996331305,
        51.4565158032
      ]
    },
    "record_timestamp": "2019-11-28T13:31:12.664Z"
  },
  {
    "datasetid": "pupils-classed-as-disadvantaged-in-bristol",
    "recordid": "9fe12fb920e6a22dfe8990933feb43760f414a5e",
    "fields": {
      "ward_code": "E05010896",
      "ward_name": "Easton",
      "total_number_of_pupils": 1792,
      "disadvantaged_of_all_pupils": 28.2,
      "year": "2019",
      "total_number_of_pupils_classed_as_disadvantaged": 506
    },
    "geometry": {
      "type": "Point",
      "coordinates": [
        -2.55850571231,
        51.4623719964
      ]
    },
    "record_timestamp": "2019-11-28T13:31:12.664Z"
  },
  {
    "datasetid": "pupils-classed-as-disadvantaged-in-bristol",
    "recordid": "b01202431e08c0f76ffe7964a4eedf915778e8be",
    "fields": {
      "ward_code": "E05010897",
      "ward_name": "Eastville",
      "total_number_of_pupils": 1979,
      "disadvantaged_of_all_pupils": 25.7,
      "year": "2019",
      "total_number_of_pupils_classed_as_disadvantaged": 508
    },
    "geometry": {
      "type": "Point",
      "coordinates": [
        -2.54692680567,
        51.4747101824
      ]
    },
    "record_timestamp": "2019-11-28T13:31:12.664Z"
  },
  {
    "datasetid": "pupils-classed-as-disadvantaged-in-bristol",
    "recordid": "7f7d32d9ba61361d860d69210c891f32c4229a20",
    "fields": {
      "ward_code": "E05010900",
      "ward_name": "Hartcliffe & Withywood",
      "total_number_of_pupils": 4206,
      "disadvantaged_of_all_pupils": 48.4,
      "year": "2019",
      "total_number_of_pupils_classed_as_disadvantaged": 2036
    },
    "geometry": {
      "type": "Point",
      "coordinates": [
        -2.6122179734,
        51.4077037025
      ]
    },
    "record_timestamp": "2019-11-28T13:31:12.664Z"
  },
  {
    "datasetid": "pupils-classed-as-disadvantaged-in-bristol",
    "recordid": "13b3877623660aadbabe291bf79dd84dcabb622e",
    "fields": {
      "ward_code": "E05010910",
      "ward_name": "St George Central",
      "total_number_of_pupils": 1490,
      "disadvantaged_of_all_pupils": 27.2,
      "year": "2019",
      "total_number_of_pupils_classed_as_disadvantaged": 405
    },
    "geometry": {
      "type": "Point",
      "coordinates": [
        -2.52638340272,
        51.4621405804
      ]
    },
    "record_timestamp": "2019-11-28T13:31:12.664Z"
  },
  {
    "datasetid": "pupils-classed-as-disadvantaged-in-bristol",
    "recordid": "25349f31a762ac537e7b96d298d5bb2c29a77f94",
    "fields": {
      "ward_code": "E05010886",
      "ward_name": "Avonmouth & Lawrence Weston",
      "disadvantaged_of_all_pupils": 34.3824940048,
      "year": "2016",
      "total_number_of_pupils_classed_as_disadvantaged": 1147
    },
    "geometry": {
      "type": "Point",
      "coordinates": [
        -2.67640359358,
        51.5073341696
      ]
    },
    "record_timestamp": "2019-11-28T13:31:12.664Z"
  },
  {
    "datasetid": "pupils-classed-as-disadvantaged-in-bristol",
    "recordid": "a953836d1c6d6e6dff19f00e73ec93546880ed37",
    "fields": {
      "ward_code": "E05010915",
      "ward_name": "Stockwood",
      "disadvantaged_of_all_pupils": 25.1631617114,
      "year": "2016",
      "total_number_of_pupils_classed_as_disadvantaged": 347
    },
    "geometry": {
      "type": "Point",
      "coordinates": [
        -2.54973459028,
        51.418418512
      ]
    },
    "record_timestamp": "2019-11-28T13:31:12.664Z"
  },
  {
    "datasetid": "pupils-classed-as-disadvantaged-in-bristol",
    "recordid": "b474538c85790cdb1f2014222047bbd9689e4d37",
    "fields": {
      "ward_code": "E05010917",
      "ward_name": "Westbury-on-Trym & Henleaze",
      "disadvantaged_of_all_pupils": 5.05774591796,
      "year": "2016",
      "total_number_of_pupils_classed_as_disadvantaged": 127
    },
    "geometry": {
      "type": "Point",
      "coordinates": [
        -2.61748273112,
        51.4897948304
      ]
    },
    "record_timestamp": "2019-11-28T13:31:12.664Z"
  },
  {
    "datasetid": "pupils-classed-as-disadvantaged-in-bristol",
    "recordid": "0d0a485196a4b89bdcc7183c5d56710413fd0f6c",
    "fields": {
      "ward_code": "E05010903",
      "ward_name": "Hillfields",
      "total_number_of_pupils": 1575,
      "disadvantaged_of_all_pupils": 31.2380952381,
      "year": "2017",
      "total_number_of_pupils_classed_as_disadvantaged": 492
    },
    "geometry": {
      "type": "Point",
      "coordinates": [
        -2.5225753211,
        51.4737018096
      ]
    },
    "record_timestamp": "2019-11-28T13:31:12.664Z"
  },
  {
    "datasetid": "pupils-classed-as-disadvantaged-in-bristol",
    "recordid": "ea03130486368350e1166871ded5eae31e9fe0b0",
    "fields": {
      "ward_code": "E05010914",
      "ward_name": "Southville",
      "total_number_of_pupils": 1208,
      "disadvantaged_of_all_pupils": 12.582781457,
      "year": "2017",
      "total_number_of_pupils_classed_as_disadvantaged": 152
    },
    "geometry": {
      "type": "Point",
      "coordinates": [
        -2.60399054226,
        51.4433220308
      ]
    },
    "record_timestamp": "2019-11-28T13:31:12.664Z"
  },
  {
    "datasetid": "pupils-classed-as-disadvantaged-in-bristol",
    "recordid": "82426e8a031a2f2d25b9d43f4712f6dc738213b1",
    "fields": {
      "ward_code": "E05010891",
      "ward_name": "Brislington West",
      "total_number_of_pupils": 1356,
      "disadvantaged_of_all_pupils": 20.6489675516,
      "year": "2018",
      "total_number_of_pupils_classed_as_disadvantaged": 280
    },
    "geometry": {
      "type": "Point",
      "coordinates": [
        -2.54906988637,
        51.4343938593
      ]
    },
    "record_timestamp": "2019-11-28T13:31:12.664Z"
  },
  {
    "datasetid": "pupils-classed-as-disadvantaged-in-bristol",
    "recordid": "7016266dbdbb50777a81e2797df0754b20e88fcd",
    "fields": {
      "ward_code": "E05010896",
      "ward_name": "Easton",
      "total_number_of_pupils": 1792,
      "disadvantaged_of_all_pupils": 30.078125,
      "year": "2018",
      "total_number_of_pupils_classed_as_disadvantaged": 539
    },
    "geometry": {
      "type": "Point",
      "coordinates": [
        -2.55850571231,
        51.4623719964
      ]
    },
    "record_timestamp": "2019-11-28T13:31:12.664Z"
  },
  {
    "datasetid": "pupils-classed-as-disadvantaged-in-bristol",
    "recordid": "303a944ac60c938b5de85bf47eb9e2e0b529441b",
    "fields": {
      "ward_code": "E05010897",
      "ward_name": "Eastville",
      "total_number_of_pupils": 1980,
      "disadvantaged_of_all_pupils": 25.404040404,
      "year": "2018",
      "total_number_of_pupils_classed_as_disadvantaged": 503
    },
    "geometry": {
      "type": "Point",
      "coordinates": [
        -2.54692680567,
        51.4747101824
      ]
    },
    "record_timestamp": "2019-11-28T13:31:12.664Z"
  },
  {
    "datasetid": "pupils-classed-as-disadvantaged-in-bristol",
    "recordid": "0ae0207cecb829c919b754cceff3f9f1e5aab860",
    "fields": {
      "ward_code": "E05010901",
      "ward_name": "Henbury & Brentry",
      "total_number_of_pupils": 1971,
      "disadvantaged_of_all_pupils": 34.1,
      "year": "2019",
      "total_number_of_pupils_classed_as_disadvantaged": 672
    },
    "geometry": {
      "type": "Point",
      "coordinates": [
        -2.62103514848,
        51.5089736142
      ]
    },
    "record_timestamp": "2019-11-28T13:31:12.664Z"
  },
  {
    "datasetid": "pupils-classed-as-disadvantaged-in-bristol",
    "recordid": "efbc61284b964a74e1faef152dbf8413ad3cf043",
    "fields": {
      "ward_code": "E05010904",
      "ward_name": "Horfield",
      "total_number_of_pupils": 1504,
      "disadvantaged_of_all_pupils": 26.6,
      "year": "2019",
      "total_number_of_pupils_classed_as_disadvantaged": 400
    },
    "geometry": {
      "type": "Point",
      "coordinates": [
        -2.586379126,
        51.4950842804
      ]
    },
    "record_timestamp": "2019-11-28T13:31:12.664Z"
  },
  {
    "datasetid": "pupils-classed-as-disadvantaged-in-bristol",
    "recordid": "403c7d1af7f7598b330dce38e53a1582c6dc1b2a",
    "fields": {
      "ward_code": "E05010907",
      "ward_name": "Lawrence Hill",
      "total_number_of_pupils": 3520,
      "disadvantaged_of_all_pupils": 44.7,
      "year": "2019",
      "total_number_of_pupils_classed_as_disadvantaged": 1574
    },
    "geometry": {
      "type": "Point",
      "coordinates": [
        -2.57123424149,
        51.4545929175
      ]
    },
    "record_timestamp": "2019-11-28T13:31:12.664Z"
  },
  {
    "datasetid": "pupils-classed-as-disadvantaged-in-bristol",
    "recordid": "bfd8c08a65a3a9dfac0edc1a21dd1f35eb05db8d",
    "fields": {
      "ward_code": "E05010908",
      "ward_name": "Lockleaze",
      "total_number_of_pupils": 2149,
      "disadvantaged_of_all_pupils": 34.4,
      "year": "2019",
      "total_number_of_pupils_classed_as_disadvantaged": 740
    },
    "geometry": {
      "type": "Point",
      "coordinates": [
        -2.56566726138,
        51.4858562509
      ]
    },
    "record_timestamp": "2019-11-28T13:31:12.664Z"
  },
  {
    "datasetid": "pupils-classed-as-disadvantaged-in-bristol",
    "recordid": "3a05b899a352c12a8f3649f7aa9e75473aaf4706",
    "fields": {
      "ward_code": "E05010909",
      "ward_name": "Redland",
      "total_number_of_pupils": 2068,
      "disadvantaged_of_all_pupils": 2.6,
      "year": "2019",
      "total_number_of_pupils_classed_as_disadvantaged": 54
    },
    "geometry": {
      "type": "Point",
      "coordinates": [
        -2.60115761678,
        51.4752449941
      ]
    },
    "record_timestamp": "2019-11-28T13:31:12.664Z"
  },
  {
    "datasetid": "pupils-classed-as-disadvantaged-in-bristol",
    "recordid": "0ce78ba65dd29dbcc47fe0137bbf4a0fcada878e",
    "fields": {
      "total_number_of_pupils_classed_as_disadvantaged": 16456,
      "total_number_of_pupils": 59419,
      "ward_name": "Bristol",
      "disadvantaged_of_all_pupils": 27.7,
      "year": "2019"
    },
    "record_timestamp": "2019-11-28T13:31:12.664Z"
  },
  {
    "datasetid": "pupils-classed-as-disadvantaged-in-bristol",
    "recordid": "6caa92401a0563b9ee65b01522359fcbf1077945",
    "fields": {
      "ward_code": "E05010904",
      "ward_name": "Horfield",
      "disadvantaged_of_all_pupils": 28.591954023,
      "year": "2016",
      "total_number_of_pupils_classed_as_disadvantaged": 398
    },
    "geometry": {
      "type": "Point",
      "coordinates": [
        -2.586379126,
        51.4950842804
      ]
    },
    "record_timestamp": "2019-11-28T13:31:12.664Z"
  },
  {
    "datasetid": "pupils-classed-as-disadvantaged-in-bristol",
    "recordid": "8d948f88878bef035a716d977cb5a88f6246a1b1",
    "fields": {
      "ward_code": "E05010907",
      "ward_name": "Lawrence Hill",
      "disadvantaged_of_all_pupils": 49.666464524,
      "year": "2016",
      "total_number_of_pupils_classed_as_disadvantaged": 1638
    },
    "geometry": {
      "type": "Point",
      "coordinates": [
        -2.57123424149,
        51.4545929175
      ]
    },
    "record_timestamp": "2019-11-28T13:31:12.664Z"
  },
  {
    "datasetid": "pupils-classed-as-disadvantaged-in-bristol",
    "recordid": "9d1d2766532f7be3c363ef1d9643e8adbb4fda80",
    "fields": {
      "ward_code": "E05010898",
      "ward_name": "Filwood",
      "total_number_of_pupils": 3133,
      "disadvantaged_of_all_pupils": 45.3558889244,
      "year": "2017",
      "total_number_of_pupils_classed_as_disadvantaged": 1421
    },
    "geometry": {
      "type": "Point",
      "coordinates": [
        -2.59280262818,
        51.4254187146
      ]
    },
    "record_timestamp": "2019-11-28T13:31:12.664Z"
  },
  {
    "datasetid": "pupils-classed-as-disadvantaged-in-bristol",
    "recordid": "c1a7ecf12027a204869c5a7293b6b366d905cea3",
    "fields": {
      "ward_code": "E05010902",
      "ward_name": "Hengrove & Whitchurch Park",
      "total_number_of_pupils": 2327,
      "disadvantaged_of_all_pupils": 27.7180919639,
      "year": "2017",
      "total_number_of_pupils_classed_as_disadvantaged": 645
    },
    "geometry": {
      "type": "Point",
      "coordinates": [
        -2.57721341501,
        51.4115422794
      ]
    },
    "record_timestamp": "2019-11-28T13:31:12.664Z"
  },
  {
    "datasetid": "pupils-classed-as-disadvantaged-in-bristol",
    "recordid": "10ec233ce532b8cda0dbad55bf8a016eb0bd5587",
    "fields": {
      "ward_code": "E05010909",
      "ward_name": "Redland",
      "total_number_of_pupils": 2065,
      "disadvantaged_of_all_pupils": 2.61501210654,
      "year": "2017",
      "total_number_of_pupils_classed_as_disadvantaged": 54
    },
    "geometry": {
      "type": "Point",
      "coordinates": [
        -2.60115761678,
        51.4752449941
      ]
    },
    "record_timestamp": "2019-11-28T13:31:12.664Z"
  },
  {
    "datasetid": "pupils-classed-as-disadvantaged-in-bristol",
    "recordid": "5d85f391c7a288f0824f1243e08b44659871a386",
    "fields": {
      "ward_code": "E05010889",
      "ward_name": "Bishopsworth",
      "total_number_of_pupils": 1695,
      "disadvantaged_of_all_pupils": 20.7669616519,
      "year": "2018",
      "total_number_of_pupils_classed_as_disadvantaged": 352
    },
    "geometry": {
      "type": "Point",
      "coordinates": [
        -2.61645553985,
        51.4217884041
      ]
    },
    "record_timestamp": "2019-11-28T13:31:12.664Z"
  },
  {
    "datasetid": "pupils-classed-as-disadvantaged-in-bristol",
    "recordid": "0e878658fd3fa955b9d9a23a116fb351df224638",
    "fields": {
      "ward_code": "E05010911",
      "ward_name": "St George Troopers Hill",
      "total_number_of_pupils": 342,
      "disadvantaged_of_all_pupils": 24.269005848,
      "year": "2018",
      "total_number_of_pupils_classed_as_disadvantaged": 83
    },
    "geometry": {
      "type": "Point",
      "coordinates": [
        -2.53032298326,
        51.4534361531
      ]
    },
    "record_timestamp": "2019-11-28T13:31:12.664Z"
  },
  {
    "datasetid": "pupils-classed-as-disadvantaged-in-bristol",
    "recordid": "d01a3b9af32cc647edbe606081d4f1a095010989",
    "fields": {
      "ward_code": "E05010890",
      "ward_name": "Brislington East",
      "total_number_of_pupils": 1497,
      "disadvantaged_of_all_pupils": 25.7,
      "year": "2019",
      "total_number_of_pupils_classed_as_disadvantaged": 385
    },
    "geometry": {
      "type": "Point",
      "coordinates": [
        -2.53865369047,
        51.4402835576
      ]
    },
    "record_timestamp": "2019-11-28T13:31:12.664Z"
  },
  {
    "datasetid": "pupils-classed-as-disadvantaged-in-bristol",
    "recordid": "d7b31ac93abd82d846237e953697275214003baf",
    "fields": {
      "ward_code": "E05010892",
      "ward_name": "Central",
      "total_number_of_pupils": 727,
      "disadvantaged_of_all_pupils": 41.5,
      "year": "2019",
      "total_number_of_pupils_classed_as_disadvantaged": 302
    },
    "geometry": {
      "type": "Point",
      "coordinates": [
        -2.59433619751,
        51.4544148955
      ]
    },
    "record_timestamp": "2019-11-28T13:31:12.664Z"
  },
  {
    "datasetid": "pupils-classed-as-disadvantaged-in-bristol",
    "recordid": "e7dcb8f61ba729d742cc50169eb23d67ad273a7b",
    "fields": {
      "ward_code": "E05010899",
      "ward_name": "Frome Vale",
      "total_number_of_pupils": 1357,
      "disadvantaged_of_all_pupils": 29.5,
      "year": "2019",
      "total_number_of_pupils_classed_as_disadvantaged": 400
    },
    "geometry": {
      "type": "Point",
      "coordinates": [
        -2.53119915299,
        51.4870905493
      ]
    },
    "record_timestamp": "2019-11-28T13:31:12.664Z"
  },
  {
    "datasetid": "pupils-classed-as-disadvantaged-in-bristol",
    "recordid": "370f0fda78fabaae7287c5d506d28d60d244673a",
    "fields": {
      "ward_code": "E05010905",
      "ward_name": "Hotwells & Harbourside",
      "total_number_of_pupils": 224,
      "disadvantaged_of_all_pupils": 25.9,
      "year": "2019",
      "total_number_of_pupils_classed_as_disadvantaged": 58
    },
    "geometry": {
      "type": "Point",
      "coordinates": [
        -2.60957858467,
        51.4497285026
      ]
    },
    "record_timestamp": "2019-11-28T13:31:12.664Z"
  },
  {
    "datasetid": "pupils-classed-as-disadvantaged-in-bristol",
    "recordid": "aa8089b74c8c5bff98c4c5c464cb736596a19e2d",
    "fields": {
      "ward_code": "E05010911",
      "ward_name": "St George Troopers Hill",
      "total_number_of_pupils": 358,
      "disadvantaged_of_all_pupils": 23.5,
      "year": "2019",
      "total_number_of_pupils_classed_as_disadvantaged": 84
    },
    "geometry": {
      "type": "Point",
      "coordinates": [
        -2.53032298326,
        51.4534361531
      ]
    },
    "record_timestamp": "2019-11-28T13:31:12.664Z"
  },
  {
    "datasetid": "pupils-classed-as-disadvantaged-in-bristol",
    "recordid": "9aeca24431d9235a9c51910aee3300305760044b",
    "fields": {
      "ward_code": "E05010902",
      "ward_name": "Hengrove & Whitchurch Park",
      "disadvantaged_of_all_pupils": 28.5714285714,
      "year": "2016",
      "total_number_of_pupils_classed_as_disadvantaged": 646
    },
    "geometry": {
      "type": "Point",
      "coordinates": [
        -2.57721341501,
        51.4115422794
      ]
    },
    "record_timestamp": "2019-11-28T13:31:12.664Z"
  },
  {
    "datasetid": "pupils-classed-as-disadvantaged-in-bristol",
    "recordid": "54f476706b790367e399836a39989fe6220401e1",
    "fields": {
      "ward_code": "E05010910",
      "ward_name": "St George Central",
      "disadvantaged_of_all_pupils": 29.0794979079,
      "year": "2016",
      "total_number_of_pupils_classed_as_disadvantaged": 417
    },
    "geometry": {
      "type": "Point",
      "coordinates": [
        -2.52638340272,
        51.4621405804
      ]
    },
    "record_timestamp": "2019-11-28T13:31:12.664Z"
  },
  {
    "datasetid": "pupils-classed-as-disadvantaged-in-bristol",
    "recordid": "8b52ef5a8027e15ce9b8fbb3af602d4b3b49fa49",
    "fields": {
      "ward_code": "E05010911",
      "ward_name": "St George Troopers Hill",
      "disadvantaged_of_all_pupils": 19.7530864198,
      "year": "2016",
      "total_number_of_pupils_classed_as_disadvantaged": 64
    },
    "geometry": {
      "type": "Point",
      "coordinates": [
        -2.53032298326,
        51.4534361531
      ]
    },
    "record_timestamp": "2019-11-28T13:31:12.664Z"
  },
  {
    "datasetid": "pupils-classed-as-disadvantaged-in-bristol",
    "recordid": "823540f3fa9bca91fb47726fbc4f5e7f19d46d43",
    "fields": {
      "ward_code": "E05010918",
      "ward_name": "Windmill Hill",
      "disadvantaged_of_all_pupils": 23.6651285432,
      "year": "2016",
      "total_number_of_pupils_classed_as_disadvantaged": 327
    },
    "geometry": {
      "type": "Point",
      "coordinates": [
        -2.58594427096,
        51.4390971799
      ]
    },
    "record_timestamp": "2019-11-28T13:31:12.664Z"
  },
  {
    "datasetid": "pupils-classed-as-disadvantaged-in-bristol",
    "recordid": "4bb7e16fb4bc817b180fcb56ab578a3295f3d6e5",
    "fields": {
      "total_number_of_pupils_classed_as_disadvantaged": 17176,
      "ward_name": "Bristol",
      "disadvantaged_of_all_pupils": 29.7,
      "year": "2016"
    },
    "record_timestamp": "2019-11-28T13:31:12.664Z"
  },
  {
    "datasetid": "pupils-classed-as-disadvantaged-in-bristol",
    "recordid": "6480a4d30f2ed69e1e436b3a0e2a45606deb4a8b",
    "fields": {
      "ward_code": "E05010886",
      "ward_name": "Avonmouth & Lawrence Weston",
      "total_number_of_pupils": 3447,
      "disadvantaged_of_all_pupils": 32.8691615898,
      "year": "2017",
      "total_number_of_pupils_classed_as_disadvantaged": 1133
    },
    "geometry": {
      "type": "Point",
      "coordinates": [
        -2.67640359358,
        51.5073341696
      ]
    },
    "record_timestamp": "2019-11-28T13:31:12.664Z"
  },
  {
    "datasetid": "pupils-classed-as-disadvantaged-in-bristol",
    "recordid": "df9ac2db93b37e88b67d1cc3bc57bee35e01d16a",
    "fields": {
      "ward_code": "E05010887",
      "ward_name": "Bedminster",
      "total_number_of_pupils": 1222,
      "disadvantaged_of_all_pupils": 16.2029459902,
      "year": "2017",
      "total_number_of_pupils_classed_as_disadvantaged": 198
    },
    "geometry": {
      "type": "Point",
      "coordinates": [
        -2.62187227821,
        51.4371603671
      ]
    },
    "record_timestamp": "2019-11-28T13:31:12.664Z"
  },
  {
    "datasetid": "pupils-classed-as-disadvantaged-in-bristol",
    "recordid": "159d14a15544d850059e6d97057970bb4d6bbd8f",
    "fields": {
      "ward_code": "E05010892",
      "ward_name": "Central",
      "total_number_of_pupils": 639,
      "disadvantaged_of_all_pupils": 42.5665101721,
      "year": "2017",
      "total_number_of_pupils_classed_as_disadvantaged": 272
    },
    "geometry": {
      "type": "Point",
      "coordinates": [
        -2.59433619751,
        51.4544148955
      ]
    },
    "record_timestamp": "2019-11-28T13:31:12.664Z"
  },
  {
    "datasetid": "pupils-classed-as-disadvantaged-in-bristol",
    "recordid": "93c42f22d4e316a33294ef9a19e2c1f4c76f1c88",
    "fields": {
      "ward_code": "E05010893",
      "ward_name": "Clifton",
      "total_number_of_pupils": 557,
      "disadvantaged_of_all_pupils": 14.5421903052,
      "year": "2017",
      "total_number_of_pupils_classed_as_disadvantaged": 81
    },
    "geometry": {
      "type": "Point",
      "coordinates": [
        -2.61996331305,
        51.4565158032
      ]
    },
    "record_timestamp": "2019-11-28T13:31:12.664Z"
  },
  {
    "datasetid": "pupils-classed-as-disadvantaged-in-bristol",
    "recordid": "268537ee292197a2038e4c69177ae367368f5fdb",
    "fields": {
      "ward_code": "E05010896",
      "ward_name": "Easton",
      "total_number_of_pupils": 1834,
      "disadvantaged_of_all_pupils": 31.73391494,
      "year": "2017",
      "total_number_of_pupils_classed_as_disadvantaged": 582
    },
    "geometry": {
      "type": "Point",
      "coordinates": [
        -2.55850571231,
        51.4623719964
      ]
    },
    "record_timestamp": "2019-11-28T13:31:12.664Z"
  },
  {
    "datasetid": "pupils-classed-as-disadvantaged-in-bristol",
    "recordid": "ee9298da36d002d7532f59a05a29007b93ba58bd",
    "fields": {
      "ward_code": "E05010900",
      "ward_name": "Hartcliffe & Withywood",
      "total_number_of_pupils": 3929,
      "disadvantaged_of_all_pupils": 53.1432934589,
      "year": "2017",
      "total_number_of_pupils_classed_as_disadvantaged": 2088
    },
    "geometry": {
      "type": "Point",
      "coordinates": [
        -2.6122179734,
        51.4077037025
      ]
    },
    "record_timestamp": "2019-11-28T13:31:12.664Z"
  },
  {
    "datasetid": "pupils-classed-as-disadvantaged-in-bristol",
    "recordid": "ae37f2082c022ef392da0ec8935348d876a38e33",
    "fields": {
      "ward_code": "E05010911",
      "ward_name": "St George Troopers Hill",
      "total_number_of_pupils": 328,
      "disadvantaged_of_all_pupils": 21.3414634146,
      "year": "2017",
      "total_number_of_pupils_classed_as_disadvantaged": 70
    },
    "geometry": {
      "type": "Point",
      "coordinates": [
        -2.53032298326,
        51.4534361531
      ]
    },
    "record_timestamp": "2019-11-28T13:31:12.664Z"
  },
  {
    "datasetid": "pupils-classed-as-disadvantaged-in-bristol",
    "recordid": "2e1c10afff2770cda135482d286f970a8fc4f3cb",
    "fields": {
      "ward_code": "E05010893",
      "ward_name": "Clifton",
      "total_number_of_pupils": 529,
      "disadvantaged_of_all_pupils": 14.3667296786,
      "year": "2018",
      "total_number_of_pupils_classed_as_disadvantaged": 76
    },
    "geometry": {
      "type": "Point",
      "coordinates": [
        -2.61996331305,
        51.4565158032
      ]
    },
    "record_timestamp": "2019-11-28T13:31:12.664Z"
  },
  {
    "datasetid": "pupils-classed-as-disadvantaged-in-bristol",
    "recordid": "a19e8ce64a060392f335255a8dfa18b113edfb5d",
    "fields": {
      "total_number_of_pupils_classed_as_disadvantaged": 16400,
      "total_number_of_pupils": 58120,
      "ward_name": "Bristol",
      "disadvantaged_of_all_pupils": 28.2174810736,
      "year": "2018"
    },
    "record_timestamp": "2019-11-28T13:31:12.664Z"
  },
  {
    "datasetid": "pupils-classed-as-disadvantaged-in-bristol",
    "recordid": "d7e2c3c83b68a447af1a5c6a376536507f0f6c4b",
    "fields": {
      "ward_code": "E05010898",
      "ward_name": "Filwood",
      "total_number_of_pupils": 3168,
      "disadvantaged_of_all_pupils": 43.6,
      "year": "2019",
      "total_number_of_pupils_classed_as_disadvantaged": 1382
    },
    "geometry": {
      "type": "Point",
      "coordinates": [
        -2.59280262818,
        51.4254187146
      ]
    },
    "record_timestamp": "2019-11-28T13:31:12.664Z"
  },
  {
    "datasetid": "pupils-classed-as-disadvantaged-in-bristol",
    "recordid": "705fb1ede36d7873021606f774ed8c137e5965c5",
    "fields": {
      "ward_code": "E05010914",
      "ward_name": "Southville",
      "total_number_of_pupils": 1293,
      "disadvantaged_of_all_pupils": 11.1,
      "year": "2019",
      "total_number_of_pupils_classed_as_disadvantaged": 143
    },
    "geometry": {
      "type": "Point",
      "coordinates": [
        -2.60399054226,
        51.4433220308
      ]
    },
    "record_timestamp": "2019-11-28T13:31:12.664Z"
  },
  {
    "datasetid": "pupils-classed-as-disadvantaged-in-bristol",
    "recordid": "2135a44e311e4abafc632f7b9341b5b024f0dd23",
    "fields": {
      "ward_code": "E05010918",
      "ward_name": "Windmill Hill",
      "total_number_of_pupils": 1644,
      "disadvantaged_of_all_pupils": 21.8,
      "year": "2019",
      "total_number_of_pupils_classed_as_disadvantaged": 359
    },
    "geometry": {
      "type": "Point",
      "coordinates": [
        -2.58594427096,
        51.4390971799
      ]
    },
    "record_timestamp": "2019-11-28T13:31:12.664Z"
  },
  {
    "datasetid": "pupils-classed-as-disadvantaged-in-bristol",
    "recordid": "bb04ae49474a4ea35ae59516b36519d6d9963a02",
    "fields": {
      "ward_code": "E05010888",
      "ward_name": "Bishopston & Ashley Down",
      "disadvantaged_of_all_pupils": 7.32356857523,
      "year": "2016",
      "total_number_of_pupils_classed_as_disadvantaged": 110
    },
    "geometry": {
      "type": "Point",
      "coordinates": [
        -2.58646340656,
        51.4814532715
      ]
    },
    "record_timestamp": "2019-11-28T13:31:12.664Z"
  },
  {
    "datasetid": "pupils-classed-as-disadvantaged-in-bristol",
    "recordid": "04216119108e6e3a1aa3f65950c719b5e170fc05",
    "fields": {
      "ward_code": "E05010898",
      "ward_name": "Filwood",
      "disadvantaged_of_all_pupils": 46.5019255456,
      "year": "2016",
      "total_number_of_pupils_classed_as_disadvantaged": 1449
    },
    "geometry": {
      "type": "Point",
      "coordinates": [
        -2.59280262818,
        51.4254187146
      ]
    },
    "record_timestamp": "2019-11-28T13:31:12.664Z"
  },
  {
    "datasetid": "pupils-classed-as-disadvantaged-in-bristol",
    "recordid": "13620400153f6b09bffc7e426d94f7d44be53ee7",
    "fields": {
      "ward_code": "E05010899",
      "ward_name": "Frome Vale",
      "disadvantaged_of_all_pupils": 34.6020761246,
      "year": "2016",
      "total_number_of_pupils_classed_as_disadvantaged": 400
    },
    "geometry": {
      "type": "Point",
      "coordinates": [
        -2.53119915299,
        51.4870905493
      ]
    },
    "record_timestamp": "2019-11-28T13:31:12.664Z"
  },
  {
    "datasetid": "pupils-classed-as-disadvantaged-in-bristol",
    "recordid": "ecae8bace84cae9ddf8d70c1476721bfb8b01ac6",
    "fields": {
      "ward_code": "E05010901",
      "ward_name": "Henbury & Brentry",
      "disadvantaged_of_all_pupils": 37.5073486185,
      "year": "2016",
      "total_number_of_pupils_classed_as_disadvantaged": 638
    },
    "geometry": {
      "type": "Point",
      "coordinates": [
        -2.62103514848,
        51.5089736142
      ]
    },
    "record_timestamp": "2019-11-28T13:31:12.664Z"
  },
  {
    "datasetid": "pupils-classed-as-disadvantaged-in-bristol",
    "recordid": "ce0e239bf03aefe2b96aa26f5d8c4680a9fa10d7",
    "fields": {
      "ward_code": "E05010897",
      "ward_name": "Eastville",
      "total_number_of_pupils": 1948,
      "disadvantaged_of_all_pupils": 26.2833675565,
      "year": "2017",
      "total_number_of_pupils_classed_as_disadvantaged": 512
    },
    "geometry": {
      "type": "Point",
      "coordinates": [
        -2.54692680567,
        51.4747101824
      ]
    },
    "record_timestamp": "2019-11-28T13:31:12.664Z"
  },
  {
    "datasetid": "pupils-classed-as-disadvantaged-in-bristol",
    "recordid": "b8a3597e0f9a1449e7de70908cc96efb39158f45",
    "fields": {
      "ward_code": "E05010910",
      "ward_name": "St George Central",
      "total_number_of_pupils": 1486,
      "disadvantaged_of_all_pupils": 27.6581426649,
      "year": "2017",
      "total_number_of_pupils_classed_as_disadvantaged": 411
    },
    "geometry": {
      "type": "Point",
      "coordinates": [
        -2.52638340272,
        51.4621405804
      ]
    },
    "record_timestamp": "2019-11-28T13:31:12.664Z"
  },
  {
    "datasetid": "pupils-classed-as-disadvantaged-in-bristol",
    "recordid": "8a16f9704e675f18c10b93ef32f6d3448d6f5e39",
    "fields": {
      "ward_code": "E05010915",
      "ward_name": "Stockwood",
      "total_number_of_pupils": 1363,
      "disadvantaged_of_all_pupils": 23.6977256053,
      "year": "2017",
      "total_number_of_pupils_classed_as_disadvantaged": 323
    },
    "geometry": {
      "type": "Point",
      "coordinates": [
        -2.54973459028,
        51.418418512
      ]
    },
    "record_timestamp": "2019-11-28T13:31:12.664Z"
  },
  {
    "datasetid": "pupils-classed-as-disadvantaged-in-bristol",
    "recordid": "51b2ee1254d90d35d0e840d2eaf626e53b33ca53",
    "fields": {
      "ward_code": "E05010888",
      "ward_name": "Bishopston & Ashley Down",
      "total_number_of_pupils": 1611,
      "disadvantaged_of_all_pupils": 7.01427684668,
      "year": "2018",
      "total_number_of_pupils_classed_as_disadvantaged": 113
    },
    "geometry": {
      "type": "Point",
      "coordinates": [
        -2.58646340656,
        51.4814532715
      ]
    },
    "record_timestamp": "2019-11-28T13:31:12.664Z"
  },
  {
    "datasetid": "pupils-classed-as-disadvantaged-in-bristol",
    "recordid": "0e210eb9473e353bdf07cc2ac0494a36f8fcca2b",
    "fields": {
      "ward_code": "E05010898",
      "ward_name": "Filwood",
      "total_number_of_pupils": 3137,
      "disadvantaged_of_all_pupils": 44.3098501753,
      "year": "2018",
      "total_number_of_pupils_classed_as_disadvantaged": 1390
    },
    "geometry": {
      "type": "Point",
      "coordinates": [
        -2.59280262818,
        51.4254187146
      ]
    },
    "record_timestamp": "2019-11-28T13:31:12.664Z"
  },
  {
    "datasetid": "pupils-classed-as-disadvantaged-in-bristol",
    "recordid": "d0837d4d39f9c6746afc340aaec61942813c9765",
    "fields": {
      "ward_code": "E05010900",
      "ward_name": "Hartcliffe & Withywood",
      "total_number_of_pupils": 4053,
      "disadvantaged_of_all_pupils": 50.5798174192,
      "year": "2018",
      "total_number_of_pupils_classed_as_disadvantaged": 2050
    },
    "geometry": {
      "type": "Point",
      "coordinates": [
        -2.6122179734,
        51.4077037025
      ]
    },
    "record_timestamp": "2019-11-28T13:31:12.664Z"
  },
  {
    "datasetid": "pupils-classed-as-disadvantaged-in-bristol",
    "recordid": "6dd0b85127f53357c31807c95d41a3ab3d56ebfc",
    "fields": {
      "ward_code": "E05010902",
      "ward_name": "Hengrove & Whitchurch Park",
      "total_number_of_pupils": 2350,
      "disadvantaged_of_all_pupils": 28.5106382979,
      "year": "2018",
      "total_number_of_pupils_classed_as_disadvantaged": 670
    },
    "geometry": {
      "type": "Point",
      "coordinates": [
        -2.57721341501,
        51.4115422794
      ]
    },
    "record_timestamp": "2019-11-28T13:31:12.664Z"
  },
  {
    "datasetid": "pupils-classed-as-disadvantaged-in-bristol",
    "recordid": "8a9b297b5bea933299e01be011cbb12fb9e377a0",
    "fields": {
      "ward_code": "E05010904",
      "ward_name": "Horfield",
      "total_number_of_pupils": 1452,
      "disadvantaged_of_all_pupils": 27.0661157025,
      "year": "2018",
      "total_number_of_pupils_classed_as_disadvantaged": 393
    },
    "geometry": {
      "type": "Point",
      "coordinates": [
        -2.586379126,
        51.4950842804
      ]
    },
    "record_timestamp": "2019-11-28T13:31:12.664Z"
  },
  {
    "datasetid": "pupils-classed-as-disadvantaged-in-bristol",
    "recordid": "fb124badb62e079548b901f1cf6de77313558777",
    "fields": {
      "ward_code": "E05010908",
      "ward_name": "Lockleaze",
      "total_number_of_pupils": 2094,
      "disadvantaged_of_all_pupils": 34.8137535817,
      "year": "2018",
      "total_number_of_pupils_classed_as_disadvantaged": 729
    },
    "geometry": {
      "type": "Point",
      "coordinates": [
        -2.56566726138,
        51.4858562509
      ]
    },
    "record_timestamp": "2019-11-28T13:31:12.664Z"
  },
  {
    "datasetid": "pupils-classed-as-disadvantaged-in-bristol",
    "recordid": "4734b3d4bd43daad98dda3869f04f88022c2d536",
    "fields": {
      "ward_code": "E05010912",
      "ward_name": "St George West",
      "total_number_of_pupils": 704,
      "disadvantaged_of_all_pupils": 28.8352272727,
      "year": "2018",
      "total_number_of_pupils_classed_as_disadvantaged": 203
    },
    "geometry": {
      "type": "Point",
      "coordinates": [
        -2.54693954016,
        51.4601173974
      ]
    },
    "record_timestamp": "2019-11-28T13:31:12.664Z"
  },
  {
    "datasetid": "pupils-classed-as-disadvantaged-in-bristol",
    "recordid": "820844b47ea74babc8847738303f70e2df6fbd11",
    "fields": {
      "ward_code": "E05010917",
      "ward_name": "Westbury-on-Trym & Henleaze",
      "total_number_of_pupils": 2707,
      "disadvantaged_of_all_pupils": 4.46989287034,
      "year": "2018",
      "total_number_of_pupils_classed_as_disadvantaged": 121
    },
    "geometry": {
      "type": "Point",
      "coordinates": [
        -2.61748273112,
        51.4897948304
      ]
    },
    "record_timestamp": "2019-11-28T13:31:12.664Z"
  },
  {
    "datasetid": "pupils-classed-as-disadvantaged-in-bristol",
    "recordid": "db59be499f9e01dacb366f175dcbbaea54857cdb",
    "fields": {
      "ward_code": "E05010885",
      "ward_name": "Ashley",
      "total_number_of_pupils": 2451,
      "disadvantaged_of_all_pupils": 28.6,
      "year": "2019",
      "total_number_of_pupils_classed_as_disadvantaged": 701
    },
    "geometry": {
      "type": "Point",
      "coordinates": [
        -2.58267316047,
        51.4683098847
      ]
    },
    "record_timestamp": "2019-11-28T13:31:12.664Z"
  },
  {
    "datasetid": "pupils-classed-as-disadvantaged-in-bristol",
    "recordid": "a922ad559374f794ea244c27c4682ee3e0388439",
    "fields": {
      "ward_code": "E05010887",
      "ward_name": "Bedminster",
      "total_number_of_pupils": 1304,
      "disadvantaged_of_all_pupils": 14.3,
      "year": "2019",
      "total_number_of_pupils_classed_as_disadvantaged": 186
    },
    "geometry": {
      "type": "Point",
      "coordinates": [
        -2.62187227821,
        51.4371603671
      ]
    },
    "record_timestamp": "2019-11-28T13:31:12.664Z"
  },
  {
    "datasetid": "pupils-classed-as-disadvantaged-in-bristol",
    "recordid": "bcc7be7c8e78d91979b2cd2a9a204010b67170b4",
    "fields": {
      "ward_code": "E05010915",
      "ward_name": "Stockwood",
      "total_number_of_pupils": 1448,
      "disadvantaged_of_all_pupils": 23.9,
      "year": "2019",
      "total_number_of_pupils_classed_as_disadvantaged": 346
    },
    "geometry": {
      "type": "Point",
      "coordinates": [
        -2.54973459028,
        51.418418512
      ]
    },
    "record_timestamp": "2019-11-28T13:31:12.664Z"
  },
  {
    "datasetid": "pupils-classed-as-disadvantaged-in-bristol",
    "recordid": "40ab2169a1690fc3be2decebeba2e492fadb9a51",
    "fields": {
      "ward_code": "E05010916",
      "ward_name": "Stoke Bishop",
      "total_number_of_pupils": 1192,
      "disadvantaged_of_all_pupils": 20.6,
      "year": "2019",
      "total_number_of_pupils_classed_as_disadvantaged": 245
    },
    "geometry": {
      "type": "Point",
      "coordinates": [
        -2.63604316329,
        51.4774256958
      ]
    },
    "record_timestamp": "2019-11-28T13:31:12.664Z"
  },
  {
    "datasetid": "pupils-classed-as-disadvantaged-in-bristol",
    "recordid": "86d462ce1fe2062c4486facc7e82959943df8824",
    "fields": {
      "ward_code": "E05010885",
      "ward_name": "Ashley",
      "disadvantaged_of_all_pupils": 32.4989393297,
      "year": "2016",
      "total_number_of_pupils_classed_as_disadvantaged": 766
    },
    "geometry": {
      "type": "Point",
      "coordinates": [
        -2.58267316047,
        51.4683098847
      ]
    },
    "record_timestamp": "2019-11-28T13:31:12.664Z"
  },
  {
    "datasetid": "pupils-classed-as-disadvantaged-in-bristol",
    "recordid": "06cd620a827ec1787f367112b91d1ba8cda6f144",
    "fields": {
      "ward_code": "E05010889",
      "ward_name": "Bishopsworth",
      "disadvantaged_of_all_pupils": 23.4441087613,
      "year": "2016",
      "total_number_of_pupils_classed_as_disadvantaged": 388
    },
    "geometry": {
      "type": "Point",
      "coordinates": [
        -2.61645553985,
        51.4217884041
      ]
    },
    "record_timestamp": "2019-11-28T13:31:12.664Z"
  },
  {
    "datasetid": "pupils-classed-as-disadvantaged-in-bristol",
    "recordid": "68bb8b367f59c179e1f58480e5b85101ef57ad4a",
    "fields": {
      "ward_code": "E05010894",
      "ward_name": "Clifton Down",
      "disadvantaged_of_all_pupils": 10.4278074866,
      "year": "2016",
      "total_number_of_pupils_classed_as_disadvantaged": 39
    },
    "geometry": {
      "type": "Point",
      "coordinates": [
        -2.61265665527,
        51.4649698075
      ]
    },
    "record_timestamp": "2019-11-28T13:31:12.664Z"
  },
  {
    "datasetid": "pupils-classed-as-disadvantaged-in-bristol",
    "recordid": "7ab6dc60719c7a1a7534f06e3583fe3657b1de49",
    "fields": {
      "ward_code": "E05010896",
      "ward_name": "Easton",
      "disadvantaged_of_all_pupils": 33.6368505624,
      "year": "2016",
      "total_number_of_pupils_classed_as_disadvantaged": 628
    },
    "geometry": {
      "type": "Point",
      "coordinates": [
        -2.55850571231,
        51.4623719964
      ]
    },
    "record_timestamp": "2019-11-28T13:31:12.664Z"
  },
  {
    "datasetid": "pupils-classed-as-disadvantaged-in-bristol",
    "recordid": "dcb5a8dc7d72739275a4c61c9060b049efaa499c",
    "fields": {
      "ward_code": "E05010900",
      "ward_name": "Hartcliffe & Withywood",
      "disadvantaged_of_all_pupils": 52.8899445764,
      "year": "2016",
      "total_number_of_pupils_classed_as_disadvantaged": 2004
    },
    "geometry": {
      "type": "Point",
      "coordinates": [
        -2.6122179734,
        51.4077037025
      ]
    },
    "record_timestamp": "2019-11-28T13:31:12.664Z"
  },
  {
    "datasetid": "pupils-classed-as-disadvantaged-in-bristol",
    "recordid": "519b8acb678856e827febc0bc578e3eb54eb2c87",
    "fields": {
      "ward_code": "E05010906",
      "ward_name": "Knowle",
      "disadvantaged_of_all_pupils": 28.7101248266,
      "year": "2016",
      "total_number_of_pupils_classed_as_disadvantaged": 621
    },
    "geometry": {
      "type": "Point",
      "coordinates": [
        -2.57233440569,
        51.4327773874
      ]
    },
    "record_timestamp": "2019-11-28T13:31:12.664Z"
  },
  {
    "datasetid": "pupils-classed-as-disadvantaged-in-bristol",
    "recordid": "30eeef84d896384363a1079cc08463927d5120f5",
    "fields": {
      "ward_code": "E05010909",
      "ward_name": "Redland",
      "disadvantaged_of_all_pupils": 3.21951219512,
      "year": "2016",
      "total_number_of_pupils_classed_as_disadvantaged": 66
    },
    "geometry": {
      "type": "Point",
      "coordinates": [
        -2.60115761678,
        51.4752449941
      ]
    },
    "record_timestamp": "2019-11-28T13:31:12.664Z"
  },
  {
    "datasetid": "pupils-classed-as-disadvantaged-in-bristol",
    "recordid": "7f976068393f48313e70c805b66df2d4ccd2dfcb",
    "fields": {
      "ward_code": "E05010914",
      "ward_name": "Southville",
      "disadvantaged_of_all_pupils": 11.5485564304,
      "year": "2016",
      "total_number_of_pupils_classed_as_disadvantaged": 132
    },
    "geometry": {
      "type": "Point",
      "coordinates": [
        -2.60399054226,
        51.4433220308
      ]
    },
    "record_timestamp": "2019-11-28T13:31:12.664Z"
  },
  {
    "datasetid": "pupils-classed-as-disadvantaged-in-bristol",
    "recordid": "0127ef232c6d8d381d0a6a85edeb1afa2367edf7",
    "fields": {
      "ward_code": "E05010889",
      "ward_name": "Bishopsworth",
      "total_number_of_pupils": 1674,
      "disadvantaged_of_all_pupils": 22.2819593787,
      "year": "2017",
      "total_number_of_pupils_classed_as_disadvantaged": 373
    },
    "geometry": {
      "type": "Point",
      "coordinates": [
        -2.61645553985,
        51.4217884041
      ]
    },
    "record_timestamp": "2019-11-28T13:31:12.664Z"
  },
  {
    "datasetid": "pupils-classed-as-disadvantaged-in-bristol",
    "recordid": "50f00712abe666d0f67de5e96abed10243091bbc",
    "fields": {
      "ward_code": "E05010904",
      "ward_name": "Horfield",
      "total_number_of_pupils": 1450,
      "disadvantaged_of_all_pupils": 28.1379310345,
      "year": "2017",
      "total_number_of_pupils_classed_as_disadvantaged": 408
    },
    "geometry": {
      "type": "Point",
      "coordinates": [
        -2.586379126,
        51.4950842804
      ]
    },
    "record_timestamp": "2019-11-28T13:31:12.664Z"
  },
  {
    "datasetid": "pupils-classed-as-disadvantaged-in-bristol",
    "recordid": "91b01c8bcba252e02b4c6467f13f76d19ff9283f",
    "fields": {
      "ward_code": "E05010905",
      "ward_name": "Hotwells & Harbourside",
      "total_number_of_pupils": 211,
      "disadvantaged_of_all_pupils": 25.1184834123,
      "year": "2017",
      "total_number_of_pupils_classed_as_disadvantaged": 53
    },
    "geometry": {
      "type": "Point",
      "coordinates": [
        -2.60957858467,
        51.4497285026
      ]
    },
    "record_timestamp": "2019-11-28T13:31:12.664Z"
  },
  {
    "datasetid": "pupils-classed-as-disadvantaged-in-bristol",
    "recordid": "9b651646c8fc4244466136752fad57d2ec270873",
    "fields": {
      "ward_code": "E05010912",
      "ward_name": "St George West",
      "total_number_of_pupils": 692,
      "disadvantaged_of_all_pupils": 30.3468208092,
      "year": "2017",
      "total_number_of_pupils_classed_as_disadvantaged": 210
    },
    "geometry": {
      "type": "Point",
      "coordinates": [
        -2.54693954016,
        51.4601173974
      ]
    },
    "record_timestamp": "2019-11-28T13:31:12.664Z"
  },
  {
    "datasetid": "pupils-classed-as-disadvantaged-in-bristol",
    "recordid": "aaa2c9c536c5407d2b01a34e0f8d8b9ceabb8e33",
    "fields": {
      "ward_code": "E05010886",
      "ward_name": "Avonmouth & Lawrence Weston",
      "total_number_of_pupils": 3531,
      "disadvantaged_of_all_pupils": 32.0305862362,
      "year": "2018",
      "total_number_of_pupils_classed_as_disadvantaged": 1131
    },
    "geometry": {
      "type": "Point",
      "coordinates": [
        -2.67640359358,
        51.5073341696
      ]
    },
    "record_timestamp": "2019-11-28T13:31:12.664Z"
  },
  {
    "datasetid": "pupils-classed-as-disadvantaged-in-bristol",
    "recordid": "c6998faa6749a68a7ecef74d0d601e26144fdf7b",
    "fields": {
      "ward_code": "E05010894",
      "ward_name": "Clifton Down",
      "total_number_of_pupils": 382,
      "disadvantaged_of_all_pupils": 8.37696335079,
      "year": "2018",
      "total_number_of_pupils_classed_as_disadvantaged": 32
    },
    "geometry": {
      "type": "Point",
      "coordinates": [
        -2.61265665527,
        51.4649698075
      ]
    },
    "record_timestamp": "2019-11-28T13:31:12.664Z"
  },
  {
    "datasetid": "pupils-classed-as-disadvantaged-in-bristol",
    "recordid": "279bdffaf850f0afd5d7d83956d640378c391b3b",
    "fields": {
      "ward_code": "E05010899",
      "ward_name": "Frome Vale",
      "total_number_of_pupils": 1262,
      "disadvantaged_of_all_pupils": 30.2694136292,
      "year": "2018",
      "total_number_of_pupils_classed_as_disadvantaged": 382
    },
    "geometry": {
      "type": "Point",
      "coordinates": [
        -2.53119915299,
        51.4870905493
      ]
    },
    "record_timestamp": "2019-11-28T13:31:12.664Z"
  },
  {
    "datasetid": "pupils-classed-as-disadvantaged-in-bristol",
    "recordid": "cff3dd226563e2e8b886223adbc54aad5072df3a",
    "fields": {
      "ward_code": "E05010913",
      "ward_name": "Southmead",
      "total_number_of_pupils": 2253,
      "disadvantaged_of_all_pupils": 35.2418996893,
      "year": "2018",
      "total_number_of_pupils_classed_as_disadvantaged": 794
    },
    "geometry": {
      "type": "Point",
      "coordinates": [
        -2.60111790007,
        51.5030620845
      ]
    },
    "record_timestamp": "2019-11-28T13:31:12.664Z"
  },
  {
    "datasetid": "pupils-classed-as-disadvantaged-in-bristol",
    "recordid": "c5e1c6f119e0cb226084f5ce110a8a4caf67cd32",
    "fields": {
      "ward_code": "E05010914",
      "ward_name": "Southville",
      "total_number_of_pupils": 1223,
      "disadvantaged_of_all_pupils": 11.6925592805,
      "year": "2018",
      "total_number_of_pupils_classed_as_disadvantaged": 143
    },
    "geometry": {
      "type": "Point",
      "coordinates": [
        -2.60399054226,
        51.4433220308
      ]
    },
    "record_timestamp": "2019-11-28T13:31:12.664Z"
  },
  {
    "datasetid": "pupils-classed-as-disadvantaged-in-bristol",
    "recordid": "b0489c871e9da21ddfdade22a562772982f43d75",
    "fields": {
      "ward_code": "E05010886",
      "ward_name": "Avonmouth & Lawrence Weston",
      "total_number_of_pupils": 3636,
      "disadvantaged_of_all_pupils": 31.7,
      "year": "2019",
      "total_number_of_pupils_classed_as_disadvantaged": 1152
    },
    "geometry": {
      "type": "Point",
      "coordinates": [
        -2.67640359358,
        51.5073341696
      ]
    },
    "record_timestamp": "2019-11-28T13:31:12.664Z"
  },
  {
    "datasetid": "pupils-classed-as-disadvantaged-in-bristol",
    "recordid": "e8f3616d3a1365e988171b45dc74c19641b8b346",
    "fields": {
      "ward_code": "E05010888",
      "ward_name": "Bishopston & Ashley Down",
      "total_number_of_pupils": 1649,
      "disadvantaged_of_all_pupils": 7.6,
      "year": "2019",
      "total_number_of_pupils_classed_as_disadvantaged": 125
    },
    "geometry": {
      "type": "Point",
      "coordinates": [
        -2.58646340656,
        51.4814532715
      ]
    },
    "record_timestamp": "2019-11-28T13:31:12.664Z"
  },
  {
    "datasetid": "pupils-classed-as-disadvantaged-in-bristol",
    "recordid": "6857e4c62326a9dace15cad53a4faaec19eb3d32",
    "fields": {
      "ward_code": "E05010895",
      "ward_name": "Cotham",
      "total_number_of_pupils": 618,
      "disadvantaged_of_all_pupils": 6.8,
      "year": "2019",
      "total_number_of_pupils_classed_as_disadvantaged": 42
    },
    "geometry": {
      "type": "Point",
      "coordinates": [
        -2.59991083361,
        51.4659633898
      ]
    },
    "record_timestamp": "2019-11-28T13:31:12.664Z"
  },
  {
    "datasetid": "pupils-classed-as-disadvantaged-in-bristol",
    "recordid": "9afdb24fbf926de738c1c5f6a64b4d23c74e05f7",
    "fields": {
      "ward_code": "E05010912",
      "ward_name": "St George West",
      "total_number_of_pupils": 706,
      "disadvantaged_of_all_pupils": 28.5,
      "year": "2019",
      "total_number_of_pupils_classed_as_disadvantaged": 201
    },
    "geometry": {
      "type": "Point",
      "coordinates": [
        -2.54693954016,
        51.4601173974
      ]
    },
    "record_timestamp": "2019-11-28T13:31:12.664Z"
  },
  {
    "datasetid": "pupils-classed-as-disadvantaged-in-bristol",
    "recordid": "c80baf52f517d1817429e944272b7cdcf623528d",
    "fields": {
      "ward_code": "E05010903",
      "ward_name": "Hillfields",
      "disadvantaged_of_all_pupils": 34.9841269841,
      "year": "2016",
      "total_number_of_pupils_classed_as_disadvantaged": 551
    },
    "geometry": {
      "type": "Point",
      "coordinates": [
        -2.5225753211,
        51.4737018096
      ]
    },
    "record_timestamp": "2019-11-28T13:31:12.664Z"
  },
  {
    "datasetid": "pupils-classed-as-disadvantaged-in-bristol",
    "recordid": "d537edbec3d2af2a3ed14a87048afdcb067779e3",
    "fields": {
      "ward_code": "E05010913",
      "ward_name": "Southmead",
      "disadvantaged_of_all_pupils": 38.7635379061,
      "year": "2016",
      "total_number_of_pupils_classed_as_disadvantaged": 859
    },
    "geometry": {
      "type": "Point",
      "coordinates": [
        -2.60111790007,
        51.5030620845
      ]
    },
    "record_timestamp": "2019-11-28T13:31:12.664Z"
  },
  {
    "datasetid": "pupils-classed-as-disadvantaged-in-bristol",
    "recordid": "1001b1d955649e932d51a7f21f00fcd0ac358123",
    "fields": {
      "ward_code": "E05010885",
      "ward_name": "Ashley",
      "total_number_of_pupils": 2408,
      "disadvantaged_of_all_pupils": 31.8521594684,
      "year": "2017",
      "total_number_of_pupils_classed_as_disadvantaged": 767
    },
    "geometry": {
      "type": "Point",
      "coordinates": [
        -2.58267316047,
        51.4683098847
      ]
    },
    "record_timestamp": "2019-11-28T13:31:12.664Z"
  },
  {
    "datasetid": "pupils-classed-as-disadvantaged-in-bristol",
    "recordid": "1794ee3994f49ff02601a5dcc4a8f2eab2ac985f",
    "fields": {
      "ward_code": "E05010890",
      "ward_name": "Brislington East",
      "total_number_of_pupils": 1513,
      "disadvantaged_of_all_pupils": 26.1731658956,
      "year": "2017",
      "total_number_of_pupils_classed_as_disadvantaged": 396
    },
    "geometry": {
      "type": "Point",
      "coordinates": [
        -2.53865369047,
        51.4402835576
      ]
    },
    "record_timestamp": "2019-11-28T13:31:12.664Z"
  },
  {
    "datasetid": "pupils-classed-as-disadvantaged-in-bristol",
    "recordid": "0977547195ee32f5f0882eae98c7c7d0d1ca5ae8",
    "fields": {
      "ward_code": "E05010891",
      "ward_name": "Brislington West",
      "total_number_of_pupils": 1311,
      "disadvantaged_of_all_pupils": 20.823798627,
      "year": "2017",
      "total_number_of_pupils_classed_as_disadvantaged": 273
    },
    "geometry": {
      "type": "Point",
      "coordinates": [
        -2.54906988637,
        51.4343938593
      ]
    },
    "record_timestamp": "2019-11-28T13:31:12.664Z"
  },
  {
    "datasetid": "pupils-classed-as-disadvantaged-in-bristol",
    "recordid": "f7b15e2ad03a59e2238336acf95457f18467f191",
    "fields": {
      "ward_code": "E05010894",
      "ward_name": "Clifton Down",
      "total_number_of_pupils": 366,
      "disadvantaged_of_all_pupils": 7.65027322404,
      "year": "2017",
      "total_number_of_pupils_classed_as_disadvantaged": 28
    },
    "geometry": {
      "type": "Point",
      "coordinates": [
        -2.61265665527,
        51.4649698075
      ]
    },
    "record_timestamp": "2019-11-28T13:31:12.664Z"
  },
  {
    "datasetid": "pupils-classed-as-disadvantaged-in-bristol",
    "recordid": "eaacfab7eae190ac622d148d3e8f7da4acc2919c",
    "fields": {
      "ward_code": "E05010901",
      "ward_name": "Henbury & Brentry",
      "total_number_of_pupils": 1769,
      "disadvantaged_of_all_pupils": 35.4437535331,
      "year": "2017",
      "total_number_of_pupils_classed_as_disadvantaged": 627
    },
    "geometry": {
      "type": "Point",
      "coordinates": [
        -2.62103514848,
        51.5089736142
      ]
    },
    "record_timestamp": "2019-11-28T13:31:12.664Z"
  },
  {
    "datasetid": "pupils-classed-as-disadvantaged-in-bristol",
    "recordid": "c0b3f7675d620e847ac69dbf00b706b2db886886",
    "fields": {
      "ward_code": "E05010917",
      "ward_name": "Westbury-on-Trym & Henleaze",
      "total_number_of_pupils": 2612,
      "disadvantaged_of_all_pupils": 5.09188361409,
      "year": "2017",
      "total_number_of_pupils_classed_as_disadvantaged": 133
    },
    "geometry": {
      "type": "Point",
      "coordinates": [
        -2.61748273112,
        51.4897948304
      ]
    },
    "record_timestamp": "2019-11-28T13:31:12.664Z"
  },
  {
    "datasetid": "pupils-classed-as-disadvantaged-in-bristol",
    "recordid": "cc1f678c5451706f0cf8bf246d0f6f2d0badce0e",
    "fields": {
      "ward_code": "E05010892",
      "ward_name": "Central",
      "total_number_of_pupils": 695,
      "disadvantaged_of_all_pupils": 40.2877697842,
      "year": "2018",
      "total_number_of_pupils_classed_as_disadvantaged": 280
    },
    "geometry": {
      "type": "Point",
      "coordinates": [
        -2.59433619751,
        51.4544148955
      ]
    },
    "record_timestamp": "2019-11-28T13:31:12.664Z"
  },
  {
    "datasetid": "pupils-classed-as-disadvantaged-in-bristol",
    "recordid": "c2f81667b64a5148a6dd1082610f878d1805a097",
    "fields": {
      "ward_code": "E05010895",
      "ward_name": "Cotham",
      "total_number_of_pupils": 600,
      "disadvantaged_of_all_pupils": 6.83333333333,
      "year": "2018",
      "total_number_of_pupils_classed_as_disadvantaged": 41
    },
    "geometry": {
      "type": "Point",
      "coordinates": [
        -2.59991083361,
        51.4659633898
      ]
    },
    "record_timestamp": "2019-11-28T13:31:12.664Z"
  },
  {
    "datasetid": "pupils-classed-as-disadvantaged-in-bristol",
    "recordid": "605aef814e4167b1f202772a5c63091012d1d465",
    "fields": {
      "ward_code": "E05010906",
      "ward_name": "Knowle",
      "total_number_of_pupils": 2221,
      "disadvantaged_of_all_pupils": 26.9248086448,
      "year": "2018",
      "total_number_of_pupils_classed_as_disadvantaged": 598
    },
    "geometry": {
      "type": "Point",
      "coordinates": [
        -2.57233440569,
        51.4327773874
      ]
    },
    "record_timestamp": "2019-11-28T13:31:12.664Z"
  },
  {
    "datasetid": "pupils-classed-as-disadvantaged-in-bristol",
    "recordid": "b5c752820c31bb4b90a26ddef9de0514f498bdad",
    "fields": {
      "ward_code": "E05010907",
      "ward_name": "Lawrence Hill",
      "total_number_of_pupils": 3477,
      "disadvantaged_of_all_pupils": 46.1317227495,
      "year": "2018",
      "total_number_of_pupils_classed_as_disadvantaged": 1604
    },
    "geometry": {
      "type": "Point",
      "coordinates": [
        -2.57123424149,
        51.4545929175
      ]
    },
    "record_timestamp": "2019-11-28T13:31:12.664Z"
  },
  {
    "datasetid": "pupils-classed-as-disadvantaged-in-bristol",
    "recordid": "9aafb5ba9c9c16f7a50340faec21c739abf92830",
    "fields": {
      "ward_code": "E05010915",
      "ward_name": "Stockwood",
      "total_number_of_pupils": 1450,
      "disadvantaged_of_all_pupils": 23.5172413793,
      "year": "2018",
      "total_number_of_pupils_classed_as_disadvantaged": 341
    },
    "geometry": {
      "type": "Point",
      "coordinates": [
        -2.54973459028,
        51.418418512
      ]
    },
    "record_timestamp": "2019-11-28T13:31:12.664Z"
  },
  {
    "datasetid": "pupils-classed-as-disadvantaged-in-bristol",
    "recordid": "3d833879b73145b9b2a499469315fec74e186477",
    "fields": {
      "ward_code": "E05010916",
      "ward_name": "Stoke Bishop",
      "total_number_of_pupils": 1185,
      "disadvantaged_of_all_pupils": 22.5316455696,
      "year": "2018",
      "total_number_of_pupils_classed_as_disadvantaged": 267
    },
    "geometry": {
      "type": "Point",
      "coordinates": [
        -2.63604316329,
        51.4774256958
      ]
    },
    "record_timestamp": "2019-11-28T13:31:12.664Z"
  },
  {
    "datasetid": "pupils-classed-as-disadvantaged-in-bristol",
    "recordid": "3053e11979a105b7b3fcb4a6162d55bfc27c290d",
    "fields": {
      "ward_code": "E05010894",
      "ward_name": "Clifton Down",
      "total_number_of_pupils": 387,
      "disadvantaged_of_all_pupils": 10.1,
      "year": "2019",
      "total_number_of_pupils_classed_as_disadvantaged": 39
    },
    "geometry": {
      "type": "Point",
      "coordinates": [
        -2.61265665527,
        51.4649698075
      ]
    },
    "record_timestamp": "2019-11-28T13:31:12.664Z"
  },
  {
    "datasetid": "pupils-classed-as-disadvantaged-in-bristol",
    "recordid": "10ad87d38ef99f2e535862b7b3bb83e10ad559db",
    "fields": {
      "ward_code": "E05010887",
      "ward_name": "Bedminster",
      "disadvantaged_of_all_pupils": 17.387755102,
      "year": "2016",
      "total_number_of_pupils_classed_as_disadvantaged": 213
    },
    "geometry": {
      "type": "Point",
      "coordinates": [
        -2.62187227821,
        51.4371603671
      ]
    },
    "record_timestamp": "2019-11-28T13:31:12.664Z"
  },
  {
    "datasetid": "pupils-classed-as-disadvantaged-in-bristol",
    "recordid": "dcbcd39242d6ed0277b848d1565da8b883bed4b6",
    "fields": {
      "ward_code": "E05010891",
      "ward_name": "Brislington West",
      "disadvantaged_of_all_pupils": 21.4071856287,
      "year": "2016",
      "total_number_of_pupils_classed_as_disadvantaged": 286
    },
    "geometry": {
      "type": "Point",
      "coordinates": [
        -2.54906988637,
        51.4343938593
      ]
    },
    "record_timestamp": "2019-11-28T13:31:12.664Z"
  },
  {
    "datasetid": "pupils-classed-as-disadvantaged-in-bristol",
    "recordid": "8b5ddc9fecfe79eb6f9b94ac17118055a2ab3ebd",
    "fields": {
      "ward_code": "E05010892",
      "ward_name": "Central",
      "disadvantaged_of_all_pupils": 42.0722135008,
      "year": "2016",
      "total_number_of_pupils_classed_as_disadvantaged": 268
    },
    "geometry": {
      "type": "Point",
      "coordinates": [
        -2.59433619751,
        51.4544148955
      ]
    },
    "record_timestamp": "2019-11-28T13:31:12.664Z"
  },
  {
    "datasetid": "pupils-classed-as-disadvantaged-in-bristol",
    "recordid": "a8f70b89f1fe5f6e51f8b9962166a9d432529776",
    "fields": {
      "ward_code": "E05010897",
      "ward_name": "Eastville",
      "disadvantaged_of_all_pupils": 27.4760383387,
      "year": "2016",
      "total_number_of_pupils_classed_as_disadvantaged": 516
    },
    "geometry": {
      "type": "Point",
      "coordinates": [
        -2.54692680567,
        51.4747101824
      ]
    },
    "record_timestamp": "2019-11-28T13:31:12.664Z"
  },
  {
    "datasetid": "pupils-classed-as-disadvantaged-in-bristol",
    "recordid": "9e70d459487cf8804128a0640e858460851130c2",
    "fields": {
      "ward_code": "E05010905",
      "ward_name": "Hotwells & Harbourside",
      "disadvantaged_of_all_pupils": 23.8095238095,
      "year": "2016",
      "total_number_of_pupils_classed_as_disadvantaged": 45
    },
    "geometry": {
      "type": "Point",
      "coordinates": [
        -2.60957858467,
        51.4497285026
      ]
    },
    "record_timestamp": "2019-11-28T13:31:12.664Z"
  },
  {
    "datasetid": "pupils-classed-as-disadvantaged-in-bristol",
    "recordid": "149a15bb41bd7524d5880826f488192ad55896a9",
    "fields": {
      "ward_code": "E05010908",
      "ward_name": "Lockleaze",
      "disadvantaged_of_all_pupils": 35.9,
      "year": "2016",
      "total_number_of_pupils_classed_as_disadvantaged": 718
    },
    "geometry": {
      "type": "Point",
      "coordinates": [
        -2.56566726138,
        51.4858562509
      ]
    },
    "record_timestamp": "2019-11-28T13:31:12.664Z"
  },
  {
    "datasetid": "pupils-classed-as-disadvantaged-in-bristol",
    "recordid": "5010a38a03f31a0826973d9901db31ff77079255",
    "fields": {
      "ward_code": "E05010912",
      "ward_name": "St George West",
      "disadvantaged_of_all_pupils": 29.6943231441,
      "year": "2016",
      "total_number_of_pupils_classed_as_disadvantaged": 204
    },
    "geometry": {
      "type": "Point",
      "coordinates": [
        -2.54693954016,
        51.4601173974
      ]
    },
    "record_timestamp": "2019-11-28T13:31:12.664Z"
  },
  {
    "datasetid": "pupils-classed-as-disadvantaged-in-bristol",
    "recordid": "bd9ffff6dac66de7d4605acef58df15eafaa31a5",
    "fields": {
      "ward_code": "E05010916",
      "ward_name": "Stoke Bishop",
      "disadvantaged_of_all_pupils": 22.7592267135,
      "year": "2016",
      "total_number_of_pupils_classed_as_disadvantaged": 259
    },
    "geometry": {
      "type": "Point",
      "coordinates": [
        -2.63604316329,
        51.4774256958
      ]
    },
    "record_timestamp": "2019-11-28T13:31:12.664Z"
  },
  {
    "datasetid": "pupils-classed-as-disadvantaged-in-bristol",
    "recordid": "38335224870dc5d302cd6b89b2b222b4704574df",
    "fields": {
      "ward_code": "E05010895",
      "ward_name": "Cotham",
      "total_number_of_pupils": 595,
      "disadvantaged_of_all_pupils": 7.73109243697,
      "year": "2017",
      "total_number_of_pupils_classed_as_disadvantaged": 46
    },
    "geometry": {
      "type": "Point",
      "coordinates": [
        -2.59991083361,
        51.4659633898
      ]
    },
    "record_timestamp": "2019-11-28T13:31:12.664Z"
  },
  {
    "datasetid": "pupils-classed-as-disadvantaged-in-bristol",
    "recordid": "8cc2f6d001964588c100139c53b72646d6d29041",
    "fields": {
      "ward_code": "E05010899",
      "ward_name": "Frome Vale",
      "total_number_of_pupils": 1221,
      "disadvantaged_of_all_pupils": 31.8591318591,
      "year": "2017",
      "total_number_of_pupils_classed_as_disadvantaged": 389
    },
    "geometry": {
      "type": "Point",
      "coordinates": [
        -2.53119915299,
        51.4870905493
      ]
    },
    "record_timestamp": "2019-11-28T13:31:12.664Z"
  },
  {
    "datasetid": "pupils-classed-as-disadvantaged-in-bristol",
    "recordid": "de4ab447d620b9c3d74749a9d3d396b5c7428494",
    "fields": {
      "ward_code": "E05010908",
      "ward_name": "Lockleaze",
      "total_number_of_pupils": 2059,
      "disadvantaged_of_all_pupils": 36.0854783876,
      "year": "2017",
      "total_number_of_pupils_classed_as_disadvantaged": 743
    },
    "geometry": {
      "type": "Point",
      "coordinates": [
        -2.56566726138,
        51.4858562509
      ]
    },
    "record_timestamp": "2019-11-28T13:31:12.664Z"
  },
  {
    "datasetid": "pupils-classed-as-disadvantaged-in-bristol",
    "recordid": "31d1e03e0b7e984de84d1771eaba44161d8e2d91",
    "fields": {
      "ward_code": "E05010916",
      "ward_name": "Stoke Bishop",
      "total_number_of_pupils": 1161,
      "disadvantaged_of_all_pupils": 22.3944875108,
      "year": "2017",
      "total_number_of_pupils_classed_as_disadvantaged": 260
    },
    "geometry": {
      "type": "Point",
      "coordinates": [
        -2.63604316329,
        51.4774256958
      ]
    },
    "record_timestamp": "2019-11-28T13:31:12.664Z"
  },
  {
    "datasetid": "pupils-classed-as-disadvantaged-in-bristol",
    "recordid": "7a33f4294f7a6bae3609b66a0c6070b242e2d0cc",
    "fields": {
      "ward_code": "E05010918",
      "ward_name": "Windmill Hill",
      "total_number_of_pupils": 1530,
      "disadvantaged_of_all_pupils": 22.8758169935,
      "year": "2017",
      "total_number_of_pupils_classed_as_disadvantaged": 350
    },
    "geometry": {
      "type": "Point",
      "coordinates": [
        -2.58594427096,
        51.4390971799
      ]
    },
    "record_timestamp": "2019-11-28T13:31:12.664Z"
  },
  {
    "datasetid": "pupils-classed-as-disadvantaged-in-bristol",
    "recordid": "210a96c073788fb604c2c6693c27b0446fd4ee2b",
    "fields": {
      "total_number_of_pupils_classed_as_disadvantaged": 16691,
      "total_number_of_pupils": 57023,
      "ward_name": "Bristol",
      "disadvantaged_of_all_pupils": 29.3,
      "year": "2017"
    },
    "record_timestamp": "2019-11-28T13:31:12.664Z"
  },
  {
    "datasetid": "pupils-classed-as-disadvantaged-in-bristol",
    "recordid": "15f393c530606562557dff6b2453d61a93a8841a",
    "fields": {
      "ward_code": "E05010885",
      "ward_name": "Ashley",
      "total_number_of_pupils": 2457,
      "disadvantaged_of_all_pupils": 30.4843304843,
      "year": "2018",
      "total_number_of_pupils_classed_as_disadvantaged": 749
    },
    "geometry": {
      "type": "Point",
      "coordinates": [
        -2.58267316047,
        51.4683098847
      ]
    },
    "record_timestamp": "2019-11-28T13:31:12.664Z"
  },
  {
    "datasetid": "pupils-classed-as-disadvantaged-in-bristol",
    "recordid": "46cc772a33496388179f497d775780602a11777e",
    "fields": {
      "ward_code": "E05010890",
      "ward_name": "Brislington East",
      "total_number_of_pupils": 1467,
      "disadvantaged_of_all_pupils": 24.7443762781,
      "year": "2018",
      "total_number_of_pupils_classed_as_disadvantaged": 363
    },
    "geometry": {
      "type": "Point",
      "coordinates": [
        -2.53865369047,
        51.4402835576
      ]
    },
    "record_timestamp": "2019-11-28T13:31:12.664Z"
  },
  {
    "datasetid": "pupils-classed-as-disadvantaged-in-bristol",
    "recordid": "8236f3d0333d53fe46c2570a5f6697e749f97ee9",
    "fields": {
      "ward_code": "E05010901",
      "ward_name": "Henbury & Brentry",
      "total_number_of_pupils": 1900,
      "disadvantaged_of_all_pupils": 34.3157894737,
      "year": "2018",
      "total_number_of_pupils_classed_as_disadvantaged": 652
    },
    "geometry": {
      "type": "Point",
      "coordinates": [
        -2.62103514848,
        51.5089736142
      ]
    },
    "record_timestamp": "2019-11-28T13:31:12.664Z"
  },
  {
    "datasetid": "pupils-classed-as-disadvantaged-in-bristol",
    "recordid": "d67395deb75be48f923072956e6012b4287f19e3",
    "fields": {
      "ward_code": "E05010903",
      "ward_name": "Hillfields",
      "total_number_of_pupils": 1624,
      "disadvantaged_of_all_pupils": 30.7881773399,
      "year": "2018",
      "total_number_of_pupils_classed_as_disadvantaged": 500
    },
    "geometry": {
      "type": "Point",
      "coordinates": [
        -2.5225753211,
        51.4737018096
      ]
    },
    "record_timestamp": "2019-11-28T13:31:12.664Z"
  },
  {
    "datasetid": "pupils-classed-as-disadvantaged-in-bristol",
    "recordid": "231fc69bfafe0bceca06342ce22cdb7c93fe953f",
    "fields": {
      "ward_code": "E05010905",
      "ward_name": "Hotwells & Harbourside",
      "total_number_of_pupils": 210,
      "disadvantaged_of_all_pupils": 25.7142857143,
      "year": "2018",
      "total_number_of_pupils_classed_as_disadvantaged": 54
    },
    "geometry": {
      "type": "Point",
      "coordinates": [
        -2.60957858467,
        51.4497285026
      ]
    },
    "record_timestamp": "2019-11-28T13:31:12.664Z"
  },
  {
    "datasetid": "pupils-classed-as-disadvantaged-in-bristol",
    "recordid": "f19fe9a845c3d1d168f933ab03864c4a95c78457",
    "fields": {
      "ward_code": "E05010909",
      "ward_name": "Redland",
      "total_number_of_pupils": 2062,
      "disadvantaged_of_all_pupils": 2.27934044617,
      "year": "2018",
      "total_number_of_pupils_classed_as_disadvantaged": 47
    },
    "geometry": {
      "type": "Point",
      "coordinates": [
        -2.60115761678,
        51.4752449941
      ]
    },
    "record_timestamp": "2019-11-28T13:31:12.664Z"
  },
  {
    "datasetid": "pupils-classed-as-disadvantaged-in-bristol",
    "recordid": "5af535f897b14d19e4f46e55b9c4af903850db5c",
    "fields": {
      "ward_code": "E05010891",
      "ward_name": "Brislington West",
      "total_number_of_pupils": 1342,
      "disadvantaged_of_all_pupils": 20.4,
      "year": "2019",
      "total_number_of_pupils_classed_as_disadvantaged": 274
    },
    "geometry": {
      "type": "Point",
      "coordinates": [
        -2.54906988637,
        51.4343938593
      ]
    },
    "record_timestamp": "2019-11-28T13:31:12.664Z"
  },
  {
    "datasetid": "pupils-classed-as-disadvantaged-in-bristol",
    "recordid": "587493ef99e212c6ff9a287f37f21d854c69017e",
    "fields": {
      "ward_code": "E05010902",
      "ward_name": "Hengrove & Whitchurch Park",
      "total_number_of_pupils": 2454,
      "disadvantaged_of_all_pupils": 27.1,
      "year": "2019",
      "total_number_of_pupils_classed_as_disadvantaged": 665
    },
    "geometry": {
      "type": "Point",
      "coordinates": [
        -2.57721341501,
        51.4115422794
      ]
    },
    "record_timestamp": "2019-11-28T13:31:12.664Z"
  },
  {
    "datasetid": "pupils-classed-as-disadvantaged-in-bristol",
    "recordid": "90b6216b620936d273314dccccaaf1cb995cf9d1",
    "fields": {
      "ward_code": "E05010903",
      "ward_name": "Hillfields",
      "total_number_of_pupils": 1693,
      "disadvantaged_of_all_pupils": 31.4,
      "year": "2019",
      "total_number_of_pupils_classed_as_disadvantaged": 531
    },
    "geometry": {
      "type": "Point",
      "coordinates": [
        -2.5225753211,
        51.4737018096
      ]
    },
    "record_timestamp": "2019-11-28T13:31:12.664Z"
  },
  {
    "datasetid": "pupils-classed-as-disadvantaged-in-bristol",
    "recordid": "92070e7d30dcb05f2b5985e2d59b2944be70f172",
    "fields": {
      "ward_code": "E05010906",
      "ward_name": "Knowle",
      "total_number_of_pupils": 2282,
      "disadvantaged_of_all_pupils": 26.6,
      "year": "2019",
      "total_number_of_pupils_classed_as_disadvantaged": 608
    },
    "geometry": {
      "type": "Point",
      "coordinates": [
        -2.57233440569,
        51.4327773874
      ]
    },
    "record_timestamp": "2019-11-28T13:31:12.664Z"
  },
  {
    "datasetid": "pupils-classed-as-disadvantaged-in-bristol",
    "recordid": "9696af5bcc4edb997f2824574725ed4a169b2c9a",
    "fields": {
      "ward_code": "E05010913",
      "ward_name": "Southmead",
      "total_number_of_pupils": 2309,
      "disadvantaged_of_all_pupils": 33.5,
      "year": "2019",
      "total_number_of_pupils_classed_as_disadvantaged": 773
    },
    "geometry": {
      "type": "Point",
      "coordinates": [
        -2.60111790007,
        51.5030620845
      ]
    },
    "record_timestamp": "2019-11-28T13:31:12.664Z"
  },
  {
    "datasetid": "pupils-classed-as-disadvantaged-in-bristol",
    "recordid": "d4f783e5452f8526c4271a1301e81e40eb53295a",
    "fields": {
      "ward_code": "E05010917",
      "ward_name": "Westbury-on-Trym & Henleaze",
      "total_number_of_pupils": 2742,
      "disadvantaged_of_all_pupils": 4.9,
      "year": "2019",
      "total_number_of_pupils_classed_as_disadvantaged": 133
    },
    "geometry": {
      "type": "Point",
      "coordinates": [
        -2.61748273112,
        51.4897948304
      ]
    },
    "record_timestamp": "2019-11-28T13:31:12.664Z"
  }
]
