[
  {
    "x": 80,
    "r": 20,
    "label": "Bristol"
  },
  {
    "x": 200,
    "r": 40,
    "label": "Ashley"
  },
  {
    "x": 100,
    "r": 60,
    "label": "test1"
  },
  {
    "x": 400,
    "r": 100,
    "label": "test2"
  },
  {
    "x": 80,
    "r": 150,
    "label": "Bristolz"
  },
  {
    "x": 200,
    "r": 200,
    "label": "Ashleyz"
  },
  {
    "x": 100,
    "r": 225,
    "label": "test3"
  },
  {
    "x": 400,
    "r": 335,
    "label": "test4"
  },
  {
    "x": 100,
    "r": 90,
    "label": "B"
  },
  {
    "x": 400,
    "r": 7,
    "label": "R"
  },
  {
    "x": 80,
    "r": 134,
    "label": "I"
  },
  {
    "x": 200,
    "r": 21,
    "label": "S"
  },
  {
    "x": 100,
    "r": 421,
    "label": "T"
  },
  {
    "x": 400,
    "r": 278,
    "label": "O"
  },
  {
    "x": 380,
    "r": 22,
    "label": "L"
  }
]
