[
  {
    "datasetid": "pupils-with-special-educational-needs-in-bristol",
    "recordid": "9c9f9f850d1585401bff65442948a83e8679f974",
    "fields": {
      "ward_code": "E05010885",
      "pupils_with_ehcp0": 1.41196013289,
      "of_sen_pupils": 14.7840531561,
      "pupils_with_ehcp": 34,
      "of_sen_pupils_receiving_school_support": 11.9186046512,
      "pupils_with_statement_of_sen": 35,
      "geo_point_2d": [
        51.4683098847,
        -2.58267316047
      ],
      "ward_name": "Ashley",
      "sen_pupils_receiving_school_support": 287,
      "total_number_of_pupils": 2408,
      "year": "2017",
      "total_number_of_sen_pupils": 356
    },
    "record_timestamp": "2019-09-17T15:52:23.201+01:00"
  },
  {
    "datasetid": "pupils-with-special-educational-needs-in-bristol",
    "recordid": "42af380f6313ad9a1a8adfc93412d765cc688428",
    "fields": {
      "ward_code": "E05010896",
      "pupils_with_ehcp0": 0.708833151581,
      "of_sen_pupils": 16.6852678571,
      "pupils_with_ehcp": 13,
      "of_sen_pupils_receiving_school_support": 13.5223555071,
      "pupils_with_statement_of_sen": 18,
      "geo_point_2d": [
        51.4623719964,
        -2.55850571231
      ],
      "ward_name": "Easton",
      "sen_pupils_receiving_school_support": 248,
      "total_number_of_pupils": 1834,
      "year": "2017",
      "total_number_of_sen_pupils": 279
    },
    "record_timestamp": "2019-09-17T15:52:23.201+01:00"
  },
  {
    "datasetid": "pupils-with-special-educational-needs-in-bristol",
    "recordid": "6d2869e6e09e5d16b080fed6bfe42f8039a53d8a",
    "fields": {
      "ward_code": "E05010899",
      "pupils_with_ehcp0": 1.9656019656,
      "of_sen_pupils": 15.6101426307,
      "pupils_with_ehcp": 24,
      "of_sen_pupils_receiving_school_support": 12.9402129402,
      "pupils_with_statement_of_sen": 26,
      "geo_point_2d": [
        51.4870905493,
        -2.53119915299
      ],
      "ward_name": "Frome Vale",
      "sen_pupils_receiving_school_support": 158,
      "total_number_of_pupils": 1221,
      "year": "2017",
      "total_number_of_sen_pupils": 208
    },
    "record_timestamp": "2019-09-17T15:52:23.201+01:00"
  },
  {
    "datasetid": "pupils-with-special-educational-needs-in-bristol",
    "recordid": "15cf1951d96d75c65cd71219fff6d6dda870c159",
    "fields": {
      "ward_code": "E05010900",
      "pupils_with_ehcp0": 1.45075082718,
      "of_sen_pupils": 24.4756970146,
      "pupils_with_ehcp": 57,
      "of_sen_pupils_receiving_school_support": 18.0962076864,
      "pupils_with_statement_of_sen": 61,
      "geo_point_2d": [
        51.4077037025,
        -2.6122179734
      ],
      "ward_name": "Hartcliffe & Withywood",
      "sen_pupils_receiving_school_support": 711,
      "total_number_of_pupils": 3929,
      "year": "2017",
      "total_number_of_sen_pupils": 829
    },
    "record_timestamp": "2019-09-17T15:52:23.201+01:00"
  },
  {
    "datasetid": "pupils-with-special-educational-needs-in-bristol",
    "recordid": "c624a0274f395827fe1f25e9196f04e4584ae38e",
    "fields": {
      "ward_code": "E05010914",
      "pupils_with_ehcp0": 0.745033112583,
      "of_sen_pupils": 12.6737530662,
      "pupils_with_ehcp": 9,
      "of_sen_pupils_receiving_school_support": 10.2649006623,
      "pupils_with_statement_of_sen": 9,
      "geo_point_2d": [
        51.4433220308,
        -2.60399054226
      ],
      "ward_name": "Southville",
      "sen_pupils_receiving_school_support": 124,
      "total_number_of_pupils": 1208,
      "year": "2017",
      "total_number_of_sen_pupils": 142
    },
    "record_timestamp": "2019-09-17T15:52:23.201+01:00"
  },
  {
    "datasetid": "pupils-with-special-educational-needs-in-bristol",
    "recordid": "987a691b595c58f7e548f5f5090b4af9c13bb506",
    "fields": {
      "ward_code": "E05010897",
      "pupils_with_ehcp0": 1.41414141414,
      "of_sen_pupils": 13.8383838384,
      "pupils_with_ehcp": 28,
      "of_sen_pupils_receiving_school_support": 12.2222222222,
      "pupils_with_statement_of_sen": 4,
      "geo_point_2d": [
        51.4747101824,
        -2.54692680567
      ],
      "ward_name": "Eastville",
      "sen_pupils_receiving_school_support": 242,
      "total_number_of_pupils": 1980,
      "year": "2018",
      "total_number_of_sen_pupils": 274
    },
    "record_timestamp": "2019-09-17T15:52:23.201+01:00"
  },
  {
    "datasetid": "pupils-with-special-educational-needs-in-bristol",
    "recordid": "3c6b7f145e706a1d65316d19c761864d60b6f6c0",
    "fields": {
      "ward_code": "E05010900",
      "pupils_with_ehcp0": 1.87515420676,
      "of_sen_pupils": 24.4756970146,
      "pupils_with_ehcp": 76,
      "of_sen_pupils_receiving_school_support": 21.7863311128,
      "pupils_with_statement_of_sen": 33,
      "geo_point_2d": [
        51.4077037025,
        -2.6122179734
      ],
      "ward_name": "Hartcliffe & Withywood",
      "sen_pupils_receiving_school_support": 883,
      "total_number_of_pupils": 4053,
      "year": "2018",
      "total_number_of_sen_pupils": 992
    },
    "record_timestamp": "2019-09-17T15:52:23.201+01:00"
  },
  {
    "datasetid": "pupils-with-special-educational-needs-in-bristol",
    "recordid": "d4f2eb7023e0809c2ef5ec3b45280c68f0f27020",
    "fields": {
      "ward_code": "E05010885",
      "pupils_with_ehcp0": 2.421009437,
      "of_sen_pupils": 16.536725482,
      "pupils_with_ehcp": 59,
      "of_sen_pupils_receiving_school_support": 14.115716044,
      "pupils_with_statement_of_sen": 0,
      "geo_point_2d": [
        51.4683098847,
        -2.58267316047
      ],
      "ward_name": "Ashley",
      "sen_pupils_receiving_school_support": 344,
      "total_number_of_pupils": 2437,
      "year": "2019",
      "total_number_of_sen_pupils": 403
    },
    "record_timestamp": "2019-09-17T15:52:23.201+01:00"
  },
  {
    "datasetid": "pupils-with-special-educational-needs-in-bristol",
    "recordid": "5db79a34fc7078ff4ae3ce06eb6b6c0b6790e25b",
    "fields": {
      "ward_code": "E05010900",
      "pupils_with_ehcp0": 2.827701893,
      "of_sen_pupils": 23.963575365,
      "pupils_with_ehcp": 118,
      "of_sen_pupils_receiving_school_support": 21.135873472,
      "pupils_with_statement_of_sen": 0,
      "geo_point_2d": [
        51.4077037025,
        -2.6122179734
      ],
      "ward_name": "Hartcliffe & Withywood",
      "sen_pupils_receiving_school_support": 882,
      "total_number_of_pupils": 4173,
      "year": "2019",
      "total_number_of_sen_pupils": 1000
    },
    "record_timestamp": "2019-09-17T15:52:23.201+01:00"
  },
  {
    "datasetid": "pupils-with-special-educational-needs-in-bristol",
    "recordid": "294eed4b9f1e4b9d27ebb26e3b5a891f9c2e0e1c",
    "fields": {
      "ward_code": "E05010905",
      "pupils_with_ehcp0": 1.345291479,
      "of_sen_pupils": 9.417040358,
      "pupils_with_ehcp": 3,
      "of_sen_pupils_receiving_school_support": 8.071748878,
      "pupils_with_statement_of_sen": 0,
      "geo_point_2d": [
        51.4497285026,
        -2.60957858467
      ],
      "ward_name": "Hotwells & Harbourside",
      "sen_pupils_receiving_school_support": 18,
      "total_number_of_pupils": 223,
      "year": "2019",
      "total_number_of_sen_pupils": 21
    },
    "record_timestamp": "2019-09-17T15:52:23.201+01:00"
  },
  {
    "datasetid": "pupils-with-special-educational-needs-in-bristol",
    "recordid": "ddddfecf8001b917916bd0a219bdc3a275e0a1c6",
    "fields": {
      "ward_code": "E05010902",
      "pupils_with_ehcp0": 1.16029222174,
      "of_sen_pupils": 16.5957446809,
      "pupils_with_ehcp": 27,
      "of_sen_pupils_receiving_school_support": 12.6342930812,
      "pupils_with_statement_of_sen": 33,
      "geo_point_2d": [
        51.4115422794,
        -2.57721341501
      ],
      "ward_name": "Hengrove & Whitchurch Park",
      "sen_pupils_receiving_school_support": 294,
      "total_number_of_pupils": 2327,
      "year": "2017",
      "total_number_of_sen_pupils": 354
    },
    "record_timestamp": "2019-09-17T15:52:23.201+01:00"
  },
  {
    "datasetid": "pupils-with-special-educational-needs-in-bristol",
    "recordid": "0db22a03e4e59f5d51cde8ccbdb364119337ca44",
    "fields": {
      "ward_code": "E05010904",
      "pupils_with_ehcp0": 1.51724137931,
      "of_sen_pupils": 15.3581267218,
      "pupils_with_ehcp": 22,
      "of_sen_pupils_receiving_school_support": 12.6896551724,
      "pupils_with_statement_of_sen": 23,
      "geo_point_2d": [
        51.4950842804,
        -2.586379126
      ],
      "ward_name": "Horfield",
      "sen_pupils_receiving_school_support": 184,
      "total_number_of_pupils": 1450,
      "year": "2017",
      "total_number_of_sen_pupils": 229
    },
    "record_timestamp": "2019-09-17T15:52:23.201+01:00"
  },
  {
    "datasetid": "pupils-with-special-educational-needs-in-bristol",
    "recordid": "dfd5f9137f3109b112f8a75bbc8701f7ba69eb94",
    "fields": {
      "ward_code": "E05010907",
      "pupils_with_ehcp0": 1.22448979592,
      "of_sen_pupils": 17.8314639057,
      "pupils_with_ehcp": 42,
      "of_sen_pupils_receiving_school_support": 14.3440233236,
      "pupils_with_statement_of_sen": 43,
      "geo_point_2d": [
        51.4545929175,
        -2.57123424149
      ],
      "ward_name": "Lawrence Hill",
      "sen_pupils_receiving_school_support": 492,
      "total_number_of_pupils": 3430,
      "year": "2017",
      "total_number_of_sen_pupils": 577
    },
    "record_timestamp": "2019-09-17T15:52:23.201+01:00"
  },
  {
    "datasetid": "pupils-with-special-educational-needs-in-bristol",
    "recordid": "eab5ed8066c6f599d9c81e4b495df10300ef2217",
    "fields": {
      "ward_code": "E05010913",
      "pupils_with_ehcp0": 1.37594318686,
      "of_sen_pupils": 14.8690634709,
      "pupils_with_ehcp": 31,
      "of_sen_pupils_receiving_school_support": 12.960497115,
      "pupils_with_statement_of_sen": 33,
      "geo_point_2d": [
        51.5030620845,
        -2.60111790007
      ],
      "ward_name": "Southmead",
      "sen_pupils_receiving_school_support": 292,
      "total_number_of_pupils": 2253,
      "year": "2017",
      "total_number_of_sen_pupils": 356
    },
    "record_timestamp": "2019-09-17T15:52:23.201+01:00"
  },
  {
    "datasetid": "pupils-with-special-educational-needs-in-bristol",
    "recordid": "6e643281c26a317535d92075558da12335f41c22",
    "fields": {
      "ward_code": "E05010894",
      "pupils_with_ehcp0": 1.04712041885,
      "of_sen_pupils": 9.94764397906,
      "pupils_with_ehcp": 4,
      "of_sen_pupils_receiving_school_support": 8.90052356021,
      "geo_point_2d": [
        51.4649698075,
        -2.61265665527
      ],
      "ward_name": "Clifton Down",
      "sen_pupils_receiving_school_support": 34,
      "total_number_of_pupils": 382,
      "year": "2018",
      "total_number_of_sen_pupils": 38
    },
    "record_timestamp": "2019-09-17T15:52:23.201+01:00"
  },
  {
    "datasetid": "pupils-with-special-educational-needs-in-bristol",
    "recordid": "7d4d0677e09c391602239cd05e363363c15f9934",
    "fields": {
      "ward_code": "E05010902",
      "pupils_with_ehcp0": 1.44680851064,
      "of_sen_pupils": 16.5957446809,
      "pupils_with_ehcp": 34,
      "of_sen_pupils_receiving_school_support": 14.3829787234,
      "pupils_with_statement_of_sen": 18,
      "geo_point_2d": [
        51.4115422794,
        -2.57721341501
      ],
      "ward_name": "Hengrove & Whitchurch Park",
      "sen_pupils_receiving_school_support": 338,
      "total_number_of_pupils": 2350,
      "year": "2018",
      "total_number_of_sen_pupils": 390
    },
    "record_timestamp": "2019-09-17T15:52:23.201+01:00"
  },
  {
    "datasetid": "pupils-with-special-educational-needs-in-bristol",
    "recordid": "0657ac95b126860e958a064b78696bbfc8dbbdd8",
    "fields": {
      "ward_code": "E05010904",
      "pupils_with_ehcp0": 2.41046831956,
      "of_sen_pupils": 15.3581267218,
      "pupils_with_ehcp": 35,
      "of_sen_pupils_receiving_school_support": 12.4655647383,
      "pupils_with_statement_of_sen": 7,
      "geo_point_2d": [
        51.4950842804,
        -2.586379126
      ],
      "ward_name": "Horfield",
      "sen_pupils_receiving_school_support": 181,
      "total_number_of_pupils": 1452,
      "year": "2018",
      "total_number_of_sen_pupils": 223
    },
    "record_timestamp": "2019-09-17T15:52:23.201+01:00"
  },
  {
    "datasetid": "pupils-with-special-educational-needs-in-bristol",
    "recordid": "2deb6cfcbd940d6ff0668bcf2b8b6c87477561c1",
    "fields": {
      "ward_code": "E05010910",
      "pupils_with_ehcp0": 2.1768707483,
      "of_sen_pupils": 13.8095238095,
      "pupils_with_ehcp": 32,
      "of_sen_pupils_receiving_school_support": 11.2925170068,
      "pupils_with_statement_of_sen": 5,
      "geo_point_2d": [
        51.4621405804,
        -2.52638340272
      ],
      "ward_name": "St George Central",
      "sen_pupils_receiving_school_support": 166,
      "total_number_of_pupils": 1470,
      "year": "2018",
      "total_number_of_sen_pupils": 203
    },
    "record_timestamp": "2019-09-17T15:52:23.201+01:00"
  },
  {
    "datasetid": "pupils-with-special-educational-needs-in-bristol",
    "recordid": "07222ff5dec2d147da748b0b2365e1dc790bc658",
    "fields": {
      "sen_pupils_receiving_school_support": 7415,
      "pupils_with_ehcp0": 1.80144528562,
      "of_sen_pupils": 15.1531314522,
      "pupils_with_statement_of_sen": 345,
      "of_sen_pupils_receiving_school_support": 12.7580867171,
      "pupils_with_ehcp": 1047,
      "ward_name": "Bristol",
      "total_number_of_pupils": 58120,
      "year": "2018",
      "total_number_of_sen_pupils": 8807
    },
    "record_timestamp": "2019-09-17T15:52:23.201+01:00"
  },
  {
    "datasetid": "pupils-with-special-educational-needs-in-bristol",
    "recordid": "1c2bccf6f9aa77e10bdd506b9cd8b1dc8a60534b",
    "fields": {
      "ward_code": "E05010886",
      "pupils_with_ehcp0": 2.665186007,
      "of_sen_pupils": 14.047751249,
      "pupils_with_ehcp": 96,
      "of_sen_pupils_receiving_school_support": 11.382565241,
      "pupils_with_statement_of_sen": 0,
      "geo_point_2d": [
        51.5073341696,
        -2.67640359358
      ],
      "ward_name": "Avonmouth & Lawrence Weston",
      "sen_pupils_receiving_school_support": 410,
      "total_number_of_pupils": 3602,
      "year": "2019",
      "total_number_of_sen_pupils": 506
    },
    "record_timestamp": "2019-09-17T15:52:23.201+01:00"
  },
  {
    "datasetid": "pupils-with-special-educational-needs-in-bristol",
    "recordid": "87f6c28836062f545e6961d1f964652f91048f6c",
    "fields": {
      "ward_code": "E05010887",
      "pupils_with_ehcp0": 1.69622205,
      "of_sen_pupils": 13.878180416,
      "pupils_with_ehcp": 22,
      "of_sen_pupils_receiving_school_support": 12.181958365,
      "pupils_with_statement_of_sen": 0,
      "geo_point_2d": [
        51.4371603671,
        -2.62187227821
      ],
      "ward_name": "Bedminster",
      "sen_pupils_receiving_school_support": 158,
      "total_number_of_pupils": 1297,
      "year": "2019",
      "total_number_of_sen_pupils": 180
    },
    "record_timestamp": "2019-09-17T15:52:23.201+01:00"
  },
  {
    "datasetid": "pupils-with-special-educational-needs-in-bristol",
    "recordid": "fdd7cc2d0489a82036e8e296308312861a48bc90",
    "fields": {
      "ward_code": "E05010902",
      "pupils_with_ehcp0": 2.299794661,
      "of_sen_pupils": 17.248459958,
      "pupils_with_ehcp": 56,
      "of_sen_pupils_receiving_school_support": 14.948665297,
      "pupils_with_statement_of_sen": 0,
      "geo_point_2d": [
        51.4115422794,
        -2.57721341501
      ],
      "ward_name": "Hengrove & Whitchurch Park",
      "sen_pupils_receiving_school_support": 364,
      "total_number_of_pupils": 2435,
      "year": "2019",
      "total_number_of_sen_pupils": 420
    },
    "record_timestamp": "2019-09-17T15:52:23.201+01:00"
  },
  {
    "datasetid": "pupils-with-special-educational-needs-in-bristol",
    "recordid": "0289a7e2966c27801cc241b5fca207d5d20fcdc6",
    "fields": {
      "ward_code": "E05010886",
      "pupils_with_ehcp0": 1.68262257035,
      "of_sen_pupils": 12.5177003682,
      "pupils_with_ehcp": 58,
      "of_sen_pupils_receiving_school_support": 9.86364955033,
      "pupils_with_statement_of_sen": 39,
      "geo_point_2d": [
        51.5073341696,
        -2.67640359358
      ],
      "ward_name": "Avonmouth & Lawrence Weston",
      "sen_pupils_receiving_school_support": 340,
      "total_number_of_pupils": 3447,
      "year": "2017",
      "total_number_of_sen_pupils": 437
    },
    "record_timestamp": "2019-09-17T15:52:23.201+01:00"
  },
  {
    "datasetid": "pupils-with-special-educational-needs-in-bristol",
    "recordid": "e6b67534f8123a323a2924264458ef1fae85dedd",
    "fields": {
      "ward_code": "E05010889",
      "pupils_with_ehcp0": 1.01553166069,
      "of_sen_pupils": 14.1002949853,
      "pupils_with_ehcp": 17,
      "of_sen_pupils_receiving_school_support": 10.5734767025,
      "pupils_with_statement_of_sen": 20,
      "geo_point_2d": [
        51.4217884041,
        -2.61645553985
      ],
      "ward_name": "Bishopsworth",
      "sen_pupils_receiving_school_support": 177,
      "total_number_of_pupils": 1674,
      "year": "2017",
      "total_number_of_sen_pupils": 214
    },
    "record_timestamp": "2019-09-17T15:52:23.201+01:00"
  },
  {
    "datasetid": "pupils-with-special-educational-needs-in-bristol",
    "recordid": "534603b80cd8f11124478aa8c03052d244084ca1",
    "fields": {
      "ward_code": "E05010893",
      "pupils_with_ehcp0": 0.718132854578,
      "of_sen_pupils": 9.07372400756,
      "pupils_with_ehcp": 4,
      "of_sen_pupils_receiving_school_support": 10.0538599641,
      "pupils_with_statement_of_sen": 3,
      "geo_point_2d": [
        51.4565158032,
        -2.61996331305
      ],
      "ward_name": "Clifton",
      "sen_pupils_receiving_school_support": 56,
      "total_number_of_pupils": 557,
      "year": "2017",
      "total_number_of_sen_pupils": 63
    },
    "record_timestamp": "2019-09-17T15:52:23.201+01:00"
  },
  {
    "datasetid": "pupils-with-special-educational-needs-in-bristol",
    "recordid": "053a05e441c7dc3e7eff813d8cf0474284e1444c",
    "fields": {
      "ward_code": "E05010906",
      "pupils_with_ehcp0": 1.5733456733,
      "of_sen_pupils": 14.9482215218,
      "pupils_with_ehcp": 34,
      "of_sen_pupils_receiving_school_support": 11.8463674225,
      "pupils_with_statement_of_sen": 32,
      "geo_point_2d": [
        51.4327773874,
        -2.57233440569
      ],
      "ward_name": "Knowle",
      "sen_pupils_receiving_school_support": 256,
      "total_number_of_pupils": 2161,
      "year": "2017",
      "total_number_of_sen_pupils": 322
    },
    "record_timestamp": "2019-09-17T15:52:23.201+01:00"
  },
  {
    "datasetid": "pupils-with-special-educational-needs-in-bristol",
    "recordid": "58e56902f2c6082f811ad6fb96cfb7ea4c523fcd",
    "fields": {
      "ward_code": "E05010911",
      "pupils_with_ehcp0": 1.82926829268,
      "of_sen_pupils": 14.0350877193,
      "pupils_with_ehcp": 6,
      "of_sen_pupils_receiving_school_support": 11.8902439024,
      "pupils_with_statement_of_sen": 5,
      "geo_point_2d": [
        51.4534361531,
        -2.53032298326
      ],
      "ward_name": "St George Troopers Hill",
      "sen_pupils_receiving_school_support": 39,
      "total_number_of_pupils": 328,
      "year": "2017",
      "total_number_of_sen_pupils": 50
    },
    "record_timestamp": "2019-09-17T15:52:23.201+01:00"
  },
  {
    "datasetid": "pupils-with-special-educational-needs-in-bristol",
    "recordid": "c6a512c2fc7e56bad46a725ec3b62a81e756541a",
    "fields": {
      "ward_code": "E05010915",
      "pupils_with_ehcp0": 1.3206162876,
      "of_sen_pupils": 11.5862068966,
      "pupils_with_ehcp": 18,
      "of_sen_pupils_receiving_school_support": 9.39104915627,
      "pupils_with_statement_of_sen": 21,
      "geo_point_2d": [
        51.418418512,
        -2.54973459028
      ],
      "ward_name": "Stockwood",
      "sen_pupils_receiving_school_support": 128,
      "total_number_of_pupils": 1363,
      "year": "2017",
      "total_number_of_sen_pupils": 167
    },
    "record_timestamp": "2019-09-17T15:52:23.201+01:00"
  },
  {
    "datasetid": "pupils-with-special-educational-needs-in-bristol",
    "recordid": "dd7aa0b4dbfab5ffdb1bfc459045b2fdbc8a2040",
    "fields": {
      "sen_pupils_receiving_school_support": 6994,
      "pupils_with_ehcp0": 1.28193886677,
      "of_sen_pupils": 14.8396261158,
      "pupils_with_statement_of_sen": 737,
      "of_sen_pupils_receiving_school_support": 12.2652263122,
      "pupils_with_ehcp": 731,
      "ward_name": "Bristol",
      "total_number_of_pupils": 57023,
      "year": "2017",
      "total_number_of_sen_pupils": 8462
    },
    "record_timestamp": "2019-09-17T15:52:23.201+01:00"
  },
  {
    "datasetid": "pupils-with-special-educational-needs-in-bristol",
    "recordid": "f3025e7ce410b0b138ac709621b51dca918a00da",
    "fields": {
      "ward_code": "E05010887",
      "pupils_with_ehcp0": 1.25,
      "of_sen_pupils": 12.1875,
      "pupils_with_ehcp": 16,
      "of_sen_pupils_receiving_school_support": 10.703125,
      "pupils_with_statement_of_sen": 3,
      "geo_point_2d": [
        51.4371603671,
        -2.62187227821
      ],
      "ward_name": "Bedminster",
      "sen_pupils_receiving_school_support": 137,
      "total_number_of_pupils": 1280,
      "year": "2018",
      "total_number_of_sen_pupils": 156
    },
    "record_timestamp": "2019-09-17T15:52:23.201+01:00"
  },
  {
    "datasetid": "pupils-with-special-educational-needs-in-bristol",
    "recordid": "fcf99ab062f106537c4ce03987569dd3e2f611de",
    "fields": {
      "ward_code": "E05010895",
      "pupils_with_ehcp0": 0.833333333333,
      "of_sen_pupils": 9,
      "pupils_with_ehcp": 5,
      "of_sen_pupils_receiving_school_support": 7.66666666667,
      "pupils_with_statement_of_sen": 3,
      "geo_point_2d": [
        51.4659633898,
        -2.59991083361
      ],
      "ward_name": "Cotham",
      "sen_pupils_receiving_school_support": 46,
      "total_number_of_pupils": 600,
      "year": "2018",
      "total_number_of_sen_pupils": 54
    },
    "record_timestamp": "2019-09-17T15:52:23.201+01:00"
  },
  {
    "datasetid": "pupils-with-special-educational-needs-in-bristol",
    "recordid": "b57aa04bb737ebefe0e8033059b2f0e5c37ddd33",
    "fields": {
      "ward_code": "E05010899",
      "pupils_with_ehcp0": 2.6941362916,
      "of_sen_pupils": 15.6101426307,
      "pupils_with_ehcp": 34,
      "of_sen_pupils_receiving_school_support": 11.9651347068,
      "pupils_with_statement_of_sen": 12,
      "geo_point_2d": [
        51.4870905493,
        -2.53119915299
      ],
      "ward_name": "Frome Vale",
      "sen_pupils_receiving_school_support": 151,
      "total_number_of_pupils": 1262,
      "year": "2018",
      "total_number_of_sen_pupils": 197
    },
    "record_timestamp": "2019-09-17T15:52:23.201+01:00"
  },
  {
    "datasetid": "pupils-with-special-educational-needs-in-bristol",
    "recordid": "2c0d83f290b82464c897efcf92b4a7d12fd946ce",
    "fields": {
      "ward_code": "E05010901",
      "pupils_with_ehcp0": 2.36842105263,
      "of_sen_pupils": 16.6842105263,
      "pupils_with_ehcp": 45,
      "of_sen_pupils_receiving_school_support": 13.0526315789,
      "pupils_with_statement_of_sen": 24,
      "geo_point_2d": [
        51.5089736142,
        -2.62103514848
      ],
      "ward_name": "Henbury & Brentry",
      "sen_pupils_receiving_school_support": 248,
      "total_number_of_pupils": 1900,
      "year": "2018",
      "total_number_of_sen_pupils": 317
    },
    "record_timestamp": "2019-09-17T15:52:23.201+01:00"
  },
  {
    "datasetid": "pupils-with-special-educational-needs-in-bristol",
    "recordid": "5285fb8c465e5cb2107f41782a01ce914c05284c",
    "fields": {
      "ward_code": "E05010909",
      "pupils_with_ehcp0": 0.969932104753,
      "of_sen_pupils": 11.0572259942,
      "pupils_with_ehcp": 20,
      "of_sen_pupils_receiving_school_support": 9.89330746848,
      "pupils_with_statement_of_sen": 4,
      "geo_point_2d": [
        51.4752449941,
        -2.60115761678
      ],
      "ward_name": "Redland",
      "sen_pupils_receiving_school_support": 204,
      "total_number_of_pupils": 2062,
      "year": "2018",
      "total_number_of_sen_pupils": 228
    },
    "record_timestamp": "2019-09-17T15:52:23.201+01:00"
  },
  {
    "datasetid": "pupils-with-special-educational-needs-in-bristol",
    "recordid": "c7687c8d000ee71695af26bc67a3ca061b71283a",
    "fields": {
      "ward_code": "E05010912",
      "pupils_with_ehcp0": 2.13068181818,
      "of_sen_pupils": 15.9090909091,
      "pupils_with_ehcp": 15,
      "of_sen_pupils_receiving_school_support": 13.6363636364,
      "pupils_with_statement_of_sen": 1,
      "geo_point_2d": [
        51.4601173974,
        -2.54693954016
      ],
      "ward_name": "St George West",
      "sen_pupils_receiving_school_support": 96,
      "total_number_of_pupils": 704,
      "year": "2018",
      "total_number_of_sen_pupils": 112
    },
    "record_timestamp": "2019-09-17T15:52:23.201+01:00"
  },
  {
    "datasetid": "pupils-with-special-educational-needs-in-bristol",
    "recordid": "e4ff717b6dedd58aa72ede271ae3df05b4fcc20b",
    "fields": {
      "ward_code": "E05010892",
      "pupils_with_ehcp0": 1.377410468,
      "of_sen_pupils": 16.528925619,
      "pupils_with_ehcp": 10,
      "of_sen_pupils_receiving_school_support": 15.151515151,
      "pupils_with_statement_of_sen": 0,
      "geo_point_2d": [
        51.4544148955,
        -2.59433619751
      ],
      "ward_name": "Central",
      "sen_pupils_receiving_school_support": 110,
      "total_number_of_pupils": 726,
      "year": "2019",
      "total_number_of_sen_pupils": 120
    },
    "record_timestamp": "2019-09-17T15:52:23.201+01:00"
  },
  {
    "datasetid": "pupils-with-special-educational-needs-in-bristol",
    "recordid": "abe6c309098d5c93b9a40baa38e9c71187cfffc8",
    "fields": {
      "ward_code": "E05010894",
      "pupils_with_ehcp0": 1.291989664,
      "of_sen_pupils": 10.077519379,
      "pupils_with_ehcp": 5,
      "of_sen_pupils_receiving_school_support": 8.785529715,
      "pupils_with_statement_of_sen": 0,
      "geo_point_2d": [
        51.4649698075,
        -2.61265665527
      ],
      "ward_name": "Clifton Down",
      "sen_pupils_receiving_school_support": 34,
      "total_number_of_pupils": 387,
      "year": "2019",
      "total_number_of_sen_pupils": 39
    },
    "record_timestamp": "2019-09-17T15:52:23.201+01:00"
  },
  {
    "datasetid": "pupils-with-special-educational-needs-in-bristol",
    "recordid": "7051300e364b1151bf1e743ed3aa8ea9daadcf2b",
    "fields": {
      "ward_code": "E05010897",
      "pupils_with_ehcp0": 1.674277016,
      "of_sen_pupils": 14.459665144,
      "pupils_with_ehcp": 33,
      "of_sen_pupils_receiving_school_support": 12.785388127,
      "pupils_with_statement_of_sen": 0,
      "geo_point_2d": [
        51.4747101824,
        -2.54692680567
      ],
      "ward_name": "Eastville",
      "sen_pupils_receiving_school_support": 252,
      "total_number_of_pupils": 1971,
      "year": "2019",
      "total_number_of_sen_pupils": 285
    },
    "record_timestamp": "2019-09-17T15:52:23.201+01:00"
  },
  {
    "datasetid": "pupils-with-special-educational-needs-in-bristol",
    "recordid": "c423d5cb7db87d262eff02bbbe9b119cd905e767",
    "fields": {
      "ward_code": "E05010908",
      "pupils_with_ehcp0": 3.891233005,
      "of_sen_pupils": 17.393342709,
      "pupils_with_ehcp": 83,
      "of_sen_pupils_receiving_school_support": 13.502109704,
      "pupils_with_statement_of_sen": 0,
      "geo_point_2d": [
        51.4858562509,
        -2.56566726138
      ],
      "ward_name": "Lockleaze",
      "sen_pupils_receiving_school_support": 288,
      "total_number_of_pupils": 2133,
      "year": "2019",
      "total_number_of_sen_pupils": 371
    },
    "record_timestamp": "2019-09-17T15:52:23.201+01:00"
  },
  {
    "datasetid": "pupils-with-special-educational-needs-in-bristol",
    "recordid": "1eef66b7808a9062e1577135150170da85023dba",
    "fields": {
      "ward_code": "E05010910",
      "pupils_with_ehcp0": 2.706359945,
      "of_sen_pupils": 15.290933694,
      "pupils_with_ehcp": 40,
      "of_sen_pupils_receiving_school_support": 12.584573748,
      "pupils_with_statement_of_sen": 0,
      "geo_point_2d": [
        51.4621405804,
        -2.52638340272
      ],
      "ward_name": "St George Central",
      "sen_pupils_receiving_school_support": 186,
      "total_number_of_pupils": 1478,
      "year": "2019",
      "total_number_of_sen_pupils": 226
    },
    "record_timestamp": "2019-09-17T15:52:23.201+01:00"
  },
  {
    "datasetid": "pupils-with-special-educational-needs-in-bristol",
    "recordid": "041b7d6abf7fbbdfc992badeb32e572f9bec153c",
    "fields": {
      "ward_code": "E05010916",
      "pupils_with_ehcp0": 2.115059221,
      "of_sen_pupils": 12.859560067,
      "pupils_with_ehcp": 25,
      "of_sen_pupils_receiving_school_support": 10.744500846,
      "pupils_with_statement_of_sen": 0,
      "geo_point_2d": [
        51.4774256958,
        -2.63604316329
      ],
      "ward_name": "Stoke Bishop",
      "sen_pupils_receiving_school_support": 127,
      "total_number_of_pupils": 1182,
      "year": "2019",
      "total_number_of_sen_pupils": 152
    },
    "record_timestamp": "2019-09-17T15:52:23.201+01:00"
  },
  {
    "datasetid": "pupils-with-special-educational-needs-in-bristol",
    "recordid": "ac2e1d0f35b41294bac7c697c8e968c02b0145fe",
    "fields": {
      "ward_code": "E05010888",
      "pupils_with_ehcp0": 0.970245795602,
      "of_sen_pupils": 11.4835505897,
      "pupils_with_ehcp": 15,
      "of_sen_pupils_receiving_school_support": 8.47347994825,
      "pupils_with_statement_of_sen": 11,
      "geo_point_2d": [
        51.4814532715,
        -2.58646340656
      ],
      "ward_name": "Bishopston & Ashley Down",
      "sen_pupils_receiving_school_support": 131,
      "total_number_of_pupils": 1546,
      "year": "2017",
      "total_number_of_sen_pupils": 157
    },
    "record_timestamp": "2019-09-17T15:52:23.201+01:00"
  },
  {
    "datasetid": "pupils-with-special-educational-needs-in-bristol",
    "recordid": "7e25bc3bb533d320fd80b9a31cc5c37ab5ccee77",
    "fields": {
      "ward_code": "E05010897",
      "pupils_with_ehcp0": 1.18069815195,
      "of_sen_pupils": 13.8383838384,
      "pupils_with_ehcp": 23,
      "of_sen_pupils_receiving_school_support": 11.0882956879,
      "pupils_with_statement_of_sen": 19,
      "geo_point_2d": [
        51.4747101824,
        -2.54692680567
      ],
      "ward_name": "Eastville",
      "sen_pupils_receiving_school_support": 216,
      "total_number_of_pupils": 1948,
      "year": "2017",
      "total_number_of_sen_pupils": 258
    },
    "record_timestamp": "2019-09-17T15:52:23.201+01:00"
  },
  {
    "datasetid": "pupils-with-special-educational-needs-in-bristol",
    "recordid": "e7a6974bd5e568b11f352f8e70d9c0bb6fef9215",
    "fields": {
      "ward_code": "E05010905",
      "pupils_with_ehcp0": 0.473933649289,
      "of_sen_pupils": 9.04761904762,
      "pupils_with_ehcp": 1,
      "of_sen_pupils_receiving_school_support": 5.21327014218,
      "pupils_with_statement_of_sen": 2,
      "geo_point_2d": [
        51.4497285026,
        -2.60957858467
      ],
      "ward_name": "Hotwells & Harbourside",
      "sen_pupils_receiving_school_support": 11,
      "total_number_of_pupils": 211,
      "year": "2017",
      "total_number_of_sen_pupils": 14
    },
    "record_timestamp": "2019-09-17T15:52:23.201+01:00"
  },
  {
    "datasetid": "pupils-with-special-educational-needs-in-bristol",
    "recordid": "c12e4fe078328f7e03a4c364cefd3c2d5e7db157",
    "fields": {
      "ward_code": "E05010917",
      "pupils_with_ehcp0": 0.574272588055,
      "of_sen_pupils": 10.6021425933,
      "pupils_with_ehcp": 15,
      "of_sen_pupils_receiving_school_support": 7.42725880551,
      "pupils_with_statement_of_sen": 23,
      "geo_point_2d": [
        51.4897948304,
        -2.61748273112
      ],
      "ward_name": "Westbury-on-Trym & Henleaze",
      "sen_pupils_receiving_school_support": 194,
      "total_number_of_pupils": 2612,
      "year": "2017",
      "total_number_of_sen_pupils": 232
    },
    "record_timestamp": "2019-09-17T15:52:23.201+01:00"
  },
  {
    "datasetid": "pupils-with-special-educational-needs-in-bristol",
    "recordid": "90b798de94962dde117d5f0de08bbe5a19765294",
    "fields": {
      "ward_code": "E05010893",
      "pupils_with_ehcp0": 0.945179584121,
      "of_sen_pupils": 9.07372400756,
      "pupils_with_ehcp": 5,
      "of_sen_pupils_receiving_school_support": 8.12854442344,
      "geo_point_2d": [
        51.4565158032,
        -2.61996331305
      ],
      "ward_name": "Clifton",
      "sen_pupils_receiving_school_support": 43,
      "total_number_of_pupils": 529,
      "year": "2018",
      "total_number_of_sen_pupils": 48
    },
    "record_timestamp": "2019-09-17T15:52:23.201+01:00"
  },
  {
    "datasetid": "pupils-with-special-educational-needs-in-bristol",
    "recordid": "2491a99c661799ffca045095879e9db215049e93",
    "fields": {
      "ward_code": "E05010911",
      "pupils_with_ehcp0": 3.50877192982,
      "of_sen_pupils": 14.0350877193,
      "pupils_with_ehcp": 12,
      "of_sen_pupils_receiving_school_support": 10.5263157895,
      "geo_point_2d": [
        51.4534361531,
        -2.53032298326
      ],
      "ward_name": "St George Troopers Hill",
      "sen_pupils_receiving_school_support": 36,
      "total_number_of_pupils": 342,
      "year": "2018",
      "total_number_of_sen_pupils": 48
    },
    "record_timestamp": "2019-09-17T15:52:23.201+01:00"
  },
  {
    "datasetid": "pupils-with-special-educational-needs-in-bristol",
    "recordid": "73f4e6a3d0f1de3915a4309940d5c22ea9534547",
    "fields": {
      "ward_code": "E05010915",
      "pupils_with_ehcp0": 2.06896551724,
      "of_sen_pupils": 11.5862068966,
      "pupils_with_ehcp": 30,
      "of_sen_pupils_receiving_school_support": 8.8275862069,
      "pupils_with_statement_of_sen": 10,
      "geo_point_2d": [
        51.418418512,
        -2.54973459028
      ],
      "ward_name": "Stockwood",
      "sen_pupils_receiving_school_support": 128,
      "total_number_of_pupils": 1450,
      "year": "2018",
      "total_number_of_sen_pupils": 168
    },
    "record_timestamp": "2019-09-17T15:52:23.201+01:00"
  },
  {
    "datasetid": "pupils-with-special-educational-needs-in-bristol",
    "recordid": "3c5ab2974a56631702ad0c956f2b5bc887ad0e50",
    "fields": {
      "ward_code": "E05010888",
      "pupils_with_ehcp0": 1.584399756,
      "of_sen_pupils": 12.675198049,
      "pupils_with_ehcp": 26,
      "of_sen_pupils_receiving_school_support": 11.090798293,
      "pupils_with_statement_of_sen": 0,
      "geo_point_2d": [
        51.4814532715,
        -2.58646340656
      ],
      "ward_name": "Bishopston & Ashley Down",
      "sen_pupils_receiving_school_support": 182,
      "total_number_of_pupils": 1641,
      "year": "2019",
      "total_number_of_sen_pupils": 208
    },
    "record_timestamp": "2019-09-17T15:52:23.201+01:00"
  },
  {
    "datasetid": "pupils-with-special-educational-needs-in-bristol",
    "recordid": "fc19f3f6f71b30eb19b393884ef1bdd5253e6225",
    "fields": {
      "ward_code": "E05010903",
      "pupils_with_ehcp0": 3.62232779,
      "of_sen_pupils": 15.558194774,
      "pupils_with_ehcp": 61,
      "of_sen_pupils_receiving_school_support": 11.935866983,
      "pupils_with_statement_of_sen": 0,
      "geo_point_2d": [
        51.4737018096,
        -2.5225753211
      ],
      "ward_name": "Hillfields",
      "sen_pupils_receiving_school_support": 201,
      "total_number_of_pupils": 1684,
      "year": "2019",
      "total_number_of_sen_pupils": 262
    },
    "record_timestamp": "2019-09-17T15:52:23.201+01:00"
  },
  {
    "datasetid": "pupils-with-special-educational-needs-in-bristol",
    "recordid": "63134945251af835d5c44b54cbb2904478008977",
    "fields": {
      "ward_code": "E05010907",
      "pupils_with_ehcp0": 2.851439977,
      "of_sen_pupils": 18.277730253,
      "pupils_with_ehcp": 100,
      "of_sen_pupils_receiving_school_support": 15.426290276,
      "pupils_with_statement_of_sen": 0,
      "geo_point_2d": [
        51.4545929175,
        -2.57123424149
      ],
      "ward_name": "Lawrence Hill",
      "sen_pupils_receiving_school_support": 541,
      "total_number_of_pupils": 3507,
      "year": "2019",
      "total_number_of_sen_pupils": 641
    },
    "record_timestamp": "2019-09-17T15:52:23.201+01:00"
  },
  {
    "datasetid": "pupils-with-special-educational-needs-in-bristol",
    "recordid": "b604d709e7fa73ff0bb3ce274d4a15615efa5ea6",
    "fields": {
      "ward_code": "E05010894",
      "pupils_with_ehcp0": 1.09289617486,
      "of_sen_pupils": 9.94764397906,
      "pupils_with_ehcp": 4,
      "of_sen_pupils_receiving_school_support": 9.83606557377,
      "pupils_with_statement_of_sen": 1,
      "geo_point_2d": [
        51.4649698075,
        -2.61265665527
      ],
      "ward_name": "Clifton Down",
      "sen_pupils_receiving_school_support": 36,
      "total_number_of_pupils": 366,
      "year": "2017",
      "total_number_of_sen_pupils": 41
    },
    "record_timestamp": "2019-09-17T15:52:23.201+01:00"
  },
  {
    "datasetid": "pupils-with-special-educational-needs-in-bristol",
    "recordid": "b8d63c536f3c38ab26a83689f7eca418ef29df58",
    "fields": {
      "ward_code": "E05010901",
      "pupils_with_ehcp0": 1.92198982476,
      "of_sen_pupils": 16.6842105263,
      "pupils_with_ehcp": 34,
      "of_sen_pupils_receiving_school_support": 11.1362351611,
      "pupils_with_statement_of_sen": 41,
      "geo_point_2d": [
        51.5089736142,
        -2.62103514848
      ],
      "ward_name": "Henbury & Brentry",
      "sen_pupils_receiving_school_support": 197,
      "total_number_of_pupils": 1769,
      "year": "2017",
      "total_number_of_sen_pupils": 272
    },
    "record_timestamp": "2019-09-17T15:52:23.201+01:00"
  },
  {
    "datasetid": "pupils-with-special-educational-needs-in-bristol",
    "recordid": "036cae8d4c82db6efa30d3b23e3c6516c0a61bea",
    "fields": {
      "ward_code": "E05010910",
      "pupils_with_ehcp0": 1.00942126514,
      "of_sen_pupils": 13.8095238095,
      "pupils_with_ehcp": 15,
      "of_sen_pupils_receiving_school_support": 12.6514131898,
      "pupils_with_statement_of_sen": 24,
      "geo_point_2d": [
        51.4621405804,
        -2.52638340272
      ],
      "ward_name": "St George Central",
      "sen_pupils_receiving_school_support": 188,
      "total_number_of_pupils": 1486,
      "year": "2017",
      "total_number_of_sen_pupils": 227
    },
    "record_timestamp": "2019-09-17T15:52:23.201+01:00"
  },
  {
    "datasetid": "pupils-with-special-educational-needs-in-bristol",
    "recordid": "0f195d31da3f604aef762107ed566a6a9a79f928",
    "fields": {
      "ward_code": "E05010896",
      "pupils_with_ehcp0": 1.67410714286,
      "of_sen_pupils": 16.6852678571,
      "pupils_with_ehcp": 30,
      "of_sen_pupils_receiving_school_support": 14.6205357143,
      "pupils_with_statement_of_sen": 7,
      "geo_point_2d": [
        51.4623719964,
        -2.55850571231
      ],
      "ward_name": "Easton",
      "sen_pupils_receiving_school_support": 262,
      "total_number_of_pupils": 1792,
      "year": "2018",
      "total_number_of_sen_pupils": 299
    },
    "record_timestamp": "2019-09-17T15:52:23.201+01:00"
  },
  {
    "datasetid": "pupils-with-special-educational-needs-in-bristol",
    "recordid": "2c2864d50009b1ef6099248efcb1e6dd5a298ed4",
    "fields": {
      "ward_code": "E05010906",
      "pupils_with_ehcp0": 1.84601530842,
      "of_sen_pupils": 14.9482215218,
      "pupils_with_ehcp": 41,
      "of_sen_pupils_receiving_school_support": 12.1116614138,
      "pupils_with_statement_of_sen": 22,
      "geo_point_2d": [
        51.4327773874,
        -2.57233440569
      ],
      "ward_name": "Knowle",
      "sen_pupils_receiving_school_support": 269,
      "total_number_of_pupils": 2221,
      "year": "2018",
      "total_number_of_sen_pupils": 332
    },
    "record_timestamp": "2019-09-17T15:52:23.201+01:00"
  },
  {
    "datasetid": "pupils-with-special-educational-needs-in-bristol",
    "recordid": "6b0d1b56e4cc0b1bec8d3e0833ef98164e7d6c34",
    "fields": {
      "ward_code": "E05010913",
      "pupils_with_ehcp0": 1.95295162006,
      "of_sen_pupils": 14.8690634709,
      "pupils_with_ehcp": 44,
      "of_sen_pupils_receiving_school_support": 12.2503328895,
      "pupils_with_statement_of_sen": 15,
      "geo_point_2d": [
        51.5030620845,
        -2.60111790007
      ],
      "ward_name": "Southmead",
      "sen_pupils_receiving_school_support": 276,
      "total_number_of_pupils": 2253,
      "year": "2018",
      "total_number_of_sen_pupils": 335
    },
    "record_timestamp": "2019-09-17T15:52:23.201+01:00"
  },
  {
    "datasetid": "pupils-with-special-educational-needs-in-bristol",
    "recordid": "1da017f1c396a04080f809d2fc72b2908b99acd5",
    "fields": {
      "ward_code": "E05010916",
      "pupils_with_ehcp0": 1.68776371308,
      "of_sen_pupils": 12.6582278481,
      "pupils_with_ehcp": 20,
      "of_sen_pupils_receiving_school_support": 10.5485232068,
      "pupils_with_statement_of_sen": 5,
      "geo_point_2d": [
        51.4774256958,
        -2.63604316329
      ],
      "ward_name": "Stoke Bishop",
      "sen_pupils_receiving_school_support": 125,
      "total_number_of_pupils": 1185,
      "year": "2018",
      "total_number_of_sen_pupils": 150
    },
    "record_timestamp": "2019-09-17T15:52:23.201+01:00"
  },
  {
    "datasetid": "pupils-with-special-educational-needs-in-bristol",
    "recordid": "80a3c23ae84e2003b353d0cd48ad3469e68c271e",
    "fields": {
      "ward_code": "E05010918",
      "pupils_with_ehcp0": 1.21096239643,
      "of_sen_pupils": 10.2613129382,
      "pupils_with_ehcp": 19,
      "of_sen_pupils_receiving_school_support": 8.79541108987,
      "pupils_with_statement_of_sen": 4,
      "geo_point_2d": [
        51.4390971799,
        -2.58594427096
      ],
      "ward_name": "Windmill Hill",
      "sen_pupils_receiving_school_support": 138,
      "total_number_of_pupils": 1569,
      "year": "2018",
      "total_number_of_sen_pupils": 161
    },
    "record_timestamp": "2019-09-17T15:52:23.201+01:00"
  },
  {
    "datasetid": "pupils-with-special-educational-needs-in-bristol",
    "recordid": "f5e618c8a4b81f11c17a6a4c31a157d03da86adb",
    "fields": {
      "ward_code": "E05010889",
      "pupils_with_ehcp0": 1.925320886,
      "of_sen_pupils": 13.943990665,
      "pupils_with_ehcp": 33,
      "of_sen_pupils_receiving_school_support": 12.018669778,
      "pupils_with_statement_of_sen": 0,
      "geo_point_2d": [
        51.4217884041,
        -2.61645553985
      ],
      "ward_name": "Bishopsworth",
      "sen_pupils_receiving_school_support": 206,
      "total_number_of_pupils": 1714,
      "year": "2019",
      "total_number_of_sen_pupils": 239
    },
    "record_timestamp": "2019-09-17T15:52:23.201+01:00"
  },
  {
    "datasetid": "pupils-with-special-educational-needs-in-bristol",
    "recordid": "605bb429c8b8aa79a107aee7539a76ee7ffca2ac",
    "fields": {
      "ward_code": "E05010891",
      "pupils_with_ehcp0": 2.185380557,
      "of_sen_pupils": 15.146948003,
      "pupils_with_ehcp": 29,
      "of_sen_pupils_receiving_school_support": 12.961567445,
      "pupils_with_statement_of_sen": 0,
      "geo_point_2d": [
        51.4343938593,
        -2.54906988637
      ],
      "ward_name": "Brislington West",
      "sen_pupils_receiving_school_support": 172,
      "total_number_of_pupils": 1327,
      "year": "2019",
      "total_number_of_sen_pupils": 201
    },
    "record_timestamp": "2019-09-17T15:52:23.201+01:00"
  },
  {
    "datasetid": "pupils-with-special-educational-needs-in-bristol",
    "recordid": "df75b3d6bb316c8fb3006e71746ae1ac864f355c",
    "fields": {
      "ward_code": "E05010898",
      "pupils_with_ehcp0": 3.32693538,
      "of_sen_pupils": 18.618042226,
      "pupils_with_ehcp": 104,
      "of_sen_pupils_receiving_school_support": 15.291106845,
      "pupils_with_statement_of_sen": 0,
      "geo_point_2d": [
        51.4254187146,
        -2.59280262818
      ],
      "ward_name": "Filwood",
      "sen_pupils_receiving_school_support": 478,
      "total_number_of_pupils": 3126,
      "year": "2019",
      "total_number_of_sen_pupils": 582
    },
    "record_timestamp": "2019-09-17T15:52:23.201+01:00"
  },
  {
    "datasetid": "pupils-with-special-educational-needs-in-bristol",
    "recordid": "90ad7d885787470a2433720b3d8f2c3a81459968",
    "fields": {
      "ward_code": "E05010904",
      "pupils_with_ehcp0": 2.742474916,
      "of_sen_pupils": 13.645484949,
      "pupils_with_ehcp": 41,
      "of_sen_pupils_receiving_school_support": 10.903010033,
      "pupils_with_statement_of_sen": 0,
      "geo_point_2d": [
        51.4950842804,
        -2.586379126
      ],
      "ward_name": "Horfield",
      "sen_pupils_receiving_school_support": 163,
      "total_number_of_pupils": 1495,
      "year": "2019",
      "total_number_of_sen_pupils": 204
    },
    "record_timestamp": "2019-09-17T15:52:23.201+01:00"
  },
  {
    "datasetid": "pupils-with-special-educational-needs-in-bristol",
    "recordid": "25e06dc344808aa5e35f4877842a8c18455fafc5",
    "fields": {
      "ward_code": "E05010909",
      "pupils_with_ehcp0": 1.115963124,
      "of_sen_pupils": 11.062590975,
      "pupils_with_ehcp": 23,
      "of_sen_pupils_receiving_school_support": 9.94662785,
      "pupils_with_statement_of_sen": 0,
      "geo_point_2d": [
        51.4752449941,
        -2.60115761678
      ],
      "ward_name": "Redland",
      "sen_pupils_receiving_school_support": 205,
      "total_number_of_pupils": 2061,
      "year": "2019",
      "total_number_of_sen_pupils": 228
    },
    "record_timestamp": "2019-09-17T15:52:23.201+01:00"
  },
  {
    "datasetid": "pupils-with-special-educational-needs-in-bristol",
    "recordid": "2ac2053b650618e244bff69713978ea2f024b2c8",
    "fields": {
      "ward_code": "E05010911",
      "pupils_with_ehcp0": 4.225352112,
      "of_sen_pupils": 18.309859154,
      "pupils_with_ehcp": 15,
      "of_sen_pupils_receiving_school_support": 14.084507042,
      "pupils_with_statement_of_sen": 0,
      "geo_point_2d": [
        51.4534361531,
        -2.53032298326
      ],
      "ward_name": "St George Troopers Hill",
      "sen_pupils_receiving_school_support": 50,
      "total_number_of_pupils": 355,
      "year": "2019",
      "total_number_of_sen_pupils": 65
    },
    "record_timestamp": "2019-09-17T15:52:23.201+01:00"
  },
  {
    "datasetid": "pupils-with-special-educational-needs-in-bristol",
    "recordid": "e691cc932e45f4e3a4088a25ae5fba2c1f726951",
    "fields": {
      "ward_code": "E05010918",
      "pupils_with_ehcp0": 1.218026796,
      "of_sen_pupils": 11.388550548,
      "pupils_with_ehcp": 20,
      "of_sen_pupils_receiving_school_support": 10.170523751,
      "pupils_with_statement_of_sen": 0,
      "geo_point_2d": [
        51.4390971799,
        -2.58594427096
      ],
      "ward_name": "Windmill Hill",
      "sen_pupils_receiving_school_support": 167,
      "total_number_of_pupils": 1642,
      "year": "2019",
      "total_number_of_sen_pupils": 187
    },
    "record_timestamp": "2019-09-17T15:52:23.201+01:00"
  },
  {
    "datasetid": "pupils-with-special-educational-needs-in-bristol",
    "recordid": "f7618f75ce4febe238d2f9c5fdf5f76d75b171a3",
    "fields": {
      "sen_pupils_receiving_school_support": 7685,
      "pupils_with_ehcp0": 2.41055698604,
      "of_sen_pupils": 15.4289199078,
      "pupils_with_statement_of_sen": 0,
      "of_sen_pupils_receiving_school_support": 13.0183629218,
      "pupils_with_ehcp": 1423,
      "ward_name": "Bristol",
      "total_number_of_pupils": 59032,
      "year": "2019",
      "total_number_of_sen_pupils": 9108
    },
    "record_timestamp": "2019-09-17T15:52:23.201+01:00"
  },
  {
    "datasetid": "pupils-with-special-educational-needs-in-bristol",
    "recordid": "f5e95a7c7c6bc0be923a3c3c05b73f5c8437f998",
    "fields": {
      "ward_code": "E05010887",
      "pupils_with_ehcp0": 0.900163666121,
      "of_sen_pupils": 12.1875,
      "pupils_with_ehcp": 11,
      "of_sen_pupils_receiving_school_support": 10.3109656301,
      "pupils_with_statement_of_sen": 8,
      "geo_point_2d": [
        51.4371603671,
        -2.62187227821
      ],
      "ward_name": "Bedminster",
      "sen_pupils_receiving_school_support": 126,
      "total_number_of_pupils": 1222,
      "year": "2017",
      "total_number_of_sen_pupils": 145
    },
    "record_timestamp": "2019-09-17T15:52:23.201+01:00"
  },
  {
    "datasetid": "pupils-with-special-educational-needs-in-bristol",
    "recordid": "71773fd8b9fbbccbae644ba34eb7b5cd59ec0281",
    "fields": {
      "ward_code": "E05010891",
      "pupils_with_ehcp0": 0.762776506484,
      "of_sen_pupils": 13.790560472,
      "pupils_with_ehcp": 10,
      "of_sen_pupils_receiving_school_support": 14.1113653699,
      "pupils_with_statement_of_sen": 13,
      "geo_point_2d": [
        51.4343938593,
        -2.54906988637
      ],
      "ward_name": "Brislington West",
      "sen_pupils_receiving_school_support": 185,
      "total_number_of_pupils": 1311,
      "year": "2017",
      "total_number_of_sen_pupils": 208
    },
    "record_timestamp": "2019-09-17T15:52:23.201+01:00"
  },
  {
    "datasetid": "pupils-with-special-educational-needs-in-bristol",
    "recordid": "e72bf70264d4cb5fa8dc0ec78dd4cbc8a243cacf",
    "fields": {
      "ward_code": "E05010898",
      "pupils_with_ehcp0": 1.59591445898,
      "of_sen_pupils": 18.4252470513,
      "pupils_with_ehcp": 50,
      "of_sen_pupils_receiving_school_support": 15.3846153846,
      "pupils_with_statement_of_sen": 54,
      "geo_point_2d": [
        51.4254187146,
        -2.59280262818
      ],
      "ward_name": "Filwood",
      "sen_pupils_receiving_school_support": 482,
      "total_number_of_pupils": 3133,
      "year": "2017",
      "total_number_of_sen_pupils": 586
    },
    "record_timestamp": "2019-09-17T15:52:23.201+01:00"
  },
  {
    "datasetid": "pupils-with-special-educational-needs-in-bristol",
    "recordid": "abdccb43bc06ad2c6b844987a94ef6aa865d1fc4",
    "fields": {
      "ward_code": "E05010903",
      "pupils_with_ehcp0": 1.77777777778,
      "of_sen_pupils": 17.3645320197,
      "pupils_with_ehcp": 28,
      "of_sen_pupils_receiving_school_support": 13.5873015873,
      "pupils_with_statement_of_sen": 37,
      "geo_point_2d": [
        51.4737018096,
        -2.5225753211
      ],
      "ward_name": "Hillfields",
      "sen_pupils_receiving_school_support": 214,
      "total_number_of_pupils": 1575,
      "year": "2017",
      "total_number_of_sen_pupils": 279
    },
    "record_timestamp": "2019-09-17T15:52:23.201+01:00"
  },
  {
    "datasetid": "pupils-with-special-educational-needs-in-bristol",
    "recordid": "c535eadb0bcd29d259f14dfd6d4c41878142d012",
    "fields": {
      "ward_code": "E05010912",
      "pupils_with_ehcp0": 2.02312138728,
      "of_sen_pupils": 15.9090909091,
      "pupils_with_ehcp": 14,
      "of_sen_pupils_receiving_school_support": 11.9942196532,
      "pupils_with_statement_of_sen": 2,
      "geo_point_2d": [
        51.4601173974,
        -2.54693954016
      ],
      "ward_name": "St George West",
      "sen_pupils_receiving_school_support": 83,
      "total_number_of_pupils": 692,
      "year": "2017",
      "total_number_of_sen_pupils": 99
    },
    "record_timestamp": "2019-09-17T15:52:23.201+01:00"
  },
  {
    "datasetid": "pupils-with-special-educational-needs-in-bristol",
    "recordid": "4b7d8bf738b113652719403349ddf5e52f6b93c4",
    "fields": {
      "ward_code": "E05010918",
      "pupils_with_ehcp0": 1.24183006536,
      "of_sen_pupils": 10.2613129382,
      "pupils_with_ehcp": 19,
      "of_sen_pupils_receiving_school_support": 9.54248366013,
      "pupils_with_statement_of_sen": 11,
      "geo_point_2d": [
        51.4390971799,
        -2.58594427096
      ],
      "ward_name": "Windmill Hill",
      "sen_pupils_receiving_school_support": 146,
      "total_number_of_pupils": 1530,
      "year": "2017",
      "total_number_of_sen_pupils": 176
    },
    "record_timestamp": "2019-09-17T15:52:23.201+01:00"
  },
  {
    "datasetid": "pupils-with-special-educational-needs-in-bristol",
    "recordid": "8865aaf466770895662e04065419945c8bedd17f",
    "fields": {
      "ward_code": "E05010886",
      "pupils_with_ehcp0": 2.09572359105,
      "of_sen_pupils": 12.5177003682,
      "pupils_with_ehcp": 74,
      "of_sen_pupils_receiving_school_support": 9.96884735202,
      "pupils_with_statement_of_sen": 16,
      "geo_point_2d": [
        51.5073341696,
        -2.67640359358
      ],
      "ward_name": "Avonmouth & Lawrence Weston",
      "sen_pupils_receiving_school_support": 352,
      "total_number_of_pupils": 3531,
      "year": "2018",
      "total_number_of_sen_pupils": 442
    },
    "record_timestamp": "2019-09-17T15:52:23.201+01:00"
  },
  {
    "datasetid": "pupils-with-special-educational-needs-in-bristol",
    "recordid": "32e81cbe24e8ac5cf3e2026033fe32e54328e32f",
    "fields": {
      "ward_code": "E05010889",
      "pupils_with_ehcp0": 1.17994100295,
      "of_sen_pupils": 14.1002949853,
      "pupils_with_ehcp": 20,
      "of_sen_pupils_receiving_school_support": 12.0943952802,
      "pupils_with_statement_of_sen": 14,
      "geo_point_2d": [
        51.4217884041,
        -2.61645553985
      ],
      "ward_name": "Bishopsworth",
      "sen_pupils_receiving_school_support": 205,
      "total_number_of_pupils": 1695,
      "year": "2018",
      "total_number_of_sen_pupils": 239
    },
    "record_timestamp": "2019-09-17T15:52:23.201+01:00"
  },
  {
    "datasetid": "pupils-with-special-educational-needs-in-bristol",
    "recordid": "c45c5822f8de779958d6a3071fc5ae43c6beb636",
    "fields": {
      "ward_code": "E05010892",
      "pupils_with_ehcp0": 1.43884892086,
      "of_sen_pupils": 15.9712230216,
      "pupils_with_ehcp": 10,
      "of_sen_pupils_receiving_school_support": 14.5323741007,
      "geo_point_2d": [
        51.4544148955,
        -2.59433619751
      ],
      "ward_name": "Central",
      "sen_pupils_receiving_school_support": 101,
      "total_number_of_pupils": 695,
      "year": "2018",
      "total_number_of_sen_pupils": 111
    },
    "record_timestamp": "2019-09-17T15:52:23.201+01:00"
  },
  {
    "datasetid": "pupils-with-special-educational-needs-in-bristol",
    "recordid": "29cb01ce5d3065cb1b08c337be3d07f702679089",
    "fields": {
      "ward_code": "E05010895",
      "pupils_with_ehcp0": 0.811688311,
      "of_sen_pupils": 10.714285714,
      "pupils_with_ehcp": 5,
      "of_sen_pupils_receiving_school_support": 9.902597402,
      "pupils_with_statement_of_sen": 0,
      "geo_point_2d": [
        51.4659633898,
        -2.59991083361
      ],
      "ward_name": "Cotham",
      "sen_pupils_receiving_school_support": 61,
      "total_number_of_pupils": 616,
      "year": "2019",
      "total_number_of_sen_pupils": 66
    },
    "record_timestamp": "2019-09-17T15:52:23.201+01:00"
  },
  {
    "datasetid": "pupils-with-special-educational-needs-in-bristol",
    "recordid": "b7bc8d27da9ba75a991874b2e0dd91fb01ed768e",
    "fields": {
      "ward_code": "E05010906",
      "pupils_with_ehcp0": 2.513227513,
      "of_sen_pupils": 14.594356261,
      "pupils_with_ehcp": 57,
      "of_sen_pupils_receiving_school_support": 12.081128747,
      "pupils_with_statement_of_sen": 0,
      "geo_point_2d": [
        51.4327773874,
        -2.57233440569
      ],
      "ward_name": "Knowle",
      "sen_pupils_receiving_school_support": 274,
      "total_number_of_pupils": 2268,
      "year": "2019",
      "total_number_of_sen_pupils": 331
    },
    "record_timestamp": "2019-09-17T15:52:23.201+01:00"
  },
  {
    "datasetid": "pupils-with-special-educational-needs-in-bristol",
    "recordid": "b64796c80d4be0f4f1897f4b0d260cec814df071",
    "fields": {
      "ward_code": "E05010912",
      "pupils_with_ehcp0": 1.714285714,
      "of_sen_pupils": 15.857142857,
      "pupils_with_ehcp": 12,
      "of_sen_pupils_receiving_school_support": 14.142857142,
      "pupils_with_statement_of_sen": 0,
      "geo_point_2d": [
        51.4601173974,
        -2.54693954016
      ],
      "ward_name": "St George West",
      "sen_pupils_receiving_school_support": 99,
      "total_number_of_pupils": 700,
      "year": "2019",
      "total_number_of_sen_pupils": 111
    },
    "record_timestamp": "2019-09-17T15:52:23.201+01:00"
  },
  {
    "datasetid": "pupils-with-special-educational-needs-in-bristol",
    "recordid": "a2580aee33852a113dbd8d4506d90bb6fa27b684",
    "fields": {
      "ward_code": "E05010913",
      "pupils_with_ehcp0": 2.44648318,
      "of_sen_pupils": 15.465268676,
      "pupils_with_ehcp": 56,
      "of_sen_pupils_receiving_school_support": 13.018785495,
      "pupils_with_statement_of_sen": 0,
      "geo_point_2d": [
        51.5030620845,
        -2.60111790007
      ],
      "ward_name": "Southmead",
      "sen_pupils_receiving_school_support": 298,
      "total_number_of_pupils": 2289,
      "year": "2019",
      "total_number_of_sen_pupils": 354
    },
    "record_timestamp": "2019-09-17T15:52:23.201+01:00"
  },
  {
    "datasetid": "pupils-with-special-educational-needs-in-bristol",
    "recordid": "9f9f0e8b1d2f3a2ab8fdbc196617920db7823781",
    "fields": {
      "ward_code": "E05010915",
      "pupils_with_ehcp0": 2.440725244,
      "of_sen_pupils": 11.366806136,
      "pupils_with_ehcp": 35,
      "of_sen_pupils_receiving_school_support": 8.926080892,
      "pupils_with_statement_of_sen": 0,
      "geo_point_2d": [
        51.418418512,
        -2.54973459028
      ],
      "ward_name": "Stockwood",
      "sen_pupils_receiving_school_support": 128,
      "total_number_of_pupils": 1434,
      "year": "2019",
      "total_number_of_sen_pupils": 163
    },
    "record_timestamp": "2019-09-17T15:52:23.201+01:00"
  },
  {
    "datasetid": "pupils-with-special-educational-needs-in-bristol",
    "recordid": "cb8620f2c6933c1e980c4b7d63d2d9e6c5dc0db0",
    "fields": {
      "ward_code": "E05010890",
      "pupils_with_ehcp0": 1.05750165235,
      "of_sen_pupils": 16.3599182004,
      "pupils_with_ehcp": 16,
      "of_sen_pupils_receiving_school_support": 16.2590879048,
      "pupils_with_statement_of_sen": 21,
      "geo_point_2d": [
        51.4402835576,
        -2.53865369047
      ],
      "ward_name": "Brislington East",
      "sen_pupils_receiving_school_support": 246,
      "total_number_of_pupils": 1513,
      "year": "2017",
      "total_number_of_sen_pupils": 283
    },
    "record_timestamp": "2019-09-17T15:52:23.201+01:00"
  },
  {
    "datasetid": "pupils-with-special-educational-needs-in-bristol",
    "recordid": "41e845e50a90b62d9c32990b5e4e9171abe87282",
    "fields": {
      "ward_code": "E05010892",
      "pupils_with_ehcp0": 0.782472613459,
      "of_sen_pupils": 15.9712230216,
      "pupils_with_ehcp": 5,
      "of_sen_pupils_receiving_school_support": 15.0234741784,
      "pupils_with_statement_of_sen": 4,
      "geo_point_2d": [
        51.4544148955,
        -2.59433619751
      ],
      "ward_name": "Central",
      "sen_pupils_receiving_school_support": 96,
      "total_number_of_pupils": 639,
      "year": "2017",
      "total_number_of_sen_pupils": 105
    },
    "record_timestamp": "2019-09-17T15:52:23.201+01:00"
  },
  {
    "datasetid": "pupils-with-special-educational-needs-in-bristol",
    "recordid": "1cf2ef0b3c4cf604659f45cfb1afab9aa643d769",
    "fields": {
      "ward_code": "E05010908",
      "pupils_with_ehcp0": 2.08839242351,
      "of_sen_pupils": 17.2874880611,
      "pupils_with_ehcp": 43,
      "of_sen_pupils_receiving_school_support": 14.4244779019,
      "pupils_with_statement_of_sen": 33,
      "geo_point_2d": [
        51.4858562509,
        -2.56566726138
      ],
      "ward_name": "Lockleaze",
      "sen_pupils_receiving_school_support": 297,
      "total_number_of_pupils": 2059,
      "year": "2017",
      "total_number_of_sen_pupils": 373
    },
    "record_timestamp": "2019-09-17T15:52:23.201+01:00"
  },
  {
    "datasetid": "pupils-with-special-educational-needs-in-bristol",
    "recordid": "d0541c5c2c0929723e0ca6e9c588c5be55fe9d71",
    "fields": {
      "ward_code": "E05010888",
      "pupils_with_ehcp0": 1.17939168218,
      "of_sen_pupils": 11.4835505897,
      "pupils_with_ehcp": 19,
      "of_sen_pupils_receiving_school_support": 9.99379267536,
      "pupils_with_statement_of_sen": 5,
      "geo_point_2d": [
        51.4814532715,
        -2.58646340656
      ],
      "ward_name": "Bishopston & Ashley Down",
      "sen_pupils_receiving_school_support": 161,
      "total_number_of_pupils": 1611,
      "year": "2018",
      "total_number_of_sen_pupils": 185
    },
    "record_timestamp": "2019-09-17T15:52:23.201+01:00"
  },
  {
    "datasetid": "pupils-with-special-educational-needs-in-bristol",
    "recordid": "23d12ffd01f5d7f39e0f3b06fc461d0f4703c042",
    "fields": {
      "ward_code": "E05010890",
      "pupils_with_ehcp0": 1.3633265167,
      "of_sen_pupils": 16.3599182004,
      "pupils_with_ehcp": 20,
      "of_sen_pupils_receiving_school_support": 13.8377641445,
      "pupils_with_statement_of_sen": 17,
      "geo_point_2d": [
        51.4402835576,
        -2.53865369047
      ],
      "ward_name": "Brislington East",
      "sen_pupils_receiving_school_support": 203,
      "total_number_of_pupils": 1467,
      "year": "2018",
      "total_number_of_sen_pupils": 240
    },
    "record_timestamp": "2019-09-17T15:52:23.201+01:00"
  },
  {
    "datasetid": "pupils-with-special-educational-needs-in-bristol",
    "recordid": "278bd9cb910f93c7e348647e29c660b7eadd6dd1",
    "fields": {
      "ward_code": "E05010891",
      "pupils_with_ehcp0": 1.47492625369,
      "of_sen_pupils": 13.790560472,
      "pupils_with_ehcp": 20,
      "of_sen_pupils_receiving_school_support": 11.9469026549,
      "pupils_with_statement_of_sen": 5,
      "geo_point_2d": [
        51.4343938593,
        -2.54906988637
      ],
      "ward_name": "Brislington West",
      "sen_pupils_receiving_school_support": 162,
      "total_number_of_pupils": 1356,
      "year": "2018",
      "total_number_of_sen_pupils": 187
    },
    "record_timestamp": "2019-09-17T15:52:23.201+01:00"
  },
  {
    "datasetid": "pupils-with-special-educational-needs-in-bristol",
    "recordid": "51684e56af12c362e64622a90e8f7445ee2ade5b",
    "fields": {
      "ward_code": "E05010898",
      "pupils_with_ehcp0": 2.35894166401,
      "of_sen_pupils": 18.4252470513,
      "pupils_with_ehcp": 74,
      "of_sen_pupils_receiving_school_support": 15.0781000956,
      "pupils_with_statement_of_sen": 31,
      "geo_point_2d": [
        51.4254187146,
        -2.59280262818
      ],
      "ward_name": "Filwood",
      "sen_pupils_receiving_school_support": 473,
      "total_number_of_pupils": 3137,
      "year": "2018",
      "total_number_of_sen_pupils": 578
    },
    "record_timestamp": "2019-09-17T15:52:23.201+01:00"
  },
  {
    "datasetid": "pupils-with-special-educational-needs-in-bristol",
    "recordid": "e0a1b6e2d7bc899ad637d81f7f8cf477823b1f7e",
    "fields": {
      "ward_code": "E05010907",
      "pupils_with_ehcp0": 1.95570894449,
      "of_sen_pupils": 17.8314639057,
      "pupils_with_ehcp": 68,
      "of_sen_pupils_receiving_school_support": 15.2142651711,
      "pupils_with_statement_of_sen": 23,
      "geo_point_2d": [
        51.4545929175,
        -2.57123424149
      ],
      "ward_name": "Lawrence Hill",
      "sen_pupils_receiving_school_support": 529,
      "total_number_of_pupils": 3477,
      "year": "2018",
      "total_number_of_sen_pupils": 620
    },
    "record_timestamp": "2019-09-17T15:52:23.201+01:00"
  },
  {
    "datasetid": "pupils-with-special-educational-needs-in-bristol",
    "recordid": "4d83cfecd21b13cba278592b1a6b21487ac9ee39",
    "fields": {
      "ward_code": "E05010914",
      "pupils_with_ehcp0": 0.981193785773,
      "of_sen_pupils": 12.6737530662,
      "pupils_with_ehcp": 12,
      "of_sen_pupils_receiving_school_support": 11.447260834,
      "pupils_with_statement_of_sen": 3,
      "geo_point_2d": [
        51.4433220308,
        -2.60399054226
      ],
      "ward_name": "Southville",
      "sen_pupils_receiving_school_support": 140,
      "total_number_of_pupils": 1223,
      "year": "2018",
      "total_number_of_sen_pupils": 155
    },
    "record_timestamp": "2019-09-17T15:52:23.201+01:00"
  },
  {
    "datasetid": "pupils-with-special-educational-needs-in-bristol",
    "recordid": "659a666b4a29c302dc5b0486f5de6691e6eabf3e",
    "fields": {
      "ward_code": "E05010893",
      "pupils_with_ehcp0": 1.308411214,
      "of_sen_pupils": 8.971962616,
      "pupils_with_ehcp": 7,
      "of_sen_pupils_receiving_school_support": 7.663551401,
      "pupils_with_statement_of_sen": 0,
      "geo_point_2d": [
        51.4565158032,
        -2.61996331305
      ],
      "ward_name": "Clifton",
      "sen_pupils_receiving_school_support": 41,
      "total_number_of_pupils": 535,
      "year": "2019",
      "total_number_of_sen_pupils": 48
    },
    "record_timestamp": "2019-09-17T15:52:23.201+01:00"
  },
  {
    "datasetid": "pupils-with-special-educational-needs-in-bristol",
    "recordid": "3fadfc38b948b7c1596fa1466da4bc4b9eb0fdf0",
    "fields": {
      "ward_code": "E05010901",
      "pupils_with_ehcp0": 3.739754098,
      "of_sen_pupils": 15.163934426,
      "pupils_with_ehcp": 73,
      "of_sen_pupils_receiving_school_support": 11.424180327,
      "pupils_with_statement_of_sen": 0,
      "geo_point_2d": [
        51.5089736142,
        -2.62103514848
      ],
      "ward_name": "Henbury & Brentry",
      "sen_pupils_receiving_school_support": 223,
      "total_number_of_pupils": 1952,
      "year": "2019",
      "total_number_of_sen_pupils": 296
    },
    "record_timestamp": "2019-09-17T15:52:23.201+01:00"
  },
  {
    "datasetid": "pupils-with-special-educational-needs-in-bristol",
    "recordid": "d3d5e227beb0a37c47678921579ee4ce7df42b5c",
    "fields": {
      "ward_code": "E05010914",
      "pupils_with_ehcp0": 1.242236024,
      "of_sen_pupils": 11.335403726,
      "pupils_with_ehcp": 16,
      "of_sen_pupils_receiving_school_support": 10.093167701,
      "pupils_with_statement_of_sen": 0,
      "geo_point_2d": [
        51.4433220308,
        -2.60399054226
      ],
      "ward_name": "Southville",
      "sen_pupils_receiving_school_support": 130,
      "total_number_of_pupils": 1288,
      "year": "2019",
      "total_number_of_sen_pupils": 146
    },
    "record_timestamp": "2019-09-17T15:52:23.201+01:00"
  },
  {
    "datasetid": "pupils-with-special-educational-needs-in-bristol",
    "recordid": "d5f6eac4f17cf15b3e7caf8aabe49b05949a051a",
    "fields": {
      "ward_code": "E05010895",
      "pupils_with_ehcp0": 0.840336134454,
      "of_sen_pupils": 9,
      "pupils_with_ehcp": 5,
      "of_sen_pupils_receiving_school_support": 8.73949579832,
      "pupils_with_statement_of_sen": 4,
      "geo_point_2d": [
        51.4659633898,
        -2.59991083361
      ],
      "ward_name": "Cotham",
      "sen_pupils_receiving_school_support": 52,
      "total_number_of_pupils": 595,
      "year": "2017",
      "total_number_of_sen_pupils": 61
    },
    "record_timestamp": "2019-09-17T15:52:23.201+01:00"
  },
  {
    "datasetid": "pupils-with-special-educational-needs-in-bristol",
    "recordid": "6c955ec427fdf0dd2577487516ac64f8af84f371",
    "fields": {
      "ward_code": "E05010909",
      "pupils_with_ehcp0": 0.532687651332,
      "of_sen_pupils": 11.0572259942,
      "pupils_with_ehcp": 11,
      "of_sen_pupils_receiving_school_support": 8.9588377724,
      "pupils_with_statement_of_sen": 15,
      "geo_point_2d": [
        51.4752449941,
        -2.60115761678
      ],
      "ward_name": "Redland",
      "sen_pupils_receiving_school_support": 185,
      "total_number_of_pupils": 2065,
      "year": "2017",
      "total_number_of_sen_pupils": 211
    },
    "record_timestamp": "2019-09-17T15:52:23.201+01:00"
  },
  {
    "datasetid": "pupils-with-special-educational-needs-in-bristol",
    "recordid": "66cf09c04a0eff7f1e9edd8c77eeb951f9192e71",
    "fields": {
      "ward_code": "E05010916",
      "pupils_with_ehcp0": 1.37812230835,
      "of_sen_pupils": 12.6582278481,
      "pupils_with_ehcp": 16,
      "of_sen_pupils_receiving_school_support": 10.5943152455,
      "pupils_with_statement_of_sen": 13,
      "geo_point_2d": [
        51.4774256958,
        -2.63604316329
      ],
      "ward_name": "Stoke Bishop",
      "sen_pupils_receiving_school_support": 123,
      "total_number_of_pupils": 1161,
      "year": "2017",
      "total_number_of_sen_pupils": 152
    },
    "record_timestamp": "2019-09-17T15:52:23.201+01:00"
  },
  {
    "datasetid": "pupils-with-special-educational-needs-in-bristol",
    "recordid": "817a8aee5b481b636216dcbf55fb476f019ebcac",
    "fields": {
      "ward_code": "E05010885",
      "pupils_with_ehcp0": 1.9129019129,
      "of_sen_pupils": 15.2625152625,
      "pupils_with_ehcp": 47,
      "of_sen_pupils_receiving_school_support": 12.9426129426,
      "pupils_with_statement_of_sen": 10,
      "geo_point_2d": [
        51.4683098847,
        -2.58267316047
      ],
      "ward_name": "Ashley",
      "sen_pupils_receiving_school_support": 318,
      "total_number_of_pupils": 2457,
      "year": "2018",
      "total_number_of_sen_pupils": 375
    },
    "record_timestamp": "2019-09-17T15:52:23.201+01:00"
  },
  {
    "datasetid": "pupils-with-special-educational-needs-in-bristol",
    "recordid": "7efd58e5559bd671585f07b8a2998cb40f7276e0",
    "fields": {
      "ward_code": "E05010903",
      "pupils_with_ehcp0": 2.95566502463,
      "of_sen_pupils": 17.3645320197,
      "pupils_with_ehcp": 48,
      "of_sen_pupils_receiving_school_support": 13.5467980296,
      "pupils_with_statement_of_sen": 14,
      "geo_point_2d": [
        51.4737018096,
        -2.5225753211
      ],
      "ward_name": "Hillfields",
      "sen_pupils_receiving_school_support": 220,
      "total_number_of_pupils": 1624,
      "year": "2018",
      "total_number_of_sen_pupils": 282
    },
    "record_timestamp": "2019-09-17T15:52:23.201+01:00"
  },
  {
    "datasetid": "pupils-with-special-educational-needs-in-bristol",
    "recordid": "71a8adb73a6fb3c3b4cab205c85bdb5e74bfa69f",
    "fields": {
      "ward_code": "E05010905",
      "pupils_with_ehcp0": 1.42857142857,
      "of_sen_pupils": 9.04761904762,
      "pupils_with_ehcp": 3,
      "of_sen_pupils_receiving_school_support": 7.14285714286,
      "pupils_with_statement_of_sen": 1,
      "geo_point_2d": [
        51.4497285026,
        -2.60957858467
      ],
      "ward_name": "Hotwells & Harbourside",
      "sen_pupils_receiving_school_support": 15,
      "total_number_of_pupils": 210,
      "year": "2018",
      "total_number_of_sen_pupils": 19
    },
    "record_timestamp": "2019-09-17T15:52:23.201+01:00"
  },
  {
    "datasetid": "pupils-with-special-educational-needs-in-bristol",
    "recordid": "86de69d24be887afeb20fe3f1143399f1128a3fa",
    "fields": {
      "ward_code": "E05010908",
      "pupils_with_ehcp0": 3.05635148042,
      "of_sen_pupils": 17.2874880611,
      "pupils_with_ehcp": 64,
      "of_sen_pupils_receiving_school_support": 13.3715377268,
      "pupils_with_statement_of_sen": 18,
      "geo_point_2d": [
        51.4858562509,
        -2.56566726138
      ],
      "ward_name": "Lockleaze",
      "sen_pupils_receiving_school_support": 280,
      "total_number_of_pupils": 2094,
      "year": "2018",
      "total_number_of_sen_pupils": 362
    },
    "record_timestamp": "2019-09-17T15:52:23.201+01:00"
  },
  {
    "datasetid": "pupils-with-special-educational-needs-in-bristol",
    "recordid": "6103241b7fa38192730e09d37f3d3d961b642dad",
    "fields": {
      "ward_code": "E05010917",
      "pupils_with_ehcp0": 0.849649057998,
      "of_sen_pupils": 10.6021425933,
      "pupils_with_ehcp": 23,
      "of_sen_pupils_receiving_school_support": 9.34613963798,
      "pupils_with_statement_of_sen": 11,
      "geo_point_2d": [
        51.4897948304,
        -2.61748273112
      ],
      "ward_name": "Westbury-on-Trym & Henleaze",
      "sen_pupils_receiving_school_support": 253,
      "total_number_of_pupils": 2707,
      "year": "2018",
      "total_number_of_sen_pupils": 287
    },
    "record_timestamp": "2019-09-17T15:52:23.201+01:00"
  },
  {
    "datasetid": "pupils-with-special-educational-needs-in-bristol",
    "recordid": "6c8f91099319eecc9708d58bd0270438aa1c106c",
    "fields": {
      "ward_code": "E05010890",
      "pupils_with_ehcp0": 2.419354838,
      "of_sen_pupils": 17.473118279,
      "pupils_with_ehcp": 36,
      "of_sen_pupils_receiving_school_support": 15.05376344,
      "pupils_with_statement_of_sen": 0,
      "geo_point_2d": [
        51.4402835576,
        -2.53865369047
      ],
      "ward_name": "Brislington East",
      "sen_pupils_receiving_school_support": 224,
      "total_number_of_pupils": 1488,
      "year": "2019",
      "total_number_of_sen_pupils": 260
    },
    "record_timestamp": "2019-09-17T15:52:23.201+01:00"
  },
  {
    "datasetid": "pupils-with-special-educational-needs-in-bristol",
    "recordid": "e9952b403649896686a9c6f8b88f42bed1db9330",
    "fields": {
      "ward_code": "E05010896",
      "pupils_with_ehcp0": 1.964085297,
      "of_sen_pupils": 16.666666666,
      "pupils_with_ehcp": 35,
      "of_sen_pupils_receiving_school_support": 14.702581369,
      "pupils_with_statement_of_sen": 0,
      "geo_point_2d": [
        51.4623719964,
        -2.55850571231
      ],
      "ward_name": "Easton",
      "sen_pupils_receiving_school_support": 262,
      "total_number_of_pupils": 1782,
      "year": "2019",
      "total_number_of_sen_pupils": 297
    },
    "record_timestamp": "2019-09-17T15:52:23.201+01:00"
  },
  {
    "datasetid": "pupils-with-special-educational-needs-in-bristol",
    "recordid": "3d74494b9f5dce3feb658dc5b4e8eae0f0bd1c0c",
    "fields": {
      "ward_code": "E05010899",
      "pupils_with_ehcp0": 3.857566765,
      "of_sen_pupils": 16.394658753,
      "pupils_with_ehcp": 52,
      "of_sen_pupils_receiving_school_support": 12.537091988,
      "pupils_with_statement_of_sen": 0,
      "geo_point_2d": [
        51.4870905493,
        -2.53119915299
      ],
      "ward_name": "Frome Vale",
      "sen_pupils_receiving_school_support": 169,
      "total_number_of_pupils": 1348,
      "year": "2019",
      "total_number_of_sen_pupils": 221
    },
    "record_timestamp": "2019-09-17T15:52:23.201+01:00"
  },
  {
    "datasetid": "pupils-with-special-educational-needs-in-bristol",
    "recordid": "050772a138a0230c8c3db43bbbd151df7b38dc94",
    "fields": {
      "ward_code": "E05010917",
      "pupils_with_ehcp0": 1.352339181,
      "of_sen_pupils": 10.05116959,
      "pupils_with_ehcp": 37,
      "of_sen_pupils_receiving_school_support": 8.698830409,
      "pupils_with_statement_of_sen": 0,
      "geo_point_2d": [
        51.4897948304,
        -2.61748273112
      ],
      "ward_name": "Westbury-on-Trym & Henleaze",
      "sen_pupils_receiving_school_support": 238,
      "total_number_of_pupils": 2736,
      "year": "2019",
      "total_number_of_sen_pupils": 275
    },
    "record_timestamp": "2019-09-17T15:52:23.201+01:00"
  }
]
