[
  {
    "datasetid": "household-size-and-bedrooms-2011-census-by-2016-ward",
    "recordid": "dabc98f1ef67030924ebf9251cf6782b670ab5aa",
    "fields": {
      "average_household_size_persons_per_household": 2,
      "total_number_of_households": 2915,
      "2016_ward_code": "E05010912",
      "3_bedroom_household": 800,
      "average_number_of_bedrooms_per_household": 2.1,
      "with_3_bedrooms": 27.4,
      "4_or_more_bedroom_household": 134,
      "overcrowded_households_ie_occupancy_rating_bedrooms_of_1_or_less0": 4.9,
      "overcrowded_households_ie_occupancy_rating_bedrooms_of_1_or_less": 143,
      "with_1_bedroom": 23.3,
      "with_4_or_more_bedrooms": 4.6,
      "1_bedroom_household": 679,
      "2_bedroom_household": 1291,
      "2016_ward_name": "St George West",
      "with_2_bedrooms": 44.3
    },
    "record_timestamp": "2019-01-07T15:51:23+00:00"
  },
  {
    "datasetid": "household-size-and-bedrooms-2011-census-by-2016-ward",
    "recordid": "2e04328d7bd7164ea36596a3376d206a28bf7cc5",
    "fields": {
      "average_household_size_persons_per_household": 2.3,
      "total_number_of_households": 7077,
      "2016_ward_code": "E05010907",
      "3_bedroom_household": 1392,
      "average_number_of_bedrooms_per_household": 2,
      "with_3_bedrooms": 19.7,
      "4_or_more_bedroom_household": 335,
      "overcrowded_households_ie_occupancy_rating_bedrooms_of_1_or_less0": 16.5,
      "overcrowded_households_ie_occupancy_rating_bedrooms_of_1_or_less": 1167,
      "with_1_bedroom": 32.3,
      "with_4_or_more_bedrooms": 4.7,
      "1_bedroom_household": 2288,
      "2_bedroom_household": 3022,
      "2016_ward_name": "Lawrence Hill",
      "with_2_bedrooms": 42.7
    },
    "record_timestamp": "2019-01-07T15:51:23+00:00"
  },
  {
    "datasetid": "household-size-and-bedrooms-2011-census-by-2016-ward",
    "recordid": "c14e0ab5b9e488c912b090febd9c52a848eb2240",
    "fields": {
      "average_household_size_persons_per_household": 2,
      "total_number_of_households": 5576,
      "2016_ward_code": "E05010892",
      "3_bedroom_household": 519,
      "average_number_of_bedrooms_per_household": 2.1,
      "with_3_bedrooms": 9.3,
      "4_or_more_bedroom_household": 704,
      "overcrowded_households_ie_occupancy_rating_bedrooms_of_1_or_less0": 7.8,
      "overcrowded_households_ie_occupancy_rating_bedrooms_of_1_or_less": 436,
      "with_1_bedroom": 43.3,
      "with_4_or_more_bedrooms": 12.6,
      "1_bedroom_household": 2413,
      "2_bedroom_household": 1881,
      "2016_ward_name": "Central",
      "with_2_bedrooms": 33.7
    },
    "record_timestamp": "2019-01-07T15:51:23+00:00"
  },
  {
    "datasetid": "household-size-and-bedrooms-2011-census-by-2016-ward",
    "recordid": "5cdd0ddf1487ac78aa0dd95cd273f0dd52bcc66b",
    "fields": {
      "average_household_size_persons_per_household": 2.5,
      "total_number_of_households": 5262,
      "2016_ward_code": "E05010906",
      "3_bedroom_household": 3421,
      "average_number_of_bedrooms_per_household": 2.8,
      "with_3_bedrooms": 65,
      "4_or_more_bedroom_household": 687,
      "overcrowded_households_ie_occupancy_rating_bedrooms_of_1_or_less0": 4.1,
      "overcrowded_households_ie_occupancy_rating_bedrooms_of_1_or_less": 218,
      "with_1_bedroom": 10.8,
      "with_4_or_more_bedrooms": 13.1,
      "1_bedroom_household": 568,
      "2_bedroom_household": 578,
      "2016_ward_name": "Knowle",
      "with_2_bedrooms": 11
    },
    "record_timestamp": "2019-01-07T15:51:23+00:00"
  },
  {
    "datasetid": "household-size-and-bedrooms-2011-census-by-2016-ward",
    "recordid": "4e32ec3ab269c6b66ee33d610b5b213d28b1e0d2",
    "fields": {
      "average_household_size_persons_per_household": 2.3,
      "total_number_of_households": 7287,
      "2016_ward_code": "E05010902",
      "3_bedroom_household": 4325,
      "average_number_of_bedrooms_per_household": 2.8,
      "with_3_bedrooms": 59.4,
      "4_or_more_bedroom_household": 804,
      "overcrowded_households_ie_occupancy_rating_bedrooms_of_1_or_less0": 2.3,
      "overcrowded_households_ie_occupancy_rating_bedrooms_of_1_or_less": 171,
      "with_1_bedroom": 6.9,
      "with_4_or_more_bedrooms": 11,
      "1_bedroom_household": 506,
      "2_bedroom_household": 1642,
      "2016_ward_name": "Hengrove & Whitchurch Park",
      "with_2_bedrooms": 22.5
    },
    "record_timestamp": "2019-01-07T15:51:23+00:00"
  },
  {
    "datasetid": "household-size-and-bedrooms-2011-census-by-2016-ward",
    "recordid": "15d68fd374deb66754bd1bead640505c725da2c3",
    "fields": {
      "average_household_size_persons_per_household": 2.5,
      "total_number_of_households": 4724,
      "2016_ward_code": "E05010888",
      "3_bedroom_household": 1819,
      "average_number_of_bedrooms_per_household": 2.9,
      "with_3_bedrooms": 38.5,
      "4_or_more_bedroom_household": 1208,
      "overcrowded_households_ie_occupancy_rating_bedrooms_of_1_or_less0": 3.3,
      "overcrowded_households_ie_occupancy_rating_bedrooms_of_1_or_less": 158,
      "with_1_bedroom": 11.8,
      "with_4_or_more_bedrooms": 25.6,
      "1_bedroom_household": 558,
      "2_bedroom_household": 1126,
      "2016_ward_name": "Bishopston & Ashley Down",
      "with_2_bedrooms": 23.8
    },
    "record_timestamp": "2019-01-07T15:51:23+00:00"
  },
  {
    "datasetid": "household-size-and-bedrooms-2011-census-by-2016-ward",
    "recordid": "41aed24448bb7d794cc057549883167153d8c8f9",
    "fields": {
      "average_household_size_persons_per_household": 2.4,
      "total_number_of_households": 5113,
      "2016_ward_code": "E05010913",
      "3_bedroom_household": 3023,
      "average_number_of_bedrooms_per_household": 2.6,
      "with_3_bedrooms": 59.1,
      "4_or_more_bedroom_household": 370,
      "overcrowded_households_ie_occupancy_rating_bedrooms_of_1_or_less0": 5.7,
      "overcrowded_households_ie_occupancy_rating_bedrooms_of_1_or_less": 289,
      "with_1_bedroom": 14.1,
      "with_4_or_more_bedrooms": 7.2,
      "1_bedroom_household": 719,
      "2_bedroom_household": 991,
      "2016_ward_name": "Southmead",
      "with_2_bedrooms": 19.4
    },
    "record_timestamp": "2019-01-07T15:51:23+00:00"
  },
  {
    "datasetid": "household-size-and-bedrooms-2011-census-by-2016-ward",
    "recordid": "01e1518c0756f6361d71733cd3d2bd3d133dfd05",
    "fields": {
      "average_household_size_persons_per_household": 2.4,
      "total_number_of_households": 8035,
      "2016_ward_code": "E05010917",
      "3_bedroom_household": 2816,
      "average_number_of_bedrooms_per_household": 3.3,
      "with_3_bedrooms": 35,
      "4_or_more_bedroom_household": 3255,
      "overcrowded_households_ie_occupancy_rating_bedrooms_of_1_or_less0": 1.2,
      "overcrowded_households_ie_occupancy_rating_bedrooms_of_1_or_less": 99,
      "with_1_bedroom": 7.3,
      "with_4_or_more_bedrooms": 40.5,
      "1_bedroom_household": 586,
      "2_bedroom_household": 1368,
      "2016_ward_name": "Westbury-on-Trym & Henleaze",
      "with_2_bedrooms": 17
    },
    "record_timestamp": "2019-01-07T15:51:23+00:00"
  },
  {
    "datasetid": "household-size-and-bedrooms-2011-census-by-2016-ward",
    "recordid": "b968df42e136be1b02f339e257b7b2a4574a93d9",
    "fields": {
      "average_household_size_persons_per_household": 2.3,
      "total_number_of_households": 8668,
      "2016_ward_code": "E05010886",
      "3_bedroom_household": 4420,
      "average_number_of_bedrooms_per_household": 2.6,
      "with_3_bedrooms": 51,
      "4_or_more_bedroom_household": 945,
      "overcrowded_households_ie_occupancy_rating_bedrooms_of_1_or_less0": 4.3,
      "overcrowded_households_ie_occupancy_rating_bedrooms_of_1_or_less": 371,
      "with_1_bedroom": 10.3,
      "with_4_or_more_bedrooms": 10.9,
      "1_bedroom_household": 893,
      "2_bedroom_household": 2399,
      "2016_ward_name": "Avonmouth & Lawrence Weston",
      "with_2_bedrooms": 27.7
    },
    "record_timestamp": "2019-01-07T15:51:23+00:00"
  },
  {
    "datasetid": "household-size-and-bedrooms-2011-census-by-2016-ward",
    "recordid": "d8fced533cdc4c430d50ad6a5e13c697cb80a8b3",
    "fields": {
      "average_household_size_persons_per_household": 2.3,
      "total_number_of_households": 5299,
      "2016_ward_code": "E05010910",
      "3_bedroom_household": 2824,
      "average_number_of_bedrooms_per_household": 2.6,
      "with_3_bedrooms": 53.3,
      "4_or_more_bedroom_household": 371,
      "overcrowded_households_ie_occupancy_rating_bedrooms_of_1_or_less0": 4.2,
      "overcrowded_households_ie_occupancy_rating_bedrooms_of_1_or_less": 225,
      "with_1_bedroom": 13.5,
      "with_4_or_more_bedrooms": 7,
      "1_bedroom_household": 713,
      "2_bedroom_household": 1378,
      "2016_ward_name": "St George Central",
      "with_2_bedrooms": 26
    },
    "record_timestamp": "2019-01-07T15:51:23+00:00"
  },
  {
    "datasetid": "household-size-and-bedrooms-2011-census-by-2016-ward",
    "recordid": "02a1ac3f1e3066c5ffbc8c16766937ce6cb4700c",
    "fields": {
      "average_household_size_persons_per_household": 2.2,
      "total_number_of_households": 5834,
      "2016_ward_code": "E05010918",
      "3_bedroom_household": 2117,
      "average_number_of_bedrooms_per_household": 2.4,
      "with_3_bedrooms": 36.3,
      "4_or_more_bedroom_household": 491,
      "overcrowded_households_ie_occupancy_rating_bedrooms_of_1_or_less0": 4.7,
      "overcrowded_households_ie_occupancy_rating_bedrooms_of_1_or_less": 277,
      "with_1_bedroom": 19.7,
      "with_4_or_more_bedrooms": 8.4,
      "1_bedroom_household": 1151,
      "2_bedroom_household": 2067,
      "2016_ward_name": "Windmill Hill",
      "with_2_bedrooms": 35.4
    },
    "record_timestamp": "2019-01-07T15:51:23+00:00"
  },
  {
    "datasetid": "household-size-and-bedrooms-2011-census-by-2016-ward",
    "recordid": "3fba9172aeb6af694bbaaa2f32e5170b279f7169",
    "fields": {
      "average_household_size_persons_per_household": 2.1,
      "total_number_of_households": 5331,
      "2016_ward_code": "E05010914",
      "3_bedroom_household": 1640,
      "average_number_of_bedrooms_per_household": 2.3,
      "with_3_bedrooms": 30.8,
      "4_or_more_bedroom_household": 610,
      "overcrowded_households_ie_occupancy_rating_bedrooms_of_1_or_less0": 4.3,
      "overcrowded_households_ie_occupancy_rating_bedrooms_of_1_or_less": 227,
      "with_1_bedroom": 26.9,
      "with_4_or_more_bedrooms": 11.4,
      "1_bedroom_household": 1436,
      "2_bedroom_household": 1635,
      "2016_ward_name": "Southville",
      "with_2_bedrooms": 30.7
    },
    "record_timestamp": "2019-01-07T15:51:23+00:00"
  },
  {
    "datasetid": "household-size-and-bedrooms-2011-census-by-2016-ward",
    "recordid": "c61f6b3dde4576e8271a81b4c9ae9d47b7e2e7fe",
    "fields": {
      "average_household_size_persons_per_household": 2.1,
      "total_number_of_households": 5288,
      "2016_ward_code": "E05010887",
      "3_bedroom_household": 2216,
      "average_number_of_bedrooms_per_household": 2.4,
      "with_3_bedrooms": 41.9,
      "4_or_more_bedroom_household": 395,
      "overcrowded_households_ie_occupancy_rating_bedrooms_of_1_or_less0": 3.5,
      "overcrowded_households_ie_occupancy_rating_bedrooms_of_1_or_less": 184,
      "with_1_bedroom": 14.1,
      "with_4_or_more_bedrooms": 7.5,
      "1_bedroom_household": 744,
      "2_bedroom_household": 1923,
      "2016_ward_name": "Bedminster",
      "with_2_bedrooms": 36.4
    },
    "record_timestamp": "2019-01-07T15:51:23+00:00"
  },
  {
    "datasetid": "household-size-and-bedrooms-2011-census-by-2016-ward",
    "recordid": "d35fc38e86657a49f6f4df7b71ee846b839e41ce",
    "fields": {
      "average_household_size_persons_per_household": 2.5,
      "total_number_of_households": 5139,
      "2016_ward_code": "E05010898",
      "3_bedroom_household": 3441,
      "average_number_of_bedrooms_per_household": 2.7,
      "with_3_bedrooms": 67,
      "4_or_more_bedroom_household": 241,
      "overcrowded_households_ie_occupancy_rating_bedrooms_of_1_or_less0": 5.9,
      "overcrowded_households_ie_occupancy_rating_bedrooms_of_1_or_less": 303,
      "with_1_bedroom": 9.4,
      "with_4_or_more_bedrooms": 4.7,
      "1_bedroom_household": 484,
      "2_bedroom_household": 962,
      "2016_ward_name": "Filwood",
      "with_2_bedrooms": 18.7
    },
    "record_timestamp": "2019-01-07T15:51:23+00:00"
  },
  {
    "datasetid": "household-size-and-bedrooms-2011-census-by-2016-ward",
    "recordid": "19e942cc626f0a57874776af30b9aa5ab660903d",
    "fields": {
      "average_household_size_persons_per_household": 2.3,
      "total_number_of_households": 4641,
      "2016_ward_code": "E05010891",
      "3_bedroom_household": 2427,
      "average_number_of_bedrooms_per_household": 2.6,
      "with_3_bedrooms": 52.3,
      "4_or_more_bedroom_household": 534,
      "overcrowded_households_ie_occupancy_rating_bedrooms_of_1_or_less0": 3.4,
      "overcrowded_households_ie_occupancy_rating_bedrooms_of_1_or_less": 157,
      "with_1_bedroom": 13.4,
      "with_4_or_more_bedrooms": 11.5,
      "1_bedroom_household": 621,
      "2_bedroom_household": 1047,
      "2016_ward_name": "Brislington West",
      "with_2_bedrooms": 22.6
    },
    "record_timestamp": "2019-01-07T15:51:23+00:00"
  },
  {
    "datasetid": "household-size-and-bedrooms-2011-census-by-2016-ward",
    "recordid": "47402bd47dfe84bdf5ac23066489869ef7a14c67",
    "fields": {
      "average_household_size_persons_per_household": 2.2,
      "total_number_of_households": 5007,
      "2016_ward_code": "E05010894",
      "3_bedroom_household": 707,
      "average_number_of_bedrooms_per_household": 2.5,
      "with_3_bedrooms": 14.1,
      "4_or_more_bedroom_household": 1001,
      "overcrowded_households_ie_occupancy_rating_bedrooms_of_1_or_less0": 6.7,
      "overcrowded_households_ie_occupancy_rating_bedrooms_of_1_or_less": 335,
      "with_1_bedroom": 29.2,
      "with_4_or_more_bedrooms": 20,
      "1_bedroom_household": 1460,
      "2_bedroom_household": 1807,
      "2016_ward_name": "Clifton Down",
      "with_2_bedrooms": 36.1
    },
    "record_timestamp": "2019-01-07T15:51:23+00:00"
  },
  {
    "datasetid": "household-size-and-bedrooms-2011-census-by-2016-ward",
    "recordid": "d023736fc4059faa71fdc1e4e2af13f90fb7bceb",
    "fields": {
      "average_household_size_persons_per_household": 2.5,
      "total_number_of_households": 4837,
      "2016_ward_code": "E05010908",
      "3_bedroom_household": 2946,
      "average_number_of_bedrooms_per_household": 2.7,
      "with_3_bedrooms": 60.9,
      "4_or_more_bedroom_household": 464,
      "overcrowded_households_ie_occupancy_rating_bedrooms_of_1_or_less0": 6.8,
      "overcrowded_households_ie_occupancy_rating_bedrooms_of_1_or_less": 331,
      "with_1_bedroom": 10.5,
      "with_4_or_more_bedrooms": 9.6,
      "1_bedroom_household": 508,
      "2_bedroom_household": 910,
      "2016_ward_name": "Lockleaze",
      "with_2_bedrooms": 18.8
    },
    "record_timestamp": "2019-01-07T15:51:23+00:00"
  },
  {
    "datasetid": "household-size-and-bedrooms-2011-census-by-2016-ward",
    "recordid": "533170ffedc7ea259d894fe6767de4525e4bad5c",
    "fields": {
      "average_household_size_persons_per_household": 2.3,
      "total_number_of_households": 4905,
      "2016_ward_code": "E05010915",
      "3_bedroom_household": 2622,
      "average_number_of_bedrooms_per_household": 2.8,
      "with_3_bedrooms": 53.5,
      "4_or_more_bedroom_household": 882,
      "overcrowded_households_ie_occupancy_rating_bedrooms_of_1_or_less0": 2.8,
      "overcrowded_households_ie_occupancy_rating_bedrooms_of_1_or_less": 139,
      "with_1_bedroom": 12.1,
      "with_4_or_more_bedrooms": 18,
      "1_bedroom_household": 592,
      "2_bedroom_household": 803,
      "2016_ward_name": "Stockwood",
      "with_2_bedrooms": 16.4
    },
    "record_timestamp": "2019-01-07T15:51:23+00:00"
  },
  {
    "datasetid": "household-size-and-bedrooms-2011-census-by-2016-ward",
    "recordid": "92913b935f86202fcf3bb9370db97167214d074b",
    "fields": {
      "average_household_size_persons_per_household": 2.4,
      "total_number_of_households": 4568,
      "2016_ward_code": "E05010889",
      "3_bedroom_household": 2933,
      "average_number_of_bedrooms_per_household": 2.8,
      "with_3_bedrooms": 64.2,
      "4_or_more_bedroom_household": 521,
      "overcrowded_households_ie_occupancy_rating_bedrooms_of_1_or_less0": 2.8,
      "overcrowded_households_ie_occupancy_rating_bedrooms_of_1_or_less": 128,
      "with_1_bedroom": 6.2,
      "with_4_or_more_bedrooms": 11.4,
      "1_bedroom_household": 281,
      "2_bedroom_household": 825,
      "2016_ward_name": "Bishopsworth",
      "with_2_bedrooms": 18.1
    },
    "record_timestamp": "2019-01-07T15:51:23+00:00"
  },
  {
    "datasetid": "household-size-and-bedrooms-2011-census-by-2016-ward",
    "recordid": "054362bf4a2faed82bdf5e39023db9161786cae5",
    "fields": {
      "average_household_size_persons_per_household": 2.3,
      "total_number_of_households": 4972,
      "2016_ward_code": "E05010890",
      "3_bedroom_household": 2665,
      "average_number_of_bedrooms_per_household": 2.6,
      "with_3_bedrooms": 53.6,
      "4_or_more_bedroom_household": 365,
      "overcrowded_households_ie_occupancy_rating_bedrooms_of_1_or_less0": 3.2,
      "overcrowded_households_ie_occupancy_rating_bedrooms_of_1_or_less": 159,
      "with_1_bedroom": 10.4,
      "with_4_or_more_bedrooms": 7.3,
      "1_bedroom_household": 516,
      "2_bedroom_household": 1422,
      "2016_ward_name": "Brislington East",
      "with_2_bedrooms": 28.6
    },
    "record_timestamp": "2019-01-07T15:51:23+00:00"
  },
  {
    "datasetid": "household-size-and-bedrooms-2011-census-by-2016-ward",
    "recordid": "2c1661d94af3743a938a6a33f3b1f9939c5b6656",
    "fields": {
      "average_household_size_persons_per_household": 2.4,
      "total_number_of_households": 4855,
      "2016_ward_code": "E05010895",
      "3_bedroom_household": 654,
      "average_number_of_bedrooms_per_household": 2.6,
      "with_3_bedrooms": 13.5,
      "4_or_more_bedroom_household": 1319,
      "overcrowded_households_ie_occupancy_rating_bedrooms_of_1_or_less0": 6.5,
      "overcrowded_households_ie_occupancy_rating_bedrooms_of_1_or_less": 318,
      "with_1_bedroom": 29.3,
      "with_4_or_more_bedrooms": 27.2,
      "1_bedroom_household": 1424,
      "2_bedroom_household": 1430,
      "2016_ward_name": "Cotham",
      "with_2_bedrooms": 29.5
    },
    "record_timestamp": "2019-01-07T15:51:23+00:00"
  },
  {
    "datasetid": "household-size-and-bedrooms-2011-census-by-2016-ward",
    "recordid": "56196f5af8e93dc0fe28dd0ee157b55d390b9b15",
    "fields": {
      "average_household_size_persons_per_household": 2.3,
      "total_number_of_households": 5859,
      "2016_ward_code": "E05010896",
      "3_bedroom_household": 2110,
      "average_number_of_bedrooms_per_household": 2.4,
      "with_3_bedrooms": 36,
      "4_or_more_bedroom_household": 375,
      "overcrowded_households_ie_occupancy_rating_bedrooms_of_1_or_less0": 9.4,
      "overcrowded_households_ie_occupancy_rating_bedrooms_of_1_or_less": 551,
      "with_1_bedroom": 14.9,
      "with_4_or_more_bedrooms": 6.4,
      "1_bedroom_household": 875,
      "2_bedroom_household": 2480,
      "2016_ward_name": "Easton",
      "with_2_bedrooms": 42.3
    },
    "record_timestamp": "2019-01-07T15:51:23+00:00"
  },
  {
    "datasetid": "household-size-and-bedrooms-2011-census-by-2016-ward",
    "recordid": "258a66b8e168fc933a3aeae6ad28ab8a9298dc80",
    "fields": {
      "average_household_size_persons_per_household": 2.2,
      "total_number_of_households": 5176,
      "2016_ward_code": "E05010899",
      "3_bedroom_household": 2112,
      "average_number_of_bedrooms_per_household": 2.6,
      "with_3_bedrooms": 40.8,
      "4_or_more_bedroom_household": 797,
      "overcrowded_households_ie_occupancy_rating_bedrooms_of_1_or_less0": 4.2,
      "overcrowded_households_ie_occupancy_rating_bedrooms_of_1_or_less": 218,
      "with_1_bedroom": 15,
      "with_4_or_more_bedrooms": 15.4,
      "1_bedroom_household": 775,
      "2_bedroom_household": 1479,
      "2016_ward_name": "Frome Vale",
      "with_2_bedrooms": 28.6
    },
    "record_timestamp": "2019-01-07T15:51:23+00:00"
  },
  {
    "datasetid": "household-size-and-bedrooms-2011-census-by-2016-ward",
    "recordid": "bb2ce99ef6f6480f8f96f040e4569325d6b99652",
    "fields": {
      "average_household_size_persons_per_household": 2.4,
      "total_number_of_households": 4907,
      "2016_ward_code": "E05010904",
      "3_bedroom_household": 2510,
      "average_number_of_bedrooms_per_household": 2.8,
      "with_3_bedrooms": 51.2,
      "4_or_more_bedroom_household": 798,
      "overcrowded_households_ie_occupancy_rating_bedrooms_of_1_or_less0": 4.8,
      "overcrowded_households_ie_occupancy_rating_bedrooms_of_1_or_less": 237,
      "with_1_bedroom": 7.9,
      "with_4_or_more_bedrooms": 16.3,
      "1_bedroom_household": 389,
      "2_bedroom_household": 1207,
      "2016_ward_name": "Horfield",
      "with_2_bedrooms": 24.6
    },
    "record_timestamp": "2019-01-07T15:51:23+00:00"
  },
  {
    "datasetid": "household-size-and-bedrooms-2011-census-by-2016-ward",
    "recordid": "43cb351736dd929cbf52765c2a2b1f7af1f6bcbe",
    "fields": {
      "average_household_size_persons_per_household": 2.3,
      "total_number_of_households": 2513,
      "2016_ward_code": "E05010911",
      "3_bedroom_household": 1491,
      "average_number_of_bedrooms_per_household": 2.7,
      "with_3_bedrooms": 59.3,
      "4_or_more_bedroom_household": 236,
      "overcrowded_households_ie_occupancy_rating_bedrooms_of_1_or_less0": 3.1,
      "overcrowded_households_ie_occupancy_rating_bedrooms_of_1_or_less": 78,
      "with_1_bedroom": 9.5,
      "with_4_or_more_bedrooms": 9.4,
      "1_bedroom_household": 239,
      "2_bedroom_household": 545,
      "2016_ward_name": "St George Troopers Hill",
      "with_2_bedrooms": 21.7
    },
    "record_timestamp": "2019-01-07T15:51:23+00:00"
  },
  {
    "datasetid": "household-size-and-bedrooms-2011-census-by-2016-ward",
    "recordid": "211e1c9584b43dac7b8120fe443ebb90170a9a77",
    "fields": {
      "average_household_size_persons_per_household": 1.9,
      "total_number_of_households": 2380,
      "2016_ward_code": "E05010905",
      "3_bedroom_household": 303,
      "average_number_of_bedrooms_per_household": 2.2,
      "with_3_bedrooms": 12.7,
      "4_or_more_bedroom_household": 340,
      "overcrowded_households_ie_occupancy_rating_bedrooms_of_1_or_less0": 3.8,
      "overcrowded_households_ie_occupancy_rating_bedrooms_of_1_or_less": 90,
      "with_1_bedroom": 31.1,
      "with_4_or_more_bedrooms": 14.3,
      "1_bedroom_household": 740,
      "2_bedroom_household": 984,
      "2016_ward_name": "Hotwells & Harbourside",
      "with_2_bedrooms": 41.3
    },
    "record_timestamp": "2019-01-07T15:51:23+00:00"
  },
  {
    "datasetid": "household-size-and-bedrooms-2011-census-by-2016-ward",
    "recordid": "b72305107aff02658b04c55211045c3a33e939da",
    "fields": {
      "average_household_size_persons_per_household": 2,
      "total_number_of_households": 5914,
      "2016_ward_code": "E05010893",
      "3_bedroom_household": 882,
      "average_number_of_bedrooms_per_household": 2.4,
      "with_3_bedrooms": 14.9,
      "4_or_more_bedroom_household": 1031,
      "overcrowded_households_ie_occupancy_rating_bedrooms_of_1_or_less0": 4.4,
      "overcrowded_households_ie_occupancy_rating_bedrooms_of_1_or_less": 258,
      "with_1_bedroom": 27.1,
      "with_4_or_more_bedrooms": 17.4,
      "1_bedroom_household": 1603,
      "2_bedroom_household": 2371,
      "2016_ward_name": "Clifton",
      "with_2_bedrooms": 40.1
    },
    "record_timestamp": "2019-01-07T15:51:23+00:00"
  },
  {
    "datasetid": "household-size-and-bedrooms-2011-census-by-2016-ward",
    "recordid": "98a4f7640f1546bc8774c1234e13e1919cc7f100",
    "fields": {
      "average_household_size_persons_per_household": 2.5,
      "total_number_of_households": 5085,
      "2016_ward_code": "E05010909",
      "3_bedroom_household": 1320,
      "average_number_of_bedrooms_per_household": 3.1,
      "with_3_bedrooms": 26,
      "4_or_more_bedroom_household": 1808,
      "overcrowded_households_ie_occupancy_rating_bedrooms_of_1_or_less0": 3,
      "overcrowded_households_ie_occupancy_rating_bedrooms_of_1_or_less": 152,
      "with_1_bedroom": 16.3,
      "with_4_or_more_bedrooms": 35.6,
      "1_bedroom_household": 828,
      "2_bedroom_household": 1109,
      "2016_ward_name": "Redland",
      "with_2_bedrooms": 21.8
    },
    "record_timestamp": "2019-01-07T15:51:23+00:00"
  },
  {
    "datasetid": "household-size-and-bedrooms-2011-census-by-2016-ward",
    "recordid": "dc9595ee027fd08f5b37467823be9de50e044c63",
    "fields": {
      "average_household_size_persons_per_household": 2.3,
      "total_number_of_households": 7607,
      "2016_ward_code": "E05010900",
      "3_bedroom_household": 3740,
      "average_number_of_bedrooms_per_household": 2.5,
      "with_3_bedrooms": 49.2,
      "4_or_more_bedroom_household": 489,
      "overcrowded_households_ie_occupancy_rating_bedrooms_of_1_or_less0": 5.7,
      "overcrowded_households_ie_occupancy_rating_bedrooms_of_1_or_less": 436,
      "with_1_bedroom": 14.2,
      "with_4_or_more_bedrooms": 6.4,
      "1_bedroom_household": 1078,
      "2_bedroom_household": 2283,
      "2016_ward_name": "Hartcliffe & Withywood",
      "with_2_bedrooms": 30
    },
    "record_timestamp": "2019-01-07T15:51:23+00:00"
  },
  {
    "datasetid": "household-size-and-bedrooms-2011-census-by-2016-ward",
    "recordid": "2595f8bf6ac2b77896f018305b43a40f89ffe5e5",
    "fields": {
      "average_household_size_persons_per_household": 2.3,
      "total_number_of_households": 5790,
      "2016_ward_code": "E05010897",
      "3_bedroom_household": 2047,
      "average_number_of_bedrooms_per_household": 2.5,
      "with_3_bedrooms": 35.4,
      "4_or_more_bedroom_household": 782,
      "overcrowded_households_ie_occupancy_rating_bedrooms_of_1_or_less0": 6.3,
      "overcrowded_households_ie_occupancy_rating_bedrooms_of_1_or_less": 364,
      "with_1_bedroom": 18.4,
      "with_4_or_more_bedrooms": 13.5,
      "1_bedroom_household": 1067,
      "2_bedroom_household": 1871,
      "2016_ward_name": "Eastville",
      "with_2_bedrooms": 32.3
    },
    "record_timestamp": "2019-01-07T15:51:23+00:00"
  },
  {
    "datasetid": "household-size-and-bedrooms-2011-census-by-2016-ward",
    "recordid": "df3a4a8f95dab6b3d3bdd1481aa1fb3a1d7cacd6",
    "fields": {
      "average_household_size_persons_per_household": 2.3,
      "total_number_of_households": 7700,
      "2016_ward_code": "E05010885",
      "3_bedroom_household": 1635,
      "average_number_of_bedrooms_per_household": 2.4,
      "with_3_bedrooms": 21.2,
      "4_or_more_bedroom_household": 1453,
      "overcrowded_households_ie_occupancy_rating_bedrooms_of_1_or_less0": 8.6,
      "overcrowded_households_ie_occupancy_rating_bedrooms_of_1_or_less": 664,
      "with_1_bedroom": 27.6,
      "with_4_or_more_bedrooms": 18.9,
      "1_bedroom_household": 2122,
      "2_bedroom_household": 2473,
      "2016_ward_name": "Ashley",
      "with_2_bedrooms": 32.1
    },
    "record_timestamp": "2019-01-07T15:51:23+00:00"
  },
  {
    "datasetid": "household-size-and-bedrooms-2011-census-by-2016-ward",
    "recordid": "5456fa2322b53ab297d017dc9879dfdb9cccaed7",
    "fields": {
      "average_household_size_persons_per_household": 2.2,
      "total_number_of_households": 5320,
      "2016_ward_code": "E05010901",
      "3_bedroom_household": 2187,
      "average_number_of_bedrooms_per_household": 2.6,
      "with_3_bedrooms": 41.1,
      "4_or_more_bedroom_household": 709,
      "overcrowded_households_ie_occupancy_rating_bedrooms_of_1_or_less0": 4.1,
      "overcrowded_households_ie_occupancy_rating_bedrooms_of_1_or_less": 219,
      "with_1_bedroom": 9.7,
      "with_4_or_more_bedrooms": 13.3,
      "1_bedroom_household": 514,
      "2_bedroom_household": 1900,
      "2016_ward_name": "Henbury & Brentry",
      "with_2_bedrooms": 35.7
    },
    "record_timestamp": "2019-01-07T15:51:23+00:00"
  },
  {
    "datasetid": "household-size-and-bedrooms-2011-census-by-2016-ward",
    "recordid": "0ac6fe00157bbb6f394edc10e749e6d484394863",
    "fields": {
      "average_household_size_persons_per_household": 2.3,
      "total_number_of_households": 4292,
      "2016_ward_code": "E05010916",
      "3_bedroom_household": 1615,
      "average_number_of_bedrooms_per_household": 3.2,
      "with_3_bedrooms": 37.6,
      "4_or_more_bedroom_household": 1604,
      "overcrowded_households_ie_occupancy_rating_bedrooms_of_1_or_less0": 1.7,
      "overcrowded_households_ie_occupancy_rating_bedrooms_of_1_or_less": 72,
      "with_1_bedroom": 7.1,
      "with_4_or_more_bedrooms": 37.4,
      "1_bedroom_household": 305,
      "2_bedroom_household": 763,
      "2016_ward_name": "Stoke Bishop",
      "with_2_bedrooms": 17.8
    },
    "record_timestamp": "2019-01-07T15:51:23+00:00"
  },
  {
    "datasetid": "household-size-and-bedrooms-2011-census-by-2016-ward",
    "recordid": "e0fc44436accb16d5badbd87b7c246c081ceba0e",
    "fields": {
      "average_household_size_persons_per_household": 2.5,
      "total_number_of_households": 4871,
      "2016_ward_code": "E05010903",
      "3_bedroom_household": 3011,
      "average_number_of_bedrooms_per_household": 2.7,
      "with_3_bedrooms": 61.8,
      "4_or_more_bedroom_household": 453,
      "overcrowded_households_ie_occupancy_rating_bedrooms_of_1_or_less0": 5.5,
      "overcrowded_households_ie_occupancy_rating_bedrooms_of_1_or_less": 267,
      "with_1_bedroom": 8.5,
      "with_4_or_more_bedrooms": 9.3,
      "1_bedroom_household": 416,
      "2_bedroom_household": 987,
      "2016_ward_name": "Hillfields",
      "with_2_bedrooms": 20.3
    },
    "record_timestamp": "2019-01-07T15:51:23+00:00"
  }
]
