[
  {
    "datasetid": "reception-children-with-excess-weight-in-bristol",
    "recordid": "9b32c70e9fcbc8a5a55310289503e2d4eddfd77a",
    "fields": {
      "ward_code": "E05010886",
      "reception_children_with_excess_weight": 27.3,
      "time_period_3_year_average": "2015/16 to 2017/18",
      "reception_children_with_excess_weight_ul": 30.2,
      "geo_point_2d": [
        51.50733416955092,
        -2.676403593578519
      ],
      "reception_children_with_excess_weight_ll": 24.4,
      "ward_name": "Avonmouth & Lawrence Weston"
    },
    "record_timestamp": "2019-05-09T12:38:30+01:00"
  },
  {
    "datasetid": "reception-children-with-excess-weight-in-bristol",
    "recordid": "3e3886c348ac55cc939e71057b0e25f0334820ea",
    "fields": {
      "ward_code": "E05010890",
      "reception_children_with_excess_weight": 22.5872689938,
      "time_period_3_year_average": "2014/15 to 2016/17",
      "reception_children_with_excess_weight_ul": 26.3011642171,
      "geo_point_2d": [
        51.440283557635674,
        -2.538653690470255
      ],
      "reception_children_with_excess_weight_ll": 18.8733737706,
      "ward_name": "Brislington East"
    },
    "record_timestamp": "2019-05-09T12:38:30+01:00"
  },
  {
    "datasetid": "reception-children-with-excess-weight-in-bristol",
    "recordid": "fa9d3a95eeb04d89b76ab018cc1bff29dab5a664",
    "fields": {
      "ward_code": "E05010896",
      "reception_children_with_excess_weight": 21.2844036697,
      "time_period_3_year_average": "2014/15 to 2016/17",
      "reception_children_with_excess_weight_ul": 24.7209243255,
      "geo_point_2d": [
        51.46237199635526,
        -2.558505712306767
      ],
      "reception_children_with_excess_weight_ll": 17.847883014,
      "ward_name": "Easton"
    },
    "record_timestamp": "2019-05-09T12:38:30+01:00"
  },
  {
    "datasetid": "reception-children-with-excess-weight-in-bristol",
    "recordid": "6bf769eb5645dca2c2a0421bc6e7b1b496322393",
    "fields": {
      "ward_code": "E05010914",
      "reception_children_with_excess_weight": 17.9347826087,
      "time_period_3_year_average": "2014/15 to 2016/17",
      "reception_children_with_excess_weight_ul": 21.8545453691,
      "geo_point_2d": [
        51.44332203083603,
        -2.6039905422451843
      ],
      "reception_children_with_excess_weight_ll": 14.0150198482,
      "ward_name": "Southville"
    },
    "record_timestamp": "2019-05-09T12:38:30+01:00"
  },
  {
    "datasetid": "reception-children-with-excess-weight-in-bristol",
    "recordid": "00874e5b7d24359c0285d2d8d28bd15bb601696d",
    "fields": {
      "ward_code": "E05010905",
      "reception_children_with_excess_weight": 19.4444444444,
      "time_period_3_year_average": "2014/15 to 2016/17",
      "reception_children_with_excess_weight_ul": 28.586320762,
      "geo_point_2d": [
        51.44972850261871,
        -2.609578584671327
      ],
      "reception_children_with_excess_weight_ll": 10.3025681268,
      "ward_name": "Hotwells & Harbourside"
    },
    "record_timestamp": "2019-05-09T12:38:30+01:00"
  },
  {
    "datasetid": "reception-children-with-excess-weight-in-bristol",
    "recordid": "c89d802ae8859fbe5facf95f088c1b2149789d32",
    "fields": {
      "ward_code": "E05010892",
      "reception_children_with_excess_weight": 28.6516853933,
      "time_period_3_year_average": "2014/15 to 2016/17",
      "reception_children_with_excess_weight_ul": 35.2939017296,
      "geo_point_2d": [
        51.45441489548896,
        -2.5943361975129386
      ],
      "reception_children_with_excess_weight_ll": 22.0094690569,
      "ward_name": "Central"
    },
    "record_timestamp": "2019-05-09T12:38:30+01:00"
  },
  {
    "datasetid": "reception-children-with-excess-weight-in-bristol",
    "recordid": "460393039656728e2e812847f8490d27dea63d8c",
    "fields": {
      "ward_code": "E05010904",
      "reception_children_with_excess_weight": 24.5478036176,
      "time_period_3_year_average": "2014/15 to 2016/17",
      "reception_children_with_excess_weight_ul": 28.8356858829,
      "geo_point_2d": [
        51.495084280418844,
        -2.5863791260049473
      ],
      "reception_children_with_excess_weight_ll": 20.2599213522,
      "ward_name": "Horfield"
    },
    "record_timestamp": "2019-05-09T12:38:30+01:00"
  },
  {
    "datasetid": "reception-children-with-excess-weight-in-bristol",
    "recordid": "7f55dfcb1c018982b2ea354e7565b689c145f9d2",
    "fields": {
      "ward_code": "E05010917",
      "reception_children_with_excess_weight": 16.7,
      "time_period_3_year_average": "2015/16 to 2017/18",
      "reception_children_with_excess_weight_ul": 19.4,
      "geo_point_2d": [
        51.489794830406666,
        -2.6174827311199365
      ],
      "reception_children_with_excess_weight_ll": 14,
      "ward_name": "Westbury-on-Trym & Henleaze"
    },
    "record_timestamp": "2019-05-09T12:38:30+01:00"
  },
  {
    "datasetid": "reception-children-with-excess-weight-in-bristol",
    "recordid": "1fd4a92cac2e6996fd5f52d2be5f3414791f67fb",
    "fields": {
      "ward_code": "E05010916",
      "reception_children_with_excess_weight": 17.4,
      "time_period_3_year_average": "2015/16 to 2017/18",
      "reception_children_with_excess_weight_ul": 21.6,
      "geo_point_2d": [
        51.477425695764694,
        -2.6360431632859567
      ],
      "reception_children_with_excess_weight_ll": 13.2,
      "ward_name": "Stoke Bishop"
    },
    "record_timestamp": "2019-05-09T12:38:30+01:00"
  },
  {
    "datasetid": "reception-children-with-excess-weight-in-bristol",
    "recordid": "975a59e68cbc8a29f09e04d7d2536ae916369d58",
    "fields": {
      "ward_code": "E05010895",
      "reception_children_with_excess_weight": 16.8,
      "time_period_3_year_average": "2015/16 to 2017/18",
      "reception_children_with_excess_weight_ul": 23.4,
      "geo_point_2d": [
        51.465963389780946,
        -2.5999108335995267
      ],
      "reception_children_with_excess_weight_ll": 10.2,
      "ward_name": "Cotham"
    },
    "record_timestamp": "2019-05-09T12:38:30+01:00"
  },
  {
    "datasetid": "reception-children-with-excess-weight-in-bristol",
    "recordid": "6df5d0321458f1810613e1e783f8847feffff611",
    "fields": {
      "ward_code": "E05010903",
      "reception_children_with_excess_weight": 21.6,
      "time_period_3_year_average": "2015/16 to 2017/18",
      "reception_children_with_excess_weight_ul": 25.7,
      "geo_point_2d": [
        51.473701809639934,
        -2.5225753211023467
      ],
      "reception_children_with_excess_weight_ll": 17.5,
      "ward_name": "Hillfields"
    },
    "record_timestamp": "2019-05-09T12:38:30+01:00"
  },
  {
    "datasetid": "reception-children-with-excess-weight-in-bristol",
    "recordid": "eea99d5e0fe118ed4444d97cef18b11afde7e3c9",
    "fields": {
      "reception_children_with_excess_weight": 22.9,
      "time_period_3_year_average": "2015/16 to 2017/18",
      "reception_children_with_excess_weight_ul": 23.6,
      "reception_children_with_excess_weight_ll": 22.2,
      "ward_name": "Bristol"
    },
    "record_timestamp": "2019-05-09T12:38:30+01:00"
  },
  {
    "datasetid": "reception-children-with-excess-weight-in-bristol",
    "recordid": "a3484ef098c2c5c2d4bed1905e80cb34cd971d7b",
    "fields": {
      "ward_code": "E05010890",
      "reception_children_with_excess_weight": 21.8,
      "time_period_3_year_average": "2015/16 to 2017/18",
      "reception_children_with_excess_weight_ul": 25.5,
      "geo_point_2d": [
        51.440283557635674,
        -2.538653690470255
      ],
      "reception_children_with_excess_weight_ll": 18.1,
      "ward_name": "Brislington East"
    },
    "record_timestamp": "2019-05-09T12:38:30+01:00"
  },
  {
    "datasetid": "reception-children-with-excess-weight-in-bristol",
    "recordid": "b8e67c1c35fcbda50032f12e8ccfdb332a45c98a",
    "fields": {
      "ward_code": "E05010911",
      "reception_children_with_excess_weight": 16,
      "time_period_3_year_average": "2015/16 to 2017/18",
      "reception_children_with_excess_weight_ul": 23.2,
      "geo_point_2d": [
        51.45343615313802,
        -2.5303229832629905
      ],
      "reception_children_with_excess_weight_ll": 8.8,
      "ward_name": "St George Troopers Hill"
    },
    "record_timestamp": "2019-05-09T12:38:30+01:00"
  },
  {
    "datasetid": "reception-children-with-excess-weight-in-bristol",
    "recordid": "2d6b5e201c3b630cf5967710f5f1670d2b1152f6",
    "fields": {
      "ward_code": "E05010892",
      "reception_children_with_excess_weight": 23.8,
      "time_period_3_year_average": "2015/16 to 2017/18",
      "reception_children_with_excess_weight_ul": 29.9,
      "geo_point_2d": [
        51.45441489548896,
        -2.5943361975129386
      ],
      "reception_children_with_excess_weight_ll": 17.7,
      "ward_name": "Central"
    },
    "record_timestamp": "2019-05-09T12:38:30+01:00"
  },
  {
    "datasetid": "reception-children-with-excess-weight-in-bristol",
    "recordid": "a62b1cf79e9a6bbde237863c3f487233229a6dde",
    "fields": {
      "ward_code": "E05010909",
      "reception_children_with_excess_weight": 17.5,
      "time_period_3_year_average": "2015/16 to 2017/18",
      "reception_children_with_excess_weight_ul": 21.2,
      "geo_point_2d": [
        51.475244994104166,
        -2.6011576167757497
      ],
      "reception_children_with_excess_weight_ll": 13.8,
      "ward_name": "Redland"
    },
    "record_timestamp": "2019-05-09T12:38:30+01:00"
  },
  {
    "datasetid": "reception-children-with-excess-weight-in-bristol",
    "recordid": "e36880107cbdc3612146290b1550833143b731ae",
    "fields": {
      "ward_code": "E05010911",
      "reception_children_with_excess_weight": 20.1680672269,
      "time_period_3_year_average": "2014/15 to 2016/17",
      "reception_children_with_excess_weight_ul": 27.3775324755,
      "geo_point_2d": [
        51.45343615313802,
        -2.5303229832629905
      ],
      "reception_children_with_excess_weight_ll": 12.9586019782,
      "ward_name": "St George Troopers Hill"
    },
    "record_timestamp": "2019-05-09T12:38:30+01:00"
  },
  {
    "datasetid": "reception-children-with-excess-weight-in-bristol",
    "recordid": "c1fd78e8675ced77abd4a171fb2c6333d7dd6552",
    "fields": {
      "ward_code": "E05010916",
      "reception_children_with_excess_weight": 20.9375,
      "time_period_3_year_average": "2014/15 to 2016/17",
      "reception_children_with_excess_weight_ul": 25.395384025,
      "geo_point_2d": [
        51.477425695764694,
        -2.6360431632859567
      ],
      "reception_children_with_excess_weight_ll": 16.479615975,
      "ward_name": "Stoke Bishop"
    },
    "record_timestamp": "2019-05-09T12:38:30+01:00"
  },
  {
    "datasetid": "reception-children-with-excess-weight-in-bristol",
    "recordid": "5f06f16d815f178b0a24de558e7ded953d0894e8",
    "fields": {
      "ward_code": "E05010915",
      "reception_children_with_excess_weight": 20.6632653061,
      "time_period_3_year_average": "2014/15 to 2016/17",
      "reception_children_with_excess_weight_ul": 24.6714679926,
      "geo_point_2d": [
        51.4184185120091,
        -2.549734590275577
      ],
      "reception_children_with_excess_weight_ll": 16.6550626197,
      "ward_name": "Stockwood"
    },
    "record_timestamp": "2019-05-09T12:38:30+01:00"
  },
  {
    "datasetid": "reception-children-with-excess-weight-in-bristol",
    "recordid": "aac5406aeb3a0924cf0a2c85c80092fd474d2de9",
    "fields": {
      "ward_code": "E05010900",
      "reception_children_with_excess_weight": 32.8078817734,
      "time_period_3_year_average": "2014/15 to 2016/17",
      "reception_children_with_excess_weight_ul": 35.6963747246,
      "geo_point_2d": [
        51.40770370251634,
        -2.6122179733905804
      ],
      "reception_children_with_excess_weight_ll": 29.9193888222,
      "ward_name": "Hartcliffe & Withywood"
    },
    "record_timestamp": "2019-05-09T12:38:30+01:00"
  },
  {
    "datasetid": "reception-children-with-excess-weight-in-bristol",
    "recordid": "eed587626523bff650c412339724ed1c3ec5cd8d",
    "fields": {
      "ward_code": "E05010889",
      "reception_children_with_excess_weight": 25.4320987654,
      "time_period_3_year_average": "2014/15 to 2016/17",
      "reception_children_with_excess_weight_ul": 29.6733658333,
      "geo_point_2d": [
        51.42178840411747,
        -2.6164555398506413
      ],
      "reception_children_with_excess_weight_ll": 21.1908316975,
      "ward_name": "Bishopsworth"
    },
    "record_timestamp": "2019-05-09T12:38:30+01:00"
  },
  {
    "datasetid": "reception-children-with-excess-weight-in-bristol",
    "recordid": "3b582ae3893436e569d092e1be641bf0b8927f2c",
    "fields": {
      "ward_code": "E05010894",
      "reception_children_with_excess_weight": 12.9310344828,
      "time_period_3_year_average": "2014/15 to 2016/17",
      "reception_children_with_excess_weight_ul": 19.0372960525,
      "geo_point_2d": [
        51.46496980750949,
        -2.61265665526117
      ],
      "reception_children_with_excess_weight_ll": 6.82477291303,
      "ward_name": "Clifton Down"
    },
    "record_timestamp": "2019-05-09T12:38:30+01:00"
  },
  {
    "datasetid": "reception-children-with-excess-weight-in-bristol",
    "recordid": "a80d6d60bc92701a54b0b9b48909bd35a4b04d4d",
    "fields": {
      "ward_code": "E05010898",
      "reception_children_with_excess_weight": 30.7458143075,
      "time_period_3_year_average": "2014/15 to 2016/17",
      "reception_children_with_excess_weight_ul": 34.2743084439,
      "geo_point_2d": [
        51.42541871461089,
        -2.5928026281688696
      ],
      "reception_children_with_excess_weight_ll": 27.217320171,
      "ward_name": "Filwood"
    },
    "record_timestamp": "2019-05-09T12:38:30+01:00"
  },
  {
    "datasetid": "reception-children-with-excess-weight-in-bristol",
    "recordid": "c77474ac786fa28fe304b230bfd24384d26ccc7a",
    "fields": {
      "ward_code": "E05010902",
      "reception_children_with_excess_weight": 23.8021638331,
      "time_period_3_year_average": "2014/15 to 2016/17",
      "reception_children_with_excess_weight_ul": 27.0837474165,
      "geo_point_2d": [
        51.411542279375816,
        -2.577213415009987
      ],
      "reception_children_with_excess_weight_ll": 20.5205802497,
      "ward_name": "Hengrove & Whitchurch Park"
    },
    "record_timestamp": "2019-05-09T12:38:30+01:00"
  },
  {
    "datasetid": "reception-children-with-excess-weight-in-bristol",
    "recordid": "d88832321918c03a53c30e6763cc2013e137c3f0",
    "fields": {
      "ward_code": "E05010906",
      "reception_children_with_excess_weight": 24.9554367201,
      "time_period_3_year_average": "2014/15 to 2016/17",
      "reception_children_with_excess_weight_ul": 28.5365399908,
      "geo_point_2d": [
        51.43277738744576,
        -2.5723344056870134
      ],
      "reception_children_with_excess_weight_ll": 21.3743334495,
      "ward_name": "Knowle"
    },
    "record_timestamp": "2019-05-09T12:38:30+01:00"
  },
  {
    "datasetid": "reception-children-with-excess-weight-in-bristol",
    "recordid": "b0cb76b4192f9b5647a01c6901021797dd4124e9",
    "fields": {
      "ward_code": "E05010896",
      "reception_children_with_excess_weight": 20.9,
      "time_period_3_year_average": "2015/16 to 2017/18",
      "reception_children_with_excess_weight_ul": 24.4,
      "geo_point_2d": [
        51.46237199635526,
        -2.558505712306767
      ],
      "reception_children_with_excess_weight_ll": 17.4,
      "ward_name": "Easton"
    },
    "record_timestamp": "2019-05-09T12:38:30+01:00"
  },
  {
    "datasetid": "reception-children-with-excess-weight-in-bristol",
    "recordid": "104eb5991c706161f8fa153777f38477fd046322",
    "fields": {
      "ward_code": "E05010897",
      "reception_children_with_excess_weight": 22.3,
      "time_period_3_year_average": "2015/16 to 2017/18",
      "reception_children_with_excess_weight_ul": 25.9,
      "geo_point_2d": [
        51.4747101824164,
        -2.54692680566368
      ],
      "reception_children_with_excess_weight_ll": 18.7,
      "ward_name": "Eastville"
    },
    "record_timestamp": "2019-05-09T12:38:30+01:00"
  },
  {
    "datasetid": "reception-children-with-excess-weight-in-bristol",
    "recordid": "620cfa6c5ffe46bdce88f4c1af445ab6069b37a5",
    "fields": {
      "ward_code": "E05010905",
      "reception_children_with_excess_weight": 17.4,
      "time_period_3_year_average": "2015/16 to 2017/18",
      "reception_children_with_excess_weight_ul": 26.3,
      "geo_point_2d": [
        51.44972850261871,
        -2.609578584671327
      ],
      "reception_children_with_excess_weight_ll": 8.5,
      "ward_name": "Hotwells & Harbourside"
    },
    "record_timestamp": "2019-05-09T12:38:30+01:00"
  },
  {
    "datasetid": "reception-children-with-excess-weight-in-bristol",
    "recordid": "eaf293b77a742082ef3dfb45c581bc780b6d36d2",
    "fields": {
      "ward_code": "E05010906",
      "reception_children_with_excess_weight": 23.6,
      "time_period_3_year_average": "2015/16 to 2017/18",
      "reception_children_with_excess_weight_ul": 27.2,
      "geo_point_2d": [
        51.43277738744576,
        -2.5723344056870134
      ],
      "reception_children_with_excess_weight_ll": 20,
      "ward_name": "Knowle"
    },
    "record_timestamp": "2019-05-09T12:38:30+01:00"
  },
  {
    "datasetid": "reception-children-with-excess-weight-in-bristol",
    "recordid": "ad72f9151fa6aa722325fedc0f27620ae3349788",
    "fields": {
      "ward_code": "E05010912",
      "reception_children_with_excess_weight": 22.8,
      "time_period_3_year_average": "2015/16 to 2017/18",
      "reception_children_with_excess_weight_ul": 28.1,
      "geo_point_2d": [
        51.460117397352384,
        -2.546939540158561
      ],
      "reception_children_with_excess_weight_ll": 17.5,
      "ward_name": "St George West"
    },
    "record_timestamp": "2019-05-09T12:38:30+01:00"
  },
  {
    "datasetid": "reception-children-with-excess-weight-in-bristol",
    "recordid": "960e21aeab1761eb6a970c83f1e41659d3d907df",
    "fields": {
      "ward_code": "E05010913",
      "reception_children_with_excess_weight": 28.3,
      "time_period_3_year_average": "2015/16 to 2017/18",
      "reception_children_with_excess_weight_ul": 32.4,
      "geo_point_2d": [
        51.50306208450213,
        -2.6011179000657774
      ],
      "reception_children_with_excess_weight_ll": 24.2,
      "ward_name": "Southmead"
    },
    "record_timestamp": "2019-05-09T12:38:30+01:00"
  },
  {
    "datasetid": "reception-children-with-excess-weight-in-bristol",
    "recordid": "3848c28095775e093414696d2915b208ab7b16fb",
    "fields": {
      "ward_code": "E05010886",
      "reception_children_with_excess_weight": 26.9613259669,
      "time_period_3_year_average": "2014/15 to 2016/17",
      "reception_children_with_excess_weight_ul": 29.8525306951,
      "geo_point_2d": [
        51.50733416955092,
        -2.676403593578519
      ],
      "reception_children_with_excess_weight_ll": 24.0701212386,
      "ward_name": "Avonmouth & Lawrence Weston"
    },
    "record_timestamp": "2019-05-09T12:38:30+01:00"
  },
  {
    "datasetid": "reception-children-with-excess-weight-in-bristol",
    "recordid": "9872a5d69efb0838350a490187b68f283b86a799",
    "fields": {
      "ward_code": "E05010893",
      "reception_children_with_excess_weight": 19.3,
      "time_period_3_year_average": "2015/16 to 2017/18",
      "reception_children_with_excess_weight_ul": 25.4,
      "geo_point_2d": [
        51.45651580315947,
        -2.619963313044622
      ],
      "reception_children_with_excess_weight_ll": 13.2,
      "ward_name": "Clifton"
    },
    "record_timestamp": "2019-05-09T12:38:30+01:00"
  },
  {
    "datasetid": "reception-children-with-excess-weight-in-bristol",
    "recordid": "4891bb7f37ce2f723f4cb57eb9390511456f9b38",
    "fields": {
      "ward_code": "E05010888",
      "reception_children_with_excess_weight": 14.3737166324,
      "time_period_3_year_average": "2014/15 to 2016/17",
      "reception_children_with_excess_weight_ul": 17.4895891237,
      "geo_point_2d": [
        51.481453271475736,
        -2.586463406560199
      ],
      "reception_children_with_excess_weight_ll": 11.2578441412,
      "ward_name": "Bishopston & Ashley Down"
    },
    "record_timestamp": "2019-05-09T12:38:30+01:00"
  },
  {
    "datasetid": "reception-children-with-excess-weight-in-bristol",
    "recordid": "da6a1935445393284d6061332178406329601347",
    "fields": {
      "ward_code": "E05010912",
      "reception_children_with_excess_weight": 25.1968503937,
      "time_period_3_year_average": "2014/15 to 2016/17",
      "reception_children_with_excess_weight_ul": 30.5360023809,
      "geo_point_2d": [
        51.460117397352384,
        -2.546939540158561
      ],
      "reception_children_with_excess_weight_ll": 19.8576984065,
      "ward_name": "St George West"
    },
    "record_timestamp": "2019-05-09T12:38:30+01:00"
  },
  {
    "datasetid": "reception-children-with-excess-weight-in-bristol",
    "recordid": "f80e63064131aa66f508702427ffd5989aac990f",
    "fields": {
      "ward_code": "E05010899",
      "reception_children_with_excess_weight": 21.5017064846,
      "time_period_3_year_average": "2014/15 to 2016/17",
      "reception_children_with_excess_weight_ul": 26.2059395866,
      "geo_point_2d": [
        51.487090549306394,
        -2.531199152981719
      ],
      "reception_children_with_excess_weight_ll": 16.7974733827,
      "ward_name": "Frome Vale"
    },
    "record_timestamp": "2019-05-09T12:38:30+01:00"
  },
  {
    "datasetid": "reception-children-with-excess-weight-in-bristol",
    "recordid": "4a2b8ef833ee5f8dfce2952a08d0d2a2fc9eb21c",
    "fields": {
      "reception_children_with_excess_weight": 23.4011818779,
      "time_period_3_year_average": "2014/15 to 2016/17",
      "reception_children_with_excess_weight_ul": 24.0735947987,
      "reception_children_with_excess_weight_ll": 22.728768957,
      "ward_name": "Bristol"
    },
    "record_timestamp": "2019-05-09T12:38:30+01:00"
  },
  {
    "datasetid": "reception-children-with-excess-weight-in-bristol",
    "recordid": "aebeda55fcff3030166371912e55c4158df03218",
    "fields": {
      "ward_code": "E05010887",
      "reception_children_with_excess_weight": 21.5633423181,
      "time_period_3_year_average": "2014/15 to 2016/17",
      "reception_children_with_excess_weight_ul": 25.7482578334,
      "geo_point_2d": [
        51.437160367112604,
        -2.621872278194263
      ],
      "reception_children_with_excess_weight_ll": 17.3784268027,
      "ward_name": "Bedminster"
    },
    "record_timestamp": "2019-05-09T12:38:30+01:00"
  },
  {
    "datasetid": "reception-children-with-excess-weight-in-bristol",
    "recordid": "ee77576d36ab9650e8e36f053a1216390a94b14d",
    "fields": {
      "ward_code": "E05010893",
      "reception_children_with_excess_weight": 18.2352941176,
      "time_period_3_year_average": "2014/15 to 2016/17",
      "reception_children_with_excess_weight_ul": 24.0398759249,
      "geo_point_2d": [
        51.45651580315947,
        -2.619963313044622
      ],
      "reception_children_with_excess_weight_ll": 12.4307123104,
      "ward_name": "Clifton"
    },
    "record_timestamp": "2019-05-09T12:38:30+01:00"
  },
  {
    "datasetid": "reception-children-with-excess-weight-in-bristol",
    "recordid": "bf1feca6a2affe601683db98974572d0a08111f5",
    "fields": {
      "ward_code": "E05010907",
      "reception_children_with_excess_weight": 25.5341880342,
      "time_period_3_year_average": "2014/15 to 2016/17",
      "reception_children_with_excess_weight_ul": 28.3277456813,
      "geo_point_2d": [
        51.45459291753686,
        -2.5712342414908114
      ],
      "reception_children_with_excess_weight_ll": 22.7406303871,
      "ward_name": "Lawrence Hill"
    },
    "record_timestamp": "2019-05-09T12:38:30+01:00"
  },
  {
    "datasetid": "reception-children-with-excess-weight-in-bristol",
    "recordid": "e0f257b7f1575d21b1a22ad4d5095b65b54e7e1d",
    "fields": {
      "ward_code": "E05010889",
      "reception_children_with_excess_weight": 24.3,
      "time_period_3_year_average": "2015/16 to 2017/18",
      "reception_children_with_excess_weight_ul": 28.5,
      "geo_point_2d": [
        51.42178840411747,
        -2.6164555398506413
      ],
      "reception_children_with_excess_weight_ll": 20.1,
      "ward_name": "Bishopsworth"
    },
    "record_timestamp": "2019-05-09T12:38:30+01:00"
  },
  {
    "datasetid": "reception-children-with-excess-weight-in-bristol",
    "recordid": "195a182d77383bdff2f3964ce8262753fe896bd3",
    "fields": {
      "ward_code": "E05010907",
      "reception_children_with_excess_weight": 24.5,
      "time_period_3_year_average": "2015/16 to 2017/18",
      "reception_children_with_excess_weight_ul": 27.2,
      "geo_point_2d": [
        51.45459291753686,
        -2.5712342414908114
      ],
      "reception_children_with_excess_weight_ll": 21.8,
      "ward_name": "Lawrence Hill"
    },
    "record_timestamp": "2019-05-09T12:38:30+01:00"
  },
  {
    "datasetid": "reception-children-with-excess-weight-in-bristol",
    "recordid": "cf3e06bef621dda167e0c444911674aa028df7ea",
    "fields": {
      "ward_code": "E05010908",
      "reception_children_with_excess_weight": 23,
      "time_period_3_year_average": "2015/16 to 2017/18",
      "reception_children_with_excess_weight_ul": 26.8,
      "geo_point_2d": [
        51.485856250896916,
        -2.5656672613818317
      ],
      "reception_children_with_excess_weight_ll": 19.2,
      "ward_name": "Lockleaze"
    },
    "record_timestamp": "2019-05-09T12:38:30+01:00"
  },
  {
    "datasetid": "reception-children-with-excess-weight-in-bristol",
    "recordid": "c12ab023ca75e73b896547f1323d216845867a51",
    "fields": {
      "ward_code": "E05010918",
      "reception_children_with_excess_weight": 18.9,
      "time_period_3_year_average": "2015/16 to 2017/18",
      "reception_children_with_excess_weight_ul": 22.5,
      "geo_point_2d": [
        51.43909717990885,
        -2.5859442709607294
      ],
      "reception_children_with_excess_weight_ll": 15.3,
      "ward_name": "Windmill Hill"
    },
    "record_timestamp": "2019-05-09T12:38:30+01:00"
  },
  {
    "datasetid": "reception-children-with-excess-weight-in-bristol",
    "recordid": "ff671f0cfa049832fb63d0249b79ae0885d52916",
    "fields": {
      "ward_code": "E05010901",
      "reception_children_with_excess_weight": 28.0777537797,
      "time_period_3_year_average": "2014/15 to 2016/17",
      "reception_children_with_excess_weight_ul": 32.1710990421,
      "geo_point_2d": [
        51.50897361423407,
        -2.62103514849043
      ],
      "reception_children_with_excess_weight_ll": 23.9844085173,
      "ward_name": "Henbury & Brentry"
    },
    "record_timestamp": "2019-05-09T12:38:30+01:00"
  },
  {
    "datasetid": "reception-children-with-excess-weight-in-bristol",
    "recordid": "88f2a4706359ac21336c7f68ccdfd5ad206ffdc1",
    "fields": {
      "ward_code": "E05010897",
      "reception_children_with_excess_weight": 23.8095238095,
      "time_period_3_year_average": "2014/15 to 2016/17",
      "reception_children_with_excess_weight_ul": 27.6079894715,
      "geo_point_2d": [
        51.4747101824164,
        -2.54692680566368
      ],
      "reception_children_with_excess_weight_ll": 20.0110581476,
      "ward_name": "Eastville"
    },
    "record_timestamp": "2019-05-09T12:38:30+01:00"
  },
  {
    "datasetid": "reception-children-with-excess-weight-in-bristol",
    "recordid": "ee89b4edcda69edf6311db5c70ab2b8b9f8008fb",
    "fields": {
      "ward_code": "E05010910",
      "reception_children_with_excess_weight": 22.7699530516,
      "time_period_3_year_average": "2014/15 to 2016/17",
      "reception_children_with_excess_weight_ul": 26.7521752487,
      "geo_point_2d": [
        51.46214058043526,
        -2.5263834027166023
      ],
      "reception_children_with_excess_weight_ll": 18.7877308545,
      "ward_name": "St George Central"
    },
    "record_timestamp": "2019-05-09T12:38:30+01:00"
  },
  {
    "datasetid": "reception-children-with-excess-weight-in-bristol",
    "recordid": "bd36bd3887cf5d136a2cd68e77c08fb036b252ba",
    "fields": {
      "ward_code": "E05010914",
      "reception_children_with_excess_weight": 16.8,
      "time_period_3_year_average": "2015/16 to 2017/18",
      "reception_children_with_excess_weight_ul": 20.6,
      "geo_point_2d": [
        51.44332203083603,
        -2.6039905422451843
      ],
      "reception_children_with_excess_weight_ll": 13,
      "ward_name": "Southville"
    },
    "record_timestamp": "2019-05-09T12:38:30+01:00"
  },
  {
    "datasetid": "reception-children-with-excess-weight-in-bristol",
    "recordid": "e8fd6b66c41e03461f26be6ccdff0b7f9937074a",
    "fields": {
      "ward_code": "E05010908",
      "reception_children_with_excess_weight": 23.6956521739,
      "time_period_3_year_average": "2014/15 to 2016/17",
      "reception_children_with_excess_weight_ul": 27.5815030589,
      "geo_point_2d": [
        51.485856250896916,
        -2.5656672613818317
      ],
      "reception_children_with_excess_weight_ll": 19.8098012889,
      "ward_name": "Lockleaze"
    },
    "record_timestamp": "2019-05-09T12:38:30+01:00"
  },
  {
    "datasetid": "reception-children-with-excess-weight-in-bristol",
    "recordid": "e2608be3259df382fb2bf66f5009825e5dcc3916",
    "fields": {
      "ward_code": "E05010900",
      "reception_children_with_excess_weight": 33.4,
      "time_period_3_year_average": "2015/16 to 2017/18",
      "reception_children_with_excess_weight_ul": 36.3,
      "geo_point_2d": [
        51.40770370251634,
        -2.6122179733905804
      ],
      "reception_children_with_excess_weight_ll": 30.5,
      "ward_name": "Hartcliffe & Withywood"
    },
    "record_timestamp": "2019-05-09T12:38:30+01:00"
  },
  {
    "datasetid": "reception-children-with-excess-weight-in-bristol",
    "recordid": "af7be4625f8bdfddc0c6e56d352e306b0057be56",
    "fields": {
      "ward_code": "E05010888",
      "reception_children_with_excess_weight": 12.4,
      "time_period_3_year_average": "2015/16 to 2017/18",
      "reception_children_with_excess_weight_ul": 15.3,
      "geo_point_2d": [
        51.481453271475736,
        -2.586463406560199
      ],
      "reception_children_with_excess_weight_ll": 9.5,
      "ward_name": "Bishopston & Ashley Down"
    },
    "record_timestamp": "2019-05-09T12:38:30+01:00"
  },
  {
    "datasetid": "reception-children-with-excess-weight-in-bristol",
    "recordid": "0e5e098c8ffa676d82715052aa0367cf9f84ac09",
    "fields": {
      "ward_code": "E05010885",
      "reception_children_with_excess_weight": 20.6593406593,
      "time_period_3_year_average": "2014/15 to 2016/17",
      "reception_children_with_excess_weight_ul": 24.3794568472,
      "geo_point_2d": [
        51.46830988465869,
        -2.5826731604707702
      ],
      "reception_children_with_excess_weight_ll": 16.9392244714,
      "ward_name": "Ashley"
    },
    "record_timestamp": "2019-05-09T12:38:30+01:00"
  },
  {
    "datasetid": "reception-children-with-excess-weight-in-bristol",
    "recordid": "1a7ff0abbbf8d15dbcfdcf1000d70f94a1ad2117",
    "fields": {
      "ward_code": "E05010917",
      "reception_children_with_excess_weight": 16.9444444444,
      "time_period_3_year_average": "2014/15 to 2016/17",
      "reception_children_with_excess_weight_ul": 19.6846796018,
      "geo_point_2d": [
        51.489794830406666,
        -2.6174827311199365
      ],
      "reception_children_with_excess_weight_ll": 14.2042092871,
      "ward_name": "Westbury-on-Trym & Henleaze"
    },
    "record_timestamp": "2019-05-09T12:38:30+01:00"
  },
  {
    "datasetid": "reception-children-with-excess-weight-in-bristol",
    "recordid": "0fbd01279769b797b6a864ad34728f526543ac79",
    "fields": {
      "ward_code": "E05010901",
      "reception_children_with_excess_weight": 27.9,
      "time_period_3_year_average": "2015/16 to 2017/18",
      "reception_children_with_excess_weight_ul": 31.8,
      "geo_point_2d": [
        51.50897361423407,
        -2.62103514849043
      ],
      "reception_children_with_excess_weight_ll": 24,
      "ward_name": "Henbury & Brentry"
    },
    "record_timestamp": "2019-05-09T12:38:30+01:00"
  },
  {
    "datasetid": "reception-children-with-excess-weight-in-bristol",
    "recordid": "c7052877bf221fc15cae26e8af148267e4d48b99",
    "fields": {
      "ward_code": "E05010902",
      "reception_children_with_excess_weight": 25.3,
      "time_period_3_year_average": "2015/16 to 2017/18",
      "reception_children_with_excess_weight_ul": 28.6,
      "geo_point_2d": [
        51.411542279375816,
        -2.577213415009987
      ],
      "reception_children_with_excess_weight_ll": 22,
      "ward_name": "Hengrove & Whitchurch Park"
    },
    "record_timestamp": "2019-05-09T12:38:30+01:00"
  },
  {
    "datasetid": "reception-children-with-excess-weight-in-bristol",
    "recordid": "c4ff6020da6056a7413b2fd7f83b66fe3372f5e2",
    "fields": {
      "ward_code": "E05010910",
      "reception_children_with_excess_weight": 22.8,
      "time_period_3_year_average": "2015/16 to 2017/18",
      "reception_children_with_excess_weight_ul": 26.9,
      "geo_point_2d": [
        51.46214058043526,
        -2.5263834027166023
      ],
      "reception_children_with_excess_weight_ll": 18.7,
      "ward_name": "St George Central"
    },
    "record_timestamp": "2019-05-09T12:38:30+01:00"
  },
  {
    "datasetid": "reception-children-with-excess-weight-in-bristol",
    "recordid": "2a8a96893501d8129dc42b0b5a5ac1604bce24d1",
    "fields": {
      "ward_code": "E05010918",
      "reception_children_with_excess_weight": 19.7647058824,
      "time_period_3_year_average": "2014/15 to 2016/17",
      "reception_children_with_excess_weight_ul": 23.5507834625,
      "geo_point_2d": [
        51.43909717990885,
        -2.5859442709607294
      ],
      "reception_children_with_excess_weight_ll": 15.9786283022,
      "ward_name": "Windmill Hill"
    },
    "record_timestamp": "2019-05-09T12:38:30+01:00"
  },
  {
    "datasetid": "reception-children-with-excess-weight-in-bristol",
    "recordid": "f1cb6eec831094a40d55d60fa26d61faf9d43f03",
    "fields": {
      "ward_code": "E05010887",
      "reception_children_with_excess_weight": 20.9,
      "time_period_3_year_average": "2015/16 to 2017/18",
      "reception_children_with_excess_weight_ul": 25,
      "geo_point_2d": [
        51.437160367112604,
        -2.621872278194263
      ],
      "reception_children_with_excess_weight_ll": 16.8,
      "ward_name": "Bedminster"
    },
    "record_timestamp": "2019-05-09T12:38:30+01:00"
  },
  {
    "datasetid": "reception-children-with-excess-weight-in-bristol",
    "recordid": "b26ddff11f5e12bacbbb7ff22d761c9f3dae15e3",
    "fields": {
      "ward_code": "E05010899",
      "reception_children_with_excess_weight": 21.3,
      "time_period_3_year_average": "2015/16 to 2017/18",
      "reception_children_with_excess_weight_ul": 25.8,
      "geo_point_2d": [
        51.487090549306394,
        -2.531199152981719
      ],
      "reception_children_with_excess_weight_ll": 16.8,
      "ward_name": "Frome Vale"
    },
    "record_timestamp": "2019-05-09T12:38:30+01:00"
  },
  {
    "datasetid": "reception-children-with-excess-weight-in-bristol",
    "recordid": "838246c8d2f4c9b425b78392723df3a8c935a61a",
    "fields": {
      "ward_code": "E05010898",
      "reception_children_with_excess_weight": 30.8,
      "time_period_3_year_average": "2015/16 to 2017/18",
      "reception_children_with_excess_weight_ul": 34.3,
      "geo_point_2d": [
        51.42541871461089,
        -2.5928026281688696
      ],
      "reception_children_with_excess_weight_ll": 27.3,
      "ward_name": "Filwood"
    },
    "record_timestamp": "2019-05-09T12:38:30+01:00"
  },
  {
    "datasetid": "reception-children-with-excess-weight-in-bristol",
    "recordid": "27a29110ea997dfcea3b55fb40a1301cc9e76b44",
    "fields": {
      "ward_code": "E05010894",
      "reception_children_with_excess_weight": 18.1,
      "time_period_3_year_average": "2015/16 to 2017/18",
      "reception_children_with_excess_weight_ul": 25.1,
      "geo_point_2d": [
        51.46496980750949,
        -2.61265665526117
      ],
      "reception_children_with_excess_weight_ll": 11.1,
      "ward_name": "Clifton Down"
    },
    "record_timestamp": "2019-05-09T12:38:30+01:00"
  },
  {
    "datasetid": "reception-children-with-excess-weight-in-bristol",
    "recordid": "bc5a74b86b78fe591eca89703ede0139f3191e31",
    "fields": {
      "ward_code": "E05010904",
      "reception_children_with_excess_weight": 23,
      "time_period_3_year_average": "2015/16 to 2017/18",
      "reception_children_with_excess_weight_ul": 27.2,
      "geo_point_2d": [
        51.495084280418844,
        -2.5863791260049473
      ],
      "reception_children_with_excess_weight_ll": 18.8,
      "ward_name": "Horfield"
    },
    "record_timestamp": "2019-05-09T12:38:30+01:00"
  },
  {
    "datasetid": "reception-children-with-excess-weight-in-bristol",
    "recordid": "8e7a49f2d794e476de46123c6ea0d12c09dd66e9",
    "fields": {
      "ward_code": "E05010915",
      "reception_children_with_excess_weight": 19.1,
      "time_period_3_year_average": "2015/16 to 2017/18",
      "reception_children_with_excess_weight_ul": 23,
      "geo_point_2d": [
        51.4184185120091,
        -2.549734590275577
      ],
      "reception_children_with_excess_weight_ll": 15.2,
      "ward_name": "Stockwood"
    },
    "record_timestamp": "2019-05-09T12:38:30+01:00"
  },
  {
    "datasetid": "reception-children-with-excess-weight-in-bristol",
    "recordid": "9e6277f8247d8ae6e1c62c4b80926df0bb466751",
    "fields": {
      "ward_code": "E05010909",
      "reception_children_with_excess_weight": 16.6265060241,
      "time_period_3_year_average": "2014/15 to 2016/17",
      "reception_children_with_excess_weight_ul": 20.2086787347,
      "geo_point_2d": [
        51.475244994104166,
        -2.6011576167757497
      ],
      "reception_children_with_excess_weight_ll": 13.0443333135,
      "ward_name": "Redland"
    },
    "record_timestamp": "2019-05-09T12:38:30+01:00"
  },
  {
    "datasetid": "reception-children-with-excess-weight-in-bristol",
    "recordid": "bad6320f79cfef91555fc64d1ec109559acf2546",
    "fields": {
      "ward_code": "E05010895",
      "reception_children_with_excess_weight": 14.8148148148,
      "time_period_3_year_average": "2014/15 to 2016/17",
      "reception_children_with_excess_weight_ul": 20.807470653,
      "geo_point_2d": [
        51.465963389780946,
        -2.5999108335995267
      ],
      "reception_children_with_excess_weight_ll": 8.8221589766,
      "ward_name": "Cotham"
    },
    "record_timestamp": "2019-05-09T12:38:30+01:00"
  },
  {
    "datasetid": "reception-children-with-excess-weight-in-bristol",
    "recordid": "1bd062e2638bf1de4e9560e8b2594495b036538d",
    "fields": {
      "ward_code": "E05010903",
      "reception_children_with_excess_weight": 20.2702702703,
      "time_period_3_year_average": "2014/15 to 2016/17",
      "reception_children_with_excess_weight_ul": 24.3666020514,
      "geo_point_2d": [
        51.473701809639934,
        -2.5225753211023467
      ],
      "reception_children_with_excess_weight_ll": 16.1739384891,
      "ward_name": "Hillfields"
    },
    "record_timestamp": "2019-05-09T12:38:30+01:00"
  },
  {
    "datasetid": "reception-children-with-excess-weight-in-bristol",
    "recordid": "abf099f214a4ff08f0ccd665935183d1d9b1004d",
    "fields": {
      "ward_code": "E05010885",
      "reception_children_with_excess_weight": 20,
      "time_period_3_year_average": "2015/16 to 2017/18",
      "reception_children_with_excess_weight_ul": 23.7,
      "geo_point_2d": [
        51.46830988465869,
        -2.5826731604707702
      ],
      "reception_children_with_excess_weight_ll": 16.3,
      "ward_name": "Ashley"
    },
    "record_timestamp": "2019-05-09T12:38:30+01:00"
  },
  {
    "datasetid": "reception-children-with-excess-weight-in-bristol",
    "recordid": "0f59aa0d93925489aadf5c6af7984e1befc04981",
    "fields": {
      "ward_code": "E05010913",
      "reception_children_with_excess_weight": 28.5714285714,
      "time_period_3_year_average": "2014/15 to 2016/17",
      "reception_children_with_excess_weight_ul": 32.7547287041,
      "geo_point_2d": [
        51.50306208450213,
        -2.6011179000657774
      ],
      "reception_children_with_excess_weight_ll": 24.3881284388,
      "ward_name": "Southmead"
    },
    "record_timestamp": "2019-05-09T12:38:30+01:00"
  },
  {
    "datasetid": "reception-children-with-excess-weight-in-bristol",
    "recordid": "a42d9a10662483ecdb21b03aaab7bba8ff2fc342",
    "fields": {
      "ward_code": "E05010891",
      "reception_children_with_excess_weight": 20.3007518797,
      "time_period_3_year_average": "2014/15 to 2016/17",
      "reception_children_with_excess_weight_ul": 24.2476216543,
      "geo_point_2d": [
        51.43439385931224,
        -2.5490698863745944
      ],
      "reception_children_with_excess_weight_ll": 16.3538821051,
      "ward_name": "Brislington West"
    },
    "record_timestamp": "2019-05-09T12:38:30+01:00"
  },
  {
    "datasetid": "reception-children-with-excess-weight-in-bristol",
    "recordid": "8ae2bc2cf07400f7503fc3bee2af43805e748249",
    "fields": {
      "ward_code": "E05010891",
      "reception_children_with_excess_weight": 20.8,
      "time_period_3_year_average": "2015/16 to 2017/18",
      "reception_children_with_excess_weight_ul": 24.6,
      "geo_point_2d": [
        51.43439385931224,
        -2.5490698863745944
      ],
      "reception_children_with_excess_weight_ll": 17,
      "ward_name": "Brislington West"
    },
    "record_timestamp": "2019-05-09T12:38:30+01:00"
  }
]
