[
  {
    "year": "2001",
    "bristol": 1.7,
    "wardCurrent": 5.2
  },
  {
    "year": "2002",
    "bristol": 9.7,
    "wardCurrent": 2
  },
  {
    "year": "2003",
    "bristol": 16,
    "wardCurrent": 17
  }
]
