module gitlab.com/briosh/hub/api

go 1.19

require (
	github.com/IncSW/geoip2 v0.1.2
	github.com/ajstarks/svgo v0.0.0-20211024235047-1546f124cd8b
	github.com/discord/lilliput v0.0.0-20220922234446-1ef1bb44bb7e
	github.com/labstack/echo/v4 v4.9.1
	github.com/sirupsen/logrus v1.9.0
	github.com/swaggo/swag v1.8.9
	github.com/urfave/cli/v2 v2.23.7
	gitlab.com/evolves-fr/gommon v0.33.0
	golang.org/x/crypto v0.0.0-20211215153901-e495a2d5b3d3
	pkg.brio.sh/swaggerui/v4 v4.12.0
)

require (
	github.com/KyleBanks/depth v1.2.1 // indirect
	github.com/PuerkitoBio/purell v1.1.1 // indirect
	github.com/PuerkitoBio/urlesc v0.0.0-20170810143723-de5bf2ad4578 // indirect
	github.com/cpuguy83/go-md2man/v2 v2.0.2 // indirect
	github.com/go-openapi/jsonpointer v0.19.5 // indirect
	github.com/go-openapi/jsonreference v0.19.6 // indirect
	github.com/go-openapi/spec v0.20.4 // indirect
	github.com/go-openapi/swag v0.19.15 // indirect
	github.com/golang-jwt/jwt v3.2.2+incompatible // indirect
	github.com/josharian/intern v1.0.0 // indirect
	github.com/labstack/gommon v0.4.0 // indirect
	github.com/mailru/easyjson v0.7.6 // indirect
	github.com/mattn/go-colorable v0.1.11 // indirect
	github.com/mattn/go-isatty v0.0.14 // indirect
	github.com/russross/blackfriday/v2 v2.1.0 // indirect
	github.com/valyala/bytebufferpool v1.0.0 // indirect
	github.com/valyala/fasttemplate v1.2.1 // indirect
	github.com/xrash/smetrics v0.0.0-20201216005158-039620a65673 // indirect
	golang.org/x/net v0.0.0-20220722155237-a158d28d115b // indirect
	golang.org/x/sys v0.0.0-20220722155257-8c9f86f7a55f // indirect
	golang.org/x/text v0.3.7 // indirect
	golang.org/x/time v0.0.0-20201208040808-7e3f01d25324 // indirect
	golang.org/x/tools v0.1.12 // indirect
	gopkg.in/yaml.v2 v2.4.0 // indirect
	gopkg.in/yaml.v3 v3.0.1 // indirect
)
