0 Wheel Rim 20 x 30 Smooth with 6 Pinholes with Tyre 20/ 83 x 30 Offset Tread
0 Name: 4266c01.dat
0 Author: Steffen [Steffen]
0 !LDRAW_ORG Shortcut UPDATE 2022-01
0 !LICENSE Redistributable under CCAL version 2.0 : see CAreadme.txt

0 BFC CERTIFY CW

0 !HISTORY 2012-11-12 [cwdee] Compensate for origin change in 4266
0 !HISTORY 2022-01-14 [PTadmin] Official Update 2022-01

1 16 0 0 0 1 0 0 0 1 0 0 0 1 4266.dat
1 256 0 0 0 1 0 0 0 1 0 0 0 1 4267.dat