0 ~Minifig Headdress Rocket Costume, Base
0 Name: s\29580s02.dat
0 Author: Gerald Lasser [GeraldLasser]
0 !LDRAW_ORG Subpart UPDATE 2022-01
0 !LICENSE Redistributable under CCAL version 2.0 : see CAreadme.txt

0 BFC CERTIFY CCW

0 !HISTORY 2022-01-14 [PTadmin] Official Update 2022-01

1 16 0 -41 0 5.8 0 0 0 5.8 0 0 0 6 8-8sphe.dat
1 16 0 -32.533 0 5.5 0 0 0 1 0 0 0 5.5 4-4edge.dat

1 16 0 -24 0 1 0 0 0 -6 0 0 0 1 stud4o.dat
0 BFC INVERTNEXT
1 16 0 0 0 2.6 0 0 0 -6 0 0 0 2.6 4-4con4.dat
1 16 0 0 0 8 0 0 0 -6 0 0 0 8 4-4cylo.dat
1 16 0 -6 0 2.6 0 0 0 -1 0 0 0 2.6 4-4ring3.dat
1 16 0 -6 0 10.4 0 0 0 1 0 0 0 10.4 4-4edge.dat
1 16 0 0 0 13 0 0 0 1 0 0 0 13 4-4edge.dat

1 16 0 0 0 1 0 0 0 1 0 0 0 1 s\29580s04.dat
1 16 0 0 0 1 0 0 0 1 0 0 0 -1 s\29580s04.dat
1 16 0 0 0 -1 0 0 0 1 0 0 0 1 s\29580s04.dat
1 16 0 0 0 -1 0 0 0 1 0 0 0 -1 s\29580s04.dat

0 // Backside
4 16 4.975 0 12.011 0 0 13 0 65 13 4.975 65 12.011
4 16 12.011 0 4.975 9.192 0 9.192 9.192 24 9.192 12.011 24 4.975
4 16 4.975 0 12.011 7.236 24 10.5 9.192 24 9.192 9.192 0 9.192
4 16 4.975 65 12.011 7.236 65 10.5 7.236 24 10.5 4.975 0 12.011
4 16 -7.236 24 10.5 -7.236 65 10.5 -4.975 65 12.011 -4.975 0 12.011
4 16 0 65 13 0 0 13 -4.975 0 12.011 -4.975 65 12.011
4 16 -9.192 24 9.192 -9.192 0 9.192 -12.011 0 4.975 -12.011 24 4.975
4 16 -9.192 24 9.192 -7.236 24 10.5 -4.975 0 12.011 -9.192 0 9.192

5 24 -9.1923 0 9.1923 -9.192 24 9.192 -12.011 0 4.975 -4.9751 0 12.0107
5 24 -4.9751 0 12.0107 -4.975 65 12.011 -9.1923 0 9.1923 0 0 13
5 24 0 0 13 0 65 13 -4.9751 0 12.0107 4.975 0 12.011
5 24 4.975 0 12.011 4.975 65 12.011 0 0 13 9.192 0 9.192
5 24 9.192 0 9.192 9.192 24 9.192 4.975 0 12.011 12.0107 0 4.9751

0 // Visor
3 16 4.018 .799 -12.201 0 0 -13 4.975 0 -12.011
3 16 4.018 .799 -12.201 4.975 0 -12.011 4.975 1.438 -12.011
4 16 7.425 3.075 -10.374 4.975 1.438 -12.011 4.975 0 -12.011 9.192 0 -9.192
3 16 7.425 3.075 -10.374 9.192 0 -9.192 9.192 5.72 -9.192
4 16 9.192 0 -9.192 12.011 0 -4.975 9.701 6.482 -8.431 9.192 5.72 -9.192
3 16 9.701 6.482 -8.431 12.011 0 -4.975 10.5 10.5 -7.235
3 16 10.5 10.5 -7.235 12.011 0 -4.975 12.011 24 -4.975
3 16 10.5 10.5 -7.235 12.011 24 -4.975 9.701 14.518 -8.431
4 16 9.192 15.28 -9.192 9.701 14.518 -8.431 12.011 24 -4.975 9.192 24 -9.192
3 16 9.192 15.28 -9.192 9.192 24 -9.192 7.425 17.925 -10.374
4 16 4.975 19.562 -12.011 7.425 17.925 -10.374 9.192 24 -9.192 7.236 24 -10.5
4 16 7.236 65 -10.5 4.975 65 -12.011 4.975 19.562 -12.011 7.236 24 -10.5
4 16 4.018 20.201 -12.201 4.975 65 -12.011 0 65 -13 0 21 -13
3 16 4.975 65 -12.011 4.018 20.201 -12.201 4.975 19.562 -12.011
3 16 0 0 -13 -4.018 .799 -12.201 -4.975 0 -12.011
3 16 -4.975 0 -12.011 -4.018 .799 -12.201 -4.975 1.438 -12.011
4 16 -4.975 0 -12.011 -4.975 1.438 -12.011 -7.425 3.075 -10.374 -9.192 0 -9.192
3 16 -9.192 0 -9.192 -7.425 3.075 -10.374 -9.192 5.72 -9.192
4 16 -9.701 6.482 -8.431 -12.011 0 -4.975 -9.192 0 -9.192 -9.192 5.72 -9.192
3 16 -12.011 0 -4.975 -9.701 6.482 -8.431 -10.5 10.5 -7.235
3 16 -12.011 0 -4.975 -10.5 10.5 -7.235 -12.011 24 -4.975
3 16 -12.011 24 -4.975 -10.5 10.5 -7.235 -9.701 14.518 -8.431
4 16 -12.011 24 -4.975 -9.701 14.518 -8.431 -9.192 15.28 -9.192 -9.192 24 -9.192
3 16 -9.192 24 -9.192 -9.192 15.28 -9.192 -7.425 17.925 -10.374
4 16 -9.192 24 -9.192 -7.425 17.925 -10.374 -4.975 19.562 -12.011 -7.236 24 -10.5
4 16 -4.975 19.562 -12.011 -4.975 65 -12.011 -7.236 65 -10.5 -7.236 24 -10.5
4 16 0 65 -13 -4.975 65 -12.011 -4.018 20.201 -12.201 0 21 -13
3 16 -4.018 20.201 -12.201 -4.975 65 -12.011 -4.975 19.562 -12.011
2 24 9.701 6.482 -8.431 10.5 10.5 -7.235
2 24 0 0 -13 4.018 .799 -12.201
2 24 9.701 6.482 -8.431 9.192 5.72 -9.192
2 24 7.425 3.075 -10.374 9.192 5.72 -9.192
2 24 4.018 .799 -12.201 4.975 1.438 -12.011
2 24 7.425 3.075 -10.374 4.975 1.438 -12.011
2 24 9.701 14.518 -8.431 10.5 10.5 -7.235
2 24 4.975 19.562 -12.011 7.425 17.925 -10.374
2 24 4.975 19.562 -12.011 4.018 20.201 -12.201
2 24 9.192 15.28 -9.192 9.701 14.518 -8.431
2 24 9.192 15.28 -9.192 7.425 17.925 -10.374
2 24 0 21 -13 4.018 20.201 -12.201
2 24 -9.701 6.482 -8.431 -10.5 10.5 -7.235
2 24 0 0 -13 -4.018 .799 -12.201
2 24 -9.701 6.482 -8.431 -9.192 5.72 -9.192
2 24 -7.425 3.075 -10.374 -9.192 5.72 -9.192
2 24 -4.018 .799 -12.201 -4.975 1.438 -12.011
2 24 -7.425 3.075 -10.374 -4.975 1.438 -12.011
2 24 -9.701 14.518 -8.431 -10.5 10.5 -7.235
2 24 -4.975 19.562 -12.011 -7.425 17.925 -10.374
2 24 -4.975 19.562 -12.011 -4.018 20.201 -12.201
2 24 -9.192 15.28 -9.192 -9.701 14.518 -8.431
2 24 -9.192 15.28 -9.192 -7.425 17.925 -10.374
2 24 0 21 -13 -4.018 20.201 -12.201

5 24 9.192 5.72 -9.192 9.192 0 -9.192 12.0107 0 -4.9751 4.975 0 -12.011
5 24 4.975 0 -12.011 4.975 1.438 -12.011 9.192 0 -9.192 0 0 -13
5 24 -4.9751 0 -12.0107 -4.975 1.438 -12.011 0 0 -13 -9.1923 0 -9.1923
5 24 -9.192 5.72 -9.192 -9.1923 0 -9.1923 -4.9751 0 -12.0107 -12.011 0 -4.975
5 24 9.192 15.28 -9.192 9.192 24 -9.192 12.011 24 -4.975 7.236 24 -10.5
5 24 4.975 19.562 -12.011 4.975 65 -12.011 7.236 65 -10.5 0 65 -13
5 24 0 65 -13 0 21 -13 4.018 20.201 -12.201 -4.018 20.201 -12.201
5 24 -4.975 65 -12.011 -4.975 19.562 -12.011 -7.236 65 -10.5 0 65 -13
5 24 -9.192 24 -9.192 -9.192 15.28 -9.192 -12.011 24 -4.975 -7.236 24 -10.5

0 // Visor Inner Side
4 16 0 0 -13 4.018 .799 -12.201 4.018 .799 -24 0 0 -24
3 16 4.018 .799 -24 4.018 .799 -12.201 4.975 1.438 -12.011
4 16 4.975 1.438 -12.011 7.425 3.075 -10.374 7.425 3.075 -24 4.018 .799 -24
4 16 9.701 6.482 -24 7.425 3.075 -24 7.425 3.075 -10.374 9.192 5.72 -9.192
3 16 9.701 6.482 -24 9.192 5.72 -9.192 9.701 6.482 -8.431
4 16 10.5 10.5 -24 9.701 6.482 -24 9.701 6.482 -8.431 10.5 10.5 -7.235
4 16 10.5 10.5 -24 10.5 10.5 -7.235 9.701 14.518 -8.431 9.701 14.518 -24
3 16 9.701 14.518 -24 9.701 14.518 -8.431 9.192 15.28 -9.192
4 16 9.192 15.28 -9.192 7.425 17.925 -10.374 7.425 17.925 -24 9.701 14.518 -24
4 16 7.425 17.925 -10.374 4.975 19.562 -12.011 4.018 20.201 -24 7.425 17.925 -24
3 16 4.018 20.201 -24 4.975 19.562 -12.011 4.018 20.201 -12.201
4 16 0 21 -24 4.018 20.201 -24 4.018 20.201 -12.201 0 21 -13

4 16 -4.018 .799 -24 -4.018 .799 -12.201 0 0 -13 0 0 -24
3 16 -4.018 .799 -12.201 -4.018 .799 -24 -4.975 1.438 -12.011
4 16 -7.425 3.075 -24 -7.425 3.075 -10.374 -4.975 1.438 -12.011 -4.018 .799 -24
4 16 -7.425 3.075 -10.374 -7.425 3.075 -24 -9.701 6.482 -24 -9.192 5.72 -9.192
3 16 -9.192 5.72 -9.192 -9.701 6.482 -24 -9.701 6.482 -8.431
4 16 -9.701 6.482 -8.431 -9.701 6.482 -24 -10.5 10.5 -24 -10.5 10.5 -7.235
4 16 -9.701 14.518 -8.431 -10.5 10.5 -7.235 -10.5 10.5 -24 -9.701 14.518 -24
3 16 -9.701 14.518 -8.431 -9.701 14.518 -24 -9.192 15.28 -9.192
4 16 -7.425 17.925 -24 -7.425 17.925 -10.374 -9.192 15.28 -9.192 -9.701 14.518 -24
4 16 -4.018 20.201 -24 -4.975 19.562 -12.011 -7.425 17.925 -10.374 -7.425 17.925 -24
3 16 -4.975 19.562 -12.011 -4.018 20.201 -24 -4.018 20.201 -12.201
4 16 -4.018 20.201 -12.201 -4.018 20.201 -24 0 21 -24 0 21 -13

2 24 0 0 -24 4.018 .799 -24
2 24 4.018 .799 -24 7.425 3.075 -24
2 24 7.425 3.075 -24 9.701 6.482 -24
2 24 9.701 6.482 -24 10.5 10.5 -24
2 24 10.5 10.5 -24 9.701 14.518 -24
2 24 9.701 14.518 -24 7.425 17.925 -24
2 24 7.425 17.925 -24 4.018 20.201 -24
2 24 4.018 20.201 -24 0 21 -24
2 24 0 21 -24 -4.018 20.201 -24
2 24 -4.018 20.201 -24 -7.425 17.925 -24
2 24 -7.425 17.925 -24 -9.701 14.518 -24
2 24 -9.701 14.518 -24 -10.5 10.5 -24
2 24 -10.5 10.5 -24 -9.701 6.482 -24
2 24 -9.701 6.482 -24 -7.425 3.075 -24
2 24 -7.425 3.075 -24 -4.018 .799 -24
2 24 -4.018 .799 -24 0 0 -24

5 24 -7.425 3.075 -10.374 -7.425 3.075 -24 -4.975 1.438 -12.011 -9.701 6.482 -24
5 24 4.018 .799 -24 4.018 .799 -12.201 0 0 -24 4.975 1.438 -12.011
5 24 -4.018 20.201 -24 -4.018 20.201 -12.201 0 21 -24 -4.975 19.562 -12.011
5 24 0 0 -24 0 0 -13 -4.018 .799 -24 4.018 .799 -12.201
5 24 9.701 14.518 -24 9.701 14.518 -8.431 9.192 15.28 -9.192 10.5 10.5 -24
5 24 -4.018 .799 -12.201 -4.018 .799 -24 -4.975 1.438 -12.011 0 0 -13
5 24 -9.701 6.482 -24 -9.701 6.482 -8.431 -10.5 10.5 -24 -9.192 5.72 -9.192
5 24 -7.425 17.925 -10.374 -7.425 17.925 -24 -9.192 15.28 -9.192 -4.018 20.201 -24
5 24 -10.5 10.5 -24 -10.5 10.5 -7.235 -9.701 14.518 -24 -9.701 6.482 -8.431
5 24 9.701 6.482 -8.431 9.701 6.482 -24 9.192 5.72 -9.192 10.5 10.5 -7.235
5 24 4.018 20.201 -12.201 4.018 20.201 -24 0 21 -13 4.975 19.562 -12.011
5 24 -9.701 14.518 -8.431 -9.701 14.518 -24 -9.192 15.28 -9.192 -10.5 10.5 -7.235
5 24 7.425 3.075 -10.374 7.425 3.075 -24 4.018 .799 -24 9.192 5.72 -9.192
5 24 7.425 17.925 -24 7.425 17.925 -10.374 9.701 14.518 -24 4.975 19.562 -12.011
5 24 0 21 -13 0 21 -24 4.018 20.201 -24 -4.018 20.201 -12.201
5 24 10.5 10.5 -24 10.5 10.5 -7.235 9.701 14.518 -8.431 9.701 6.482 -24

0 // Visor Front and Outside
4 16 0 -3.5 -24 0 0 -24 4.018 .799 -24 5.358 -2.435 -24
4 16 5.358 -2.435 -24 4.018 .799 -24 7.425 3.075 -24 9.899 .601 -24
4 16 9.899 .601 -24 7.425 3.075 -24 9.701 6.482 -24 12.935 5.142 -24
4 16 14 10.5 -24 12.935 5.142 -24 9.701 6.482 -24 10.5 10.5 -24
4 16 14 10.5 -24 10.5 10.5 -24 9.701 14.518 -24 12.935 15.858 -24
4 16 9.701 14.518 -24 7.425 17.925 -24 9.899 20.399 -24 12.935 15.858 -24
4 16 9.899 20.399 -24 7.425 17.925 -24 4.018 20.201 -24 5.358 23.435 -24
4 16 4.018 20.201 -24 0 21 -24 0 24.5 -24 5.358 23.435 -24
4 16 -4.018 .799 -24 0 0 -24 0 -3.5 -24 -5.358 -2.435 -24
4 16 -7.425 3.075 -24 -4.018 .799 -24 -5.358 -2.435 -24 -9.899 .601 -24
4 16 -9.701 6.482 -24 -7.425 3.075 -24 -9.899 .601 -24 -12.935 5.142 -24
4 16 -9.701 6.482 -24 -12.935 5.142 -24 -14 10.5 -24 -10.5 10.5 -24
4 16 -9.701 14.518 -24 -10.5 10.5 -24 -14 10.5 -24 -12.935 15.858 -24
4 16 -9.899 20.399 -24 -7.425 17.925 -24 -9.701 14.518 -24 -12.935 15.858 -24
4 16 -4.018 20.201 -24 -7.425 17.925 -24 -9.899 20.399 -24 -5.358 23.435 -24
4 16 0 24.5 -24 0 21 -24 -4.018 20.201 -24 -5.358 23.435 -24
2 24 0 -3.5 -24 5.358 -2.435 -24
2 24 5.358 -2.435 -24 9.899 .601 -24
2 24 9.899 .601 -24 12.935 5.142 -24
2 24 12.935 5.142 -24 14 10.5 -24
2 24 14 10.5 -24 12.935 15.858 -24
2 24 12.935 15.858 -24 9.899 20.399 -24
2 24 9.899 20.399 -24 5.358 23.435 -24
2 24 5.358 23.435 -24 0 24.5 -24
2 24 0 24.5 -24 -5.358 23.435 -24
2 24 -5.358 23.435 -24 -9.899 20.399 -24
2 24 -9.899 20.399 -24 -12.935 15.858 -24
2 24 -12.935 15.858 -24 -14 10.5 -24
2 24 -14 10.5 -24 -12.935 5.142 -24
2 24 -12.935 5.142 -24 -9.899 .601 -24
2 24 -9.899 .601 -24 -5.358 -2.435 -24
2 24 -5.358 -2.435 -24 0 -3.5 -24

4 16 0 -3.62 -19.2 0 -3.5 -24 5.358 -2.435 -24 5.413 -2.567 -18.274
4 16 10.029 .471 -16.641 7.481 -1.191 -18.061 5.358 -2.435 -24 9.899 .601 -24
3 16 7.481 -1.191 -18.061 5.413 -2.567 -18.274 5.358 -2.435 -24
4 16 10.029 .471 -16.641 9.899 .601 -24 12.935 5.142 -24 13.134 5.06 -15.358
4 16 13.134 5.06 -15.358 12.935 5.142 -24 14 10.5 -24 14.211 10.5 -15.576
4 16 14 10.5 -24 12.935 15.858 -24 13.112 15.931 -16.308 14.211 10.5 -15.576
4 16 12.935 15.858 -24 9.899 20.399 -24 9.999 20.499 -18.384 13.112 15.931 -16.308
4 16 5.394 23.523 -20.175 8.13 21.711 -19.63 9.899 20.399 -24 5.358 23.435 -24
3 16 8.13 21.711 -19.63 9.999 20.499 -18.384 9.899 20.399 -24
4 16 5.394 23.523 -20.175 5.358 23.435 -24 0 24.5 -24 0 24.57 -21.219
4 16 -5.358 -2.435 -24 0 -3.5 -24 0 -3.62 -19.2 -5.413 -2.567 -18.274
4 16 -5.413 -2.567 -18.274 -7.481 -1.191 -18.061 -9.899 .601 -24 -5.358 -2.435 -24
3 16 -7.481 -1.191 -18.061 -10.029 .471 -16.641 -9.899 .601 -24
4 16 -12.935 5.142 -24 -9.899 .601 -24 -10.029 .471 -16.641 -13.134 5.06 -15.358
4 16 -14 10.5 -24 -12.935 5.142 -24 -13.134 5.06 -15.358 -14.211 10.5 -15.576
4 16 -13.112 15.931 -16.308 -12.935 15.858 -24 -14 10.5 -24 -14.211 10.5 -15.576
4 16 -9.999 20.499 -18.384 -9.899 20.399 -24 -12.935 15.858 -24 -13.112 15.931 -16.308
4 16 -9.999 20.499 -18.384 -8.13 21.711 -19.63 -5.358 23.435 -24 -9.899 20.399 -24
3 16 -8.13 21.711 -19.63 -5.394 23.523 -20.175 -5.358 23.435 -24
4 16 0 24.5 -24 -5.358 23.435 -24 -5.394 23.523 -20.175 0 24.57 -21.219
2 24 0 24.57 -21.219 2.934 24 -20.665
2 24 13.112 15.931 -16.308 9.999 20.499 -18.384
2 24 13.112 15.931 -16.308 14.211 10.5 -15.576
2 24 9.999 20.499 -18.384 8.13 21.711 -19.63
2 24 5.394 23.523 -20.175 2.934 24 -20.665
2 24 8.13 21.711 -19.63 5.394 23.523 -20.175
2 24 7.481 -1.191 -18.061 10.029 .471 -16.641
2 24 13.134 5.06 -15.358 14.211 10.5 -15.576
2 24 10.029 .471 -16.641 13.134 5.06 -15.358
2 24 5.413 -2.567 -18.274 7.481 -1.191 -18.061
2 24 5.413 -2.567 -18.274 0 -3.62 -19.2
2 24 0 24.57 -21.219 -2.934 24 -20.665
2 24 -13.112 15.931 -16.308 -9.999 20.499 -18.384
2 24 -13.112 15.931 -16.308 -14.211 10.5 -15.576
2 24 -9.999 20.499 -18.384 -8.13 21.711 -19.63
2 24 -5.394 23.523 -20.175 -2.934 24 -20.665
2 24 -8.13 21.711 -19.63 -5.394 23.523 -20.175
2 24 -7.481 -1.191 -18.061 -10.029 .471 -16.641
2 24 -13.134 5.06 -15.358 -14.211 10.5 -15.576
2 24 -10.029 .471 -16.641 -13.134 5.06 -15.358
2 24 -5.413 -2.567 -18.274 -7.481 -1.191 -18.061
2 24 -5.413 -2.567 -18.274 0 -3.62 -19.2

5 24 14.211 10.5 -15.576 14 10.5 -24 13.134 5.06 -15.358 12.935 15.858 -24
5 24 10.029 .471 -16.641 9.899 .601 -24 5.413 -2.567 -18.274 12.935 5.142 -24
5 24 0 -3.62 -19.2 0 -3.5 -24 5.358 -2.435 -24 -5.413 -2.567 -18.274
5 24 -12.935 5.142 -24 -13.134 5.06 -15.358 -9.899 .601 -24 -14.211 10.5 -15.576
5 24 -13.112 15.931 -16.308 -12.935 15.858 -24 -14 10.5 -24 -9.999 20.499 -18.384
5 24 5.358 -2.435 -24 5.413 -2.567 -18.274 9.899 .601 -24 0 -3.62 -19.2
5 24 12.935 15.858 -24 13.112 15.931 -16.308 14.211 10.5 -15.576 9.899 20.399 -24
5 24 -9.899 .601 -24 -10.029 .471 -16.641 -5.358 -2.435 -24 -13.134 5.06 -15.358
5 24 5.358 23.435 -24 5.394 23.523 -20.175 9.999 20.499 -18.384 0 24.5 -24
5 24 13.134 5.06 -15.358 12.935 5.142 -24 10.029 .471 -16.641 14 10.5 -24
5 24 -9.899 20.399 -24 -9.999 20.499 -18.384 -12.935 15.858 -24 -5.394 23.523 -20.175
5 24 9.999 20.499 -18.384 9.899 20.399 -24 13.112 15.931 -16.308 5.358 23.435 -24
5 24 0 24.5 -24 0 24.57 -21.219 -5.358 23.435 -24 5.394 23.523 -20.175
5 24 -5.413 -2.567 -18.274 -5.358 -2.435 -24 -10.029 .471 -16.641 0 -3.5 -24
5 24 -5.394 23.523 -20.175 -5.358 23.435 -24 -9.899 20.399 -24 0 24.57 -21.219
5 24 -14 10.5 -24 -14.211 10.5 -15.576 -12.935 5.142 -24 -13.112 15.931 -16.308

0 // Complementary Cond-Lines
5 24 0 -27.5 -9.25 0 -32.533 -5.5 3.54 -27.5 -8.55 -3.54 -27.5 -8.55
5 24 0 -19.5 -13.5 0 -27.5 -9.25 -5.17 -19.5 -12.47 5.17 -19.5 -12.47
5 24 5.5 -32.533 0 9.25 -27.5 0 8.55 -27.5 -3.54 8.55 -27.5 3.54
5 24 9.25 -27.5 0 13.5 -19.5 0 12.47 -19.5 5.17 12.47 -19.5 -5.17
5 24 0 -32.533 5.5 0 -27.5 9.25 -3.54 -27.5 8.55 3.54 -27.5 8.55
5 24 0 -27.5 9.25 0 -19.5 13.5 -5.17 -19.5 12.47 5.17 -19.5 12.47
5 24 -5.5 -32.533 0 -9.25 -27.5 0 -8.55 -27.5 3.54 -8.55 -27.5 -3.54
5 24 -9.25 -27.5 0 -13.5 -19.5 0 -12.47 -19.5 5.17 -12.47 -19.5 -5.17

5 24 -13 0 0 -13 24 0 -12.011 24 -4.975 -12.011 24 4.975
5 24 -14 24 0 -17.75 24 0 -17.598 24.761 -4.018 -17.598 24.761 4.018
5 24 13 0 0 13 24 0 12.011 24 -4.975 12.011 24 4.975
5 24 17.75 24 0 14 24 0 17.598 24.761 -4.018 17.598 24.761 4.018
5 24 0 55 -17.833 0 65 -16 -6.1235 65 -14.7822 6.1232 65 -14.7824
5 24 0 55 17.833 0 65 16 -6.1235 65 14.7822 6.1232 65 14.7824
