0 Slope Brick Curved  2 x  2 x  0.667 with Arctic 2018 Logo Pattern
0 Name: 15068p08.dat
0 Author: Gerald Lasser [GeraldLasser]
0 !LDRAW_ORG Part UPDATE 2020-03
0 !LICENSE Redistributable under CCAL version 2.0 : see CAreadme.txt

0 BFC CERTIFY CCW

0 !KEYWORDS Bricklink 15068pb140, set 60190, set 60191, set 60193, set 60198
0 !KEYWORDS White Mountain, Star

0 !HISTORY 2020-12-29 [PTadmin] Official Update 2020-03

1 16 0 0 0 1 0 0 0 1 0 0 0 1 s\15068s01.dat

5 24 -20 -15.6524 12.616 20 -15.6524 12.616 20 -16.0001 20 20 -14.6036 5.36
5 24 -20 -14.6036 5.36 20 -14.6036 5.36 20 -15.6524 12.616 20 -12.8827 -1.648
5 24 20 -12.8827 -1.648 -20 -12.8827 -1.648 -20 -14.6036 5.36 -20 -10.5099 -8.284
5 24 -20 -10.5099 -8.284 20 -10.5099 -8.284 20 -12.8827 -1.648 20 -7.5337 -14.4398
5 24 20 -7.5337 -14.4398 -20 -7.5337 -14.4398 -20 -4 -20 -20 -10.5099 -8.284

4 15 -3.7767 -7.5316 -14.436 -2.1537 -7.3267 -14.7588 0 -7.2371 -14.9 3.7767 -7.5316 -14.436
3 15 3.7767 -7.5316 -14.436 0 -7.2371 -14.9 2.1537 -7.3267 -14.7588
4 16 -3.7767 -7.5316 -14.436 -20 -7.5316 -14.436 -20 -3.9999 -20 -2.1537 -7.3267 -14.7588
4 16 0 -7.2371 -14.9 -2.1537 -7.3267 -14.7588 -20 -3.9999 -20 20 -3.9999 -20
4 16 20 -3.9999 -20 20 -7.5316 -14.436 3.7767 -7.5316 -14.436 2.1537 -7.3267 -14.7588
3 16 2.1537 -7.3267 -14.7588 0 -7.2371 -14.9 20 -3.9999 -20
4 15 -14.0059 -12.7022 -2.1529 -14.1064 -12.8827 -1.648 -16.1412 -12.8827 -1.648 -15.9378 -12.5171 -2.6705
4 15 -14.0059 -12.7022 -2.1529 -15.9378 -12.5171 -2.6705 -15.244 -11.7863 -4.7143 -14.2894 -11.0942 -6.65
4 15 -7.4 -11.8987 -4.4 -14.0059 -12.7022 -2.1529 -14.2894 -11.0942 -6.65 -13.1976 -10.5099 -8.284
4 15 -1.7059 -12.0228 -4.0529 -7.4 -11.8987 -4.4 -13.1976 -10.5099 -8.284 8.9937 -10.5099 -8.284
3 15 11.5036 -10.8878 -7.227 10.5422 -10.5099 -8.284 13.1976 -10.5099 -8.284
4 15 12.5574 -11.4517 -5.65 11.5036 -10.8878 -7.227 13.1976 -10.5099 -8.284 14.2894 -11.0942 -6.65
4 15 13.3963 -12.06 -3.9489 12.5574 -11.4517 -5.65 14.2894 -11.0942 -6.65 15.244 -11.7863 -4.7143
4 15 14.0059 -12.7022 -2.1529 13.3963 -12.06 -3.9489 15.244 -11.7863 -4.7143 15.9378 -12.5171 -2.6705
4 15 14.1064 -12.8827 -1.648 14.0059 -12.7022 -2.1529 15.9378 -12.5171 -2.6705 16.1412 -12.8827 -1.648
3 15 -.7119 -12.8827 -1.648 -2.673 -12.8827 -1.648 -1.7059 -12.5591 -2.5529
4 15 -13.5721 -12.8827 -1.648 -14.0059 -12.7022 -2.1529 -7.4 -11.8987 -4.4 -4.9303 -12.8827 -1.648
4 15 -4.1735 -12.8827 -1.648 -7.4 -11.8987 -4.4 -1.7059 -12.0228 -4.0529 -3.867 -12.8827 -1.648
4 321 5.2867 -12.8827 -1.648 5.2259 -12.5052 -2.7038 7.15 -12.671 -2.24 8.5947 -12.8827 -1.648
4 15 5.2259 -12.5052 -2.7038 5.2867 -12.8827 -1.648 4.357 -12.8827 -1.648 4.503 -12.135 -3.7391
3 15 4.503 -12.135 -3.7391 5.1299 -11.9081 -4.3736 5.2259 -12.5052 -2.7038
3 272 -13.5721 -12.8827 -1.648 -14.1064 -12.8827 -1.648 -14.0059 -12.7022 -2.1529
3 272 4.357 -12.8827 -1.648 2.4367 -12.8827 -1.648 4.503 -12.135 -3.7391
3 272 -4.1735 -12.8827 -1.648 -4.9303 -12.8827 -1.648 -7.4 -11.8987 -4.4
4 272 -2.673 -12.8827 -1.648 -3.867 -12.8827 -1.648 -1.7059 -12.0228 -4.0529 -1.7059 -12.5591 -2.5529
4 272 -.7119 -12.8827 -1.648 -1.7059 -12.5591 -2.5529 -1.7059 -12.0228 -4.0529 .5936 -12.8827 -1.648
4 15 .5936 -12.8827 -1.648 -1.7059 -12.0228 -4.0529 4.503 -12.135 -3.7391 2.4367 -12.8827 -1.648
3 15 5.1299 -11.9081 -4.3736 4.503 -12.135 -3.7391 -1.7059 -12.0228 -4.0529
3 15 -1.7059 -12.0228 -4.0529 8.9937 -10.5099 -8.284 5.1299 -11.9081 -4.3736
4 272 7.15 -12.671 -2.24 5.2259 -12.5052 -2.7038 5.1299 -11.9081 -4.3736 10.5422 -10.5099 -8.284
3 272 5.1299 -11.9081 -4.3736 8.9937 -10.5099 -8.284 10.5422 -10.5099 -8.284
4 272 7.15 -12.671 -2.24 10.5422 -10.5099 -8.284 11.5036 -10.8878 -7.227 12.5574 -11.4517 -5.65
4 272 8.5947 -12.8827 -1.648 7.15 -12.671 -2.24 12.5574 -11.4517 -5.65 13.3963 -12.06 -3.9489
4 272 8.5947 -12.8827 -1.648 13.3963 -12.06 -3.9489 14.0059 -12.7022 -2.1529 14.1064 -12.8827 -1.648
3 16 -16.1412 -12.8827 -1.648 -20 -12.8827 -1.648 -15.9378 -12.5171 -2.6705
4 16 -15.244 -11.7863 -4.7143 -15.9378 -12.5171 -2.6705 -20 -12.8827 -1.648 -20 -10.5099 -8.284
3 16 -15.244 -11.7863 -4.7143 -20 -10.5099 -8.284 -14.2894 -11.0942 -6.65
3 16 -14.2894 -11.0942 -6.65 -20 -10.5099 -8.284 -13.1976 -10.5099 -8.284
3 16 20 -12.8827 -1.648 16.1412 -12.8827 -1.648 15.9378 -12.5171 -2.6705
4 16 20 -12.8827 -1.648 15.9378 -12.5171 -2.6705 15.244 -11.7863 -4.7143 20 -10.5099 -8.284
3 16 15.244 -11.7863 -4.7143 14.2894 -11.0942 -6.65 20 -10.5099 -8.284
3 16 14.2894 -11.0942 -6.65 13.1976 -10.5099 -8.284 20 -10.5099 -8.284
4 15 -13.1976 -10.5099 -8.284 -11.6673 -9.6466 -10.0673 -10.0446 -8.9576 -11.4903 -8.25 -8.3771 -12.6894
4 15 -13.1976 -10.5099 -8.284 -8.25 -8.3771 -12.6894 -6.3143 -7.915 -13.644 -3.7767 -7.5316 -14.436
4 15 8.9937 -10.5099 -8.284 -13.1976 -10.5099 -8.284 -3.7767 -7.5316 -14.436 3.7767 -7.5316 -14.436
4 15 8.9937 -10.5099 -8.284 3.7767 -7.5316 -14.436 6.3143 -7.915 -13.644 9.8 -10.1148 -9.1
4 15 9.8 -10.1148 -9.1 6.3143 -7.915 -13.644 8.25 -8.3771 -12.6894 10.0446 -8.9576 -11.4903
4 15 9.8 -10.1148 -9.1 10.0446 -8.9576 -11.4903 11.6673 -9.6466 -10.0673 10.5422 -10.5099 -8.284
3 15 13.1976 -10.5099 -8.284 10.5422 -10.5099 -8.284 11.6673 -9.6466 -10.0673
3 272 10.5422 -10.5099 -8.284 8.9937 -10.5099 -8.284 9.8 -10.1148 -9.1
4 16 -11.6673 -9.6466 -10.0673 -13.1976 -10.5099 -8.284 -20 -10.5099 -8.284 -20 -7.5316 -14.436
3 16 -11.6673 -9.6466 -10.0673 -20 -7.5316 -14.436 -10.0446 -8.9576 -11.4903
3 16 -10.0446 -8.9576 -11.4903 -20 -7.5316 -14.436 -8.25 -8.3771 -12.6894
3 16 -8.25 -8.3771 -12.6894 -20 -7.5316 -14.436 -6.3143 -7.915 -13.644
3 16 -6.3143 -7.915 -13.644 -20 -7.5316 -14.436 -3.7767 -7.5316 -14.436
4 16 20 -10.5099 -8.284 13.1976 -10.5099 -8.284 11.6673 -9.6466 -10.0673 20 -7.5316 -14.436
3 16 11.6673 -9.6466 -10.0673 10.0446 -8.9576 -11.4903 20 -7.5316 -14.436
3 16 10.0446 -8.9576 -11.4903 8.25 -8.3771 -12.6894 20 -7.5316 -14.436
3 16 8.25 -8.3771 -12.6894 6.3143 -7.915 -13.644 20 -7.5316 -14.436
3 16 6.3143 -7.915 -13.644 3.7767 -7.5316 -14.436 20 -7.5316 -14.436
4 15 14.0059 -14.6026 5.3529 16.0393 -14.6036 5.36 15.9378 -14.6774 5.8705 13.5071 -14.8062 6.7615
4 15 13.5071 -14.8062 6.7615 15.9378 -14.6774 5.8705 15.244 -14.9728 7.9143 13.1008 -14.9441 7.7155
4 15 12.5574 -15.1081 8.85 15.244 -14.9728 7.9143 14.2894 -15.2526 9.85 11.5036 -15.336 10.427
4 15 11.5036 -15.336 10.427 14.2894 -15.2526 9.85 13.0903 -15.512 11.6446 10.2531 -15.5421 11.8531
4 15 10.2531 -15.5421 11.8531 13.0903 -15.512 11.6446 12.2384 -15.6524 12.616 9.3831 -15.6524 12.616
4 15 -11.5036 -15.336 10.427 -12.2384 -15.6524 12.616 -13.0903 -15.512 11.6446 -12.5574 -15.1081 8.85
4 15 -12.5574 -15.1081 8.85 -13.0903 -15.512 11.6446 -14.2894 -15.2526 9.85 -13.1747 -14.9244 7.579
4 15 -13.1747 -14.9244 7.579 -14.2894 -15.2526 9.85 -15.244 -14.9728 7.9143 -13.4533 -14.8315 6.9365
4 15 -14.0059 -14.6026 5.3529 -15.244 -14.9728 7.9143 -15.9378 -14.6774 5.8705 -16.0393 -14.6036 5.36
3 15 -7 -14.6961 6 -7.55 -14.6036 5.36 -6.36 -14.6036 5.36
4 321 -11.5036 -15.336 10.427 -12.5574 -15.1081 8.85 -13.1747 -14.9244 7.579 -10.2531 -15.5421 11.8531
4 321 -9.3831 -15.6524 12.616 -10.2531 -15.5421 11.8531 -13.1747 -14.9244 7.579 -.49 -15.3061 10.22
3 321 -.49 -15.3061 10.22 -13.1747 -14.9244 7.579 .2 -15.1587 9.2
3 321 .2 -15.1587 9.2 -13.1747 -14.9244 7.579 .94 -15.0647 8.55
3 321 .94 -15.0647 8.55 -13.1747 -14.9244 7.579 2.27 -15.004 8.13
4 15 3.3834 -14.6036 5.36 3.8566 -14.6464 5.6558 3.2508 -14.7321 6.2487 2.6954 -14.6036 5.36
4 15 3.2508 -14.7321 6.2487 3.8566 -14.6464 5.6558 4.8 -14.8696 7.2 3.2454 -15.0083 8.16
4 15 3.8487 -15.0935 8.7492 2.2544 -15.2375 9.7456 3.2454 -15.0083 8.16 4.8 -14.8696 7.2
4 15 6.3505 -15.0074 8.1535 7.3456 -15.2375 9.7456 5.76 -15.0943 8.7546 4.8 -14.8696 7.2
4 15 6.9046 -14.6036 5.36 6.3442 -14.7332 6.2566 5.7535 -14.6455 5.6495 6.2167 -14.6036 5.36
4 15 5.7535 -14.6455 5.6495 6.3442 -14.7332 6.2566 4.8 -14.8696 7.2 3.8566 -14.6464 5.6558
3 15 6.3505 -15.0074 8.1535 4.8 -14.8696 7.2 6.3442 -14.7332 6.2566
3 15 6.3505 -15.0074 8.1535 6.3442 -14.7332 6.2566 7.71 -14.7395 6.3
4 15 3.8487 -15.0935 8.7492 4.8 -14.8696 7.2 5.76 -15.0943 8.7546 4.1049 -15.6524 12.616
3 15 -15.244 -14.9728 7.9143 -14.0059 -14.6026 5.3529 -13.4533 -14.8315 6.9365
3 15 12.5574 -15.1081 8.85 13.1008 -14.9441 7.7155 15.244 -14.9728 7.9143
3 321 -9.3831 -15.6524 12.616 -.49 -15.3061 10.22 -.65 -15.442 11.16
3 321 -9.3831 -15.6524 12.616 -.65 -15.442 11.16 -.33 -15.5489 11.9
3 321 -9.3831 -15.6524 12.616 -.33 -15.5489 11.9 .4 -15.6241 12.42
3 321 1.0282 -15.6524 12.616 -9.3831 -15.6524 12.616 .4 -15.6241 12.42
3 15 5.5201 -15.6524 12.616 4.1049 -15.6524 12.616 5.76 -15.0943 8.7546
3 321 9.3831 -15.6524 12.616 7.7632 -15.6524 12.616 8.83 -15.6255 12.43
3 321 9.3831 -15.6524 12.616 8.83 -15.6255 12.43 10.2531 -15.5421 11.8531
4 15 3.2508 -14.7321 6.2487 3.2454 -15.0083 8.16 2.27 -15.004 8.13 -1.05 -14.7496 6.37
4 15 2.27 -15.004 8.13 -13.1747 -14.9244 7.579 -13.4533 -14.8315 6.9365 -1.05 -14.7496 6.37
4 321 9.8936 -14.6036 5.36 7.71 -14.7395 6.3 6.3442 -14.7332 6.2566 6.9046 -14.6036 5.36
3 321 7.71 -14.7395 6.3 9.8936 -14.6036 5.36 9 -14.6846 5.92
3 321 3.8566 -14.6464 5.6558 3.3834 -14.6036 5.36 3.868 -14.6036 5.36
4 15 5.69 -14.6036 5.36 5.7535 -14.6455 5.6495 3.8566 -14.6464 5.6558 3.868 -14.6036 5.36
3 321 5.7535 -14.6455 5.6495 5.69 -14.6036 5.36 6.2167 -14.6036 5.36
4 321 3.2508 -14.7321 6.2487 -1.05 -14.7496 6.37 -.06 -14.6701 5.82 2.6954 -14.6036 5.36
3 321 -.06 -14.6701 5.82 .2606 -14.6036 5.36 2.6954 -14.6036 5.36
4 272 -7.55 -14.6036 5.36 -7 -14.6961 6 -13.4533 -14.8315 6.9365 -14.0059 -14.6026 5.3529
4 272 -1.05 -14.7496 6.37 -13.4533 -14.8315 6.9365 -7 -14.6961 6 -.06 -14.6701 5.82
4 272 .2606 -14.6036 5.36 -.06 -14.6701 5.82 -7 -14.6961 6 -6.36 -14.6036 5.36
4 272 9.8936 -14.6036 5.36 14.0059 -14.6026 5.3529 13.5071 -14.8062 6.7615 9 -14.6846 5.92
3 272 13.5071 -14.8062 6.7615 7.71 -14.7395 6.3 9 -14.6846 5.92
4 272 7.3456 -15.2375 9.7456 6.3505 -15.0074 8.1535 13.1008 -14.9441 7.7155 12.5574 -15.1081 8.85
4 272 7.3456 -15.2375 9.7456 12.5574 -15.1081 8.85 11.5036 -15.336 10.427 10.2531 -15.5421 11.8531
4 272 7.3456 -15.2375 9.7456 10.2531 -15.5421 11.8531 8.83 -15.6255 12.43 7.7632 -15.6524 12.616
4 272 7.3456 -15.2375 9.7456 7.7632 -15.6524 12.616 5.5201 -15.6524 12.616 5.76 -15.0943 8.7546
4 272 2.27 -15.004 8.13 3.2454 -15.0083 8.16 2.2544 -15.2375 9.7456 .94 -15.0647 8.55
4 272 .2 -15.1587 9.2 .94 -15.0647 8.55 2.2544 -15.2375 9.7456 -.49 -15.3061 10.22
4 272 -.65 -15.442 11.16 -.49 -15.3061 10.22 2.2544 -15.2375 9.7456 -.33 -15.5489 11.9
4 272 .4 -15.6241 12.42 -.33 -15.5489 11.9 2.2544 -15.2375 9.7456 1.0282 -15.6524 12.616
4 272 4.1049 -15.6524 12.616 1.0282 -15.6524 12.616 2.2544 -15.2375 9.7456 3.8487 -15.0935 8.7492
3 16 -12.2384 -15.6524 12.616 -20 -15.6524 12.616 -13.0903 -15.512 11.6446
3 16 -20 -15.6524 12.616 -14.2894 -15.2526 9.85 -13.0903 -15.512 11.6446
4 16 -15.244 -14.9728 7.9143 -14.2894 -15.2526 9.85 -20 -15.6524 12.616 -20 -14.6036 5.36
3 16 -15.244 -14.9728 7.9143 -20 -14.6036 5.36 -15.9378 -14.6774 5.8705
3 16 -15.9378 -14.6774 5.8705 -20 -14.6036 5.36 -16.0393 -14.6036 5.36
3 16 20 -15.6524 12.616 12.2384 -15.6524 12.616 13.0903 -15.512 11.6446
3 16 20 -15.6524 12.616 13.0903 -15.512 11.6446 14.2894 -15.2526 9.85
4 16 20 -15.6524 12.616 14.2894 -15.2526 9.85 15.244 -14.9728 7.9143 20 -14.6036 5.36
3 16 15.244 -14.9728 7.9143 15.9378 -14.6774 5.8705 20 -14.6036 5.36
3 16 15.9378 -14.6774 5.8705 16.0393 -14.6036 5.36 20 -14.6036 5.36
3 15 -12.2384 -15.6524 12.616 -11.5036 -15.336 10.427 -10.2531 -15.5421 11.8531
3 15 -9.3831 -15.6524 12.616 -12.2384 -15.6524 12.616 -10.2531 -15.5421 11.8531
4 15 -14.5 -13.6803 1.6 -14.376 -14.1451 3.4926 -16.3588 -14.2092 3.7537 -16.5 -13.6803 1.6
4 15 -14.376 -13.2155 -.2926 -14.5 -13.6803 1.6 -16.5 -13.6803 1.6 -16.3588 -13.1514 -.5537
4 15 -14.1064 -12.8827 -1.648 -14.376 -13.2155 -.2926 -16.3588 -13.1514 -.5537 -16.1412 -12.8827 -1.648
4 15 14.376 -13.2155 -.2926 14.1064 -12.8827 -1.648 16.1412 -12.8827 -1.648 16.3588 -13.1514 -.5537
4 15 14.5 -13.6803 1.6 14.376 -13.2155 -.2926 16.3588 -13.1514 -.5537 16.5 -13.6803 1.6
4 15 14.376 -14.1451 3.4926 14.5 -13.6803 1.6 16.5 -13.6803 1.6 16.3588 -14.2092 3.7537
4 15 14.0059 -14.6026 5.3529 14.376 -14.1451 3.4926 16.3588 -14.2092 3.7537 16.0393 -14.6036 5.36
4 15 -14.376 -14.1451 3.4926 -14.0059 -14.6026 5.3529 -16.0393 -14.6036 5.36 -16.3588 -14.2092 3.7537
4 15 -3.9 -13.1646 -.5 -6.36 -14.6036 5.36 -7.55 -14.6036 5.36 -13.5721 -12.8827 -1.648
4 15 0 -13.0418 -1 -6.36 -14.6036 5.36 -3.9 -13.1646 -.5 -.7119 -12.8827 -1.648
3 15 -3.9 -13.1646 -.5 -2.673 -12.8827 -1.648 -.7119 -12.8827 -1.648
3 15 -3.9 -13.1646 -.5 -13.5721 -12.8827 -1.648 -4.9303 -12.8827 -1.648
3 15 -4 -12.919 -1.5 -4.1735 -12.8827 -1.648 -3.867 -12.8827 -1.648
4 321 10.5 -14.5103 4.98 9.8936 -14.6036 5.36 7.3456 -14.4304 4.6544 11.6 -14.196 3.7
4 321 12 -13.9259 2.6 11.6 -14.196 3.7 7.3456 -14.4304 4.6544 11.9 -13.6557 1.5
4 321 11.2 -13.3856 .4 11.9 -13.6557 1.5 7.3456 -14.4304 4.6544 10.13 -13.1106 -.72
4 321 5.2867 -12.8827 -1.648 8.5947 -12.8827 -1.648 7.3456 -14.4304 4.6544 5.69 -14.6036 5.36
3 15 3.3834 -14.6036 5.36 2.6954 -14.6036 5.36 2.2544 -14.4304 4.6544
3 15 6.9046 -14.6036 5.36 6.2167 -14.6036 5.36 7.3456 -14.4304 4.6544
3 321 9.8936 -14.6036 5.36 6.9046 -14.6036 5.36 7.3456 -14.4304 4.6544
3 321 8.5947 -12.8827 -1.648 10.13 -13.1106 -.72 7.3456 -14.4304 4.6544
4 321 2.2544 -14.4304 4.6544 1.5 -13.4838 .8 4.357 -12.8827 -1.648 3.868 -14.6036 5.36
3 321 3.868 -14.6036 5.36 3.3834 -14.6036 5.36 2.2544 -14.4304 4.6544
4 15 5.69 -14.6036 5.36 3.868 -14.6036 5.36 4.357 -12.8827 -1.648 5.2867 -12.8827 -1.648
3 321 6.2167 -14.6036 5.36 5.69 -14.6036 5.36 7.3456 -14.4304 4.6544
4 321 2.2544 -14.4304 4.6544 2.6954 -14.6036 5.36 .2606 -14.6036 5.36 .4 -14.5545 5.16
3 321 .4 -14.5545 5.16 .45 -14.3679 4.4 2.2544 -14.4304 4.6544
4 321 2.2544 -14.4304 4.6544 .45 -14.3679 4.4 .33 -14.2009 3.72 1.5 -13.4838 .8
3 321 .33 -14.2009 3.72 -.11 -14.0462 3.09 1.5 -13.4838 .8
4 321 -.87 -13.9136 2.55 .62 -13.2505 -.15 1.5 -13.4838 .8 -.11 -14.0462 3.09
3 321 -.87 -13.9136 2.55 -1.68 -13.8276 2.2 .62 -13.2505 -.15
4 272 -7.55 -14.6036 5.36 -14.0059 -14.6026 5.3529 -14.376 -14.1451 3.4926 -14.5 -13.6803 1.6
4 272 -7.55 -14.6036 5.36 -14.5 -13.6803 1.6 -14.376 -13.2155 -.2926 -14.1064 -12.8827 -1.648
3 272 -7.55 -14.6036 5.36 -14.1064 -12.8827 -1.648 -13.5721 -12.8827 -1.648
4 272 .45 -14.3679 4.4 .4 -14.5545 5.16 .2606 -14.6036 5.36 .33 -14.2009 3.72
4 272 -.11 -14.0462 3.09 .33 -14.2009 3.72 .2606 -14.6036 5.36 -.87 -13.9136 2.55
4 272 -1.68 -13.8276 2.2 -.87 -13.9136 2.55 .2606 -14.6036 5.36 -6.36 -14.6036 5.36
4 272 -1.68 -13.8276 2.2 -6.36 -14.6036 5.36 0 -13.0418 -1 .62 -13.2505 -.15
4 272 .62 -13.2505 -.15 0 -13.0418 -1 1.5 -13.1155 -.7 1.5 -13.4838 .8
4 272 4.357 -12.8827 -1.648 1.5 -13.4838 .8 1.5 -13.1155 -.7 2.4367 -12.8827 -1.648
4 272 -4.1735 -12.8827 -1.648 -4 -12.919 -1.5 -3.9 -13.1646 -.5 -4.9303 -12.8827 -1.648
4 272 -2.673 -12.8827 -1.648 -3.9 -13.1646 -.5 -4 -12.919 -1.5 -3.867 -12.8827 -1.648
4 272 0 -13.0418 -1 -.7119 -12.8827 -1.648 .5936 -12.8827 -1.648 1.5 -13.1155 -.7
3 15 1.5 -13.1155 -.7 .5936 -12.8827 -1.648 2.4367 -12.8827 -1.648
3 272 10.13 -13.1106 -.72 8.5947 -12.8827 -1.648 14.1064 -12.8827 -1.648
4 272 11.2 -13.3856 .4 10.13 -13.1106 -.72 14.1064 -12.8827 -1.648 14.376 -13.2155 -.2926
4 272 11.2 -13.3856 .4 14.376 -13.2155 -.2926 14.5 -13.6803 1.6 11.9 -13.6557 1.5
4 272 12 -13.9259 2.6 11.9 -13.6557 1.5 14.5 -13.6803 1.6 14.376 -14.1451 3.4926
4 272 11.6 -14.196 3.7 12 -13.9259 2.6 14.376 -14.1451 3.4926 14.0059 -14.6026 5.3529
3 272 14.0059 -14.6026 5.3529 10.5 -14.5103 4.98 11.6 -14.196 3.7
3 272 9.8936 -14.6036 5.36 10.5 -14.5103 4.98 14.0059 -14.6026 5.3529
3 16 -16.0393 -14.6036 5.36 -20 -14.6036 5.36 -16.3588 -14.2092 3.7537
4 16 -16.5 -13.6803 1.6 -16.3588 -14.2092 3.7537 -20 -14.6036 5.36 -20 -12.8827 -1.648
3 16 -16.5 -13.6803 1.6 -20 -12.8827 -1.648 -16.3588 -13.1514 -.5537
3 16 -16.3588 -13.1514 -.5537 -20 -12.8827 -1.648 -16.1412 -12.8827 -1.648
3 16 20 -14.6036 5.36 16.0393 -14.6036 5.36 16.3588 -14.2092 3.7537
4 16 20 -14.6036 5.36 16.3588 -14.2092 3.7537 16.5 -13.6803 1.6 20 -12.8827 -1.648
3 16 16.5 -13.6803 1.6 16.3588 -13.1514 -.5537 20 -12.8827 -1.648
3 16 16.3588 -13.1514 -.5537 16.1412 -12.8827 -1.648 20 -12.8827 -1.648
4 15 12.2384 -15.6524 12.616 11.6673 -15.6831 13.2673 8.827 -15.6754 13.1036 9.3831 -15.6524 12.616
4 15 8.827 -15.6754 13.1036 11.6673 -15.6831 13.2673 10.0446 -15.7501 14.6903 7.25 -15.725 14.1574
4 15 7.25 -15.725 14.1574 10.0446 -15.7501 14.6903 8.25 -15.8065 15.8894 5.3681 -15.7676 15.0634
4 15 6.3143 -15.8515 16.844 4.2908 -15.7846 15.4229 5.3681 -15.7676 15.0634 8.25 -15.8065 15.8894
4 15 4.2908 -15.7846 15.4229 6.3143 -15.8515 16.844 4.2705 -15.8841 17.5378 1.8926 -15.8106 15.976
4 15 1.8926 -15.8106 15.976 4.2705 -15.8841 17.5378 2.1537 -15.904 17.9588 0 -15.8164 16.1
4 15 0 -15.8164 16.1 2.1537 -15.904 17.9588 0 -15.9106 18.1 -1.8926 -15.8106 15.976
4 15 -1.8926 -15.8106 15.976 0 -15.9106 18.1 -2.1537 -15.904 17.9588 -3.7529 -15.7932 15.6059
4 15 -3.7529 -15.7932 15.6059 -2.1537 -15.904 17.9588 -4.2705 -15.8841 17.5378 -5.5489 -15.7645 14.9963
4 15 -5.5489 -15.7645 14.9963 -4.2705 -15.8841 17.5378 -6.3143 -15.8515 16.844 -7.25 -15.725 14.1574
4 15 -7.25 -15.725 14.1574 -6.3143 -15.8515 16.844 -8.25 -15.8065 15.8894 -8.827 -15.6754 13.1036
4 15 -8.827 -15.6754 13.1036 -8.25 -15.8065 15.8894 -10.0446 -15.7501 14.6903 -9.3831 -15.6524 12.616
4 15 -9.3831 -15.6524 12.616 -10.0446 -15.7501 14.6903 -11.6673 -15.6831 13.2673 -12.2384 -15.6524 12.616
4 321 -7.25 -15.725 14.1574 -8.827 -15.6754 13.1036 -9.3831 -15.6524 12.616 -5.5489 -15.7645 14.9963
4 321 -5.5489 -15.7645 14.9963 -9.3831 -15.6524 12.616 1.0282 -15.6524 12.616 -3.7529 -15.7932 15.6059
4 321 -3.7529 -15.7932 15.6059 1.0282 -15.6524 12.616 1.65 -15.6615 12.81 -1.8926 -15.8106 15.976
4 321 0 -15.8164 16.1 -1.8926 -15.8106 15.976 1.65 -15.6615 12.81 1.8926 -15.8106 15.976
4 321 1.8926 -15.8106 15.976 1.65 -15.6615 12.81 3.16 -15.6662 12.91 4.2908 -15.7846 15.4229
3 321 4.2908 -15.7846 15.4229 3.16 -15.6662 12.91 4.1242 -15.6661 12.9072
4 15 5.5035 -15.6649 12.8826 5.3681 -15.7676 15.0634 4.2908 -15.7846 15.4229 4.1242 -15.6661 12.9072
4 15 4.1242 -15.6661 12.9072 4.1049 -15.6524 12.616 5.5201 -15.6524 12.616 5.5035 -15.6649 12.8826
4 321 5.3681 -15.7676 15.0634 5.5035 -15.6649 12.8826 6.88 -15.6597 12.77 7.25 -15.725 14.1574
4 321 9.3831 -15.6524 12.616 7.25 -15.725 14.1574 6.88 -15.6597 12.77 7.7632 -15.6524 12.616
3 321 7.25 -15.725 14.1574 9.3831 -15.6524 12.616 8.827 -15.6754 13.1036
4 272 7.7632 -15.6524 12.616 6.88 -15.6597 12.77 5.5035 -15.6649 12.8826 5.5201 -15.6524 12.616
4 272 1.65 -15.6615 12.81 1.0282 -15.6524 12.616 4.1049 -15.6524 12.616 3.16 -15.6662 12.91
3 272 4.1242 -15.6661 12.9072 3.16 -15.6662 12.91 4.1049 -15.6524 12.616
4 16 -20 -16.0001 20 -20 -15.6524 12.616 -12.2384 -15.6524 12.616 -11.6673 -15.6831 13.2673
3 16 -20 -16.0001 20 -11.6673 -15.6831 13.2673 -10.0446 -15.7501 14.6903
3 16 -20 -16.0001 20 -10.0446 -15.7501 14.6903 -8.25 -15.8065 15.8894
3 16 -20 -16.0001 20 -8.25 -15.8065 15.8894 -6.3143 -15.8515 16.844
3 16 -20 -16.0001 20 -6.3143 -15.8515 16.844 -4.2705 -15.8841 17.5378
3 16 -20 -16.0001 20 -4.2705 -15.8841 17.5378 -2.1537 -15.904 17.9588
4 16 -20 -16.0001 20 -2.1537 -15.904 17.9588 0 -15.9106 18.1 20 -16.0001 20
4 16 12.2384 -15.6524 12.616 20 -15.6524 12.616 20 -16.0001 20 11.6673 -15.6831 13.2673
3 16 20 -16.0001 20 10.0446 -15.7501 14.6903 11.6673 -15.6831 13.2673
3 16 20 -16.0001 20 8.25 -15.8065 15.8894 10.0446 -15.7501 14.6903
3 16 20 -16.0001 20 6.3143 -15.8515 16.844 8.25 -15.8065 15.8894
3 16 20 -16.0001 20 4.2705 -15.8841 17.5378 6.3143 -15.8515 16.844
3 16 20 -16.0001 20 2.1537 -15.904 17.9588 4.2705 -15.8841 17.5378
3 16 20 -16.0001 20 0 -15.9106 18.1 2.1537 -15.904 17.9588
4 15 13.5071 -14.8062 6.7615 13.1008 -14.9441 7.7155 6.3505 -15.0074 8.1535 7.71 -14.7395 6.3
