0 Brick  1 x  1 Round with Black, Yellow and White "BUZZ COLA" Pattern
0 Name: 3062bp02.dat
0 Author: Evert-Jan Boer [ejboer]
0 !LDRAW_ORG Part UPDATE 2022-02
0 !LICENSE Redistributable under CCAL version 2.0 : see CAreadme.txt

0 BFC CERTIFY CCW

0 !KEYWORDS Bricklink 3062bpb044, Set 71202, Set 71016

0 !HISTORY 2022-03-06 [PTadmin] Official Update 2022-02

1 16 0 0 0 1 0 0 0 1 0 0 0 1 s\3062bs01.dat
1 16 0 0 0 10 0 0 0 19 0 0 0 10 2-4cyli.dat

4 0 -9.3681 14.55 -3.1778 -9.4477 14.3 -2.7775 -9.577 14.6421 -2.1271 -9.6367 15.3 -1.827
4 0 -9.3582 6.8 -3.2278 -9.2388 6.6286 -3.8278 -9.2388 6.1313 -3.8276 -9.378 6.35 -3.1277
4 0 -9.6964 6.65 -1.5268 -9.5571 7.5625 -2.2272 -9.4676 7.15 -2.6775 -9.5571 6.8409 -2.2272
4 0 -9.3582 6.8 -3.2278 -9.378 6.35 -3.1277 -9.5571 6.8409 -2.2272 -9.4676 7.15 -2.6775
3 0 -9.3084 9.45 -3.4779 -9.5472 10.0886 -2.2772 -9.5472 10.9429 -2.2772
3 0 -9.5571 6.4 -2.2272 -9.6964 6.65 -1.5268 -9.5571 6.8409 -2.2272
4 0 -9.6864 12.75 -1.5768 -9.5472 10.0886 -2.2772 -9.5571 7.5625 -2.2272 -9.6964 6.65 -1.5268
3 0 -9.5472 10.0886 -2.2772 -9.6864 12.75 -1.5768 -9.5472 10.9429 -2.2772
4 0 -9.577 12.75 -2.1271 -9.5472 11.9 -2.2772 -9.5472 10.9429 -2.2772 -9.6864 12.75 -1.5768
4 0 -9.577 14.6421 -2.1271 -9.4477 14.3 -2.7775 -9.4477 12.75 -2.7775 -9.577 12.75 -2.1271
4 0 -9.4477 12.75 -2.7775 -9.378 11.95 -3.1277 -9.5472 11.9 -2.2772 -9.577 12.75 -2.1271
3 0 -9.378 11.95 -3.1277 -9.4477 12.75 -2.7775 -9.378 12.75 -3.1277
3 0 -9.577 14.6421 -2.1271 -9.6367 14.8 -1.827 -9.6367 15.3 -1.827
4 0 -9.2388 13.4886 -3.8276 -9.4477 14.3 -2.7775 -9.3681 14.55 -3.1778 -9.2388 14.1554 -3.8277
4 0 -9.5472 10.9429 -2.2772 -9.378 10.6 -3.1277 -9.2388 9.9618 -3.8276 -9.3084 9.45 -3.4779
3 0 -9.2388 9.9618 -3.8276 -9.378 10.6 -3.1277 -9.2388 10.4765 -3.8276
3 0 -9.2388 9.1318 -3.8276 -9.3084 9.45 -3.4779 -9.2388 9.9618 -3.8276
4 0 -8.729 12.75 -4.5901 -8.3042 12.6 -5.2257 -7.9927 11.8 -5.6919 -8.4458 11.9 -5.0138
4 0 -8.4458 11.9 -5.0138 -7.9927 11.8 -5.6919 -7.8511 11.05 -5.9037 -8.3042 11.2 -5.2257
4 0 -7.8511 11.05 -5.9037 -7.8794 10.55 -5.8614 -8.3042 10.75 -5.2257 -8.3042 11.2 -5.2257
4 0 -7.8794 10.55 -5.8614 -7.9927 10.2 -5.6919 -8.3042 9.95 -5.2257 -8.3042 10.75 -5.2257
4 0 -8.3042 10.75 -5.2257 -8.3042 9.95 -5.2257 -8.5025 9.9 -4.9291 -8.4175 10.4 -5.0562
4 0 -8.4175 10.4 -5.0562 -8.5025 9.9 -4.9291 -8.8706 9.9 -4.3782 -8.6724 10.3 -4.6748
4 0 -8.3609 8.5 -5.141 -8.814 8.45 -4.4629 -9.2388 9.1318 -3.8276 -8.7857 9.35 -4.5053
4 0 -8.814 8.45 -4.4629 -8.3609 8.5 -5.141 -8.1626 7.55 -5.4376 -8.5591 7.6 -4.8443
4 0 -8.5591 7.6 -4.8443 -8.1626 7.55 -5.4376 -8.1343 6.65 -5.48 -8.4742 6.95 -4.9714
4 0 -8.5591 6.6 -4.8443 -8.4742 6.95 -4.9714 -8.1343 6.65 -5.48 -8.2759 6.15 -5.2681
4 0 -8.7574 6.5 -4.5477 -8.5591 6.6 -4.8443 -8.2759 6.15 -5.2681 -8.5308 5.95 -4.8867
4 0 -8.9556 6.5 -4.251 -8.7574 6.5 -4.5477 -8.5308 5.95 -4.8867 -8.8706 5.95 -4.3782
3 0 -9.2388 13.4886 -3.8276 -9.2388 14.1554 -3.8277 -8.814 13.7 -4.4629
4 0 -8.3042 12.6 -5.2257 -8.729 12.75 -4.5901 -9.2388 13.4886 -3.8276 -8.814 13.7 -4.4629
4 0 -8.8706 9.9 -4.3782 -9.2388 9.9618 -3.8276 -9.2388 10.4765 -3.8276 -8.6724 10.3 -4.6748
3 0 -9.2388 9.1318 -3.8276 -9.2388 9.9618 -3.8276 -8.7857 9.35 -4.5053
4 0 -9.2388 6.6286 -3.8278 -8.9556 6.5 -4.251 -8.8706 5.95 -4.3782 -9.2388 6.1313 -3.8276
4 0 -6.9864 9.1 -7.1276 -6.3929 9.2 -7.5241 -6.2234 8.2 -7.6375 -6.9016 8.6 -7.1842
4 0 -6.9864 9.1 -7.1276 -7.0712 10.1 -7.0708 -6.4777 10.1 -7.4675 -6.3929 9.2 -7.5241
4 0 -7.0712 10.1 -7.0708 -7.0712 11 -7.0708 -6.4777 10.9 -7.4675 -6.4777 10.1 -7.4675
4 0 -7.0712 11 -7.0708 -6.9864 11.6 -7.1276 -6.4777 11.5 -7.4675 -6.4777 10.9 -7.4675
4 0 -6.4777 10.9 -7.4675 -6.4777 11.5 -7.4675 -6.2234 12.4 -7.6375 -5.9691 10.9 -7.8074
4 0 -6.6473 13 -7.3542 -6.2234 12.4 -7.6375 -6.4777 11.5 -7.4675 -6.6473 12.1 -7.3542
4 0 -6.6473 13 -7.3542 -6.3082 13 -7.5808 -5.9691 12.4 -7.8074 -6.2234 12.4 -7.6375
4 0 -6.3929 14.3 -7.5241 -5.9691 13.3 -7.8074 -5.9691 12.4 -7.8074 -6.3082 13 -7.5808
4 0 -6.3929 14.3 -7.5241 -5.4604 13.7 -8.1474 -5.2909 13.1 -8.2607 -5.9691 13.3 -7.8074
4 0 -4.5051 10.4 -8.7858 -3.9964 10.4 -9.1258 -3.8268 9.8 -9.2391 -4.0812 9.9 -9.0691
4 0 -4.5051 10.4 -8.7858 -4.0812 9.9 -9.0691 -3.9116 8.7 -9.1825 -4.3355 9 -8.8992
4 0 -4.3355 9 -8.8992 -3.9116 8.7 -9.1825 -3.8268 7.4 -9.2391 -4.1659 7.6 -9.0125
3 0 -3.8268 7.4 -9.2391 -3.9116 8.7 -9.1825 -3.8268 8.2333 -9.2391
4 0 -4.104 12.8 -9.0539 -5.2909 13.1 -8.2607 -5.4604 13.7 -8.1474 -3.8268 13.0256 -9.2391
4 0 -4.104 12.8 -9.0539 -3.8268 13.0256 -9.2391 -3.9964 10.4 -9.1258 -4.0812 11.5 -9.0691
3 0 -3.8268 9.8 -9.2391 -3.9964 10.4 -9.1258 -3.8268 13.0256 -9.2391
3 0 -3.6268 7.3 -9.2788 -3.8268 7.4 -9.2391 -3.8268 8.2333 -9.2391
4 0 -2.5269 4.6 -9.4975 -1.7269 4.1 -9.6566 -2.2269 3.7 -9.5572 -2.4269 4 -9.5174
4 0 -2.2269 3.7 -9.5572 -1.7269 4.1 -9.6566 -.5269 3.7 -9.8952 -1.1269 3.3 -9.7759
4 0 -1.1269 3.3 -9.7759 -.5269 3.7 -9.8952 0 3.9615 -10 0 3.0585 -10
4 0 -.5269 3.7 -9.8952 -1.4269 4.9 -9.7163 -.4269 4.6 -9.9151 -.1269 4.1 -9.9748
4 0 -.8269 8.9 -9.8356 -.4269 7.8 -9.9151 -.7269 6.9 -9.8555 -1.2269 8.3 -9.756
4 0 -1.0269 9.7 -9.7958 -.8269 8.9 -9.8356 -1.2269 8.3 -9.756 -1.6269 9.6 -9.6765
4 0 -1.0269 10.1 -9.7958 -1.0269 9.7 -9.7958 -1.6269 9.6 -9.6765 -1.7269 10.3 -9.6566
4 0 -1.7269 10.3 -9.6566 -1.6269 11.1 -9.6765 -.7269 10.5 -9.8555 -1.0269 10.1 -9.7958
4 0 0 10.073 -10 0 9.6135 -10 -1.0269 10.1 -9.7958 -.7269 10.5 -9.8555
4 0 -.1269 5.3 -9.9748 -.7269 6.9 -9.8555 -.4269 7.8 -9.9151 0 6.6244 -10
3 0 0 5.1095 -10 -.1269 5.3 -9.9748 0 6.6244 -10
3 0 -.5269 3.7 -9.8952 -.1269 4.1 -9.9748 0 3.9615 -10
4 0 -.4269 4.6 -9.9151 0 4.5051 -10 0 4.0683 -10 -.1269 4.1 -9.9748
3 0 -3.5268 9.7 -9.2987 -3.8268 9.8 -9.2391 -3.7268 11.3 -9.2589
4 0 -3.7537 13 -9.2536 -3.7268 11.3 -9.2589 -3.8268 9.8 -9.2391 -3.8268 13.0256 -9.2391
4 0 0 5.1095 -10 .558 5.3 -9.889 1.2658 3.8 -9.7483 .558 4.4 -9.889
4 0 0 9.6135 -10 0 10.073 -10 1.0298 9.9 -9.7952 1.0298 9.2 -9.7952
4 0 0 10.073 -10 0 10.5926 -10 1.2658 10.3 -9.7483 1.0298 9.9 -9.7952
4 0 1.2658 10.3 -9.7483 2.6814 10 -9.4668 2.4454 9.8 -9.5137 1.0298 9.9 -9.7952
3 0 0 5.1095 -10 0 6.6244 -10 .558 5.3 -9.889
4 0 0 3.0585 -10 0 3.9615 -10 1.1478 2.9 -9.7718 .322 3 -9.936
4 0 0 4.5051 -10 .558 4.4 -9.889 1.2658 3.8 -9.7483 0 4.0683 -10
4 0 3.827 3.5288 -9.239 2.8 3.7 -9.4432 2.8 4.4 -9.4432 3.827 4.0546 -9.239
4 0 2.8 11.5 -9.4432 3.827 11.1791 -9.239 3.5 9.2 -9.304 3 10.6 -9.4034
3 0 3.827 8.3498 -9.239 3.5 9.2 -9.304 3.827 11.1791 -9.239
3 0 5.4 3.3 -8.1877 4.6 3.9 -8.7224 5.4 3.9 -8.1877
4 0 6.5624 3.95 -7.4109 6.3929 3.3 -7.5242 5.4 3.3 -8.1877 5.4 3.9 -8.1877
4 0 6.5624 3.95 -7.4109 5.4 3.9 -8.1877 5.2 4.5 -8.3214 6.1 4.4 -7.7199
4 0 4.3 4.6 -8.9229 5.2 4.5 -8.3214 5.4 3.9 -8.1877 4.9 4.1 -8.5219
4 0 5.7 6.3 -7.9872 6.5001 5.2 -7.4526 6.1 4.4 -7.7199 5.4 5.3 -8.1877
4 0 5.1 7.3 -8.3882 5.7 6.3 -7.9872 5.4 5.3 -8.1877 4.7 6.6 -8.6556
4 0 4.5 8.6 -8.7892 5.1 7.3 -8.3882 4.7 6.6 -8.6556 4 7.9 -9.1234
4 0 4.1 9.8 -9.0566 4.5 8.6 -8.7892 4 7.9 -9.1234 3.827 8.3498 -9.239
3 0 4.4 11 -8.8561 4.1 11.5 -9.0566 5.1 11.3 -8.3882
4 0 5.7 10.5 -7.9872 4.4 11 -8.8561 5.1 11.3 -8.3882 5.5 10.9 -8.1209
4 0 5.1 11.3 -8.3882 6.4353 11.1 -7.4959 6.4353 10.8 -7.4959 5.5 10.9 -8.1209
4 0 7.0711 3.364 -7.0709 6.3929 3.3 -7.5242 6.5624 3.95 -7.4109 7.0711 3.6357 -7.0709
4 0 7.0711 4.1987 -7.0709 6.5624 3.95 -7.4109 6.1 4.4 -7.7199 6.5001 5.2 -7.4526
3 0 6.5624 3.95 -7.4109 7.0711 4.1987 -7.0709 7.0711 4.0357 -7.0709
4 0 3.827 4.0546 -9.239 4.6 3.9 -8.7224 5.4 3.3 -8.1877 3.827 3.5288 -9.239
3 0 3.827 8.3498 -9.239 3.827 11.1791 -9.239 3.9 10.6 -9.1902
3 0 3.827 8.3498 -9.239 3.9 10.6 -9.1902 4.1 9.8 -9.0566
4 0 5.7 10.5 -7.9872 3.9 10.6 -9.1902 3.827 11.1791 -9.239 4.4 11 -8.8561
3 0 7.0711 3.364 -7.0709 7.0711 3.6357 -7.0709 7.326 3.4 -6.6895
3 0 7.0711 4.0357 -7.0709 7.0711 4.1987 -7.0709 7.1277 4.05 -6.9861
4 14 -9.6964 6.65 -1.5268 -9.5571 6.4 -2.2272 -9.7859 5.75 -1.0765 -9.9352 6.3 -.3261
4 14 -9.7859 5.75 -1.0765 -9.5571 6.4 -2.2272 -9.3681 5.5 -3.1778 -9.3184 4.95 -3.4279
4 14 -9.3681 5.5 -3.1778 -9.5571 6.4 -2.2272 -9.5571 6.8409 -2.2272 -9.378 6.35 -3.1277
4 14 -9.378 6.35 -3.1277 -9.2388 6.1313 -3.8276 -9.2388 5.1861 -3.8278 -9.3681 5.5 -3.1778
4 14 -9.8556 11.85 -.7263 -9.6964 6.65 -1.5268 -9.9352 6.3 -.3261 -9.975 11.9 -.126
4 14 -9.9153 14.9 -.4261 -9.6864 12.75 -1.5768 -9.6964 6.65 -1.5268 -9.8556 11.85 -.7263
4 14 -9.9153 14.9 -.4261 -9.7859 14.95 -1.0765 -9.6367 14.8 -1.827 -9.6864 12.75 -1.5768
4 14 -9.6864 12.75 -1.5768 -9.6367 14.8 -1.827 -9.577 14.6421 -2.1271 -9.577 12.75 -2.1271
4 14 -9.8556 17 -.7263 -9.6367 15.3 -1.827 -9.6367 14.8 -1.827 -9.7859 14.95 -1.0765
4 14 -9.8556 17 -.7263 -9.6268 16.65 -1.877 -9.3582 16 -3.2278 -9.6367 15.3 -1.827
4 14 -9.6367 15.3 -1.827 -9.3582 16 -3.2278 -9.2388 15.6069 -3.8278 -9.3681 14.55 -3.1778
4 14 -9.2388 6.6286 -3.8278 -9.3582 6.8 -3.2278 -9.3383 7.3 -3.3279 -9.2388 7.2167 -3.8276
4 14 -9.388 7.45 -3.0777 -9.3383 7.3 -3.3279 -9.3582 6.8 -3.2278 -9.4676 7.15 -2.6775
4 14 -9.3184 8.8 -3.4279 -9.388 7.45 -3.0777 -9.4676 7.15 -2.6775 -9.5571 7.5625 -2.2272
4 14 -9.5472 11.9 -2.2772 -9.378 11.95 -3.1277 -9.3283 11.6 -3.3779 -9.5472 10.9429 -2.2772
4 14 -9.5472 10.9429 -2.2772 -9.3283 11.6 -3.3779 -9.2388 11.08 -3.8277 -9.378 10.6 -3.1277
4 14 -9.4477 12.75 -2.7775 -9.4477 14.3 -2.7775 -9.2388 13.4886 -3.8276 -9.378 12.75 -3.1277
3 14 -9.3184 4.95 -3.4279 -9.3681 5.5 -3.1778 -9.2388 5.1861 -3.8278
3 14 -9.2388 10.4765 -3.8276 -9.378 10.6 -3.1277 -9.2388 11.08 -3.8277
4 14 -9.378 11.95 -3.1277 -9.378 12.75 -3.1277 -9.2388 13.4886 -3.8276 -9.2388 11.7731 -3.8278
3 14 -9.3283 11.6 -3.3779 -9.378 11.95 -3.1277 -9.2388 11.7731 -3.8278
3 14 -9.2388 14.1554 -3.8277 -9.3681 14.55 -3.1778 -9.2388 15.6069 -3.8278
4 14 -9.3184 8.8 -3.4279 -9.5571 7.5625 -2.2272 -9.5472 10.0886 -2.2772 -9.3084 9.45 -3.4779
4 14 -9.3084 9.45 -3.4779 -9.2388 9.1318 -3.8276 -9.2388 8.625 -3.8278 -9.3184 8.8 -3.4279
4 14 -8.5308 5.95 -4.8867 -8.3326 4.95 -5.1833 -8.7574 4.95 -4.5477 -8.8706 5.95 -4.3782
4 14 -8.3326 4.95 -5.1833 -8.5308 5.95 -4.8867 -7.5679 5.6 -6.3275 -7.8511 5.2 -5.9037
4 14 -7.4546 6.2 -6.497 -7.5679 5.6 -6.3275 -8.5308 5.95 -4.8867 -8.2759 6.15 -5.2681
4 14 -8.2759 6.15 -5.2681 -8.1343 6.65 -5.48 -7.4829 6.8 -6.4546 -7.4546 6.2 -6.497
4 14 -8.1343 6.65 -5.48 -8.1626 7.55 -5.4376 -7.6529 7.7 -6.2004 -7.4829 6.8 -6.4546
4 14 -8.1626 7.55 -5.4376 -8.3609 8.5 -5.141 -7.9077 8.5 -5.819 -7.6529 7.7 -6.2004
4 14 -8.7857 9.35 -4.5053 -8.2193 9.2 -5.3528 -7.9077 8.5 -5.819 -8.3609 8.5 -5.141
3 14 -8.7857 9.35 -4.5053 -8.8706 9.9 -4.3782 -8.5025 9.9 -4.9291
3 14 -8.7857 9.35 -4.5053 -9.2388 9.9618 -3.8276 -8.8706 9.9 -4.3782
3 14 -8.3042 12.6 -5.2257 -8.814 13.7 -4.4629 -8.3326 14.25 -5.1833
4 14 -8.3326 14.25 -5.1833 -8.1626 14.55 -5.4376 -7.8228 13.85 -5.9461 -8.3042 12.6 -5.2257
4 14 -7.8228 13.85 -5.9461 -7.5679 13.1 -6.3275 -7.4829 12.45 -6.4546 -8.3042 12.6 -5.2257
4 14 -7.9927 11.8 -5.6919 -8.3042 12.6 -5.2257 -7.4829 12.45 -6.4546 -7.4546 11.9 -6.497
4 14 -7.9927 11.8 -5.6919 -7.4546 11.9 -6.497 -7.313 9.7 -6.7089 -7.8511 11.05 -5.9037
4 14 -8.7857 9.35 -4.5053 -8.5025 9.9 -4.9291 -8.3042 9.95 -5.2257 -8.2193 9.2 -5.3528
4 14 -8.2193 9.2 -5.3528 -8.3042 9.95 -5.2257 -7.5679 9.4 -6.3275 -7.9077 9.25 -5.819
4 14 -7.5679 9.4 -6.3275 -8.3042 9.95 -5.2257 -7.9927 10.2 -5.6919 -7.313 9.7 -6.7089
3 14 -7.313 9.7 -6.7089 -7.9927 10.2 -5.6919 -7.8794 10.55 -5.8614
3 14 -7.313 9.7 -6.7089 -7.8794 10.55 -5.8614 -7.8511 11.05 -5.9037
4 14 -8.3326 14.25 -5.1833 -8.814 13.7 -4.4629 -9.2388 14.1554 -3.8277 -8.7574 15.05 -4.5477
3 14 -9.2388 14.1554 -3.8277 -9.2388 15.6069 -3.8278 -8.7574 15.05 -4.5477
4 14 -9.1539 8.5 -3.9544 -8.814 8.45 -4.4629 -8.5591 7.6 -4.8443 -8.9273 7.8 -4.2934
4 14 -8.9273 7.8 -4.2934 -8.5591 7.6 -4.8443 -8.4742 6.95 -4.9714 -8.7857 7.15 -4.5053
4 14 -8.7574 6.5 -4.5477 -8.7857 7.15 -4.5053 -8.4742 6.95 -4.9714 -8.5591 6.6 -4.8443
4 14 -9.2388 7.2167 -3.8276 -8.7857 7.15 -4.5053 -8.7574 6.5 -4.5477 -8.9556 6.5 -4.251
4 14 -9.2388 10.4765 -3.8276 -8.9839 10.9 -4.2087 -8.729 10.9 -4.5901 -8.6724 10.3 -4.6748
4 14 -8.3042 10.75 -5.2257 -8.4175 10.4 -5.0562 -8.6724 10.3 -4.6748 -8.729 10.9 -4.5901
4 14 -8.729 10.9 -4.5901 -8.5874 11.1 -4.8019 -8.3042 11.2 -5.2257 -8.3042 10.75 -5.2257
4 14 -8.4458 11.9 -5.0138 -8.3042 11.2 -5.2257 -8.5874 11.1 -4.8019 -8.5874 11.35 -4.8019
4 14 -8.729 12.75 -4.5901 -8.4458 11.9 -5.0138 -8.5874 11.35 -4.8019 -8.7857 11.95 -4.5053
4 14 -8.8706 5.95 -4.3782 -8.7574 4.95 -4.5477 -9.2388 5.1861 -3.8278 -9.2388 6.1313 -3.8276
3 14 -8.9556 6.5 -4.251 -9.2388 6.6286 -3.8278 -9.2388 7.2167 -3.8276
4 14 -9.2388 8.625 -3.8278 -9.2388 9.1318 -3.8276 -8.814 8.45 -4.4629 -9.1539 8.5 -3.9544
3 14 -9.2388 10.4765 -3.8276 -9.2388 11.08 -3.8277 -8.9839 10.9 -4.2087
3 14 -9.1255 11.85 -3.9968 -8.729 12.75 -4.5901 -8.7857 11.95 -4.5053
4 14 -8.729 12.75 -4.5901 -9.1255 11.85 -3.9968 -9.2388 11.7731 -3.8278 -9.2388 13.4886 -3.8276
4 14 -7.9208 17.7 -5.7994 -7.2411 16.4 -6.8165 -7.3544 15.5 -6.6469 -7.8642 16 -5.8841
4 14 -7.0712 16.5 -7.0708 -7.2411 16.4 -6.8165 -7.9208 17.7 -5.7994 -7.411 17.7 -6.5622
3 14 -7.0712 16.5 -7.0708 -7.411 17.7 -6.5622 -7.0712 17.5 -7.0708
4 14 -7.0712 10.1 -7.0708 -7.313 9.7 -6.7089 -7.4546 11.9 -6.497 -7.0712 11 -7.0708
3 14 -7.1278 12.8 -6.986 -7.3544 13.5 -6.6469 -7.0712 13.6 -7.0708
4 14 -7.313 9.7 -6.7089 -7.0712 10.1 -7.0708 -7.0712 7.7407 -7.0708 -7.3544 8 -6.6469
4 14 -7.2978 12.1 -6.7317 -7.0712 12.18 -7.0708 -7.0712 11 -7.0708 -7.4546 11.9 -6.497
3 14 -7.0712 12.5 -7.0708 -7.1278 12.8 -6.986 -7.0712 13.6 -7.0708
4 14 -7.0712 17.5 -7.0708 -6.3082 17.1 -7.5808 -6.2234 16.2 -7.6375 -7.0712 16.5 -7.0708
4 14 -6.2234 16.2 -7.6375 -6.3082 17.1 -7.5808 -5.5452 16.6 -8.0907 -5.5452 16.1 -8.0907
4 14 -5.5452 16.6 -8.0907 -5.2909 16.4 -8.2607 -5.2909 16.1 -8.2607 -5.5452 16.1 -8.0907
4 14 -5.3756 1.3 -8.204 -5.7147 1.7 -7.9774 -4.867 2.1 -8.544 -5.0365 1.6 -8.4307
4 14 -5.7147 3.1 -7.9774 -4.867 2.1 -8.544 -5.7147 1.7 -7.9774 -5.7995 2.3 -7.9207
4 14 -5.7147 3.1 -7.9774 -5.3756 3.6 -8.204 -4.6974 3.2 -8.6573 -4.867 2.1 -8.544
4 14 -4.6974 3.2 -8.6573 -4.1888 2.6 -8.9972 -4.3583 2 -8.8839 -4.867 2.1 -8.544
4 14 -4.1888 2.6 -8.9972 -4.0192 2.3 -9.1105 -3.9344 1.9 -9.1672 -4.3583 2 -8.8839
4 14 -5.1213 5.4 -8.374 -5.7995 4.5 -7.9207 -6.5625 3.5 -7.4108 -6.8168 6.5 -7.2409
4 14 -5.7995 4.5 -7.9207 -5.1213 5.4 -8.374 -4.6126 6 -8.7139 -4.1888 3.8 -8.9972
4 14 -7.0712 7.7407 -7.0708 -6.2234 8.2 -7.6375 -5.4604 7.9 -8.1474 -5.2061 6.6 -8.3173
4 14 -6.2234 8.2 -7.6375 -6.3929 9.2 -7.5241 -5.63 9.3 -8.0341 -5.4604 7.9 -8.1474
4 14 -5.63 10 -8.0341 -5.63 9.3 -8.0341 -6.3929 9.2 -7.5241 -6.4777 10.1 -7.4675
4 14 -6.4777 10.9 -7.4675 -5.9691 10.9 -7.8074 -5.63 10 -8.0341 -6.4777 10.1 -7.4675
4 14 -5.63 10 -8.0341 -5.9691 10.9 -7.8074 -5.2061 11.6 -8.3173 -4.9518 9.8 -8.4873
4 14 -5.9691 12.4 -7.8074 -5.2061 11.6 -8.3173 -5.9691 10.9 -7.8074 -6.2234 12.4 -7.6375
4 14 -5.9691 13.3 -7.8074 -5.3756 12.5 -8.204 -5.2061 11.6 -8.3173 -5.9691 12.4 -7.8074
3 14 -5.3756 12.5 -8.204 -5.9691 13.3 -7.8074 -5.2909 13.1 -8.2607
4 14 -5.2909 13.1 -8.2607 -4.104 12.8 -9.0539 -4.2735 11.9 -8.9406 -5.3756 12.5 -8.204
4 14 -6.9864 12.2 -7.1276 -6.6473 12.1 -7.3542 -6.4777 11.5 -7.4675 -6.9864 11.6 -7.1276
4 14 -7.0712 12.5 -7.0708 -6.6473 13 -7.3542 -6.6473 12.1 -7.3542 -6.9864 12.2 -7.1276
4 14 -6.3929 14.3 -7.5241 -6.3082 13 -7.5808 -6.6473 13 -7.3542 -7.0712 13.6 -7.0708
4 14 -7.0712 13.6 -7.0708 -6.9016 15.5 -7.1842 -6.0538 15.1 -7.7508 -6.3929 14.3 -7.5241
4 14 -5.0365 14.6 -8.4307 -5.4604 13.7 -8.1474 -6.3929 14.3 -7.5241 -6.0538 15.1 -7.7508
4 14 -4.0192 14 -9.1105 -3.8268 13.0256 -9.2391 -5.4604 13.7 -8.1474 -5.0365 14.6 -8.4307
3 14 -7.0712 7.7407 -7.0708 -7.0712 10.1 -7.0708 -6.9864 9.1 -7.1276
3 14 -7.0712 7.7407 -7.0708 -6.9864 9.1 -7.1276 -6.9016 8.6 -7.1842
3 14 -7.0712 7.7407 -7.0708 -6.9016 8.6 -7.1842 -6.2234 8.2 -7.6375
4 14 -7.0712 12.18 -7.0708 -6.9864 12.2 -7.1276 -6.9864 11.6 -7.1276 -7.0712 11 -7.0708
3 14 -7.0712 12.5 -7.0708 -7.0712 13.6 -7.0708 -6.6473 13 -7.3542
4 14 -4.2507 11 -8.9558 -4.2735 11.9 -8.9406 -4.104 12.8 -9.0539 -4.0812 11.5 -9.0691
3 14 -3.9964 10.4 -9.1258 -4.2507 11 -8.9558 -4.0812 11.5 -9.0691
4 14 -4.6746 11 -8.6725 -4.2507 11 -8.9558 -3.9964 10.4 -9.1258 -4.5051 10.4 -8.7858
4 14 -4.6746 11 -8.6725 -4.5051 10.4 -8.7858 -4.3355 9 -8.8992 -4.6746 9 -8.6725
4 14 -4.6746 9 -8.6725 -4.3355 9 -8.8992 -4.1659 7.6 -9.0125 -4.5898 7.4 -8.7292
4 14 -4.5898 7.4 -8.7292 -4.1659 7.6 -9.0125 -3.8268 7.4 -9.2391 -3.8268 6.86 -9.2391
4 14 -4.0812 9.9 -9.0691 -3.8268 9.8 -9.2391 -3.8268 8.2333 -9.2391 -3.9116 8.7 -9.1825
3 14 -3.8268 13.0256 -9.2391 -4.0192 14 -9.1105 -3.8268 13.9024 -9.239
4 14 -2.6269 8.1 -9.4776 -2.3269 6.3 -9.5373 -3.8268 6.86 -9.2391 -3.6268 7.3 -9.2788
4 14 -3.7268 11.3 -9.2589 -2.6269 10.8 -9.4776 -2.7269 9.4 -9.4578 -3.5268 9.7 -9.2987
3 14 -2.4269 9.4 -9.5174 -2.7269 9.4 -9.4578 -2.6269 10.8 -9.4776
4 14 -3.7537 13 -9.2536 -2.7269 11.9 -9.4578 -2.6269 10.8 -9.4776 -3.7268 11.3 -9.2589
4 14 -3.8268 13.9024 -9.239 -2.8269 12.8 -9.4379 -2.7269 11.9 -9.4578 -3.7537 13 -9.2536
4 14 -3.8268 13.9024 -9.239 -2.4269 13.3 -9.5174 -2.5269 12.7 -9.4975 -2.8269 12.8 -9.4379
4 14 -2.8269 3.4 -9.4379 -3.1269 4.5 -9.3782 -2.5269 4.6 -9.4975 -2.4269 4 -9.5174
4 14 -2.4269 4 -9.5174 -2.2269 3.7 -9.5572 -2.5269 2.6 -9.4975 -2.8269 3.4 -9.4379
4 14 -2.2269 3.7 -9.5572 -1.1269 3.3 -9.7759 -1.5269 2.3 -9.6964 -2.5269 2.6 -9.4975
4 14 0 2.0973 -10 -1.5269 2.3 -9.6964 -1.1269 3.3 -9.7759 0 3.0585 -10
3 14 -.2269 1.7 -9.9549 -1.5269 2.3 -9.6964 0 2.0973 -10
3 14 0 3.9615 -10 -.1269 4.1 -9.9748 0 4.0683 -10
4 14 -3.1269 4.5 -9.3782 -3.3268 5.6 -9.3385 -2.4269 5.3 -9.5174 -2.5269 4.6 -9.4975
4 14 -2.4269 5.3 -9.5174 -1.8269 5 -9.6367 -1.7269 4.1 -9.6566 -2.5269 4.6 -9.4975
4 14 -1.8269 5 -9.6367 -1.4269 4.9 -9.7163 -.5269 3.7 -9.8952 -1.7269 4.1 -9.6566
4 14 -1.8269 5 -9.6367 -1.8269 5.9 -9.6367 -.7269 5.3 -9.8555 -1.4269 4.9 -9.7163
4 14 -1.4269 4.9 -9.7163 -.7269 5.3 -9.8555 -.1269 5.3 -9.9748 -.4269 4.6 -9.9151
4 14 -.4269 4.6 -9.9151 -.1269 5.3 -9.9748 0 5.1095 -10 0 4.5051 -10
4 14 -.1269 5.3 -9.9748 -.7269 5.3 -9.8555 -1.5269 6.9 -9.6964 -.7269 6.9 -9.8555
4 14 -1.9269 8.7 -9.6168 -1.2269 8.3 -9.756 -.7269 6.9 -9.8555 -1.5269 6.9 -9.6964
3 14 -1.5269 6.9 -9.6964 -2.3269 8.9 -9.5373 -1.9269 8.7 -9.6168
4 14 -2.0269 9.7 -9.597 -1.6269 9.6 -9.6765 -1.2269 8.3 -9.756 -1.9269 8.7 -9.6168
4 14 -2.1269 10.9 -9.5771 -1.7269 10.3 -9.6566 -1.6269 9.6 -9.6765 -2.0269 9.7 -9.597
4 14 -2.0269 12.7 -9.597 -1.6269 11.1 -9.6765 -1.7269 10.3 -9.6566 -2.1269 10.9 -9.5771
4 14 -2.0269 12.7 -9.597 -1.0269 12.1 -9.7958 -.7269 10.5 -9.8555 -1.6269 11.1 -9.6765
3 14 0 10.073 -10 -.7269 10.5 -9.8555 0 10.5926 -10
4 14 -1.0269 12.1 -9.7958 0 11.5398 -10 0 10.5926 -10 -.7269 10.5 -9.8555
3 14 0 6.6244 -10 -.4269 7.8 -9.9151 0 9.6135 -10
4 14 -.4269 7.8 -9.9151 -.8269 8.9 -9.8356 -1.0269 9.7 -9.7958 0 9.6135 -10
3 14 0 9.6135 -10 -1.0269 9.7 -9.7958 -1.0269 10.1 -9.7958
4 14 -3.8268 9.8 -9.2391 -3.5268 9.7 -9.2987 -2.7269 9.4 -9.4578 -3.8268 8.2333 -9.2391
4 14 -3.8268 8.2333 -9.2391 -2.7269 9.4 -9.4578 -2.6269 8.1 -9.4776 -3.6268 7.3 -9.2788
3 14 -3.7537 13 -9.2536 -3.8268 13.0256 -9.2391 -3.8268 13.9024 -9.239
3 14 -3.8268 6.86 -9.2391 -3.8268 7.4 -9.2391 -3.6268 7.3 -9.2788
4 14 1.2658 13.9 -9.7483 1.1478 12.7 -9.7718 .44 12.2 -9.9125 .0861 13.5 -9.9829
4 14 0 14.4853 -10 0 15.3929 -10 2.2095 14.9 -9.5606 1.2658 13.9 -9.7483
4 14 .322 3 -9.936 .2041 2.4 -9.9594 0 2.0973 -10 0 3.0585 -10
4 14 .322 3 -9.936 1.1478 2.9 -9.7718 1.8556 2 -9.631 .2041 2.4 -9.9594
4 14 3.3892 2.7 -9.3261 3.6251 1.9 -9.2791 1.8556 2 -9.631 1.1478 2.9 -9.7718
4 14 0 3.9615 -10 0 4.0683 -10 1.2658 3.8 -9.7483 1.1478 2.9 -9.7718
3 14 .558 4.4 -9.889 0 4.5051 -10 0 5.1095 -10
4 14 1.2658 10.3 -9.7483 1.5017 11 -9.7014 2.3954 10.8 -9.5237 2.6814 10 -9.4668
4 14 .558 8.6 -9.889 1.0298 9.2 -9.7952 2.4454 8.2 -9.5137 1.7376 8.3 -9.6545
4 14 3.0353 8.5 -9.3964 2.7993 8.3 -9.4434 2.4454 8.2 -9.5137 1.0298 9.2 -9.7952
4 14 1.0298 9.9 -9.7952 2.4454 9.8 -9.5137 3.0353 8.5 -9.3964 1.0298 9.2 -9.7952
4 14 1.7376 7.9 -9.6545 2.3275 7.8 -9.5372 1.9736 6.6 -9.6076 1.8556 7 -9.631
4 14 2.6814 7.8 -9.4668 2.3275 6.2 -9.5372 1.9736 6.6 -9.6076 2.3275 7.8 -9.5372
4 14 2.6814 7.8 -9.4668 3.0353 7.1 -9.3964 2.9173 6 -9.4199 2.3275 6.2 -9.5372
4 14 3.0353 7.1 -9.3964 3.5071 6.5 -9.3026 3.5071 5.9 -9.3026 2.9173 6 -9.4199
4 14 0 11.5398 -10 1.5017 11 -9.7014 1.2658 10.3 -9.7483 0 10.5926 -10
4 14 1.7 5.4 -9.662 .558 5.3 -9.889 0 6.6244 -10 1.2658 5.9 -9.7483
4 14 1.2658 5.9 -9.7483 0 6.6244 -10 1.2658 7.3 -9.7483 1.8556 6 -9.631
3 14 0 6.6244 -10 .6759 7.9 -9.8656 1.2658 7.3 -9.7483
4 14 .6759 7.9 -9.8656 0 6.6244 -10 0 9.6135 -10 .558 8.6 -9.889
3 14 .558 8.6 -9.889 0 9.6135 -10 1.0298 9.2 -9.7952
4 14 2.8 3.7 -9.4432 1.2658 3.8 -9.7483 1.9 4.9 -9.6222 2.8 4.4 -9.4432
4 14 1.2658 3.8 -9.7483 .558 5.3 -9.889 1.7 5.4 -9.662 1.9 4.9 -9.6222
4 14 2.7 4.9 -9.4631 2.8 4.4 -9.4432 1.9 4.9 -9.6222 2 5.5 -9.6023
4 14 2.7 4.9 -9.4631 3.1 4.8 -9.3836 3.827 4.0546 -9.239 2.8 4.4 -9.4432
3 14 3.1 4.8 -9.3836 2.5 5.3 -9.5029 3.2 5 -9.3637
4 14 1.1478 2.9 -9.7718 1.2658 3.8 -9.7483 2.8 3.7 -9.4432 3.3892 2.7 -9.3261
4 14 3.827 2.5759 -9.239 3.3892 2.7 -9.3261 2.8 3.7 -9.4432 3.827 3.5288 -9.239
4 14 2.6814 10 -9.4668 3.5 9.2 -9.304 3.0353 8.5 -9.3964 2.4454 9.8 -9.5137
4 14 3.5 9.2 -9.304 2.6814 10 -9.4668 2.3954 10.8 -9.5237 3 10.6 -9.4034
4 14 3 10.6 -9.4034 2.3954 10.8 -9.5237 2.05 11.75 -9.5924 2.8 11.5 -9.4432
4 14 3.05 12.6 -9.3935 2.8 11.5 -9.4432 2.05 11.75 -9.5924 1.8 13.15 -9.6421
4 14 3.5071 6.5 -9.3026 3.8269 6.1538 -9.2391 3.8269 5.8505 -9.2391 3.5071 5.9 -9.3026
3 14 .0861 13.5 -9.9829 0 14.4853 -10 1.2658 13.9 -9.7483
4 14 1.2658 13.9 -9.7483 2.2095 14.9 -9.5606 3.8268 14.2548 -9.2391 2.9173 13.5 -9.4199
3 14 3.8268 13.3715 -9.2391 2.9173 13.5 -9.4199 3.8268 14.2548 -9.2391
4 14 3.05 12.6 -9.3935 3.827 12.4002 -9.239 3.827 11.1791 -9.239 2.8 11.5 -9.4432
4 14 3.5 9.2 -9.304 3.827 8.3498 -9.239 3.5 7.4 -9.304 3.0353 8.5 -9.3964
3 14 3.827 6.8005 -9.239 3.5 7.4 -9.304 3.827 8.3498 -9.239
4 14 3.2 5 -9.3637 3.827 4.8838 -9.239 3.827 4.0546 -9.239 3.1 4.8 -9.3836
4 14 3.827 4.8838 -9.239 4.3 4.6 -8.9229 4.6 3.9 -8.7224 3.827 4.0546 -9.239
3 14 4.6 3.9 -8.7224 4.3 4.6 -8.9229 4.9 4.1 -8.5219
3 14 5.4 3.9 -8.1877 4.6 3.9 -8.7224 4.9 4.1 -8.5219
4 14 4.7 5.3 -8.6556 4.3 4.6 -8.9229 3.827 4.8838 -9.239 4 5.3 -9.1234
4 14 5.4 5.3 -8.1877 5.2 4.5 -8.3214 4.3 4.6 -8.9229 4.7 5.3 -8.6556
3 14 6.1 4.4 -7.7199 5.2 4.5 -8.3214 5.4 5.3 -8.1877
4 14 4.8 2.3 -8.5887 5.4 3.3 -8.1877 6.4001 2.2 -7.5194 5.7 2.2 -7.9872
3 14 6.4001 2.2 -7.5194 5.4 3.3 -8.1877 6.3 2.6 -7.5862
4 14 4.1 6.3 -9.0566 4.7 6.6 -8.6556 5.4 5.3 -8.1877 4.7 5.3 -8.6556
4 14 4.1 6.3 -9.0566 3.827 6.8005 -9.239 4 7.9 -9.1234 4.7 6.6 -8.6556
4 14 3.827 12.4002 -9.239 4.8 12.15 -8.5887 5.1 11.3 -8.3882 4.1 11.5 -9.0566
4 14 6.4353 11.1 -7.4959 5.1 11.3 -8.3882 4.8 12.15 -8.5887 7.0711 11.7712 -7.0709
3 14 4.4 11 -8.8561 3.827 11.1791 -9.239 4.1 11.5 -9.0566
3 14 4.1 9.8 -9.0566 3.9 10.6 -9.1902 5.7 10.5 -7.9872
4 14 4.5 8.6 -8.7892 4.1 9.8 -9.0566 5.7 10.5 -7.9872 6.0538 8.9 -7.7508
3 14 4.4688 13.275 -8.8101 4.3191 14.075 -8.9101 4.6975 13.875 -8.6573
4 14 4.4688 13.275 -8.8101 4.6975 13.875 -8.6573 4.9094 13.625 -8.5156 4.7822 13.325 -8.6006
4 14 5.4 3.3 -8.1877 6.3929 3.3 -7.5242 7.0711 2.6361 -7.0709 6.3 2.6 -7.5862
3 14 7.0711 3.6357 -7.0709 6.5624 3.95 -7.4109 7.0711 4.0357 -7.0709
4 14 6.0538 8.9 -7.7508 6.3929 8.1 -7.5242 5.1 7.3 -8.3882 4.5 8.6 -8.7892
4 14 7.0711 9.1375 -7.0709 6.0538 8.9 -7.7508 5.7 10.5 -7.9872 6.4353 10.8 -7.4959
3 14 5.7 10.5 -7.9872 5.5 10.9 -8.1209 6.4353 10.8 -7.4959
4 14 7.0711 10.45 -7.0709 6.4353 10.8 -7.4959 6.4353 11.1 -7.4959 6.9015 10.65 -7.1843
4 14 7.0711 10.706 -7.0709 6.9015 10.65 -7.1843 6.4353 11.1 -7.4959 7.0711 11.7712 -7.0709
3 14 4.0617 5.8 -9.0822 3.8269 5.8505 -9.2391 3.8269 6.1538 -9.2391
3 14 7.0711 9.1375 -7.0709 6.4353 10.8 -7.4959 7.0711 10.45 -7.0709
4 14 6.3929 8.1 -7.5242 7.0711 7.1083 -7.0709 5.7 6.3 -7.9872 5.1 7.3 -8.3882
3 14 6.5001 5.2 -7.4526 5.7 6.3 -7.9872 7.0711 7.1083 -7.0709
3 14 7.0711 4.1987 -7.0709 6.5001 5.2 -7.4526 7.0711 7.1083 -7.0709
3 14 7.0711 2.6361 -7.0709 6.3929 3.3 -7.5242 7.0711 3.364 -7.0709
4 14 3.8268 14.2548 -9.2391 4.3191 14.075 -8.9101 4.4688 13.275 -8.8101 3.8268 13.3715 -9.2391
3 14 3.827 11.1791 -9.239 3.827 12.4002 -9.239 4.1 11.5 -9.0566
3 14 3.827 6.8005 -9.239 3.827 8.3498 -9.239 4 7.9 -9.1234
4 14 3.827 3.5288 -9.239 5.4 3.3 -8.1877 4.8 2.3 -8.5887 3.827 2.5759 -9.239
4 14 8.2041 2.8 -5.3756 7.326 3.4 -6.6895 7.1277 4.05 -6.9861 8.5156 3.35 -4.9094
4 14 7.0711 4.0357 -7.0709 7.1277 4.05 -6.9861 7.326 3.4 -6.6895 7.0711 3.6357 -7.0709
4 14 8.5156 3.35 -4.9094 7.1277 4.05 -6.9861 7.0711 4.1987 -7.0709 7.8642 4.3 -5.8842
4 14 7.0711 9.1375 -7.0709 7.2693 10.1 -6.7742 7.9491 10.1 -5.757 7.7792 9.45 -6.0113
3 14 7.7792 9.45 -6.0113 7.9491 10.1 -5.757 8.6856 10.05 -4.6551
4 14 7.156 8.2 -6.9438 7.7792 8.5 -6.0113 7.8075 6.65 -5.9689 7.3826 7.45 -6.6047
4 14 7.8075 6.65 -5.9689 7.7792 8.5 -6.0113 8.6289 6.95 -4.7398 8.4873 6.1 -4.9518
4 14 8.6289 8.55 -4.7398 8.6573 7.65 -4.6975 8.6289 6.95 -4.7398 7.7792 8.5 -6.0113
4 14 9.1671 8.5 -3.9346 9.1105 7.9 -4.0193 8.6573 7.65 -4.6975 8.6289 8.55 -4.7398
4 14 9.2391 8.0135 -3.8268 9.1105 7.9 -4.0193 9.1671 8.5 -3.9346 9.2391 8.4238 -3.8268
4 14 7.0711 10.706 -7.0709 7.0711 11.7712 -7.0709 8.374 11.55 -5.1213 7.6659 11 -6.1809
3 14 7.0711 9.1375 -7.0709 7.0711 10.45 -7.0709 7.2693 10.1 -6.7742
3 14 7.0711 4.1987 -7.0709 7.0711 7.1083 -7.0709 7.2693 5.95 -6.7742
3 14 7.2693 5.95 -6.7742 7.0711 7.1083 -7.0709 7.6942 6.1 -6.1385
3 14 7.0711 4.1987 -7.0709 7.2693 5.95 -6.7742 7.4676 5.25 -6.4775
3 14 7.0711 4.1987 -7.0709 7.4676 5.25 -6.4775 7.8642 4.3 -5.8842
4 14 7.0711 3.364 -7.0709 7.326 3.4 -6.6895 8.2041 2.8 -5.3756 7.0711 2.6361 -7.0709
3 14 9.2391 8.0135 -3.8268 9.2391 8.4238 -3.8268 9.3265 8.2 -3.3868
4 16 -9.9352 6.3 -0.3261 -9.7859 5.75 -1.0765 -9.2388 0 -3.8277 -10 0 0
3 16 -9.2388 0 -3.8277 -9.7859 5.75 -1.0765 -9.3184 4.95 -3.4279
3 16 -9.2388 7.2167 -3.8276 -9.3383 7.3 -3.3279 -9.2388 8.625 -3.8278
3 16 -10 0 0 -9.975 11.9 -0.126 -9.9352 6.3 -0.3261
4 16 -10 19 0 -9.9153 14.9 -0.4261 -9.8556 11.85 -0.7263 -9.975 11.9 -0.126
4 16 -9.7859 14.95 -1.0765 -9.9153 14.9 -0.4261 -10 19 0 -9.8556 17 -0.7263
3 16 -10 0 0 -10 19 0 -9.975 11.9 -0.126
3 16 -9.2388 0 -3.8277 -9.3184 4.95 -3.4279 -9.2388 5.1861 -3.8278
3 16 -9.2388 11.08 -3.8277 -9.3283 11.6 -3.3779 -9.2388 11.7731 -3.8278
4 16 -9.3383 7.3 -3.3279 -9.388 7.45 -3.0777 -9.3184 8.8 -3.4279 -9.2388 8.625 -3.8278
4 16 -10 19 0 -9.2388 19 -3.8276 -9.6268 16.65 -1.877 -9.8556 17 -0.7263
3 16 -9.3582 16 -3.2278 -9.6268 16.65 -1.877 -9.2388 19 -3.8276
3 16 -9.2388 15.6069 -3.8278 -9.3582 16 -3.2278 -9.2388 19 -3.8276
3 16 -9.2388 0 -3.8277 -9.2388 5.1861 -3.8278 -8.7574 4.95 -4.5477
4 16 -9.1255 11.85 -3.9968 -8.7857 11.95 -4.5053 -8.729 10.9 -4.5901 -8.9839 10.9 -4.2087
4 16 -8.5874 11.35 -4.8019 -8.5874 11.1 -4.8019 -8.729 10.9 -4.5901 -8.7857 11.95 -4.5053
4 16 -9.2388 15.6069 -3.8278 -9.2388 19 -3.8276 -8.1626 14.55 -5.4376 -8.7574 15.05 -4.5477
3 16 -8.3326 14.25 -5.1833 -8.7574 15.05 -4.5477 -8.1626 14.55 -5.4376
4 16 -9.1539 8.5 -3.9544 -8.9273 7.8 -4.2934 -8.7857 7.15 -4.5053 -9.2388 7.2167 -3.8276
4 16 -8.9839 10.9 -4.2087 -9.2388 11.08 -3.8277 -9.2388 11.7731 -3.8278 -9.1255 11.85 -3.9968
3 16 -9.2388 7.2167 -3.8276 -9.2388 8.625 -3.8278 -9.1539 8.5 -3.9544
3 16 -7.0712 0 -7.0708 -7.8511 5.2 -5.9037 -7.5679 5.6 -6.3275
4 16 -7.0712 7.7407 -7.0708 -7.4829 6.8 -6.4546 -7.6529 7.7 -6.2004 -7.3544 8 -6.6469
4 16 -7.313 9.7 -6.7089 -7.3544 8 -6.6469 -7.6529 7.7 -6.2004 -7.5679 9.4 -6.3275
3 16 -7.9077 8.5 -5.819 -8.2193 9.2 -5.3528 -7.9077 9.25 -5.819
4 16 -7.9077 9.25 -5.819 -7.5679 9.4 -6.3275 -7.6529 7.7 -6.2004 -7.9077 8.5 -5.819
4 16 -9.2388 19 -3.8276 -7.0712 19 -7.0708 -7.0712 17.5 -7.0708 -7.411 17.7 -6.5622
4 16 -7.0712 13.6 -7.0708 -7.3544 13.5 -6.6469 -7.8228 13.85 -5.9461 -7.3544 15.5 -6.6469
4 16 -7.8642 16 -5.8841 -7.3544 15.5 -6.6469 -7.8228 13.85 -5.9461 -8.1626 14.55 -5.4376
4 16 -8.1626 14.55 -5.4376 -9.2388 19 -3.8276 -7.9208 17.7 -5.7994 -7.8642 16 -5.8841
4 16 -7.8228 13.85 -5.9461 -7.3544 13.5 -6.6469 -7.1278 12.8 -6.986 -7.5679 13.1 -6.3275
4 16 -7.5679 13.1 -6.3275 -7.1278 12.8 -6.986 -7.2978 12.1 -6.7317 -7.4829 12.45 -6.4546
4 16 -7.1278 12.8 -6.986 -7.0712 12.5 -7.0708 -7.0712 12.18 -7.0708 -7.2978 12.1 -6.7317
3 16 -7.4546 11.9 -6.497 -7.4829 12.45 -6.4546 -7.2978 12.1 -6.7317
4 16 -8.7574 4.95 -4.5477 -8.3326 4.95 -5.1833 -7.0712 0 -7.0708 -9.2388 0 -3.8277
3 16 -7.0712 0 -7.0708 -8.3326 4.95 -5.1833 -7.8511 5.2 -5.9037
3 16 -7.411 17.7 -6.5622 -7.9208 17.7 -5.7994 -9.2388 19 -3.8276
3 16 -7.0712 0 -7.0708 -7.5679 5.6 -6.3275 -7.4546 6.2 -6.497
4 16 -7.4829 6.8 -6.4546 -7.0712 7.7407 -7.0708 -7.0712 0 -7.0708 -7.4546 6.2 -6.497
4 16 -7.2411 16.4 -6.8165 -7.0712 16.5 -7.0708 -7.0712 13.6 -7.0708 -7.3544 15.5 -6.6469
4 16 -5.7995 2.3 -7.9207 -6.5625 3.5 -7.4108 -5.7995 4.5 -7.9207 -5.7147 3.1 -7.9774
3 16 -5.7147 3.1 -7.9774 -5.7995 4.5 -7.9207 -5.3756 3.6 -8.204
4 16 -5.7995 4.5 -7.9207 -4.1888 3.8 -8.9972 -4.6974 3.2 -8.6573 -5.3756 3.6 -8.204
3 16 -4.1888 2.6 -8.9972 -4.6974 3.2 -8.6573 -4.1888 3.8 -8.9972
4 16 -3.9344 1.9 -9.1672 -5.0365 1.6 -8.4307 -4.867 2.1 -8.544 -4.3583 2 -8.8839
4 16 -3.9344 1.9 -9.1672 -3.8268 0 -9.2391 -5.3756 1.3 -8.204 -5.0365 1.6 -8.4307
4 16 -7.0712 7.7407 -7.0708 -5.2061 6.6 -8.3173 -5.1213 5.4 -8.374 -6.8168 6.5 -7.2409
4 16 -4.5898 7.4 -8.7292 -4.6126 6 -8.7139 -5.1213 5.4 -8.374 -5.2061 6.6 -8.3173
4 16 -7.0712 19 -7.0708 -3.8268 19 -9.2391 -6.3082 17.1 -7.5808 -7.0712 17.5 -7.0708
3 16 -5.5452 16.6 -8.0907 -6.3082 17.1 -7.5808 -3.8268 19 -9.2391
3 16 -5.2909 16.4 -8.2607 -5.5452 16.6 -8.0907 -3.8268 19 -9.2391
4 16 -5.2909 16.4 -8.2607 -3.8268 19 -9.2391 -4.0192 14 -9.1105 -5.2909 16.1 -8.2607
4 16 -5.5452 16.1 -8.0907 -5.2909 16.1 -8.2607 -4.0192 14 -9.1105 -5.0365 14.6 -8.4307
4 16 -5.0365 14.6 -8.4307 -6.0538 15.1 -7.7508 -6.2234 16.2 -7.6375 -5.5452 16.1 -8.0907
4 16 -7.0712 16.5 -7.0708 -6.2234 16.2 -7.6375 -6.0538 15.1 -7.7508 -6.9016 15.5 -7.1842
3 16 -7.0712 12.18 -7.0708 -7.0712 12.5 -7.0708 -6.9864 12.2 -7.1276
4 16 -6.5625 3.5 -7.4108 -5.7995 2.3 -7.9207 -5.7147 1.7 -7.9774 -7.0712 0 -7.0708
3 16 -7.0712 0 -7.0708 -5.7147 1.7 -7.9774 -5.3756 1.3 -8.204
3 16 -3.8268 0 -9.2391 -7.0712 0 -7.0708 -5.3756 1.3 -8.204
4 16 -7.0712 7.7407 -7.0708 -6.8168 6.5 -7.2409 -6.5625 3.5 -7.4108 -7.0712 0 -7.0708
3 16 -7.0712 13.6 -7.0708 -7.0712 16.5 -7.0708 -6.9016 15.5 -7.1842
4 16 -4.6746 9 -8.6725 -4.5898 7.4 -8.7292 -5.2061 6.6 -8.3173 -5.4604 7.9 -8.1474
4 16 -4.9518 9.8 -8.4873 -4.6746 9 -8.6725 -5.4604 7.9 -8.1474 -5.63 9.3 -8.0341
3 16 -5.63 9.3 -8.0341 -5.63 10 -8.0341 -4.9518 9.8 -8.4873
4 16 -5.2061 11.6 -8.3173 -4.6746 11 -8.6725 -4.6746 9 -8.6725 -4.9518 9.8 -8.4873
4 16 -5.2061 11.6 -8.3173 -4.2735 11.9 -8.9406 -4.2507 11 -8.9558 -4.6746 11 -8.6725
3 16 -5.2061 11.6 -8.3173 -5.3756 12.5 -8.204 -4.2735 11.9 -8.9406
3 16 -3.8268 13.9024 -9.239 -4.0192 14 -9.1105 -3.8268 19 -9.2391
4 16 -4.5898 7.4 -8.7292 -3.8268 6.86 -9.2391 -4.1888 3.8 -8.9972 -4.6126 6 -8.7139
4 16 -4.1888 2.6 -8.9972 -4.1888 3.8 -8.9972 -3.8268 6.86 -9.2391 -4.0192 2.3 -9.1105
3 16 -3.9344 1.9 -9.1672 -4.0192 2.3 -9.1105 -3.8268 6.86 -9.2391
3 16 -3.8268 0 -9.2391 -3.9344 1.9 -9.1672 -3.8268 6.86 -9.2391
4 16 0 14.4853 -10 -2.0269 12.7 -9.597 -2.5269 12.7 -9.4975 -2.4269 13.3 -9.5174
3 16 -2.7269 11.9 -9.4578 -2.8269 12.8 -9.4379 -2.5269 12.7 -9.4975
4 16 -2.5269 12.7 -9.4975 -2.0269 12.7 -9.597 -2.1269 10.9 -9.5771 -2.7269 11.9 -9.4578
4 16 -2.7269 11.9 -9.4578 -2.1269 10.9 -9.5771 -2.4269 9.4 -9.5174 -2.6269 10.8 -9.4776
4 16 -2.1269 10.9 -9.5771 -2.0269 9.7 -9.597 -2.3269 8.9 -9.5373 -2.4269 9.4 -9.5174
3 16 -1.9269 8.7 -9.6168 -2.3269 8.9 -9.5373 -2.0269 9.7 -9.597
4 16 -2.6269 8.1 -9.4776 -2.7269 9.4 -9.4578 -2.4269 9.4 -9.5174 -2.3269 8.9 -9.5373
4 16 -2.3269 6.3 -9.5373 -2.6269 8.1 -9.4776 -2.3269 8.9 -9.5373 -1.5269 6.9 -9.6964
4 16 -0.7269 5.3 -9.8555 -1.8269 5.9 -9.6367 -2.3269 6.3 -9.5373 -1.5269 6.9 -9.6964
4 16 -2.3269 6.3 -9.5373 -1.8269 5.9 -9.6367 -1.8269 5 -9.6367 -2.4269 5.3 -9.5174
4 16 -0.2269 1.7 -9.9549 -3.8268 0 -9.2391 -2.5269 2.6 -9.4975 -1.5269 2.3 -9.6964
4 16 -3.8268 6.86 -9.2391 -2.3269 6.3 -9.5373 -2.4269 5.3 -9.5174 -3.3268 5.6 -9.3385
4 16 -2.0269 12.7 -9.597 0 14.4853 -10 0 11.5398 -10 -1.0269 12.1 -9.7958
4 16 -3.1269 4.5 -9.3782 -3.8268 0 -9.2391 -3.8268 6.86 -9.2391 -3.3268 5.6 -9.3385
3 16 -3.8268 0 -9.2391 -3.1269 4.5 -9.3782 -2.8269 3.4 -9.4379
3 16 -3.8268 0 -9.2391 -2.8269 3.4 -9.4379 -2.5269 2.6 -9.4975
3 16 0 0 -10 -3.8268 0 -9.2391 -0.2269 1.7 -9.9549
3 16 0 0 -10 -0.2269 1.7 -9.9549 0 2.0973 -10
4 15 -3.3627 17.2094 -9.3313 -2.5896 16.9789 -9.4851 -2.5778 16.7723 -9.4874 -3.3653 16.7826 -9.3308
4 15 -2.0572 18.3007 -9.5909 -1.8434 18.2897 -9.6334 -1.9048 17.6813 -9.6212 -2.1021 17.7128 -9.582
4 15 -1.2936 18.0798 -9.7428 -1.1271 17.9099 -9.7759 -1.6632 17.4319 -9.6693 -1.7624 17.5866 -9.6495
4 15 -1.6564 18.2569 -9.6706 -1.4961 18.2021 -9.7025 -1.7624 17.5866 -9.6495 -1.9048 17.6813 -9.6212
3 15 -1.9048 17.6813 -9.6212 -1.8434 18.2897 -9.6334 -1.6564 18.2569 -9.6706
3 15 -1.7624 17.5866 -9.6495 -1.4961 18.2021 -9.7025 -1.2936 18.0798 -9.7428
3 15 -1.6658 15.7282 -9.6687 -1.8618 16.3141 -9.6298 -1.4904 15.7886 -9.7036
4 15 -1.701 16.4524 -9.6617 -1.3406 15.8733 -9.7334 -1.4904 15.7886 -9.7036 -1.8618 16.3141 -9.6298
3 15 -1.3406 15.8733 -9.7334 -1.701 16.4524 -9.6617 -1.2123 15.9831 -9.7589
4 15 -.1015 17.5468 -9.9798 -.1807 17.4111 -9.9641 -.8527 17.7318 -9.8304 -.7244 17.9113 -9.8559
4 15 -.2283 17.2272 -9.9546 -.929 17.5747 -9.8153 -.8527 17.7318 -9.8304 -.1807 17.4111 -9.9641
4 15 -.1803 16.5766 -9.9641 -.1006 16.4404 -9.98 -.5587 15.9199 -9.8889 -.6815 16.0255 -9.8645
4 15 0 16.3545 -10 -.4208 15.8334 -9.9163 -.5587 15.9199 -9.8889 -.1006 16.4404 -9.98
4 15 -.8736 16.2866 -9.8263 -.9409 16.4399 -9.8129 -.2281 16.7616 -9.9546 -.1803 16.5766 -9.9641
4 15 -.9409 16.4399 -9.8129 -1.0177 16.7927 -9.7976 -.2441 16.9954 -9.9515 -.2281 16.7616 -9.9546
4 15 -.2475 18.2238 -9.9508 0 17.6227 -10 -.1015 17.5468 -9.9798 -.3972 18.164 -9.921
4 15 0 15.7025 -10 -.2679 15.7661 -9.9467 -.4208 15.8334 -9.9163 0 16.3545 -10
4 15 .0662 16.3146 -9.9868 .2798 16.2727 -9.9444 .2814 15.6797 -9.944 .0833 15.6893 -9.9834
4 15 0 16.3545 -10 .0662 16.3146 -9.9868 .0833 15.6893 -9.9834 0 15.7025 -10
4 15 .5013 16.314 -9.9003 .4844 15.6891 -9.9037 .2814 15.6797 -9.944 .2798 16.2727 -9.9444
4 15 .5106 17.6735 -9.8985 .2866 17.7146 -9.943 .3125 18.3007 -9.9379 .5148 18.2907 -9.8976
4 15 .0669 17.6726 -9.9867 .1074 18.292 -9.9786 .3125 18.3007 -9.9379 .2866 17.7146 -9.943
4 15 1.1907 18.023 -9.7632 1.3348 17.8755 -9.7346 .7542 17.4119 -9.85 .6773 17.5503 -9.8653
3 15 .6773 17.5503 -9.8653 1.0171 18.1424 -9.7977 1.1907 18.023 -9.7632
4 15 .5106 17.6735 -9.8985 .8671 18.2116 -9.8276 1.0171 18.1424 -9.7977 .6773 17.5503 -9.8653
4 15 .5013 16.314 -9.9003 .6713 16.4378 -9.8665 .9961 15.8307 -9.8019 .8416 15.7647 -9.8326
4 15 1.4466 16.2762 -9.7123 .7516 16.5693 -9.8506 .7997 16.7437 -9.841 1.5133 16.4272 -9.6991
4 15 2.7039 15.723 -9.4623 1.9207 15.723 -9.6181 1.9207 18.2574 -9.6181 2.7039 17.6333 -9.4623
4 15 3.827 17.6333 -9.239 2.7039 17.6333 -9.4623 1.9207 18.2574 -9.6181 3.827 18.2574 -9.239
4 15 .0669 17.6726 -9.9867 0 17.6227 -10 0 18.2773 -10 .1074 18.292 -9.9786
4 15 3.827 18.2574 -9.239 3.9262 18.2574 -9.1727 3.9262 17.6333 -9.1727 3.827 17.6333 -9.239
3 15 5.1513 17.8391 -8.3539 4.2281 18.2574 -8.9709 5.0277 18.2574 -8.4365
3 15 5.181 15.723 -8.3341 5.3215 17.291 -8.2402 5.5982 16.3799 -8.0553
4 15 5.181 15.723 -8.3341 4.2281 18.2574 -8.9709 5.1513 17.8391 -8.3539 5.3215 17.291 -8.2402
3 15 6.0349 15.723 -7.7634 5.181 15.723 -8.3341 5.5982 16.3799 -8.0553
4 15 5.1513 17.8391 -8.3539 6.0404 17.8391 -7.7598 5.8779 17.291 -7.8683 5.3215 17.291 -8.2402
4 15 5.5982 16.3799 -8.0553 5.8779 17.291 -7.8683 6.9873 18.2574 -7.127 6.0349 15.723 -7.7634
3 15 6.0404 17.8391 -7.7598 6.1672 18.2574 -7.675 6.9873 18.2574 -7.127
3 15 5.8779 17.291 -7.8683 6.0404 17.8391 -7.7598 6.9873 18.2574 -7.1271
4 16 -2.9208 15.9143 -9.4192 -2.7861 15.8298 -9.446 -2.4269 13.3 -9.5174 -3.8268 13.9024 -9.239
3 16 -2.4269 13.3 -9.5174 -1.6658 15.7282 -9.6687 -1.4904 15.7886 -9.7036
4 16 -0.4208 15.8334 -9.9163 0 15.3929 -10 -1.4904 15.7886 -9.7036 -1.3406 15.8733 -9.7334
4 16 0 14.4853 -10 -2.4269 13.3 -9.5174 -1.4904 15.7886 -9.7036 0 15.3929 -10
3 16 0 15.3929 -10 -0.4208 15.8334 -9.9163 -0.2679 15.7661 -9.9467
4 16 -1.3406 15.8733 -9.7334 -1.2123 15.9831 -9.7589 -0.5587 15.9199 -9.8889 -0.4208 15.8334 -9.9163
3 16 -0.5587 15.9199 -9.8889 -1.2123 15.9831 -9.7589 -0.6815 16.0255 -9.8645
4 16 -3.827 19 -9.239 0 19 -10 -1.8434 18.2897 -9.6334 -2.0572 18.3007 -9.5909
4 16 -0.2475 18.2238 -9.9508 -1.6564 18.2569 -9.6706 -1.8434 18.2897 -9.6334 0 19 -10
4 16 -1.6564 18.2569 -9.6706 -0.2475 18.2238 -9.9508 -0.3972 18.164 -9.921 -1.4961 18.2021 -9.7025
4 16 -0.7244 17.9113 -9.8559 -0.8527 17.7318 -9.8304 -1.6632 17.4319 -9.6693 -1.1271 17.9099 -9.7759
3 16 -1.6632 17.4319 -9.6693 -0.8527 17.7318 -9.8304 -0.929 17.5747 -9.8153
4 16 -.1006 16.4404 -9.98 -.1803 16.5766 -9.9641 -.2281 16.7616 -9.9546 0 16.3545 -10
4 16 -.2283 17.2272 -9.9546 0 16.3545 -10 -.2281 16.7616 -9.9546 -.2441 16.9954 -9.9515
4 16 -.2283 17.2272 -9.9546 -.1807 17.4111 -9.9641 -.1015 17.5468 -9.9798 0 16.3545 -10
3 16 0 16.3545 -10 -.1015 17.5468 -9.9798 0 17.6227 -10
4 16 0 0 -10 1.8556 2 -9.631 3.6251 1.9 -9.2791 3.8271 0 -9.239
3 16 3.6251 1.9 -9.2791 3.3892 2.7 -9.3261 3.827 2.5759 -9.239
3 16 3.8271 0 -9.239 3.6251 1.9 -9.2791 3.827 2.5759 -9.239
4 16 2.9173 13.5 -9.4199 3.8268 13.3715 -9.2391 3.827 12.4002 -9.239 3.05 12.6 -9.3935
4 16 3.05 12.6 -9.3935 1.8 13.15 -9.6421 1.2658 13.9 -9.7483 2.9173 13.5 -9.4199
3 16 1.1478 12.7 -9.7718 1.2658 13.9 -9.7483 1.8 13.15 -9.6421
4 16 1.5017 11 -9.7014 1.1478 12.7 -9.7718 1.8 13.15 -9.6421 2.05 11.75 -9.5924
3 16 2.3954 10.8 -9.5237 1.5017 11 -9.7014 2.05 11.75 -9.5924
4 16 0.558 8.6 -9.889 1.7376 8.3 -9.6545 1.7376 7.9 -9.6545 0.6759 7.9 -9.8656
4 16 1.7376 7.9 -9.6545 1.7376 8.3 -9.6545 2.4454 8.2 -9.5137 2.3275 7.8 -9.5372
4 16 2.7993 8.3 -9.4434 2.6814 7.8 -9.4668 2.3275 7.8 -9.5372 2.4454 8.2 -9.5137
4 16 2.7993 8.3 -9.4434 3.0353 8.5 -9.3964 3.5 7.4 -9.304 2.6814 7.8 -9.4668
4 16 2.6814 7.8 -9.4668 3.5 7.4 -9.304 3.827 6.8005 -9.239 3.0353 7.1 -9.3964
4 16 3.0353 7.1 -9.3964 3.827 6.8005 -9.239 3.8269 6.1538 -9.2391 3.5071 6.5 -9.3026
4 16 0.6759 7.9 -9.8656 1.7376 7.9 -9.6545 1.8556 7 -9.631 1.2658 7.3 -9.7483
4 16 1.8556 7 -9.631 1.9736 6.6 -9.6076 1.8556 6 -9.631 1.2658 7.3 -9.7483
4 16 1.9736 6.6 -9.6076 2.3275 6.2 -9.5372 2 5.5 -9.6023 1.8556 6 -9.631
4 16 2 5.5 -9.6023 2.3275 6.2 -9.5372 2.9173 6 -9.4199 2.5 5.3 -9.5029
4 16 3.5071 5.9 -9.3026 3.8269 5.8505 -9.2391 3.827 4.8838 -9.239 3.2 5 -9.3637
4 16 1.2658 5.9 -9.7483 1.8556 6 -9.631 2 5.5 -9.6023 1.7 5.4 -9.662
3 16 1.9 4.9 -9.6222 1.7 5.4 -9.662 2 5.5 -9.6023
4 16 2 5.5 -9.6023 2.5 5.3 -9.5029 3.1 4.8 -9.3836 2.7 4.9 -9.4631
3 16 0 11.5398 -10 0 14.4853 -10 0.0861 13.5 -9.9829
3 16 0 11.5398 -10 0.0861 13.5 -9.9829 0.44 12.2 -9.9125
4 16 1.1478 12.7 -9.7718 1.5017 11 -9.7014 0 11.5398 -10 0.44 12.2 -9.9125
4 16 2.5 5.3 -9.5029 2.9173 6 -9.4199 3.5071 5.9 -9.3026 3.2 5 -9.3637
4 16 0.2041 2.4 -9.9594 1.8556 2 -9.631 0 0 -10 0 2.0973 -10
3 16 0 18.2773 -10 0 19 -10 0.1074 18.292 -9.9786
3 16 0 15.3929 -10 0 15.7025 -10 .0833 15.6893 -9.9834
3 16 0 15.3929 -10 0.0833 15.6893 -9.9834 0.2814 15.6797 -9.944
4 16 0 17.6227 -10 .0669 17.6726 -9.9867 .0662 16.3146 -9.9868 0 16.3545 -10
4 16 0.0669 17.6726 -9.9867 0.2866 17.7146 -9.943 0.2798 16.2727 -9.9444 0.0662 16.3146 -9.9868
4 16 0.5106 17.6735 -9.8985 0.5013 16.314 -9.9003 0.2798 16.2727 -9.9444 0.2866 17.7146 -9.943
4 16 0.6713 16.4378 -9.8665 0.5013 16.314 -9.9003 0.5106 17.6735 -9.8985 0.6773 17.5503 -9.8653
4 16 0.7542 17.4119 -9.85 0.7516 16.5693 -9.8506 0.6713 16.4378 -9.8665 0.6773 17.5503 -9.8653
4 16 0.7997 16.7437 -9.841 0.7516 16.5693 -9.8506 0.7542 17.4119 -9.85 0.8003 17.2154 -9.8409
3 16 0.7997 16.7437 -9.841 0.8003 17.2154 -9.8409 0.8156 16.9608 -9.8378
4 16 3.827 18.2574 -9.239 1.9207 18.2574 -9.6181 0 19 -10 3.8271 19 -9.239
4 16 1.9207 18.2574 -9.6181 1.0171 18.1424 -9.7977 0.8671 18.2116 -9.8276 0 19 -10
3 16 0.5148 18.2907 -9.8976 0.3125 18.3007 -9.9379 0 19 -10
3 16 0.1074 18.292 -9.9786 0 19 -10 0.3125 18.3007 -9.9379
3 16 1.1907 18.023 -9.7632 1.0171 18.1424 -9.7977 1.9207 18.2574 -9.6181
3 16 1.3348 17.8755 -9.7346 1.1907 18.023 -9.7632 1.9207 18.2574 -9.6181
4 16 0.2814 15.6797 -9.944 0.4844 15.6891 -9.9037 2.2095 14.9 -9.5606 0 15.3929 -10
3 16 1.9207 15.723 -9.6181 1.4466 16.2762 -9.7123 1.5133 16.4272 -9.6991
4 16 1.9207 15.723 -9.6181 2.7039 15.723 -9.4623 3.8268 14.2548 -9.2391 2.2095 14.9 -9.5606
4 16 2.7039 17.6333 -9.4623 3.827 17.6333 -9.239 3.8268 14.2548 -9.2391 2.7039 15.723 -9.4623
4 16 3.827 2.5759 -9.239 4.8 2.3 -8.5887 7.071 0 -7.071 3.8271 0 -9.239
3 16 7.071 0 -7.071 4.8 2.3 -8.5887 5.7 2.2 -7.9872
3 16 7.071 0 -7.071 5.7 2.2 -7.9872 6.4001 2.2 -7.5194
4 16 6.3 2.6 -7.5862 7.0711 2.6361 -7.0709 7.071 0 -7.071 6.4001 2.2 -7.5194
3 16 7.0711 10.45 -7.0709 6.9015 10.65 -7.1843 7.0711 10.706 -7.0709
4 16 3.827 12.4002 -9.239 4.4688 13.275 -8.8101 4.7822 13.325 -8.6006 4.8 12.15 -8.5887
3 16 3.827 12.4002 -9.239 3.8268 13.3715 -9.2391 4.4688 13.275 -8.8101
4 16 3.827 6.8005 -9.239 4.1 6.3 -9.0566 4.0617 5.8 -9.0822 3.8269 6.1538 -9.2391
3 16 4.7 5.3 -8.6556 4.0617 5.8 -9.0822 4.1 6.3 -9.0566
3 16 4.7 5.3 -8.6556 4 5.3 -9.1234 4.0617 5.8 -9.0822
4 16 4 5.3 -9.1234 3.827 4.8838 -9.239 3.8269 5.8505 -9.2391 4.0617 5.8 -9.0822
4 16 4.7822 13.325 -8.6006 4.9094 13.625 -8.5156 7.0711 11.7712 -7.0709 4.8 12.15 -8.5887
4 16 6.0538 8.9 -7.7508 7.0711 9.1375 -7.0709 7.0711 7.1083 -7.0709 6.3929 8.1 -7.5242
3 16 4.2281 18.2574 -8.9709 3.9262 18.2574 -9.1727 3.8271 19 -9.239
3 16 3.9262 18.2574 -9.1727 3.827 18.2574 -9.239 3.8271 19 -9.239
3 16 5.0277 18.2574 -8.4365 4.2281 18.2574 -8.9709 3.8271 19 -9.239
4 16 7.071 19 -7.071 6.1672 18.2574 -7.675 5.0277 18.2574 -8.4365 3.8271 19 -9.239
3 16 6.9873 18.2574 -7.127 6.1672 18.2574 -7.675 7.071 19 -7.071
4 16 5.0277 18.2574 -8.4365 6.1672 18.2574 -7.675 6.0404 17.8391 -7.7598 5.1513 17.8391 -8.3539
3 16 5.5982 16.3799 -8.0553 5.3215 17.291 -8.2402 5.8779 17.291 -7.8683
4 16 3.9262 18.2574 -9.1727 4.2281 18.2574 -8.9709 5.181 15.723 -8.3341 3.9262 17.6333 -9.1727
4 16 5.181 15.723 -8.3341 3.8268 14.2548 -9.2391 3.827 17.6333 -9.239 3.9262 17.6333 -9.1727
3 16 4.3191 14.075 -8.9101 3.8268 14.2548 -9.2391 5.181 15.723 -8.3341
4 16 6.0349 15.723 -7.7634 4.6975 13.875 -8.6573 4.3191 14.075 -8.9101 5.181 15.723 -8.3341
4 16 4.6975 13.875 -8.6573 6.0349 15.723 -7.7634 7.0711 11.7712 -7.0709 4.9094 13.625 -8.5156
3 16 7.0711 11.7712 -7.0709 6.0349 15.723 -7.7634 6.9873 18.2574 -7.127
3 16 7.0711 11.7712 -7.0709 6.9873 18.2574 -7.127 7.071 19 -7.071
4 16 8.5156 3.35 -4.9094 9.239 0 -3.827 7.071 0 -7.071 8.2041 2.8 -5.3756
4 16 7.2693 5.95 -6.7742 7.6942 6.1 -6.1385 8.4873 6.1 -4.9518 7.4676 5.25 -6.4775
4 16 7.4676 5.25 -6.4775 8.4873 6.1 -4.9518 8.5156 3.35 -4.9094 7.8642 4.3 -5.8842
4 16 8.6289 6.95 -4.7398 9.239 0 -3.827 8.5156 3.35 -4.9094 8.4873 6.1 -4.9518
3 16 8.6289 6.95 -4.7398 8.6573 7.65 -4.6975 9.1105 7.9 -4.0193
4 16 8.6289 6.95 -4.7398 9.1105 7.9 -4.0193 9.2391 8.0135 -3.8268 9.239 0 -3.827
3 16 8.4873 6.1 -4.9518 7.6942 6.1 -6.1385 7.8075 6.65 -5.9689
3 16 7.0711 7.1083 -7.0709 7.0711 9.1375 -7.0709 7.156 8.2 -6.9438
4 16 7.156 8.2 -6.9438 7.3826 7.45 -6.6047 7.6942 6.1 -6.1385 7.0711 7.1083 -7.0709
3 16 7.6942 6.1 -6.1385 7.3826 7.45 -6.6047 7.8075 6.65 -5.9689
4 16 7.7792 9.45 -6.0113 7.7792 8.5 -6.0113 7.156 8.2 -6.9438 7.0711 9.1375 -7.0709
4 16 8.6856 10.05 -4.6551 8.6289 8.55 -4.7398 7.7792 8.5 -6.0113 7.7792 9.45 -6.0113
4 16 8.6289 8.55 -4.7398 8.6856 10.05 -4.6551 9.239 19 -3.827 9.1671 8.5 -3.9346
4 16 7.6659 11 -6.1809 7.2693 10.1 -6.7742 7.0711 10.45 -7.0709 7.0711 10.706 -7.0709
4 16 7.2693 10.1 -6.7742 7.6659 11 -6.1809 8.374 11.55 -5.1213 7.9491 10.1 -5.757
3 16 8.6856 10.05 -4.6551 7.9491 10.1 -5.757 8.374 11.55 -5.1213
3 16 9.2391 8.4238 -3.8268 9.1671 8.5 -3.9346 9.239 19 -3.827
3 16 7.071 0 -7.071 7.0711 2.6361 -7.0709 8.2041 2.8 -5.3756
4 16 8.6856 10.05 -4.6551 8.374 11.55 -5.1213 7.071 19 -7.071 9.239 19 -3.827
4 16 9.3265 8.2 -3.3868 9.239 19 -3.827 10 19 0 10 0 0
4 16 9.3265 8.2 -3.3868 10 0 0 9.239 0 -3.827 9.2391 8.0135 -3.8268
3 16 9.3265 8.2 -3.3868 9.2391 8.4238 -3.8268 9.239 19 -3.827
3 16 8.374 11.55 -5.1213 7.0711 11.7712 -7.0709 7.071 19 -7.071

3 15 -3.2909 16.428 -9.3456 -3.3653 16.7826 -9.3308 -2.5778 16.7723 -9.4874
4 15 -3.1422 16.1382 -9.3752 -3.2909 16.428 -9.3456 -2.5778 16.7723 -9.4874 -2.5421 16.6059 -9.4945
4 15 -2.5896 16.9789 -9.4851 -3.3627 17.2094 -9.3313 -3.2676 17.5964 -9.3502 -2.5755 17.2304 -9.4879
4 15 -2.5755 17.2304 -9.4879 -3.2676 17.5964 -9.3502 -3.0496 17.9394 -9.3936 -2.4617 17.5566 -9.5105
3 15 -3.0496 17.9394 -9.3936 -2.7323 18.1805 -9.4567 -2.4617 17.5566 -9.5105
4 15 -2.4617 17.5566 -9.5105 -2.7323 18.1805 -9.4567 -2.4325 18.2706 -9.5163 -2.3078 17.6738 -9.5411
4 15 -2.1021 17.7128 -9.582 -2.3078 17.6738 -9.5411 -2.4325 18.2706 -9.5163 -2.0572 18.3007 -9.5909
4 15 -2.9208 15.9143 -9.4192 -3.1422 16.1382 -9.3752 -2.5421 16.6059 -9.4945 -2.3741 16.3609 -9.5279
4 15 -2.9208 15.9143 -9.4192 -2.3741 16.3609 -9.5279 -2.4707 15.7172 -9.5087 -2.7861 15.8298 -9.446
3 15 -2.4707 15.7172 -9.5087 -2.3741 16.3609 -9.5279 -2.2381 16.2896 -9.555
4 15 -2.0935 15.6797 -9.5837 -2.4707 15.7172 -9.5087 -2.2381 16.2896 -9.555 -2.0745 16.2658 -9.5875
4 15 -2.0935 15.6797 -9.5837 -2.0745 16.2658 -9.5875 -1.8618 16.3141 -9.6298 -1.6658 15.7282 -9.6687
3 15 -1.0177 16.7927 -9.7976 -1.0163 17.2047 -9.7979 -.2441 16.9954 -9.9515
4 15 .8003 17.2154 -9.8409 1.5895 17.1833 -9.6839 1.5894 16.7748 -9.684 .8156 16.9608 -9.8378
4 15 1.5133 16.4272 -9.6991 .7997 16.7437 -9.841 .8156 16.9608 -9.8378 1.5894 16.7748 -9.684
4 15 -.2441 16.9954 -9.9515 -1.0163 17.2047 -9.7979 -.929 17.5747 -9.8153 -.2283 17.2272 -9.9546
4 15 .8003 17.2154 -9.8409 .7542 17.4119 -9.85 1.5147 17.5476 -9.6988 1.5895 17.1833 -9.6839
3 15 -.7244 17.9113 -9.8559 -.3972 18.164 -9.921 -.1015 17.5468 -9.9798
3 15 1.3348 17.8755 -9.7346 1.5147 17.5476 -9.6988 .7542 17.4119 -9.85
3 15 .4844 15.6891 -9.9037 .5013 16.314 -9.9003 .8416 15.7647 -9.8326
3 15 1.2566 16.0194 -9.7501 .9961 15.8307 -9.8019 .6713 16.4378 -9.8665
4 15 1.2566 16.0194 -9.7501 .6713 16.4378 -9.8665 .7516 16.5693 -9.8506 1.4466 16.2762 -9.7123
3 15 -.6815 16.0255 -9.8645 -.8736 16.2866 -9.8263 -.1803 16.5766 -9.9641
3 15 .5106 17.6735 -9.8985 .5148 18.2907 -9.8976 .8671 18.2116 -9.8276
3 15 -.2475 18.2238 -9.9508 0 18.2773 -10 0 17.6227 -10
3 16 .4844 15.6891 -9.9037 .8416 15.7647 -9.8326 2.2095 14.9 -9.5606
4 16 .9961 15.8307 -9.8019 1.9207 15.723 -9.6181 2.2095 14.9 -9.5606 .8416 15.7647 -9.8326
3 16 .9961 15.8307 -9.8019 1.2566 16.0194 -9.7501 1.9207 15.723 -9.6181
3 16 1.2566 16.0194 -9.7501 1.4466 16.2762 -9.7123 1.9207 15.723 -9.6181
3 16 0 15.7025 -10 0 15.3929 -10 -.2679 15.7661 -9.9467
3 16 -1.2123 15.9831 -9.7589 -.8736 16.2866 -9.8263 -.6815 16.0255 -9.8645
3 16 -2.7861 15.8298 -9.446 -2.4707 15.7172 -9.5087 -2.4269 13.3 -9.5174
3 16 -2.4707 15.7172 -9.5087 -2.0935 15.6797 -9.5837 -2.4269 13.3 -9.5174
3 16 -2.0935 15.6797 -9.5837 -1.6658 15.7282 -9.6687 -2.4269 13.3 -9.5174
3 16 -3.1422 16.1382 -9.3752 -2.9208 15.9143 -9.4192 -3.8268 13.9024 -9.239
3 16 -3.2909 16.428 -9.3456 -3.1422 16.1382 -9.3752 -3.8268 13.9024 -9.239
3 16 -3.2676 17.5964 -9.3502 -3.827 19 -9.239 -3.0496 17.9394 -9.3936
3 16 -3.2676 17.5964 -9.3502 -3.3627 17.2094 -9.3313 -3.827 19 -9.239
4 16 -3.8268 13.9024 -9.239 -3.827 19 -9.239 -3.3627 17.2094 -9.3313 -3.3653 16.7826 -9.3308
3 16 -3.3653 16.7826 -9.3308 -3.2909 16.428 -9.3456 -3.8268 13.9024 -9.239
3 16 -2.7323 18.1805 -9.4567 -3.0496 17.9394 -9.3936 -3.827 19 -9.239
3 16 -2.4325 18.2706 -9.5163 -2.7323 18.1805 -9.4567 -3.827 19 -9.239
3 16 -2.0572 18.3007 -9.5909 -2.4325 18.2706 -9.5163 -3.827 19 -9.239
4 16 -.3972 18.164 -9.921 -.7244 17.9113 -9.8559 -1.1271 17.9099 -9.7759 -1.2936 18.0798 -9.7428
3 16 -1.2936 18.0798 -9.7428 -1.4961 18.2021 -9.7025 -.3972 18.164 -9.921
3 16 0 18.2773 -10 -.2475 18.2238 -9.9508 0 19 -10
3 16 .8671 18.2116 -9.8276 .5148 18.2907 -9.8976 0 19 -10
3 16 1.5147 17.5476 -9.6988 1.3348 17.8755 -9.7346 1.9207 18.2574 -9.6181
4 16 1.9207 15.723 -9.6181 1.5895 17.1833 -9.6839 1.5147 17.5476 -9.6988 1.9207 18.2574 -9.6181
3 16 1.5133 16.4272 -9.6991 1.5894 16.7748 -9.684 1.9207 15.723 -9.6181
3 16 1.9207 15.723 -9.6181 1.5894 16.7748 -9.684 1.5895 17.1833 -9.6839
4 16 -.8736 16.2866 -9.8263 -1.2123 15.9831 -9.7589 -1.701 16.4524 -9.6617 -.9409 16.4399 -9.8129
4 16 -1.6632 17.4319 -9.6693 -1.0177 16.7927 -9.7976 -.9409 16.4399 -9.8129 -1.701 16.4524 -9.6617
3 16 -1.0177 16.7927 -9.7976 -1.6632 17.4319 -9.6693 -1.0163 17.2047 -9.7979
3 16 -1.0163 17.2047 -9.7979 -1.6632 17.4319 -9.6693 -.929 17.5747 -9.8153
4 16 -1.701 16.4524 -9.6617 -1.8618 16.3141 -9.6298 -1.7624 17.5866 -9.6495 -1.6632 17.4319 -9.6693
4 16 -1.8618 16.3141 -9.6298 -2.0745 16.2658 -9.5875 -1.9048 17.6813 -9.6212 -1.7624 17.5866 -9.6495
3 16 -2.1021 17.7128 -9.582 -1.9048 17.6813 -9.6212 -2.0745 16.2658 -9.5875
4 16 -2.1021 17.7128 -9.582 -2.0745 16.2658 -9.5875 -2.2381 16.2896 -9.555 -2.3078 17.6738 -9.5411
4 16 -2.2381 16.2896 -9.555 -2.3741 16.3609 -9.5279 -2.4617 17.5566 -9.5105 -2.3078 17.6738 -9.5411
4 16 -2.5755 17.2304 -9.4879 -2.4617 17.5566 -9.5105 -2.5778 16.7723 -9.4874 -2.5896 16.9789 -9.4851
4 16 -2.3741 16.3609 -9.5279 -2.5421 16.6059 -9.4945 -2.5778 16.7723 -9.4874 -2.4617 17.5566 -9.5105

5 24 0 19 -10 0 0 -10 -3.827 19 -9.239 3.827 19 -9.239
5 24 3.827 19 -9.239 3.827 0 -9.239 0 19 -10 7.071 19 -7.071
5 24 7.071 19 -7.071 7.071 0 -7.071 3.827 19 -9.239 9.239 19 -3.827
5 24 9.239 19 -3.827 9.239 0 -3.827 7.071 19 -7.071 10 19 0
5 24 -9.239 19 -3.827 -9.239 0 -3.827 -10 19 0 -7.071 19 -7.071
5 24 -7.071 19 -7.071 -7.071 0 -7.071 -9.239 19 -3.827 -3.827 19 -9.239
5 24 -3.827 19 -9.239 -3.827 0 -9.239 -7.071 19 -7.071 0 19 -10
5 24 10 19 0 10 0 0 9.239 19 3.827 9.3265 8.2 -3.3868
5 24 -10 0 0 -10 19 0 -9.975 11.9 -.126 -9.239 0 3.827
