0 Minifig Electric Guitar Classic with Magenta, Bright Pink and Metallic Silver Stars Pattern
0 Name: 11640p01.dat
0 Author: Takeshi Takahashi [RainbowDolphin]
0 !LDRAW_ORG Part UPDATE 2022-01
0 !LICENSE Redistributable under CCAL version 2.0 : see CAreadme.txt

0 BFC CERTIFY CCW

0 !CATEGORY Minifig Accessory
0 !KEYWORDS Stephanie, Stage, Set 41004, Set 41005, Set 41105, Set 561509, Bricklink 11640pb01

0 !HISTORY 2022-01-14 [PTadmin] Official Update 2022-01

1 16 0 0 0 1 0 0 0 1 0 0 0 1 s\11640s01.dat

0 // Primitives
1 80 7.5 -6.32 -3.86 0 0 -1 -1 0 0 0 1.36 0 4-4cylc.dat
1 80 10.745 -3.46 -3.86 0 0 -1 -1 0 0 0 1.36 0 4-4cylc.dat
1 80 8.75 2.7 -3.86 -2.87509 0 -.84254 -2.16653 0 1.11809 0 1.36 0 4-4cylc.dat
1 80 0 -4 -2.5 0 0 4.65 -1.55 0 0 0 -1.36 0 box5.dat
0 BFC INVERTNEXT
1 16 -7.5 2 -2.5 0 0 -1.12 -1.12 0 0 0 1 0 4-4con3.dat
1 16 -7.5 2 -1.5 0 0 -3.36 -3.36 0 0 0 1 0 4-4disc.dat
1 16 -7.5 2 -1.5 0 0 -3.36 -3.36 0 0 0 1 0 4-4edge.dat
1 16 -7.5 2 -2.5 0 0 -4.48 -4.48 0 0 0 1 0 4-4edge.dat
1 26 7.5 -6.32 -2.5 0 0 -1.2 -1.2 0 0 0 1 0 4-4ndis.dat
1 16 7.5 -6.32 -2.5 0 0 -.2 -.2 0 0 0 1 0 4-4ring5.dat
1 26 10.745 -3.46 -2.5 0 0 -1.2 -1.2 0 0 0 1 0 4-4ndis.dat
1 16 10.745 -3.46 -2.5 0 0 -.2 -.2 0 0 0 1 0 4-4ring5.dat
1 16 8.75 2.7 -2.5 -2.87509 0 -.84254 -2.16653 0 1.11809 0 1 0 4-4ndis.dat
1 16 -7.5 2 -2.5 0 0 -4.48 -4.48 0 0 0 1 0 3-4ndis.dat
1 16 -7.5 2 -2.5 0 0 4.48 -4.48 0 0 0 1 0 1-4tang.dat
1 80 -2.5 -65 -3.5 0 0 -1 -1 0 0 0 1 0 4-4cylc.dat
1 80 -.75 -69.1 -3.5 0 0 -1 -1 0 0 0 1 0 4-4cylc.dat
1 80 1 -73.2 -3.5 0 0 -1 -1 0 0 0 1 0 4-4cylc.dat
1 16 -2.5 -65 -2.5 0 0 -1 -1 0 0 0 1 0 4-4ndis.dat
1 16 -.75 -69.1 -2.5 0 0 -1 -1 0 0 0 1 0 4-4ndis.dat
1 16 1 -73.2 -2.5 0 0 -1 -1 0 0 0 1 0 4-4ndis.dat

4 16 -8.35 -8.17 -2.5 -7.2 -8.4 -2.5 -7.25 -8.63 -2.5 -7.38 -8.82 -2.5
3 16 -7.57 -8.95 -2.5 -8.35 -8.17 -2.5 -7.38 -8.82 -2.5
4 29 -6.07 -9.05 -2.5 -6.85 -9.83 -2.5 -6.9 -9.6 -2.5 -6.85 -9.37 -2.5
4 29 -6.07 -9.05 -2.5 -6.85 -9.37 -2.5 -6.72 -9.18 -2.5 -6.53 -9.05 -2.5
3 29 -6.07 -9.05 -2.5 -6.53 -9.05 -2.5 -6.3 -9 -2.5
3 29 -6.07 -9.05 -2.5 -5.88 -9.18 -2.5 -5.75 -9.37 -2.5
4 29 -6.07 -9.05 -2.5 -5.75 -9.37 -2.5 -5.7 -9.6 -2.5 -5.75 -9.83 -2.5
4 29 -6.07 -9.05 -2.5 -5.75 -9.83 -2.5 -5.88 -10.02 -2.5 -6.07 -10.15 -2.5
4 29 -6.07 -9.05 -2.5 -6.07 -10.15 -2.5 -6.3 -10.2 -2.5 -6.53 -10.15 -2.5
4 29 -6.07 -9.05 -2.5 -6.53 -10.15 -2.5 -6.72 -10.02 -2.5 -6.85 -9.83 -2.5
3 16 -3.91 -8.59 -2.5 -4.9 -8 -2.5 -3.91 -7.41 -2.5
4 29 -4.56 -9.06 -2.5 -6.3 -8 -2.5 -4.9 -8 -2.5 -3.91 -8.59 -2.5
4 29 -4.56 -6.94 -2.5 -3.91 -7.41 -2.5 -4.9 -8 -2.5 -6.3 -8 -2.5
3 26 -6 -24.2 -2.5 -4.09 -11.04 -2.5 -4 -24 -2.5
4 26 -6.7 -19.2 -2.5 -6.3 -17 -2.5 -4.09 -11.04 -2.5 -6 -24.2 -2.5
3 26 -6 -24.2 -2.5 -7.7 -21.1 -2.5 -6.7 -19.2 -2.5
4 26 -6.07 -10.15 -2.5 -4.09 -11.04 -2.5 -6.3 -17 -2.5 -6.7 -14.4 -2.5
3 26 -6.7 -14.4 -2.5 -6.3 -10.2 -2.5 -6.07 -10.15 -2.5
3 26 -6.7 -14.4 -2.5 -6.53 -10.15 -2.5 -6.3 -10.2 -2.5
4 26 -6.72 -10.02 -2.5 -6.53 -10.15 -2.5 -6.7 -14.4 -2.5 -7.9 -11.4 -2.5
3 26 -7.9 -11.4 -2.5 -6.85 -9.83 -2.5 -6.72 -10.02 -2.5
4 26 -6.9 -9.6 -2.5 -6.85 -9.83 -2.5 -7.9 -11.4 -2.5 -7.57 -8.95 -2.5
4 26 -4.56 -6.94 -2.5 -5.93 -7.01 -2.5 -5.1 -6 -2.5 -4.3 -6 -2.5
3 26 -5.93 -7.01 -2.5 -4.56 -6.94 -2.5 -6.3 -8 -2.5
4 26 -7.2 -8.4 -2.5 -6.3 -8 -2.5 -6.53 -9.05 -2.5 -6.72 -9.18 -2.5
4 26 -7.25 -8.63 -2.5 -7.2 -8.4 -2.5 -6.72 -9.18 -2.5 -6.85 -9.37 -2.5
4 26 -7.38 -8.82 -2.5 -7.25 -8.63 -2.5 -6.85 -9.37 -2.5 -6.9 -9.6 -2.5
3 26 -6.9 -9.6 -2.5 -7.57 -8.95 -2.5 -7.38 -8.82 -2.5
3 26 -6.53 -9.05 -2.5 -6.3 -8 -2.5 -6.3 -9 -2.5
4 26 -6.07 -9.05 -2.5 -6.3 -9 -2.5 -6.3 -8 -2.5 -4.56 -9.06 -2.5
3 26 -5.88 -9.18 -2.5 -6.07 -9.05 -2.5 -4.56 -9.06 -2.5
3 26 -5.75 -9.37 -2.5 -5.88 -9.18 -2.5 -4.56 -9.06 -2.5
4 26 -5.7 -9.6 -2.5 -5.75 -9.37 -2.5 -4.56 -9.06 -2.5 -4.09 -11.04 -2.5
3 26 -5.75 -9.83 -2.5 -5.7 -9.6 -2.5 -4.09 -11.04 -2.5
3 26 -5.88 -10.02 -2.5 -5.75 -9.83 -2.5 -4.09 -11.04 -2.5
3 26 -4.09 -11.04 -2.5 -6.07 -10.15 -2.5 -5.88 -10.02 -2.5
3 16 -4.3 -6 -2.5 -5.1 -6 -2.5 -4.65 -5.55 -2.5
4 16 -10.15 -11.875 -2.5 -8.5926 -10.084 -2.5 -7.9 -11.4 -2.5 -9.711 -17.33 -2.5
4 16 -9.711 -17.33 -2.5 -7.9 -11.4 -2.5 -6.7 -14.4 -2.5 -6.3 -17 -2.5
4 16 -9.711 -17.33 -2.5 -6.3 -17 -2.5 -6.7 -19.2 -2.5 -7.7 -21.1 -2.5
4 16 6.7 -9.5 -2.5 6.15 -9.73 -2.5 6.1 -9.5 -2.5 6.15 -9.27 -2.5
4 16 6.7 -9.5 -2.5 6.15 -9.27 -2.5 6.28 -9.08 -2.5 6.47 -8.95 -2.5
4 16 6.7 -9.5 -2.5 6.47 -8.95 -2.5 6.7 -8.9 -2.5 6.93 -8.95 -2.5
4 16 6.7 -9.5 -2.5 6.93 -8.95 -2.5 7.12 -9.08 -2.5 7.25 -9.27 -2.5
4 16 6.7 -9.5 -2.5 7.25 -9.27 -2.5 7.3 -9.5 -2.5 7.25 -9.73 -2.5
4 16 6.7 -9.5 -2.5 7.25 -9.73 -2.5 7.12 -9.92 -2.5 6.93 -10.05 -2.5
4 16 6.7 -9.5 -2.5 6.93 -10.05 -2.5 6.7 -10.1 -2.5 6.47 -10.05 -2.5
4 16 6.7 -9.5 -2.5 6.47 -10.05 -2.5 6.28 -9.92 -2.5 6.15 -9.73 -2.5
4 29 8.25 -15.53 -2.5 7.15 -15.53 -2.5 7.1 -15.3 -2.5 7.15 -15.07 -2.5
4 29 8.25 -15.53 -2.5 7.15 -15.07 -2.5 7.28 -14.88 -2.5 7.47 -14.75 -2.5
4 29 8.25 -15.53 -2.5 7.47 -14.75 -2.5 7.7 -14.7 -2.5 7.93 -14.75 -2.5
4 29 8.25 -15.53 -2.5 7.93 -14.75 -2.5 8.119 -14.88 -2.5 8.25 -15.07 -2.5
3 29 8.25 -15.53 -2.5 8.25 -15.07 -2.5 8.3 -15.3 -2.5
3 29 8.25 -15.53 -2.5 8.119 -15.72 -2.5 7.93 -15.85 -2.5
4 29 8.25 -15.53 -2.5 7.93 -15.85 -2.5 7.7 -15.9 -2.5 7.47 -15.85 -2.5
4 29 8.25 -15.53 -2.5 7.47 -15.85 -2.5 7.28 -15.72 -2.5 7.15 -15.53 -2.5
3 29 8.93 -18.75 -2.5 8.15 -19.53 -2.5 8.1 -19.3 -2.5
4 29 8.28 -18.88 -2.5 8.93 -18.75 -2.5 8.1 -19.3 -2.5 8.15 -19.07 -2.5
4 29 8.7 -18.7 -2.5 8.93 -18.75 -2.5 8.28 -18.88 -2.5 8.47 -18.75 -2.5
4 16 7.5 -11.3 -2.5 6.58 -11.68 -2.5 6.5 -11.3 -2.5 6.58 -10.92 -2.5
4 16 7.5 -11.3 -2.5 6.58 -10.92 -2.5 6.79 -10.59 -2.5 7.12 -10.38 -2.5
4 16 7.5 -11.3 -2.5 7.12 -10.38 -2.5 7.5 -10.3 -2.5 7.88 -10.38 -2.5
4 16 7.5 -11.3 -2.5 7.88 -10.38 -2.5 8.21 -10.59 -2.5 8.42 -10.92 -2.5
4 16 7.5 -11.3 -2.5 8.42 -10.92 -2.5 8.5 -11.3 -2.5 8.42 -11.68 -2.5
4 16 7.5 -11.3 -2.5 8.42 -11.68 -2.5 8.21 -12.01 -2.5 7.88 -12.22 -2.5
4 16 7.5 -11.3 -2.5 7.88 -12.22 -2.5 7.5 -12.3 -2.5 7.12 -12.22 -2.5
4 16 7.5 -11.3 -2.5 7.12 -12.22 -2.5 6.79 -12.01 -2.5 6.58 -11.68 -2.5
4 16 6.38 -13.84 -2.5 6 -13.6 -2.5 6.38 -13.36 -2.5 6.82 -13.98 -2.5
3 16 6.48 -14.27 -2.5 6.38 -13.84 -2.5 6.82 -13.98 -2.5
4 16 6.82 -13.98 -2.5 6.38 -13.36 -2.5 7.1 -13.6 -2.5 7.27 -14.01 -2.5
4 16 7.1 -13.6 -2.5 6.38 -13.36 -2.5 6.82 -13.22 -2.5 7.27 -13.19 -2.5
3 16 6.38 -13.36 -2.5 6.48 -12.93 -2.5 6.82 -13.22 -2.5
4 29 6.13 -14.01 -2.5 5.5 -13.6 -2.5 6 -13.6 -2.5 6.38 -13.84 -2.5
4 29 6.13 -14.01 -2.5 6.38 -13.84 -2.5 6.48 -14.27 -2.5 6.33 -14.74 -2.5
4 29 6.92 -14.27 -2.5 6.33 -14.74 -2.5 6.48 -14.27 -2.5 6.82 -13.98 -2.5
4 29 6.92 -14.27 -2.5 6.82 -13.98 -2.5 7.27 -14.01 -2.5 7.67 -14.31 -2.5
4 29 7.4 -13.6 -2.5 7.67 -14.31 -2.5 7.27 -14.01 -2.5 7.1 -13.6 -2.5
4 29 7.4 -13.6 -2.5 7.1 -13.6 -2.5 7.27 -13.19 -2.5 7.67 -12.89 -2.5
4 29 6.92 -12.93 -2.5 7.67 -12.89 -2.5 7.27 -13.19 -2.5 6.82 -13.22 -2.5
4 29 6.92 -12.93 -2.5 6.82 -13.22 -2.5 6.48 -12.93 -2.5 6.33 -12.46 -2.5
4 29 6.13 -13.19 -2.5 6.33 -12.46 -2.5 6.48 -12.93 -2.5 6.38 -13.36 -2.5
4 29 6.13 -13.19 -2.5 6.38 -13.36 -2.5 6 -13.6 -2.5 5.5 -13.6 -2.5
4 29 6.59 -17.15 -2.5 7.1 -17.5 -2.5 6.59 -17.85 -2.5 5.91 -18.07 -2.5
3 29 6.41 -18.45 -2.5 5.91 -18.07 -2.5 6.59 -17.85 -2.5
3 29 6.59 -17.15 -2.5 5.91 -16.93 -2.5 6.41 -16.55 -2.5
4 16 7.1 -17.5 -2.5 8.3 -17.5 -2.5 7.07 -18.21 -2.5 6.59 -17.85 -2.5
4 16 6.41 -18.45 -2.5 6.59 -17.85 -2.5 7.07 -18.21 -2.5 6.78 -19.59 -2.5
4 16 5.91 -18.07 -2.5 6.41 -18.45 -2.5 6.78 -19.59 -2.5 5.73 -18.64 -2.5
4 16 6.41 -16.55 -2.5 5.91 -16.93 -2.5 5.73 -16.36 -2.5 6.78 -15.41 -2.5
4 16 6.41 -16.55 -2.5 6.78 -15.41 -2.5 7.07 -16.79 -2.5 6.59 -17.15 -2.5
4 16 7.1 -17.5 -2.5 6.59 -17.15 -2.5 7.07 -16.79 -2.5 8.3 -17.5 -2.5
4 16 5.23 -9.27 -2.5 5.45 -10.13 -2.5 5.45 -11.07 -2.5 5.23 -11.93 -2.5
4 29 5.23 -9.27 -2.5 5.08 -8.02 -2.5 5.69 -8.93 -2.5 5.9 -10 -2.5
4 29 5.45 -10.13 -2.5 5.23 -9.27 -2.5 5.9 -10 -2.5 5.9 -10.4 -2.5
3 29 5.23 -11.93 -2.5 5.45 -11.07 -2.5 5.8 -10.9 -2.5
4 16 5.8 -10.9 -2.5 5.45 -11.07 -2.5 5.45 -10.13 -2.5 5.9 -10.4 -2.5
3 16 5.8 -10.9 -2.5 5.9 -10.4 -2.5 6.2 -10.6 -2.5
3 26 7.1 -21.9 -2.5 8.15 -19.53 -2.5 8.28 -19.72 -2.5
4 26 8.15 -19.53 -2.5 7.1 -21.9 -2.5 5.7 -21.5 -2.5 6.78 -19.59 -2.5
4 26 4 -21.7 -2.5 5.73 -18.64 -2.5 6.78 -19.59 -2.5 5.7 -21.5 -2.5
3 26 5.73 -16.36 -2.5 6.33 -14.74 -2.5 6.78 -15.41 -2.5
4 26 6.78 -15.41 -2.5 6.33 -14.74 -2.5 7.1 -15.3 -2.5 7.15 -15.53 -2.5
4 26 6.78 -15.41 -2.5 7.15 -15.53 -2.5 7.28 -15.72 -2.5 7.07 -16.79 -2.5
3 26 7.07 -16.79 -2.5 7.28 -15.72 -2.5 7.47 -15.85 -2.5
4 26 7.07 -16.79 -2.5 7.47 -15.85 -2.5 7.7 -15.9 -2.5 8.3 -17.5 -2.5
3 26 8.3 -17.5 -2.5 7.7 -15.9 -2.5 7.93 -15.85 -2.5
4 26 8.3 -17.5 -2.5 7.93 -15.85 -2.5 8.119 -15.72 -2.5 9.2 -17.4 -2.5
4 26 8.3 -17.5 -2.5 9.2 -17.4 -2.5 8.7 -18.7 -2.5 8.47 -18.75 -2.5
4 26 8.3 -17.5 -2.5 8.47 -18.75 -2.5 8.28 -18.88 -2.5 7.07 -18.21 -2.5
3 26 8.15 -19.07 -2.5 7.07 -18.21 -2.5 8.28 -18.88 -2.5
4 26 7.07 -18.21 -2.5 8.15 -19.07 -2.5 8.1 -19.3 -2.5 6.78 -19.59 -2.5
3 26 6.78 -19.59 -2.5 8.1 -19.3 -2.5 8.15 -19.53 -2.5
3 26 9.2 -17.4 -2.5 8.93 -18.75 -2.5 8.7 -18.7 -2.5
3 26 9.2 -17.4 -2.5 8.119 -15.72 -2.5 8.25 -15.53 -2.5
4 26 9.2 -17.4 -2.5 8.25 -15.53 -2.5 8.3 -15.3 -2.5 8.9 -14.3 -2.5
3 26 8.3 -15.3 -2.5 8.25 -15.07 -2.5 8.9 -14.3 -2.5
3 26 8.25 -15.07 -2.5 8.119 -14.88 -2.5 8.9 -14.3 -2.5
4 26 8.9 -14.3 -2.5 8.119 -14.88 -2.5 7.93 -14.75 -2.5 7.67 -14.31 -2.5
3 26 7.93 -14.75 -2.5 7.7 -14.7 -2.5 7.67 -14.31 -2.5
4 26 7.67 -14.31 -2.5 7.7 -14.7 -2.5 7.47 -14.75 -2.5 6.92 -14.27 -2.5
3 26 7.28 -14.88 -2.5 6.92 -14.27 -2.5 7.47 -14.75 -2.5
4 26 6.92 -14.27 -2.5 7.28 -14.88 -2.5 7.15 -15.07 -2.5 6.33 -14.74 -2.5
3 26 7.1 -15.3 -2.5 6.33 -14.74 -2.5 7.15 -15.07 -2.5
4 26 8.9 -14.3 -2.5 7.67 -14.31 -2.5 7.4 -13.6 -2.5 7.67 -12.89 -2.5
4 26 9.3 -12.3 -2.5 8.9 -14.3 -2.5 7.67 -12.89 -2.5 7.88 -12.22 -2.5
3 26 9.3 -12.3 -2.5 7.88 -12.22 -2.5 8.21 -12.01 -2.5
3 26 9.3 -12.3 -2.5 8.21 -12.01 -2.5 8.42 -11.68 -2.5
3 26 9.3 -12.3 -2.5 8.42 -11.68 -2.5 8.5 -11.3 -2.5
4 26 6.3 -6.32 -2.5 6.3 -7.52 -2.5 5.08 -8.02 -2.5 5.1 -6 -2.5
3 26 6.3 -7.52 -2.5 6.47 -8.95 -2.5 5.08 -8.02 -2.5
4 26 5.08 -8.02 -2.5 6.47 -8.95 -2.5 6.28 -9.08 -2.5 5.69 -8.93 -2.5
3 26 6.15 -9.27 -2.5 5.69 -8.93 -2.5 6.28 -9.08 -2.5
4 26 5.69 -8.93 -2.5 6.15 -9.27 -2.5 6.1 -9.5 -2.5 5.9 -10 -2.5
3 26 5.9 -10 -2.5 6.1 -9.5 -2.5 6.15 -9.73 -2.5
4 26 5.9 -10 -2.5 6.15 -9.73 -2.5 6.28 -9.92 -2.5 5.9 -10.4 -2.5
4 26 5.9 -10.4 -2.5 6.28 -9.92 -2.5 6.47 -10.05 -2.5 6.2 -10.6 -2.5
4 26 6.2 -10.6 -2.5 6.47 -10.05 -2.5 6.79 -10.59 -2.5 6.58 -10.92 -2.5
4 26 5.8 -10.9 -2.5 6.2 -10.6 -2.5 6.58 -10.92 -2.5 6.5 -11.3 -2.5
4 26 5.8 -10.9 -2.5 6.5 -11.3 -2.5 6.58 -11.68 -2.5 6.33 -12.46 -2.5
3 26 6.33 -12.46 -2.5 6.58 -11.68 -2.5 6.79 -12.01 -2.5
4 26 6.33 -12.46 -2.5 6.79 -12.01 -2.5 7.12 -12.22 -2.5 6.92 -12.93 -2.5
4 26 6.92 -12.93 -2.5 7.12 -12.22 -2.5 7.5 -12.3 -2.5 7.67 -12.89 -2.5
3 26 7.67 -12.89 -2.5 7.5 -12.3 -2.5 7.88 -12.22 -2.5
4 26 5.23 -11.93 -2.5 5.8 -10.9 -2.5 6.33 -12.46 -2.5 6.13 -13.19 -2.5
3 26 5.23 -11.93 -2.5 6.13 -13.19 -2.5 5.5 -13.6 -2.5
4 26 5.35 -13.77 -2.5 5.23 -11.93 -2.5 5.5 -13.6 -2.5 5.4 -14 -2.5
3 26 5.4 -14 -2.5 5.5 -13.6 -2.5 6.13 -14.01 -2.5
4 26 5.35 -14.23 -2.5 5.4 -14 -2.5 6.13 -14.01 -2.5 6.33 -14.74 -2.5
4 26 6.79 -10.59 -2.5 6.47 -10.05 -2.5 6.7 -10.1 -2.5 7.12 -10.38 -2.5
4 26 7.12 -10.38 -2.5 6.7 -10.1 -2.5 6.93 -10.05 -2.5 7.5 -10.3 -2.5
3 26 7.5 -10.3 -2.5 6.93 -10.05 -2.5 7.12 -9.92 -2.5
4 26 7.5 -10.3 -2.5 7.12 -9.92 -2.5 7.25 -9.73 -2.5 8.05 -9.73 -2.5
4 26 7.88 -10.38 -2.5 7.5 -10.3 -2.5 8.05 -9.73 -2.5 8.18 -9.92 -2.5
4 26 7.88 -10.38 -2.5 8.18 -9.92 -2.5 8.37 -10.05 -2.5 8.21 -10.59 -2.5
4 26 8.6 -10.1 -2.5 8.42 -10.92 -2.5 8.21 -10.59 -2.5 8.37 -10.05 -2.5
3 26 8.6 -10.1 -2.5 8.5 -11.3 -2.5 8.42 -10.92 -2.5
3 26 8.05 -9.73 -2.5 7.25 -9.73 -2.5 7.3 -9.5 -2.5
4 26 8 -9.5 -2.5 8.05 -9.73 -2.5 7.3 -9.5 -2.5 7.25 -9.27 -2.5
3 26 7.5 -7.52 -2.5 7.25 -9.27 -2.5 7.12 -9.08 -2.5
3 26 7.12 -9.08 -2.5 6.93 -8.95 -2.5 7.5 -7.52 -2.5
3 26 7.5 -7.52 -2.5 6.93 -8.95 -2.5 6.7 -8.9 -2.5
4 26 6.3 -7.52 -2.5 7.5 -7.52 -2.5 6.7 -8.9 -2.5 6.47 -8.95 -2.5
4 16 10.124 -12.502 -2.5 9.92 -17.34 -2.5 8.9 -14.3 -2.5 9.3 -12.3 -2.5
4 29 4.8 -14 -2.5 4.25 -14.23 -2.5 4.2 -14 -2.5 4.25 -13.77 -2.5
4 29 4.8 -14 -2.5 4.25 -13.77 -2.5 4.38 -13.58 -2.5 4.57 -13.45 -2.5
4 29 4.8 -14 -2.5 4.57 -13.45 -2.5 4.8 -13.4 -2.5 5.03 -13.45 -2.5
4 29 4.8 -14 -2.5 5.03 -13.45 -2.5 5.22 -13.58 -2.5 5.35 -13.77 -2.5
4 29 4.8 -14 -2.5 5.35 -13.77 -2.5 5.4 -14 -2.5 5.35 -14.23 -2.5
4 29 4.8 -14 -2.5 5.35 -14.23 -2.5 5.22 -14.42 -2.5 5.03 -14.55 -2.5
4 29 4.8 -14 -2.5 5.03 -14.55 -2.5 4.8 -14.6 -2.5 4.57 -14.55 -2.5
4 29 4.8 -14 -2.5 4.57 -14.55 -2.5 4.38 -14.42 -2.5 4.25 -14.23 -2.5
4 29 4.49 -15.75 -2.5 4.49 -16.45 -2.5 3.81 -16.67 -2.5 3.4 -16.1 -2.5
3 29 3.19 -16.69 -2.5 3.4 -16.1 -2.5 3.81 -16.67 -2.5
4 29 3.81 -15.53 -2.5 4.49 -15.75 -2.5 3.4 -16.1 -2.5 3.19 -15.51 -2.5
3 29 4.49 -15.75 -2.5 3.81 -15.53 -2.5 4.31 -15.15 -2.5
4 29 6.59 -17.15 -2.5 5.91 -18.07 -2.5 5.5 -17.5 -2.5 5.91 -16.93 -2.5
3 29 5.91 -18.07 -2.5 5.29 -18.09 -2.5 5.5 -17.5 -2.5
3 29 5.91 -16.93 -2.5 5.5 -17.5 -2.5 5.29 -16.91 -2.5
4 16 4.32 -18.79 -2.5 5.29 -18.09 -2.5 5.91 -18.07 -2.5 5.73 -18.64 -2.5
4 16 5.29 -18.09 -2.5 4.32 -18.79 -2.5 4.9 -17.5 -2.5 5.5 -17.5 -2.5
4 16 5.29 -16.91 -2.5 5.5 -17.5 -2.5 4.9 -17.5 -2.5 4.4 -16.7 -2.5
4 16 5.29 -16.91 -2.5 4.4 -16.7 -2.5 4.49 -16.45 -2.5 4.7 -16.3 -2.5
4 16 5.91 -16.93 -2.5 5.29 -16.91 -2.5 4.7 -16.3 -2.5 5.73 -16.36 -2.5
3 29 4.31 -17.05 -2.5 3.81 -16.67 -2.5 4.4 -16.7 -2.5
3 29 4.4 -16.7 -2.5 3.81 -16.67 -2.5 4.49 -16.45 -2.5
3 29 4.49 -16.45 -2.5 4.49 -15.75 -2.5 4.7 -16.3 -2.5
3 29 4.7 -16.3 -2.5 4.49 -15.75 -2.5 5 -16.1 -2.5
4 16 5.23 -9.27 -2.5 5.23 -11.93 -2.5 4.55 -11.36 -2.5 4 -10.6 -2.5
3 16 5.23 -9.27 -2.5 4 -10.6 -2.5 4.55 -9.84 -2.5
3 16 3.67 -11.42 -2.5 4 -10.6 -2.5 4.55 -11.36 -2.5
4 16 4.39 -6.76 -2.5 4.5 -7.3 -2.5 4.5 -7.6 -2.5 4.39 -7.84 -2.5
4 29 3.49 -12.36 -2.5 3.67 -11.42 -2.5 4.17 -12.59 -2.5 3.6 -12.7 -2.5
4 29 5.23 -11.93 -2.5 4.17 -12.59 -2.5 3.67 -11.42 -2.5 4.55 -11.36 -2.5
4 29 4.09 -8.29 -2.5 5.23 -9.27 -2.5 4.55 -9.84 -2.5 3.64 -8.59 -2.5
4 29 5.08 -8.02 -2.5 5.23 -9.27 -2.5 4.39 -7.84 -2.5 4.5 -7.6 -2.5
3 26 4 -21.7 -2.5 4.32 -18.79 -2.5 5.73 -18.64 -2.5
4 26 4.31 -17.05 -2.5 4.9 -17.5 -2.5 4.32 -18.79 -2.5 3.0479 -16.6875 -2.5
3 26 4.9 -17.5 -2.5 4.31 -17.05 -2.5 4.4 -16.7 -2.5
3 26 4.31 -17.05 -2.5 3.0479 -16.6875 -2.5 3.19 -16.69 -2.5
3 26 3.19 -16.69 -2.5 3.81 -16.67 -2.5 4.31 -17.05 -2.5
4 26 3.4 -16.1 -2.5 3.19 -16.69 -2.5 3.0479 -16.6875 -2.5 3.19 -15.51 -2.5
4 26 4.2 -14 -2.5 4.25 -14.23 -2.5 3.81 -15.53 -2.5 3.19 -15.51 -2.5
4 26 3.81 -15.53 -2.5 4.25 -14.23 -2.5 4.38 -14.42 -2.5 4.31 -15.15 -2.5
3 26 4.31 -15.15 -2.5 4.38 -14.42 -2.5 4.57 -14.55 -2.5
4 26 4.31 -15.15 -2.5 4.57 -14.55 -2.5 4.8 -14.6 -2.5 4.49 -15.75 -2.5
4 26 4.49 -15.75 -2.5 4.8 -14.6 -2.5 5.03 -14.55 -2.5 5 -16.1 -2.5
4 26 5.22 -14.42 -2.5 5.73 -16.36 -2.5 5 -16.1 -2.5 5.03 -14.55 -2.5
3 26 5.73 -16.36 -2.5 4.7 -16.3 -2.5 5 -16.1 -2.5
4 26 6.33 -14.74 -2.5 5.73 -16.36 -2.5 5.22 -14.42 -2.5 5.35 -14.23 -2.5
3 26 5.08 -8.02 -2.5 4.5 -7.6 -2.5 4.5 -7.3 -2.5
3 26 5.23 -11.93 -2.5 5.22 -13.58 -2.5 5.03 -13.45 -2.5
3 26 5.35 -13.77 -2.5 5.22 -13.58 -2.5 5.23 -11.93 -2.5
4 26 4.17 -12.59 -2.5 5.23 -11.93 -2.5 5.03 -13.45 -2.5 4.8 -13.4 -2.5
3 26 4.57 -13.45 -2.5 4.17 -12.59 -2.5 4.8 -13.4 -2.5
4 26 4.17 -12.59 -2.5 4.57 -13.45 -2.5 4.38 -13.58 -2.5 3.6 -12.7 -2.5
4 26 3.6 -12.9 -2.5 3.6 -12.7 -2.5 4.38 -13.58 -2.5 4.25 -13.77 -2.5
3 26 3.6 -12.9 -2.5 4.25 -13.77 -2.5 3.5136 -13.4502 -2.5
4 26 3.5136 -13.4502 -2.5 4.25 -13.77 -2.5 4.2 -14 -2.5 3.19 -15.51 -2.5
4 16 -3.91 -8.59 -2.5 -3.91 -7.41 -2.5 -2.79 -8.95 -2.5 -3.66 -9.71 -2.5
4 16 -2.79 -8.95 -2.5 -3.91 -7.41 -2.5 -2.1 -8 -2.5 -1.9 -9 -2.5
3 16 -1.9 -9 -2.5 -2.1 -8 -2.5 -1.9 -8.5 -2.5
4 16 -2.1 -8 -2.5 -3.91 -7.41 -2.5 -2.79 -7.05 -2.5 -1.9 -7.5 -2.5
3 16 -1.9 -7.5 -2.5 -2.79 -7.05 -2.5 -1.9 -7 -2.5
3 16 -3.91 -7.41 -2.5 -3.66 -6.29 -2.5 -2.79 -7.05 -2.5
3 29 -3.66 -9.71 -2.5 -2.54 -9.71 -2.5 -4.09 -11.04 -2.5
4 29 -2.54 -9.71 -2.5 -3.66 -9.71 -2.5 -2.79 -8.95 -2.5 -1.9 -9 -2.5
3 29 -1.9 -9.8 -2.5 -2.54 -9.71 -2.5 -1.9 -9 -2.5
3 29 -1.9 -8.5 -2.5 -2.1 -8 -2.5 -1.9 -7.5 -2.5
4 29 -1.9 -6.2 -2.5 -1.9 -7 -2.5 -2.79 -7.05 -2.5 -2.54 -6.29 -2.5
4 29 -2.54 -6.29 -2.5 -2.79 -7.05 -2.5 -3.66 -6.29 -2.5 -2.9 -6 -2.5
4 29 -4.3 -6 -2.5 -3.66 -6.29 -2.5 -3.91 -7.41 -2.5 -4.56 -6.94 -2.5
3 29 -3.66 -6.29 -2.5 -4.3 -6 -2.5 -2.9 -6 -2.5
3 29 -.51 -9.88 -2.5 -1.1 -9.8 -2.5 -1.1 -8.4 -2.5
3 29 -1.1 -7.6 -2.5 -1.1 -6.2 -2.5 -.51 -6.12 -2.5
4 80 -1.9 -6 -2.5 -1.1 -6 -2.5 -1.1 -6.2 -2.5 -1.9 -6.2 -2.5
3 80 -1.9 -7 -2.5 -1.9 -6.2 -2.5 -1.1 -6.2 -2.5
4 80 -1.9 -7.5 -2.5 -1.9 -7 -2.5 -1.1 -6.2 -2.5 -1.1 -7.6 -2.5
4 80 -1.9 -7.5 -2.5 -1.1 -7.6 -2.5 -1.1 -8.4 -2.5 -1.9 -8.5 -2.5
4 80 -1.9 -9 -2.5 -1.9 -8.5 -2.5 -1.1 -8.4 -2.5 -1.1 -9.8 -2.5
4 80 -1.9 -9.8 -2.5 -1.9 -9 -2.5 -1.1 -9.8 -2.5 -1.1 -16.6875 -2.5
3 16 4 -10.6 -2.5 3.67 -9.78 -2.5 4.55 -9.84 -2.5
3 16 4.39 -7.84 -2.5 4.09 -8.29 -2.5 4.39 -6.76 -2.5
4 16 4.09 -6.31 -2.5 4.39 -6.76 -2.5 4.09 -8.29 -2.5 3.64 -8.59 -2.5
4 16 3.64 -6 -2.5 4.09 -6.31 -2.5 3.64 -8.59 -2.5 3.1 -8.7 -2.5
4 16 2.56 -6 -2.5 3.64 -6 -2.5 3.1 -8.7 -2.5 2.56 -8.59 -2.5
4 16 2.11 -6.31 -2.5 2.56 -6 -2.5 2.56 -8.59 -2.5 2.11 -8.29 -2.5
4 16 2.11 -6.31 -2.5 2.11 -8.29 -2.5 1.9 -8 -2.5 1.9 -6.6 -2.5
4 16 .91 -13.44 -2.5 .8 -12.9 -2.5 .91 -12.36 -2.5 1.1 -13.8 -2.5
3 16 1.1 -13.8 -2.5 .91 -12.36 -2.5 1.1 -12 -2.5
4 16 1.9 -11.6 -2.5 2.2 -11.5 -2.5 2.2 -14.3 -2.5 1.9 -14.2 -2.5
4 16 2.74 -14.19 -2.5 2.2 -14.3 -2.5 2.2 -11.5 -2.5 2.74 -11.61 -2.5
4 16 3.19 -13.89 -2.5 2.74 -14.19 -2.5 2.74 -11.61 -2.5 3.19 -11.91 -2.5
4 16 3.5136 -13.4502 -2.5 3.19 -13.89 -2.5 3.19 -11.91 -2.5 3.49 -12.36 -2.5
4 16 3.5136 -13.4502 -2.5 3.49 -12.36 -2.5 3.6 -12.7 -2.5 3.6 -12.9 -2.5
4 29 .51 -8.93 -2.5 1.1 -8 -2.5 1.1 -12 -2.5 .51 -11.07 -2.5
4 29 .51 -8.93 -2.5 .51 -11.07 -2.5 .4 -10.5 -2.5 .4 -9.5 -2.5
4 29 2.2 -11.5 -2.5 1.9 -11.6 -2.5 1.9 -8 -2.5 2.11 -8.29 -2.5
4 29 2.74 -11.61 -2.5 2.2 -11.5 -2.5 2.11 -8.29 -2.5 2.56 -8.59 -2.5
4 29 3.19 -11.91 -2.5 2.74 -11.61 -2.5 2.56 -8.59 -2.5 3.1 -8.7 -2.5
4 29 3.19 -11.91 -2.5 3.1 -8.7 -2.5 3.67 -9.78 -2.5 3.67 -11.42 -2.5
3 29 3.67 -11.42 -2.5 3.67 -9.78 -2.5 4 -10.6 -2.5
3 29 3.49 -12.36 -2.5 3.19 -11.91 -2.5 3.67 -11.42 -2.5
4 29 3.67 -9.78 -2.5 3.1 -8.7 -2.5 3.64 -8.59 -2.5 4.55 -9.84 -2.5
3 29 5.23 -9.27 -2.5 4.09 -8.29 -2.5 4.39 -7.84 -2.5
3 80 .4 -9.5 -2.5 -.4 -6 -2.5 .4 -6 -2.5
4 80 -.4 -6 -2.5 .4 -9.5 -2.5 .4 -10.5 -2.5 -.4 -16.6875 -2.5
4 80 1.1 -6 -2.5 1.9 -6 -2.5 1.9 -6.6 -2.5 1.1 -8 -2.5
3 80 1.9 -8 -2.5 1.1 -8 -2.5 1.9 -6.6 -2.5
4 80 1.1 -8 -2.5 1.9 -8 -2.5 1.9 -11.6 -2.5 1.1 -12 -2.5
4 80 1.1 -13.8 -2.5 1.1 -12 -2.5 1.9 -11.6 -2.5 1.9 -14.2 -2.5
4 26 3.0479 -16.6875 -2.5 1.9 -16.6875 -2.5 2.2 -14.3 -2.5 3.19 -15.51 -2.5
3 26 1.9 -16.6875 -2.5 1.9 -14.2 -2.5 2.2 -14.3 -2.5
3 26 3.19 -15.51 -2.5 2.2 -14.3 -2.5 2.74 -14.19 -2.5
3 26 3.19 -15.51 -2.5 2.74 -14.19 -2.5 3.19 -13.89 -2.5
3 26 3.19 -15.51 -2.5 3.19 -13.89 -2.5 3.5136 -13.4502 -2.5
4 26 5.1 -6 -2.5 5.08 -8.02 -2.5 4.5 -7.3 -2.5 4.39 -6.76 -2.5
3 26 4.39 -6.76 -2.5 4.09 -6.31 -2.5 5.1 -6 -2.5
3 26 5.1 -6 -2.5 4.09 -6.31 -2.5 3.64 -6 -2.5
4 26 1.1 -16.6875 -2.5 .4 -16.6875 -2.5 .91 -13.44 -2.5 1.1 -13.8 -2.5
3 26 .4 -16.6875 -2.5 .8 -12.9 -2.5 .91 -13.44 -2.5
3 26 .8 -12.9 -2.5 .51 -11.07 -2.5 .91 -12.36 -2.5
3 26 .91 -12.36 -2.5 .51 -11.07 -2.5 1.1 -12 -2.5
4 26 .8 -12.9 -2.5 .4 -16.6875 -2.5 .4 -10.5 -2.5 .51 -11.07 -2.5
3 26 .4 -9.5 -2.5 .4 -6 -2.5 .51 -8.93 -2.5
4 26 1.1 -8 -2.5 .51 -8.93 -2.5 .4 -6 -2.5 1.1 -6 -2.5
3 26 1.9 -6.6 -2.5 1.9 -6 -2.5 2.11 -6.31 -2.5
3 26 2.11 -6.31 -2.5 1.9 -6 -2.5 2.56 -6 -2.5
4 26 -.4 -16.6875 -2.5 -1.1 -16.6875 -2.5 -1.1 -9.8 -2.5 -.51 -9.88 -2.5
3 26 -.4 -16.6875 -2.5 -.51 -9.88 -2.5 -.4 -6 -2.5
4 26 -.51 -6.12 -2.5 -.4 -6 -2.5 -.51 -9.88 -2.5 -1.1 -8.4 -2.5
3 26 -1.1 -8.4 -2.5 -1.1 -7.6 -2.5 -.51 -6.12 -2.5
4 26 -.51 -6.12 -2.5 -1.1 -6.2 -2.5 -1.1 -6 -2.5 -.4 -6 -2.5
3 80 -1.1 -16.6875 -2.5 -1.9 -16.6875 -2.5 -1.9 -9.8 -2.5
3 80 .4 -16.6875 -2.5 -.4 -16.6875 -2.5 .4 -10.5 -2.5
4 80 1.1 -13.8 -2.5 1.9 -14.2 -2.5 1.9 -16.6875 -2.5 1.1 -16.6875 -2.5
4 26 -1.9 -16.6875 -2.5 -3.0479 -16.6875 -2.5 -2.54 -9.71 -2.5 -1.9 -9.8 -2.5
4 26 -4 -24 -2.5 -4.09 -11.04 -2.5 -2.54 -9.71 -2.5 -3.0479 -16.6875 -2.5
4 26 -2.54 -6.29 -2.5 -2.9 -6 -2.5 -1.9 -6 -2.5 -1.9 -6.2 -2.5
3 16 5.1 -6 -2.5 3.64 -6 -2.5 4.65 -5.55 -2.5
3 16 3.64 -6 -2.5 2.56 -6 -2.5 4.65 -5.55 -2.5
3 16 2.56 -6 -2.5 1.9 -6 -2.5 4.65 -5.55 -2.5
3 16 1.9 -6 -2.5 1.1 -6 -2.5 4.65 -5.55 -2.5
3 16 1.1 -6 -2.5 .4 -6 -2.5 4.65 -5.55 -2.5
4 16 4.65 -5.55 -2.5 .4 -6 -2.5 -.4 -6 -2.5 -4.65 -5.55 -2.5
3 16 -.4 -6 -2.5 -1.1 -6 -2.5 -4.65 -5.55 -2.5
3 16 -1.1 -6 -2.5 -1.9 -6 -2.5 -4.65 -5.55 -2.5
3 16 -1.9 -6 -2.5 -2.9 -6 -2.5 -4.65 -5.55 -2.5
3 16 -2.9 -6 -2.5 -4.3 -6 -2.5 -4.65 -5.55 -2.5
4 29 -4.09 -11.04 -2.5 -4.56 -9.06 -2.5 -3.91 -8.59 -2.5 -3.66 -9.71 -2.5
3 26 -4 -24 -2.5 -3.0479 -16.6875 -2.5 -3.0479 -23.728 -2.5
4 16 -3.0479 -23.728 -2.5 -3.0479 -25.7296 -2.5 -4.044 -25.493 -2.5 -4 -24 -2.5
4 26 4.32 -18.79 -2.5 4 -21.7 -2.5 3.0479 -21.972 -2.5 3.0479 -16.6875 -2.5
4 16 3.0479 -23.0339 -2.5 3.0479 -21.972 -2.5 4 -21.7 -2.5 4.496 -22.546 -2.5
4 16 6.148 -22.38 -2.5 4.496 -22.546 -2.5 4 -21.7 -2.5 5.7 -21.5 -2.5
4 29 8.6 -10.1 -2.5 8.37 -10.05 -2.5 8.18 -9.92 -2.5 8.05 -9.73 -2.5
4 16 -12.191 -25.437 -2.5 -10.932 -21.607 -2.5 -6.854 -25.87 -2.5 -12.46 -29.263 -2.5
3 26 10.6 -25.6 -2.5 9.8 -25.2 -2.5 11.5 -24.6 -2.5
4 16 9.229 -25.701 -2.5 9.8 -25.2 -2.5 10.6 -25.6 -2.5 10.388 -26.336 -2.5
4 16 11 -26.193 -2.5 10.388 -26.336 -2.5 10.6 -25.6 -2.5 11.5 -24.6 -2.5
3 16 11 -26.193 -2.5 11.5 -24.6 -2.5 12.162 -24.5 -2.5
4 16 -12.46 -29.263 -2.5 -9.918 -31.847 -2.5 -11.144 -31.974 -2.5 -11.9 -31.411 -2.5
4 16 -12.46 -29.263 -2.5 -8.805 -28.438 -2.5 -9.37 -31.296 -2.5 -9.918 -31.847 -2.5
4 16 -11.98 2 -2.5 -14.314 2.932 -2.5 -13 6.5 -2.5 -11.98 6.48 -2.5
4 16 -11.98 2 -2.5 -11.98 -2.48 -2.5 -14.25 0 -2.5 -14.314 2.932 -2.5
3 16 -12.513 -6.65 -2.5 -14.25 0 -2.5 -11.98 -2.48 -2.5
4 26 -8.22 -7.98 -2.5 -9.3 -7.9 -2.5 -9.3 -6.1 -2.5 -8.1 -6.3 -2.5
4 26 -7.47 -5.89 -2.5 -8.1 -6.3 -2.5 -9.3 -6.1 -2.5 -8.7 -4.7 -2.5
4 16 -7.5 -2.48 -2.5 -7.5 -3.7 -2.5 -8.7 -4.7 -2.5 -11.98 -2.48 -2.5
4 16 -12.513 -6.65 -2.5 -11.98 -2.48 -2.5 -8.7 -4.7 -2.5 -9.3 -6.1 -2.5
4 16 -12.513 -6.65 -2.5 -9.3 -6.1 -2.5 -9.3 -7.9 -2.5 -10.15 -11.875 -2.5
3 16 -8.35 -8.17 -2.5 -8.35 -8.63 -2.5 -8.4 -8.4 -2.5
3 16 -8.35 -8.17 -2.5 -8.22 -7.98 -2.5 -8.029 -7.85 -2.5
4 16 -8.35 -8.17 -2.5 -8.029 -7.85 -2.5 -7.8 -7.8 -2.5 -7.57 -7.85 -2.5
4 16 -8.35 -8.17 -2.5 -7.57 -7.85 -2.5 -7.38 -7.98 -2.5 -7.25 -8.17 -2.5
3 16 -8.35 -8.17 -2.5 -7.25 -8.17 -2.5 -7.2 -8.4 -2.5
4 16 -8.35 -8.17 -2.5 -7.57 -8.95 -2.5 -7.8 -9 -2.5 -8.029 -8.95 -2.5
4 16 -8.35 -8.17 -2.5 -8.029 -8.95 -2.5 -8.22 -8.82 -2.5 -8.35 -8.63 -2.5
4 16 -7.47 -6.71 -2.5 -8.1 -6.3 -2.5 -7.47 -5.89 -2.5 -6.68 -6.97 -2.5
3 16 -7.27 -7.44 -2.5 -7.47 -6.71 -2.5 -6.68 -6.97 -2.5
4 16 -6.68 -6.97 -2.5 -7.47 -5.89 -2.5 -6.2 -6.3 -2.5 -5.93 -7.01 -2.5
4 16 -6.2 -6.3 -2.5 -7.47 -5.89 -2.5 -6.68 -5.63 -2.5 -5.93 -5.59 -2.5
3 16 -7.47 -5.89 -2.5 -7.27 -5.16 -2.5 -6.68 -5.63 -2.5
4 26 -8.9 -9.5 -2.5 -8.029 -8.95 -2.5 -7.8 -9 -2.5 -8.5926 -10.084 -2.5
4 26 -7.9 -11.4 -2.5 -8.5926 -10.084 -2.5 -7.8 -9 -2.5 -7.57 -8.95 -2.5
3 26 -8.9 -9.5 -2.5 -8.22 -8.82 -2.5 -8.029 -8.95 -2.5
4 26 -8.35 -8.63 -2.5 -8.22 -8.82 -2.5 -8.9 -9.5 -2.5 -9.3 -7.9 -2.5
3 26 -9.3 -7.9 -2.5 -8.4 -8.4 -2.5 -8.35 -8.63 -2.5
3 26 -9.3 -7.9 -2.5 -8.35 -8.17 -2.5 -8.4 -8.4 -2.5
3 26 -9.3 -7.9 -2.5 -8.22 -7.98 -2.5 -8.35 -8.17 -2.5
4 26 -7.47 -5.89 -2.5 -8.7 -4.7 -2.5 -7.5 -3.7 -2.5 -7.27 -5.16 -2.5
4 26 -7.27 -5.16 -2.5 -7.5 -3.7 -2.5 -5.1 -3.6 -2.5 -6.68 -5.63 -2.5
3 26 -6.68 -5.63 -2.5 -5.1 -3.6 -2.5 -5.93 -5.59 -2.5
4 26 -5.93 -5.59 -2.5 -5.1 -3.6 -2.5 -5.1 -6 -2.5 -6.2 -6.3 -2.5
3 26 -5.93 -7.01 -2.5 -6.2 -6.3 -2.5 -5.1 -6 -2.5
4 26 -5.93 -7.01 -2.5 -6.3 -8 -2.5 -7.27 -7.44 -2.5 -6.68 -6.97 -2.5
4 26 -7.27 -7.44 -2.5 -6.3 -8 -2.5 -7.25 -8.17 -2.5 -7.38 -7.98 -2.5
3 26 -7.38 -7.98 -2.5 -7.57 -7.85 -2.5 -7.27 -7.44 -2.5
4 26 -7.27 -7.44 -2.5 -7.57 -7.85 -2.5 -7.8 -7.8 -2.5 -7.47 -6.71 -2.5
4 26 -7.47 -6.71 -2.5 -7.8 -7.8 -2.5 -8.029 -7.85 -2.5 -8.1 -6.3 -2.5
3 26 -8.22 -7.98 -2.5 -8.1 -6.3 -2.5 -8.029 -7.85 -2.5
3 26 -6.3 -8 -2.5 -7.2 -8.4 -2.5 -7.25 -8.17 -2.5
4 16 -4.65 -2.45 -2.5 -4.65 -5.55 -2.5 -5.1 -6 -2.5 -5.1 -3.6 -2.5
3 16 -10.15 -11.875 -2.5 -9.3 -7.9 -2.5 -8.9 -9.5 -2.5
3 16 -10.15 -11.875 -2.5 -8.9 -9.5 -2.5 -8.5926 -10.084 -2.5
4 16 -11.98 6.48 -2.5 -13 6.5 -2.5 -10.5 8.025 -2.5 -7.5 6.48 -2.5
4 16 -7.5 6.48 -2.5 -10.5 8.025 -2.5 -7.5 8.65 -2.5 -3.02 6.48 -2.5
4 16 -3.02 6.48 -2.5 -7.5 8.65 -2.5 3.25 8.9 -2.5 2.19 8.039 -2.5
4 80 2.5 7.3 -2.5 1.76 6.99 -2.5 1.7 7.3 -2.5 1.76 7.61 -2.5
4 80 2.5 7.3 -2.5 1.76 7.61 -2.5 1.93 7.87 -2.5 2.19 8.039 -2.5
4 80 2.5 7.3 -2.5 2.19 8.039 -2.5 2.5 8.1 -2.5 2.81 8.039 -2.5
4 80 2.5 7.3 -2.5 2.81 8.039 -2.5 3.07 7.87 -2.5 3.24 7.61 -2.5
4 80 2.5 7.3 -2.5 3.24 7.61 -2.5 3.3 7.3 -2.5 3.24 6.99 -2.5
4 80 2.5 7.3 -2.5 3.24 6.99 -2.5 3.07 6.73 -2.5 2.81 6.56 -2.5
4 80 2.5 7.3 -2.5 2.81 6.56 -2.5 2.5 6.5 -2.5 2.19 6.56 -2.5
4 80 2.5 7.3 -2.5 2.19 6.56 -2.5 1.93 6.73 -2.5 1.76 6.99 -2.5
4 16 1.81 2.95 -2.5 1.3 3.3 -2.5 1.81 3.65 -2.5 2.49 2.73 -2.5
4 16 2.49 2.73 -2.5 1.81 3.65 -2.5 2.49 3.87 -2.5 2.9 3.3 -2.5
3 16 3.11 2.71 -2.5 2.49 2.73 -2.5 2.9 3.3 -2.5
3 16 2.9 3.3 -2.5 2.49 3.87 -2.5 3.11 3.89 -2.5
3 16 1.99 2.35 -2.5 1.81 2.95 -2.5 2.49 2.73 -2.5
3 16 1.81 3.65 -2.5 1.99 4.25 -2.5 2.49 3.87 -2.5
4 80 1.49 2.71 -2.5 .5 3.3 -2.5 1.3 3.3 -2.5 1.81 2.95 -2.5
4 80 1.49 2.71 -2.5 1.81 2.95 -2.5 1.99 2.35 -2.5 1.74 1.59 -2.5
4 80 2.61 2.35 -2.5 1.74 1.59 -2.5 1.99 2.35 -2.5 2.49 2.73 -2.5
4 80 2.61 2.35 -2.5 2.49 2.73 -2.5 3.11 2.71 -2.5 3.76 2.24 -2.5
4 80 3.3 3.3 -2.5 3.76 2.24 -2.5 3.11 2.71 -2.5 2.9 3.3 -2.5
4 80 3.3 3.3 -2.5 2.9 3.3 -2.5 3.11 3.89 -2.5 3.76 4.36 -2.5
4 80 2.61 4.25 -2.5 3.76 4.36 -2.5 3.11 3.89 -2.5 2.49 3.87 -2.5
4 80 2.61 4.25 -2.5 2.49 3.87 -2.5 1.99 4.25 -2.5 1.74 5.01 -2.5
4 80 1.49 3.89 -2.5 1.74 5.01 -2.5 1.99 4.25 -2.5 1.81 3.65 -2.5
4 80 1.49 3.89 -2.5 1.81 3.65 -2.5 1.3 3.3 -2.5 .5 3.3 -2.5
3 16 2.19 8.039 -2.5 3.25 8.9 -2.5 2.5 8.1 -2.5
3 16 2.81 8.039 -2.5 2.5 8.1 -2.5 3.25 8.9 -2.5
3 16 3.07 7.87 -2.5 2.81 8.039 -2.5 3.25 8.9 -2.5
3 16 3.24 7.61 -2.5 3.07 7.87 -2.5 3.25 8.9 -2.5
4 16 2.81 6.56 -2.5 3.8 6 -2.5 1.74 5.01 -2.5 2.5 6.5 -2.5
3 16 3.8 6 -2.5 2.81 6.56 -2.5 3.07 6.73 -2.5
3 16 3.8 6 -2.5 3.07 6.73 -2.5 3.24 6.99 -2.5
3 16 3.8 6 -2.5 3.24 6.99 -2.5 3.3 7.3 -2.5
4 16 3.25 8.9 -2.5 3.8 6 -2.5 3.3 7.3 -2.5 3.24 7.61 -2.5
3 16 1.74 5.01 -2.5 2.19 6.56 -2.5 2.5 6.5 -2.5
4 16 1.93 6.73 -2.5 2.19 6.56 -2.5 1.74 5.01 -2.5 -3.02 6.48 -2.5
3 16 -3.02 6.48 -2.5 1.76 6.99 -2.5 1.93 6.73 -2.5
3 16 -3.02 6.48 -2.5 1.7 7.3 -2.5 1.76 6.99 -2.5
3 16 -3.02 6.48 -2.5 1.76 7.61 -2.5 1.7 7.3 -2.5
3 16 -3.02 6.48 -2.5 1.93 7.87 -2.5 1.76 7.61 -2.5
3 16 -3.02 6.48 -2.5 2.19 8.039 -2.5 1.93 7.87 -2.5
4 16 -3.02 6.48 -2.5 1.74 5.01 -2.5 1.49 3.89 -2.5 .5 3.3 -2.5
3 16 -3.02 2 -2.5 -3.02 6.48 -2.5 .5 3.3 -2.5
4 16 -3.02 2 -2.5 .5 3.3 -2.5 1.49 2.71 -2.5 1.74 1.59 -2.5
4 16 4.65 -2.45 -2.5 1.74 1.59 -2.5 2.61 2.35 -2.5 3.76 2.24 -2.5
3 80 7.66 6.61 -2.5 7.66 5.99 -2.5 7.6 6.3 -2.5
3 80 7.66 6.61 -2.5 7.83 6.87 -2.5 8.09 7.04 -2.5
4 80 7.66 6.61 -2.5 8.09 7.04 -2.5 8.4 7.1 -2.5 8.71 7.04 -2.5
4 80 7.66 6.61 -2.5 8.71 7.04 -2.5 8.97 6.87 -2.5 9.14 6.61 -2.5
4 80 8.71 5.56 -2.5 7.66 6.61 -2.5 9.14 6.61 -2.5 9.2 6.3 -2.5
4 80 7.66 6.61 -2.5 8.71 5.56 -2.5 8.4 5.5 -2.5 8.09 5.56 -2.5
4 80 7.66 6.61 -2.5 8.09 5.56 -2.5 7.83 5.73 -2.5 7.66 5.99 -2.5
4 80 5.4 3.3 -2.5 4.6 3.3 -2.5 4.66 3.61 -2.5 4.83 3.87 -2.5
4 80 5.4 3.3 -2.5 4.83 3.87 -2.5 5.09 4.04 -2.5 5.4 4.1 -2.5
4 80 5.4 3.3 -2.5 5.4 4.1 -2.5 5.71 4.04 -2.5 5.97 3.87 -2.5
4 80 5.4 3.3 -2.5 5.97 3.87 -2.5 6.14 3.61 -2.5 6.2 3.3 -2.5
4 80 5.4 3.3 -2.5 6.2 3.3 -2.5 6.14 2.99 -2.5 5.97 2.73 -2.5
4 80 5.4 3.3 -2.5 5.97 2.73 -2.5 5.71 2.56 -2.5 5.4 2.5 -2.5
4 80 5.4 3.3 -2.5 5.4 2.5 -2.5 5.09 2.56 -2.5 4.83 2.73 -2.5
4 80 4.6 3.3 -2.5 5.4 3.3 -2.5 4.83 2.73 -2.5 4.66 2.99 -2.5
3 80 3.8 6 -2.5 4.55 6.47 -2.5 4.55 5.53 -2.5
4 80 5.45 5.24 -2.5 4.55 5.53 -2.5 4.55 6.47 -2.5 5.45 6.76 -2.5
4 80 5.45 5.24 -2.5 5.45 6.76 -2.5 6 6 -2.5 6.33 5.18 -2.5
3 80 4.77 4.67 -2.5 4.55 5.53 -2.5 5.45 5.24 -2.5
3 80 4.55 6.47 -2.5 4.77 7.33 -2.5 5.45 6.76 -2.5
3 80 6 6 -2.5 5.45 6.76 -2.5 6.33 6.82 -2.5
4 16 4.77 7.33 -2.5 3.25 8.9 -2.5 6.33 6.82 -2.5 5.45 6.76 -2.5
4 16 7.83 6.87 -2.5 6.33 6.82 -2.5 3.25 8.9 -2.5 8.09 7.04 -2.5
4 16 8.4 7.1 -2.5 8.09 7.04 -2.5 3.25 8.9 -2.5 9.75 7.75 -2.5
3 16 8.71 7.04 -2.5 8.4 7.1 -2.5 9.75 7.75 -2.5
3 16 8.97 6.87 -2.5 8.71 7.04 -2.5 9.75 7.75 -2.5
3 16 9.14 6.61 -2.5 8.97 6.87 -2.5 9.75 7.75 -2.5
4 16 10.7826 5.9846 -2.5 9.2 6.3 -2.5 9.14 6.61 -2.5 9.75 7.75 -2.5
3 16 7.9075 3.8181 -2.5 8.4 5.5 -2.5 8.71 5.56 -2.5
3 16 7.9075 3.8181 -2.5 8.09 5.56 -2.5 8.4 5.5 -2.5
4 16 7.83 5.73 -2.5 8.09 5.56 -2.5 7.9075 3.8181 -2.5 6.33 5.18 -2.5
4 16 7.66 5.99 -2.5 7.83 5.73 -2.5 6.33 5.18 -2.5 6 6 -2.5
4 16 7.6 6.3 -2.5 7.66 5.99 -2.5 6 6 -2.5 6.33 6.82 -2.5
3 16 7.6 6.3 -2.5 6.33 6.82 -2.5 7.66 6.61 -2.5
3 16 7.66 6.61 -2.5 6.33 6.82 -2.5 7.83 6.87 -2.5
4 16 6.14 3.61 -2.5 6.33 5.18 -2.5 7.9075 3.8181 -2.5 6.2 3.3 -2.5
3 16 6.14 2.99 -2.5 6.2 3.3 -2.5 7.9075 3.8181 -2.5
3 16 5.97 2.73 -2.5 6.14 2.99 -2.5 7.9075 3.8181 -2.5
4 16 5.97 2.73 -2.5 7.9075 3.8181 -2.5 5.0324 1.6516 -2.5 5.71 2.56 -2.5
3 16 5.0324 1.6516 -2.5 5.4 2.5 -2.5 5.71 2.56 -2.5
3 16 5.0324 1.6516 -2.5 5.09 2.56 -2.5 5.4 2.5 -2.5
3 16 5.0324 1.6516 -2.5 4.83 2.73 -2.5 5.09 2.56 -2.5
3 16 4.6 3.3 -2.5 3.3 3.3 -2.5 4.66 3.61 -2.5
4 16 3.76 4.36 -2.5 4.83 3.87 -2.5 4.66 3.61 -2.5 3.3 3.3 -2.5
4 16 3.8 6 -2.5 4.77 4.67 -2.5 4.83 3.87 -2.5 3.76 4.36 -2.5
4 16 5.09 4.04 -2.5 4.83 3.87 -2.5 4.77 4.67 -2.5 5.45 5.24 -2.5
3 16 5.09 4.04 -2.5 5.45 5.24 -2.5 5.4 4.1 -2.5
4 16 5.71 4.04 -2.5 5.4 4.1 -2.5 5.45 5.24 -2.5 6.33 5.18 -2.5
3 16 5.97 3.87 -2.5 5.71 4.04 -2.5 6.33 5.18 -2.5
3 16 6.14 3.61 -2.5 5.97 3.87 -2.5 6.33 5.18 -2.5
3 16 3.8 6 -2.5 4.55 5.53 -2.5 4.77 4.67 -2.5
4 16 3.25 8.9 -2.5 4.77 7.33 -2.5 4.55 6.47 -2.5 3.8 6 -2.5
4 80 9.2 6.3 -2.5 9.14 5.99 -2.5 8.97 5.73 -2.5 8.71 5.56 -2.5
4 16 10.7826 5.9846 -2.5 9.75 7.75 -2.5 11.75 6.75 -2.5 11.6251 4.8665 -2.5
3 16 10.7826 5.9846 -2.5 9.14 5.99 -2.5 9.2 6.3 -2.5
4 16 8.97 5.73 -2.5 9.14 5.99 -2.5 10.7826 5.9846 -2.5 7.9075 3.8181 -2.5
3 16 7.9075 3.8181 -2.5 8.71 5.56 -2.5 8.97 5.73 -2.5
4 16 11.6251 4.8665 -2.5 11.75 6.75 -2.5 13.9 4 -2.5 12.4676 3.7484 -2.5
4 26 11.8 -.3 -2.5 12.6 -.5 -2.5 11.945 -2.26 -2.5 10.6 -.7 -2.5
4 16 9.5925 1.5819 -2.5 12.4676 3.7484 -2.5 11.8 -.3 -2.5 10.6 -.7 -2.5
4 16 13.9 4 -2.5 12.6 -.5 -2.5 11.8 -.3 -2.5 12.4676 3.7484 -2.5
3 26 10.6 -.7 -2.5 11.945 -2.26 -2.5 10.745 -2.26 -2.5
4 26 10.6 -.7 -2.5 10.745 -2.26 -2.5 9.545 -2.26 -2.5 9.4 -1.6 -2.5
4 16 9.5925 1.5819 -2.5 10.6 -.7 -2.5 9.4 -1.6 -2.5 6.7175 -.5846 -2.5
3 16 6.7175 -.5846 -2.5 9.4 -1.6 -2.5 6.7 -3.2 -2.5
3 26 6.7 -3.2 -2.5 9.4 -1.6 -2.5 9.545 -2.26 -2.5
4 16 6.7175 -.5846 -2.5 6.7 -3.2 -2.5 4.65 -2.45 -2.5 5.8749 .5335 -2.5
4 16 5.0324 1.6516 -2.5 5.8749 .5335 -2.5 4.65 -2.45 -2.5 3.76 2.24 -2.5
4 16 4.66 2.99 -2.5 4.83 2.73 -2.5 5.0324 1.6516 -2.5 3.3 3.3 -2.5
3 16 5.0324 1.6516 -2.5 3.76 2.24 -2.5 3.3 3.3 -2.5
3 16 3.3 3.3 -2.5 4.6 3.3 -2.5 4.66 2.99 -2.5
4 16 1.74 5.01 -2.5 3.8 6 -2.5 3.76 4.36 -2.5 2.61 4.25 -2.5
4 26 6.7 -3.2 -2.5 9.545 -2.26 -2.5 9.545 -3.46 -2.5 7.5 -5.12 -2.5
4 26 6.7 -3.2 -2.5 7.5 -5.12 -2.5 6.3 -5.12 -2.5 5.1 -3.6 -2.5
3 16 4.65 -2.45 -2.5 6.7 -3.2 -2.5 5.1 -3.6 -2.5
4 26 6.3 -6.32 -2.5 5.1 -6 -2.5 5.1 -3.6 -2.5 6.3 -5.12 -2.5
4 16 4.65 -5.55 -2.5 4.65 -2.45 -2.5 5.1 -3.6 -2.5 5.1 -6 -2.5
4 26 8.7 -5.12 -2.5 7.5 -5.12 -2.5 9.545 -3.46 -2.5 9.545 -4.66 -2.5
4 26 9.545 -4.66 -2.5 10.745 -4.66 -2.5 8.7 -6.32 -2.5 8.7 -5.12 -2.5
4 26 10.745 -4.66 -2.5 11.945 -4.66 -2.5 8.7 -7.52 -2.5 8.7 -6.32 -2.5
4 26 12.6 -5 -2.5 9.8 -10.7 -2.5 9.2 -9.5 -2.5 11.945 -4.66 -2.5
4 26 9.02 -9.08 -2.5 8.7 -7.52 -2.5 11.945 -4.66 -2.5 9.15 -9.27 -2.5
3 26 9.2 -9.5 -2.5 9.15 -9.27 -2.5 11.945 -4.66 -2.5
4 16 10.124 -12.502 -2.5 9.3 -12.3 -2.5 9.8 -10.7 -2.5 12.6 -5 -2.5
3 16 10.124 -12.502 -2.5 12.6 -5 -2.5 13.25 -5.025 -2.5
4 26 11.945 -3.46 -2.5 11.945 -2.26 -2.5 12.6 -.5 -2.5 13.1 -1.2 -2.5
4 16 14.35 .375 -2.5 13.1 -1.2 -2.5 12.6 -.5 -2.5 13.9 4 -2.5
4 26 13.2 -2.9 -2.5 12.6 -5 -2.5 11.945 -4.66 -2.5 11.945 -3.46 -2.5
3 26 11.945 -3.46 -2.5 13.1 -1.2 -2.5 13.2 -2.9 -2.5
4 16 13.25 -5.025 -2.5 12.6 -5 -2.5 13.2 -2.9 -2.5 14.35 .375 -2.5
3 16 13.2 -2.9 -2.5 13.1 -1.2 -2.5 14.35 .375 -2.5
3 16 -12.46 -29.263 -2.5 -6.854 -25.87 -2.5 -8.805 -28.438 -2.5
4 26 -6 -24.2 -2.5 -7.3 -23.9 -2.5 -7.9 -22.6 -2.5 -7.7 -21.1 -2.5
4 16 -9.711 -17.33 -2.5 -7.7 -21.1 -2.5 -7.9 -22.6 -2.5 -10.932 -21.607 -2.5
4 16 -10.932 -21.607 -2.5 -7.9 -22.6 -2.5 -7.3 -23.9 -2.5 -6.854 -25.87 -2.5
4 16 -6.854 -25.87 -2.5 -7.3 -23.9 -2.5 -6 -24.2 -2.5 -4.044 -25.493 -2.5
3 16 -4.044 -25.493 -2.5 -6 -24.2 -2.5 -4 -24 -2.5
4 29 8.93 -18.75 -2.5 9.12 -18.88 -2.5 9.3 -19.3 -2.5 9.25 -19.53 -2.5
3 29 9.12 -18.88 -2.5 9.25 -19.07 -2.5 9.3 -19.3 -2.5
4 29 8.93 -18.75 -2.5 9.25 -19.53 -2.5 9.12 -19.72 -2.5 8.93 -19.85 -2.5
4 29 8.93 -18.75 -2.5 8.93 -19.85 -2.5 8.7 -19.9 -2.5 8.47 -19.85 -2.5
4 29 8.15 -19.53 -2.5 8.93 -18.75 -2.5 8.47 -19.85 -2.5 8.28 -19.72 -2.5
4 26 8.7 -22.9 -2.5 10.6 -21 -2.5 11.4 -23 -2.5 9.3 -23.9 -2.5
4 26 8.93 -19.85 -2.5 10.6 -21 -2.5 8.7 -22.9 -2.5 8.7 -19.9 -2.5
4 26 8.47 -19.85 -2.5 8.7 -19.9 -2.5 8.7 -22.9 -2.5 7.1 -21.9 -2.5
3 26 7.1 -21.9 -2.5 8.28 -19.72 -2.5 8.47 -19.85 -2.5
4 26 9.3 -19.3 -2.5 9.25 -19.07 -2.5 9.2 -17.4 -2.5 10.6 -21 -2.5
3 26 9.12 -18.88 -2.5 9.2 -17.4 -2.5 9.25 -19.07 -2.5
3 26 9.2 -17.4 -2.5 9.12 -18.88 -2.5 8.93 -18.75 -2.5
3 26 10.6 -21 -2.5 9.25 -19.53 -2.5 9.3 -19.3 -2.5
3 26 10.6 -21 -2.5 9.12 -19.72 -2.5 9.25 -19.53 -2.5
3 26 10.6 -21 -2.5 8.93 -19.85 -2.5 9.12 -19.72 -2.5
4 16 6.148 -22.38 -2.5 5.7 -21.5 -2.5 7.1 -21.9 -2.5 8.7 -22.9 -2.5
4 16 8.606 -23.753 -2.5 6.148 -22.38 -2.5 8.7 -22.9 -2.5 9.3 -23.9 -2.5
4 16 11.875 -22.3741 -2.5 11.4 -23 -2.5 10.6 -21 -2.5 9.92 -17.34 -2.5
4 16 8.9 -14.3 -2.5 9.92 -17.34 -2.5 10.6 -21 -2.5 9.2 -17.4 -2.5
4 26 11.5 -24.6 -2.5 9.8 -25.2 -2.5 9.3 -23.9 -2.5 11.4 -23 -2.5
4 16 9.8 -25.2 -2.5 9.229 -25.701 -2.5 8.606 -23.753 -2.5 9.3 -23.9 -2.5
4 16 12.162 -24.5 -2.5 11.5 -24.6 -2.5 11.4 -23 -2.5 11.875 -22.3741 -2.5
3 29 8.05 -9.73 -2.5 8 -9.5 -2.5 8.05 -9.27 -2.5
4 29 8.05 -9.73 -2.5 8.05 -9.27 -2.5 8.18 -9.08 -2.5 8.3369 -8.9727 -2.5
3 29 8.05 -9.73 -2.5 8.83 -10.05 -2.5 8.6 -10.1 -2.5
3 26 8 -9.5 -2.5 7.25 -9.27 -2.5 8.05 -9.27 -2.5
4 26 8.05 -9.27 -2.5 7.25 -9.27 -2.5 7.5 -7.52 -2.5 8.18 -9.08 -2.5
3 26 8.18 -9.08 -2.5 7.5 -7.52 -2.5 8.3369 -8.9727 -2.5
4 29 8.05 -9.73 -2.5 8.3369 -8.9727 -2.5 8.37 -8.95 -2.5 8.6 -8.9 -2.5
4 29 8.05 -9.73 -2.5 8.6 -8.9 -2.5 8.83 -8.95 -2.5 9.02 -9.08 -2.5
3 29 9.15 -9.27 -2.5 8.05 -9.73 -2.5 9.02 -9.08 -2.5
4 29 8.05 -9.73 -2.5 9.15 -9.27 -2.5 9.2 -9.5 -2.5 9.15 -9.73 -2.5
4 29 8.05 -9.73 -2.5 9.15 -9.73 -2.5 9.02 -9.92 -2.5 8.83 -10.05 -2.5
4 26 8.5 -11.3 -2.5 8.6 -10.1 -2.5 9.8 -10.7 -2.5 9.3 -12.3 -2.5
3 26 9.8 -10.7 -2.5 8.6 -10.1 -2.5 8.83 -10.05 -2.5
3 26 9.8 -10.7 -2.5 8.83 -10.05 -2.5 9.02 -9.92 -2.5
3 26 9.02 -9.92 -2.5 9.15 -9.73 -2.5 9.8 -10.7 -2.5
3 26 9.8 -10.7 -2.5 9.15 -9.73 -2.5 9.2 -9.5 -2.5
3 26 8.3369 -8.9727 -2.5 7.5 -7.52 -2.5 8.37 -8.95 -2.5
4 26 8.6 -8.9 -2.5 8.37 -8.95 -2.5 7.5 -7.52 -2.5 8.7 -7.52 -2.5
3 26 8.83 -8.95 -2.5 8.6 -8.9 -2.5 8.7 -7.52 -2.5
3 26 9.02 -9.08 -2.5 8.83 -8.95 -2.5 8.7 -7.52 -2.5
4 26 .4 -16.6875 -2.5 1.1 -16.6875 -2.5 1.1 -21.6524 -3.7813 .4426 -22.159 -3.912
4 26 -.4 -16.6875 -2.5 -.4447 -22.1574 -3.9116 -1.1 -21.6524 -3.7813 -1.1 -16.6875 -2.5
4 80 -1.1 -21.6524 -3.7813 -1.5308 -21.3205 -3.6956 -1.9 -20.3644 -3.4489 -1.1 -16.6875 -2.5
3 80 -1.1 -16.6875 -2.5 -1.9 -20.3644 -3.4489 -1.9 -16.6875 -2.5
4 80 -.4 -16.6875 -2.5 .4 -16.6875 -2.5 0 -22.5 -4 -.4447 -22.1574 -3.9116
3 80 .4 -16.6875 -2.5 .4426 -22.159 -3.912 0 -22.5 -4
4 80 1.5308 -21.3205 -3.6956 1.1 -21.6524 -3.7813 1.1 -16.6875 -2.5 1.9 -16.6875 -2.5
3 80 1.5308 -21.3205 -3.6956 1.9 -16.6875 -2.5 1.9 -20.3644 -3.4489
4 26 1.9 -20.3644 -3.4489 1.9 -16.6875 -2.5 3.0479 -16.6875 -2.5 2.8284 -17.96 -2.8284
4 26 -1.9 -20.3644 -3.4489 -2.8284 -17.96 -2.8284 -3.0479 -16.6875 -2.5 -1.9 -16.6875 -2.5
3 80 -1.9 -62.3125 -2.5 -1.9 -58.6357 -3.4489 -1.5308 -57.6795 -3.6956
4 80 -1.1 -62.3125 -2.5 -1.9 -62.3125 -2.5 -1.5308 -57.6795 -3.6956 -1.1 -57.3476 -3.7813
3 80 -.4 -62.3125 -2.5 -.4 -56.8082 -3.9205 0 -56.5 -4
4 80 .4 -62.3125 -2.5 -.4 -62.3125 -2.5 0 -56.5 -4 .4 -56.8082 -3.9205
4 80 1.1 -57.3476 -3.7813 1.5308 -57.6795 -3.6956 1.9 -58.6357 -3.4489 1.1 -62.3125 -2.5
3 80 1.1 -62.3125 -2.5 1.9 -58.6357 -3.4489 1.9 -62.3125 -2.5
4 16 3.0479 -62.3125 -2.5 1.9 -62.3125 -2.5 1.9 -58.6357 -3.4489 2.8284 -61.04 -2.8284
4 16 -3.0479 -62.3125 -2.5 -2.8284 -61.04 -2.8284 -1.9 -58.6357 -3.4489 -1.9 -62.3125 -2.5
4 16 -1.1 -57.3476 -3.7813 -.4 -56.8082 -3.9205 -.4 -62.3125 -2.5 -1.1 -62.3125 -2.5
4 16 .4 -56.8082 -3.9205 1.1 -57.3476 -3.7813 1.1 -62.3125 -2.5 .4 -62.3125 -2.5
3 16 -3.0479 -62.3125 -2.5 -3.0479 -61.2959 -2.5 -2.8284 -61.04 -2.8284
3 16 3.0479 -62.3125 -2.5 2.8284 -61.04 -2.8284 3.0479 -61.2959 -2.5
3 26 -3.0479 -23.728 -2.5 -2.8284 -17.96 -2.8284 -2.8284 -23.6653 -2.8284
3 26 -3.0479 -23.728 -2.5 -3.0479 -16.6875 -2.5 -2.8284 -17.96 -2.8284
4 16 -2.8284 -25.2841 -2.8284 -3.0479 -25.7296 -2.5 -3.0479 -23.728 -2.5 -2.8284 -23.6653 -2.8284
4 16 -3.0479 -25.7296 -2.5 -2.8284 -25.2841 -2.8284 -2.8284 -61.04 -2.8284 -3.0479 -61.2959 -2.5
4 26 -1.9 -23.4 -3.4489 -2.8284 -23.6653 -2.8284 -2.8284 -17.96 -2.8284 -1.9 -20.3644 -3.4489
4 80 -1.5308 -21.3205 -3.6956 -1.5308 -23.3077 -3.6956 -1.9 -23.4 -3.4489 -1.9 -20.3644 -3.4489
4 80 -1.9 -23.4 -3.4489 -1.5308 -23.3077 -3.6956 -1.5308 -57.6795 -3.6956 -1.9 -58.6357 -3.4489
3 16 -2.8284 -25.2841 -2.8284 -2.8284 -23.6653 -2.8284 -1.9 -23.4 -3.4489
4 16 -2.8284 -61.04 -2.8284 -2.8284 -25.2841 -2.8284 -1.9 -23.4 -3.4489 -1.9 -58.6357 -3.4489
4 26 -.4447 -22.1574 -3.9116 -.4 -23 -3.9205 -1.1 -23.2 -3.7813 -1.1 -21.6524 -3.7813
4 80 -1.1 -23.2 -3.7813 -1.5308 -23.3077 -3.6956 -1.5308 -21.3205 -3.6956 -1.1 -21.6524 -3.7813
4 80 -1.5308 -57.6795 -3.6956 -1.5308 -23.3077 -3.6956 -1.1 -23.2 -3.7813 -1.1 -57.3476 -3.7813
4 80 -.4 -23 -3.9205 -.4447 -22.1574 -3.9116 0 -22.5 -4 0 -22.85 -4
4 80 -.4 -23 -3.9205 0 -22.85 -4 0 -56.5 -4 -.4 -56.8082 -3.9205
4 16 -1.1 -23.2 -3.7813 -.4 -23 -3.9205 -.4 -56.8082 -3.9205 -1.1 -57.3476 -3.7813
4 26 1.1 -21.6524 -3.7813 1.1 -22.5 -3.7813 .4 -22.7 -3.9205 .4426 -22.159 -3.912
4 80 0 -22.5 -4 .4426 -22.159 -3.912 .4 -22.7 -3.9205 0 -22.85 -4
4 80 0 -56.5 -4 0 -22.85 -4 .4 -22.7 -3.9205 .4 -56.8082 -3.9205
4 80 1.1 -22.5 -3.7813 1.1 -21.6524 -3.7813 1.5308 -21.3205 -3.6956 1.5308 -22.3923 -3.6956
4 80 1.1 -22.5 -3.7813 1.5308 -22.3923 -3.6956 1.5308 -57.6795 -3.6956 1.1 -57.3476 -3.7813
4 16 1.1 -57.3476 -3.7813 .4 -56.8082 -3.9205 .4 -22.7 -3.9205 1.1 -22.5 -3.7813
4 26 2.8284 -17.96 -2.8284 2.8284 -22.0347 -2.8284 1.9 -22.3 -3.4489 1.9 -20.3644 -3.4489
4 80 1.9 -22.3 -3.4489 1.5308 -22.3923 -3.6956 1.5308 -21.3205 -3.6956 1.9 -20.3644 -3.4489
4 80 1.5308 -57.6795 -3.6956 1.5308 -22.3923 -3.6956 1.9 -22.3 -3.4489 1.9 -58.6357 -3.4489
4 16 2.8284 -61.04 -2.8284 1.9 -58.6357 -3.4489 1.9 -22.3 -3.4489 2.8284 -22.8936 -2.8284
3 16 2.8284 -22.8936 -2.8284 1.9 -22.3 -3.4489 2.8284 -22.0347 -2.8284
4 26 3.0479 -16.6875 -2.5 3.0479 -21.972 -2.5 2.8284 -22.0347 -2.8284 2.8284 -17.96 -2.8284
4 16 3.0479 -61.2959 -2.5 2.8284 -61.04 -2.8284 2.8284 -22.8936 -2.8284 3.0479 -23.0339 -2.5
4 16 3.0479 -23.0339 -2.5 2.8284 -22.8936 -2.8284 2.8284 -22.0347 -2.8284 3.0479 -21.972 -2.5
4 16 6.925 -78.072 -2.5 5.339 -79.491 -2.5 3.661 -79.869 -2.5 7.574 -76.049 -2.5
4 16 -5.046 -61.46 -2.5 -5.978 -63.432 -2.5 -6.087 -62.809 -2.5 -5.728 -61.894 -2.5
4 16 7.021 -73.995 -2.5 1.549 -79.162 -2.5 .065 -77.5 -2.5 5.5 -72.5 -2.5
4 16 7.574 -76.049 -2.5 3.661 -79.869 -2.5 1.549 -79.162 -2.5 7.021 -73.995 -2.5
4 16 -3.5 -64 -2.5 -3.5 -65 -2.5 -5.978 -63.432 -2.5 -5.046 -61.46 -2.5
3 16 -3.5 -66 -2.5 -5.978 -63.432 -2.5 -3.5 -65 -2.5
3 16 .065 -77.5 -2.5 0 -74.2 -2.5 1 -74.2 -2.5
3 16 .065 -77.5 -2.5 1 -74.2 -2.5 2 -74.2 -2.5
3 16 .065 -77.5 -2.5 2 -74.2 -2.5 5.5 -72.5 -2.5
3 16 2 -73.2 -2.5 2 -72.2 -2.5 5.5 -72.5 -2.5
3 16 2 -74.2 -2.5 2 -73.2 -2.5 5.5 -72.5 -2.5
4 16 1 -72.2 -2.5 -.75 -70.1 -2.5 .25 -70.1 -2.5 1.1 -71.5 -2.5
4 16 2 -72.2 -2.5 1 -72.2 -2.5 1.1 -71.5 -2.5 1.9 -71.5 -2.5
4 16 0 -72.2 -2.5 -1.75 -70.1 -2.5 -.75 -70.1 -2.5 1 -72.2 -2.5
3 16 0 -73.2 -2.5 -1.75 -70.1 -2.5 0 -72.2 -2.5
3 16 0 -74.2 -2.5 -1.75 -70.1 -2.5 0 -73.2 -2.5
4 16 -1.75 -70.1 -2.5 0 -74.2 -2.5 .065 -77.5 -2.5 -5.978 -63.432 -2.5
4 16 -1.75 -68.1 -2.5 -3.5 -66 -2.5 -2.5 -66 -2.5 -.75 -68.1 -2.5
4 16 -.75 -68.1 -2.5 -2.5 -66 -2.5 -1.5 -66 -2.5 -.4 -67.5 -2.5
4 16 .25 -68.1 -2.5 -.75 -68.1 -2.5 -.4 -67.5 -2.5 .4 -67.5 -2.5
4 16 -1.75 -70.1 -2.5 -5.978 -63.432 -2.5 -3.5 -66 -2.5 -1.75 -69.1 -2.5
3 16 -1.75 -69.1 -2.5 -3.5 -66 -2.5 -1.75 -68.1 -2.5
4 16 .4 -67.5 -2.5 1.1 -71.5 -2.5 .25 -69.1 -2.5 .25 -68.1 -2.5
3 16 1.1 -71.5 -2.5 .25 -70.1 -2.5 .25 -69.1 -2.5
3 16 2 -72.2 -2.5 1.9 -71.5 -2.5 5.5 -72.5 -2.5
4 16 -3.5 -64 -2.5 -5.046 -61.46 -2.5 -3.0479 -62.3125 -2.5 -2.5 -64 -2.5
4 80 -1.1 -62.3125 -2.5 -1.1 -63.5 -2.5 -1.9 -63.5 -2.5 -1.9 -62.3125 -2.5
4 80 -.4 -67.5 -2.5 -.4 -62.3125 -2.5 .4 -62.3125 -2.5 .4 -67.5 -2.5
4 16 -3.0479 -62.3125 -2.5 -1.9 -62.3125 -2.5 -1.9 -63.5 -2.5 -2.5 -64 -2.5
4 16 -2.5 -64 -2.5 -1.9 -63.5 -2.5 -1.1 -63.5 -2.5 -1.5 -64 -2.5
4 16 -1.5 -65 -2.5 -1.5 -64 -2.5 -1.1 -63.5 -2.5 -.4 -67.5 -2.5
4 16 -.4 -62.3125 -2.5 -.4 -67.5 -2.5 -1.1 -63.5 -2.5 -1.1 -62.3125 -2.5
4 16 1.1 -71.5 -2.5 .4 -67.5 -2.5 .4 -62.3125 -2.5 1.1 -62.3125 -2.5
4 16 4.701 -61.43 -2.5 5.27 -61.711 -2.5 3.0479 -62.3125 -2.5 3.0479 -61.2959 -2.5
4 80 1.1 -62.3125 -2.5 1.9 -62.3125 -2.5 1.9 -71.5 -2.5 1.1 -71.5 -2.5
3 16 3.0479 -62.3125 -2.5 5.27 -61.711 -2.5 5.5 -62.302 -2.5
3 16 1.9 -71.5 -2.5 1.9 -62.3125 -2.5 3.0479 -62.3125 -2.5
4 16 5.5 -72.5 -2.5 1.9 -71.5 -2.5 3.0479 -62.3125 -2.5 5.5 -62.302 -2.5
3 16 -.4 -67.5 -2.5 -1.5 -66 -2.5 -1.5 -65 -2.5
3 16 -3.0479 -62.3125 -2.5 -5.046 -61.46 -2.5 -3.0479 -61.2959 -2.5

2 24 -2.8284 -61.04 -2.8284 -1.5308 -57.6795 -3.6956
2 24 -1.5308 -57.6795 -3.6956 0 -56.5 -4
2 24 0 -56.5 -4 1.5308 -57.6795 -3.6956
2 24 1.5308 -57.6795 -3.6956 2.8284 -61.04 -2.8284
2 24 -3.0479 -16.6875 -2.5 -2.8284 -17.96 -2.8284
2 24 -2.8284 -17.96 -2.8284 -1.5308 -21.3205 -3.6956
2 24 -1.5308 -21.3205 -3.6956 0 -22.5 -4
2 24 0 -22.5 -4 1.5308 -21.3205 -3.6956
2 24 1.5308 -21.3205 -3.6956 2.8284 -17.96 -2.8284
2 24 2.8284 -17.96 -2.8284 3.0479 -16.6875 -2.5
2 24 3.0479 -62.3125 -2.5 2.8284 -61.04 -2.8284
2 24 -3.0479 -62.3125 -2.5 -2.8284 -61.04 -2.8284
2 24 -3.0479 -61.2959 -2.5 -3.0479 -62.3125 -2.5
2 24 -3.0479 -62.3125 -2.5 3.0479 -62.3125 -2.5
2 24 3.0479 -62.3125 -2.5 3.0479 -61.2959 -2.5
2 24 3.0479 -23.0339 -2.5 3.0479 -16.6875 -2.5
2 24 -3.0479 -16.6875 -2.5 3.0479 -16.6875 -2.5
2 24 -3.0479 -25.7296 -2.5 -3.0479 -16.6875 -2.5
5 24 -2.8284 -17.96 -2.8284 -2.8284 -61.04 -2.8284 -3.0479 -61.2959 -2.5 -1.5308 -21.3205 -3.6956
5 24 -1.5308 -21.3205 -3.6956 -1.5308 -57.6795 -3.6956 -2.8284 -61.04 -2.8284 0 -22.5 -4
5 24 0 -22.5 -4 0 -56.5 -4 -1.5308 -57.6795 -3.6956 1.5308 -21.3205 -3.6956
5 24 1.5308 -21.3205 -3.6956 1.5308 -57.6795 -3.6956 0 -56.5 -4 2.8284 -17.96 -2.8284
5 24 2.8284 -17.96 -2.8284 2.8284 -61.04 -2.8284 1.5308 -57.6795 -3.6956 3.0479 -23.0339 -2.5
4 16 -5.1 -3.6 -2.5 -6.608928 -2.48 -2.5 -5.785504 -2.139072 -2.5 -4.65 -2.45 -2.5
3 16 -4.65 -2.45 -2.5 -5.785504 -2.139072 -2.5 -4.96208 -1.798144 -2.5
4 16 -4.96208 -1.798144 -2.5 -4.332192 -1.167808 -2.5 4.65 -2.45 -2.5 -4.65 -2.45 -2.5
3 16 4.65 -2.45 -2.5 -4.332192 -1.167808 -2.5 -3.701856 -.53792 -2.5
4 16 -3.701856 -.53792 -2.5 -3.360928 .285504 -2.5 1.74 1.59 -2.5 4.65 -2.45 -2.5
3 16 1.74 1.59 -2.5 -3.360928 .285504 -2.5 -3.02 1.108928 -2.5
3 16 1.74 1.59 -2.5 -3.02 1.108928 -2.5 -3.02 2 -2.5
4 16 -5.1 -3.6 -2.5 -7.5 -3.7 -2.5 -7.5 -2.48 -2.5 -6.608928 -2.48 -2.5
