0 Tile  3 x  2 with Angled End with Dark Bluish Grey "TC" and Cracks Pattern
0 Name: 22385px1.dat
0 Author: Evert-Jan Boer [ejboer]
0 !LDRAW_ORG Part UPDATE 2022-05
0 !LICENSE Redistributable under CCAL version 2.0 : see CAreadme.txt

0 BFC CERTIFY CCW

0 !KEYWORDS Set 10273, Bricklink 22385pb190, Haunted House

0 !HISTORY 2022-09-15 [PTadmin] Official Update 2022-05

1 16 0 0 0 1 0 0 0 1 0 0 0 1 s\22385s01.dat

4 72 -5.05 0 17.6 -4.7 0 17.7 -4.55 0 18 -5.4 0 17.65
3 72 -5.4 0 17.65 -5.55 0 18.15 -5.6 0 17.9
4 72 -4.95 0 18.4 -5.3 0 18.35 -5.55 0 18.15 -5.4 0 17.65
4 72 -4.95 0 18.4 -5.4 0 17.65 -4.55 0 18 -4.7 0 18.35
4 72 -7.2 0 20.3 -7.05 0 20.55 -7 0 20.85 -7.5 0 20.25
3 72 -7.5 0 20.25 -7.8 0 20.85 -7.75 0 20.5
4 72 -7.8 0 20.85 -7.5 0 20.25 -7.25 0 20.95 -7.5 0 20.95
3 72 -7 0 20.85 -7.25 0 20.95 -7.5 0 20.25
4 72 -8.85 0 19.05 -9.55 0 19.5 -9.75 0 19 -9.25 0 18.8
4 72 -9.75 0 18.5 -9.4 0 18.6 -9.25 0 18.8 -9.75 0 19
3 72 -9.4 0 18.25 -9.4 0 18.6 -9.75 0 18.5
3 72 -8.85 0 21.15 -9 0 21.4 -8.9 0 20.85
4 72 -9.4 0 21 -9.15 0 20.85 -8.9 0 20.85 -9 0 21.4
4 72 -9.25 0 21.5 -9.4 0 21.3 -9.4 0 21 -9 0 21.4
4 72 -11.55 0 18.45 -12.05 0 18.35 -13.05 0 17.95 -12 0 17.75
4 72 -13.05 0 18.8 -13.55 0 18.15 -13.05 0 17.95 -12.05 0 18.35
4 72 -13.45 0 19.3 -13.85 0 18.8 -13.55 0 18.15 -13.05 0 18.8
4 72 -13.05 0 18.8 -12.8 0 19.25 -12.95 0 19.75 -13.45 0 19.3
4 72 -12.3 0 19.75 -12.95 0 19.75 -12.8 0 19.25 -12.35 0 19.5
4 72 -14.35 0 18.85 -14.05 0 18.05 -13.55 0 18.15 -13.85 0 18.8
4 72 -14.95 0 18.15 -14.65 0 17.75 -14.05 0 18.05 -14.35 0 18.85
4 72 -14.95 0 18.15 -15.5 0 17.65 -14.45 0 17.05 -14.65 0 17.75
4 72 -15.5 0 17.65 -15.35 0 16.85 -14.75 0 16.1 -14.45 0 17.05
4 72 -15.35 0 16.85 -15.6 0 15.5 -15.35 0 15.05 -14.75 0 16.1
4 72 -15.05 0 19.05 -15.55 0 18.6 -14.95 0 18.15 -14.35 0 18.85
4 72 -15.55 0 18.6 -15.05 0 19.05 -15.4 0 19.55 -15.85 0 19.1
3 72 -15.4 0 19.55 -16 0 19.85 -15.85 0 19.1
3 72 13.75 0 18.2 13.4 0 18.2 14 0 18
4 72 14 0 18 13.4 0 18.2 13.7 0 17.5 13.95 0 17.7
4 72 13.1 0 17.8 13.3 0 17.55 13.7 0 17.5 13.4 0 18.2
3 72 13.1 0 17.8 13.4 0 18.2 13.1 0 18.05
3 72 12.55 0 16.2 12.5 0 16.55 12.15 0 16.45
4 72 12.55 0 16.2 12.15 0 16.45 12.05 0 16.05 12.35 0 15.95
3 72 12.15 0 16.45 11.75 0 16.45 12.05 0 16.05
4 72 12.05 0 16.85 11.7 0 16.75 11.75 0 16.45 12.15 0 16.45
4 72 12.5 0 16.55 12.35 0 16.8 12.05 0 16.85 12.15 0 16.45
3 72 10.5 0 16.75 10.15 0 17.15 10.05 0 16.85
4 72 9.6 0 17.25 9.65 0 16.85 10.05 0 16.85 10.15 0 17.15
4 72 10.05 0 16.85 9.65 0 16.85 9.55 0 16.55 9.95 0 16.55
4 72 10.1 0 16.2 9.95 0 16.55 9.55 0 16.55 9.7 0 16.3
4 72 11.6 0 18.75 11.45 0 19.6 11.05 0 19.35 11.15 0 18.8
3 72 11.15 0 18.8 11.05 0 19.35 10.65 0 19
4 72 9.35 0 18.8 9.65 0 18.9 9.55 0 19.25 9.4 0 19.05
4 72 9.15 0 19.3 9 0 18.95 9.35 0 18.8 9.4 0 19.05
3 72 9.55 0 19.25 9.15 0 19.3 9.4 0 19.05
4 72 -5.5 0 10.4 -6 0 11.05 -6.3 0 10.7 -6 0 10.55
3 72 -6 0 10.55 -6.3 0 10.7 -6.3 0 10.3
4 72 -8.2 0 9.7 -7.9 0 9.2 -7.45 0 9.65 -7.7 0 10
4 72 -7.7 0 10.35 -8.25 0 10.15 -8.2 0 9.7 -7.7 0 10
4 72 -15.45 0 -.1 -15 0 -.7 -14.85 0 -.2 -15.1 0 0
4 72 -15.65 0 -.3 -15.45 0 -.65 -15 0 -.7 -15.45 0 -.1
3 72 -15.1 0 -2.8 -15.6 0 -2.65 -15.6 0 -3.25
4 72 -15.1 0 -2.8 -15.6 0 -3.25 -15.35 0 -3.5 -14.9 0 -3.3
3 72 -15 0 -3.6 -14.9 0 -3.3 -15.35 0 -3.5
4 72 -13.55 0 -2.45 -13.3 0 -2.6 -13 0 -2.5 -13.1 0 -2.05
3 72 -13.1 0 -2.05 -13.5 0 -2.05 -13.55 0 -2.45
4 72 7.85 0 -14.2 8.35 0 -14.65 9.2 0 -14.55 8.9 0 -13.8
4 72 6.7 0 -15.05 7.4 0 -15.3 8.35 0 -14.65 7.85 0 -14.2
4 72 6 0 -16.15 6.95 0 -16.15 7.4 0 -15.3 6.7 0 -15.05
4 72 5.6 0 -16.8 6.8 0 -17.2 6.95 0 -16.15 6 0 -16.15
4 72 5.6 0 -16.8 5.6 0 -17.55 5.8 0 -18.15 6.8 0 -17.2
4 72 14.75 0 -6.65 14.95 0 -7.5 15.35 0 -7.1 15.2 0 -6.65
4 72 14.35 0 -7.05 14.6 0 -7.5 14.95 0 -7.5 14.75 0 -6.65
4 72 11.7 0 -9.6 11.95 0 -9.45 12 0 -9.05 11.7 0 -8.95
4 72 11.45 0 -9.1 11.45 0 -9.45 11.7 0 -9.6 11.7 0 -8.95
3 72 12.35 0 -7.65 12.2 0 -7.35 12.15 0 -7.9
4 72 11.65 0 -7.6 11.85 0 -7.85 12.15 0 -7.9 12.2 0 -7.35
4 72 12.2 0 -7.35 11.85 0 -7.2 11.6 0 -7.25 11.65 0 -7.6
3 72 13.8 0 -5.7 13.9 0 -5.35 13.55 0 -5.75
4 72 13.5 0 -5.2 13.35 0 -5.45 13.55 0 -5.75 13.9 0 -5.35
4 72 14 0 -5.1 13.75 0 -5 13.5 0 -5.2 13.9 0 -5.35
3 72 10.1117 0 -14.2331 9.7 0 -13.95 9.5882 0 -14.757
4 72 9.5882 0 -14.757 9.7 0 -13.95 8.9 0 -13.8 9.2 0 -14.55
4 72 5.8 0 -18.15 6.045 0 -18.3031 6.9489 0 -17.3985 6.8 0 -17.2
3 72 15.45 0 11.25 15.2 0 11.5 14.85 0 11.4
4 72 15.45 0 11.25 14.85 0 11.4 14.55 0 10.75 15.2 0 10.55
4 72 14.1 0 10.4 14.65 0 10 15.2 0 10.55 14.55 0 10.75
4 72 14.65 0 10 14.1 0 10.4 13.35 0 10.15 13.6 0 9.65
4 72 13.6 0 9.65 13.35 0 10.15 12.25 0 9.95 12.4 0 9.4
4 72 12.4 0 9.4 12.25 0 9.95 11.3 0 9.85 11.5 0 9.25
4 72 10.6 0 9.9 10.7 0 9.25 11.5 0 9.25 11.3 0 9.85
4 72 10.7 0 9.25 10.6 0 9.9 9.7 0 9.6 10.2 0 9.35
4 72 9.4 0 10.35 9.7 0 9.6 10.6 0 9.9 10.1 0 10.1
4 72 12.8 0 14.6 13 0 13.9 13.35 0 14.2 13.3 0 14.55
4 72 12.1 0 14.6 12.25 0 13.95 13 0 13.9 12.8 0 14.6
4 72 12.25 0 13.95 12.1 0 14.6 11.5 0 14.45 11.75 0 13.8
4 72 11.5 0 14.45 10.95 0 14.1 11.35 0 13.5 11.75 0 13.8
4 72 10.95 0 14.1 10.45 0 13.55 11.1 0 13.15 11.35 0 13.5
4 72 10.85 0 12.25 11.1 0 13.15 10.45 0 13.55 10.25 0 12.8
4 72 10.25 0 12.8 10.05 0 11.85 10.7 0 11.5 10.85 0 12.25
4 72 9.8 0 11.05 10.5 0 10.85 10.7 0 11.5 10.05 0 11.85
4 72 10.5 0 10.85 9.8 0 11.05 9.4 0 10.35 10.1 0 10.1
4 72 8.7 0 9.65 9 0 9 9.7 0 9.6 9.4 0 10.35
4 72 9 0 9 8.7 0 9.65 7.6 0 8.95 8 0 8.45
4 72 8 0 8.45 7.6 0 8.95 6.35 0 8.35 6.75 0 7.9
4 72 6.75 0 7.9 6.35 0 8.35 5.1 0 7.75 5.4 0 7.2
4 72 4.05 0 6.35 5.4 0 7.2 5.1 0 7.75 3.55 0 6.85
3 72 4.05 0 6.35 3.55 0 6.85 3.3 0 5.65
3 72 4.1 0 8.7 3.55 0 9 3.8 0 8.1
4 72 3.55 0 6.85 3.8 0 8.1 3.55 0 9 2.95 0 8.8
4 72 3.55 0 6.85 2.95 0 8.8 -.15 0 7.2 3.3 0 5.65
4 72 -.3 0 9.05 -.15 0 7.2 2.95 0 8.8 2.5 0 9
4 72 -.65 0 10.2 -.3 0 9.05 2.5 0 9 2.2 0 9.6
4 72 2.2 0 9.6 1.9 0 11.1 -1.55 0 11.05 -.65 0 10.2
4 72 1.9 0 11.1 1.35 0 12.45 -1.3 0 12.4 -1.55 0 11.05
3 72 1.35 0 12.45 .4 0 13.55 -1.3 0 12.4
4 72 -1.4 0 14.7 -2.2 0 13.2 -1.3 0 12.4 .4 0 13.55
4 72 -3.35 0 15.3 -3 0 13.7 -2.2 0 13.2 -1.4 0 14.7
4 72 -5.05 0 15.35 -4.55 0 14.1 -3 0 13.7 -3.35 0 15.3
4 72 -7.05 0 14.9 -6.35 0 14.05 -4.55 0 14.1 -5.05 0 15.35
4 72 -9.05 0 14 -8 0 13.65 -6.35 0 14.05 -7.05 0 14.9
4 72 -10.35 0 13.25 -9.4 0 12.95 -8 0 13.65 -9.05 0 14
4 72 -11.25 0 12.25 -10.3 0 12.15 -9.4 0 12.95 -10.35 0 13.25
4 72 -2.65 0 13.1 -3 0 11.9 -1.55 0 11.05 -1.3 0 12.4
4 72 -4.1 0 13.55 -4.35 0 12.45 -3 0 11.9 -2.65 0 13.1
4 72 -5.65 0 13.65 -5.55 0 12.6 -4.35 0 12.45 -4.1 0 13.55
4 72 -6.9 0 12.45 -5.55 0 12.6 -5.65 0 13.65 -6.9 0 13.5
4 72 -6.9 0 13.5 -7.85 0 13.2 -7.5 0 12 -6.9 0 12.45
4 72 -8.25 0 11.85 -7.5 0 12 -7.85 0 13.2 -8.75 0 12.8
3 72 -8 0 11.6 -7.5 0 12 -8.25 0 11.85
4 72 -7.5 0 12 -8 0 11.6 -7.6 0 11.45 -7.45 0 11.7
4 72 -8.75 0 12.8 -9.55 0 12.35 -9 0 11.55 -8.25 0 11.85
4 72 -9.45 0 11.2 -9 0 11.55 -9.55 0 12.35 -10.05 0 12
4 72 -9.45 0 11.2 -10.05 0 12 -10.3 0 12.15 -10.25 0 10.95
3 72 -9.95 0 10.5 -9.45 0 11.2 -10.25 0 10.95
3 72 -10.3 0 12.15 -11.25 0 12.25 -10.25 0 10.95
4 72 -10.85 0 10.7 -10.25 0 10.95 -11.25 0 12.25 -11.5 0 11.75
4 72 -11.6 0 11.2 -11.35 0 10.8 -10.85 0 10.7 -11.5 0 11.75
4 72 2.85 0 4.15 3.3 0 5.65 -.15 0 7.2 -.25 0 5.3
4 72 -.25 0 5.3 -.7 0 3.75 2.55 0 2.55 2.85 0 4.15
4 72 2.35 0 1.25 2.55 0 2.55 -.7 0 3.75 -1.6 0 2.25
4 72 -1.25 0 0 -1.05 0 -.95 2.1 0 -.8 2.35 0 1.25
3 72 -1.25 0 0 2.35 0 1.25 -1.25 0 .25
4 72 -1.6 0 2.25 -1.55 0 .4 -1.25 0 .25 2.35 0 1.25
4 72 -1.55 0 .4 -1.6 0 2.25 -2.85 0 1.15 -1.85 0 .15
4 72 -1.85 0 .15 -2.85 0 1.15 -4.15 0 .25 -2.7 0 -.7
4 72 -2.7 0 -.7 -4.15 0 .25 -5.25 0 -.15 -4.05 0 -1.65
3 72 -4.05 0 -1.65 -5.25 0 -.15 -5.55 0 -2.2
4 72 -5.25 0 -.15 -6.4 0 -.25 -7.1 0 -2.3 -5.55 0 -2.2
4 72 -9.75 0 -1.9 -8.4 0 -2.2 -7.1 0 -2.3 -6.4 0 -.25
3 72 -6.4 0 -.25 -7.95 0 0 -9.75 0 -1.9
4 72 -9.05 0 .45 -11 0 -1.25 -9.75 0 -1.9 -7.95 0 0
4 72 -9.95 0 1.25 -11.55 0 -.8 -11 0 -1.25 -9.05 0 .45
4 72 -13.15 0 1.35 -12.05 0 -.45 -11.55 0 -.8 -9.95 0 1.25
4 72 -12.95 0 2.35 -13.15 0 1.35 -9.95 0 1.25 -10.2 0 1.8
4 72 -12.55 0 3.35 -12.95 0 2.35 -10.2 0 1.8 -10.3 0 2.45
3 72 -10.25 0 3.05 -12.55 0 3.35 -10.3 0 2.45
4 72 -12.55 0 3.35 -10.25 0 3.05 -10.3 0 4.25 -12.05 0 4.3
4 72 -11.15 0 5.35 -12.05 0 4.3 -10.3 0 4.25 -10.4 0 4.55
4 72 -10.4 0 4.55 -9.8 0 4.75 -10.3 0 6.15 -11.15 0 5.35
4 72 -8.55 0 5.15 -10.3 0 6.15 -9.8 0 4.75 -9.15 0 4.9
4 72 -10.3 0 6.15 -8.55 0 5.15 -8.5 0 6.95 -9.45 0 6.6
4 72 -8.55 0 5.15 -8.3 0 5 -7.7 0 7.05 -8.5 0 6.95
3 72 -7.15 0 6.9 -7.7 0 7.05 -8.3 0 5
4 72 -6.8 0 5.9 -6.85 0 6.45 -7.15 0 6.9 -8.3 0 5
3 72 -7 0 4.95 -6.8 0 5.9 -8.3 0 5
4 72 -7 0 4.95 -8.3 0 5 -8.45 0 4.75 -7.55 0 4.3
4 72 -8.85 0 4.6 -8.3 0 3.75 -7.55 0 4.3 -8.45 0 4.75
4 72 -9.5 0 4.5 -9.05 0 3.65 -8.3 0 3.75 -8.85 0 4.6
4 72 -10.3 0 4.25 -9.75 0 3.45 -9.05 0 3.65 -9.5 0 4.5
3 72 -9.75 0 3.45 -10.3 0 4.25 -10.05 0 3.3
3 72 -10.05 0 3.3 -10.3 0 4.25 -10.25 0 3.05
4 72 -13.05 0 -.7 -12.05 0 -.45 -13.15 0 1.35 -13.2 0 .35
4 72 -11.75 0 -1 -12.05 0 -.45 -13.05 0 -.7 -12.65 0 -1.5
4 72 -11.1 0 -1.7 -11.75 0 -1 -12.65 0 -1.5 -12.05 0 -2.25
3 72 -11.3 0 -2.95 -11.1 0 -1.7 -12.05 0 -2.25
4 72 -11.1 0 -1.7 -11.3 0 -2.95 -10 0 -2.7 -10.4 0 -2.2
4 72 -11.3 0 -2.95 -10.7 0 -3.25 -10.35 0 -3.3 -10 0 -2.7
4 72 -10 0 -3.25 -9.95 0 -2.95 -10 0 -2.7 -10.35 0 -3.3
3 72 -1.05 0 -.95 -1.25 0 0 -1.75 0 -.5
4 72 -2.85 0 -1.45 -1.75 0 -1.65 -1.05 0 -.95 -1.75 0 -.5
4 72 -3.9 0 -2.05 -3.05 0 -2.65 -1.75 0 -1.65 -2.85 0 -1.45
4 72 -5.2 0 -2.55 -4.65 0 -3.4 -3.05 0 -2.65 -3.9 0 -2.05
4 72 -6.65 0 -2.9 -6.35 0 -3.9 -4.65 0 -3.4 -5.2 0 -2.55
4 72 -6.35 0 -3.9 -6.65 0 -2.9 -7.8 0 -2.95 -7.45 0 -4
4 72 -8.85 0 -3.8 -8.2 0 -3.95 -7.45 0 -4 -7.8 0 -2.95
4 72 -9.55 0 -3.4 -8.85 0 -3.8 -7.8 0 -2.95 -9.4 0 -2.65
4 72 -9.9 0 -4 -9.35 0 -4.35 -8.85 0 -3.8 -9.55 0 -3.4
4 72 -10.35 0 -4.35 -10.05 0 -4.9 -9.35 0 -4.35 -9.9 0 -4
4 72 -11.1 0 -4.85 -10.4 0 -5.35 -10.05 0 -4.9 -10.35 0 -4.35
3 72 -11.1 0 -4.85 -10.35 0 -4.35 -11.1 0 -4.45
4 72 -11.1 0 -4.85 -11.1 0 -4.45 -11.85 0 -4.75 -11.65 0 -4.95
3 72 -11.65 0 -4.95 -11.85 0 -4.75 -12.4 0 -5.15
4 72 -11.1 0 -4.85 -11.05 0 -5.4 -10.5 0 -5.9 -10.4 0 -5.35
4 72 -11.2 0 -6.05 -10.75 0 -6.3 -10.5 0 -5.9 -11.05 0 -5.4
4 72 -11.45 0 -6.45 -11.2 0 -6.65 -10.75 0 -6.3 -11.2 0 -6.05
3 72 -11.2 0 -6.65 -11.45 0 -6.45 -11.75 0 -7.1
4 72 -1.05 0 -.95 -1.05 0 -2.45 1.75 0 -3.4 2.1 0 -.8
4 72 1.45 0 -5.15 1.75 0 -3.4 -1.05 0 -2.45 -1.25 0 -4.1
4 72 1.15 0 -6.6 1.45 0 -5.15 -1.25 0 -4.1 -1.9 0 -6.75
4 72 2.1 0 -.8 2.5 0 -1 2.9 0 -1 2.35 0 1.25
3 72 3.25 0 -.65 2.35 0 1.25 2.9 0 -1
4 72 3.25 0 -.65 3.75 0 -.05 2.9 0 1.8 2.35 0 1.25
4 72 3.75 0 -.05 4.55 0 .65 4.55 0 2 2.9 0 1.8
3 72 4.55 0 2 3.85 0 2.85 2.9 0 1.8
4 72 4.55 0 2 5.2 0 2.65 4.95 0 3.85 3.85 0 2.85
4 72 5.2 0 2.65 6.35 0 3.2 6.25 0 4.65 4.95 0 3.85
4 72 6.35 0 3.2 7.25 0 3.4 7.45 0 5.1 6.25 0 4.65
4 72 8.15 0 3.5 8.45 0 5.1 7.45 0 5.1 7.25 0 3.4
4 72 9.1 0 3.3 9.7 0 4.95 8.45 0 5.1 8.15 0 3.5
4 72 10.3 0 2.8 11.3 0 4.45 9.7 0 4.95 9.1 0 3.3
4 72 11.3 0 4.45 10.3 0 2.8 11.45 0 2.05 12.75 0 3.6
4 72 12.2 0 1.3 13.65 0 2.45 12.75 0 3.6 11.45 0 2.05
4 72 12.7 0 .35 14.15 0 1.1 13.65 0 2.45 12.2 0 1.3
4 72 12.9 0 -.8 14.25 0 -.3 14.15 0 1.1 12.7 0 .35
4 72 12.85 0 -1.55 14.15 0 -1.5 14.25 0 -.3 12.9 0 -.8
4 72 12.65 0 -2.4 13.85 0 -2.75 14.15 0 -1.5 12.85 0 -1.55
4 72 13.85 0 -2.75 12.65 0 -2.4 12.2 0 -3.35 13.25 0 -3.9
3 72 13.25 0 -3.9 12.2 0 -3.35 12.35 0 -5.15
4 72 12.2 0 -3.35 11.45 0 -4.15 11.15 0 -6.6 12.35 0 -5.15
4 72 11.45 0 -4.15 11 0 -4.45 9.75 0 -7.1 11.15 0 -6.6
4 72 10.15 0 -4.35 9.4 0 -6.8 9.75 0 -7.1 11 0 -4.45
4 72 10.85 0 -3.45 10.15 0 -4.35 11 0 -4.45 11.5 0 -3.8
4 72 11.3 0 -2.5 10.85 0 -3.45 11.5 0 -3.8 11.9 0 -2.95
4 72 11.6 0 -1.55 11.3 0 -2.5 11.9 0 -2.95 12.3 0 -1.9
4 72 11.55 0 -.9 11.6 0 -1.55 12.3 0 -1.9 12.35 0 -.85
4 72 11.25 0 -.1 11.55 0 -.9 12.35 0 -.85 12.15 0 -.1
4 72 12.15 0 -.1 11.65 0 1.05 10.45 0 .7 11.25 0 -.1
3 72 11.65 0 1.05 10.85 0 1.85 10.45 0 .7
4 72 9.55 0 2.5 9.45 0 1.35 10.45 0 .7 10.85 0 1.85
4 72 7.95 0 2.8 8.05 0 1.75 9.45 0 1.35 9.55 0 2.5
4 72 6.75 0 2.8 6.95 0 1.85 8.05 0 1.75 7.95 0 2.8
4 72 6.95 0 1.85 6.75 0 2.8 5.85 0 2.65 6.15 0 1.65
4 72 6.15 0 1.65 5.85 0 2.65 5.05 0 2.3 5.3 0 1.3
4 72 5.3 0 1.3 5.05 0 2.3 4.55 0 2 4.55 0 .65
3 72 9.4 0 -6.8 10.15 0 -4.35 9.15 0 -5.4
4 72 9.4 0 -6.8 9.15 0 -5.4 7.85 0 -6.25 8.3 0 -7.5
4 72 6.2 0 -7 6.65 0 -8.35 8.3 0 -7.5 7.85 0 -6.25
4 72 4.8 0 -7.25 4.85 0 -8.9 6.65 0 -8.35 6.2 0 -7
4 72 2.95 0 -7.2 3.25 0 -9.1 4.85 0 -8.9 4.8 0 -7.25
4 72 1.8 0 -7.05 1.35 0 -9 3.25 0 -9.1 2.95 0 -7.2
4 72 1.35 0 -6.9 -.45 0 -8.9 1.35 0 -9 1.8 0 -7.05
4 72 -.45 0 -8.9 1.35 0 -6.9 1.15 0 -6.6 -1.9 0 -6.75
4 72 11.15 0 -6.6 9.75 0 -7.1 9 0 -7.75 9.55 0 -8.3
4 72 9.55 0 -8.3 9 0 -7.75 7.3 0 -8.8 7.85 0 -9.45
4 72 5.5 0 -9.6 5.85 0 -10.35 7.85 0 -9.45 7.3 0 -8.8
4 72 3.85 0 -9.9 4.15 0 -10.8 5.85 0 -10.35 5.5 0 -9.6
4 72 2.25 0 -9.9 3 0 -10.9 4.15 0 -10.8 3.85 0 -9.9
3 72 3 0 -10.9 2.25 0 -9.9 1.55 0 -10.8
4 72 .1 0 -9.65 .15 0 -10.6 1.55 0 -10.8 2.25 0 -9.9
4 72 -2.4 0 -9.35 -1.8 0 -10.4 .15 0 -10.6 .1 0 -9.65
4 72 -4.75 0 -9.2 -3.85 0 -10.15 -1.8 0 -10.4 -2.4 0 -9.35
4 72 -6.5 0 -9.2 -5.85 0 -10.05 -3.85 0 -10.15 -4.75 0 -9.2
4 72 -5.85 0 -10.05 -6.5 0 -9.2 -7.8 0 -9.4 -7.45 0 -10.25
4 72 -8.25 0 -10.5 -7.45 0 -10.25 -7.8 0 -9.4 -8.45 0 -9.7
4 72 -8.25 0 -10.5 -8.45 0 -9.7 -9.2 0 -10.5 -8.75 0 -10.6
3 72 -9.2 0 -10.5 -8.45 0 -9.7 -9.5 0 -10.1
4 72 -9.55 0 -9.65 -9.5 0 -10.1 -8.45 0 -9.7 -8.65 0 -9.6
4 72 -9.5 0 -9.15 -9.55 0 -9.65 -8.65 0 -9.6 -8.7 0 -9.35
4 72 -9.2 0 -8.55 -9.5 0 -9.15 -8.7 0 -9.35 -8.6 0 -9.05
4 72 -8.75 0 -7.9 -9.2 0 -8.55 -8.6 0 -9.05 -8.35 0 -8.85
4 72 -8.35 0 -8.85 -7.8 0 -8.7 -8.4 0 -7.5 -8.75 0 -7.9
4 72 -7.8 0 -8.7 -6.7 0 -8.6 -7.65 0 -7.05 -8.4 0 -7.5
4 72 -5.1 0 -8.6 -6.1 0 -6.6 -7.65 0 -7.05 -6.7 0 -8.6
4 72 -3.35 0 -8.7 -4.3 0 -6.5 -6.1 0 -6.6 -5.1 0 -8.6
4 72 -1.75 0 -8.8 -2.75 0 -6.65 -4.3 0 -6.5 -3.35 0 -8.7
4 72 -.45 0 -8.9 -1.9 0 -6.75 -2.75 0 -6.65 -1.75 0 -8.8
3 16 16 0 -8.34 15.35 0 -7.1 14.95 0 -7.5
3 16 6.045 0 -18.3031 5.8 0 -18.15 0 0 -24.353
4 16 -11.1 0 -4.85 -11.65 0 -4.95 -11.2 0 -6.05 -11.05 0 -5.4
4 16 -11.65 0 -4.95 -12.4 0 -5.15 -11.45 0 -6.45 -11.2 0 -6.05
3 16 -11.45 0 -6.45 -12.4 0 -5.15 -11.75 0 -7.1
4 16 9.55 0 19.25 11.05 0 19.35 11.45 0 19.6 16 0 30
3 16 9.55 0 19.25 16 0 30 9.15 0 19.3
3 16 -9.25 0 21.5 -16 0 30 -9.4 0 21.3
4 16 -12.95 0 19.75 -12.3 0 19.75 -9.4 0 21.3 -16 0 30
4 16 -15.4 0 19.55 -12.95 0 19.75 -16 0 30 -16 0 19.85
4 16 -15.05 0 19.05 -13.45 0 19.3 -12.95 0 19.75 -15.4 0 19.55
4 16 -13.85 0 18.8 -13.45 0 19.3 -15.05 0 19.05 -14.35 0 18.85
4 16 9.5882 0 -14.757 9.2 0 -14.55 6.8 0 -17.2 6.9489 0 -17.3985
3 16 6.8 0 -17.2 9.2 0 -14.55 8.35 0 -14.65
4 16 6.8 0 -17.2 8.35 0 -14.65 7.4 0 -15.3 6.95 0 -16.15
4 16 11.7 0 -9.6 10.1117 0 -14.2331 16 0 -8.34 11.95 0 -9.45
3 16 10.1117 0 -14.2331 11.7 0 -9.6 9.7 0 -13.95
4 16 8.9 0 -13.8 9.7 0 -13.95 11.7 0 -9.6 11.45 0 -9.45
4 16 11.45 0 -9.1 9.55 0 -8.3 8.9 0 -13.8 11.45 0 -9.45
4 16 11.85 0 -7.85 11.7 0 -8.95 12 0 -9.05 12.15 0 -7.9
4 16 11.45 0 -9.1 11.7 0 -8.95 11.85 0 -7.85 11.65 0 -7.6
4 16 11.6 0 -7.25 9.55 0 -8.3 11.45 0 -9.1 11.65 0 -7.6
3 16 11.6 0 -7.25 11.15 0 -6.6 9.55 0 -8.3
3 16 14.95 0 -7.5 14.6 0 -7.5 16 0 -8.34
4 16 12 0 -9.05 11.95 0 -9.45 16 0 -8.34 14.6 0 -7.5
4 16 12.35 0 -7.65 12.15 0 -7.9 12 0 -9.05 14.6 0 -7.5
3 16 14.6 0 -7.5 14.35 0 -7.05 12.35 0 -7.65
4 16 13.55 0 -5.75 12.2 0 -7.35 12.35 0 -7.65 14.35 0 -7.05
4 16 13.35 0 -5.45 11.85 0 -7.2 12.2 0 -7.35 13.55 0 -5.75
4 16 13.35 0 -5.45 12.35 0 -5.15 11.6 0 -7.25 11.85 0 -7.2
3 16 11.6 0 -7.25 12.35 0 -5.15 11.15 0 -6.6
4 16 13.8 0 -5.7 13.55 0 -5.75 14.35 0 -7.05 14.75 0 -6.65
4 16 14.75 0 -6.65 15.2 0 -6.65 13.9 0 -5.35 13.8 0 -5.7
3 16 15.2 0 -6.65 14 0 -5.1 13.9 0 -5.35
4 16 13.35 0 -5.45 13.5 0 -5.2 13.25 0 -3.9 12.35 0 -5.15
3 16 13.75 0 -5 13.25 0 -3.9 13.5 0 -5.2
4 16 13.75 0 -5 14 0 -5.1 13.85 0 -2.75 13.25 0 -3.9
4 16 14 0 -5.1 15.2 0 -6.65 14.15 0 -1.5 13.85 0 -2.75
4 16 13.65 0 2.45 14.65 0 10 13.6 0 9.65 12.75 0 3.6
4 16 15.2 0 10.55 14.65 0 10 13.65 0 2.45 14.15 0 1.1
4 16 14.15 0 1.1 14.25 0 -.3 15.45 0 11.25 15.2 0 10.55
4 16 15.45 0 11.25 14.25 0 -.3 14.15 0 -1.5 15.2 0 -6.65
3 16 15.35 0 -7.1 15.45 0 11.25 15.2 0 -6.65
4 16 15.35 0 -7.1 16 0 -8.34 16 0 30 15.45 0 11.25
3 16 11.45 0 -4.15 11.5 0 -3.8 11 0 -4.45
4 16 11.5 0 -3.8 11.45 0 -4.15 12.2 0 -3.35 11.9 0 -2.95
4 16 11.9 0 -2.95 12.2 0 -3.35 12.65 0 -2.4 12.3 0 -1.9
3 16 12.65 0 -2.4 12.85 0 -1.55 12.3 0 -1.9
4 16 12.3 0 -1.9 12.85 0 -1.55 12.9 0 -.8 12.35 0 -.85
4 16 12.9 0 -.8 12.7 0 .35 12.15 0 -.1 12.35 0 -.85
4 16 12.7 0 .35 12.2 0 1.3 11.65 0 1.05 12.15 0 -.1
4 16 12.2 0 1.3 11.45 0 2.05 10.85 0 1.85 11.65 0 1.05
4 16 10.85 0 1.85 11.45 0 2.05 10.3 0 2.8 9.55 0 2.5
3 16 10.3 0 2.8 9.1 0 3.3 9.55 0 2.5
4 16 8.15 0 3.5 7.95 0 2.8 9.55 0 2.5 9.1 0 3.3
4 16 6.75 0 2.8 7.95 0 2.8 8.15 0 3.5 7.25 0 3.4
3 16 6.75 0 2.8 7.25 0 3.4 6.35 0 3.2
4 16 6.75 0 2.8 6.35 0 3.2 5.2 0 2.65 5.85 0 2.65
3 16 5.85 0 2.65 5.2 0 2.65 5.05 0 2.3
3 16 5.05 0 2.3 5.2 0 2.65 4.55 0 2
4 16 9.75 0 -7.1 9.4 0 -6.8 8.3 0 -7.5 9 0 -7.75
4 16 9 0 -7.75 8.3 0 -7.5 6.65 0 -8.35 7.3 0 -8.8
4 16 7.3 0 -8.8 6.65 0 -8.35 4.85 0 -8.9 5.5 0 -9.6
4 16 5.5 0 -9.6 4.85 0 -8.9 3.25 0 -9.1 3.85 0 -9.9
4 16 1.35 0 -9 2.25 0 -9.9 3.85 0 -9.9 3.25 0 -9.1
4 16 -.45 0 -8.9 .1 0 -9.65 2.25 0 -9.9 1.35 0 -9
4 16 -.45 0 -8.9 -1.75 0 -8.8 -2.4 0 -9.35 .1 0 -9.65
3 16 -1.75 0 -8.8 -3.35 0 -8.7 -2.4 0 -9.35
4 16 -5.1 0 -8.6 -4.75 0 -9.2 -2.4 0 -9.35 -3.35 0 -8.7
4 16 -6.5 0 -9.2 -4.75 0 -9.2 -5.1 0 -8.6 -6.7 0 -8.6
4 16 -7.8 0 -9.4 -6.5 0 -9.2 -6.7 0 -8.6 -7.8 0 -8.7
4 16 -7.8 0 -8.7 -8.35 0 -8.85 -8.6 0 -9.05 -7.8 0 -9.4
4 16 -8.45 0 -9.7 -7.8 0 -9.4 -8.6 0 -9.05 -8.7 0 -9.35
3 16 -8.45 0 -9.7 -8.7 0 -9.35 -8.65 0 -9.6
4 16 12.8 0 14.6 13.3 0 14.55 12.55 0 16.2 12.35 0 15.95
4 16 12.05 0 16.05 12.1 0 14.6 12.8 0 14.6 12.35 0 15.95
4 16 11.75 0 16.45 11.5 0 14.45 12.1 0 14.6 12.05 0 16.05
4 16 11.75 0 16.45 10.1 0 16.2 10.95 0 14.1 11.5 0 14.45
4 16 10.05 0 16.85 9.95 0 16.55 10.1 0 16.2 10.5 0 16.75
4 16 11.7 0 16.75 10.5 0 16.75 10.1 0 16.2 11.75 0 16.45
4 16 11.15 0 18.8 10.5 0 16.75 11.7 0 16.75 11.6 0 18.75
3 16 10.5 0 16.75 11.15 0 18.8 10.15 0 17.15
4 16 9.6 0 17.25 10.15 0 17.15 11.15 0 18.8 10.65 0 19
4 16 9.35 0 18.8 9.6 0 17.25 10.65 0 19 9.65 0 18.9
4 16 9.65 0 18.9 10.65 0 19 11.05 0 19.35 9.55 0 19.25
4 16 12.35 0 16.8 12.5 0 16.55 13.3 0 17.55 13.1 0 17.8
4 16 13.1 0 18.05 11.6 0 18.75 12.35 0 16.8 13.1 0 17.8
3 16 12.35 0 16.8 11.6 0 18.75 12.05 0 16.85
3 16 12.05 0 16.85 11.6 0 18.75 11.7 0 16.75
4 16 13.7 0 17.5 13.3 0 17.55 12.5 0 16.55 12.55 0 16.2
3 16 13.3 0 14.55 13.7 0 17.5 12.55 0 16.2
4 16 14.85 0 11.4 13.7 0 17.5 13.3 0 14.55 13.35 0 14.2
4 16 14.85 0 11.4 15.2 0 11.5 13.95 0 17.7 13.7 0 17.5
4 16 15.2 0 11.5 15.45 0 11.25 14 0 18 13.95 0 17.7
4 16 13.35 0 14.2 13 0 13.9 14.55 0 10.75 14.85 0 11.4
4 16 14.55 0 10.75 13 0 13.9 13.35 0 10.15 14.1 0 10.4
4 16 11.75 0 13.8 13.35 0 10.15 13 0 13.9 12.25 0 13.95
3 16 13.35 0 10.15 11.75 0 13.8 11.35 0 13.5
4 16 10.85 0 12.25 13.35 0 10.15 11.35 0 13.5 11.1 0 13.15
4 16 13.35 0 10.15 10.85 0 12.25 10.7 0 11.5 12.25 0 9.95
4 16 12.25 0 9.95 10.7 0 11.5 10.5 0 10.85 11.3 0 9.85
4 16 11.3 0 9.85 10.5 0 10.85 10.1 0 10.1 10.6 0 9.9
4 16 11.3 0 4.45 12.75 0 3.6 13.6 0 9.65 12.4 0 9.4
3 16 11.3 0 4.45 12.4 0 9.4 11.5 0 9.25
4 16 10.7 0 9.25 9.7 0 4.95 11.3 0 4.45 11.5 0 9.25
3 16 10.7 0 9.25 10.2 0 9.35 9.7 0 4.95
4 16 10.2 0 9.35 9.7 0 9.6 9 0 9 9.7 0 4.95
4 16 9.7 0 4.95 9 0 9 8 0 8.45 8.45 0 5.1
3 16 8.45 0 5.1 8 0 8.45 7.45 0 5.1
4 16 5.4 0 7.2 7.45 0 5.1 8 0 8.45 6.75 0 7.9
3 16 7.45 0 5.1 5.4 0 7.2 6.25 0 4.65
4 16 4.95 0 3.85 6.25 0 4.65 5.4 0 7.2 4.05 0 6.35
4 16 2.85 0 4.15 4.95 0 3.85 4.05 0 6.35 3.3 0 5.65
3 16 4.95 0 3.85 2.85 0 4.15 3.85 0 2.85
4 16 2.85 0 4.15 2.55 0 2.55 2.9 0 1.8 3.85 0 2.85
3 16 2.9 0 1.8 2.55 0 2.55 2.35 0 1.25
3 16 11.6 0 18.75 16 0 30 11.45 0 19.6
4 16 13.4 0 18.2 16 0 30 11.6 0 18.75 13.1 0 18.05
3 16 13.75 0 18.2 16 0 30 13.4 0 18.2
3 16 14 0 18 16 0 30 13.75 0 18.2
3 16 15.45 0 11.25 16 0 30 14 0 18
4 16 9.7 0 16.3 10.45 0 13.55 10.95 0 14.1 10.1 0 16.2
4 16 10.25 0 12.8 10.45 0 13.55 9.7 0 16.3 1.35 0 12.45
4 16 10.25 0 12.8 1.35 0 12.45 9.8 0 11.05 10.05 0 11.85
4 16 9.4 0 10.35 9.8 0 11.05 1.35 0 12.45 1.9 0 11.1
3 16 9.4 0 10.35 1.9 0 11.1 8.7 0 9.65
4 16 8.7 0 9.65 1.9 0 11.1 6.35 0 8.35 7.6 0 8.95
4 16 4.1 0 8.7 6.35 0 8.35 1.9 0 11.1 3.55 0 9
3 16 3.55 0 9 2.5 0 9 2.95 0 8.8
4 16 2.5 0 9 3.55 0 9 1.9 0 11.1 2.2 0 9.6
3 16 6.35 0 8.35 4.1 0 8.7 5.1 0 7.75
4 16 3.55 0 6.85 5.1 0 7.75 4.1 0 8.7 3.8 0 8.1
4 16 9.7 0 16.3 9.55 0 16.55 .4 0 13.55 1.35 0 12.45
3 16 9.55 0 16.55 9.65 0 16.85 .4 0 13.55
4 16 9.35 0 18.8 .4 0 13.55 9.65 0 16.85 9.6 0 17.25
4 16 -1.4 0 14.7 .4 0 13.55 9.35 0 18.8 9 0 18.95
4 16 -3.35 0 15.3 -1.4 0 14.7 -4.55 0 18 -4.7 0 17.7
4 16 -5.05 0 15.35 -3.35 0 15.3 -4.7 0 17.7 -5.05 0 17.6
4 16 -3 0 13.7 -2.65 0 13.1 -1.3 0 12.4 -2.2 0 13.2
4 16 -4.55 0 14.1 -4.1 0 13.55 -2.65 0 13.1 -3 0 13.7
4 16 -4.1 0 13.55 -4.55 0 14.1 -6.35 0 14.05 -5.65 0 13.65
3 16 -5.65 0 13.65 -6.35 0 14.05 -6.9 0 13.5
4 16 -6.35 0 14.05 -8 0 13.65 -7.85 0 13.2 -6.9 0 13.5
4 16 -9.4 0 12.95 -8.75 0 12.8 -7.85 0 13.2 -8 0 13.65
3 16 -8.75 0 12.8 -9.4 0 12.95 -9.55 0 12.35
4 16 -10.05 0 12 -9.55 0 12.35 -9.4 0 12.95 -10.3 0 12.15
4 16 9.15 0 19.3 -7 0 20.85 -7.05 0 20.55 9 0 18.95
4 16 9 0 18.95 -7.05 0 20.55 -4.95 0 18.4 -4.7 0 18.35
4 16 -5.3 0 18.35 -4.95 0 18.4 -7.05 0 20.55 -7.2 0 20.3
4 16 -5.55 0 18.15 -5.3 0 18.35 -7.2 0 20.3 -7.5 0 20.25
4 16 -5.55 0 18.15 -7.5 0 20.25 -7.75 0 20.5 -8.85 0 19.05
4 16 -5.55 0 18.15 -8.85 0 19.05 -9.25 0 18.8 -5.6 0 17.9
4 16 -9.25 0 18.8 -9.4 0 18.6 -9.4 0 18.25 -5.6 0 17.9
4 16 -7.05 0 14.9 -5.4 0 17.65 -5.6 0 17.9 -9.4 0 18.25
4 16 -7.05 0 14.9 -5.05 0 15.35 -5.05 0 17.6 -5.4 0 17.65
4 16 -4.7 0 18.35 -4.55 0 18 -1.4 0 14.7 9 0 18.95
4 16 -7.75 0 20.5 -7.8 0 20.85 -8.85 0 21.15 -8.9 0 20.85
3 16 -8.9 0 20.85 -9.15 0 20.85 -9.55 0 19.5
4 16 -7.75 0 20.5 -8.9 0 20.85 -9.55 0 19.5 -8.85 0 19.05
4 16 -9.15 0 20.85 -9.4 0 21 -12.35 0 19.5 -9.55 0 19.5
4 16 -9.4 0 21.3 -12.3 0 19.75 -12.35 0 19.5 -9.4 0 21
4 16 -9.55 0 19.5 -12.35 0 19.5 -11.55 0 18.45 -9.75 0 19
4 16 -12.05 0 18.35 -11.55 0 18.45 -12.35 0 19.5 -12.8 0 19.25
3 16 -12.05 0 18.35 -12.8 0 19.25 -13.05 0 18.8
3 16 -9.75 0 18.5 -9.75 0 19 -11.55 0 18.45
4 16 -11.55 0 18.45 -12 0 17.75 -9.4 0 18.25 -9.75 0 18.5
4 16 -9.4 0 18.25 -12 0 17.75 -10.35 0 13.25 -9.05 0 14
3 16 -7.05 0 14.9 -9.4 0 18.25 -9.05 0 14
4 16 -9 0 21.4 -8.85 0 21.15 -7.8 0 20.85 -7.5 0 20.95
4 16 -7.5 0 20.95 -16 0 30 -9.25 0 21.5 -9 0 21.4
4 16 -7.5 0 20.95 -7.25 0 20.95 16 0 30 -16 0 30
4 16 -7.25 0 20.95 -7 0 20.85 9.15 0 19.3 16 0 30
3 16 -14.95 0 18.15 -15.55 0 18.6 -15.5 0 17.65
3 16 -15.35 0 16.85 -15.5 0 17.65 -15.6 0 15.5
4 16 -15.85 0 19.1 -15.6 0 15.5 -15.5 0 17.65 -15.55 0 18.6
4 16 -15.85 0 19.1 -16 0 19.85 -16 0 -8.34 -15.6 0 15.5
3 16 -15 0 -3.6 -15.35 0 -3.5 -16 0 -8.34
3 16 -15.35 0 -3.5 -15.6 0 -3.25 -16 0 -8.34
4 16 -15 0 -3.6 -16 0 -8.34 -11.75 0 -7.1 -12.4 0 -5.15
4 16 -11.85 0 -4.75 -14.9 0 -3.3 -15 0 -3.6 -12.4 0 -5.15
4 16 -13.55 0 -2.45 -14.9 0 -3.3 -11.85 0 -4.75 -13.3 0 -2.6
4 16 -13.5 0 -2.05 -15.1 0 -2.8 -14.9 0 -3.3 -13.55 0 -2.45
4 16 -15 0 -.7 -15.45 0 -.65 -15.6 0 -2.65 -15.1 0 -2.8
4 16 -10 0 -3.25 -9.55 0 -3.4 -9.4 0 -2.65 -9.95 0 -2.95
4 16 -10.35 0 -3.3 -9.9 0 -4 -9.55 0 -3.4 -10 0 -3.25
4 16 -10.7 0 -3.25 -10.35 0 -4.35 -9.9 0 -4 -10.35 0 -3.3
3 16 -10.35 0 -4.35 -10.7 0 -3.25 -11.1 0 -4.45
4 16 -10.7 0 -3.25 -11.3 0 -2.95 -11.85 0 -4.75 -11.1 0 -4.45
3 16 -11.3 0 -2.95 -12.05 0 -2.25 -11.85 0 -4.75
4 16 -12.05 0 -2.25 -13 0 -2.5 -13.3 0 -2.6 -11.85 0 -4.75
4 16 -12.65 0 -1.5 -13.1 0 -2.05 -13 0 -2.5 -12.05 0 -2.25
3 16 -13.1 0 -2.05 -12.65 0 -1.5 -13.5 0 -2.05
4 16 -12.65 0 -1.5 -15 0 -.7 -15.1 0 -2.8 -13.5 0 -2.05
4 16 -14.85 0 -.2 -15 0 -.7 -12.65 0 -1.5 -13.05 0 -.7
3 16 -13.05 0 -.7 -13.2 0 .35 -14.85 0 -.2
3 16 -1.25 0 .25 -1.55 0 .4 -1.25 0 0
4 16 -1.75 0 -.5 -1.25 0 0 -1.55 0 .4 -1.85 0 .15
4 16 -2.85 0 -1.45 -1.75 0 -.5 -1.85 0 .15 -2.7 0 -.7
4 16 -3.9 0 -2.05 -2.85 0 -1.45 -2.7 0 -.7 -4.05 0 -1.65
4 16 -4.05 0 -1.65 -5.55 0 -2.2 -5.2 0 -2.55 -3.9 0 -2.05
4 16 -5.55 0 -2.2 -7.1 0 -2.3 -6.65 0 -2.9 -5.2 0 -2.55
4 16 -8.4 0 -2.2 -7.8 0 -2.95 -6.65 0 -2.9 -7.1 0 -2.3
4 16 -9.75 0 -1.9 -9.4 0 -2.65 -7.8 0 -2.95 -8.4 0 -2.2
3 16 -9.95 0 -2.95 -9.4 0 -2.65 -10 0 -2.7
4 16 -10.4 0 -2.2 -10 0 -2.7 -9.4 0 -2.65 -9.75 0 -1.9
4 16 -11.1 0 -1.7 -10.4 0 -2.2 -9.75 0 -1.9 -11 0 -1.25
4 16 -11.55 0 -.8 -11.75 0 -1 -11.1 0 -1.7 -11 0 -1.25
3 16 -11.55 0 -.8 -12.05 0 -.45 -11.75 0 -1
3 16 -15.45 0 -.65 -15.65 0 -.3 -15.6 0 -2.65
4 16 -15.65 0 -.3 -16 0 -8.34 -15.6 0 -3.25 -15.6 0 -2.65
4 16 -15.1 0 0 -14.85 0 -.2 -13.2 0 .35 -13.15 0 1.35
4 16 -8.85 0 4.6 -8.45 0 4.75 -8.3 0 5 -8.55 0 5.15
3 16 -8.85 0 4.6 -8.55 0 5.15 -9.15 0 4.9
4 16 -8.85 0 4.6 -9.15 0 4.9 -9.8 0 4.75 -9.5 0 4.5
4 16 -9.5 0 4.5 -9.8 0 4.75 -10.4 0 4.55 -10.3 0 4.25
4 16 -13.15 0 1.35 -12.95 0 2.35 -15.45 0 -.1 -15.1 0 0
3 16 -12.95 0 2.35 -12.55 0 3.35 -15.45 0 -.1
4 16 -12.55 0 3.35 -15.35 0 15.05 -15.65 0 -.3 -15.45 0 -.1
4 16 -16 0 -8.34 -15.65 0 -.3 -15.35 0 15.05 -15.6 0 15.5
4 16 -12 0 17.75 -13.05 0 17.95 -14.45 0 17.05 -10.35 0 13.25
3 16 -10.35 0 13.25 -14.45 0 17.05 -14.75 0 16.1
4 16 -15.35 0 15.05 -11.25 0 12.25 -10.35 0 13.25 -14.75 0 16.1
3 16 -11.25 0 12.25 -15.35 0 15.05 -11.5 0 11.75
3 16 -11.5 0 11.75 -15.35 0 15.05 -11.6 0 11.2
4 16 -14.45 0 17.05 -13.05 0 17.95 -13.55 0 18.15 -14.05 0 18.05
3 16 -14.45 0 17.05 -14.05 0 18.05 -14.65 0 17.75
3 16 -9.95 0 10.5 -10.25 0 10.95 -10.85 0 10.7
4 16 -9.95 0 10.5 -10.85 0 10.7 -10.3 0 6.15 -9.45 0 6.6
4 16 -11.15 0 5.35 -10.3 0 6.15 -10.85 0 10.7 -11.35 0 10.8
4 16 -12.55 0 3.35 -12.05 0 4.3 -11.6 0 11.2 -15.35 0 15.05
4 16 -11.6 0 11.2 -12.05 0 4.3 -11.15 0 5.35 -11.35 0 10.8
4 16 -7.7 0 10 -7.45 0 9.65 -6.3 0 10.3 -6.3 0 10.7
4 16 -7.6 0 11.45 -7.7 0 10.35 -7.7 0 10 -6.3 0 10.7
4 16 -8.25 0 10.15 -7.7 0 10.35 -7.6 0 11.45 -8 0 11.6
3 16 -8 0 11.6 -8.25 0 11.85 -9 0 11.55
4 16 -9.45 0 11.2 -8.25 0 10.15 -8 0 11.6 -9 0 11.55
3 16 -8.25 0 10.15 -9.45 0 11.2 -9.95 0 10.5
4 16 -9.45 0 6.6 -8.2 0 9.7 -8.25 0 10.15 -9.95 0 10.5
4 16 -7.9 0 9.2 -8.2 0 9.7 -9.45 0 6.6 -8.5 0 6.95
4 16 -7.45 0 9.65 -7.9 0 9.2 -8.5 0 6.95 -7.7 0 7.05
4 16 -7.7 0 7.05 -7.15 0 6.9 -6.3 0 10.3 -7.45 0 9.65
4 16 -7.15 0 6.9 -6.85 0 6.45 -5.5 0 10.4 -6.3 0 10.3
3 16 -5.5 0 10.4 -6 0 10.55 -6.3 0 10.3
4 16 -6.3 0 10.7 -6 0 11.05 -7.45 0 11.7 -7.6 0 11.45
3 16 -7.45 0 11.7 -6.9 0 12.45 -7.5 0 12
4 16 -5.55 0 12.6 -6.9 0 12.45 -7.45 0 11.7 -6 0 11.05
4 16 -5.5 0 10.4 -4.35 0 12.45 -5.55 0 12.6 -6 0 11.05
4 16 -1.55 0 11.05 -3 0 11.9 -4.35 0 12.45 -5.5 0 10.4
4 16 -6.8 0 5.9 -1.55 0 11.05 -5.5 0 10.4 -6.85 0 6.45
4 16 -.3 0 9.05 -.65 0 10.2 -1.55 0 11.05 -6.8 0 5.9
4 16 -.25 0 5.3 -.15 0 7.2 -.3 0 9.05 -6.8 0 5.9
3 16 -.25 0 5.3 -6.8 0 5.9 -.7 0 3.75
4 16 -.7 0 3.75 -6.8 0 5.9 -7 0 4.95 -1.6 0 2.25
3 16 -1.6 0 2.25 -7 0 4.95 -2.85 0 1.15
4 16 -7 0 4.95 -7.55 0 4.3 -4.15 0 .25 -2.85 0 1.15
3 16 -4.15 0 .25 -7.55 0 4.3 -5.25 0 -.15
4 16 -6.4 0 -.25 -5.25 0 -.15 -7.55 0 4.3 -8.3 0 3.75
4 16 -6.4 0 -.25 -8.3 0 3.75 -9.05 0 .45 -7.95 0 0
3 16 -9.05 0 .45 -8.3 0 3.75 -9.05 0 3.65
4 16 -10.2 0 1.8 -9.95 0 1.25 -9.05 0 .45 -9.05 0 3.65
4 16 -10.3 0 2.45 -10.2 0 1.8 -9.05 0 3.65 -9.75 0 3.45
4 16 -10.25 0 3.05 -10.3 0 2.45 -9.75 0 3.45 -10.05 0 3.3
4 16 2.95 0 -7.2 2.5 0 -1 2.1 0 -.8 1.75 0 -3.4
4 16 1.75 0 -3.4 1.45 0 -5.15 1.8 0 -7.05 2.95 0 -7.2
4 16 1.15 0 -6.6 1.35 0 -6.9 1.8 0 -7.05 1.45 0 -5.15
4 16 4.8 0 -7.25 2.9 0 -1 2.5 0 -1 2.95 0 -7.2
4 16 7.85 0 -6.25 2.9 0 -1 4.8 0 -7.25 6.2 0 -7
4 16 7.85 0 -6.25 9.15 0 -5.4 3.25 0 -.65 2.9 0 -1
4 16 9.15 0 -5.4 10.15 0 -4.35 3.75 0 -.05 3.25 0 -.65
3 16 10.15 0 -4.35 4.55 0 .65 3.75 0 -.05
4 16 10.15 0 -4.35 10.85 0 -3.45 5.3 0 1.3 4.55 0 .65
3 16 10.85 0 -3.45 6.15 0 1.65 5.3 0 1.3
4 16 10.85 0 -3.45 11.3 0 -2.5 11.6 0 -1.55 6.15 0 1.65
4 16 8.05 0 1.75 6.95 0 1.85 6.15 0 1.65 11.6 0 -1.55
4 16 11.55 0 -.9 9.45 0 1.35 8.05 0 1.75 11.6 0 -1.55
4 16 10.45 0 .7 9.45 0 1.35 11.55 0 -.9 11.25 0 -.1
3 16 -1.05 0 -2.45 -1.05 0 -.95 -1.75 0 -1.65
4 16 -1.05 0 -2.45 -1.75 0 -1.65 -3.05 0 -2.65 -1.25 0 -4.1
4 16 -1.25 0 -4.1 -3.05 0 -2.65 -2.75 0 -6.65 -1.9 0 -6.75
4 16 -4.3 0 -6.5 -2.75 0 -6.65 -3.05 0 -2.65 -4.65 0 -3.4
3 16 -4.3 0 -6.5 -4.65 0 -3.4 -6.35 0 -3.9
4 16 -4.3 0 -6.5 -6.35 0 -3.9 -7.45 0 -4 -6.1 0 -6.6
4 16 -8.2 0 -3.95 -7.65 0 -7.05 -6.1 0 -6.6 -7.45 0 -4
4 16 -8.85 0 -3.8 -9.35 0 -4.35 -7.65 0 -7.05 -8.2 0 -3.95
4 16 -9.35 0 -4.35 -10.05 0 -4.9 -10.4 0 -5.35 -7.65 0 -7.05
4 16 -8.4 0 -7.5 -7.65 0 -7.05 -10.4 0 -5.35 -10.5 0 -5.9
4 16 -8.75 0 -7.9 -8.4 0 -7.5 -10.5 0 -5.9 -10.75 0 -6.3
4 16 -9.2 0 -8.55 -8.75 0 -7.9 -10.75 0 -6.3 -11.2 0 -6.65
4 16 -11.2 0 -6.65 -11.75 0 -7.1 -9.5 0 -9.15 -9.2 0 -8.55
4 16 -9.55 0 -9.65 -9.5 0 -9.15 -11.75 0 -7.1 -16 0 -8.34
3 16 -9.55 0 -9.65 -16 0 -8.34 -9.5 0 -10.1
4 16 0 0 -24.353 -9.2 0 -10.5 -9.5 0 -10.1 -16 0 -8.34
4 16 -5.85 0 -10.05 0 0 -24.353 -1.8 0 -10.4 -3.85 0 -10.15
4 16 -8.25 0 -10.5 0 0 -24.353 -5.85 0 -10.05 -7.45 0 -10.25
3 16 0 0 -24.353 -8.25 0 -10.5 -8.75 0 -10.6
3 16 -8.75 0 -10.6 -9.2 0 -10.5 0 0 -24.353
3 16 8.9 0 -13.8 9.55 0 -8.3 7.85 0 -9.45
4 16 8.9 0 -13.8 7.85 0 -9.45 5.85 0 -10.35 7.85 0 -14.2
3 16 7.85 0 -14.2 5.85 0 -10.35 6.7 0 -15.05
4 16 5.85 0 -10.35 4.15 0 -10.8 6 0 -16.15 6.7 0 -15.05
4 16 4.15 0 -10.8 3 0 -10.9 5.6 0 -16.8 6 0 -16.15
3 16 3 0 -10.9 1.55 0 -10.8 5.6 0 -16.8
4 16 1.55 0 -10.8 .15 0 -10.6 5.6 0 -17.55 5.6 0 -16.8
4 16 5.6 0 -17.55 .15 0 -10.6 -1.8 0 -10.4 0 0 -24.353
3 16 5.8 0 -18.15 5.6 0 -17.55 0 0 -24.353
