0 Duplo Window  1 x  4 x  3 with Flat Top with 4 Same Size Panes
0 Name: 90265.dat
0 Author: Philippe Hurbain [Philo]
0 !LDRAW_ORG Part UPDATE 2022-01
0 !LICENSE Redistributable under CCAL version 2.0 : see CAreadme.txt

0 BFC CERTIFY CCW

0 !CATEGORY Window

0 !HISTORY 2022-01-14 [PTadmin] Official Update 2022-01

1 16 0 0 0 1 0 0 0 1 0 0 0 1 s\27382s02.dat
1 16 -16.5 11.5 -2.5 4 0 0 0 0 -4 0 1 0 1-4ndis.dat
1 16 -54.5 11.5 -2.5 -4 0 0 0 0 -4 0 1 0 1-4ndis.dat
1 16 -16.5 42 -2.5 4 0 0 0 0 4 0 1 0 1-4ndis.dat
1 16 -54.5 42 -2.5 -4 0 0 0 0 4 0 1 0 1-4ndis.dat
1 16 -16.5 11.5 2.5 4 0 0 0 0 -4 0 -1 0 1-4ndis.dat
1 16 -54.5 11.5 2.5 -4 0 0 0 0 -4 0 -1 0 1-4ndis.dat
1 16 -16.5 42 2.5 4 0 0 0 0 4 0 -1 0 1-4ndis.dat
1 16 -54.5 42 2.5 -4 0 0 0 0 4 0 -1 0 1-4ndis.dat
0 BFC INVERTNEXT
1 16 -54.5 11.5 -2.5 -4 0 0 0 0 -4 0 5 0 1-4cylo.dat
0 BFC INVERTNEXT
1 16 -16.5 42 -2.5 4 0 0 0 0 4 0 5 0 1-4cylo.dat
0 BFC INVERTNEXT
1 16 -54.5 42 -2.5 -4 0 0 0 0 4 0 5 0 1-4cylo.dat
1 16 -35.5 46 0 -19 0 0 0 1 0 0 0 -2.5 rect2p.dat
1 16 -35.5 7.5 0 19 0 0 0 -1 0 0 0 -2.5 rect2p.dat
1 16 -58.5 26.75 0 0 -1 0 -15.25 0 0 0 0 -2.5 rect2p.dat
1 16 -12.5 26.75 0 0 1 0 15.25 0 0 0 0 -2.5 rect2p.dat
0 BFC INVERTNEXT
1 16 -16.5 11.5 -2.5 4 0 0 0 0 -4 0 5 0 1-4cylo.dat
1 16 -16.5 -11.5 -2.5 4 0 0 0 0 4 0 1 0 1-4ndis.dat
1 16 -54.5 -11.5 -2.5 -4 0 0 0 0 4 0 1 0 1-4ndis.dat
1 16 -16.5 -42 -2.5 4 0 0 0 0 -4 0 1 0 1-4ndis.dat
1 16 -54.5 -42 -2.5 -4 0 0 0 0 -4 0 1 0 1-4ndis.dat
1 16 -16.5 -11.5 2.5 4 0 0 0 0 4 0 -1 0 1-4ndis.dat
1 16 -54.5 -11.5 2.5 -4 0 0 0 0 4 0 -1 0 1-4ndis.dat
1 16 -16.5 -42 2.5 4 0 0 0 0 -4 0 -1 0 1-4ndis.dat
1 16 -54.5 -42 2.5 -4 0 0 0 0 -4 0 -1 0 1-4ndis.dat
0 BFC INVERTNEXT
1 16 -54.5 -11.5 -2.5 -4 0 0 0 0 4 0 5 0 1-4cylo.dat
0 BFC INVERTNEXT
1 16 -16.5 -42 -2.5 4 0 0 0 0 -4 0 5 0 1-4cylo.dat
0 BFC INVERTNEXT
1 16 -54.5 -42 -2.5 -4 0 0 0 0 -4 0 5 0 1-4cylo.dat
1 16 -35.5 -46 0 19 0 0 0 -1 0 0 0 -2.5 rect2p.dat
1 16 -35.5 -7.5 0 -19 0 0 0 1 0 0 0 -2.5 rect2p.dat
1 16 -58.5 -26.75 0 0 -1 0 -15.25 0 0 0 0 -2.5 rect2p.dat
1 16 -12.5 -26.75 0 0 1 0 15.25 0 0 0 0 -2.5 rect2p.dat
0 BFC INVERTNEXT
1 16 -16.5 -11.5 -2.5 4 0 0 0 0 4 0 5 0 1-4cylo.dat
4 16 -9.5 37 2.5 -12.5 46 2.5 -12.5 -46 2.5 -9.5 -37 2.5
3 16 -9.5 -37 2.5 -12.5 -46 2.5 -5.5 -60 2.5
3 16 -12.5 46 2.5 -9.5 37 2.5 -5.5 60 2.5
1 16 -114.5 11.5 -2.5 -4 0 0 0 0 -4 0 1 0 1-4ndis.dat
1 16 -76.5 11.5 -2.5 4 0 0 0 0 -4 0 1 0 1-4ndis.dat
1 16 -114.5 42 -2.5 -4 0 0 0 0 4 0 1 0 1-4ndis.dat
1 16 -76.5 42 -2.5 4 0 0 0 0 4 0 1 0 1-4ndis.dat
1 16 -114.5 11.5 2.5 -4 0 0 0 0 -4 0 -1 0 1-4ndis.dat
1 16 -76.5 11.5 2.5 4 0 0 0 0 -4 0 -1 0 1-4ndis.dat
1 16 -114.5 42 2.5 -4 0 0 0 0 4 0 -1 0 1-4ndis.dat
1 16 -76.5 42 2.5 4 0 0 0 0 4 0 -1 0 1-4ndis.dat
0 BFC INVERTNEXT
1 16 -76.5 11.5 -2.5 4 0 0 0 0 -4 0 5 0 1-4cylo.dat
0 BFC INVERTNEXT
1 16 -114.5 42 -2.5 -4 0 0 0 0 4 0 5 0 1-4cylo.dat
0 BFC INVERTNEXT
1 16 -76.5 42 -2.5 4 0 0 0 0 4 0 5 0 1-4cylo.dat
1 16 -95.5 46 0 -19 0 0 0 1 0 0 0 -2.5 rect2p.dat
1 16 -95.5 7.5 0 19 0 0 0 -1 0 0 0 -2.5 rect2p.dat
1 16 -72.5 26.75 0 0 1 0 15.25 0 0 0 0 -2.5 rect2p.dat
1 16 -118.5 26.75 0 0 -1 0 -15.25 0 0 0 0 -2.5 rect2p.dat
0 BFC INVERTNEXT
1 16 -114.5 11.5 -2.5 -4 0 0 0 0 -4 0 5 0 1-4cylo.dat
1 16 -114.5 -11.5 -2.5 -4 0 0 0 0 4 0 1 0 1-4ndis.dat
1 16 -76.5 -11.5 -2.5 4 0 0 0 0 4 0 1 0 1-4ndis.dat
1 16 -114.5 -42 -2.5 -4 0 0 0 0 -4 0 1 0 1-4ndis.dat
1 16 -76.5 -42 -2.5 4 0 0 0 0 -4 0 1 0 1-4ndis.dat
1 16 -114.5 -11.5 2.5 -4 0 0 0 0 4 0 -1 0 1-4ndis.dat
1 16 -76.5 -11.5 2.5 4 0 0 0 0 4 0 -1 0 1-4ndis.dat
1 16 -114.5 -42 2.5 -4 0 0 0 0 -4 0 -1 0 1-4ndis.dat
1 16 -76.5 -42 2.5 4 0 0 0 0 -4 0 -1 0 1-4ndis.dat
0 BFC INVERTNEXT
1 16 -76.5 -11.5 -2.5 4 0 0 0 0 4 0 5 0 1-4cylo.dat
0 BFC INVERTNEXT
1 16 -114.5 -42 -2.5 -4 0 0 0 0 -4 0 5 0 1-4cylo.dat
0 BFC INVERTNEXT
1 16 -76.5 -42 -2.5 4 0 0 0 0 -4 0 5 0 1-4cylo.dat
1 16 -95.5 -46 0 19 0 0 0 -1 0 0 0 -2.5 rect2p.dat
1 16 -95.5 -7.5 0 -19 0 0 0 1 0 0 0 -2.5 rect2p.dat
1 16 -72.5 -26.75 0 0 1 0 15.25 0 0 0 0 -2.5 rect2p.dat
1 16 -118.5 -26.75 0 0 -1 0 -15.25 0 0 0 0 -2.5 rect2p.dat
0 BFC INVERTNEXT
1 16 -114.5 -11.5 -2.5 -4 0 0 0 0 4 0 5 0 1-4cylo.dat
4 16 -12.5 7.5 2.5 -58.5 7.5 2.5 -58.5 -7.5 2.5 -12.5 -7.5 2.5
4 16 -72.5 -7.5 2.5 -72.5 7.5 2.5 -118.5 7.5 2.5 -118.5 -7.5 2.5
4 16 -58.5 -7.5 2.5 -72.5 -7.5 2.5 -72.5 -46 2.5 -58.5 -46 2.5
4 16 -72.5 7.5 2.5 -72.5 -7.5 2.5 -58.5 -7.5 2.5 -58.5 7.5 2.5
4 16 -72.5 46 2.5 -72.5 7.5 2.5 -58.5 7.5 2.5 -58.5 46 2.5
4 16 -118.5 46 2.5 -12.5 46 2.5 -5.5 60 2.5 -125.5 60 2.5
4 16 -12.5 -46 2.5 -118.5 -46 2.5 -125.5 -60 2.5 -5.5 -60 2.5
4 16 -133.5 52 2.5 -133.5 -52 2.5 -125.5 -60 2.5 -125.5 60 2.5
4 16 -118.5 46 2.5 -125.5 60 2.5 -125.5 -60 2.5 -118.5 -46 2.5
0 BFC INVERTNEXT
1 16 -54.5 11.5 2.5 -4 0 0 0 0 -4 0 -5 0 1-4cylo.dat
0 BFC INVERTNEXT
1 16 -16.5 42 2.5 4 0 0 0 0 4 0 -5 0 1-4cylo.dat
0 BFC INVERTNEXT
1 16 -54.5 42 2.5 -4 0 0 0 0 4 0 -5 0 1-4cylo.dat
0 BFC INVERTNEXT
1 16 -16.5 11.5 2.5 4 0 0 0 0 -4 0 -5 0 1-4cylo.dat
0 BFC INVERTNEXT
1 16 -54.5 -11.5 2.5 -4 0 0 0 0 4 0 -5 0 1-4cylo.dat
0 BFC INVERTNEXT
1 16 -16.5 -42 2.5 4 0 0 0 0 -4 0 -5 0 1-4cylo.dat
0 BFC INVERTNEXT
1 16 -54.5 -42 2.5 -4 0 0 0 0 -4 0 -5 0 1-4cylo.dat
0 BFC INVERTNEXT
1 16 -16.5 -11.5 2.5 4 0 0 0 0 4 0 -5 0 1-4cylo.dat
4 16 -12.5 -46 -2.5 -12.5 46 -2.5 -9.5 37 -2.5 -9.5 -37 -2.5
3 16 -12.5 -46 -2.5 -9.5 -37 -2.5 -5.5 -60 -2.5
3 16 -9.5 37 -2.5 -12.5 46 -2.5 -5.5 60 -2.5
0 BFC INVERTNEXT
1 16 -76.5 11.5 2.5 4 0 0 0 0 -4 0 -5 0 1-4cylo.dat
0 BFC INVERTNEXT
1 16 -114.5 42 2.5 -4 0 0 0 0 4 0 -5 0 1-4cylo.dat
0 BFC INVERTNEXT
1 16 -76.5 42 2.5 4 0 0 0 0 4 0 -5 0 1-4cylo.dat
0 BFC INVERTNEXT
1 16 -114.5 11.5 2.5 -4 0 0 0 0 -4 0 -5 0 1-4cylo.dat
0 BFC INVERTNEXT
1 16 -76.5 -11.5 2.5 4 0 0 0 0 4 0 -5 0 1-4cylo.dat
0 BFC INVERTNEXT
1 16 -114.5 -42 2.5 -4 0 0 0 0 -4 0 -5 0 1-4cylo.dat
0 BFC INVERTNEXT
1 16 -76.5 -42 2.5 4 0 0 0 0 -4 0 -5 0 1-4cylo.dat
0 BFC INVERTNEXT
1 16 -114.5 -11.5 2.5 -4 0 0 0 0 4 0 -5 0 1-4cylo.dat
4 16 -58.5 -7.5 -2.5 -58.5 7.5 -2.5 -12.5 7.5 -2.5 -12.5 -7.5 -2.5
4 16 -118.5 7.5 -2.5 -72.5 7.5 -2.5 -72.5 -7.5 -2.5 -118.5 -7.5 -2.5
4 16 -72.5 -46 -2.5 -72.5 -7.5 -2.5 -58.5 -7.5 -2.5 -58.5 -46 -2.5
4 16 -58.5 -7.5 -2.5 -72.5 -7.5 -2.5 -72.5 7.5 -2.5 -58.5 7.5 -2.5
4 16 -58.5 7.5 -2.5 -72.5 7.5 -2.5 -72.5 46 -2.5 -58.5 46 -2.5
4 16 -5.5 60 -2.5 -12.5 46 -2.5 -118.5 46 -2.5 -125.5 60 -2.5
4 16 -125.5 -60 -2.5 -118.5 -46 -2.5 -12.5 -46 -2.5 -5.5 -60 -2.5
4 16 -125.5 -60 -2.5 -133.5 -52 -2.5 -133.5 52 -2.5 -125.5 60 -2.5
4 16 -125.5 -60 -2.5 -125.5 60 -2.5 -118.5 46 -2.5 -118.5 -46 -2.5
1 16 -133.5 0 0 0 1 0 -52 0 0 0 0 2.5 rect2p.dat
