0 Minifig Hips with Belt and Copper Buckle Pattern
0 Name: 3815bpx2.dat
0 Author: Evert-Jan Boer [ejboer]
0 !LDRAW_ORG Part UPDATE 2022-03
0 !LICENSE Redistributable under CCAL version 2.0 : see CAreadme.txt

0 BFC CERTIFY CCW

0 !KEYWORDS Bricklink 970c00pb0416, Set 75917, Set 71205, Owen Grady, Jurassic World

0 !HISTORY 2022-05-07 [PTadmin] Official Update 2022-03

1 16 0 0 0 1 0 0 0 1 0 0 0 1 s\3815bs01.dat
1 16 -2 12 0 0 4 0 8.08395 0 -3.34848 -3.34848 0 -8.08395 5-16cyli.dat

4 0 -15.95 1 -10 -15.95 5.5 -10 -15.21 5.5 -10 -15.21 4.8 -10
4 0 -9.41 5.5 -10 -9.41 4.8 -10 -10.15 4.8 -10 -10.15 5.5 -10
3 0 -15.95 1 -10 -15.21 4.8 -10 -15.2 1.8 -10
4 0 -15.2 1.8 -10 -12 1.8 -10 -9.95 1 -10 -15.95 1 -10
4 0 -10.96 4.8 -10 -10.95 3.85 -10 -10.95 2.15 -10 -12 1.8 -10
3 0 -12 1.8 -10 -12.01 4.8 -10 -10.96 4.8 -10
4 0 -10.96 5.5 -10 -10.96 4.8 -10 -12.01 4.8 -10 -12 5.5 -10
3 0 -10.95 3.85 -10 -10.96 4.8 -10 -10.15 4.8 -10
4 0 -10.15 4.8 -10 -9.41 4.8 -10 -7.2 3.85 -10 -10.95 3.85 -10
3 0 -7.2 3.85 -10 -9.41 4.8 -10 -7.2 4.8 -10
4 0 -9.95 1 -10 -12 1.8 -10 -10.95 2.15 -10 -9.95 1.3 -10
4 0 -10.95 2.15 -10 -7.2 2.15 -10 -7.2 1.3 -10 -9.95 1.3 -10
3 0 -7.2 3.85 -10 -7.2 4.8 -10 -6.6 5.5 -10
3 0 -7.2 4.8 -10 -7.2 5.5 -10 -6.6 5.5 -10
4 0 -7.2 3.85 -10 -6.6 5.5 -10 -6.6 1 -10 -7.2 2.15 -10
3 0 -6.6 1 -10 -7.2 1.3 -10 -7.2 2.15 -10
3 0 -6.6 1 -10 -7.2 1 -10 -7.2 1.3 -10
3 0 7.9 1 -10 7.3 1 -10 7.9 1.3 -10
4 0 7.9 2.15 -10 7.3 1 -10 7.3 5.5 -10 7.9 3.85 -10
3 0 7.9 4.8 -10 7.3 5.5 -10 7.9 5.5 -10
4 0 8.57 3.4 -10 9.23 3.68 -10 9.37 3 -10 8.65 3 -10
4 0 8.65 3 -10 9.37 3 -10 9.23 2.32 -10 8.57 2.6 -10
4 0 8.57 2.6 -10 9.23 2.32 -10 9.12 2.15 -10 8.34 2.26 -10
4 0 8.57 3.4 -10 8.34 3.74 -10 9.12 3.85 -10 9.23 3.68 -10
4 0 7.3 1 -10 7.9 2.15 -10 8.18 2.15 -10 7.9 1.3 -10
4 0 8.34 2.26 -10 9.12 2.15 -10 7.9 1.3 -10 8.18 2.15 -10
4 0 7.9 1.3 -10 9.12 2.15 -10 17 2.15 -10 17 1.3 -10
4 0 7.3 5.5 -10 7.9 4.8 -10 8.18 3.85 -10 7.9 3.85 -10
4 0 8.34 3.74 -10 8.18 3.85 -10 7.9 4.8 -10 9.12 3.85 -10
4 0 17 4.8 -10 17 3.85 -10 9.12 3.85 -10 7.9 4.8 -10
4 70 8.57 2.6 -10 8.34 2.26 -10 8.18 2.15 -10 7.9 2.15 -10
3 70 7.9 2.15 -10 8.65 3 -10 8.57 2.6 -10
4 70 8.34 3.74 -10 8.57 3.4 -10 8.65 3 -10 7.9 2.15 -10
4 70 7.9 3.85 -10 8.18 3.85 -10 8.34 3.74 -10 7.9 2.15 -10
3 70 9.23 3.68 -10 9.12 3.85 -10 17 3.85 -10
4 70 9.23 3.68 -10 17 3.85 -10 17 2.15 -10 9.37 3 -10
3 70 17 2.15 -10 9.12 2.15 -10 9.23 2.32 -10
3 70 17 2.15 -10 9.23 2.32 -10 9.37 3 -10
3 0 -5 1 -10 -5.7 1 -10 -5 1.3 -10
3 0 -5.7 1 -10 -5 2.15 -10 -5 1.3 -10
3 0 -5.7 1 -10 -5 3.85 -10 -5 2.15 -10
4 0 -5 4.8 -10 -5 3.85 -10 -5.7 1 -10 -5.7 5.5 -10
3 0 -5 4.8 -10 -5.7 5.5 -10 -5 5.5 -10
3 0 6.55 1 -10 5.85 1 -10 5.85 1.3 -10
4 0 6.55 5.5 -10 6.55 1 -10 5.85 2.15 -10 5.85 3.85 -10
3 0 5.85 3.85 -10 5.85 4.8 -10 6.55 5.5 -10
3 0 5.85 4.8 -10 5.85 5.5 -10 6.55 5.5 -10
3 0 5.05 1 -10 4.3 1 -10 5.05 1.3 -10
3 0 5.85 1.3 -10 5.05 1.3 -10 5.05 2.15 -10
4 0 6.55 1 -10 5.85 1.3 -10 5.05 2.15 -10 5.85 2.15 -10
4 0 5.85 4.8 -10 5.85 3.85 -10 5.05 3.85 -10 5.05 4.8 -10
4 0 5.05 1.3 -10 4.3 1 -10 4.3 1.85 -10 5.05 2.15 -10
4 0 4.3 4.15 -10 5.05 3.85 -10 5.05 2.15 -10 4.3 1.85 -10
3 0 5.05 3.85 -10 4.3 4.15 -10 5.05 4.8 -10
4 0 4.3 4.15 -10 4.3 5 -10 5.05 5 -10 5.05 4.8 -10
4 0 4.3 1.85 -10 4.3 1 -10 2.75 1 -10 2.75 1.85 -10
4 0 2.75 4.15 -10 2 5 -10 4.3 5 -10 4.3 4.15 -10
4 0 -2.9 2.15 -10 -2.65 1.3 -10 -5 1.3 -10 -5 2.15 -10
4 0 -5 3.85 -10 -5 4.8 -10 -2.65 4.8 -10 -2.9 3.85 -10
4 0 -.2 2.15 -10 2 2.15 -10 2 1.3 -10 .05 1.3 -10
3 0 2 1.3 -10 2 2.15 -10 2.75 1.85 -10
4 0 2 1 -10 2 1.3 -10 2.75 1.85 -10 2.75 1 -10
3 0 2 3.85 -10 -.2 3.85 -10 .05 4.8 -10
3 0 2.75 4.15 -10 2 4.8 -10 2 5 -10
4 0 .05 4.8 -10 2 4.8 -10 2.75 4.15 -10 2 3.85 -10
4 0 2 2.15 -10 2 3.85 -10 2.75 4.15 -10 2.75 1.85 -10
4 300 -3 3 -10 -2 3 -10 -1.9 2.15 -10 -2.9 2.15 -10
4 300 -1.65 2 -10 -2.65 1.3 -10 -2.9 2.15 -10 -1.9 2.15 -10
4 300 -2.65 1.3 -10 -1.65 2 -10 -1.65 .85 -10 -2.25 .95 -10
4 300 -.15 .95 -10 -.65 .85 -10 -1.65 .85 -10 -1.65 2 -10
4 300 -.55 2 -10 .05 1.3 -10 -.15 .95 -10 -1.65 2 -10
3 300 .05 1.3 -10 -.55 2 -10 -.2 2.15 -10
4 300 -3 3 -10 -2.9 3.85 -10 -1.9 3.8 -10 -2 3 -10
4 300 -2.2 4.95 -10 -1.9 3.8 -10 -2.9 3.85 -10 -2.65 4.8 -10
4 300 -1.9 3.8 -10 -2.2 4.95 -10 -1.3 4.95 -10 -1.55 3.95 -10
4 300 -.25 4.9 -10 -.65 3.95 -10 -1.55 3.95 -10 -1.3 4.95 -10
4 300 -.25 4.9 -10 .05 4.8 -10 -.2 3.85 -10 -.65 3.95 -10
4 484 4.3 4.15 -10 4.3 1.85 -10 2.75 1.85 -10 2.75 4.15 -10
4 70 5.85 3.85 -10 5.85 2.15 -10 5.05 2.15 -10 5.05 3.85 -10
4 70 -5 3.85 -10 -3 3 -10 -2.9 2.15 -10 -5 2.15 -10
3 70 -3 3 -10 -5 3.85 -10 -2.9 3.85 -10
4 70 -7.2 3.85 -10 -7.2 2.15 -10 -10.95 2.15 -10 -10.95 3.85 -10
4 70 -15.21 4.8 -10 -12.01 4.8 -10 -12 1.8 -10 -15.2 1.8 -10
4 16 -15.95 1 -10 -18 0 -10 -18 6 -10 -15.95 5.5 -10
3 16 -15.21 5.5 -10 -15.95 5.5 -10 -18 6 -10
4 16 -15.21 4.8 -10 -15.21 5.5 -10 -12 5.5 -10 -12.01 4.8 -10
4 16 -10.15 5.5 -10 -10.15 4.8 -10 -10.96 4.8 -10 -10.96 5.5 -10
4 16 -5.7 5.5 -10 -5.7 1 -10 -6.6 1 -10 -6.6 5.5 -10
4 16 -7.2 5.5 -10 -7.2 4.8 -10 -9.41 4.8 -10 -9.41 5.5 -10
4 16 -9.95 1 -10 -9.95 1.3 -10 -7.2 1.3 -10 -7.2 1 -10
4 16 -5 1.3 -10 -2.65 1.3 -10 -2.25 .95 -10 -5 1 -10
4 16 -5 4.8 -10 -5 5.5 -10 -2.2 4.95 -10 -2.65 4.8 -10
3 16 -.15 .95 -10 .05 1.3 -10 2 1.3 -10
4 16 0 0 -10 -.15 .95 -10 2 1.3 -10 2 1 -10
4 16 0 6 -10 2 5 -10 .05 4.8 -10 -.25 4.9 -10
3 16 2 4.8 -10 .05 4.8 -10 2 5 -10
4 16 5.85 1.3 -10 5.85 1 -10 5.05 1 -10 5.05 1.3 -10
4 16 7.3 5.5 -10 7.3 1 -10 6.55 1 -10 6.55 5.5 -10
4 16 5.85 5.5 -10 5.85 4.8 -10 5.05 4.8 -10 5.05 5 -10
4 16 7.9 4.8 -10 7.9 5.5 -10 18 6 -10 17 4.8 -10
3 16 17 3.85 -10 17 4.8 -10 18 6 -10
3 16 17 2.15 -10 17 3.85 -10 18 6 -10
4 16 18 6 -10 18 0 -10 17 1.3 -10 17 2.15 -10
4 16 7.9 1.3 -10 17 1.3 -10 18 0 -10 7.9 1 -10
3 0 -.88 2.78 -10 -.94 3 -10 -.88 3.22 -10
4 0 -.88 3.22 -10 -.72 3.38 -10 -.72 2.62 -10 -.88 2.78 -10
4 0 -.5 3.44 -10 -.5 2.56 -10 -.72 2.62 -10 -.72 3.38 -10
4 0 -.28 2.62 -10 -.5 2.56 -10 -.5 3.44 -10 -.28 3.38 -10
3 0 -.28 2.62 -10 -.28 3.38 -10 -.12 2.78 -10
4 0 -.28 3.38 -10 -.12 3.22 -10 -.06 3 -10 -.12 2.78 -10
4 0 .93 3.38 -10 .77 2.78 -10 .71 3 -10 .77 3.22 -10
3 0 .93 2.62 -10 .77 2.78 -10 .93 3.38 -10
4 0 1.15 3.44 -10 1.15 2.56 -10 .93 2.62 -10 .93 3.38 -10
3 0 1.15 2.56 -10 1.15 3.44 -10 1.37 3.38 -10
4 0 1.15 2.56 -10 1.37 3.38 -10 1.53 2.78 -10 1.37 2.62 -10
4 0 1.59 3 -10 1.53 2.78 -10 1.37 3.38 -10 1.53 3.22 -10
4 70 -.94 3 -10 -.88 2.78 -10 -1.65 2 -10 -1.9 2.15 -10
4 70 -.88 2.78 -10 -.72 2.62 -10 -.55 2 -10 -1.65 2 -10
3 70 -.55 2 -10 -.72 2.62 -10 -.5 2.56 -10
4 70 -.55 2 -10 -.5 2.56 -10 -.28 2.62 -10 -.2 2.15 -10
4 70 .77 2.78 -10 -.2 2.15 -10 -.28 2.62 -10 -.12 2.78 -10
3 70 -.2 2.15 -10 .77 2.78 -10 .93 2.62 -10
4 70 .93 2.62 -10 1.15 2.56 -10 2 2.15 -10 -.2 2.15 -10
3 70 2 2.15 -10 1.15 2.56 -10 1.37 2.62 -10
3 70 2 2.15 -10 1.37 2.62 -10 1.53 2.78 -10
4 70 2 3.85 -10 2 2.15 -10 1.53 2.78 -10 1.59 3 -10
3 70 1.59 3 -10 1.53 3.22 -10 2 3.85 -10
3 70 1.53 3.22 -10 1.37 3.38 -10 2 3.85 -10
4 70 -1.9 3.8 -10 -.94 3 -10 -1.9 2.15 -10 -2 3 -10
4 70 -.94 3 -10 -1.9 3.8 -10 -1.55 3.95 -10 -.88 3.22 -10
3 70 -.88 3.22 -10 -1.55 3.95 -10 -.72 3.38 -10
4 70 -1.55 3.95 -10 -.65 3.95 -10 -.5 3.44 -10 -.72 3.38 -10
4 70 -.65 3.95 -10 -.2 3.85 -10 -.28 3.38 -10 -.5 3.44 -10
4 70 -.28 3.38 -10 -.2 3.85 -10 1.15 3.44 -10 .93 3.38 -10
4 70 1.37 3.38 -10 1.15 3.44 -10 -.2 3.85 -10 2 3.85 -10
4 70 -.28 3.38 -10 .93 3.38 -10 .77 3.22 -10 -.12 3.22 -10
4 70 -.12 3.22 -10 .77 3.22 -10 .71 3 -10 -.06 3 -10
4 70 -.06 3 -10 .71 3 -10 .77 2.78 -10 -.12 2.78 -10
4 16 0 6 -10 -1.3 4.95 -10 -2.2 4.95 -10 -5 5.5 -10
4 16 0 6 -10 5.85 5.5 -10 5.05 5 -10 4.3 5 -10
3 16 -12 5.5 -10 -15.21 5.5 -10 -18 6 -10
3 16 -10.96 5.5 -10 -12 5.5 -10 -18 6 -10
3 16 -10.15 5.5 -10 -10.96 5.5 -10 -18 6 -10
3 16 -9.41 5.5 -10 -10.15 5.5 -10 -18 6 -10
3 16 -7.2 5.5 -10 -9.41 5.5 -10 -18 6 -10
3 16 -18 0 -10 -15.95 1 -10 -9.95 1 -10
3 16 -18 0 -10 -9.95 1 -10 -7.2 1 -10
3 16 -18 0 -10 -7.2 1 -10 -6.6 1 -10
3 16 -18 0 -10 -6.6 1 -10 -5.7 1 -10
3 16 -18 0 -10 -5.7 1 -10 -5 1 -10
4 16 -1.65 .85 -10 -18 0 -10 -5 1 -10 -2.25 .95 -10
4 16 -.65 .85 -10 0 0 -10 -18 0 -10 -1.65 .85 -10
3 16 0 0 -10 -.65 .85 -10 -.15 .95 -10
3 16 0 0 -10 2 1 -10 2.75 1 -10
3 16 0 0 -10 2.75 1 -10 4.3 1 -10
3 16 0 0 -10 4.3 1 -10 5.05 1 -10
3 16 0 0 -10 5.05 1 -10 5.85 1 -10
3 16 0 0 -10 5.85 1 -10 6.55 1 -10
3 16 0 0 -10 6.55 1 -10 7.3 1 -10
4 16 7.3 1 -10 7.9 1 -10 18 0 -10 0 0 -10
3 16 -6.6 5.5 -10 -7.2 5.5 -10 -18 6 -10
3 16 -5.7 5.5 -10 -6.6 5.5 -10 -18 6 -10
4 16 0 6 -10 -5 5.5 -10 -5.7 5.5 -10 -18 6 -10
3 16 -.25 4.9 -10 -1.3 4.95 -10 0 6 -10
3 16 4.3 5 -10 2 5 -10 0 6 -10
3 16 6.55 5.5 -10 5.85 5.5 -10 0 6 -10
3 16 7.3 5.5 -10 6.55 5.5 -10 0 6 -10
4 16 18 6 -10 7.9 5.5 -10 7.3 5.5 -10 0 6 -10
