0 Tyre 14/ 20 x 60
0 Name: 32076.dat
0 Author: Philippe Hurbain [Philo]
0 !LDRAW_ORG Part UPDATE 2022-04
0 !LICENSE Redistributable under CCAL version 2.0 : see CAreadme.txt

0 BFC CERTIFY CCW

0 !HISTORY 2018-01-25 [Philo] Adapted from Marc Klein 32078
0 !HISTORY 2022-07-18 [PTadmin] Official Update 2022-04

1 16 0 0 0 0.86603 -0.5 0 0.5 0.86603 0 0 0 1 s\32076s01.dat
1 16 0 0 0 1 0 0 0 1 0 0 0 1 s\32076s01.dat
1 16 0 0 0 0.5 -0.86603 0 0.86603 0.5 0 0 0 1 s\32076s01.dat
1 16 0 0 0 0.5 0.86603 0 -0.86603 0.5 0 0 0 1 s\32076s01.dat
1 16 0 0 0 0 1 0 -1 0 0 0 0 1 s\32076s01.dat
1 16 0 0 0 0.86603 0.5 0 -0.5 0.86603 0 0 0 1 s\32076s01.dat
1 16 0 0 0 -0.86603 0.5 0 -0.5 -0.86603 0 0 0 1 s\32076s01.dat
1 16 0 0 0 -1 0 0 0 -1 0 0 0 1 s\32076s01.dat
1 16 0 0 0 -0.5 0.86603 0 -0.86603 -0.5 0 0 0 1 s\32076s01.dat
1 16 0 0 0 -0.5 -0.86603 0 0.86603 -0.5 0 0 0 1 s\32076s01.dat
1 16 0 0 0 0 -1 0 1 0 0 0 0 1 s\32076s01.dat
1 16 0 0 0 -0.86603 -0.5 0 0.5 -0.86603 0 0 0 1 s\32076s01.dat
