0 Minifig Torso with Soccer Shirt with Octan Logo and Blue Stripes Pattern
0 Name: 973pc4b.dat
0 Author: Fredrik Hareide [fhareide]
0 !LDRAW_ORG Part UPDATE 2022-04
0 !LICENSE Redistributable under CCAL version 2.0 : see CAreadme.txt

0 BFC CERTIFY CCW

0 !KEYWORDS Bricklink 973pb0844, Set 8804, 2-sided

0 !HISTORY 2022-07-18 [PTadmin] Official Update 2022-04

1 16 0 0 0 1 0 0 0 1 0 0 0 1 s\973s01.dat
1 16 0 -4 0 4.243 0 -4.243 0 -8 0 -4.243 0 -4.243 1-4cyli.dat

0 // Black
4 0 12.24 2 -10 11.28 2 -10 12.13 2.75 -10 12.99 2.73 -10
4 0 -13.01 22.07 -10 -13.7 22.03 -10 -13.76 22.79 -10 -13.78 23.19 -10
4 0 11.7 4.23 -10 12.28 3.81 -10 10.98 2.69 -10 10.41 3.04 -10
4 0 -0.2 2.33 -10 2.12 2.19 -10 2.02 1.51 -10 -0.22 1.61 -10
4 0 -0.97 5.41 -10 -0.36 4.96 -10 -2.39 3.78 -10 -2.86 4.4 -10
4 0 -10.72 0.59 -10 -11.17 1.43 -10 -10.31 1.14 -10 -9.95 0.63 -10
4 0 7.3 6.02 -10 7.28 4.8 -10 7 4.9 -10 6.43 6.21 -10
4 0 12.84 5.51 -10 13.33 5.47 -10 13.29 4.93 -10 11.7 4.23 -10
4 0 -10.96 9.33 -10 -11.71 8.7 -10 -11.02 13.92 -10 -10.43 13.07 -10
4 0 -7.08 8.78 -10 -6.51 8.03 -10 -9.58 8.44 -10 -10.96 9.33 -10
4 0 -7.55 5.07 -10 -7.34 6.55 -10 -6.63 4.84 -10 -7.07 3.95 -10
4 0 -3.42 6.39 -10 -2.23 6.81 -10 -1.35 6.67 -10 -1.92 6.23 -10
4 0 0.84 9.35 -10 1.29 10.15 -10 1.47 10.1 -10 1.54 9.95 -10
4 0 -0.13 14.68 -10 -1.1 15.6 -10 -0.74 15.95 -10 0.66 14.74 -10
4 0 -0.59 20.46 -10 -0.12 19.4 -10 -0.45 19.04 -10 -1.57 20.44 -10
4 0 -5.4 24.14 -10 -5.95 23.23 -10 -6.21 23.35 -10 -6.04 24.39 -10
4 0 -7.27 21.17 -10 -6.79 22.03 -10 -6.52 21.91 -10 -6.63 20.92 -10
4 0 -3.03 21.88 -10 -2.9 22.68 -10 -2.65 22.58 -10 -2.6 21.86 -10
4 0 -0.26 21.84 -10 -1.21 22.36 -10 -0.24 22.41 -10 0.33 21.9 -10
4 0 5.4 22.79 -10 5.59 22.68 -10 5.44 22.07 -10 5.24 21.91 -10
4 0 2.82 24.36 -10 2.58 23.69 -10 2.4 23.73 -10 2.48 24.55 -10
4 0 2.41 22.67 -10 2.59 22.71 -10 2.88 22.1 -10 2.64 21.89 -10
4 0 13.4 30.76 -10 13.73 29.25 -10 13.61 28.31 -10 12.83 26.64 -10
4 0 -12.97 2 -10 -13.13 2.85 -10 -11.98 2 -10 -11.94 1.21 -10
4 0 15.69 27.73 -10 15.55 26.53 -10 15.07 27.5 -10 15.19 29 -10
4 0 10.99 11.06 -10 10.16 12.2 -10 10.85 12.38 -10 11.58 11.2 -10
4 0 9.89 13.51 -10 10 15.24 -10 10.88 14.14 -10 10.64 13.64 -10
4 0 8.04 7.34 -10 9.54 7.44 -10 9.27 6.04 -10 7.3 6.02 -10
4 0 8.08 13.63 -10 7.68 13.06 -10 6.97 13.28 -10 6.72 14.85 -10
4 0 9.08 11.94 -10 8.98 11.59 -10 8.71 11.67 -10 8.73 12.27 -10
4 0 5.37 9.32 -10 5.65 10.79 -10 5.98 9.32 -10 5.42 7.71 -10
4 0 5.65 10.79 -10 6.16 12.16 -10 6.3 10.66 -10 5.98 9.32 -10
4 0 6.16 12.16 -10 6.97 13.28 -10 6.89 11.96 -10 6.3 10.66 -10
4 0 11.2 1.27 -10 10.2 1.33 -10 11.28 2 -10 12.24 2 -10
4 0 10.41 3.04 -10 10.98 2.69 -10 9.61 1.93 -10 9.41 2.49 -10
4 0 8.94 1.33 -10 9.48 1.55 -10 9.66 1.25 -10 9.21 0.7 -10
4 0 10.07 0.72 -10 9.66 1.25 -10 10.2 1.33 -10 11.2 1.27 -10
4 0 9.61 1.93 -10 9.48 1.55 -10 8.94 1.33 -10 8.68 2.39 -10
4 0 9.41 2.49 -10 9.61 1.93 -10 8.68 2.39 -10 9.21 2.75 -10
4 0 -3.64 5.54 -10 -5.69 4.68 -10 -6.29 5.05 -10 -3.42 6.39 -10
4 0 -5.8 3.81 -10 -5.67 3.14 -10 -6.46 3.21 -10 -6.21 3.91 -10
4 0 -9.97 2.39 -10 -9.44 3.42 -10 -9.29 2 -10 -10.05 1.66 -10
4 0 -13.39 4.52 -10 -13.44 5.07 -10 -13.03 4.99 -10 -12.22 3.95 -10
4 0 -12.22 3.95 -10 -10.96 2.83 -10 -12.52 3.4 -10 -13.39 4.52 -10
4 0 -11.94 1.21 -10 -11.98 2 -10 -11.17 1.43 -10 -10.72 0.59 -10
4 0 -10.11 9.71 -10 -10.36 10.2 -10 -10.09 10.21 -10 -9.94 9.93 -10
4 0 -10.11 9.71 -10 -9.94 9.93 -10 -9.63 9.87 -10 -9.56 9.61 -10
4 0 -9.56 9.61 -10 -9.63 9.87 -10 -9.39 10.08 -10 -9.14 9.97 -10
4 0 -9.16 10.52 -10 -9.14 9.97 -10 -9.39 10.08 -10 -9.4 10.39 -10
4 0 -9.16 10.52 -10 -9.4 10.39 -10 -9.66 10.58 -10 -9.61 10.85 -10
4 0 -10.14 10.71 -10 -9.61 10.85 -10 -9.66 10.58 -10 -9.96 10.5 -10
4 0 -10.36 10.2 -10 -10.14 10.71 -10 -9.96 10.5 -10 -10.09 10.21 -10
4 0 -10.1 11.9 -10 -9.82 11.92 -10 -9.67 11.65 -10 -9.82 11.42 -10
4 0 -9.82 11.42 -10 -9.67 11.65 -10 -9.36 11.61 -10 -9.28 11.34 -10
4 0 -9.28 11.34 -10 -9.36 11.61 -10 -9.14 11.82 -10 -8.87 11.72 -10
4 0 -8.91 12.27 -10 -8.87 11.72 -10 -9.14 11.82 -10 -9.16 12.13 -10
4 0 -8.91 12.27 -10 -9.16 12.13 -10 -9.42 12.3 -10 -9.37 12.58 -10
4 0 -9.9 12.41 -10 -9.37 12.58 -10 -9.42 12.3 -10 -9.71 12.21 -10
4 0 -10.1 11.9 -10 -9.9 12.41 -10 -9.71 12.21 -10 -9.82 11.92 -10
4 0 -7.78 12.42 -10 -7.77 12.14 -10 -8.05 11.98 -10 -8.28 12.14 -10
4 0 -8.28 12.14 -10 -8.05 11.98 -10 -8.11 11.66 -10 -8.37 11.58 -10
4 0 -8.37 11.58 -10 -8.11 11.66 -10 -7.89 11.41 -10 -7.99 11.16 -10
4 0 -7.99 11.16 -10 -7.89 11.41 -10 -7.56 11.43 -10 -7.43 11.19 -10
4 0 -7.1 11.65 -10 -7.43 11.19 -10 -7.56 11.43 -10 -7.37 11.7 -10
4 0 -7.26 12.2 -10 -7.1 11.65 -10 -7.37 11.7 -10 -7.46 12.01 -10
4 0 -7.26 12.2 -10 -7.46 12.01 -10 -7.77 12.14 -10 -7.78 12.42 -10
4 0 -8.52 9.61 -10 -8.28 9.75 -10 -8.01 9.57 -10 -8.05 9.29 -10
4 0 -8.05 9.29 -10 -8.01 9.57 -10 -7.7 9.66 -10 -7.51 9.46 -10
4 0 -7.51 9.46 -10 -7.7 9.66 -10 -7.58 9.97 -10 -7.31 9.99 -10
4 0 -7.31 9.99 -10 -7.58 9.97 -10 -7.75 10.25 -10 -7.59 10.48 -10
4 0 -8.15 10.56 -10 -7.59 10.48 -10 -7.75 10.25 -10 -8.07 10.3 -10
4 0 -8.57 10.17 -10 -8.15 10.56 -10 -8.07 10.3 -10 -8.31 10.08 -10
4 0 -8.52 9.61 -10 -8.57 10.17 -10 -8.31 10.08 -10 -8.28 9.75 -10
4 0 -1.47 9.36 -10 -2.19 9.86 -10 -2.13 10.07 -10 -1.94 10.15 -10
4 0 0.87 7.52 -10 1.62 7.34 -10 1.63 7.02 -10 0.86 6.71 -10
4 0 1.63 7.02 -10 2.91 6.33 -10 2.5 5.75 -10 0.86 6.71 -10
4 0 -1.47 7.52 -10 -1.35 6.67 -10 -2.23 6.81 -10 -2.22 7.06 -10
4 0 12.83 26.64 -10 13.46 26.89 -10 13.43 26.29 -10 13.38 25.57 -10
4 0 13.85 17.45 -10 14.58 17.88 -10 15.13 17.74 -10 15.07 15.75 -10
4 0 -1.51 9.21 -10 -2.22 7.06 -10 -2.19 9.86 -10 -1.47 9.36 -10
4 0 -1.35 9.41 -10 -1.94 10.15 -10 1.29 10.15 -10 0.72 9.4 -10
4 0 1.54 9.95 -10 1.62 7.34 -10 0.89 9.2 -10 0.84 9.35 -10
4 0 0.77 7.48 -10 0.86 6.71 -10 -1.35 6.67 -10 -1.37 7.46 -10
4 0 -14.31 17.48 -10 -14.72 17.84 -10 -14.43 18.66 -10 -13.26 19.96 -10
4 0 -13.26 19.96 -10 -14.43 18.66 -10 -14.25 19.19 -10 -13.93 20.1 -10
4 0 -13.26 19.96 -10 -13.93 20.1 -10 -13.79 21.29 -10 -13.01 22.07 -10
3 0 -13.79 21.29 -10 -13.71 21.94 -10 -13.01 22.07 -10
3 0 -13.7 22.03 -10 -13.01 22.07 -10 -13.71 21.94 -10
4 0 -13.01 22.07 -10 -13.78 23.19 -10 -13.91 24.94 -10 -13.36 26.5 -10
3 0 -13.36 26.5 -10 -13.91 24.94 -10 -13.95 25.58 -10
3 0 -13.36 26.5 -10 -13.95 25.58 -10 -14 26.3 -10
4 0 -15.61 22.09 -10 -14.98 22 -10 -14.96 20.2 -10 -14.96 19.53 -10
4 0 -15.61 22.09 -10 -15 22.25 -10 -14.98 22.11 -10 -14.98 22 -10
3 0 -15 22.25 -10 -15.61 22.09 -10 -15.13 23.28 -10
4 0 -15.2 23.9 -10 -15.13 23.28 -10 -15.61 22.09 -10 -16.12 26.21 -10
4 0 -14.96 19.53 -10 -14.94 18.09 -10 -15.47 17.27 -10 -15.61 22.09 -10
3 0 -15.2 23.9 -10 -16.12 26.21 -10 -15.3 24.65 -10
4 0 -15.37 25.26 -10 -15.3 24.65 -10 -16.12 26.21 -10 -15.49 26.21 -10
4 0 -15.84 29 -10 -15.49 26.21 -10 -16.12 26.21 -10 -16.71 30.62 -10
4 0 -15.96 29.99 -10 -15.96 29.96 -10 -16.71 30.62 -10 -16.04 30.62 -10
3 0 -16.71 30.62 -10 -15.96 29.96 -10 -15.84 29 -10
4 0 -15.14 15.83 -10 -15.43 15.95 -10 -15.47 17.27 -10 -14.31 17.48 -10
4 0 -13.8 30.62 -10 -13.36 26.5 -10 -14.23 28.32 -10 -14.33 29.17 -10
4 0 -14.41 29.69 -10 -14.54 30.62 -10 -13.8 30.62 -10 -14.33 29.17 -10
3 0 -15.47 17.27 -10 -14.72 17.84 -10 -14.31 17.48 -10
4 0 -14.17 27.78 -10 -14.23 28.32 -10 -13.36 26.5 -10 -14.07 26.91 -10
3 0 -15.47 17.27 -10 -14.94 18.09 -10 -14.72 17.84 -10
3 0 -14.07 26.91 -10 -13.36 26.5 -10 -14.01 26.42 -10
3 0 -14.01 26.42 -10 -13.36 26.5 -10 -14 26.3 -10
4 0 5.32 1.39 -10 4.67 2.01 -10 5.49 2 -10 6.06 1.25 -10
4 0 5.32 1.39 -10 6.06 1.25 -10 6.37 0.59 -10 4.35 1.05 -10
4 0 4.35 1.05 -10 2.02 1.51 -10 4.31 1.72 -10 5.32 1.39 -10
3 0 4.31 1.72 -10 2.02 1.51 -10 2.12 2.19 -10
4 0 -2.49 1.49 -10 -2.67 2.12 -10 -0.2 2.33 -10 -0.22 1.61 -10
4 0 -4.91 1.01 -10 -5.83 1.33 -10 -4.92 1.6 -10 -2.49 1.49 -10
3 0 -2.67 2.12 -10 -2.49 1.49 -10 -4.92 1.6 -10
4 0 -5.83 1.33 -10 -4.91 1.01 -10 -7.14 0.49 -10 -6.85 1.01 -10
4 0 -5.83 1.33 -10 -6.85 1.01 -10 -6.05 2 -10 -5.06 2 -10
4 0 -5.06 2 -10 -6.05 2 -10 -4.56 3.29 -10 -3.92 2.89 -10
4 0 -3.92 2.89 -10 -4.56 3.29 -10 -2.86 4.4 -10 -2.39 3.78 -10
3 0 -3.42 6.39 -10 -1.92 6.23 -10 -3.64 5.54 -10
4 0 -0.97 5.41 -10 -1.92 6.23 -10 -1.35 6.67 -10 0.15 5.49 -10
4 0 1.68 4 -10 0.15 5.49 -10 2.02 4.48 -10 3.45 3.07 -10
4 0 3.45 3.07 -10 2.02 4.48 -10 4.09 3.32 -10 4.67 2.01 -10
4 0 -0.36 4.96 -10 -0.97 5.41 -10 0.15 5.49 -10 1.68 4 -10
3 0 4.67 2.01 -10 4.09 3.32 -10 5.49 2 -10
4 0 -11.24 2.26 -10 -10.96 2.83 -10 -9.97 2.39 -10 -10.05 1.66 -10
4 0 -10.05 1.66 -10 -9.29 2 -10 -9.56 1.18 -10 -10.31 1.14 -10
3 0 -10.31 1.14 -10 -9.56 1.18 -10 -9.95 0.63 -10
4 0 5 4.68 -10 2.5 5.75 -10 4.05 5.85 -10 5.87 4.88 -10
3 0 5 4.68 -10 5.87 4.88 -10 5.77 4.23 -10
4 0 6.18 4.97 -10 6.43 6.21 -10 7 4.9 -10 6.59 4.13 -10
4 0 5.77 4.23 -10 5.87 4.88 -10 6.18 4.97 -10 6.59 4.13 -10
4 0 4.68 3.5 -10 4.6 3.97 -10 5.52 4.02 -10 5.03 3.15 -10
4 0 5.81 3.29 -10 5.03 3.15 -10 5.52 4.02 -10 5.77 4.23 -10
3 0 5.77 4.23 -10 6.59 4.13 -10 5.81 3.29 -10
4 0 7.99 3.6 -10 7.3 6.02 -10 9.21 2.75 -10 8.68 2.39 -10
3 0 7.28 4.8 -10 7.3 6.02 -10 7.99 3.6 -10
3 0 13.29 4.93 -10 12.28 3.81 -10 11.7 4.23 -10
4 0 -10.43 13.07 -10 -11.02 13.92 -10 -9.64 13.76 -10 -6.59 12.58 -10
3 0 -9.64 13.76 -10 -5.86 13.21 -10 -6.59 12.58 -10
3 0 -11.71 8.7 -10 -10.96 9.33 -10 -9.58 8.44 -10
4 0 -6.51 8.03 -10 -7.08 8.78 -10 -6.59 12.58 -10 -5.86 13.21 -10
4 0 -8.75 3.18 -10 -9.44 3.42 -10 -8.36 5.19 -10 -7.55 5.07 -10
3 0 -8.36 5.19 -10 -7.34 6.55 -10 -7.55 5.07 -10
4 0 -6.19 4.28 -10 -6.63 4.84 -10 -6.29 5.05 -10 -5.69 4.68 -10
4 0 -6.19 4.28 -10 -6.21 3.91 -10 -7.07 3.95 -10 -6.63 4.84 -10
3 0 0.84 9.35 -10 0.72 9.4 -10 1.29 10.15 -10
4 0 2.82 15.95 -10 -0.26 16.97 -10 -0.21 17.58 -10 3.21 16.57 -10
4 0 3.21 16.57 -10 -0.21 17.58 -10 -0.08 18.15 -10 3.43 17.18 -10
4 0 3.43 17.18 -10 -0.08 18.15 -10 0.16 18.61 -10 1.05 19.32 -10
3 0 0.16 18.61 -10 0.51 19.04 -10 1.05 19.32 -10
4 0 1.05 19.32 -10 1.71 19.44 -10 3.27 18.51 -10 3.43 17.18 -10
4 0 3.27 18.51 -10 1.71 19.44 -10 2.42 19.32 -10 2.92 19 -10
3 0 3.5 17.88 -10 3.43 17.18 -10 3.27 18.51 -10
4 0 -0.26 16.97 -10 2.82 15.95 -10 2.24 15.41 -10 1.45 15.07 -10
4 0 1.45 15.07 -10 0.66 14.74 -10 -0.46 16.42 -10 -0.26 16.97 -10
3 0 0.66 14.74 -10 -0.74 15.95 -10 -0.46 16.42 -10
4 0 -1.1 15.6 -10 -0.13 14.68 -10 -0.9 14.67 -10 -1.52 15.37 -10
4 0 -1.52 15.37 -10 -0.9 14.67 -10 -1.61 14.83 -10 -1.91 15.22 -10
3 0 -2.31 15.04 -10 -1.91 15.22 -10 -1.61 14.83 -10
4 0 -4.21 18.75 -10 -0.88 18 -10 -0.93 17.42 -10 -4.43 18.22 -10
4 0 -0.93 17.42 -10 -1.07 16.86 -10 -1.34 16.42 -10 -4.52 17.67 -10
4 0 -1.34 16.42 -10 -1.73 16.04 -10 -2.12 15.87 -10 -4.47 17.12 -10
4 0 -2.12 15.87 -10 -2.55 15.75 -10 -3.07 15.79 -10 -4.47 17.12 -10
3 0 -1.34 16.42 -10 -4.47 17.12 -10 -4.52 17.67 -10
4 0 -3.07 15.79 -10 -3.63 15.89 -10 -3.99 16.23 -10 -4.47 17.12 -10
3 0 -4.31 16.61 -10 -4.47 17.12 -10 -3.99 16.23 -10
3 0 -0.93 17.42 -10 -4.52 17.67 -10 -4.43 18.22 -10
4 0 -0.88 18 -10 -4.21 18.75 -10 -3.88 19.22 -10 -3.48 19.66 -10
4 0 -0.88 18 -10 -3.48 19.66 -10 -2.96 19.98 -10 -0.74 18.56 -10
4 0 -0.74 18.56 -10 -2.96 19.98 -10 -2.41 20.26 -10 -1.57 20.44 -10
3 0 -1.57 20.44 -10 -0.45 19.04 -10 -0.74 18.56 -10
4 0 0.31 19.7 -10 -0.59 20.46 -10 0.39 20.3 -10 0.79 19.9 -10
3 0 0.39 20.3 -10 1.3 20.07 -10 0.79 19.9 -10
3 0 0.31 19.7 -10 -0.12 19.4 -10 -0.59 20.46 -10
4 0 -7.35 24.09 -10 -6.97 23.05 -10 -7.09 22.79 -10 -7.82 23.59 -10
4 0 -7.35 24.09 -10 -6.72 24.37 -10 -6.77 23.25 -10 -6.97 23.05 -10
4 0 -6.5 23.35 -10 -6.72 24.37 -10 -6.04 24.39 -10 -6.21 23.35 -10
4 0 -5.95 23.23 -10 -5.4 24.14 -10 -4.9 23.67 -10 -5.75 23.03 -10
4 0 -5.75 23.03 -10 -4.9 23.67 -10 -4.62 23.04 -10 -5.65 22.76 -10
4 0 -5.65 22.76 -10 -4.62 23.04 -10 -4.61 22.36 -10 -5.65 22.48 -10
4 0 -5.65 22.48 -10 -4.61 22.36 -10 -4.85 21.72 -10 -5.32 21.22 -10
3 0 -6.5 23.35 -10 -6.77 23.25 -10 -6.72 24.37 -10
3 0 -5.77 22.21 -10 -5.65 22.48 -10 -5.32 21.22 -10
4 0 -5.32 21.22 -10 -5.95 20.94 -10 -5.97 22.01 -10 -5.77 22.21 -10
4 0 -6.24 21.91 -10 -5.95 20.94 -10 -6.63 20.92 -10 -6.52 21.91 -10
4 0 -6.79 22.03 -10 -7.27 21.17 -10 -7.77 21.64 -10 -6.99 22.23 -10
4 0 -6.99 22.23 -10 -7.77 21.64 -10 -8.05 22.27 -10 -7.09 22.5 -10
4 0 -7.09 22.5 -10 -8.05 22.27 -10 -8.07 22.95 -10 -7.09 22.79 -10
3 0 -7.09 22.79 -10 -8.07 22.95 -10 -7.82 23.59 -10
3 0 -6.24 21.91 -10 -5.97 22.01 -10 -5.95 20.94 -10
4 0 -2.13 22.62 -10 -1.86 22.69 -10 -1.84 22.03 -10 -2.21 21.92 -10
4 0 -2.38 22.55 -10 -2.21 21.92 -10 -2.6 21.86 -10 -2.65 22.58 -10
4 0 -2.9 22.68 -10 -3.03 21.88 -10 -3.46 21.99 -10 -3.09 22.85 -10
4 0 -3.09 22.85 -10 -3.46 21.99 -10 -3.84 22.23 -10 -4.11 22.57 -10
4 0 -3.2 23.08 -10 -4.11 22.57 -10 -4.23 22.96 -10 -4.22 23.37 -10
4 0 -4.22 23.37 -10 -4.12 23.73 -10 -3.21 23.32 -10 -3.2 23.08 -10
4 0 -3.11 23.57 -10 -4.12 23.73 -10 -3.93 24.04 -10 -3.67 24.3 -10
3 0 -4.12 23.73 -10 -3.11 23.57 -10 -3.21 23.32 -10
4 0 -3.11 23.57 -10 -3.67 24.3 -10 -3.33 24.48 -10 -2.9 23.71 -10
4 0 -2.9 23.71 -10 -3.33 24.48 -10 -2.93 24.55 -10 -2.61 23.79 -10
4 0 -2.61 23.79 -10 -2.93 24.55 -10 -2.53 24.55 -10 -2.3 23.76 -10
4 0 -2.3 23.76 -10 -2.53 24.55 -10 -2.2 24.5 -10 -1.93 24.42 -10
3 0 -1.88 23.6 -10 -2.3 23.76 -10 -1.93 24.42 -10
3 0 -3.2 23.08 -10 -3.09 22.85 -10 -4.11 22.57 -10
3 0 -2.13 22.62 -10 -2.21 21.92 -10 -2.38 22.55 -10
3 0 0.64 23.96 -10 0.53 23.7 -10 0.39 23.72 -10
4 0 0.64 23.96 -10 0.39 23.72 -10 0.21 23.74 -10 0.56 24.28 -10
4 0 0.34 24.4 -10 0.56 24.28 -10 0.21 23.74 -10 0.06 24.45 -10
4 0 0.04 23.71 -10 -0.26 24.48 -10 0.06 24.45 -10 0.21 23.74 -10
4 0 -0.12 23.61 -10 -0.85 24.33 -10 -0.58 24.44 -10 -0.26 24.48 -10
4 0 -0.23 23.43 -10 -1.18 23.88 -10 -1.05 24.13 -10 -0.12 23.61 -10
3 0 -1.05 24.13 -10 -0.85 24.33 -10 -0.12 23.61 -10
4 0 -0.29 23.18 -10 -1.21 22.96 -10 -1.21 23.49 -10 -0.23 23.43 -10
3 0 -1.18 23.88 -10 -0.23 23.43 -10 -1.21 23.49 -10
4 0 -1.54 21.98 -10 -1.54 22.33 -10 -1.21 22.36 -10 -1.01 21.6 -10
4 0 -0.26 22.67 -10 -1.21 22.36 -10 -1.21 22.96 -10 -0.29 23.18 -10
4 0 -0.26 21.84 -10 -0.26 21.19 -10 -0.37 21.13 -10 -1.01 21.6 -10
4 0 0.57 21.98 -10 0.33 21.9 -10 0.38 22.4 -10 0.57 22.36 -10
3 0 -1.01 21.6 -10 -1.21 22.36 -10 -0.26 21.84 -10
3 0 -0.26 24.48 -10 0.04 23.71 -10 -0.12 23.61 -10
3 0 -0.24 22.41 -10 0.38 22.4 -10 0.33 21.9 -10
3 0 -0.26 22.67 -10 -0.24 22.41 -10 -1.21 22.36 -10
4 0 6.04 23.08 -10 6.09 24.42 -10 7.01 24.42 -10 6.93 22.44 -10
4 0 5.97 22.88 -10 6.93 22.44 -10 6.77 22.04 -10 6.43 21.86 -10
4 0 5.81 22.72 -10 6.43 21.86 -10 6.07 21.81 -10 5.71 21.93 -10
4 0 5.4 22.79 -10 5.24 21.91 -10 4.34 21.91 -10 5.29 22.96 -10
4 0 5.71 21.93 -10 5.44 22.07 -10 5.59 22.68 -10 5.81 22.72 -10
3 0 6.93 22.44 -10 5.97 22.88 -10 6.04 23.08 -10
4 0 4.34 21.91 -10 4.34 24.44 -10 5.27 23.16 -10 5.29 22.96 -10
3 0 6.43 21.86 -10 5.81 22.72 -10 5.97 22.88 -10
3 0 5.27 23.16 -10 4.34 24.44 -10 5.27 24.45 -10
4 0 2.86 23.3 -10 3.8 24.52 -10 3.78 21.95 -10 2.86 23.11 -10
4 0 2.81 23.47 -10 2.82 24.36 -10 3.04 24.54 -10 3.8 24.52 -10
3 0 2.72 24.51 -10 2.82 24.36 -10 2.48 24.55 -10
4 0 1.95 24.51 -10 2.23 24.55 -10 2.22 23.69 -10 1.69 24.4 -10
4 0 2.23 24.55 -10 2.48 24.55 -10 2.4 23.73 -10 2.22 23.69 -10
4 0 1.47 24.26 -10 1.69 24.4 -10 2.06 23.6 -10 1.3 24.09 -10
4 0 1.94 23.46 -10 1.14 23.87 -10 1.3 24.09 -10 2.06 23.6 -10
4 0 1.88 23.28 -10 0.96 23.47 -10 1.02 23.64 -10 1.94 23.46 -10
3 0 1.94 23.46 -10 1.02 23.64 -10 1.14 23.87 -10
4 0 1.88 23.28 -10 1.89 23.1 -10 0.92 23.32 -10 0.96 23.47 -10
3 0 2.06 23.6 -10 1.69 24.4 -10 2.22 23.69 -10
3 0 2.86 23.3 -10 2.81 23.47 -10 3.8 24.52 -10
3 0 2.82 24.36 -10 2.81 23.47 -10 2.72 23.6 -10
3 0 2.82 24.36 -10 2.72 23.6 -10 2.58 23.69 -10
4 0 0.9 23.13 -10 0.92 23.32 -10 1.89 23.1 -10 0.92 22.91 -10
4 0 1.89 23.1 -10 1.95 22.93 -10 0.99 22.65 -10 0.92 22.91 -10
4 0 1.95 22.93 -10 1.29 22.22 -10 1.11 22.41 -10 0.99 22.65 -10
4 0 2.07 22.79 -10 1.78 21.93 -10 1.51 22.07 -10 1.29 22.22 -10
4 0 1.78 21.93 -10 2.07 22.79 -10 2.23 22.7 -10 2.06 21.86 -10
4 0 2.35 21.86 -10 2.06 21.86 -10 2.23 22.7 -10 2.41 22.67 -10
3 0 2.64 21.89 -10 2.35 21.86 -10 2.41 22.67 -10
4 0 3.78 21.95 -10 2.93 21.95 -10 2.88 22.1 -10 2.82 22.94 -10
3 0 3.78 21.95 -10 2.82 22.94 -10 2.86 23.11 -10
3 0 2.88 22.1 -10 2.73 22.81 -10 2.82 22.94 -10
3 0 2.73 22.81 -10 2.88 22.1 -10 2.59 22.71 -10
3 0 1.29 22.22 -10 1.95 22.93 -10 2.07 22.79 -10
4 0 12.83 26.64 -10 13.61 28.31 -10 13.56 27.79 -10 13.47 26.9 -10
3 0 13.46 26.89 -10 12.83 26.64 -10 13.47 26.9 -10
3 0 13.4 30.76 -10 13.99 30.76 -10 13.8 29.68 -10
3 0 13.4 30.76 -10 13.8 29.68 -10 13.73 29.25 -10
3 0 15.07 27.5 -10 15.55 26.53 -10 14.96 26.11 -10
4 0 15.32 29.85 -10 15.36 30.04 -10 16.08 30.76 -10 15.19 29 -10
3 0 15.47 30.76 -10 16.08 30.76 -10 15.36 30.04 -10
3 0 15.69 27.73 -10 15.19 29 -10 16.08 30.76 -10
4 0 11.45 9.78 -10 12.1 9.84 -10 12.26 8.17 -10 11.58 8.11 -10
4 0 11.58 11.2 -10 12.1 9.84 -10 11.45 9.78 -10 10.99 11.06 -10
4 0 9.89 13.51 -10 9.37 13.08 -10 8.75 13.67 -10 9.26 15.14 -10
4 0 9.89 13.51 -10 10.85 12.38 -10 10.16 12.2 -10 9.37 13.08 -10
3 0 11.55 15.58 -10 11.13 14.7 -10 10 15.24 -10
4 0 11.13 14.7 -10 11.29 14.06 -10 10.88 14.14 -10 10 15.24 -10
4 0 9.26 15.14 -10 8.75 13.67 -10 8.41 13.8 -10 6.72 14.85 -10
3 0 8.41 13.8 -10 8.08 13.63 -10 6.72 14.85 -10
4 0 6.97 13.28 -10 6.18 13.33 -10 5.87 13.84 -10 6.72 14.85 -10
4 0 5.87 13.84 -10 5.52 13.63 -10 5.54 14.28 -10 6.72 14.85 -10
3 0 5.54 14.28 -10 4.74 14.93 -10 6.72 14.85 -10
3 0 9.26 15.14 -10 10 15.24 -10 9.89 13.51 -10
4 0 6.8 7.52 -10 7.3 6.02 -10 6.43 6.21 -10 5.7 6.49 -10
4 0 5.7 6.49 -10 5.42 7.71 -10 6.05 7.74 -10 6.8 7.52 -10
3 0 8.04 7.34 -10 7.3 6.02 -10 6.8 7.52 -10
4 0 12.24 6.96 -10 10.7 6.35 -10 10.84 7.8 -10 11.58 8.11 -10
4 0 10.7 6.35 -10 9.27 6.04 -10 9.54 7.44 -10 10.84 7.8 -10
3 0 12.26 8.17 -10 12.24 6.96 -10 11.58 8.11 -10
4 0 9.96 8.83 -10 9.42 7.76 -10 7.55 8.05 -10 9.64 10.11 -10
4 0 7.41 10.81 -10 7.55 8.05 -10 7.07 8.37 -10 6.47 9.87 -10
4 0 6.47 9.87 -10 6.6 10.49 -10 7.22 10.75 -10 7.41 10.81 -10
3 0 7.22 10.75 -10 6.6 10.49 -10 6.99 10.96 -10
3 0 9.87 8.22 -10 9.42 7.76 -10 9.96 8.83 -10
3 0 9.87 8.22 -10 9.96 8.83 -10 10.13 8.33 -10
4 0 10.27 9.86 -10 10.89 9.39 -10 10.43 9.02 -10 9.96 8.83 -10
4 0 9.64 10.11 -10 7.55 8.05 -10 7.41 10.81 -10 9.59 10.36 -10
4 0 7.6 11.65 -10 7.35 11.19 -10 7.13 11.7 -10 7.47 11.87 -10
3 0 7.23 11.92 -10 7.47 11.87 -10 7.13 11.7 -10
4 0 7.75 11.73 -10 7.41 10.81 -10 7.35 11.19 -10 7.6 11.65 -10
4 0 10.57 10.05 -10 11.05 9.74 -10 10.89 9.39 -10 10.27 9.86 -10
4 0 10.57 10.05 -10 10.77 10.32 -10 10.97 10.1 -10 11.05 9.74 -10
4 0 8.47 11.69 -10 7.75 11.73 -10 7.71 12.09 -10 8.48 12.25 -10
4 0 8.48 12.25 -10 7.71 12.09 -10 7.79 12.4 -10 8.13 12.78 -10
4 0 8.58 11.56 -10 7.41 10.81 -10 7.75 11.73 -10 8.47 11.69 -10
4 0 8.13 12.78 -10 8.3 12.96 -10 8.48 12.81 -10 8.48 12.25 -10
3 0 10.27 9.86 -10 9.96 8.83 -10 9.89 9.91 -10
3 0 9.89 9.91 -10 9.96 8.83 -10 9.64 10.11 -10
4 0 9.59 10.36 -10 7.41 10.81 -10 8.58 11.56 -10 9.1 11.39 -10
4 0 9.41 11.22 -10 9.73 10.64 -10 9.59 10.36 -10 9.1 11.39 -10
4 0 9.19 12.63 -10 8.73 12.27 -10 8.81 12.8 -10 8.95 12.9 -10
4 0 9.29 12.14 -10 9.08 11.94 -10 8.73 12.27 -10 9.19 12.63 -10
4 0 8.58 11.56 -10 8.71 11.67 -10 8.98 11.59 -10 9.1 11.39 -10
4 0 10.46 10.96 -10 10.44 10.84 -10 10.02 10.83 -10 10.13 11.22 -10
3 0 9.19 12.63 -10 9.39 12.37 -10 9.29 12.14 -10
4 0 9.73 10.64 -10 9.41 11.22 -10 9.73 11.29 -10 10.02 10.83 -10
3 0 10.13 11.22 -10 10.02 10.83 -10 9.73 11.29 -10
3 0 5.42 7.71 -10 5.98 9.32 -10 6.05 7.74 -10
3 0 7.68 13.06 -10 6.89 11.96 -10 6.97 13.28 -10
3 0 12.13 2.75 -10 13.03 3.3 -10 12.99 2.73 -10
3 0 9.21 0.7 -10 9.66 1.25 -10 10.07 0.72 -10
3 0 -7.07 3.95 -10 -6.21 3.91 -10 -6.46 3.21 -10
4 0 -5.8 3.81 -10 -5.19 3.99 -10 -5.17 3.61 -10 -5.67 3.14 -10
3 0 -8.75 3.18 -10 -9.29 2 -10 -9.44 3.42 -10
3 0 -12.52 3.4 -10 -10.96 2.83 -10 -11.24 2.26 -10
3 0 1.62 7.34 -10 0.87 7.52 -10 0.9 7.63 -10
3 0 4.05 5.85 -10 2.5 5.75 -10 2.91 6.33 -10
3 0 -1.37 7.46 -10 -1.35 6.67 -10 -1.47 7.52 -10
4 0 13.38 25.57 -10 13.35 24.95 -10 12.63 24.43 -10 12.83 26.64 -10
3 0 13.2 22.65 -10 12.51 22.17 -10 13.2 22.84 -10
4 0 12.51 22.17 -10 13.2 22.65 -10 13.23 21.98 -10 13.25 21.29 -10
4 0 13.25 21.29 -10 13.26 21.09 -10 12.55 20.72 -10 12.51 22.17 -10
4 0 12.63 24.43 -10 13.35 24.95 -10 13.23 23.26 -10 12.51 22.17 -10
3 0 13.2 22.84 -10 12.51 22.17 -10 13.23 23.26 -10
4 0 13.95 18.86 -10 13.85 17.45 -10 13.03 19.24 -10 13.66 19.55 -10
4 0 13.66 19.55 -10 13.03 19.24 -10 12.55 20.72 -10 13.26 21.09 -10
4 0 14.59 20.25 -10 15.17 21.94 -10 15.15 19.67 -10 14.6 19.73 -10
4 0 15.15 19.67 -10 15.13 17.74 -10 14.58 17.88 -10 14.6 19.64 -10
3 0 14.6 19.64 -10 14.6 19.73 -10 15.15 19.67 -10
3 0 14.88 25.31 -10 14.96 26.11 -10 15.55 26.53 -10
4 0 15.55 26.53 -10 15.17 21.94 -10 14.81 24.64 -10 14.88 25.31 -10
4 0 14.72 23.82 -10 14.81 24.64 -10 15.17 21.94 -10 14.66 23.21 -10
4 0 14.58 22.47 -10 14.66 23.21 -10 15.17 21.94 -10 14.59 20.25 -10
4 0 13.85 17.45 -10 13.95 18.86 -10 14.2 18.26 -10 14.29 18.02 -10
3 0 14.58 17.88 -10 13.85 17.45 -10 14.29 18.02 -10
3 0 -2.22 7.06 -10 -1.51 9.21 -10 -1.51 7.68 -10
3 0 -1.47 9.36 -10 -1.94 10.15 -10 -1.35 9.41 -10
3 0 0.86 6.71 -10 0.77 7.48 -10 0.87 7.52 -10
3 0 1.62 7.34 -10 0.9 7.63 -10 0.89 9.2 -10
3 0 -1.47 7.52 -10 -2.22 7.06 -10 -1.51 7.68 -10
4 0 8.25 2 10 8.99 2 10 8.46 3.3 10 7.79 3.07 10
4 0 3.42 2.14 10 5.54 2.36 10 3.3 2.62 10 1.35 2.21 10
4 0 4.29 5.54 10 4.07 4.85 10 5.11 4.65 10 5.38 5.28 10
4 0 2.99 5.82 10 2.93 5.05 10 4.07 4.85 10 4.29 5.54 10
4 0 5.38 5.28 10 5.11 4.65 10 6.01 4.42 10 6.4 5.03 10
4 0 6.4 5.03 10 6.01 4.42 10 6.73 4.1 10 7.28 4.62 10
4 0 7.28 4.62 10 6.73 4.1 10 7.29 3.68 10 7.94 4.06 10
4 0 7.94 4.06 10 7.29 3.68 10 7.79 3.07 10 8.46 3.3 10
4 0 1.31 2.78 10 0 2.24 10 1.35 2.21 10 3.3 2.62 10
4 0 0 5.26 10 2.93 5.05 10 2.99 5.82 10 0 6.04 10
4 0 -8.46 3.3 10 -8.99 2 10 -8.25 2 10 -7.79 3.07 10
4 0 -5.54 2.36 10 -5.62 2.28 10 -5.71 2.07 10 -3.42 2.14 10
4 0 -4.29 5.54 10 -5.38 5.28 10 -5.11 4.65 10 -4.07 4.85 10
4 0 -2.99 5.82 10 -4.29 5.54 10 -4.07 4.85 10 -2.93 5.05 10
4 0 -5.38 5.28 10 -6.4 5.03 10 -6.01 4.42 10 -5.11 4.65 10
4 0 -6.4 5.03 10 -7.28 4.62 10 -6.73 4.1 10 -6.01 4.42 10
4 0 -7.28 4.62 10 -7.94 4.06 10 -7.29 3.68 10 -6.73 4.1 10
4 0 -7.94 4.06 10 -8.46 3.3 10 -7.79 3.07 10 -7.29 3.68 10
4 0 -3.42 2.14 10 -1.35 2.21 10 -3.3 2.62 10 -5.54 2.36 10
4 0 -1.35 2.21 10 0 2.24 10 -1.31 2.78 10 -3.3 2.62 10
4 0 -2.99 5.82 10 -2.93 5.05 10 0 5.26 10 0 6.04 10
4 0 5.54 2.36 10 3.42 2.14 10 5.71 2.07 10 5.62 2.28 10
3 0 5.62 2.28 10 5.71 2.07 10 5.7 2.2 10
4 0 0 2.24 10 1.31 2.78 10 0 2.85 10 -1.31 2.78 10
3 0 -5.7 2.2 10 -5.71 2.07 10 -5.62 2.28 10

0 // Main_Colour
3 16 -13.13 2.85 -10 -14.35 2 -10 -13.39 4.52 -10
4 16 12.24 2 -10 12.99 2.73 -10 14.35 2 -10 12 0 -10
4 16 -19 29 -10 -19 32 -10 -16.71 30.62 -10 -16.12 26.21 -10
4 16 -8.75 3.18 -10 -6.46 3.21 -10 -6.05 2 -10 -9.29 2 -10
4 16 5.03 3.15 -10 5.49 2 -10 4.09 3.32 -10 4.68 3.5 -10
3 16 7.3 6.02 -10 9.27 6.04 -10 9.21 2.75 -10
4 16 -15.61 22.09 -10 -15.47 17.27 -10 -19 29 -10 -16.12 26.21 -10
4 16 -6.51 8.03 -10 -5.86 13.21 -10 -3.42 6.39 -10 -6.29 5.05 -10
4 16 0.89 9.2 -10 0.77 7.48 -10 0.72 9.4 -10 0.84 9.35 -10
4 16 -4.31 16.61 -10 -3.99 16.23 -10 -3.59 15.16 -10 -9.64 13.76 -10
4 16 -5.95 20.94 -10 -5.32 21.22 -10 -3.88 19.22 -10 -4.21 18.75 -10
4 16 -5.95 23.23 -10 -5.77 22.21 -10 -6.97 23.05 -10 -6.21 23.35 -10
3 16 -2.41 20.26 -10 -3.03 21.88 -10 -2.6 21.86 -10
4 16 19 29 -10 15.55 26.53 -10 15.69 27.73 -10 16.08 30.76 -10
4 16 -2.9 22.68 -10 -3.09 22.85 -10 -2.9 23.71 -10 -2.61 23.79 -10
4 16 0.38 22.4 -10 -0.29 23.18 -10 0.53 23.7 -10 0.57 22.36 -10
4 16 2.86 23.11 -10 1.89 23.1 -10 1.88 23.28 -10 2.86 23.3 -10
4 16 -0.85 24.33 -10 -1.05 24.13 -10 -1.58 24.93 -10 -1.22 25.18 -10
3 16 3.21 16.57 -10 3.43 17.18 -10 9.26 15.14 -10
4 16 13.56 26.94 -10 13.58 26.93 -10 13.46 26.89 -10 13.47 26.9 -10
4 16 6.07 21.81 -10 3.5 17.88 -10 5.24 21.91 -10 5.71 21.93 -10
4 16 -0.9 14.67 -10 -0.13 14.68 -10 0.39 13.96 -10 -1.41 13.98 -10
4 16 0.31 19.7 -10 1.05 19.32 -10 0.51 19.04 -10 -0.12 19.4 -10
4 16 4.74 14.93 -10 2.89 15 -10 2.24 15.41 -10 9.26 15.14 -10
4 16 5.37 9.32 -10 5.42 7.71 -10 2.91 6.33 -10 2.89 15 -10
4 16 6.43 6.21 -10 4.05 5.85 -10 2.91 6.33 -10 5.7 6.49 -10
4 16 5.87 4.88 -10 4.05 5.85 -10 6.43 6.21 -10 6.18 4.97 -10
4 16 14.35 2 -10 12.99 2.73 -10 13.03 3.3 -10 13.29 4.93 -10
4 16 14.35 2 -10 13.29 4.93 -10 13.33 5.47 -10 15.07 15.75 -10
3 16 15.13 17.74 -10 15.15 19.67 -10 19 29 -10
3 16 12 0 -10 11.2 1.27 -10 12.24 2 -10
3 16 12 0 -10 10.07 0.72 -10 11.2 1.27 -10
4 16 9.21 0.7 -10 10.07 0.72 -10 12 0 -10 6.37 0.59 -10
4 16 5.81 3.29 -10 7.99 3.6 -10 8.68 2.39 -10 5.49 2 -10
4 16 6.59 4.13 -10 7.28 4.8 -10 7.99 3.6 -10 5.81 3.29 -10
3 16 5.03 3.15 -10 5.81 3.29 -10 5.49 2 -10
4 16 4.6 3.97 -10 2.5 5.75 -10 5 4.68 -10 5.52 4.02 -10
4 16 0.86 6.71 -10 2.5 5.75 -10 0.15 5.49 -10 -1.35 6.67 -10
4 16 -1.92 6.23 -10 -0.97 5.41 -10 -2.86 4.4 -10 -3.64 5.54 -10
4 16 -6.19 4.28 -10 -5.69 4.68 -10 -5.8 3.81 -10 -6.21 3.91 -10
4 16 -5.19 3.99 -10 -3.64 5.54 -10 -2.86 4.4 -10 -4.56 3.29 -10
4 16 -7.34 6.55 -10 -8.36 5.19 -10 -9.58 8.44 -10 -6.51 8.03 -10
4 16 -4.56 3.29 -10 -6.05 2 -10 -5.67 3.14 -10 -5.17 3.61 -10
3 16 -7.07 3.95 -10 -8.75 3.18 -10 -7.55 5.07 -10
3 16 -10.72 0.59 -10 -12 0 -10 -11.94 1.21 -10
4 16 -12 0 -10 -10.72 0.59 -10 -9.95 0.63 -10 -7.14 0.49 -10
4 16 -12.97 2 -10 -11.94 1.21 -10 -12 0 -10 -14.35 2 -10
3 16 -13.13 2.85 -10 -12.97 2 -10 -14.35 2 -10
4 16 -13.44 5.07 -10 -13.39 4.52 -10 -14.35 2 -10 -15.43 15.95 -10
4 16 14.01 29.06 -10 13.76 29.17 -10 13.73 29.25 -10 14.26 29.17 -10
4 16 15.03 30.33 -10 15.28 30.23 -10 15.36 30.04 -10 14.78 30.23 -10
4 16 14.49 30.43 -10 14.24 30.53 -10 14.15 30.76 -10 14.83 30.76 -10
4 16 14.44 25.47 -10 14.19 25.37 -10 14.03 25.44 -10 14.51 25.78 -10
4 16 13.54 25.09 -10 13.51 25.02 -10 13.37 24.96 -10 13.38 25.57 -10
4 16 13.32 22.6 -10 13.2 22.65 -10 13.2 22.84 -10 13.57 22.7 -10
4 16 13.58 21.63 -10 13.48 21.38 -10 13.25 21.29 -10 13.48 21.88 -10
4 16 14.49 18.58 -10 14.39 18.34 -10 14.2 18.26 -10 13.95 18.86 -10
4 16 14.23 20.19 -10 14.59 20.25 -10 14.6 19.73 -10 14.13 19.95 -10
4 16 13.87 20.39 -10 13.52 20.74 -10 14.22 20.74 -10 14.12 20.49 -10
4 16 14.11 22.5 -10 14.46 22.15 -10 13.76 22.15 -10 13.86 22.4 -10
4 16 14.33 23.77 -10 14.58 23.88 -10 14.72 23.82 -10 14.23 23.53 -10
4 16 13.45 24.36 -10 13.8 24.71 -10 13.8 24.01 -10 13.55 24.11 -10
4 16 14.58 25.23 -10 14.83 25.33 -10 14.88 25.31 -10 14.48 24.98 -10
4 16 14.49 27.52 -10 14.73 27.42 -10 14.75 27.38 -10 14.24 27.42 -10
4 16 13.61 28.31 -10 14.16 28.04 -10 14.05 27.79 -10 13.81 27.69 -10
4 16 14.71 28.21 -10 14.46 28.32 -10 14.36 28.56 -10 14.95 28.32 -10
4 16 14.49 26.82 -10 14.24 26.92 -10 14.15 27.15 -10 14.75 27.38 -10
4 16 13.8 26.34 -10 13.56 26.24 -10 13.43 26.29 -10 13.91 26.59 -10
4 16 13.62 25.27 -10 13.54 25.09 -10 13.38 25.57 -10 13.51 25.52 -10
4 16 14.19 26.07 -10 14.44 25.97 -10 14.51 25.78 -10 13.94 25.97 -10
4 16 -14.88 24.97 -10 -15.3 24.65 -10 -15.37 25.26 -10 -14.99 25.22 -10
4 16 -14.82 23.36 -10 -15.07 23.25 -10 -15.13 23.28 -10 -14.72 23.6 -10
4 16 -14.69 21.8 -10 -14.98 22 -10 -14.98 22.11 -10 -14.45 21.9 -10
4 16 -14.67 19.62 -10 -14.92 19.52 -10 -14.96 19.53 -10 -14.57 19.87 -10
4 16 -14.51 19.33 -10 -14.26 19.22 -10 -14.25 19.19 -10 -14.75 19.22 -10
4 16 -14.81 20.74 -10 -14.46 21.09 -10 -14.11 20.74 -10 -14.21 20.49 -10
4 16 -14.06 21.88 -10 -13.81 21.98 -10 -13.71 21.94 -10 -14.16 21.63 -10
4 16 -13.76 22.79 -10 -14.29 23.19 -10 -14.04 23.29 -10 -13.78 23.19 -10
4 16 -14.73 24.36 -10 -14.38 24.71 -10 -14.14 24.11 -10 -14.38 24.01 -10
4 16 -14.2 25.27 -10 -14.1 25.52 -10 -13.95 25.58 -10 -13.91 24.94 -10
4 16 -15.12 25.72 -10 -14.53 25.97 -10 -14.42 25.72 -10 -14.53 25.47 -10
4 16 -14.39 26.84 -10 -14.07 26.91 -10 -14.01 26.42 -10 -14.49 26.59 -10
4 16 -15.42 27.17 -10 -15.07 27.52 -10 -15.07 26.82 -10 -15.32 26.92 -10
4 16 -14.64 28.28 -10 -14.39 28.39 -10 -14.23 28.32 -10 -14.74 28.04 -10
4 16 -15.29 28.21 -10 -15.64 28.56 -10 -14.94 28.56 -10 -15.04 28.32 -10
4 16 -15.61 29.63 -10 -15.86 29.73 -10 -15.96 29.96 -10 -15.37 29.73 -10
4 16 -14.84 29.66 -10 -14.59 29.76 -10 -14.41 29.69 -10 -14.94 29.41 -10
4 16 -15.07 30.43 -10 -15.32 30.53 -10 -15.36 30.62 -10 -14.79 30.62 -10
4 16 -9.29 2 -10 -6.05 2 -10 -6.85 1.01 -10 -9.56 1.18 -10
4 16 6.37 0.59 -10 6.06 1.25 -10 8.94 1.33 -10 9.21 0.7 -10
4 16 6.06 1.25 -10 5.49 2 -10 8.68 2.39 -10 8.94 1.33 -10
4 16 12 0 -10 -12 0 -10 -7.14 0.49 -10 6.37 0.59 -10
4 16 -9.56 1.18 -10 -6.85 1.01 -10 -7.14 0.49 -10 -9.95 0.63 -10
3 16 -14.79 30.62 -10 -19 32 -10 -14.54 30.62 -10
3 16 -15.36 30.62 -10 -19 32 -10 -14.79 30.62 -10
3 16 -19 32 -10 -13.8 30.62 -10 -14.54 30.62 -10
3 16 -16.04 30.62 -10 -19 32 -10 -15.36 30.62 -10
3 16 -16.71 30.62 -10 -19 32 -10 -16.04 30.62 -10
4 16 -10.09 30.62 -10 -13.8 30.62 -10 -19 32 -10 -3.84 30.7 -10
4 16 19 32 -10 9.5 30.76 -10 2.89 30.73 -10 -19 32 -10
3 16 -3.84 30.7 -10 -19 32 -10 2.89 30.73 -10
3 16 13.99 30.76 -10 19 32 -10 14.15 30.76 -10
3 16 13.4 30.76 -10 19 32 -10 13.99 30.76 -10
3 16 13.4 30.76 -10 9.5 30.76 -10 19 32 -10
3 16 15.47 30.76 -10 19 32 -10 16.08 30.76 -10
3 16 14.83 30.76 -10 19 32 -10 15.47 30.76 -10
3 16 14.83 30.76 -10 14.15 30.76 -10 19 32 -10
3 16 19 29 -10 16.08 30.76 -10 19 32 -10
3 16 -7.07 3.95 -10 -6.46 3.21 -10 -8.75 3.18 -10
3 16 -19 29 -10 -15.43 15.95 -10 -14.35 2 -10
3 16 -15.43 15.95 -10 -19 29 -10 -15.47 17.27 -10
3 16 -3.59 15.16 -10 -5.86 13.21 -10 -9.64 13.76 -10
3 16 -5.86 13.21 -10 -3.59 15.16 -10 -3.42 6.39 -10
4 16 -1.51 9.21 -10 -1.47 9.36 -10 -1.35 9.41 -10 -1.51 7.68 -10
4 16 -1.51 7.68 -10 -1.35 9.41 -10 0.72 9.4 -10 0.77 7.48 -10
4 16 0.77 7.48 -10 0.89 9.2 -10 0.9 7.63 -10 0.87 7.52 -10
4 16 -1.51 7.68 -10 0.77 7.48 -10 -1.37 7.46 -10 -1.47 7.52 -10
4 16 -1.54 22.33 -10 -1.54 21.98 -10 -1.84 22.03 -10 -1.86 22.69 -10
4 16 -1.84 22.03 -10 -1.54 21.98 -10 -1.01 21.6 -10 -0.59 20.46 -10
4 16 -0.37 21.13 -10 0.39 20.3 -10 -0.59 20.46 -10 -1.01 21.6 -10
4 16 2.42 19.32 -10 1.71 19.44 -10 1.3 20.07 -10 1.51 22.07 -10
4 16 0.57 21.98 -10 1.3 20.07 -10 0.39 20.3 -10 0.33 21.9 -10
4 16 -0.26 21.19 -10 -0.26 21.84 -10 0.33 21.9 -10 0.39 20.3 -10
3 16 0.39 20.3 -10 -0.37 21.13 -10 -0.26 21.19 -10
3 16 2.42 19.32 -10 1.51 22.07 -10 2.92 19 -10
4 16 1.51 22.07 -10 1.3 20.07 -10 0.57 21.98 -10 1.29 22.22 -10
4 16 1.11 22.41 -10 0.57 21.98 -10 0.57 22.36 -10 0.99 22.65 -10
4 16 0.9 23.13 -10 0.57 22.36 -10 0.64 23.96 -10 0.92 23.32 -10
3 16 0.9 23.13 -10 0.92 22.91 -10 0.57 22.36 -10
3 16 0.92 22.91 -10 0.99 22.65 -10 0.57 22.36 -10
3 16 1.29 22.22 -10 0.57 21.98 -10 1.11 22.41 -10
4 16 -4.52 17.67 -10 -4.47 17.12 -10 -9.64 13.76 -10 -7.27 21.17 -10
3 16 -4.47 17.12 -10 -4.31 16.61 -10 -9.64 13.76 -10
3 16 -3.59 15.16 -10 -3.99 16.23 -10 -3.63 15.89 -10
3 16 -10.09 30.62 -10 -7.35 24.09 -10 -7.82 23.59 -10
3 16 -10.09 30.62 -10 -7.82 23.59 -10 -8.07 22.95 -10
4 16 -6.63 20.92 -10 -4.43 18.22 -10 -4.52 17.67 -10 -7.27 21.17 -10
4 16 -5.95 20.94 -10 -4.21 18.75 -10 -4.43 18.22 -10 -6.63 20.92 -10
4 16 -8.05 22.27 -10 -9.64 13.76 -10 -10.09 30.62 -10 -8.07 22.95 -10
3 16 -5.32 21.22 -10 -3.48 19.66 -10 -3.88 19.22 -10
3 16 -8.05 22.27 -10 -7.77 21.64 -10 -9.64 13.76 -10
3 16 -7.77 21.64 -10 -7.27 21.17 -10 -9.64 13.76 -10
4 16 -2.41 20.26 -10 -2.96 19.98 -10 -5.32 21.22 -10 -4.85 21.72 -10
3 16 -2.96 19.98 -10 -3.48 19.66 -10 -5.32 21.22 -10
4 16 -5.77 22.21 -10 -5.97 22.01 -10 -6.24 21.91 -10 -6.52 21.91 -10
4 16 -5.77 22.21 -10 -6.52 21.91 -10 -6.79 22.03 -10 -6.97 23.05 -10
4 16 -6.79 22.03 -10 -6.99 22.23 -10 -7.09 22.5 -10 -7.09 22.79 -10
3 16 -6.97 23.05 -10 -6.79 22.03 -10 -7.09 22.79 -10
4 16 -6.97 23.05 -10 -6.77 23.25 -10 -6.5 23.35 -10 -6.21 23.35 -10
4 16 -5.95 23.23 -10 -5.75 23.03 -10 -5.65 22.76 -10 -5.65 22.48 -10
3 16 -5.95 23.23 -10 -5.65 22.48 -10 -5.77 22.21 -10
4 16 -4.22 23.37 -10 -4.23 22.96 -10 -4.61 22.36 -10 -4.62 23.04 -10
3 16 -4.61 22.36 -10 -4.23 22.96 -10 -4.11 22.57 -10
4 16 -3.84 22.23 -10 -4.85 21.72 -10 -4.61 22.36 -10 -4.11 22.57 -10
4 16 -1.57 20.44 -10 -2.41 20.26 -10 -2.21 21.92 -10 -1.84 22.03 -10
4 16 -3.46 21.99 -10 -2.41 20.26 -10 -4.85 21.72 -10 -3.84 22.23 -10
3 16 -1.84 22.03 -10 -0.59 20.46 -10 -1.57 20.44 -10
3 16 -3.03 21.88 -10 -2.41 20.26 -10 -3.46 21.99 -10
3 16 -2.41 20.26 -10 -2.6 21.86 -10 -2.21 21.92 -10
4 16 -2.13 22.62 -10 -2.3 23.76 -10 -1.88 23.6 -10 -1.86 22.69 -10
4 16 -2.3 23.76 -10 -2.13 22.62 -10 -2.38 22.55 -10 -2.65 22.58 -10
4 16 -2.61 23.79 -10 -2.3 23.76 -10 -2.65 22.58 -10 -2.9 22.68 -10
4 16 -3.21 23.32 -10 -3.11 23.57 -10 -2.9 23.71 -10 -3.2 23.08 -10
3 16 -3.2 23.08 -10 -2.9 23.71 -10 -3.09 22.85 -10
3 16 0.57 22.36 -10 0.53 23.7 -10 0.64 23.96 -10
4 16 0.38 22.4 -10 -0.24 22.41 -10 -0.26 22.67 -10 -0.29 23.18 -10
4 16 -0.23 23.43 -10 0.21 23.74 -10 0.39 23.72 -10 -0.29 23.18 -10
3 16 -0.29 23.18 -10 0.39 23.72 -10 0.53 23.7 -10
4 16 -0.12 23.61 -10 0.04 23.71 -10 0.21 23.74 -10 -0.23 23.43 -10
4 16 2.86 23.3 -10 1.88 23.28 -10 1.94 23.46 -10 2.06 23.6 -10
4 16 2.86 23.3 -10 2.06 23.6 -10 2.22 23.69 -10 2.81 23.47 -10
4 16 2.81 23.47 -10 2.22 23.69 -10 2.4 23.73 -10 2.72 23.6 -10
3 16 2.72 23.6 -10 2.4 23.73 -10 2.58 23.69 -10
4 16 2.41 22.67 -10 2.86 23.11 -10 2.82 22.94 -10 2.73 22.81 -10
4 16 2.07 22.79 -10 1.95 22.93 -10 2.86 23.11 -10 2.23 22.7 -10
3 16 2.73 22.81 -10 2.59 22.71 -10 2.41 22.67 -10
3 16 2.41 22.67 -10 2.23 22.7 -10 2.86 23.11 -10
3 16 2.86 23.11 -10 1.95 22.93 -10 1.89 23.1 -10
4 16 5.27 23.16 -10 6.09 24.42 -10 6.04 23.08 -10 5.29 22.96 -10
4 16 5.29 22.96 -10 6.04 23.08 -10 5.97 22.88 -10 5.4 22.79 -10
4 16 5.4 22.79 -10 5.97 22.88 -10 5.81 22.72 -10 5.59 22.68 -10
3 16 6.09 24.42 -10 5.27 23.16 -10 5.27 24.45 -10
4 16 4.34 24.44 -10 4.34 21.91 -10 3.78 21.95 -10 3.8 24.52 -10
4 16 2.85 25.35 -10 5.27 24.45 -10 4.34 24.44 -10 3.8 24.52 -10
4 16 3.04 24.54 -10 2.82 24.36 -10 2.72 24.51 -10 2.85 25.35 -10
4 16 2.85 25.35 -10 2.72 24.51 -10 2.48 24.55 -10 2.52 25.42 -10
4 16 9.5 30.76 -10 9.42 25.34 -10 7.01 24.42 -10 6.09 24.42 -10
4 16 2.89 30.73 -10 9.5 30.76 -10 6.09 24.42 -10 5.27 24.45 -10
4 16 2.23 24.55 -10 2.03 25.45 -10 2.52 25.42 -10 2.48 24.55 -10
3 16 2.89 30.73 -10 5.27 24.45 -10 2.85 25.35 -10
4 16 1.95 24.51 -10 1.45 25.29 -10 2.03 25.45 -10 2.23 24.55 -10
3 16 3.04 24.54 -10 2.85 25.35 -10 3.8 24.52 -10
4 16 1.69 24.4 -10 1.04 24.98 -10 1.45 25.29 -10 1.95 24.51 -10
4 16 0.34 24.4 -10 0.25 25.38 -10 0.79 25.22 -10 1.04 24.98 -10
3 16 0.06 24.45 -10 0.25 25.38 -10 0.34 24.4 -10
4 16 -0.58 24.44 -10 -1.22 25.18 -10 -0.64 25.39 -10 -0.26 24.48 -10
4 16 -0.26 24.48 -10 -0.64 25.39 -10 0.25 25.38 -10 0.06 24.45 -10
4 16 -2.3 25.37 -10 -1.84 25.16 -10 -2.2 24.5 -10 -2.53 24.55 -10
4 16 -1.84 25.16 -10 -1.58 24.93 -10 -1.93 24.42 -10 -2.2 24.5 -10
4 16 -3.03 25.42 -10 -2.3 25.37 -10 -2.53 24.55 -10 -2.93 24.55 -10
4 16 -3.33 24.48 -10 -3.78 25.23 -10 -3.51 25.32 -10 -2.93 24.55 -10
3 16 -3.51 25.32 -10 -3.03 25.42 -10 -2.93 24.55 -10
4 16 -10.09 30.62 -10 -3.84 30.7 -10 -6.72 24.37 -10 -7.35 24.09 -10
4 16 -3.84 30.7 -10 -3.78 25.23 -10 -6.04 24.39 -10 -6.72 24.37 -10
4 16 -5.4 24.14 -10 -6.04 24.39 -10 -3.78 25.23 -10 -3.93 24.04 -10
4 16 -4.9 23.67 -10 -4.12 23.73 -10 -4.22 23.37 -10 -4.62 23.04 -10
4 16 -3.93 24.04 -10 -4.12 23.73 -10 -4.9 23.67 -10 -5.4 24.14 -10
3 16 1.47 24.26 -10 1.04 24.98 -10 1.69 24.4 -10
3 16 -3.93 24.04 -10 -3.78 25.23 -10 -3.67 24.3 -10
4 16 1.04 24.98 -10 1.47 24.26 -10 1.3 24.09 -10 0.56 24.28 -10
3 16 -3.33 24.48 -10 -3.67 24.3 -10 -3.78 25.23 -10
3 16 0.96 23.47 -10 0.92 23.32 -10 0.64 23.96 -10
3 16 0.96 23.47 -10 0.64 23.96 -10 1.02 23.64 -10
4 16 0.64 23.96 -10 0.56 24.28 -10 1.3 24.09 -10 1.14 23.87 -10
3 16 1.14 23.87 -10 1.02 23.64 -10 0.64 23.96 -10
3 16 0.56 24.28 -10 0.34 24.4 -10 1.04 24.98 -10
4 16 -1.18 23.88 -10 -1.88 23.6 -10 -1.93 24.42 -10 -1.05 24.13 -10
3 16 -1.58 24.93 -10 -1.05 24.13 -10 -1.93 24.42 -10
4 16 -1.86 22.69 -10 -1.88 23.6 -10 -1.21 22.96 -10 -1.54 22.33 -10
3 16 -1.21 22.96 -10 -1.21 22.36 -10 -1.54 22.33 -10
3 16 -1.22 25.18 -10 -0.58 24.44 -10 -0.85 24.33 -10
3 16 -1.21 23.49 -10 -1.21 22.96 -10 -1.88 23.6 -10
3 16 -1.18 23.88 -10 -1.21 23.49 -10 -1.88 23.6 -10
4 16 3.5 17.88 -10 9.36 22.09 -10 9.26 15.14 -10 3.43 17.18 -10
3 16 2.82 15.95 -10 9.26 15.14 -10 2.24 15.41 -10
3 16 3.21 16.57 -10 9.26 15.14 -10 2.82 15.95 -10
4 16 7.01 24.42 -10 9.42 25.34 -10 9.36 22.09 -10 6.93 22.44 -10
3 16 6.77 22.04 -10 6.93 22.44 -10 9.36 22.09 -10
4 16 2.64 21.89 -10 2.88 22.1 -10 2.93 21.95 -10 3.5 17.88 -10
3 16 2.64 21.89 -10 3.5 17.88 -10 2.35 21.86 -10
4 16 6.43 21.86 -10 6.77 22.04 -10 9.36 22.09 -10 3.5 17.88 -10
4 16 3.5 17.88 -10 2.93 21.95 -10 3.78 21.95 -10 4.34 21.91 -10
3 16 5.24 21.91 -10 5.44 22.07 -10 5.71 21.93 -10
3 16 5.24 21.91 -10 3.5 17.88 -10 4.34 21.91 -10
3 16 3.5 17.88 -10 6.07 21.81 -10 6.43 21.86 -10
4 16 1.78 14.37 -10 1.45 15.07 -10 2.24 15.41 -10 2.89 15 -10
4 16 1.78 14.37 -10 0.39 13.96 -10 0.66 14.74 -10 1.45 15.07 -10
4 16 -1.41 13.98 -10 -2.82 14.55 -10 -1.61 14.83 -10 -0.9 14.67 -10
3 16 -2.31 15.04 -10 -1.61 14.83 -10 -2.82 14.55 -10
3 16 0.66 14.74 -10 0.39 13.96 -10 -0.13 14.68 -10
4 16 -3.07 15.79 -10 -2.82 14.55 -10 -3.59 15.16 -10 -3.63 15.89 -10
4 16 -2.31 15.04 -10 -2.82 14.55 -10 -3.07 15.79 -10 -2.55 15.75 -10
4 16 -1.73 16.04 -10 -1.1 15.6 -10 -1.52 15.37 -10 -2.12 15.87 -10
4 16 -2.12 15.87 -10 -1.52 15.37 -10 -1.91 15.22 -10 -2.55 15.75 -10
3 16 -1.91 15.22 -10 -2.31 15.04 -10 -2.55 15.75 -10
4 16 -0.74 15.95 -10 -1.1 15.6 -10 -1.34 16.42 -10 -0.46 16.42 -10
4 16 -1.07 16.86 -10 -0.26 16.97 -10 -0.46 16.42 -10 -1.34 16.42 -10
4 16 -0.93 17.42 -10 -0.21 17.58 -10 -0.26 16.97 -10 -1.07 16.86 -10
3 16 -1.1 15.6 -10 -1.73 16.04 -10 -1.34 16.42 -10
4 16 -0.88 18 -10 -0.08 18.15 -10 -0.21 17.58 -10 -0.93 17.42 -10
4 16 -0.08 18.15 -10 -0.88 18 -10 -0.74 18.56 -10 0.16 18.61 -10
4 16 0.16 18.61 -10 -0.74 18.56 -10 -0.45 19.04 -10 -0.12 19.4 -10
4 16 1.05 19.32 -10 0.31 19.7 -10 0.79 19.9 -10 1.3 20.07 -10
3 16 1.05 19.32 -10 1.3 20.07 -10 1.71 19.44 -10
3 16 -0.12 19.4 -10 0.51 19.04 -10 0.16 18.61 -10
3 16 6.72 14.85 -10 4.74 14.93 -10 9.26 15.14 -10
4 16 5.52 13.63 -10 2.89 15 -10 4.74 14.93 -10 5.54 14.28 -10
4 16 5.52 13.63 -10 5.87 13.84 -10 6.18 13.33 -10 6.16 12.16 -10
3 16 5.42 7.71 -10 5.7 6.49 -10 2.91 6.33 -10
4 16 2.89 15 -10 5.52 13.63 -10 5.65 10.79 -10 5.37 9.32 -10
3 16 6.97 13.28 -10 6.16 12.16 -10 6.18 13.33 -10
3 16 6.16 12.16 -10 5.65 10.79 -10 5.52 13.63 -10
3 16 14.35 2 -10 15.07 15.75 -10 19 29 -10
4 16 15.17 21.94 -10 15.55 26.53 -10 19 29 -10 15.15 19.67 -10
3 16 15.07 15.75 -10 15.13 17.74 -10 19 29 -10
3 16 7 4.9 -10 7.28 4.8 -10 6.59 4.13 -10
4 16 4.6 3.97 -10 4.68 3.5 -10 4.09 3.32 -10 2.02 4.48 -10
4 16 2.5 5.75 -10 4.6 3.97 -10 2.02 4.48 -10 0.15 5.49 -10
3 16 5.77 4.23 -10 5.52 4.02 -10 5 4.68 -10
4 16 -5.19 3.99 -10 -5.8 3.81 -10 -5.69 4.68 -10 -3.64 5.54 -10
3 16 -4.56 3.29 -10 -5.17 3.61 -10 -5.19 3.99 -10
3 16 -9.44 3.42 -10 -9.58 8.44 -10 -8.36 5.19 -10
4 16 -6.29 5.05 -10 -6.63 4.84 -10 -7.34 6.55 -10 -6.51 8.03 -10
3 16 -5.67 3.14 -10 -6.05 2 -10 -6.46 3.21 -10
4 16 14.26 29.66 -10 13.73 29.25 -10 13.8 29.68 -10 14.01 29.76 -10
4 16 13.73 29.25 -10 14.26 29.66 -10 14.36 29.41 -10 14.26 29.17 -10
4 16 14.78 30.23 -10 15.36 30.04 -10 15.32 29.85 -10 14.68 29.98 -10
4 16 15.32 29.85 -10 15.28 29.73 -10 15.03 29.63 -10 14.78 29.73 -10
3 16 14.68 29.98 -10 15.32 29.85 -10 14.78 29.73 -10
3 16 14.49 30.43 -10 14.83 30.76 -10 14.74 30.53 -10
3 16 14.54 25.72 -10 14.44 25.47 -10 14.51 25.78 -10
4 16 13.57 23.19 -10 13.2 22.84 -10 13.23 23.26 -10 13.32 23.3 -10
4 16 13.2 22.84 -10 13.57 23.19 -10 13.67 22.95 -10 13.57 22.7 -10
3 16 13.48 21.88 -10 13.25 21.29 -10 13.23 21.98 -10
4 16 13.95 18.86 -10 14.14 18.93 -10 14.39 18.83 -10 14.49 18.58 -10
4 16 14.6 19.73 -10 14.6 19.64 -10 14.48 19.6 -10 14.23 19.7 -10
3 16 14.6 19.73 -10 14.23 19.7 -10 14.13 19.95 -10
3 16 14.48 20.3 -10 14.59 20.25 -10 14.23 20.19 -10
3 16 13.87 20.39 -10 13.63 20.49 -10 13.52 20.74 -10
4 16 14.12 20.99 -10 13.52 20.74 -10 13.63 20.99 -10 13.87 21.09 -10
3 16 14.22 20.74 -10 13.52 20.74 -10 14.12 20.99 -10
4 16 14.46 22.15 -10 14.36 21.9 -10 14.11 21.8 -10 13.76 22.15 -10
3 16 14.11 21.8 -10 13.86 21.9 -10 13.76 22.15 -10
3 16 14.46 22.15 -10 14.11 22.5 -10 14.36 22.4 -10
4 16 14.23 23.53 -10 14.72 23.82 -10 14.66 23.21 -10 14.33 23.28 -10
3 16 14.66 23.21 -10 14.58 23.18 -10 14.33 23.28 -10
4 16 14.15 24.36 -10 14.05 24.11 -10 13.8 24.01 -10 13.8 24.71 -10
3 16 13.8 24.71 -10 13.45 24.36 -10 13.55 24.61 -10
3 16 14.15 24.36 -10 13.8 24.71 -10 14.05 24.61 -10
4 16 14.48 24.98 -10 14.88 25.31 -10 14.81 24.64 -10 14.58 24.73 -10
4 16 14.24 27.42 -10 14.75 27.38 -10 14.15 27.15 -10 14.14 27.17 -10
3 16 13.61 28.31 -10 13.81 27.69 -10 13.56 27.79 -10
4 16 13.61 28.31 -10 13.81 28.39 -10 14.05 28.28 -10 14.16 28.04 -10
4 16 14.36 28.56 -10 14.46 28.81 -10 14.71 28.91 -10 14.95 28.81 -10
4 16 14.36 28.56 -10 14.95 28.81 -10 15.06 28.56 -10 14.95 28.32 -10
4 16 14.75 27.38 -10 14.84 27.17 -10 14.73 26.92 -10 14.49 26.82 -10
4 16 13.46 26.89 -10 13.58 26.93 -10 13.8 26.84 -10 13.91 26.59 -10
3 16 13.43 26.29 -10 13.46 26.89 -10 13.91 26.59 -10
3 16 13.37 24.96 -10 13.35 24.95 -10 13.38 25.57 -10
4 16 13.94 25.97 -10 14.51 25.78 -10 14.03 25.44 -10 13.84 25.72 -10
3 16 13.84 25.72 -10 14.03 25.44 -10 13.94 25.47 -10
3 16 -15.37 25.26 -10 -15.23 25.32 -10 -14.99 25.22 -10
4 16 -15.3 24.65 -10 -14.88 24.97 -10 -14.99 24.72 -10 -15.23 24.62 -10
4 16 -14.72 23.6 -10 -15.13 23.28 -10 -15.2 23.9 -10 -14.82 23.85 -10
3 16 -14.82 23.85 -10 -15.2 23.9 -10 -15.07 23.95 -10
4 16 -14.69 22.5 -10 -14.98 22.11 -10 -15 22.25 -10 -14.94 22.4 -10
4 16 -14.98 22.11 -10 -14.69 22.5 -10 -14.45 22.4 -10 -14.34 22.15 -10
3 16 -14.98 22.11 -10 -14.34 22.15 -10 -14.45 21.9 -10
3 16 -14.94 21.9 -10 -14.98 22 -10 -14.69 21.8 -10
4 16 -14.57 19.87 -10 -14.96 19.53 -10 -14.96 20.2 -10 -14.67 20.12 -10
3 16 -14.96 20.2 -10 -14.92 20.22 -10 -14.67 20.12 -10
4 16 -14.75 19.22 -10 -14.25 19.19 -10 -14.43 18.66 -10 -14.86 18.98 -10
4 16 -14.43 18.66 -10 -14.51 18.63 -10 -14.75 18.73 -10 -14.86 18.98 -10
4 16 -14.81 20.74 -10 -14.21 20.49 -10 -14.46 20.39 -10 -14.71 20.49 -10
3 16 -14.46 21.09 -10 -14.81 20.74 -10 -14.71 20.99 -10
3 16 -14.11 20.74 -10 -14.46 21.09 -10 -14.21 20.99 -10
4 16 -14.06 21.38 -10 -13.71 21.94 -10 -13.79 21.29 -10 -13.81 21.28 -10
3 16 -13.71 21.94 -10 -14.06 21.38 -10 -14.16 21.63 -10
4 16 -13.76 22.79 -10 -13.8 22.69 -10 -14.04 22.59 -10 -14.29 22.69 -10
4 16 -13.76 22.79 -10 -14.29 22.69 -10 -14.39 22.94 -10 -14.29 23.19 -10
4 16 -14.14 24.61 -10 -14.03 24.36 -10 -14.14 24.11 -10 -14.38 24.71 -10
3 16 -14.63 24.11 -10 -14.73 24.36 -10 -14.38 24.01 -10
3 16 -14.63 24.61 -10 -14.38 24.71 -10 -14.73 24.36 -10
3 16 -14.2 25.27 -10 -13.91 24.94 -10 -14.1 25.02 -10
4 16 -15.12 25.72 -10 -14.53 25.47 -10 -14.77 25.37 -10 -15.02 25.47 -10
4 16 -15.12 25.72 -10 -15.02 25.97 -10 -14.77 26.07 -10 -14.53 25.97 -10
4 16 -14.01 26.42 -10 -14 26.3 -10 -14.14 26.24 -10 -14.39 26.34 -10
3 16 -14.49 26.59 -10 -14.01 26.42 -10 -14.39 26.34 -10
3 16 -14.39 26.84 -10 -14.14 26.94 -10 -14.07 26.91 -10
4 16 -14.72 27.17 -10 -14.82 26.92 -10 -15.07 26.82 -10 -15.07 27.52 -10
3 16 -15.32 27.42 -10 -15.07 27.52 -10 -15.42 27.17 -10
3 16 -14.82 27.42 -10 -14.72 27.17 -10 -15.07 27.52 -10
4 16 -14.64 27.79 -10 -14.23 28.32 -10 -14.17 27.78 -10 -14.39 27.69 -10
3 16 -14.74 28.04 -10 -14.23 28.32 -10 -14.64 27.79 -10
3 16 -15.64 28.56 -10 -15.29 28.21 -10 -15.54 28.32 -10
4 16 -15.64 28.56 -10 -15.54 28.81 -10 -15.29 28.91 -10 -15.04 28.81 -10
3 16 -15.04 28.81 -10 -14.94 28.56 -10 -15.64 28.56 -10
4 16 -15.96 29.96 -10 -15.96 29.99 -10 -15.86 30.23 -10 -15.61 30.33 -10
4 16 -15.96 29.96 -10 -15.61 30.33 -10 -15.37 30.23 -10 -15.26 29.98 -10
3 16 -15.96 29.96 -10 -15.26 29.98 -10 -15.37 29.73 -10
4 16 -14.41 29.69 -10 -14.33 29.17 -10 -14.59 29.06 -10 -14.84 29.17 -10
3 16 -14.41 29.69 -10 -14.84 29.17 -10 -14.94 29.41 -10
3 16 -14.79 30.62 -10 -14.83 30.53 -10 -15.07 30.43 -10
4 16 6.37 0.59 -10 -7.14 0.49 -10 -4.91 1.01 -10 4.35 1.05 -10
4 16 -4.91 1.01 -10 -2.49 1.49 -10 -0.22 1.61 -10 4.35 1.05 -10
3 16 2.02 1.51 -10 4.35 1.05 -10 -0.22 1.61 -10
4 16 15.33 19.89 10 12.28 3.77 10 14.35 2 10 19 29 10
4 16 11.42 1.98 10 12 0 10 14.35 2 10 11.89 2.55 10
4 16 19 29 10 19 32 10 15.45 30.97 10 15.33 19.89 10
3 16 5.38 5.28 10 6.4 5.03 10 9.25 30.97 10
4 16 -19 32 10 -3.21 30.89 10 3.21 30.89 10 19 32 10
4 16 5.71 2.07 10 8.25 2 10 7.79 3.07 10 5.7 2.2 10
3 16 9.15 1.67 10 8.99 2 10 8.25 2 10
4 16 5.7 2.2 10 7.79 3.07 10 7.29 3.68 10 5.62 2.28 10
4 16 6.73 4.1 10 5.54 2.36 10 5.62 2.28 10 7.29 3.68 10
4 16 2.93 5.05 10 1.31 2.78 10 3.3 2.62 10 4.07 4.85 10
4 16 -15.33 19.89 10 -19 29 10 -14.35 2 10 -12.28 3.77 10
4 16 -14.35 2 10 -12 0 10 -11.42 1.98 10 -11.89 2.55 10
4 16 -15.45 30.97 10 -19 32 10 -19 29 10 -15.33 19.89 10
3 16 -6.4 5.03 10 -5.38 5.28 10 -9.25 30.97 10
4 16 -7.79 3.07 10 -8.25 2 10 -5.71 2.07 10 -5.7 2.2 10
3 16 -8.99 2 10 -9.15 1.67 10 -8.25 2 10
4 16 -7.29 3.68 10 -5.7 2.2 10 -5.62 2.28 10 -6.73 4.1 10
4 16 0 5.26 10 -2.93 5.05 10 -1.31 2.78 10 0 2.85 10
4 16 -12 0 10 -3.42 2.14 10 -5.71 2.07 10 -9.15 1.67 10
3 16 11.89 2.55 10 14.35 2 10 12.28 3.77 10
3 16 11.42 1.98 10 10.8 1.64 10 12 0 10
3 16 8.46 3.3 10 8.99 2 10 9.25 30.97 10
4 16 4.29 5.54 10 9.25 30.97 10 3.21 30.89 10 2.99 5.82 10
3 16 8.46 3.3 10 9.25 30.97 10 7.94 4.06 10
3 16 7.94 4.06 10 9.25 30.97 10 7.28 4.62 10
3 16 4.29 5.54 10 5.38 5.28 10 9.25 30.97 10
3 16 7.28 4.62 10 9.25 30.97 10 6.4 5.03 10
3 16 19 32 10 9.25 30.97 10 15.45 30.97 10
3 16 9.25 30.97 10 19 32 10 3.21 30.89 10
3 16 -19 32 10 -15.45 30.97 10 -9.25 30.97 10
3 16 -9.25 30.97 10 -3.21 30.89 10 -19 32 10
4 16 5.11 4.65 10 3.3 2.62 10 5.54 2.36 10 6.01 4.42 10
3 16 5.54 2.36 10 6.73 4.1 10 6.01 4.42 10
3 16 3.3 2.62 10 5.11 4.65 10 4.07 4.85 10
4 16 1.31 2.78 10 2.93 5.05 10 0 5.26 10 0 2.85 10
3 16 -12.28 3.77 10 -14.35 2 10 -11.89 2.55 10
3 16 -12 0 10 -10.8 1.64 10 -11.42 1.98 10
3 16 -9.25 30.97 10 -8.99 2 10 -8.46 3.3 10
3 16 -9.25 30.97 10 -8.46 3.3 10 -7.94 4.06 10
4 16 -4.29 5.54 10 -2.99 5.82 10 -3.21 30.89 10 -9.25 30.97 10
3 16 -7.94 4.06 10 -7.28 4.62 10 -9.25 30.97 10
3 16 -7.28 4.62 10 -6.4 5.03 10 -9.25 30.97 10
3 16 -4.29 5.54 10 -9.25 30.97 10 -5.38 5.28 10
3 16 -7.79 3.07 10 -5.7 2.2 10 -7.29 3.68 10
4 16 -6.73 4.1 10 -5.62 2.28 10 -5.54 2.36 10 -6.01 4.42 10
4 16 -5.54 2.36 10 -3.3 2.62 10 -5.11 4.65 10 -6.01 4.42 10
4 16 -3.3 2.62 10 -1.31 2.78 10 -2.93 5.05 10 -4.07 4.85 10
3 16 -3.3 2.62 10 -4.07 4.85 10 -5.11 4.65 10
3 16 -10.8 1.64 10 -12 0 10 -9.15 1.67 10
4 16 -12 0 10 12 0 10 1.35 2.21 10 -1.35 2.21 10
3 16 10.8 1.64 10 9.15 1.67 10 12 0 10
4 16 9.15 1.67 10 8.25 2 10 5.71 2.07 10 12 0 10
3 16 3.42 2.14 10 1.35 2.21 10 12 0 10
3 16 1.35 2.21 10 0 2.24 10 -1.35 2.21 10
3 16 12 0 10 5.71 2.07 10 3.42 2.14 10
3 16 -8.25 2 10 -9.15 1.67 10 -5.71 2.07 10
3 16 -3.42 2.14 10 -12 0 10 -1.35 2.21 10

0 // Edge_Colour
2 24 -19 32 -10 19 32 -10
2 24 12 0 -10 14.35 2 -10
2 24 19 32 -10 19 29 -10
2 24 -14.35 2 -10 -19 29 -10
2 24 -19 32 -10 -19 29 -10
2 24 12 0 -10 -12 0 -10
2 24 -12 0 -10 -14.35 2 -10
2 24 14.35 2 -10 19 29 -10
2 24 19 32 10 19 29 10
2 24 19 29 10 14.35 2 10
2 24 14.35 2 10 12 0 10
2 24 -19 32 10 -19 29 10
2 24 -19 29 10 -14.35 2 10
2 24 19 32 10 -19 32 10
2 24 -14.35 2 10 -12 0 10
2 24 -12 0 10 12 0 10

0 // Metallic_Gold
4 82 -14.59 29.06 -10 -14.94 28.56 -10 -15.04 28.81 -10 -14.84 29.17 -10
4 82 -11.24 2.26 -10 -10.05 1.66 -10 -11.17 1.43 -10 -11.98 2 -10
4 82 12.13 2.75 -10 11.28 2 -10 10.98 2.69 -10 12.28 3.81 -10
4 82 13.03 3.3 -10 12.13 2.75 -10 12.28 3.81 -10 13.29 4.93 -10
4 82 10.2 1.33 -10 9.61 1.93 -10 10.98 2.69 -10 11.28 2 -10
4 82 -12.52 3.4 -10 -11.24 2.26 -10 -11.98 2 -10 -13.13 2.85 -10
4 82 4.31 1.72 -10 2.12 2.19 -10 3.45 3.07 -10 4.67 2.01 -10
4 82 -5.06 2 -10 -3.92 2.89 -10 -4.92 1.6 -10 -5.83 1.33 -10
4 82 10.2 1.33 -10 9.66 1.25 -10 9.48 1.55 -10 9.61 1.93 -10
4 82 -10.96 9.33 -10 -9.56 9.61 -10 -8.05 9.29 -10 -7.08 8.78 -10
4 82 14.19 25.37 -10 14.05 24.61 -10 13.8 24.71 -10 14.03 25.44 -10
4 82 14.36 29.41 -10 14.26 29.66 -10 14.78 29.73 -10 15.03 29.63 -10
4 82 14.15 27.15 -10 14.24 26.92 -10 13.8 26.84 -10 13.58 26.93 -10
4 82 9.37 13.08 -10 9.19 12.63 -10 8.95 12.9 -10 8.75 13.67 -10
4 82 10.84 7.8 -10 10.13 8.33 -10 10.43 9.02 -10 11.58 8.11 -10
4 82 10.44 10.84 -10 10.46 10.96 -10 10.99 11.06 -10 10.77 10.32 -10
4 82 6.05 7.74 -10 7.07 8.37 -10 7.55 8.05 -10 6.8 7.52 -10
4 82 6.47 9.87 -10 5.98 9.32 -10 6.3 10.66 -10 6.6 10.49 -10
4 82 6.99 10.96 -10 6.6 10.49 -10 6.3 10.66 -10 6.89 11.96 -10
4 82 7.71 12.09 -10 7.47 11.87 -10 7.23 11.92 -10 7.79 12.4 -10
4 82 8.71 11.67 -10 8.47 11.69 -10 8.48 12.25 -10 8.73 12.27 -10
3 82 4.67 2.01 -10 5.32 1.39 -10 4.31 1.72 -10
4 82 -9.94 9.93 -10 -10.09 10.21 -10 -9.96 10.5 -10 -9.63 9.87 -10
4 82 -9.16 10.52 -10 -9.61 10.85 -10 -9.28 11.34 -10 -8.87 11.72 -10
3 82 -9.9 12.41 -10 -10.43 13.07 -10 -9.37 12.58 -10
4 82 -9.42 12.3 -10 -9.14 11.82 -10 -9.82 11.92 -10 -9.71 12.21 -10
3 82 -7.1 11.65 -10 -7.26 12.2 -10 -6.59 12.58 -10
4 82 -8.52 9.61 -10 -9.14 9.97 -10 -9.16 10.52 -10 -8.57 10.17 -10
4 82 -8.31 10.08 -10 -7.7 9.66 -10 -8.01 9.57 -10 -8.28 9.75 -10
4 82 -7.78 12.42 -10 -8.28 12.14 -10 -8.91 12.27 -10 -9.37 12.58 -10
4 82 -7.46 12.01 -10 -7.89 11.41 -10 -8.11 11.66 -10 -7.77 12.14 -10
4 82 14.58 22.47 -10 14.36 22.4 -10 14.11 22.5 -10 14.58 23.18 -10
4 82 14.12 20.99 -10 14.11 21.8 -10 14.36 21.9 -10 14.22 20.74 -10
4 82 13.66 19.55 -10 14.13 19.95 -10 14.23 19.7 -10 14.14 18.93 -10
3 82 14.95 28.32 -10 15.06 28.56 -10 15.07 27.5 -10
4 82 -14.64 27.79 -10 -14.39 27.69 -10 -14.82 27.42 -10 -15.07 27.52 -10
4 82 -14.53 25.97 -10 -14.39 26.34 -10 -14.14 26.24 -10 -14.42 25.72 -10
4 82 -14.63 24.61 -10 -14.73 24.36 -10 -14.99 24.72 -10 -14.88 24.97 -10
4 82 -14.39 22.94 -10 -14.29 22.69 -10 -14.69 22.5 -10 -15.07 23.25 -10
4 82 -14.75 19.22 -10 -14.92 19.52 -10 -14.67 19.62 -10 -14.51 19.33 -10
4 82 1.68 4 -10 2.12 2.19 -10 -0.2 2.33 -10 -0.36 4.96 -10
4 82 -15.61 30.33 -10 -16.04 30.62 -10 -15.36 30.62 -10 -15.32 30.53 -10
4 82 -15.32 30.53 -10 -15.07 30.43 -10 -15.37 30.23 -10 -15.61 30.33 -10
3 82 -15.96 29.99 -10 -16.04 30.62 -10 -15.86 30.23 -10
3 82 -15.86 30.23 -10 -16.04 30.62 -10 -15.61 30.33 -10
4 82 -14.83 30.53 -10 -14.79 30.62 -10 -14.54 30.62 -10 -14.59 29.76 -10
4 82 -15.26 29.98 -10 -15.37 30.23 -10 -15.07 30.43 -10 -14.59 29.76 -10
3 82 -14.59 29.76 -10 -15.07 30.43 -10 -14.83 30.53 -10
3 82 -14.54 30.62 -10 -14.41 29.69 -10 -14.59 29.76 -10
4 82 -14.84 29.66 -10 -15.37 29.73 -10 -15.26 29.98 -10 -14.59 29.76 -10
4 82 -14.94 29.41 -10 -15.61 29.63 -10 -15.37 29.73 -10 -14.84 29.66 -10
3 82 -15.86 29.73 -10 -15.84 29 -10 -15.96 29.96 -10
4 82 -15.29 28.91 -10 -15.61 29.63 -10 -14.94 29.41 -10 -14.84 29.17 -10
4 82 -15.84 29 -10 -15.86 29.73 -10 -15.61 29.63 -10 -15.29 28.91 -10
3 82 -15.84 29 -10 -15.54 28.81 -10 -15.64 28.56 -10
3 82 -15.84 29 -10 -15.29 28.91 -10 -15.54 28.81 -10
4 82 -14.39 28.39 -10 -14.59 29.06 -10 -14.33 29.17 -10 -14.23 28.32 -10
3 82 -14.84 29.17 -10 -15.04 28.81 -10 -15.29 28.91 -10
4 82 -14.39 28.39 -10 -14.64 28.28 -10 -14.94 28.56 -10 -14.59 29.06 -10
4 82 -2.67 2.12 -10 -4.92 1.6 -10 -3.92 2.89 -10 -2.39 3.78 -10
3 82 -10.11 9.71 -10 -10.96 9.33 -10 -10.36 10.2 -10
4 82 -8.52 9.61 -10 -8.05 9.29 -10 -9.56 9.61 -10 -9.14 9.97 -10
3 82 -10.11 9.71 -10 -9.56 9.61 -10 -10.96 9.33 -10
4 82 14.54 25.72 -10 14.51 25.78 -10 14.96 26.11 -10 14.83 25.33 -10
3 82 14.96 26.11 -10 14.88 25.31 -10 14.83 25.33 -10
4 82 14.44 25.47 -10 14.54 25.72 -10 14.83 25.33 -10 14.58 25.23 -10
4 82 14.19 25.37 -10 14.44 25.47 -10 14.58 25.23 -10 14.48 24.98 -10
4 82 13.54 25.09 -10 14.03 25.44 -10 13.8 24.71 -10 13.51 25.02 -10
4 82 14.58 24.73 -10 14.81 24.64 -10 14.15 24.36 -10 14.05 24.61 -10
4 82 14.05 24.61 -10 14.19 25.37 -10 14.48 24.98 -10 14.58 24.73 -10
4 82 13.55 24.61 -10 13.35 24.95 -10 13.37 24.96 -10 13.51 25.02 -10
3 82 13.35 24.95 -10 13.55 24.61 -10 13.45 24.36 -10
3 82 13.51 25.02 -10 13.8 24.71 -10 13.55 24.61 -10
3 82 15.19 29 -10 15.28 29.73 -10 15.32 29.85 -10
3 82 15.06 28.56 -10 14.95 28.81 -10 15.19 29 -10
4 82 15.19 29 -10 14.95 28.81 -10 14.71 28.91 -10 15.03 29.63 -10
3 82 15.28 29.73 -10 15.19 29 -10 15.03 29.63 -10
4 82 14.01 29.06 -10 14.46 28.81 -10 14.36 28.56 -10 13.81 28.39 -10
4 82 14.05 28.28 -10 13.81 28.39 -10 14.36 28.56 -10 14.46 28.32 -10
4 82 14.36 29.41 -10 15.03 29.63 -10 14.71 28.91 -10 14.26 29.17 -10
4 82 14.26 29.17 -10 14.71 28.91 -10 14.46 28.81 -10 14.01 29.06 -10
4 82 13.76 29.17 -10 13.81 28.39 -10 13.61 28.31 -10 13.73 29.25 -10
3 82 13.76 29.17 -10 14.01 29.06 -10 13.81 28.39 -10
3 82 15.36 30.04 -10 15.28 30.23 -10 15.47 30.76 -10
4 82 15.03 30.33 -10 14.74 30.53 -10 14.83 30.76 -10 15.47 30.76 -10
4 82 14.78 30.23 -10 14.49 30.43 -10 14.74 30.53 -10 15.03 30.33 -10
3 82 15.47 30.76 -10 15.28 30.23 -10 15.03 30.33 -10
4 82 14.49 30.43 -10 14.78 30.23 -10 14.68 29.98 -10 14.01 29.76 -10
4 82 13.99 30.76 -10 14.15 30.76 -10 14.24 30.53 -10 14.01 29.76 -10
3 82 14.49 30.43 -10 14.01 29.76 -10 14.24 30.53 -10
4 82 14.26 29.66 -10 14.01 29.76 -10 14.68 29.98 -10 14.78 29.73 -10
3 82 13.99 30.76 -10 14.01 29.76 -10 13.8 29.68 -10
4 82 14.84 27.17 -10 15.07 27.5 -10 14.96 26.11 -10 14.73 26.92 -10
4 82 14.96 26.11 -10 14.51 25.78 -10 14.44 25.97 -10 14.49 26.82 -10
3 82 14.73 26.92 -10 14.96 26.11 -10 14.49 26.82 -10
3 82 14.84 27.17 -10 14.75 27.38 -10 15.07 27.5 -10
4 82 13.62 25.27 -10 13.94 25.47 -10 14.03 25.44 -10 13.54 25.09 -10
4 82 13.51 25.52 -10 13.84 25.72 -10 13.94 25.47 -10 13.62 25.27 -10
4 82 13.84 25.72 -10 13.51 25.52 -10 13.38 25.57 -10 13.56 26.24 -10
3 82 13.38 25.57 -10 13.43 26.29 -10 13.56 26.24 -10
4 82 13.94 25.97 -10 13.84 25.72 -10 13.56 26.24 -10 13.8 26.34 -10
4 82 14.19 26.07 -10 13.94 25.97 -10 13.8 26.34 -10 13.91 26.59 -10
4 82 14.19 26.07 -10 13.91 26.59 -10 14.49 26.82 -10 14.44 25.97 -10
4 82 13.91 26.59 -10 13.8 26.84 -10 14.24 26.92 -10 14.49 26.82 -10
4 82 8.3 12.96 -10 8.41 13.8 -10 8.75 13.67 -10 8.95 12.9 -10
4 82 9.29 12.14 -10 9.39 12.37 -10 10.16 12.2 -10 9.73 11.29 -10
4 82 9.37 13.08 -10 10.16 12.2 -10 9.39 12.37 -10 9.19 12.63 -10
4 82 8.3 12.96 -10 7.68 13.06 -10 8.08 13.63 -10 8.41 13.8 -10
4 82 8.95 12.9 -10 8.81 12.8 -10 8.48 12.81 -10 8.3 12.96 -10
4 82 9.54 7.44 -10 9.42 7.76 -10 9.87 8.22 -10 10.84 7.8 -10
3 82 10.84 7.8 -10 9.87 8.22 -10 10.13 8.33 -10
4 82 8.04 7.34 -10 6.8 7.52 -10 7.55 8.05 -10 9.42 7.76 -10
3 82 9.42 7.76 -10 9.54 7.44 -10 8.04 7.34 -10
4 82 10.89 9.39 -10 11.05 9.74 -10 11.45 9.78 -10 11.58 8.11 -10
3 82 10.43 9.02 -10 10.13 8.33 -10 9.96 8.83 -10
3 82 10.43 9.02 -10 10.89 9.39 -10 11.58 8.11 -10
4 82 10.97 10.1 -10 10.99 11.06 -10 11.45 9.78 -10 11.05 9.74 -10
4 82 10.13 11.22 -10 10.16 12.2 -10 10.99 11.06 -10 10.46 10.96 -10
4 82 9.1 11.39 -10 8.98 11.59 -10 9.08 11.94 -10 9.41 11.22 -10
4 82 9.08 11.94 -10 9.29 12.14 -10 9.73 11.29 -10 9.41 11.22 -10
3 82 10.16 12.2 -10 10.13 11.22 -10 9.73 11.29 -10
3 82 10.99 11.06 -10 10.97 10.1 -10 10.77 10.32 -10
4 82 10.44 10.84 -10 10.77 10.32 -10 10.57 10.05 -10 10.02 10.83 -10
4 82 10.02 10.83 -10 10.57 10.05 -10 10.27 9.86 -10 9.89 9.91 -10
4 82 9.89 9.91 -10 9.64 10.11 -10 9.59 10.36 -10 9.73 10.64 -10
3 82 9.73 10.64 -10 10.02 10.83 -10 9.89 9.91 -10
4 82 7.07 8.37 -10 6.05 7.74 -10 5.98 9.32 -10 6.47 9.87 -10
4 82 6.99 10.96 -10 6.89 11.96 -10 7.13 11.7 -10 7.35 11.19 -10
4 82 7.35 11.19 -10 7.41 10.81 -10 7.22 10.75 -10 6.99 10.96 -10
4 82 7.79 12.4 -10 6.89 11.96 -10 7.68 13.06 -10 8.13 12.78 -10
3 82 8.3 12.96 -10 8.13 12.78 -10 7.68 13.06 -10
3 82 6.89 11.96 -10 7.79 12.4 -10 7.23 11.92 -10
3 82 7.23 11.92 -10 7.13 11.7 -10 6.89 11.96 -10
4 82 7.75 11.73 -10 7.6 11.65 -10 7.47 11.87 -10 7.71 12.09 -10
4 82 8.73 12.27 -10 8.48 12.25 -10 8.48 12.81 -10 8.81 12.8 -10
3 82 8.71 11.67 -10 8.58 11.56 -10 8.47 11.69 -10
4 82 -9.96 10.5 -10 -9.66 10.58 -10 -9.4 10.39 -10 -9.39 10.08 -10
3 82 -9.63 9.87 -10 -9.96 10.5 -10 -9.39 10.08 -10
4 82 -10.1 11.9 -10 -10.14 10.71 -10 -10.36 10.2 -10 -10.96 9.33 -10
3 82 -10.43 13.07 -10 -10.1 11.9 -10 -10.96 9.33 -10
4 82 -10.14 10.71 -10 -10.1 11.9 -10 -9.82 11.42 -10 -9.61 10.85 -10
3 82 -9.28 11.34 -10 -9.61 10.85 -10 -9.82 11.42 -10
4 82 -10.43 13.07 -10 -6.59 12.58 -10 -7.78 12.42 -10 -9.37 12.58 -10
3 82 -10.43 13.07 -10 -9.9 12.41 -10 -10.1 11.9 -10
3 82 -9.16 12.13 -10 -9.14 11.82 -10 -9.42 12.3 -10
4 82 -9.14 11.82 -10 -9.36 11.61 -10 -9.67 11.65 -10 -9.82 11.92 -10
4 82 -8.37 11.58 -10 -9.16 10.52 -10 -8.87 11.72 -10 -8.28 12.14 -10
4 82 -8.15 10.56 -10 -8.57 10.17 -10 -9.16 10.52 -10 -8.37 11.58 -10
4 82 -8.15 10.56 -10 -8.37 11.58 -10 -7.99 11.16 -10 -7.59 10.48 -10
3 82 -7.99 11.16 -10 -7.43 11.19 -10 -7.59 10.48 -10
4 82 -7.31 9.99 -10 -7.59 10.48 -10 -7.43 11.19 -10 -7.1 11.65 -10
3 82 -7.51 9.46 -10 -7.08 8.78 -10 -8.05 9.29 -10
3 82 -7.31 9.99 -10 -7.08 8.78 -10 -7.51 9.46 -10
3 82 -6.59 12.58 -10 -7.26 12.2 -10 -7.78 12.42 -10
4 82 -6.59 12.58 -10 -7.08 8.78 -10 -7.31 9.99 -10 -7.1 11.65 -10
4 82 -8.31 10.08 -10 -8.07 10.3 -10 -7.75 10.25 -10 -7.58 9.97 -10
3 82 -8.31 10.08 -10 -7.58 9.97 -10 -7.7 9.66 -10
3 82 -8.87 11.72 -10 -8.91 12.27 -10 -8.28 12.14 -10
3 82 -7.77 12.14 -10 -8.11 11.66 -10 -8.05 11.98 -10
4 82 -7.46 12.01 -10 -7.37 11.7 -10 -7.56 11.43 -10 -7.89 11.41 -10
3 82 13.35 24.95 -10 13.45 24.36 -10 13.23 23.26 -10
4 82 13.23 23.26 -10 13.45 24.36 -10 13.55 24.11 -10 13.32 23.3 -10
4 82 13.32 23.3 -10 13.55 24.11 -10 13.8 24.01 -10 13.57 23.19 -10
4 82 14.58 23.88 -10 14.05 24.11 -10 14.15 24.36 -10 14.81 24.64 -10
4 82 14.23 23.53 -10 13.57 23.19 -10 13.8 24.01 -10 14.33 23.77 -10
4 82 14.33 23.77 -10 13.8 24.01 -10 14.05 24.11 -10 14.58 23.88 -10
4 82 14.33 23.28 -10 13.67 22.95 -10 13.57 23.19 -10 14.23 23.53 -10
3 82 14.81 24.64 -10 14.72 23.82 -10 14.58 23.88 -10
4 82 14.11 22.5 -10 13.57 22.7 -10 13.67 22.95 -10 14.33 23.28 -10
3 82 14.58 22.47 -10 14.58 23.18 -10 14.66 23.21 -10
3 82 14.11 22.5 -10 14.33 23.28 -10 14.58 23.18 -10
4 82 13.23 21.98 -10 13.2 22.65 -10 13.32 22.6 -10 13.76 22.15 -10
4 82 13.32 22.6 -10 13.57 22.7 -10 13.86 22.4 -10 13.76 22.15 -10
3 82 14.58 22.47 -10 14.46 22.15 -10 14.36 22.4 -10
3 82 14.11 22.5 -10 13.86 22.4 -10 13.57 22.7 -10
4 82 13.26 21.09 -10 13.25 21.29 -10 13.48 21.38 -10 13.63 20.99 -10
3 82 13.63 20.99 -10 13.52 20.74 -10 13.26 21.09 -10
4 82 13.87 21.09 -10 13.63 20.99 -10 13.48 21.38 -10 13.58 21.63 -10
4 82 13.48 21.88 -10 13.23 21.98 -10 13.76 22.15 -10 13.86 21.9 -10
4 82 14.11 21.8 -10 13.87 21.09 -10 13.58 21.63 -10 13.86 21.9 -10
3 82 13.58 21.63 -10 13.48 21.88 -10 13.86 21.9 -10
4 82 14.59 20.25 -10 14.22 20.74 -10 14.36 21.9 -10 14.46 22.15 -10
3 82 14.12 20.99 -10 13.87 21.09 -10 14.11 21.8 -10
3 82 14.46 22.15 -10 14.58 22.47 -10 14.59 20.25 -10
4 82 13.63 20.49 -10 13.66 19.55 -10 13.26 21.09 -10 13.52 20.74 -10
3 82 13.66 19.55 -10 14.14 18.93 -10 13.95 18.86 -10
4 82 14.39 18.83 -10 14.14 18.93 -10 14.48 19.6 -10 14.6 19.64 -10
4 82 13.66 19.55 -10 13.63 20.49 -10 13.87 20.39 -10 14.13 19.95 -10
4 82 14.48 20.3 -10 14.12 20.49 -10 14.22 20.74 -10 14.59 20.25 -10
4 82 13.87 20.39 -10 14.12 20.49 -10 14.23 20.19 -10 14.13 19.95 -10
3 82 14.12 20.49 -10 14.48 20.3 -10 14.23 20.19 -10
4 82 14.29 18.02 -10 14.2 18.26 -10 14.39 18.34 -10 14.58 17.88 -10
3 82 14.58 17.88 -10 14.49 18.58 -10 14.6 19.64 -10
3 82 14.58 17.88 -10 14.39 18.34 -10 14.49 18.58 -10
3 82 14.6 19.64 -10 14.49 18.58 -10 14.39 18.83 -10
3 82 14.23 19.7 -10 14.48 19.6 -10 14.14 18.93 -10
4 82 14.14 27.17 -10 14.15 27.15 -10 13.58 26.93 -10 13.81 27.69 -10
4 82 13.81 27.69 -10 13.58 26.93 -10 13.56 26.94 -10 13.56 27.79 -10
3 82 13.56 26.94 -10 13.47 26.9 -10 13.56 27.79 -10
4 82 14.24 27.42 -10 14.14 27.17 -10 13.81 27.69 -10 14.05 27.79 -10
4 82 14.16 28.04 -10 14.05 28.28 -10 14.46 28.32 -10 14.71 28.21 -10
4 82 14.49 27.52 -10 14.24 27.42 -10 14.05 27.79 -10 14.16 28.04 -10
4 82 14.49 27.52 -10 14.16 28.04 -10 14.71 28.21 -10 14.73 27.42 -10
4 82 15.07 27.5 -10 14.75 27.38 -10 14.73 27.42 -10 14.71 28.21 -10
3 82 14.71 28.21 -10 14.95 28.32 -10 15.07 27.5 -10
3 82 15.19 29 -10 15.07 27.5 -10 15.06 28.56 -10
4 82 -15.42 27.17 -10 -15.49 26.21 -10 -15.84 29 -10 -15.64 28.56 -10
4 82 -15.42 27.17 -10 -15.64 28.56 -10 -15.54 28.32 -10 -15.32 27.42 -10
4 82 -15.32 27.42 -10 -15.54 28.32 -10 -15.29 28.21 -10 -15.07 27.52 -10
4 82 -15.04 28.32 -10 -14.94 28.56 -10 -14.64 28.28 -10 -14.74 28.04 -10
4 82 -15.29 28.21 -10 -15.04 28.32 -10 -14.74 28.04 -10 -15.07 27.52 -10
3 82 -15.07 27.52 -10 -14.74 28.04 -10 -14.64 27.79 -10
4 82 -14.14 26.94 -10 -14.39 26.84 -10 -14.72 27.17 -10 -14.39 27.69 -10
3 82 -14.72 27.17 -10 -14.82 27.42 -10 -14.39 27.69 -10
4 82 -14.17 27.78 -10 -14.07 26.91 -10 -14.14 26.94 -10 -14.39 27.69 -10
4 82 -15.12 25.72 -10 -15.37 25.26 -10 -15.49 26.21 -10 -15.02 25.97 -10
3 82 -15.32 26.92 -10 -15.49 26.21 -10 -15.42 27.17 -10
4 82 -15.49 26.21 -10 -15.32 26.92 -10 -15.07 26.82 -10 -15.02 25.97 -10
4 82 -14.77 26.07 -10 -15.02 25.97 -10 -15.07 26.82 -10 -14.49 26.59 -10
4 82 -14.82 26.92 -10 -14.72 27.17 -10 -14.39 26.84 -10 -14.49 26.59 -10
3 82 -14.49 26.59 -10 -15.07 26.82 -10 -14.82 26.92 -10
4 82 -13.95 25.58 -10 -14.42 25.72 -10 -14.14 26.24 -10 -14 26.3 -10
4 82 -14.39 26.34 -10 -14.53 25.97 -10 -14.77 26.07 -10 -14.49 26.59 -10
4 82 -15.23 25.32 -10 -15.37 25.26 -10 -15.12 25.72 -10 -15.02 25.47 -10
4 82 -14.99 25.22 -10 -15.23 25.32 -10 -15.02 25.47 -10 -14.77 25.37 -10
4 82 -14.88 24.97 -10 -14.99 25.22 -10 -14.77 25.37 -10 -14.2 25.27 -10
4 82 -14.1 25.52 -10 -14.53 25.47 -10 -14.42 25.72 -10 -13.95 25.58 -10
4 82 -14.2 25.27 -10 -14.77 25.37 -10 -14.53 25.47 -10 -14.1 25.52 -10
4 82 -14.38 24.71 -10 -14.88 24.97 -10 -14.2 25.27 -10 -14.1 25.02 -10
4 82 -14.14 24.61 -10 -14.1 25.02 -10 -13.91 24.94 -10 -14.03 24.36 -10
3 82 -14.38 24.71 -10 -14.63 24.61 -10 -14.88 24.97 -10
4 82 -15.3 24.65 -10 -15.23 24.62 -10 -14.73 24.36 -10 -15.07 23.95 -10
3 82 -14.99 24.72 -10 -14.73 24.36 -10 -15.23 24.62 -10
3 82 -14.14 24.61 -10 -14.38 24.71 -10 -14.1 25.02 -10
3 82 -15.3 24.65 -10 -15.07 23.95 -10 -15.2 23.9 -10
4 82 -14.63 24.11 -10 -14.82 23.85 -10 -15.07 23.95 -10 -14.73 24.36 -10
4 82 -14.38 24.01 -10 -14.72 23.6 -10 -14.82 23.85 -10 -14.63 24.11 -10
4 82 -14.29 23.19 -10 -14.82 23.36 -10 -14.72 23.6 -10 -14.04 23.29 -10
4 82 -14.04 23.29 -10 -14.72 23.6 -10 -14.38 24.01 -10 -14.14 24.11 -10
4 82 -14.94 22.4 -10 -15 22.25 -10 -15.13 23.28 -10 -15.07 23.25 -10
4 82 -14.39 22.94 -10 -15.07 23.25 -10 -14.82 23.36 -10 -14.29 23.19 -10
3 82 -15.07 23.25 -10 -14.69 22.5 -10 -14.94 22.4 -10
3 82 -14.03 24.36 -10 -13.91 24.94 -10 -13.78 23.19 -10
4 82 -14.14 24.11 -10 -14.03 24.36 -10 -13.78 23.19 -10 -14.04 23.29 -10
4 82 -14.96 20.2 -10 -14.98 22 -10 -14.94 21.9 -10 -14.81 20.74 -10
4 82 -14.71 20.99 -10 -14.81 20.74 -10 -14.94 21.9 -10 -14.69 21.8 -10
4 82 -14.46 21.09 -10 -14.71 20.99 -10 -14.69 21.8 -10 -14.16 21.63 -10
4 82 -14.16 21.63 -10 -14.69 21.8 -10 -14.45 21.9 -10 -14.06 21.88 -10
4 82 -14.06 21.88 -10 -14.45 21.9 -10 -14.34 22.15 -10 -13.81 21.98 -10
4 82 -13.81 21.28 -10 -13.79 21.29 -10 -14.11 20.74 -10 -14.21 20.99 -10
4 82 -14.21 20.99 -10 -14.46 21.09 -10 -14.06 21.38 -10 -13.81 21.28 -10
3 82 -14.46 21.09 -10 -14.16 21.63 -10 -14.06 21.38 -10
4 82 -13.7 22.03 -10 -13.71 21.94 -10 -13.81 21.98 -10 -14.04 22.59 -10
4 82 -14.04 22.59 -10 -13.81 21.98 -10 -14.34 22.15 -10 -14.45 22.4 -10
3 82 -13.7 22.03 -10 -13.8 22.69 -10 -13.76 22.79 -10
3 82 -13.8 22.69 -10 -13.7 22.03 -10 -14.04 22.59 -10
4 82 -14.29 22.69 -10 -14.04 22.59 -10 -14.45 22.4 -10 -14.69 22.5 -10
3 82 -14.96 19.53 -10 -14.86 18.98 -10 -14.94 18.09 -10
4 82 -14.96 19.53 -10 -14.92 19.52 -10 -14.75 19.22 -10 -14.86 18.98 -10
4 82 -14.51 18.63 -10 -14.43 18.66 -10 -14.72 17.84 -10 -14.94 18.09 -10
4 82 -14.92 20.22 -10 -14.96 20.2 -10 -14.81 20.74 -10 -14.71 20.49 -10
4 82 -14.67 20.12 -10 -14.92 20.22 -10 -14.71 20.49 -10 -14.46 20.39 -10
4 82 -14.57 19.87 -10 -14.67 20.12 -10 -14.46 20.39 -10 -13.93 20.1 -10
4 82 -13.93 20.1 -10 -14.21 20.49 -10 -14.11 20.74 -10 -13.79 21.29 -10
3 82 -14.21 20.49 -10 -13.93 20.1 -10 -14.46 20.39 -10
4 82 -14.51 19.33 -10 -14.67 19.62 -10 -14.57 19.87 -10 -14.26 19.22 -10
3 82 -13.93 20.1 -10 -14.25 19.19 -10 -14.26 19.22 -10
3 82 -13.93 20.1 -10 -14.26 19.22 -10 -14.57 19.87 -10
3 82 -14.94 18.09 -10 -14.75 18.73 -10 -14.51 18.63 -10
3 82 -14.94 18.09 -10 -14.86 18.98 -10 -14.75 18.73 -10
4 82 -0.2 2.33 -10 -2.67 2.12 -10 -2.39 3.78 -10 -0.36 4.96 -10
3 82 1.68 4 -10 3.45 3.07 -10 2.12 2.19 -10
3 82 -12.52 3.4 -10 -13.13 2.85 -10 -13.39 4.52 -10
3 82 -10.05 1.66 -10 -10.31 1.14 -10 -11.17 1.43 -10

0 // Blue
4 1 10.41 3.04 -10 9.21 2.75 -10 9.27 6.04 -10 11.7 4.23 -10
4 1 -2.19 9.86 -10 -2.22 7.06 -10 -3.42 6.39 -10 -3.59 15.16 -10
4 1 2.89 30.73 -10 0.25 25.38 -10 -0.64 25.39 -10 -3.84 30.7 -10
4 1 9.42 25.34 -10 9.5 30.76 -10 12.83 26.64 -10 12.63 24.43 -10
4 1 12.63 24.43 -10 12.51 22.17 -10 9.36 22.09 -10 9.42 25.34 -10
4 1 13.03 19.24 -10 13.85 17.45 -10 11.55 15.58 -10 10 15.24 -10
4 1 15.07 15.75 -10 12.1 9.84 -10 11.58 11.2 -10 11.29 14.06 -10
4 1 10.7 6.35 -10 12.84 5.51 -10 11.7 4.23 -10 9.27 6.04 -10
4 1 -9.44 3.42 -10 -9.97 2.39 -10 -10.96 2.83 -10 -12.22 3.95 -10
4 1 -15.14 15.83 -10 -14.31 17.48 -10 -11.02 13.92 -10 -11.71 8.7 -10
3 1 10.41 3.04 -10 9.41 2.49 -10 9.21 2.75 -10
3 1 2.91 6.33 -10 1.63 7.02 -10 1.62 7.34 -10
4 1 2.91 6.33 -10 1.62 7.34 -10 1.54 9.95 -10 2.89 15 -10
4 1 1.47 10.1 -10 1.78 14.37 -10 2.89 15 -10 1.54 9.95 -10
4 1 1.29 10.15 -10 0.39 13.96 -10 1.78 14.37 -10 1.47 10.1 -10
4 1 -1.94 10.15 -10 -1.41 13.98 -10 0.39 13.96 -10 1.29 10.15 -10
4 1 -3.59 15.16 -10 -2.82 14.55 -10 -2.13 10.07 -10 -2.19 9.86 -10
4 1 -2.13 10.07 -10 -2.82 14.55 -10 -1.41 13.98 -10 -1.94 10.15 -10
3 1 -2.22 7.06 -10 -2.23 6.81 -10 -3.42 6.39 -10
3 1 2.85 25.35 -10 2.52 25.42 -10 2.89 30.73 -10
3 1 2.52 25.42 -10 2.03 25.45 -10 2.89 30.73 -10
3 1 -3.78 25.23 -10 -3.84 30.7 -10 -3.51 25.32 -10
3 1 -3.51 25.32 -10 -3.84 30.7 -10 -3.03 25.42 -10
4 1 0.25 25.38 -10 2.89 30.73 -10 2.03 25.45 -10 1.45 25.29 -10
3 1 0.79 25.22 -10 1.45 25.29 -10 1.04 24.98 -10
3 1 0.79 25.22 -10 0.25 25.38 -10 1.45 25.29 -10
4 1 -2.3 25.37 -10 -3.03 25.42 -10 -3.84 30.7 -10 -0.64 25.39 -10
3 1 -1.58 24.93 -10 -1.84 25.16 -10 -1.22 25.18 -10
4 1 -1.22 25.18 -10 -1.84 25.16 -10 -2.3 25.37 -10 -0.64 25.39 -10
3 1 13.4 30.76 -10 12.83 26.64 -10 9.5 30.76 -10
4 1 11.55 15.58 -10 13.85 17.45 -10 15.07 15.75 -10 11.29 14.06 -10
4 1 10 15.24 -10 9.26 15.14 -10 9.36 22.09 -10 13.03 19.24 -10
3 1 12.55 20.72 -10 9.36 22.09 -10 12.51 22.17 -10
3 1 13.03 19.24 -10 9.36 22.09 -10 12.55 20.72 -10
4 1 12.26 8.17 -10 15.07 15.75 -10 13.33 5.47 -10 12.24 6.96 -10
4 1 12.24 6.96 -10 13.33 5.47 -10 12.84 5.51 -10 10.7 6.35 -10
3 1 11.29 14.06 -10 11.13 14.7 -10 11.55 15.58 -10
4 1 10.64 13.64 -10 10.88 14.14 -10 11.29 14.06 -10 10.85 12.38 -10
3 1 10.64 13.64 -10 10.85 12.38 -10 9.89 13.51 -10
3 1 11.29 14.06 -10 11.58 11.2 -10 10.85 12.38 -10
3 1 15.07 15.75 -10 12.26 8.17 -10 12.1 9.84 -10
4 1 -9.58 8.44 -10 -9.44 3.42 -10 -12.22 3.95 -10 -13.03 4.99 -10
3 1 -13.8 30.62 -10 -10.09 30.62 -10 -13.36 26.5 -10
4 1 -10.09 30.62 -10 -9.64 13.76 -10 -13.01 22.07 -10 -13.36 26.5 -10
4 1 -9.64 13.76 -10 -11.02 13.92 -10 -13.26 19.96 -10 -13.01 22.07 -10
4 1 -11.71 8.7 -10 -9.58 8.44 -10 -13.03 4.99 -10 -13.44 5.07 -10
3 1 -14.31 17.48 -10 -13.26 19.96 -10 -11.02 13.92 -10
4 1 -11.71 8.7 -10 -13.44 5.07 -10 -15.43 15.95 -10 -15.14 15.83 -10
4 1 15.33 19.89 10 15.45 30.97 10 9.25 30.97 10 8.99 2 10
4 1 -3.21 30.89 10 -2.99 5.82 10 0 6.04 10 3.21 30.89 10
4 1 -8.99 2 10 -11.42 1.98 10 -10.8 1.64 10 -9.15 1.67 10
4 1 8.99 2 10 9.15 1.67 10 10.8 1.64 10 11.42 1.98 10
4 1 12.28 3.77 10 15.33 19.89 10 8.99 2 10 11.89 2.55 10
3 1 11.89 2.55 10 8.99 2 10 11.42 1.98 10
3 1 2.99 5.82 10 3.21 30.89 10 0 6.04 10
4 1 -15.33 19.89 10 -8.99 2 10 -9.25 30.97 10 -15.45 30.97 10
4 1 -8.99 2 10 -15.33 19.89 10 -12.28 3.77 10 -11.89 2.55 10
3 1 -8.99 2 10 -11.89 2.55 10 -11.42 1.98 10
4 16 3.5 17.88 -10 3.27 18.51 -10 2.06 21.86 -10 2.35 21.86 -10
3 16 2.06 21.86 -10 3.27 18.51 -10 1.78 21.93 -10
4 16 1.51 22.07 -10 1.78 21.93 -10 3.27 18.51 -10 2.92 19 -10
