0 ~Technic Disc  5 x  5 Projectile with Kanoka Pattern Border - Segment 3
0 Name: s\32533p00s03.dat
0 Author: Santeri Piippo [arezey]
0 !LDRAW_ORG Subpart UPDATE 2020-03
0 !LICENSE Redistributable under CCAL version 2.0 : see CAreadme.txt

0 BFC CERTIFY CCW

0 !HISTORY 2020-12-29 [PTadmin] Official Update 2020-03

3 16 27.6905 -11.9099 0.00028 32.0716 -13.2293 0.00019 27.7592 -11.9374 0.346
4 16 27.9792 -12.0695 3.68418 27.7592 -11.9374 0.346 32.0716 -13.2293 0.00019 34.4194 -13.9364 0.00015
4 16 34.4923 -13.9593 0.0489 28.423 -12.2043 3.74255 27.9792 -12.0695 3.68418 34.4194 -13.9364 0.00015
4 16 34.699 -14.1107 4.5675 28.423 -12.2043 3.74255 34.4923 -13.9593 0.0489 34.9933 -14.1112 0.10147
3 16 27.9792 -12.0695 3.68418 28.423 -12.2043 3.74255 28 -12.0943 4
3 16 28 -12.0943 4 28.423 -12.2043 3.74255 34.699 -14.1107 4.5675
4 16 33.8065 -14.1109 9.058 27.7731 -12.23 7.44247 28 -12.0943 4 34.699 -14.1107 4.5675
4 16 34.1679 -13.864 -0.1679 32.0716 -13.2293 0.00019 27.6905 -11.9099 0.00028 27.5662 -11.8848 -0.625
3 16 33.9247 -13.7997 -0.625 34.1679 -13.864 -0.1679 27.5662 -11.8848 -0.625
3 16 34.4194 -13.9364 0.00015 32.0716 -13.2293 0.00019 34.1679 -13.864 -0.1679
4 16 27.7592 -12.2465 7.654 27.7731 -12.23 7.44247 33.8065 -14.1109 9.058 31.3673 -13.7915 12.9511
4 16 31.3673 -13.7915 12.9511 30.8966 -13.6421 12.7976 27.0216 -12.3791 11.1929 27.7592 -12.2465 7.654
3 16 31.75 -13.8935 12.875 31.3673 -13.7915 12.9511 33.8065 -14.1109 9.058
3 16 32.1327 -14.0103 12.9511 31.75 -13.8935 12.875 33.8065 -14.1109 9.058
3 16 32.4214 -14.1115 13.144 32.1327 -14.0103 12.9511 33.8065 -14.1109 9.058
3 16 30.8966 -13.6421 12.7976 26.955 -12.4037 11.5124 27.0216 -12.3791 11.1929
4 16 31.3348 -13.785 12.9791 30.9435 -13.7241 13.3167 26.955 -12.4037 11.5124 30.8966 -13.6421 12.7976
3 16 30.8966 -13.6421 12.7976 31.3673 -13.7915 12.9511 31.3348 -13.785 12.9791
