0 ~Wheel 56 x 46 Technic Racing - 1/6
0 Name: s\22969s01.dat
0 Author: Marc Klein [marckl]
0 !LDRAW_ORG Subpart UPDATE 2022-03
0 !LICENSE Redistributable under CCAL version 2.0 : see CAreadme.txt

0 BFC CERTIFY CCW

0 !HISTORY 2001-10-17 [marckl] Created with stl2dat conversion tool
0 !HISTORY 2004-10-26 [sbliss] Reorganized code to reduce redundancy; BFC'ed
0 !HISTORY 2007-11-17 [mikeheide] Converted to hi-res
0 !HISTORY 2007-11-18 [Philo]   Corrected central hole bleeding and tiny holes on backface
0 !HISTORY 2011-11-06 [MagFors] Modified spokes to fit 48-primitives, moved condlines to subfile
0 !HISTORY 2011-12-29 [PTadmin] Official Update 2011-02
0 !HISTORY 2022-04-15 [MagFors] Closed gaps, adapted for connhole
0 !HISTORY 2022-05-07 [PTadmin] Official Update 2022-03

1 16 2 20 0 0 13 0 -9 0 0 0 0 9 7-16cylo.dat
1 16 22 20 0 0 -1 0 1 0 0 0 0 1 1-4ring9.dat
1 16 22 20 0 0 -1 0 0 0 -9 9 0 0 1-4ndis.dat
2 24 22 20 10 22 23.827 9.239
2 24 22 23.827 9.239 22 27.071 7.071
2 24 22 27.071 7.071 22 29.239 3.827
2 24 22 29.239 3.827 22 30 0

5 24 15 26.361 6.363 2 26.361 6.363 2 23.4443 8.3151 15 28.315 3.4442
2 24 15 28.602 2 15 28.315 3.4442
2 24 2 28.6017 2 15 28.602 2
2 24 2 28.3151 3.4443 2 28.6017 2
4 16 15 28.315 3.4442 15 28.602 2 2 28.6017 2 2 28.3151 3.4443
5 24 2 28.3151 3.4443 15 28.315 3.4442 15 28.602 2 2 26.361 6.363
0 // front peghole surround
2 24 22 13.779 11.574 22 8.175 14.1595
2 24 22 20 10 22 13.779 11.574
4 16 22 8.175 14.1595 22 3.932 6.809 22 5.6568 5.6568 22 11 9
3 16 22 5.6568 5.6568 22 7.3912 3.0616 22 11 9
3 16 22 11 9 22 13.779 11.574 22 8.175 14.1595
4 16 22 11 0 22 11 9 22 7.3912 3.0616 22 8 0
4 16 22 20 10 22 13.779 11.574 22 11 9 22 20 9
0 // peghole front surround upper
4 16 22 29.239 3.827 22 30 0 27.75 30 0 27.54 29.237 3.82
4 16 22 27.071 7.071 22 29.239 3.827 27.54 29.237 3.82 26.94 27.071 7.071
4 16 22 23.827 9.239 22 27.071 7.071 26.94 27.071 7.071 26.05 23.823 9.237
4 16 22 20 10 22 23.827 9.239 26.05 23.823 9.237 24.98 20 10
5 24 24.98 20 10 22 20 10 22 23.827 9.239 24.03 13.779 11.574
4 16 24.03 13.779 11.574 22 13.779 11.574 22 20 10 24.98 20 10
5 24 22 13.779 11.574 24.03 13.779 11.574 23.73 8.175 14.1595 22 20 10
4 16 23.73 8.175 14.1595 22 8.175 14.1595 22 13.779 11.574 24.03 13.779 11.574
1 16 15 20 0 0 1 0 0 0 11.5 11.5 0 0 1-4edge.dat
1 16 15 20 0 0 5 0 0 0 11.5 11.5 0 0 1-4cyli.dat
1 16 20 20 0 0 2.9 0 -11.5 0 0 0 0 11.5 1-4cyls2.dat
1 16 20 20 0 0 1 2.9 0 0 11.5 11.5 0 0 1-4edge.dat
1 16 15 20 0 0 1 0 0 0 -9 9 0 0 1-4ndis.dat
1 16 15 20 0 0 1 0 1.5 0 0 0 0 1.5 1-4ring6.dat
1 16 15 20 0 0 1 0 1.0455 0 0 0 0 1.0455 1-4rin10.dat
2 24 15 13.216 18.8901 15 16.617 16.617
2 24 15 16.617 16.617 15 20 11.5
4 16 15 16.617 16.617 15 20 11.5 15 20 9 15 11 9
4 16 15 8.2327 10.2587 15 13.216 18.8901 15 16.617 16.617 15 11 9
4 16 15 6.5003 11.259 15 8.2327 10.2587 15 5.6568 5.6568 15 3.932 6.809
4 16 15 8.2327 10.2587 15 11 9 15 7.3912 3.0616 15 5.6568 5.6568
4 16 15 11 9 15 11 0 15 8 0 15 7.3912 3.0616
0 // top strut
2 24 -28.3 31.666 50.847 -26 31.6662 50.8473
2 24 -26 31.6662 50.8473 .4 30.666 49.115
2 24 .4 30.666 49.115 2 30.166 48.249
2 24 2 27.666 43.92 2 30.166 48.249
2 24 2 23.735 37.109 -4 29.7324 47.4981
2 24 15 8.2327 10.2587 15 13.216 18.8901
2 24 15 8.2327 10.2587 2 8.233 10.259
2 24 2 8.233 10.259 2 23.735 37.109
2 24 15 13.216 18.8901 25.33 27.666 43.92
2 24 25.33 27.666 43.92 2 27.666 43.92
2 24 -4 29.7324 47.4981 -28.3 31.666 50.847
4 16 2 27.666 43.92 -4 29.7324 47.4981 .4 30.666 49.115 2 30.166 48.249
4 16 .4 30.666 49.115 -4 29.7324 47.4981 -28.3 31.666 50.847 -26 31.6662 50.8473
3 16 2 23.735 37.109 -4 29.7324 47.4981 2 27.666 43.92
4 16 2 23.735 37.109 2 27.666 43.92 15 13.216 18.8901 15 8.2327 10.2587
3 16 2 8.233 10.259 2 23.735 37.109 15 8.2327 10.2587
3 16 2 27.666 43.92 25.33 27.666 43.92 15 13.216 18.8901
2 24 15 6.5003 11.259 15 8.2327 10.2587
2 24 2 6.5005 11.2595 2 8.233 10.259
2 24 2 22.001 38.1075 2 23.735 37.109
2 24 -4 28.0003 48.4978 -4 29.7324 47.4981
4 16 2 8.233 10.259 15 8.2327 10.2587 15 6.5003 11.259 2 6.5005 11.2595
4 16 2 23.735 37.109 2 8.233 10.259 2 6.5005 11.2595 2 22.001 38.1075
4 16 -4 28.0003 48.4978 -4 29.7324 47.4981 2 23.735 37.109 2 22.001 38.1075
4 16 -28.3 31.666 50.847 -4 29.7324 47.4981 -4 28.0003 48.4978 -29 30 51.961
0 // top front spoke
2 24 32.811 33.78 47.06 32.94 29.137 50.4665
2 24 27.92 31.5376 41.3361 32.811 33.78 47.06
2 24 25.13 31.537 41.335 27.92 31.5376 41.3361
2 24 25.13 31.537 41.335 25.33 27.666 43.92
3 16 25.13 31.537 41.335 15 13.216 18.8901 25.33 27.666 43.92
3 16 15 13.216 18.8901 25.13 31.537 41.335 15 16.617 16.617
3 16 15 16.617 16.617 25.13 31.537 41.335 15 20 11.5
2 24 30.08 31.308 46.487 19.45 19.527 15.619
2 24 19.45 19.527 15.619 19.15 15.971 16.618
2 24 30.197 28.158 48.771 30.08 31.308 46.487
2 24 19.15 15.971 16.618 19 10.9585 18.981
4 16 19.15 15.971 16.618 19.45 19.527 15.619 30.08 31.308 46.487 30.197 28.158 48.771
3 16 19 10.9585 18.981 19.15 15.971 16.618 30.197 28.158 48.771
4 16 32.811 33.78 47.06 20.48 20 11.5 20 20 11.5 27.92 31.5376 41.3361
2 24 20.48 20 11.5 32.811 33.78 47.06
2 24 20 20 11.5 20.48 20 11.5
4 16 27.92 31.5376 41.3361 20 20 11.5 15 20 11.5 25.13 31.537 41.335
2 24 20 20 11.5 15 20 11.5
2 24 25.13 31.537 41.335 15 20 11.5
2 24 23.73 8.175 14.1595 24.03 13.779 11.574
2 24 24.26 14.286 12.996 23.96 8.926 15.4605
4 16 23.96 8.926 15.4605 23.73 8.175 14.1595 24.03 13.779 11.574 24.26 14.286 12.996
2 24 24.03 13.779 11.574 24.98 20 10
2 24 25.14 20 11.5 24.26 14.286 12.996
4 16 24.26 14.286 12.996 24.03 13.779 11.574 24.98 20 10 25.14 20 11.5
2 24 21.35 19.223 15.085 21.05 15.666 16.085
2 24 21.05 15.666 16.085 20.9 10.6515 18.449
2 24 32.176 31.308 46.487 21.35 19.223 15.085
2 24 32.3 28.158 48.771 32.176 31.308 46.487
2 24 20.48 20 11.5 19.92 14.286 12.996
2 24 19.92 14.286 12.996 19.74 8.926 15.4605
2 24 30.08 31.308 46.487 32.176 31.308 46.487
2 24 19.45 19.527 15.619 21.35 19.223 15.085
4 16 21.05 15.666 16.085 20.9 10.6515 18.449 19.74 8.926 15.4605 19.92 14.286 12.996
4 16 19.92 14.286 12.996 20.48 20 11.5 21.35 19.223 15.085 21.05 15.666 16.085
3 16 32.811 33.78 47.06 21.35 19.223 15.085 20.48 20 11.5
3 16 32.176 31.308 46.487 21.35 19.223 15.085 32.811 33.78 47.06
3 16 32.94 29.1325 50.4585 32.176 31.308 46.487 32.811 33.78 47.06
3 16 32.3 28.158 48.771 32.176 31.308 46.487 32.94 29.1325 50.4585
4 16 25.14 20 11.5 20.48 20 11.5 19.92 14.286 12.996 24.26 14.286 12.996
4 16 24.26 14.286 12.996 19.92 14.286 12.996 19.74 8.926 15.4605 23.96 8.926 15.4605
4 16 32.176 31.308 46.487 32.3 28.158 48.771 30.197 28.158 48.771 30.08 31.308 46.487
3 16 19.45 19.527 15.619 32.176 31.308 46.487 30.08 31.308 46.487
3 16 21.35 19.223 15.085 32.176 31.308 46.487 19.45 19.527 15.619
4 16 21.35 19.223 15.085 19.45 19.527 15.619 19.15 15.971 16.618 21.05 15.666 16.085
4 16 20.9 10.6515 18.449 21.05 15.666 16.085 19.15 15.971 16.618 19 10.9585 18.981
0 // middle strut
2 24 15 31.1023 2 22.7997 31.1023 2
2 24 22.7997 31.1023 2 27.92 51.868 2
2 24 -28.3 59.868 2 -26 59.8682 2
2 24 -26 59.8682 2 .4 57.868 2
2 24 .4 57.868 2 2 56.868 2
2 24 2 51.743 2 2 56.868 2
2 24 27.92 51.868 2 2 51.743 2
2 24 -28.3 59.868 2 -4 56 2
2 24 -4 56 2 2 44 2
2 24 2 44 2 2 28.6017 2
2 24 15 31.1023 2 15 28.602 2
2 24 -4 56 0 -4 56 2
2 24 2 44 0 2 44 2
4 16 22.7997 31.1023 2 27.92 51.868 2 2 51.743 2 15 31.1023 2
4 16 2 44 2 2 28.6017 2 15 28.602 2 15 31.1023 2
4 16 15 31.1023 2 2 51.743 2 -4 56 2 2 44 2
4 16 2 56.868 2 .4 57.868 2 -4 56 2 2 51.743 2
4 16 -26 59.8682 2 -28.3 59.868 2 -4 56 2 .4 57.868 2
4 16 2 44 2 2 44 0 2 29 0 2 28.6017 2
4 16 2 44 2 -4 56 2 -4 56 0 2 44 0
4 16 -4 56 0 -4 56 2 -28.3 59.868 2 -29 60 0
0 // front middle spoke
2 24 27.92 51.553 6.786 27.92 51.868 2
2 24 20 20 11.5 27.92 51.553 6.786
3 16 27.92 51.553 6.786 21.1098 24.4011 10.6249 20 20 11.5
3 16 27.92 51.553 6.786 22.0506 28.1317 8.1317 21.1098 24.4011 10.6249
3 16 27.92 51.553 6.786 22.6793 30.6249 4.4011 22.0506 28.1317 8.1317
4 16 22.7997 31.1023 2 22.6793 30.6249 4.4011 27.92 51.553 6.786 27.92 51.868 2
2 24 26.36 32.504 0 26.11 31.576 4.628
2 24 26.11 31.576 4.628 25.45 29.183 8.213
2 24 25.45 29.183 8.213 33.41 58.111 3.609
2 24 33.41 58.111 3.609 33.54 58.587 0
4 16 33.54 58.587 0 33.41 58.111 3.609 25.45 29.183 8.213 26.11 31.576 4.628
3 16 26.11 31.576 4.628 26.36 32.504 0 33.54 58.587 0
2 24 27.92 51.553 6.786 34.32 59.655 5.299
2 24 34.32 59.655 5.299 36 59.655 5.299
2 24 36 60 0 36 59.655 5.299
2 24 26.2674 24.5816 10.8229 25.14 20 11.5
2 24 36 59.655 5.299 26.2674 24.5816 10.8229
2 24 24.98 20 10 26.05 23.823 9.237
2 24 26.05 23.823 9.237 26.94 27.071 7.071
2 24 26.94 27.071 7.071 27.54 29.237 3.82
2 24 27.54 29.237 3.82 27.75 30 0
2 24 33.41 58.111 3.609 35.33 57.583 3.604
2 24 25.45 29.183 8.213 27.38 28.652 8.212
2 24 27.38 28.652 8.212 35.33 57.583 3.604
2 24 28.04 31.043 4.632 27.38 28.652 8.212
2 24 28.29 31.97 0 28.04 31.043 4.632
2 24 35.33 57.583 3.604 35.46 58.059 0
3 16 26.2674 24.5816 10.8229 36 59.655 5.299 34.32 59.655 5.299
4 16 20 20 11.5 20.48 20 11.5 26.2674 24.5816 10.8229 27.92 51.553 6.786
3 16 26.2674 24.5816 10.8229 34.32 59.655 5.299 27.92 51.553 6.786
3 16 20.48 20 11.5 25.14 20 11.5 26.2674 24.5816 10.8229
3 16 36 59.655 5.299 27.38 28.652 8.212 35.33 57.583 3.604
3 16 26.05 23.823 9.237 25.14 20 11.5 24.98 20 10
4 16 26.94 27.071 7.071 27.38 28.652 8.212 26.2674 24.5816 10.8229 26.05 23.823 9.237
3 16 26.2674 24.5816 10.8229 25.14 20 11.5 26.05 23.823 9.237
3 16 36 59.655 5.299 26.2674 24.5816 10.8229 27.38 28.652 8.212
4 16 28.04 31.043 4.632 27.38 28.652 8.212 26.94 27.071 7.071 27.54 29.237 3.82
4 16 28.29 31.97 0 28.04 31.043 4.632 27.54 29.237 3.82 27.75 30 0
3 16 35.33 57.583 3.604 35.46 58.059 0 36 60 0
3 16 35.33 57.583 3.604 36 60 0 36 59.655 5.299
5 24 36 60 0 35.33 57.583 3.604 35.46 58.059 0 36 59.655 5.299
4 16 28.04 31.043 4.632 28.29 31.97 0 26.36 32.504 0 26.11 31.576 4.628
4 16 26.11 31.576 4.628 25.45 29.183 8.213 27.38 28.652 8.212 28.04 31.043 4.632
4 16 27.38 28.652 8.212 25.45 29.183 8.213 33.41 58.111 3.609 35.33 57.583 3.604
4 16 33.41 58.111 3.609 33.54 58.587 0 35.46 58.059 0 35.33 57.583 3.604
0 // cone X = 0.4 - -26, radius = 57.8 - 60
0 // 1 16 -26 0 0 0 -1 0 60 0 0 0 0 60 48\1-6edge.dat
0 // 1 16 .4 0 0 0 -1 0 58 0 0 0 0 58 48\1-6edge.dat
4 16 .4 57.501 7.569 -26 59.484 7.83 -26 59.8682 2 .4 57.868 2
4 16 .4 57.501 7.569 .4 56.022 15.01 -26 57.954 15.528 -26 59.484 7.83
4 16 .4 56.022 15.01 .4 53.586 22.197 -26 55.434 22.962 -26 57.954 15.528
4 16 .4 53.586 22.197 .4 50.228 29 -26 51.96 30 -26 55.434 22.962
4 16 .4 50.228 29 .4 46.017 35.31 -26 47.604 36.528 -26 51.96 30
4 16 .4 46.017 35.31 .4 41.012 41.012 -26 42.426 42.426 -26 47.604 36.528
4 16 .4 41.012 41.012 .4 35.31 46.017 -26 36.528 47.604 -26 42.426 42.426
4 16 .4 35.31 46.017 .4 30.666 49.115 -26 31.6662 50.8473 -26 36.528 47.604
0 // Conditional edges
5 24 .4 57.501 7.569 -26 59.484 7.83 -26 59.8682 2 .4 56.022 15.01
5 24 .4 56.022 15.01 -26 57.954 15.528 -26 59.484 7.83 .4 53.586 22.197
5 24 .4 53.586 22.197 -26 55.434 22.962 -26 57.954 15.528 .4 50.228 29
5 24 .4 50.228 29 -26 51.96 30 -26 55.434 22.962 .4 46.017 35.31
5 24 .4 46.017 35.31 -26 47.604 36.528 -26 51.96 30 .4 41.012 41.012
5 24 .4 41.012 41.012 -26 42.426 42.426 -26 47.604 36.528 .4 35.31 46.017
5 24 .4 35.31 46.017 -26 36.528 47.604 -26 42.426 42.426 .4 30.666 49.115
0 // clipped cone, X = 27.92 - 34.32, radius = 52 - 60
0 // 1 16 34.32 0 0 0 -1 0 60 0 0 0 0 60 48\1-6edge.dat
0 // 1 16 27.92 0 0 0 -1 0 52 0 0 0 0 52 48\1-6edge.dat
3 16 34.32 59.655 5.299 34.32 59.484 7.83 27.92 51.553 6.786
4 16 34.32 59.484 7.83 34.32 57.954 15.528 27.92 50.227 13.458 27.92 51.553 6.786
4 16 34.32 57.954 15.528 34.32 55.434 22.962 27.92 48.043 19.9 27.92 50.227 13.458
4 16 34.32 55.434 22.962 34.32 51.96 30 27.92 45.032 26 27.92 48.043 19.9
4 16 34.32 51.96 30 34.32 47.604 36.528 27.92 41.257 31.658 27.92 45.032 26
4 16 34.32 47.604 36.528 34.32 42.426 42.426 27.92 36.769 36.769 27.92 41.257 31.658
4 16 34.32 42.426 42.426 34.32 36.5276 47.6036 27.92 31.658 41.257 27.92 36.769 36.769
3 16 32.811 33.78 47.06 34.32 36.5276 47.6036 34.32 30.0003 51.9611
3 16 32.811 33.78 47.06 34.32 30.0003 51.9611 32.94 29.137 50.4665
5 24 34.32 30.0003 51.9611 32.811 33.78 47.06 34.32 36.5276 47.6036 32.94 29.137 50.4665
3 16 27.92 31.658 41.257 34.32 36.5276 47.6036 32.811 33.78 47.06
3 16 27.92 31.658 41.257 32.811 33.78 47.06 27.92 31.5376 41.3361
5 24 32.811 33.78 47.06 27.92 31.658 41.257 34.32 36.5276 47.6036 27.92 31.5376 41.3361
0 // Conditional edges
5 24 34.32 59.484 7.83 27.92 51.553 6.786 34.32 59.655 5.299 34.32 57.954 15.528
5 24 34.32 57.954 15.528 27.92 50.227 13.458 27.92 51.553 6.786 34.32 55.434 22.962
5 24 34.32 55.434 22.962 27.92 48.043 19.9 27.92 50.227 13.458 34.32 51.96 30
5 24 34.32 51.96 30 27.92 45.032 26 27.92 48.043 19.9 34.32 47.604 36.528
5 24 34.32 47.604 36.528 27.92 41.257 31.658 27.92 45.032 26 34.32 42.426 42.426
5 24 34.32 42.426 42.426 27.92 36.769 36.769 27.92 41.257 31.658 34.32 36.5276 47.6036
5 24 34.32 36.5276 47.6036 27.92 31.658 41.257 27.92 36.769 36.769 34.32 30.0003 51.9611
5 24 34.32 30.0003 51.9611 32.94 29.1325 50.4585 32.811 33.78 47.06 34.32 22.9619 55.4355
0 // cone X = 0.4 - 2, radius = 57 - 57.8
0 // 1 16 2 0 0 0 -1 0 57 0 0 0 0 57 48\1-6edge.dat
0 // 1 16 0.4 0 0 0 -1 0 58 0 0 0 0 58 48\1-6edge.dat
4 16 .4 57.868 2 2 56.868 2 2 56.51 7.438 .4 57.501 7.569
4 16 2 56.51 7.438 2 55.056 14.752 .4 56.022 15.01 .4 57.501 7.569
4 16 2 55.056 14.752 2 52.662 21.814 .4 53.586 22.197 .4 56.022 15.01
4 16 2 52.662 21.814 2 49.362 28.5 .4 50.228 29 .4 53.586 22.197
4 16 2 49.362 28.5 2 45.224 34.702 .4 46.017 35.31 .4 50.228 29
4 16 2 45.224 34.702 2 40.305 40.305 .4 41.012 41.012 .4 46.017 35.31
4 16 2 40.305 40.305 2 34.702 45.224 .4 35.31 46.017 .4 41.012 41.012
4 16 2 34.702 45.224 2 30.166 48.249 .4 30.666 49.115 .4 35.31 46.017
0 // Conditional edges
5 24 2 56.51 7.438 .4 57.501 7.569 .4 57.868 2 2 55.056 14.752
5 24 2 55.056 14.752 .4 56.022 15.01 .4 57.501 7.569 2 52.662 21.814
5 24 2 52.662 21.814 .4 53.586 22.197 .4 56.022 15.01 2 49.362 28.5
5 24 2 49.362 28.5 .4 50.228 29 .4 53.586 22.197 2 45.224 34.702
5 24 2 45.224 34.702 .4 46.017 35.31 .4 50.228 29 2 40.305 40.305
5 24 2 40.305 40.305 .4 41.012 41.012 .4 46.017 35.31 2 34.702 45.224
5 24 2 34.702 45.224 .4 35.31 46.017 .4 41.012 41.012 2 30.166 48.249

0 // moved condlines from main file
0 // correction by mikeheide
5 24 -26 57.954 15.528 -26 59.484 7.83 -40 57.953 15.53 .4 56.022 15.01
5 24 -26 29.999 51.9595 -26 36.528 47.604 -40 29.999 51.9595 .4 29 50.229
5 24 -26 59.484 7.83 -26 60 0 -40 59.485 7.832 .4 57.501 7.569
5 24 -26 36.528 47.604 -26 42.426 42.426 -40 36.524 47.6 .4 35.31 46.017
5 24 -26 42.426 42.426 -26 47.604 36.528 -40 42.424 42.426 .4 41.012 41.012
5 24 -26 47.604 36.528 -26 51.96 30 -40 47.599 36.525 .4 46.017 35.31
5 24 -26 55.434 22.962 -26 57.954 15.528 -40 55.431 22.961 .4 53.586 22.197
5 24 -26 51.96 30 -26 55.434 22.962 -40 51.959 30 .4 50.228 29
0 // Added lines/Condlines
5 24 27.54 29.237 3.82 22 29.239 3.827 22 30 0 22 27.071 7.071
5 24 26.94 27.071 7.071 22 27.071 7.071 22 29.239 3.827 22 23.827 9.239
5 24 26.05 23.823 9.237 22 23.827 9.239 22 27.071 7.071 22 20 10
5 24 30.197 28.158 48.771 19.15 15.971 16.618 30.08 31.308 46.487 19 10.9585 18.981
5 24 24.98 20 10 25.14 20 11.5 24.26 14.286 12.996 26.05 23.823 9.237
5 24 19.92 14.286 12.996 21.05 15.666 16.085 20.48 20 11.5 20.9 10.6515 18.449
5 24 20.48 20 11.5 21.35 19.223 15.085 21.05 15.666 16.085 32.811 33.78 47.06
5 24 32.811 33.78 47.06 21.35 19.223 15.085 20.48 20 11.5 32.176 31.308 46.487
5 24 32.811 33.78 47.06 32.176 31.308 46.487 21.35 19.223 15.085 32.94 29.1325 50.4585
5 24 32.94 29.1325 50.4585 32.176 31.308 46.487 32.811 33.78 47.06 32.3 28.158 48.771
5 24 19.92 14.286 12.996 24.26 14.286 12.996 25.14 20 11.5 19.74 8.926 15.4605
5 24 19.45 19.527 15.619 32.176 31.308 46.487 30.08 31.308 46.487 21.35 19.223 15.085
5 24 19.15 15.971 16.618 21.05 15.666 16.085 21.35 19.223 15.085 20.9 10.6515 18.449
5 24 27.92 51.553 6.786 21.1098 24.4011 10.6249 20 20 11.5 22.0506 28.1317 8.1317
5 24 26.2674 24.5816 10.8229 27.92 51.553 6.786 34.32 59.655 5.299 20.48 20 11.5
5 24 35.33 57.583 3.604 36 59.655 5.299 27.38 28.652 8.212 35.46 58.059 0
5 24 26.05 23.823 9.237 25.14 20 11.5 24.98 20 10 27.38 28.652 8.212
5 24 26.94 27.071 7.071 27.38 28.652 8.212 26.05 23.823 9.237 28.04 31.043 4.632
5 24 26.11 31.576 4.628 28.04 31.043 4.632 28.29 31.97 0 25.45 29.183 8.213
5 24 .4 57.868 2 .4 57.501 7.569 -26 59.484 7.83 2 56.868 2
5 24 .4 57.501 7.569 .4 56.022 15.01 -26 57.954 15.528 2 56.51 7.438
5 24 .4 56.022 15.01 .4 53.586 22.197 -26 55.434 22.962 2 55.056 14.752
5 24 .4 53.586 22.197 .4 50.228 29 -26 51.96 30 2 52.662 21.814
5 24 .4 50.228 29 .4 46.017 35.31 -26 47.604 36.528 2 49.362 28.5
5 24 .4 46.017 35.31 .4 41.012 41.012 -26 42.426 42.426 2 45.224 34.702
5 24 .4 41.012 41.012 .4 35.31 46.017 -26 36.528 47.604 2 40.305 40.305
5 24 .4 35.31 46.017 .4 30.666 49.115 -26 31.6662 50.8473 2 34.702 45.224
5 24 32.811 33.78 47.06 34.32 36.5276 47.6036 34.32 30.0003 51.9611 27.92 31.5376 41.3361
5 24 25.13 31.537 41.335 15 16.617 16.617 15 13.216 18.8901 15 20 11.5
5 24 25.13 31.537 41.335 15 13.216 18.8901 15 16.617 16.617 25.33 27.666 43.92
5 24 22 30 0 27.75 30 0 22 29.239 3.827 22 29.237 -3.82
5 24 -29 30 51.961 -4 28.0003 48.4978 -28.3 31.666 50.847 -28.3 28.202 52.847
5 24 -29 60 0 -4 56 0 -28.3 59.868 2 -28.3 59.868 -2
5 24 26.36 32.504 0 33.54 58.587 0 26.11 31.576 4.628 26.11 31.576 -4.628
5 24 35.46 58.059 0 36 60 0 36 59.655 5.299 36 59.655 -5.299
5 24 28.29 31.97 0 26.36 32.504 0 28.04 31.043 4.632 28.04 31.043 -4.632
5 24 33.54 58.587 0 35.46 58.059 0 33.41 58.111 3.609 33.41 58.111 -3.609
5 24 22 8.175 14.1595 23.73 8.175 14.1595 22 13.779 11.574 22 3.134 17.72
5 24 19.74 8.926 15.4605 23.96 8.926 15.4605 24.26 14.286 12.996 24.01 4.112 18.87
5 24 20.9 10.6515 18.449 19 10.9585 18.981 19.15 15.971 16.618 19.15 6.406 22.14
5 24 32.3 28.158 48.771 30.197 28.158 48.771 30.08 31.308 46.487 30.08 24.605 50.357
5 24 32.94 29.1325 50.4585 32.3 28.158 48.771 32.176 31.308 46.487 32.176 24.605 50.357
5 24 20.48 20 11.5 25.14 20 11.5 24.26 14.286 12.996 26.2674 24.5816 10.8229
5 24 34.32 59.655 5.299 26.2674 24.5816 10.8229 36 59.655 5.299 27.92 51.553 6.786
5 24 36 59.655 5.299 27.38 28.652 8.212 26.2674 24.5816 10.8229 35.33 57.583 3.604
5 24 27.38 28.652 8.212 26.2674 24.5816 10.8229 26.05 23.823 9.237 36 59.655 5.299
5 24 26.2674 24.5816 10.8229 26.05 23.823 9.237 27.38 28.652 8.212 25.14 20 11.5
5 24 20.48 20 11.5 26.2674 24.5816 10.8229 25.14 20 11.5 27.92 51.553 6.786
5 24 24.26 14.286 12.996 24.03 13.779 11.574 25.14 20 11.5 23.96 8.926 15.4605
5 24 23.96 8.926 15.4605 23.73 8.175 14.1595 24.26 14.286 12.996 24.01 4.112 18.87
5 24 27.92 51.553 6.786 22.6793 30.6249 4.4011 27.92 51.868 2 22.0506 28.1317 8.1317
5 24 20 20 11.5 27.92 31.5376 41.3361 15 20 11.5 32.811 33.78 47.06
5 24 34.32 30.0003 51.9611 32.94 29.137 50.4665 32.811 23.8651 52.7843 32.811 33.78 47.06
