0 ~Wheel Rim 23 x 22 Offroad - Centre Subpart
0 Name: s\6580b.dat
0 Author: Jeff Boen
0 !LDRAW_ORG Subpart UPDATE 2022-02
0 !LICENSE Redistributable under CCAL version 2.0 : see CAreadme.txt

0 BFC CERTIFY CCW

0 !HISTORY 1999-05-24 [PTadmin] Official Update 1999-04
0 !HISTORY 2007-09-10 [PTadmin] Header formatted for Contributor Agreement
0 !HISTORY 2008-07-01 [PTadmin] Official Update 2008-01
0 !HISTORY 2017-01-03 [Steffen] BFCed
0 !HISTORY 2017-12-30 [PTadmin] Official Update 2017-01
0 !HISTORY 2022-01-16 [MagFors] Reshaped axlehole
0 !HISTORY 2022-03-06 [PTadmin] Official Update 2022-02

1 16 1 0 0 0 20 0 -.86603 0 -.5 -.5 0 .86603 axlehol6.dat
3 16 21 -6.1885 1.3587 21 -5.9489 -.7831 21 -4.7603 3.6527
2 24 21 -4.53321 3.85176 21 -4.2426 4.2426
2 24 1 -5.5434 -2.2962 1 -5.85176 -1.06909
2 24 21 -5.5434 -2.2962 21 -5.85176 -1.06909
2 24 1 -4.53321 3.85176 1 -4.2426 4.2426

0 // axle center
0 // 3DSMAX Object: Hub Axle Tube Ends
1 16 7 -6.013 6.013 0 1 0 -.7035 0 -1.05545 -1.0575 0 -.70555 rect.dat
1 16 21 0 0 0 -1 0 0 0 -3 -3 0 0 2-4ring2.dat
1 16 9 0 0 0 -1 0 0 0 -9 -9 0 0 2-4edge.dat
1 16 19 0 0 0 2 0 0 0 -9 -9 0 0 2-4cylo.dat
0 BFC INVERTNEXT
1 16 1 0 0 0 20 0 0 0 -6 6 0 0 1-8cylo.dat
4 16 1 -4.2426 4.2426 21 -4.2426 4.2426 21 -4.53321 3.85176 1 -4.53321 3.85176
5 24 21 -4.2426 4.2426 1 -4.2426 4.2426 21 -4.53321 3.85176 21 -2.2962 5.5434

0 // 3DSMAX Object: Hub Axle Tube Ends
0 // 3DSMAX Object: Hub Axle Tube End 1/4 02
4 16 1 0 9 1 -3.4443 8.3151 9 -3.4443 8.3151 9 0 9
4 16 1 0 6 1 -2.2962 5.5434 1 -3.4443 8.3151 1 0 9
4 16 1 -4.253 7.775 7 -4.25405 7.77605 9 -3.4443 8.3151 1 -3.4443 8.3151
4 16 1 -9 0 9 -9 0 9 -8.3151 3.4443 1 -8.3151 3.4443
4 16 1 -7.775 4.253 1 -4.53321 3.85176 1 -4.760278 3.652651 1 -8.3151 3.4443
4 16 1 -5.948851 -.783122 1 -9 0 1 -8.3151 3.4443 1 -5.795709 1.552996
3 16 1 -4.760278 3.652651 1 -5.795709 1.552996 1 -8.3151 3.4443
4 16 7 -5.66105 5.66105 7 -4.25405 7.77605 1 -4.253 7.775 1 -5.66 5.66
4 16 7 -5.66105 5.66105 1 -5.66 5.66 1 -7.775 4.253 7 -7.77195 4.24995
4 16 1 -7.775 4.253 1 -8.3151 3.4443 9 -8.3151 3.4443 7 -7.77195 4.24995
4 16 1 -4.253 7.775 1 -3.4443 8.3151 1 -2.2962 5.5434 1 -4.2426 4.2426
4 16 7 -6.36495 6.36495 7 -7.77195 4.24995 9 -8.3151 3.4443 9 -6.3639 6.3639
4 16 7 -4.25405 7.77605 7 -6.36495 6.36495 9 -6.3639 6.3639 9 -3.4443 8.3151
3 16 1 -5.66 5.66 1 -4.253 7.775 1 -4.2426 4.2426
4 16 1 -5.66 5.66 1 -4.2426 4.2426 1 -4.53321 3.85176 1 -7.775 4.253
5 24 9 -6.3639 -6.3639 7 -6.367 -6.367 9 -8.3151 -3.4443 9 -3.4443 -8.3151
0 // 3DSMAX Object: Hub Axle Tube End 1/4 02
2 24 1 -3.4443 8.3151 1 0 9
2 24 1 -4.253 7.775 7 -4.25405 7.77605
2 24 7 -7.77195 4.24995 1 -7.775 4.253
2 24 1 -7.775 4.253 1 -8.3151 3.4443
2 24 1 -9 0 1 -8.3151 3.4443
2 24 1 -4.253 7.775 1 -5.66 5.66
2 24 1 -5.66 5.66 1 -7.775 4.253
2 24 1 -3.4443 8.3151 1 -4.253 7.775
0 // 3DSMAX Object: Optional Axle Tube End
5 24 1 0 9 9 0 9 1 3.44 8.31 1 -3.4443 8.3151
5 24 1 -3.4443 8.3151 9 -3.4443 8.3151 1 0 9 1 -4.253 7.775
5 24 1 -8.3151 3.4443 9 -8.3151 3.4443 1 -7.775 4.253 9 -9 0
5 24 1 -5.66 5.66 7 -5.66105 5.66105 1 -4.253 7.775 1 -7.775 4.253

0 // axle center
0 // 3DSMAX Object: Hub Axle Tube Ends
1 16 7 -6.013 -6.013 0 1 0 .7035 0 -1.0575 -1.0575 0 .7035 rect.dat
0 BFC INVERTNEXT
1 16 1 0 0 0 20 0 0 0 -6 -6 0 0 3-16cylo.dat
4 16 21 -5.85176 -1.06909 21 -5.5434 -2.2962 1 -5.5434 -2.2962 1 -5.85176 -1.06909
5 24 21 -5.5434 -2.2962 1 -5.5434 -2.2962 21 -5.85176 -1.06909 21 -4.2426 -4.2426

0 // 3DSMAX Object: Hub Axle Tube Ends
0 // 3DSMAX Object: Hub Axle Tube End 1/4 02
4 16 1 -3.4443 -8.3151 1 0 -9 9 0 -9 9 -3.4443 -8.3151
4 16 1 -2.2962 -5.5434 1 0 -6 1 0 -9 1 -3.4443 -8.3151
4 16 7 -4.252 -7.774 1 -4.253 -7.775 1 -3.4443 -8.3151 9 -3.4443 -8.3151
4 16 9 -9 0 1 -9 0 1 -8.3151 -3.4443 9 -8.3151 -3.4443
4 16 7 -4.252 -7.774 9 -3.4443 -8.3151 9 -6.3639 -6.3639 7 -6.367 -6.367
4 16 7 -7.774 -4.252 7 -6.367 -6.367 9 -6.3639 -6.3639 9 -8.3151 -3.4443
4 16 1 -8.3151 -3.4443 1 -5.5434 -2.2962 1 -4.2426 -4.2426 1 -7.775 -4.253
4 16 1 -9 0 1 -5.948851 -.783122 1 -5.85176 -1.06909 1 -8.3151 -3.4443
3 16 1 -5.5434 -2.2962 1 -8.3151 -3.4443 1 -5.85176 -1.06909
4 16 7 -4.252 -7.774 7 -5.659 -5.659 1 -5.66 -5.66 1 -4.253 -7.775
4 16 1 -5.66 -5.66 7 -5.659 -5.659 7 -7.774 -4.252 1 -7.775 -4.253
4 16 1 -8.3151 -3.4443 1 -7.775 -4.253 7 -7.774 -4.252 9 -8.3151 -3.4443
4 16 1 -3.4443 -8.3151 1 -4.253 -7.775 1 -4.2426 -4.2426 1 -2.2962 -5.5434
3 16 1 -5.66 -5.66 1 -4.2426 -4.2426 1 -4.253 -7.775
3 16 1 -7.775 -4.253 1 -4.2426 -4.2426 1 -5.66 -5.66
5 24 9 -6.3639 6.3639 7 -6.36495 6.36495 9 -3.4443 8.3151 9 -8.3151 3.4443
0 // 3DSMAX Object: Hub Axle Tube End 1/4 02
2 24 1 -3.4443 -8.3151 1 0 -9
2 24 1 -4.253 -7.775 7 -4.252 -7.774
2 24 7 -7.774 -4.252 1 -7.775 -4.253
2 24 1 -7.775 -4.253 1 -8.3151 -3.4443
2 24 1 -9 0 1 -8.3151 -3.4443
2 24 1 -4.253 -7.775 1 -5.66 -5.66
2 24 1 -5.66 -5.66 1 -7.775 -4.253
2 24 1 -3.4443 -8.3151 1 -4.253 -7.775
0 // 3DSMAX Object: Optional Axle Tube End
5 24 1 0 -9 9 0 -9 1 3.44 -8.31 1 -3.4443 -8.3151
5 24 1 -3.4443 -8.3151 9 -3.4443 -8.3151 1 0 -9 1 -4.253 -7.775
5 24 1 -8.3151 -3.4443 9 -8.3151 -3.4443 1 -7.775 -4.253 9 -9 0
5 24 1 -5.66 -5.66 7 -5.659 -5.659 1 -4.253 -7.775 1 -7.775 -4.253
5 24 1 -9 0 9 -9 0 1 -8.3151 -3.4443 1 -8.3151 3.4443
