0 Tile  1 x  1 x  0.5 Round with Trans Dark Pink Raised Star Gem Pattern
0 Name: 72046p01.dat
0 Author: Takeshi Takahashi [RainbowDolphin]
0 !LDRAW_ORG Part UPDATE 2022-05
0 !LICENSE Redistributable under CCAL version 2.0 : see CAreadme.txt

0 BFC CERTIFY CCW

0 !KEYWORDS Set 41921, Bricklink 72046pb01

0 !HISTORY 2022-09-15 [PTadmin] Official Update 2022-05

1 16 0 0 0 1 0 0 0 1 0 0 0 1 s\72046s01.dat
1 37 0 0 0 1 0 0 0 1 0 0 0 1 s\72046s02.dat
