0 ~Electric Light & Sound Insectoid Tail  4 x 20 x  4.333 - Electronics
0 Name: u9577.dat
0 Author: Gerald Lasser [GeraldLasser]
0 !LDRAW_ORG Part UPDATE 2022-05
0 !LICENSE Redistributable under CCAL version 2.0 : see CAreadme.txt

0 BFC CERTIFY CCW

0 !HISTORY 2022-09-15 [PTadmin] Official Update 2022-05

0 // Printed Circuit Board
1 70 14.5 -27 -95.5 5.5 0 0 0 0 1 0 1 0 rect2p.dat
1 70 20 -27 -94.5 0 -1 0 1 0 0 0 0 -1 rect3.dat
1 70 27.5 -27 -93.5 0 0 -7.5 1 0 0 0 1 0 rect3.dat
1 70 35 -27 -78.25 0 -1 0 -1 0 0 0 0 15.25 rect.dat
1 70 26 -27 -43 -9 -1 0 0 0 1 20 0 0 rect2p.dat
1 70 0 -27 -23 0 0 17 1 0 0 0 -1 0 rect3.dat
1 70 -26 -27 -43 0 1 9 1 0 0 0 0 20 rect3.dat
1 70 -12.5642 -27 -129.9194 .6094 -1 0 0 0 -1 -1.2346 0 0 rect2p.dat
1 70 -35 -27 -97.077 0 1 0 -1 0 0 0 0 -34.077 rect.dat
1 70 -23.4774 -27 -131.154 0 0 11.5226 -1 0 0 0 1 0 rect3.dat
0 BFC INVERTNEXT
1 70 9 -26 -119.5 0 0 -24 0 -2 0 24 0 0 48\1-4cylo.dat
0 BFC INVERTNEXT
1 70 9 -26 -119.5 -24 0 0 0 -2 0 0 0 -24 48\1-16cylo.dat
1 70 9 -26 -119.5 0 0 -24 0 -1 0 24 0 0 48\1-4ndis.dat
1 70 9 -28 -119.5 0 0 -24 0 1 0 24 0 0 48\1-4ndis.dat
1 70 9 -26 -119.5 -24 0 0 0 -1 0 0 0 -24 48\1-16tndis.dat
1 70 9 -28 -119.5 -24 0 0 0 1 0 0 0 -24 48\1-16tndis.dat
0 BFC INVERTNEXT
1 70 0 -26 -59.5 -3.5 0 0 0 -2 0 0 0 3.5 4-4cylo.dat
1 70 0 -26 -59.5 -3.5 0 0 0 -1 0 0 0 3.5 4-4ndis.dat
1 70 0 -28 -59.5 -3.5 0 0 0 1 0 0 0 3.5 4-4ndis.dat
0 BFC INVERTNEXT
1 70 -17 -26 -75.5 -2.5 0 0 0 -2 0 0 0 2.5 4-4cylo.dat
0 BFC INVERTNEXT
1 70 -15 -26 -33.5 -2.5 0 0 0 -2 0 0 0 2.5 4-4cylo.dat
0 BFC INVERTNEXT
1 70 17 -26 -75.5 -2.5 0 0 0 -2 0 0 0 2.5 4-4cylo.dat
0 BFC INVERTNEXT
1 70 15 -26 -33.5 -2.5 0 0 0 -2 0 0 0 2.5 4-4cylo.dat
1 70 -17 -26 -75.5 -2.5 0 0 0 -1 0 0 0 2.5 4-4ndis.dat
1 70 -15 -26 -33.5 -2.5 0 0 0 -1 0 0 0 2.5 4-4ndis.dat
1 70 17 -26 -75.5 -2.5 0 0 0 -1 0 0 0 2.5 4-4ndis.dat
1 70 15 -26 -33.5 -2.5 0 0 0 -1 0 0 0 2.5 4-4ndis.dat
1 70 -17 -28 -75.5 -2.5 0 0 0 1 0 0 0 2.5 4-4ndis.dat
1 70 -15 -28 -33.5 -2.5 0 0 0 1 0 0 0 2.5 4-4ndis.dat
1 70 17 -28 -75.5 -2.5 0 0 0 1 0 0 0 2.5 4-4ndis.dat
1 70 15 -28 -33.5 -2.5 0 0 0 1 0 0 0 2.5 4-4ndis.dat
4 70 20 -28 -93.5 35 -28 -93.5 19.5 -28 -78 17 -28 -78
4 70 19.5 -28 -75.5 19.5 -28 -78 35 -28 -93.5 35 -28 -63
3 70 19.5 -28 -73 19.5 -28 -75.5 35 -28 -63
4 70 15 -28 -36 17 -28 -73 19.5 -28 -73 17.5 -28 -36
4 70 17 -28 -73 15 -28 -36 12.5 -28 -36 14.5 -28 -73
4 70 12.5 -28 -36 12.5 -28 -33.5 -12.5 -28 -33.5 -12.5 -28 -36
4 70 -12.5 -28 -31 -12.5 -28 -33.5 12.5 -28 -33.5 12.5 -28 -31
4 70 -12.5 -28 -31 12.5 -28 -31 17 -28 -23 -17 -28 -23
4 70 -3.5 -28 -56 3.5 -28 -56 12.5 -28 -36 -12.5 -28 -36
4 70 12.5 -28 -36 3.5 -28 -56 3.5 -28 -63 14.5 -28 -73
4 70 19.5 -28 -73 35 -28 -63 17.5 -28 -33.5 17.5 -28 -36
3 70 17.5 -28 -33.5 35 -28 -63 17.5 -28 -31
3 70 17.5 -28 -31 35 -28 -63 17 -28 -23
3 70 17.5 -28 -31 17 -28 -23 12.5 -28 -31
4 70 -14.5 -28 -78 14.5 -28 -78 14.5 -28 -73 -14.5 -28 -73
4 70 -3.5 -28 -63 -14.5 -28 -73 14.5 -28 -73 3.5 -28 -63
4 70 -19.5 -28 -78 -35 -28 -131.154 -15 -28 -95.5 -17 -28 -78
3 70 -15 -28 -119.5 -15 -28 -95.5 -35 -28 -131.154
4 70 -35 -28 -131.154 -19.5 -28 -78 -19.5 -28 -75.5 -35 -28 -63
3 70 -17 -28 -78 -15 -28 -95.5 -14.5 -28 -78
4 70 -15 -28 -95.5 9 -28 -95.5 14.5 -28 -78 -14.5 -28 -78
3 70 14.5 -28 -78 9 -28 -95.5 17 -28 -78
4 70 17 -28 -78 9 -28 -95.5 20 -28 -95.5 20 -28 -93.5
3 70 -19.5 -28 -75.5 -19.5 -28 -73 -35 -28 -63
4 70 -19.5 -28 -73 -17 -28 -73 -15 -28 -36 -17.5 -28 -36
4 70 -12.5 -28 -36 -15 -28 -36 -17 -28 -73 -14.5 -28 -73
4 70 -3.5 -28 -63 -3.5 -28 -56 -12.5 -28 -36 -14.5 -28 -73
4 70 -19.5 -28 -73 -17.5 -28 -36 -17.5 -28 -33.5 -35 -28 -63
3 70 -35 -28 -63 -17.5 -28 -33.5 -17.5 -28 -31
3 70 -35 -28 -63 -17.5 -28 -31 -17 -28 -23
3 70 -17 -28 -23 -17.5 -28 -31 -12.5 -28 -31
4 70 19.5 -26 -78 35 -26 -93.5 20 -26 -93.5 17 -26 -78
4 70 35 -26 -93.5 19.5 -26 -78 19.5 -26 -75.5 35 -26 -63
3 70 19.5 -26 -75.5 19.5 -26 -73 35 -26 -63
4 70 19.5 -26 -73 17 -26 -73 15 -26 -36 17.5 -26 -36
4 70 12.5 -26 -36 15 -26 -36 17 -26 -73 14.5 -26 -73
4 70 -12.5 -26 -33.5 12.5 -26 -33.5 12.5 -26 -36 -12.5 -26 -36
4 70 12.5 -26 -33.5 -12.5 -26 -33.5 -12.5 -26 -31 12.5 -26 -31
4 70 17 -26 -23 12.5 -26 -31 -12.5 -26 -31 -17 -26 -23
4 70 12.5 -26 -36 3.5 -26 -56 -3.5 -26 -56 -12.5 -26 -36
4 70 3.5 -26 -63 3.5 -26 -56 12.5 -26 -36 14.5 -26 -73
4 70 17.5 -26 -33.5 35 -26 -63 19.5 -26 -73 17.5 -26 -36
3 70 35 -26 -63 17.5 -26 -33.5 17.5 -26 -31
3 70 35 -26 -63 17.5 -26 -31 17 -26 -23
3 70 17 -26 -23 17.5 -26 -31 12.5 -26 -31
4 70 14.5 -26 -73 14.5 -26 -78 -14.5 -26 -78 -14.5 -26 -73
4 70 14.5 -26 -73 -14.5 -26 -73 -3.5 -26 -63 3.5 -26 -63
4 70 -15 -26 -95.5 -35 -26 -131.154 -19.5 -26 -78 -17 -26 -78
3 70 -15 -26 -95.5 -15 -26 -119.5 -35 -26 -131.154
4 70 -19.5 -26 -75.5 -19.5 -26 -78 -35 -26 -131.154 -35 -26 -63
3 70 -15 -26 -95.5 -17 -26 -78 -14.5 -26 -78
4 70 14.5 -26 -78 9 -26 -95.5 -15 -26 -95.5 -14.5 -26 -78
3 70 9 -26 -95.5 14.5 -26 -78 17 -26 -78
4 70 20 -26 -95.5 9 -26 -95.5 17 -26 -78 20 -26 -93.5
3 70 -19.5 -26 -73 -19.5 -26 -75.5 -35 -26 -63
4 70 -15 -26 -36 -17 -26 -73 -19.5 -26 -73 -17.5 -26 -36
4 70 -17 -26 -73 -15 -26 -36 -12.5 -26 -36 -14.5 -26 -73
4 70 -12.5 -26 -36 -3.5 -26 -56 -3.5 -26 -63 -14.5 -26 -73
4 70 -17.5 -26 -33.5 -17.5 -26 -36 -19.5 -26 -73 -35 -26 -63
3 70 -17.5 -26 -33.5 -35 -26 -63 -17.5 -26 -31
3 70 -17.5 -26 -31 -35 -26 -63 -17 -26 -23
3 70 -17.5 -26 -31 -17 -26 -23 -12.5 -26 -31
3 70 -15 -28 -119.5 -35 -28 -131.154 -15 -28 -128.6848
3 70 -15 -26 -119.5 -15 -26 -128.6848 -35 -26 -131.154
4 70 -35 -26 -131.154 -15 -26 -128.6848 -13.1736 -26 -128.6848 -11.9548 -26 -131.154
4 70 -13.1736 -28 -128.6848 -15 -28 -128.6848 -35 -28 -131.154 -11.9548 -28 -131.154

0 // LEDs
1 47 -31 -4 -28 1 0 0 0 0 1 0 -1 0 u9250.dat
1 494 -33.6 -26 -65 .4 0 0 0 18.4 0 0 0 .4 box4o4a.dat
1 494 -33.6 -4 -28 .4 0 0 0 0 .4 0 -33.4 0 box4o4a.dat
1 494 -34 -7.6 -61.4 0 1 0 .8 0 0 0 0 -.8 1-4ring4.dat
0 BFC INVERTNEXT
1 494 -34 -7.6 -61.4 0 .8 0 3.2 0 0 0 0 -3.2 1-4cylo.dat
1 494 -33.2 -7.6 -61.4 0 -1 0 .8 0 0 0 0 -.8 1-4ring4.dat
1 494 -34 -7.6 -61.4 0 .8 0 4 0 0 0 0 -4 1-4cylo.dat

1 494 -28.4 -26 -65 .4 0 0 0 18.4 0 0 0 .4 box4o4a.dat
1 494 -28.4 -4 -28 .4 0 0 0 0 .4 0 -33.4 0 box4o4a.dat
1 494 -28.8 -7.6 -61.4 0 1 0 .8 0 0 0 0 -.8 1-4ring4.dat
0 BFC INVERTNEXT
1 494 -28.8 -7.6 -61.4 0 .8 0 3.2 0 0 0 0 -3.2 1-4cylo.dat
1 494 -28 -7.6 -61.4 0 -1 0 .8 0 0 0 0 -.8 1-4ring4.dat
1 494 -28.8 -7.6 -61.4 0 .8 0 4 0 0 0 0 -4 1-4cylo.dat

1 47 31 -4 -28 -1 0 0 0 0 -1 0 -1 0 u9250.dat
1 494 33.6 -26 -65 .4 0 0 0 18.4 0 0 0 .4 box4o4a.dat
1 494 33.6 -4 -28 .4 0 0 0 0 .4 0 -33.4 0 box4o4a.dat
1 494 34 -7.6 -61.4 0 -1 0 .8 0 0 0 0 -.8 1-4ring4.dat
0 BFC INVERTNEXT
1 494 34 -7.6 -61.4 0 -.8 0 3.2 0 0 0 0 -3.2 1-4cylo.dat
1 494 33.2 -7.6 -61.4 0 1 0 .8 0 0 0 0 -.8 1-4ring4.dat
1 494 34 -7.6 -61.4 0 -.8 0 4 0 0 0 0 -4 1-4cylo.dat

1 494 28.4 -26 -65 .4 0 0 0 18.4 0 0 0 .4 box4o4a.dat
1 494 28.4 -4 -28 .4 0 0 0 0 .4 0 -33.4 0 box4o4a.dat
1 494 28.8 -7.6 -61.4 0 -1 0 .8 0 0 0 0 -.8 1-4ring4.dat
0 BFC INVERTNEXT
1 494 28.8 -7.6 -61.4 0 -.8 0 3.2 0 0 0 0 -3.2 1-4cylo.dat
1 494 28 -7.6 -61.4 0 1 0 .8 0 0 0 0 -.8 1-4ring4.dat
1 494 28.8 -7.6 -61.4 0 -.8 0 4 0 0 0 0 -4 1-4cylo.dat

0 // Speaker
1 495 8.4193 -32.2619 -121 19.5238 -.21693 0 4.3386 .97619 0 0 0 20 4-4cylo.dat
0 BFC INVERTNEXT
1 495 8.4193 -32.2619 -121 7.80952 -.21693 0 1.73544 .97619 0 0 0 8 4-4cylo.dat
1 495 8.4193 -32.2619 -121 7.80952 0 0 1.73544 1 0 0 0 8 4-4ring1.dat
1 495 8.4193 -32.2619 -121 3.90476 0 0 .86772 1 0 0 0 4 4-4ring4.dat

1 493 8.2024 -31.2857 -121 19.03571 -1.73544 0 4.23014 7.80952 0 0 0 19.5 4-4cylo.dat
0 BFC INVERTNEXT
1 493 8.2024 -31.2857 -121 7.80952 -1.73544 0 1.73544 7.80952 0 0 0 8 4-4cylo.dat
1 493 8.2024 -31.2857 -121 7.80952 0 0 1.73544 1 0 0 0 8 4-4ndis.dat
1 493 8.2024 -31.2857 -121 19.03571 0 0 4.23014 1 0 0 0 -19.5 1-4chrd.dat
1 493 8.2024 -31.2857 -121 19.03571 0 0 4.23014 1 0 0 0 19.5 1-4chrd.dat
1 493 8.2024 -31.2857 -121 -19.03571 0 0 -4.23014 1 0 0 0 -19.5 1-4chrd.dat
1 493 8.2024 -31.2857 -121 -19.03571 0 0 -4.23014 1 0 0 0 19.5 1-4chrd.dat
3 493 8.2024 -31.2857 -140.5 16.0119 -29.5503 -129 8.2024 -31.2857 -129
3 493 8.2024 -31.2857 -140.5 8.2024 -31.2857 -129 .3929 -33.0212 -129
3 493 8.2024 -31.2857 -140.5 .3929 -33.0212 -129 -10.8333 -35.5158 -121
3 493 -10.8333 -35.5158 -121 .3929 -33.0212 -129 .3929 -33.0212 -121
3 493 -10.8333 -35.5158 -121 .3929 -33.0212 -121 .3929 -33.0212 -113
3 493 8.2024 -31.2857 -101.5 -10.8333 -35.5158 -121 .3929 -33.0212 -113
3 493 8.2024 -31.2857 -101.5 .3929 -33.0212 -113 8.2024 -31.2857 -113
3 493 8.2024 -31.2857 -101.5 8.2024 -31.2857 -113 16.0119 -29.5503 -113
3 493 16.0119 -29.5503 -113 27.2381 -27.0556 -121 8.2024 -31.2857 -101.5
3 493 27.2381 -27.0556 -121 16.0119 -29.5503 -113 16.0119 -29.5503 -121
3 493 27.2381 -27.0556 -121 16.0119 -29.5503 -121 16.0119 -29.5503 -129
3 493 27.2381 -27.0556 -121 16.0119 -29.5503 -129 8.2024 -31.2857 -140.5

1 493 6.4669 -23.4762 -121 7.80952 0 0 1.73544 -1 0 0 0 -8 4-4ndis.dat
1 493 6.4669 -23.4762 -121 19.03571 0 0 4.23014 -1 0 0 0 19.5 1-4chrd.dat
1 493 6.4669 -23.4762 -121 19.03571 0 0 4.23014 -1 0 0 0 -19.5 1-4chrd.dat
1 493 6.4669 -23.4762 -121 -19.03571 0 0 -4.23014 -1 0 0 0 19.5 1-4chrd.dat
1 493 6.4669 -23.4762 -121 -19.03571 0 0 -4.23014 -1 0 0 0 -19.5 1-4chrd.dat
3 493 6.4669 -23.4762 -101.5 14.2765 -21.7408 -113 6.4669 -23.4762 -113
3 493 6.4669 -23.4762 -101.5 6.4669 -23.4762 -113 -1.3426 -25.2116 -113
3 493 6.4669 -23.4762 -101.5 -1.3426 -25.2116 -113 -12.5688 -27.7063 -121
3 493 -12.5688 -27.7063 -121 -1.3426 -25.2116 -113 -1.3426 -25.2116 -121
3 493 -12.5688 -27.7063 -121 -1.3426 -25.2116 -121 -1.3426 -25.2116 -129
3 493 6.4669 -23.4762 -140.5 -12.5688 -27.7063 -121 -1.3426 -25.2116 -129
3 493 6.4669 -23.4762 -140.5 -1.3426 -25.2116 -129 6.4669 -23.4762 -129
3 493 6.4669 -23.4762 -140.5 6.4669 -23.4762 -129 14.2765 -21.7408 -129
3 493 14.2765 -21.7408 -129 25.5026 -19.2461 -121 6.4669 -23.4762 -140.5
3 493 25.5026 -19.2461 -121 14.2765 -21.7408 -129 14.2765 -21.7408 -121
3 493 25.5026 -19.2461 -121 14.2765 -21.7408 -121 14.2765 -21.7408 -113
3 493 25.5026 -19.2461 -121 14.2765 -21.7408 -113 6.4669 -23.4762 -101.5

1 495 6.4669 -23.4762 -121 16.59523 -.21693 0 3.68781 .97619 0 0 0 17 4-4cylc.dat
1 495 6.25 -22.5 -121 16.59523 0 0 3.68781 -1 0 0 0 17 4-4disc.dat
1 493 8.2024 -31.2857 -121 6.83333 -1.73544 0 1.51851 7.80952 0 0 0 7 4-4cylo.dat
1 495 8.4193 -32.2619 -121 6.83333 -.21693 0 1.51851 .97619 0 0 0 7 4-4cylc.dat

0 // Speaker attachment
0 BFC INVERTNEXT
1 0 8.4193 -32.2619 -121 17.57142 .43386 0 3.90474 -1.95238 0 0 0 18 4-4cylo.dat
1 0 9.50395 -37.14285 -121 25.38094 -1.73544 0 5.64018 7.80952 0 0 0 26 4-4cylo.dat
0 BFC INVERTNEXT
1 0 8.4193 -32.2619 -121 19.5238 -.65079 0 4.3386 2.92857 0 0 0 20 4-4cylo.dat
1 0 7.76851 -29.33333 -121 3.90476 0 0 .86772 -1 0 0 0 4 4-4ring5.dat
1 0 7.76851 -29.33333 -121 1.95238 0 0 .43386 -1 0 0 0 2 4-4rin12.dat
1 0 9.50395 -37.14285 -121 .97619 0 0 .21693 1 0 0 0 1 4-4rin25.dat
0 BFC INVERTNEXT
1 0 9.50395 -37.14285 -121 24.40475 -.65079 0 5.42325 2.92857 0 0 0 25 4-4cylo.dat
1 0 8.85316 -34.21428 -121 4.88095 0 0 1.08465 1 0 0 0 5 4-4ring4.dat
1 0 8.85316 -34.21428 -121 1.95238 0 0 .43386 1 0 0 0 2 4-4ring9.dat

0 // Speaker Foil
1 47 9.07009 -35.19047 -121 9.7619 -.65079 0 2.1693 2.92857 0 0 0 10 bump5000.dat
0 BFC INVERTNEXT
1 47 8.85316 -34.21428 -121 9.7619 -.65079 0 2.1693 2.92857 0 0 0 10 bump5000.dat
0 BFC INVERTNEXT
1 47 9.50395 -37.14285 -121 4.88095 -.43386 0 1.08465 1.95238 0 0 0 5 4-4con2.dat
1 47 9.28702 -36.16666 -121 4.88095 -.43386 0 1.08465 1.95238 0 0 0 5 4-4con2.dat
1 16 9.28702 -36.16666 -121 14.64285 0 0 3.25395 1 0 0 0 15 4-4edge.dat
1 16 9.50395 -37.14285 -121 14.64285 0 0 3.25395 1 0 0 0 15 4-4edge.dat
1 47 9.07009 -35.19047 -121 4.88095 .43386 0 1.08465 -1.95238 0 0 0 5 4-4con3.dat
0 BFC INVERTNEXT
1 47 8.85316 -34.21428 -121 4.88095 .43386 0 1.08465 -1.95238 0 0 0 5 4-4con3.dat
1 16 8.85316 -34.21428 -121 19.5238 0 0 4.3386 1 0 0 0 20 4-4edge.dat
1 16 9.07009 -35.19047 -121 19.5238 0 0 4.3386 1 0 0 0 20 4-4edge.dat
1 47 9.07009 -35.19047 -121 4.88095 0 0 1.08465 1 0 0 0 5 4-4ring4.dat
1 47 8.85316 -34.21428 -121 4.88095 0 0 1.08465 -1 0 0 0 5 4-4ring4.dat
0 BFC INVERTNEXT
1 47 9.07009 -35.19047 -121 24.40475 -.21693 0 5.42325 .97619 0 0 0 25 4-4cylo.dat

0 // Battery Contact Positive
1 494 0 11 -152.25 0 0 15 0 -1 0 .75 0 0 rect.dat
1 494 -12.5 -4.1695 -150.76235 0 0 -2.5 2.1695 0 0 -.73765 -1 0 rect.dat
1 494 -15 -27 -150 0 1 0 0 0 -1.5 -1.5 0 0 1-4ring1.dat
0 BFC INVERTNEXT
1 494 -3 -27 -150 0 -12 0 0 0 -1.5 -1.5 0 0 1-4cylo.dat
1 494 -3 -27 -150 0 -1 0 0 0 -1.5 -1.5 0 0 1-4ring1.dat
1 494 -15 -27 -150 0 12 0 0 0 -3 -3 0 0 1-4cylo.dat
1 494 0 -3 -151.5 -9 0 0 0 0 -9 0 -1 0 4-4edge.dat
1 494 0 -3 -149 -3 0 0 0 0 -3 0 -1 0 4-4edge.dat
1 494 0 -3 -151.5 -3 0 0 0 0 -3 0 1.5 0 4-4con2.dat
1 494 0 -3 -150 -3 0 0 0 0 -3 0 1 0 4-4con1.dat
1 494 0 -3 -149 -3 0 0 0 0 -3 0 -1 0 4-4disc.dat
1 494 -12.5 -4.55 -152.25 -2.5 0 0 0 0 2.25 0 1 -.75 rect1.dat
1 494 0 -3 -151.5 -9 0 0 0 0 -9 0 -1 0 4-4ndis.dat
4 494 15 11 -151.5 -15 11 -151.5 -9 6 -151.5 0 6 -151.5
3 494 15 11 -151.5 0 6 -151.5 9 6 -151.5
4 494 -3 -25 -151.5 15 -25 -151.5 9 -12 -151.5 0 -12 -151.5
4 494 -15 -27 -151.5 -3 -25 -151.5 0 -12 -151.5 -9 -12 -151.5
1 494 0 -3 -153 -9 0 0 0 0 -9 0 1 0 4-4ndis.dat
4 494 -9 6 -153 -15 11 -153 15 11 -153 0 6 -153
3 494 0 6 -153 15 11 -153 9 6 -153
4 494 -3 -25 -153 0 -12 -153 9 -12 -153 15 -25 -153
4 494 0 -12 -153 -3 -25 -153 -15 -27 -153 -9 -12 -153

1 494 0 -3 -153 -9 0 0 0 0 -9 0 1 0 4-4edge.dat
1 494 0 -3 -150.5 -3 0 0 0 0 -3 0 1 0 4-4edge.dat
0 BFC INVERTNEXT
1 494 0 -3 -153 -3 0 0 0 0 -3 0 1.5 0 4-4con2.dat
0 BFC INVERTNEXT
1 494 0 -3 -151.5 -3 0 0 0 0 -3 0 1 0 4-4con1.dat
1 494 0 -3 -150.5 -3 0 0 0 0 -3 0 1 0 4-4disc.dat
1 494 -15 -17 -152.25 0 1 0 0 0 10 .75 0 0 rect3.dat
1 494 6 -25 -152.25 0 0 9 0 1 0 -.75 0 0 rect3.dat
4 494 -15 -30 -121.5 -21.1579 -30 -130.5 -15 -30 -150 -3 -30 -150
1 494 -33 -29.25 -126 0 1 0 0 0 -.75 -4.5 0 0 rect2p.dat
1 494 -24 -29.25 -121.5 0 0 -9 .75 0 0 0 -1 0 rect.dat
1 494 -9 -29.25 -135.75 -6 0 0 0 0 -.75 14.25 -1 0 rect2p.dat
1 494 -27.07895 -29.25 -130.5 -5.92105 0 0 0 0 .75 0 1 0 rect.dat
1 494 -18.07895 -29.25 -140.25 3.07895 0 0 0 0 -.75 -9.75 1 0 rect2p.dat
4 494 -15 -30 -121.5 -33 -30 -121.5 -33 -30 -130.5 -21.1579 -30 -130.5
1 494 -3 -26 -152.25 0 -1 0 0 0 1 -.75 0 0 rect3.dat
3 494 -15 -27 -153 -3 -25 -153 -3 -27 -153
3 494 -3 -25 -151.5 -15 -27 -151.5 -3 -27 -151.5
4 494 -15 -28.5 -121.5 -3 -28.5 -150 -15 -28.5 -150 -21.1579 -28.5 -130.5
4 494 -33 -28.5 -121.5 -15 -28.5 -121.5 -21.1579 -28.5 -130.5 -33 -28.5 -130.5
4 494 -15 11 -153 -9 6 -153 -10 -2.3 -153 -15 -2.3 -153
4 494 -9 6 -153 -9 -3 -153 -10 -7 -153 -10 -2.3 -153
4 494 -15 -27 -153 -15 -7 -153 -10 -7 -153 -9 -12 -153
3 494 -9 -12 -153 -10 -7 -153 -9 -3 -153
1 494 -12.5 -7 -152.25 2.5 0 0 0 -1 0 0 0 -.75 rect2p.dat
4 494 -10 -2.3 -153 -10 -7 -153 -10 -7 -151.5 -10 -6.8 -151.5
4 494 -15 -6.8 -151.5 -15 -6.339 -150.0247 -15 -2 -151.5 -15 -2.3 -153
4 494 -15 -2.3 -153 -15 -2 -151.5 -15 11 -151.5 -15 11 -153
4 494 -9 -12 -151.5 -10 -7 -151.5 -15 -7 -151.5 -15 -27 -151.5
4 494 -15 11 -151.5 -15 -2 -151.5 -10 -2 -151.5 -9 6 -151.5
1 494 -12.5 -6.5695 -150.76235 -2.5 0 0 0 0 -.2305 0 -1 -.73765 rect3.dat
3 494 -9 -3 -151.5 -10 -7 -151.5 -9 -12 -151.5
4 494 -9 6 -151.5 -10 -2 -151.5 -10 -7 -151.5 -9 -3 -151.5
3 494 -10 -6.339 -150.0247 -10 -6.8 -151.5 -10 -2 -151.5
2 24 -10 -2 -151.5 -10 -6.8 -151.5
2 24 -10 -6.8 -151.5 -10 -7 -151.5
2 24 -15 11 -153 -15 -2.3 -153
2 24 -15 -2 -151.5 -15 11 -151.5
2 24 -10 -2.3 -153 -10 -7 -153
1 494 12.5 -4.1695 -150.76235 0 0 2.5 -2.1695 0 0 .73765 -1 0 rect2p.dat
1 494 12.5 -4.55 -152.25 0 0 2.5 2.25 0 0 -.75 1 0 rect2p.dat
1 494 15 -16 -152.25 0 -1 0 -9 0 0 0 0 -.75 rect2p.dat
4 494 10 -2.3 -153 9 6 -153 15 11 -153 15 -2.3 -153
4 494 10 -7 -153 9 -3 -153 9 6 -153 10 -2.3 -153
4 494 10 -7 -153 15 -7 -153 15 -25 -153 9 -12 -153
3 494 10 -7 -153 9 -12 -153 9 -3 -153
4 494 15 -2 -151.5 15 -6.339 -150.0247 15 -6.8 -151.5 15 -2.3 -153
4 494 15 11 -151.5 15 -2 -151.5 15 -2.3 -153 15 11 -153
4 494 15 -7 -151.5 10 -7 -151.5 9 -12 -151.5 15 -25 -151.5
4 494 10 -2 -151.5 15 -2 -151.5 15 11 -151.5 9 6 -151.5
1 494 12.5 -6.5695 -150.76235 -2.5 0 0 0 0 -.2305 0 -1 -.73765 rect.dat
3 494 10 -7 -151.5 9 -3 -151.5 9 -12 -151.5
4 494 10 -7 -151.5 10 -2 -151.5 9 6 -151.5 9 -3 -151.5
3 494 10 -6.8 -151.5 10 -6.339 -150.0247 10 -2 -151.5
4 494 10 -6.8 -151.5 10 -7 -151.5 10 -7 -153 10 -2.3 -153
1 494 12.5 -7 -152.25 -2.5 0 0 0 -1 0 0 0 .75 rect.dat
2 24 10 -2.3 -153 10 -7 -153
2 24 10 -7 -151.5 10 -6.8 -151.5
2 24 15 -2 -151.5 15 11 -151.5
2 24 15 11 -153 15 -2.3 -153
2 24 -10 -6.8 -151.5 -10 -2.3 -153
2 24 -10 -2.3 -153 -15 -2.3 -153
2 24 -10 -7 -153 -10 -7 -151.5
2 24 15 -2.3 -153 10 -2.3 -153
2 24 10 -6.8 -151.5 10 -2 -151.5
2 24 10 -2 -151.5 15 -2 -151.5
5 24 5.5434 -.7038 -151.5 4.2426 1.2426 -151.5 2.1213 -.8787 -150.5 6.3639 3.3639 -153
5 24 4.2426 1.2426 -151.5 2.2962 2.5434 -151.5 1.1481 -.2283 -150.5 3.4443 5.3151 -153
5 24 2.2962 2.5434 -151.5 0 3 -151.5 0 6 -153 0 0 -150.5
5 24 0 3 -151.5 -2.2962 2.5434 -151.5 -3.4443 5.3151 -153 -1.1481 -.2283 -150.5
5 24 -2.2962 2.5434 -151.5 -4.2426 1.2426 -151.5 -2.1213 -.8787 -150.5 -6.3639 3.3639 -153
5 24 -4.2426 1.2426 -151.5 -5.5434 -.7038 -151.5 -8.3151 .4443 -153 -2.7717 -1.8519 -150.5
5 24 -5.5434 -.7038 -151.5 -6 -3 -151.5 -9 -3 -153 -3 -3 -150.5
5 24 -6 -3 -151.5 -5.5434 -5.2962 -151.5 -8.3151 -6.4443 -153 -2.7717 -4.1481 -150.5
5 24 -5.5434 -5.2962 -151.5 -4.2426 -7.2426 -151.5 -6.3639 -9.3639 -153 -2.1213 -5.1213 -150.5
5 24 -4.2426 -7.2426 -151.5 -2.2962 -8.5434 -151.5 -3.4443 -11.3151 -153 -1.1481 -5.7717 -150.5
5 24 0 -9 -151.5 -2.2962 -8.5434 -151.5 0 -6 -150.5 0 -12 -153
5 24 2.2962 -8.5434 -151.5 0 -9 -151.5 1.1481 -5.7717 -150.5 3.4443 -11.3151 -153
5 24 4.2426 -7.2426 -151.5 2.2962 -8.5434 -151.5 1.1481 -5.7717 -150.5 3.4443 -11.3151 -153
5 24 5.5434 -5.2962 -151.5 4.2426 -7.2426 -151.5 2.1213 -5.1213 -150.5 6.3639 -9.3639 -153
5 24 6 -3 -151.5 5.5434 -5.2962 -151.5 2.7717 -4.1481 -150.5 8.3151 -6.4443 -153
5 24 5.5434 -.7038 -151.5 6 -3 -151.5 3 -3 -150.5 9 -3 -153
5 24 -4.2426 1.2426 -150 -5.5434 -.7038 -150 -8.3151 .4443 -151.5 -2.7717 -1.8519 -149
5 24 -5.5434 -.7038 -150 -6 -3 -150 -9 -3 -151.5 -3 -3 -149
5 24 -6 -3 -150 -5.5434 -5.2962 -150 -8.3151 -6.4443 -151.5 -2.7717 -4.1481 -149
5 24 -5.5434 -5.2962 -150 -4.2426 -7.2426 -150 -6.3639 -9.3639 -151.5 -2.1213 -5.1213 -149
5 24 -4.2426 -7.2426 -150 -2.2962 -8.5434 -150 -3.4443 -11.3151 -151.5 -1.1481 -5.7717 -149
5 24 -2.2962 -8.5434 -150 0 -9 -150 0 -12 -151.5 0 -6 -149
5 24 0 -9 -150 2.2962 -8.5434 -150 3.4443 -11.3151 -151.5 1.1481 -5.7717 -149
5 24 2.2962 -8.5434 -150 4.2426 -7.2426 -150 6.3639 -9.3639 -151.5 2.1213 -5.1213 -149
5 24 4.2426 -7.2426 -150 5.5434 -5.2962 -150 8.3151 -6.4443 -151.5 2.7717 -4.1481 -149
5 24 6 -3 -150 5.5434 -5.2962 -150 9 -3 -151.5 3 -3 -149
5 24 5.5434 -.7038 -150 6 -3 -150 9 -3 -151.5 3 -3 -149
5 24 4.2426 1.2426 -150 5.5434 -.7038 -150 2.7717 -1.8519 -149 8.3151 .4443 -151.5
5 24 4.2426 1.2426 -150 2.2962 2.5434 -150 1.1481 -.2283 -149 3.4443 5.3151 -151.5
5 24 2.2962 2.5434 -150 0 3 -150 0 0 -149 0 6 -151.5
5 24 0 3 -150 -2.2962 2.5434 -150 -1.1481 -.2283 -149 -3.4443 5.3151 -151.5
5 24 -2.2962 2.5434 -150 -4.2426 1.2426 -150 -2.1213 -.8787 -149 -6.3639 3.3639 -151.5

0 // Battery Contact Negative
1 494 0 15 112.75 -15 0 0 0 -1 0 0 0 .75 rect.dat
1 494 -12.5 -2.1695 111.26235 2.5 0 0 0 0 -2.1695 0 1 -.73765 rect.dat
1 494 -15 -25 115 0 1 0 0 0 -1.5 -1.5 0 0 1-4ring1.dat
0 BFC INVERTNEXT
1 494 -6 -25 115 0 -9 0 0 0 -1.5 -1.5 0 0 1-4cylo.dat
1 494 -6 -25 115 0 -1 0 0 0 -1.5 -1.5 0 0 1-4ring1.dat
1 494 -15 -25 115 0 9 0 0 0 -3 -3 0 0 1-4cylo.dat
1 494 -12.5 -2.55 112.75 -2.5 0 0 0 0 -2.25 0 -1 -.75 rect2a.dat
4 494 15 15 112 -2.5 8 112 -3 8 112 -15 15 112
3 494 2.5 8 112 -2.5 8 112 15 15 112
3 494 2.5 8 112 15 15 112 3 8 112
4 494 -6 -23 112 2.5 -14 112 3 -14 112 15 -23 112
3 494 -2.5 -14 112 2.5 -14 112 -6 -23 112
4 494 -2.5 -14 112 -6 -23 112 -15 -25 112 -3 -14 112
4 494 -15 15 113.5 -2.5 8 113.5 2.5 8 113.5 15 15 113.5
3 494 -3 8 113.5 -2.5 8 113.5 -15 15 113.5
3 494 15 15 113.5 2.5 8 113.5 3 8 113.5
3 494 2.5 -14 113.5 -2.5 -14 113.5 -6 -23 113.5
4 494 -15 -25 113.5 -6 -23 113.5 -2.5 -14 113.5 -3 -14 113.5
1 494 -15 -15 112.75 0 1 0 -10 0 0 0 0 .75 rect2p.dat
1 494 4.5 -23 112.75 10.5 0 0 0 1 0 0 0 .75 rect2p.dat
1 494 -6 -24 112.75 0 -1 0 0 0 1 -.75 0 0 rect3.dat
3 494 -6 -23 113.5 -15 -25 113.5 -6 -25 113.5
3 494 -15 -25 112 -6 -23 112 -6 -25 112
4 494 -10 -.3 113.5 -3 8 113.5 -15 15 113.5 -15 -.3 113.5
4 494 -10 -5 113.5 -3 -14 113.5 -3 8 113.5 -10 -.3 113.5
4 494 -10 -5 113.5 -15 -5 113.5 -15 -25 113.5 -3 -14 113.5
1 494 -12.5 -5 112.75 0 0 -2.5 0 -1 0 -.75 0 0 rect3.dat
4 494 -10 -5 112 -10 -5 113.5 -10 -.3 113.5 -10 -4.8 112
4 494 -15 0 112 -15 -4.339 110.5247 -15 -4.8 112 -15 -.3 113.5
4 494 -15 15 112 -15 0 112 -15 -.3 113.5 -15 15 113.5
4 494 -15 -5 112 -10 -5 112 -3 -14 112 -15 -25 112
4 494 -10 0 112 -15 0 112 -15 15 112 -3 8 112
1 494 -12.5 -4.5695 111.26235 0 0 -2.5 -.2305 0 0 .73765 1 0 rect2p.dat
4 494 -10 -5 112 -10 0 112 -3 8 112 -3 -14 112
3 494 -10 -4.8 112 -10 -4.339 110.5247 -10 0 112
2 24 -10 0 112 -10 -4.8 112
2 24 -10 -4.8 112 -10 -5 112
2 24 -15 15 113.5 -15 -.3 113.5
2 24 -15 0 112 -15 15 112
2 24 -10 -.3 113.5 -10 -5 113.5
1 494 12.5 -2.1695 111.26235 0 0 2.5 2.1695 0 0 .73765 1 0 rect2p.dat
1 494 12.5 -2.55 112.75 0 0 2.5 -2.25 0 0 -.75 -1 0 rect2p.dat
1 494 15 -14 112.75 0 -1 0 0 0 -9 .75 0 0 rect3.dat
4 494 15 15 113.5 3 8 113.5 10 -.3 113.5 15 -.3 113.5
4 494 15 -23 113.5 15 -5 113.5 10 -5 113.5 3 -14 113.5
4 494 10 -.3 113.5 3 8 113.5 3 -14 113.5 10 -5 113.5
4 494 15 -4.8 112 15 -4.339 110.5247 15 0 112 15 -.3 113.5
4 494 15 -.3 113.5 15 0 112 15 15 112 15 15 113.5
4 494 3 -14 112 10 -5 112 15 -5 112 15 -23 112
4 494 15 15 112 15 0 112 10 0 112 3 8 112
1 494 12.5 -4.5695 111.26235 0 0 2.5 .2305 0 0 -.73765 1 0 rect.dat
4 494 3 -14 112 3 8 112 10 0 112 10 -5 112
3 494 10 -4.339 110.5247 10 -4.8 112 10 0 112
4 494 10 -5 113.5 10 -5 112 10 -4.8 112 10 -.3 113.5
1 494 12.5 -5 112.75 0 0 2.5 0 -1 0 .75 0 0 rect.dat
2 24 10 -.3 113.5 10 -5 113.5
2 24 10 -5 112 10 -4.8 112
2 24 15 0 112 15 15 112
2 24 15 15 113.5 15 -.3 113.5
2 24 10 0 112 15 0 112
2 24 10 -4.8 112 10 0 112
2 24 -15 -.3 113.5 -10 -.3 113.5
2 24 -10 -.3 113.5 -10 -4.8 112
2 24 10 -.3 113.5 15 -.3 113.5

1 494 -10.5 -27.25 115 4.5 0 0 0 0 -.75 0 16 0 box5-4a.dat
1 494 2.5 8 110.5 0 -5 0 0 0 -3 3 0 0 3-16cylo.dat
0 BFC INVERTNEXT
1 494 2.5 8 110.5 0 -5 0 0 0 -1.5 1.5 0 0 1-8cylo.dat
1 494 2.5 8 110.5 0 -1 0 0 0 -3 3 0 0 3-16chrd.dat
1 494 2.5 8 110.5 0 -1 0 0 0 -1.5 1.5 0 0 1-8ndis.dat
1 494 -2.5 8 110.5 0 1 0 0 0 -3 3 0 0 3-16chrd.dat
1 494 -2.5 8 110.5 0 1 0 0 0 -1.5 1.5 0 0 1-8ndis.dat
0 BFC INVERTNEXT
1 494 -2.5 4.1676 112.7088 0 5 0 0 0 1.5 -1.5 0 0 1-8cylo.dat
1 494 -2.5 4.1676 112.7088 0 5 0 0 0 3 -3 0 0 3-16cylo.dat
1 494 -2.5 4.1676 112.7088 0 1 0 0 0 1.5 -1.5 0 0 1-8ndis.dat
1 494 -2.5 4.1676 112.7088 0 1 0 0 0 3 -3 0 0 3-16chrd.dat
1 494 2.5 4.1676 112.7088 0 -1 0 0 0 1.5 -1.5 0 0 1-8ndis.dat
1 494 2.5 4.1676 112.7088 0 -1 0 0 0 3 -3 0 0 3-16chrd.dat
3 494 -2.5 4.1676 109.7088 -2.5 4.1676 111.2088 -2.5 5.6676 111.2088
4 494 -2.5 4.1676 109.7088 -2.5 5.6676 111.2088 -2.5 6.5 112 -2.5 6.9393 111.5607
3 494 -2.5 8 113.5 -2.5 8 112 -2.5 6.5 112
4 494 -2.5 5.6676 111.2088 -2.5 5.22825 111.64815 -2.5 8 113.5 -2.5 6.5 112
3 494 2.5 4.1676 111.2088 2.5 4.1676 109.7088 2.5 5.6676 111.2088
4 494 2.5 6.5 112 2.5 5.6676 111.2088 2.5 4.1676 109.7088 2.5 6.9393 111.5607
4 494 2.5 8 113.5 2.5 5.22825 111.64815 2.5 5.6676 111.2088 2.5 6.5 112
3 494 2.5 8 113.5 2.5 6.5 112 2.5 8 112
1 494 2.5 -14 110.5 0 -5 0 0 0 3 3 0 0 3-16cylo.dat
0 BFC INVERTNEXT
1 494 2.5 -14 110.5 0 -5 0 0 0 1.5 1.5 0 0 1-8cylo.dat
1 494 2.5 -14 110.5 0 -1 0 0 0 3 3 0 0 3-16chrd.dat
1 494 2.5 -14 110.5 0 -1 0 0 0 1.5 1.5 0 0 1-8ndis.dat
1 494 -2.5 -14 110.5 0 1 0 0 0 3 3 0 0 3-16chrd.dat
1 494 -2.5 -14 110.5 0 1 0 0 0 1.5 1.5 0 0 1-8ndis.dat
0 BFC INVERTNEXT
1 494 -2.5 -10.1676 112.7088 0 5 0 0 0 -1.5 -1.5 0 0 1-8cylo.dat
1 494 -2.5 -10.1676 112.7088 0 5 0 0 0 -3 -3 0 0 3-16cylo.dat
1 494 -2.5 -10.1676 112.7088 0 1 0 0 0 -1.5 -1.5 0 0 1-8ndis.dat
1 494 -2.5 -10.1676 112.7088 0 1 0 0 0 -3 -3 0 0 3-16chrd.dat
1 494 2.5 -10.1676 112.7088 0 -1 0 0 0 -1.5 -1.5 0 0 1-8ndis.dat
1 494 2.5 -10.1676 112.7088 0 -1 0 0 0 -3 -3 0 0 3-16chrd.dat
3 494 -2.5 -10.1676 111.2088 -2.5 -10.1676 109.7088 -2.5 -11.6676 111.2088
4 494 -2.5 -14 113.5 -2.5 -11.22825 111.64815 -2.5 -11.6676 111.2088 -2.5 -12.5 112
4 494 -2.5 -10.1676 109.7088 -2.5 -12.9393 111.5607 -2.5 -12.5 112 -2.5 -11.6676 111.2088
3 494 -2.5 -14 112 -2.5 -14 113.5 -2.5 -12.5 112
3 494 2.5 -10.1676 109.7088 2.5 -10.1676 111.2088 2.5 -11.6676 111.2088
4 494 2.5 -12.5 112 2.5 -12.9393 111.5607 2.5 -10.1676 109.7088 2.5 -11.6676 111.2088
4 494 2.5 -14 113.5 2.5 -12.5 112 2.5 -11.6676 111.2088 2.5 -11.22825 111.64815
3 494 2.5 -12.5 112 2.5 -14 113.5 2.5 -14 112
1 494 0 -10.1676 110.5 0 0 -2.5 0 14.4135 0 -.75 0 0 box4o8a.dat
0 BFC INVERTNEXT
1 494 2.5 -3 112.75 0 .5 0 0 0 11 .75 0 0 box3u2p.dat
0 BFC INVERTNEXT
1 494 -2.5 -3 112.75 0 -.5 0 0 0 11 .75 0 0 box3u2p.dat
4 494 3 -14 113.5 2.5 -14 113.5 -6 -23 113.5 15 -23 113.5
5 24 -15 -30 -150 -15 -28.5 -150 -15 -29.7717 -151.1481 -21.1579 -30 -130.5
5 24 -3 -30 -150 -3 -28.5 -150 -3 -28.38585 -150.57405 -15 -30 -121.5
