0 Slope Brick Curved  2 x  2 x  0.667 with Bright Light Orange and Gold Ruffles with Dark Red Outline Pattern
0 Name: 15068p0e.dat
0 Author: Gerald Lasser [GeraldLasser]
0 !LDRAW_ORG Part UPDATE 2022-04
0 !LICENSE Redistributable under CCAL version 2.0 : see CAreadme.txt

0 BFC CERTIFY CCW

0 !KEYWORDS Chinese New Year, Lion Dance
0 !KEYWORDS Bricklink 15068pb227, Set 80104

0 !HISTORY 2022-07-18 [PTadmin] Official Update 2022-04

0 // Pattern
1 16 0 0 0 1 0 0 0 1 0 0 0 1 s\15068p0cs01.dat
1 191 0 0 0 1 0 0 0 1 0 0 0 1 s\15068p0cs02.dat
1 82 0 0 0 1 0 0 0 1 0 0 0 1 s\15068p0cs03.dat
