0 Animal Wing Right Pteranodon with Marbled Dark Bluish Grey Edge Pattern
0 Name: 98089p02.dat
0 Author: Philippe Hurbain [Philo]
0 !LDRAW_ORG Part UPDATE 2022-02
0 !LICENSE Redistributable under CCAL version 2.0 : see CAreadme.txt

0 BFC CERTIFY CCW

0 !KEYWORDS Dinosaur

0 !HISTORY 2013-08-14 {LEGO Digital Designer} Original part shape
0 !HISTORY 2021-01-07 [Philo] File preparation for LDraw Parts Tracker
0 !HISTORY 2022-03-06 [PTadmin] Official Update 2022-02

1 16 0 0 0 -1 0 0 0 1 0 0 0 1 98088p02.dat