0 Sticker  1.8 x  1.8 with Black/Red/Blue Badge and "POLICE"
0 Name: 4615865a.dat
0 Author: Massimo Maso [Sirio]
0 !LDRAW_ORG Part UPDATE 2015-01
0 !LICENSE Redistributable under CCAL version 2.0 : see CAreadme.txt

0 BFC CERTIFY CCW

0 !HISTORY 2015-10-11 [PTadmin] Official Update 2015-01

0 // Box
1 16 0 -0.25 0 18 0 0 0 0.25 0 0 0 18 box5-12.dat
0 // White border
4 15 -14.4 -0.25 -9 -14.4 -0.25 18 -18 -0.25 18 -18 -0.25 -18
4 15 0 -0.25 -17.1 -14.4 -0.25 -9 -18 -0.25 -18 0 -0.25 -18
4 15 0 -0.25 -17.1 0 -0.25 -18 18 -0.25 -18 14.4 -0.25 -9
4 15 14.4 -0.25 -9 18 -0.25 -18 18 -0.25 18 14.4 -0.25 18
0 // Black frame
4 0 -11.7 -0.25 18 -5.4 -0.25 17.1 0 -0.25 17.1 0 -0.25 18
4 0 -7.488 -0.25 15.3 -5.4 -0.25 17.1 -11.7 -0.25 18 -9.9 -0.25 16.2
4 0 -14.4 -0.25 18 -11.7 -0.25 14.76 -9.9 -0.25 16.2 -11.7 -0.25 18
3 0 -14.4 -0.25 18 -11.7 -0.25 12.06 -11.7 -0.25 14.76
3 0 -14.4 -0.25 18 -11.7 -0.25 10.8 -11.7 -0.25 12.06
4 0 -11.7 -0.25 -7.81875 -11.7 -0.25 10.8 -14.4 -0.25 18 -14.4 -0.25 -9
4 0 0 -0.25 -14.4 -11.7 -0.25 -7.81875 -14.4 -0.25 -9 0 -0.25 -17.1
4 0 0 -0.25 -14.4 0 -0.25 -17.1 14.4 -0.25 -9 11.7 -0.25 -7.81875
4 0 11.7 -0.25 -7.81875 14.4 -0.25 -9 14.4 -0.25 18 11.7 -0.25 10.8
3 0 14.4 -0.25 18 11.7 -0.25 12.06 11.7 -0.25 10.8
3 0 14.4 -0.25 18 11.7 -0.25 12.735 11.7 -0.25 12.06
3 0 14.4 -0.25 18 11.7 -0.25 13.0725 11.7 -0.25 12.735
3 0 14.4 -0.25 18 11.7 -0.25 13.7475 11.7 -0.25 13.0725
3 0 14.4 -0.25 18 11.7 -0.25 14.085 11.7 -0.25 13.7475
3 0 14.4 -0.25 18 11.7 -0.25 14.76 11.7 -0.25 14.085
4 0 14.4 -0.25 18 11.7 -0.25 18 9.9 -0.25 16.2 11.7 -0.25 14.76
4 0 9.9 -0.25 16.2 11.7 -0.25 18 5.4 -0.25 17.1 7.488 -0.25 15.3
4 0 0 -0.25 18 0 -0.25 17.1 5.4 -0.25 17.1 11.7 -0.25 18
4 0 -10.8 -0.25 12.06 -11.7 -0.25 12.06 -11.7 -0.25 10.8 -7.488 -0.25 11.7
4 0 -7.488 -0.25 11.7 -11.7 -0.25 10.8 0 -0.25 10.8 -3.1455 -0.25 11.7
4 0 -3.1455 -0.25 11.7 0 -0.25 10.8 0 -0.25 11.7 -1.665 -0.25 12.06
4 0 0 -0.25 11.7 0 -0.25 10.8 3.1455 -0.25 11.7 0.468 -0.25 12.06
4 0 7.488 -0.25 11.7 3.1455 -0.25 11.7 0 -0.25 10.8 11.7 -0.25 10.8
4 0 8.631 -0.25 12.06 7.488 -0.25 11.7 11.7 -0.25 10.8 11.7 -0.25 12.06
0 // Red frame
4 4 0 -0.25 10.8 -11.7 -0.25 10.8 -10.08 -0.25 9.45 0 -0.25 9.45
3 4 -11.7 -0.25 10.8 -10.08 -0.25 5.4 -10.08 -0.25 9.45
3 4 -11.7 -0.25 10.8 -10.08 -0.25 4.32 -10.08 -0.25 5.4
4 4 -11.7 -0.25 10.8 -11.7 -0.25 -7.81875 -10.08 -0.25 -7.38 -10.08 -0.25 4.32
4 4 -10.08 -0.25 -7.38 -11.7 -0.25 -7.81875 0 -0.25 -14.4 0 -0.25 -13.05
4 4 10.08 -0.25 -7.38 0 -0.25 -13.05 0 -0.25 -14.4 11.7 -0.25 -7.81875
4 4 10.08 -0.25 -7.38 11.7 -0.25 -7.81875 11.7 -0.25 10.8 10.08 -0.25 4.32
3 4 11.7 -0.25 10.8 10.08 -0.25 5.4 10.08 -0.25 4.32
3 4 11.7 -0.25 10.8 10.08 -0.25 9.45 10.08 -0.25 5.4
4 4 0 -0.25 10.8 0 -0.25 9.45 10.08 -0.25 9.45 11.7 -0.25 10.8
4 4 0 -0.25 4.32 0 -0.25 5.4 -10.08 -0.25 5.4 -10.08 -0.25 4.32
4 4 0 -0.25 4.32 10.08 -0.25 4.32 10.08 -0.25 5.4 0 -0.25 5.4
0 // Black frame
4 0 0 -0.25 4.32 -10.08 -0.25 4.32 -9.18 -0.25 3.42 0 -0.25 3.42
4 0 -9.18 -0.25 3.42 -10.08 -0.25 4.32 -10.08 -0.25 -7.38 -9.18 -0.25 -6.98625
4 0 0 -0.25 -13.05 0 -0.25 -12.15 -9.18 -0.25 -6.98625 -10.08 -0.25 -7.38
4 0 0 -0.25 -13.05 10.08 -0.25 -7.38 9.18 -0.25 -6.98625 0 -0.25 -12.15
4 0 10.08 -0.25 4.32 9.18 -0.25 3.42 9.18 -0.25 -6.98625 10.08 -0.25 -7.38
4 0 0 -0.25 4.32 0 -0.25 3.42 9.18 -0.25 3.42 10.08 -0.25 4.32
0 // Blue frame
4 1 0 -0.25 2.88 0 -0.25 3.42 -9.18 -0.25 3.42 -2.11599 -0.25 -0.68751
3 1 -2.11599 -0.25 -0.68751 -9.18 -0.25 3.42 -6.16284 -0.25 -1.59759
3 1 -6.16284 -0.25 -1.59759 -9.18 -0.25 3.42 -9.18 -0.25 -6.98625
4 1 -3.42378 -0.25 -4.71249 -6.16284 -0.25 -1.59759 -9.18 -0.25 -6.98625 -3.80889 -0.25 -8.83124
3 1 -3.80889 -0.25 -8.83124 -9.18 -0.25 -6.98625 0 -0.25 -12.15
4 1 0 -0.25 -7.2 -3.80889 -0.25 -8.83124 0 -0.25 -12.15 3.80889 -0.25 -8.84241
3 1 0 -0.25 -12.15 9.18 -0.25 -6.98625 3.80889 -0.25 -8.84241
4 1 3.42378 -0.25 -4.71249 3.80889 -0.25 -8.84241 9.18 -0.25 -6.98625 6.16284 -0.25 -1.59759
3 1 9.18 -0.25 -6.98625 9.18 -0.25 3.42 6.16284 -0.25 -1.59759
3 1 6.16284 -0.25 -1.59759 9.18 -0.25 3.42 2.11599 -0.25 -0.68751
4 1 2.11599 -0.25 -0.68751 9.18 -0.25 3.42 0 -0.25 3.42 0 -0.25 2.88
0 // Black frame of star
4 0 -1.46943 -0.25 -1.57743 0 -0.25 0.9 0 -0.25 2.88 -2.11599 -0.25 -0.68751
4 0 -1.46943 -0.25 -1.57743 -2.11599 -0.25 -0.68751 -6.16284 -0.25 -1.59759 -4.27977 -0.25 -2.20941
4 0 -6.16284 -0.25 -1.59759 -3.42378 -0.25 -4.71249 -2.37762 -0.25 -4.37256 -4.27977 -0.25 -2.20941
4 0 -2.37762 -0.25 -4.37256 -3.42378 -0.25 -4.71249 -3.80889 -0.25 -8.83124 -2.64501 -0.25 -7.24059
4 0 -3.80889 -0.25 -8.83124 0 -0.25 -7.2 0 -0.25 -6.10002 -2.64501 -0.25 -7.24059
4 0 0 -0.25 -6.10002 0 -0.25 -7.2 3.80889 -0.25 -8.84241 2.64501 -0.25 -7.24059
4 0 3.80889 -0.25 -8.84241 3.42378 -0.25 -4.71249 2.37762 -0.25 -4.37256 2.64501 -0.25 -7.24059
4 0 2.37762 -0.25 -4.37256 3.42378 -0.25 -4.71249 6.16284 -0.25 -1.59759 4.27977 -0.25 -2.20941
4 0 6.16284 -0.25 -1.59759 2.11599 -0.25 -0.68751 1.46943 -0.25 -1.57743 4.27977 -0.25 -2.20941
4 0 0 -0.25 2.88 0 -0.25 0.9 1.46943 -0.25 -1.57743 2.11599 -0.25 -0.68751
0 // White star
4 15 0 -0.25 0.9 -1.46943 -0.25 -1.57743 0 -0.25 -3.6 1.46943 -0.25 -1.57743
4 15 0 -0.25 -3.6 -1.46943 -0.25 -1.57743 -4.27977 -0.25 -2.20941 -2.37762 -0.25 -4.37256
4 15 0 -0.25 -3.6 -2.37762 -0.25 -4.37256 -2.64501 -0.25 -7.24059 0 -0.25 -6.10002
4 15 0 -0.25 -3.6 0 -0.25 -6.10002 2.64501 -0.25 -7.24059 2.37762 -0.25 -4.37256
4 15 0 -0.25 -3.6 2.37762 -0.25 -4.37256 4.27977 -0.25 -2.20941 1.46943 -0.25 -1.57743
0 // Black strip
3 0 0 -0.25 9.45 -3.06 -0.25 8.28 -1.26 -0.25 8.28
4 0 -10.08 -0.25 9.45 -6.48 -0.25 8.28 -3.06 -0.25 8.28 0 -0.25 9.45
3 0 -10.08 -0.25 9.45 -8.28 -0.25 8.28 -6.48 -0.25 8.28
4 0 -8.82 -0.25 7.02 -8.28 -0.25 8.28 -10.08 -0.25 9.45 -10.08 -0.25 5.4
3 0 -7.02 -0.25 7.02 -8.82 -0.25 7.02 -10.08 -0.25 5.4
4 0 -7.02 -0.25 7.02 -10.08 -0.25 5.4 0 -0.25 5.4 -3.6 -0.25 7.02
3 0 0 -0.25 5.4 -1.8 -0.25 7.02 -3.6 -0.25 7.02
3 0 3.6 -0.25 7.02 1.8 -0.25 7.02 0 -0.25 5.4
4 0 3.6 -0.25 7.02 0 -0.25 5.4 10.08 -0.25 5.4 7.02 -0.25 7.02
3 0 8.82 -0.25 7.02 7.02 -0.25 7.02 10.08 -0.25 5.4
4 0 10.08 -0.25 9.45 8.28 -0.25 8.28 8.82 -0.25 7.02 10.08 -0.25 5.4
3 0 10.08 -0.25 9.45 6.48 -0.25 8.28 8.28 -0.25 8.28
4 0 3.06 -0.25 8.28 6.48 -0.25 8.28 10.08 -0.25 9.45 0 -0.25 9.45
3 0 0 -0.25 9.45 1.26 -0.25 8.28 3.06 -0.25 8.28
0 // Decoration
4 15 -8.28 -0.25 8.28 -8.82 -0.25 7.02 -7.02 -0.25 7.02 -6.48 -0.25 8.28
4 0 -3.6 -0.25 7.02 -3.06 -0.25 8.28 -6.48 -0.25 8.28 -7.02 -0.25 7.02
4 15 -3.06 -0.25 8.28 -3.6 -0.25 7.02 -1.8 -0.25 7.02 -1.26 -0.25 8.28
3 0 0 -0.25 9.45 -1.26 -0.25 8.28 -1.8 -0.25 7.02
4 0 -1.8 -0.25 7.02 0 -0.25 5.4 1.8 -0.25 7.02 0 -0.25 9.45
3 0 0 -0.25 9.45 1.8 -0.25 7.02 1.26 -0.25 8.28
4 15 3.06 -0.25 8.28 1.26 -0.25 8.28 1.8 -0.25 7.02 3.6 -0.25 7.02
4 0 7.02 -0.25 7.02 6.48 -0.25 8.28 3.06 -0.25 8.28 3.6 -0.25 7.02
4 15 8.28 -0.25 8.28 6.48 -0.25 8.28 7.02 -0.25 7.02 8.82 -0.25 7.02
0 // Black frame of letters
4 0 -5.4 -0.25 17.1 -3.1455 -0.25 15.3 0 -0.25 15.3 0 -0.25 17.1
4 0 0 -0.25 15.3 -1.665 -0.25 14.76 -1.665 -0.25 12.9038 -1.61559 -0.25 12.7844
4 0 -3.1455 -0.25 15.3 -2.34 -0.25 14.76 -1.665 -0.25 14.76 0 -0.25 15.3
4 0 -3.1455 -0.25 15.3 -3.36645 -0.25 14.4225 -3.276 -0.25 14.085 -2.34 -0.25 14.76
3 0 -3.1455 -0.25 15.3 -3.6135 -0.25 14.6695 -3.36645 -0.25 14.4225
4 0 -3.1455 -0.25 15.3 -5.4 -0.25 17.1 -3.951 -0.25 14.76 -3.6135 -0.25 14.6695
4 0 -5.4 -0.25 17.1 -7.488 -0.25 15.3 -6.345 -0.25 14.76 -3.951 -0.25 14.76
3 0 -7.488 -0.25 15.3 -6.6825 -0.25 14.6695 -6.345 -0.25 14.76
3 0 -7.488 -0.25 15.3 -6.92955 -0.25 14.4225 -6.6825 -0.25 14.6695
3 0 -7.488 -0.25 15.3 -7.02 -0.25 14.085 -6.92955 -0.25 14.4225
4 0 -7.488 -0.25 15.3 -8.04645 -0.25 14.4225 -7.956 -0.25 14.085 -7.02 -0.25 14.085
3 0 -7.488 -0.25 15.3 -8.2935 -0.25 14.6695 -8.04645 -0.25 14.4225
3 0 -7.488 -0.25 15.3 -8.631 -0.25 14.76 -8.2935 -0.25 14.6695
4 0 -9.9 -0.25 16.2 -11.7 -0.25 14.76 -8.631 -0.25 14.76 -7.488 -0.25 15.3
4 0 -10.8 -0.25 13.0725 -10.8 -0.25 12.06 -7.488 -0.25 11.7 -8.631 -0.25 13.0725
3 0 -8.2935 -0.25 13.163 -8.631 -0.25 13.0725 -7.488 -0.25 11.7
3 0 -8.04645 -0.25 13.41 -8.2935 -0.25 13.163 -7.488 -0.25 11.7
4 0 -7.956 -0.25 13.7475 -8.04645 -0.25 13.41 -7.488 -0.25 11.7 -7.02 -0.25 12.735
4 0 -7.956 -0.25 13.7475 -7.02 -0.25 12.735 -7.02 -0.25 14.085 -7.956 -0.25 14.085
3 0 -7.02 -0.25 12.735 -7.488 -0.25 11.7 -6.92955 -0.25 12.3975
3 0 -6.92955 -0.25 12.3975 -7.488 -0.25 11.7 -6.6825 -0.25 12.1505
3 0 -6.6825 -0.25 12.1505 -7.488 -0.25 11.7 -6.345 -0.25 12.06
4 0 -6.345 -0.25 12.06 -7.488 -0.25 11.7 -3.1455 -0.25 11.7 -3.951 -0.25 12.06
3 0 -3.6135 -0.25 12.1505 -3.951 -0.25 12.06 -3.1455 -0.25 11.7
3 0 -3.36645 -0.25 12.3975 -3.6135 -0.25 12.1505 -3.1455 -0.25 11.7
4 0 -3.276 -0.25 12.735 -3.36645 -0.25 12.3975 -3.1455 -0.25 11.7 -2.34 -0.25 12.735
4 0 -2.34 -0.25 14.76 -3.276 -0.25 14.085 -3.276 -0.25 12.735 -2.34 -0.25 12.735
3 0 -2.34 -0.25 12.735 -3.1455 -0.25 11.7 -2.24955 -0.25 12.3975
3 0 -2.24955 -0.25 12.3975 -3.1455 -0.25 11.7 -2.0025 -0.25 12.1505
3 0 -2.0025 -0.25 12.1505 -3.1455 -0.25 11.7 -1.665 -0.25 12.06
3 0 0.468 -0.25 12.06 -1.665 -0.25 12.06 0 -0.25 11.7
3 0 0.468 -0.25 12.735 0.468 -0.25 12.06 1.404 -0.25 12.06
4 0 0 -0.25 15.3 -1.61559 -0.25 12.7844 -1.49625 -0.25 12.735 0.468 -0.25 12.735
4 0 1.404 -0.25 14.76 0 -0.25 15.3 0.468 -0.25 12.735 1.404 -0.25 12.06
3 0 1.404 -0.25 12.06 0.468 -0.25 12.06 3.1455 -0.25 11.7
3 0 2.34 -0.25 12.06 1.404 -0.25 12.06 3.1455 -0.25 11.7
4 0 3.276 -0.25 12.735 2.34 -0.25 12.06 3.1455 -0.25 11.7 3.36645 -0.25 12.3975
4 0 3.276 -0.25 14.085 2.34 -0.25 14.76 2.34 -0.25 12.06 3.276 -0.25 12.735
3 0 3.36645 -0.25 12.3975 3.1455 -0.25 11.7 3.6135 -0.25 12.1505
3 0 3.6135 -0.25 12.1505 3.1455 -0.25 11.7 3.951 -0.25 12.06
4 0 7.02 -0.25 12.06 3.951 -0.25 12.06 3.1455 -0.25 11.7 7.488 -0.25 11.7
4 0 7.02 -0.25 12.735 7.02 -0.25 12.06 7.488 -0.25 11.7 7.956 -0.25 12.735
4 0 7.956 -0.25 14.085 7.02 -0.25 14.085 7.02 -0.25 12.735 7.956 -0.25 12.735
3 0 7.956 -0.25 12.735 7.488 -0.25 11.7 8.04645 -0.25 12.3975
3 0 8.04645 -0.25 12.3975 7.488 -0.25 11.7 8.2935 -0.25 12.1505
3 0 8.2935 -0.25 12.1505 7.488 -0.25 11.7 8.631 -0.25 12.06
4 0 8.631 -0.25 14.76 11.7 -0.25 14.76 9.9 -0.25 16.2 7.488 -0.25 15.3
3 0 7.488 -0.25 15.3 8.2935 -0.25 14.6695 8.631 -0.25 14.76
3 0 7.488 -0.25 15.3 8.04645 -0.25 14.4225 8.2935 -0.25 14.6695
3 0 7.488 -0.25 15.3 7.956 -0.25 14.085 8.04645 -0.25 14.4225
4 0 7.488 -0.25 15.3 7.02 -0.25 14.76 7.02 -0.25 14.085 7.956 -0.25 14.085
4 0 3.951 -0.25 14.76 7.02 -0.25 14.76 7.488 -0.25 15.3 5.4 -0.25 17.1
4 0 3.951 -0.25 14.76 5.4 -0.25 17.1 3.1455 -0.25 15.3 3.6135 -0.25 14.6695
3 0 3.1455 -0.25 15.3 3.36645 -0.25 14.4225 3.6135 -0.25 14.6695
4 0 3.276 -0.25 14.085 3.36645 -0.25 14.4225 3.1455 -0.25 15.3 2.34 -0.25 14.76
4 0 0 -0.25 15.3 1.404 -0.25 14.76 2.34 -0.25 14.76 3.1455 -0.25 15.3
4 0 0 -0.25 15.3 3.1455 -0.25 15.3 5.4 -0.25 17.1 0 -0.25 17.1
0 // Letter "P"
4 15 -11.7 -0.25 14.76 -10.6313 -0.25 14.085 -8.79975 -0.25 14.085 -8.631 -0.25 14.76
3 15 -10.6313 -0.25 14.085 -11.7 -0.25 14.76 -10.7506 -0.25 14.0356
4 15 -8.2935 -0.25 14.6695 -8.631 -0.25 14.76 -8.79975 -0.25 14.085 -8.04645 -0.25 14.4225
3 15 -8.68041 -0.25 14.0356 -8.04645 -0.25 14.4225 -8.79975 -0.25 14.085
3 15 -10.7506 -0.25 14.0356 -11.7 -0.25 14.76 -10.8 -0.25 13.9163
4 15 -8.68041 -0.25 14.0356 -8.631 -0.25 13.9163 -7.956 -0.25 14.085 -8.04645 -0.25 14.4225
4 15 -11.7 -0.25 12.06 -10.7506 -0.25 13.7969 -10.8 -0.25 13.9163 -11.7 -0.25 14.76
4 15 -7.956 -0.25 13.7475 -7.956 -0.25 14.085 -8.631 -0.25 13.9163 -8.68041 -0.25 13.7969
4 15 -8.04645 -0.25 13.41 -7.956 -0.25 13.7475 -8.68041 -0.25 13.7969 -8.79975 -0.25 13.7475
4 15 -11.7 -0.25 12.06 -10.8 -0.25 13.0725 -10.6313 -0.25 13.7475 -10.7506 -0.25 13.7969
4 15 -8.79975 -0.25 13.7475 -10.6313 -0.25 13.7475 -10.8 -0.25 13.0725 -8.631 -0.25 13.0725
4 15 -8.79975 -0.25 13.7475 -8.631 -0.25 13.0725 -8.2935 -0.25 13.163 -8.04645 -0.25 13.41
3 15 -10.8 -0.25 12.06 -10.8 -0.25 13.0725 -11.7 -0.25 12.06
0 // Inside of "P"
4 0 -10.6313 -0.25 14.085 -10.7506 -0.25 14.0356 -10.6313 -0.25 13.9163 -8.79975 -0.25 14.085
4 0 -8.79975 -0.25 14.085 -10.6313 -0.25 13.9163 -8.79975 -0.25 13.9163 -8.68041 -0.25 14.0356
4 0 -10.6313 -0.25 13.9163 -10.7506 -0.25 14.0356 -10.8 -0.25 13.9163 -10.7506 -0.25 13.7969
4 0 -8.79975 -0.25 13.9163 -8.68041 -0.25 13.7969 -8.631 -0.25 13.9163 -8.68041 -0.25 14.0356
4 0 -8.79975 -0.25 13.9163 -10.6313 -0.25 13.9163 -8.79975 -0.25 13.7475 -8.68041 -0.25 13.7969
4 0 -10.6313 -0.25 13.9163 -10.7506 -0.25 13.7969 -10.6313 -0.25 13.7475 -8.79975 -0.25 13.7475
0 // Letter "O"
4 15 -6.17625 -0.25 14.085 -3.951 -0.25 14.76 -6.345 -0.25 14.76 -6.6825 -0.25 14.6695
4 15 -3.951 -0.25 14.76 -6.17625 -0.25 14.085 -4.11975 -0.25 14.085 -3.6135 -0.25 14.6695
4 15 -6.29559 -0.25 14.0356 -6.17625 -0.25 14.085 -6.6825 -0.25 14.6695 -6.92955 -0.25 14.4225
4 15 -4.00041 -0.25 14.0356 -3.36645 -0.25 14.4225 -3.6135 -0.25 14.6695 -4.11975 -0.25 14.085
4 15 -6.92955 -0.25 14.4225 -7.02 -0.25 14.085 -6.345 -0.25 13.9163 -6.29559 -0.25 14.0356
4 15 -3.36645 -0.25 14.4225 -4.00041 -0.25 14.0356 -3.951 -0.25 13.9163 -3.276 -0.25 14.085
4 15 -7.02 -0.25 12.735 -6.345 -0.25 12.9038 -6.345 -0.25 13.9163 -7.02 -0.25 14.085
4 15 -3.276 -0.25 12.735 -3.276 -0.25 14.085 -3.951 -0.25 13.9163 -3.951 -0.25 12.9038
4 15 -6.92955 -0.25 12.3975 -6.29557 -0.25 12.7844 -6.345 -0.25 12.9038 -7.02 -0.25 12.735
4 15 -3.951 -0.25 12.9038 -4.00041 -0.25 12.7844 -3.36645 -0.25 12.3975 -3.276 -0.25 12.735
4 15 -6.6825 -0.25 12.1505 -6.17625 -0.25 12.735 -6.29557 -0.25 12.7844 -6.92955 -0.25 12.3975
4 15 -3.6135 -0.25 12.1505 -3.36645 -0.25 12.3975 -4.00041 -0.25 12.7844 -4.11975 -0.25 12.735
4 15 -4.11975 -0.25 12.735 -6.17625 -0.25 12.735 -3.951 -0.25 12.06 -3.6135 -0.25 12.1505
4 15 -6.345 -0.25 12.06 -3.951 -0.25 12.06 -6.17625 -0.25 12.735 -6.6825 -0.25 12.1505
0 // Inside of "O"
4 0 -6.17625 -0.25 13.41 -6.17625 -0.25 14.085 -6.29559 -0.25 14.0356 -6.345 -0.25 13.9163
4 0 -6.17625 -0.25 13.41 -4.11975 -0.25 13.41 -4.11975 -0.25 14.085 -6.17625 -0.25 14.085
4 0 -4.00041 -0.25 14.0356 -4.11975 -0.25 14.085 -4.11975 -0.25 13.41 -3.951 -0.25 13.9163
3 0 -6.345 -0.25 13.9163 -6.345 -0.25 12.9038 -6.17625 -0.25 13.41
3 0 -3.951 -0.25 13.9163 -4.11975 -0.25 13.41 -3.951 -0.25 12.9038
4 0 -6.29557 -0.25 12.7844 -6.17625 -0.25 12.735 -6.17625 -0.25 13.41 -6.345 -0.25 12.9038
4 0 -4.11975 -0.25 12.735 -4.11975 -0.25 13.41 -6.17625 -0.25 13.41 -6.17625 -0.25 12.735
4 0 -4.11975 -0.25 13.41 -4.11975 -0.25 12.735 -4.00041 -0.25 12.7844 -3.951 -0.25 12.9038
0 // Letter "L"
4 15 -1.665 -0.25 14.76 -2.34 -0.25 14.76 -2.34 -0.25 12.735 -2.24955 -0.25 12.3975
4 15 -1.665 -0.25 12.9038 -1.665 -0.25 14.76 -2.24955 -0.25 12.3975 -2.0025 -0.25 12.1505
4 15 -1.61559 -0.25 12.7844 -1.665 -0.25 12.9038 -2.0025 -0.25 12.1505 -1.665 -0.25 12.06
3 15 -1.49625 -0.25 12.735 -1.61559 -0.25 12.7844 -1.665 -0.25 12.06
4 15 -1.49625 -0.25 12.735 -1.665 -0.25 12.06 0.468 -0.25 12.06 0.468 -0.25 12.735
0 // Letter "I"
4 15 1.404 -0.25 14.76 1.404 -0.25 12.06 2.34 -0.25 12.06 2.34 -0.25 14.76
0 // Letter "C"
4 15 3.951 -0.25 14.76 3.6135 -0.25 14.6695 4.11975 -0.25 14.085 7.02 -0.25 14.76
3 15 7.02 -0.25 14.085 7.02 -0.25 14.76 4.11975 -0.25 14.085
4 15 3.36645 -0.25 14.4225 4.00041 -0.25 14.0356 4.11975 -0.25 14.085 3.6135 -0.25 14.6695
4 15 3.276 -0.25 14.085 3.951 -0.25 13.9163 4.00041 -0.25 14.0356 3.36645 -0.25 14.4225
3 15 3.951 -0.25 13.9163 3.276 -0.25 14.085 3.951 -0.25 12.9038
4 15 3.276 -0.25 12.735 3.36645 -0.25 12.3975 3.951 -0.25 12.9038 3.276 -0.25 14.085
4 15 3.6135 -0.25 12.1505 4.00041 -0.25 12.7844 3.951 -0.25 12.9038 3.36645 -0.25 12.3975
4 15 3.951 -0.25 12.06 4.11975 -0.25 12.735 4.00041 -0.25 12.7844 3.6135 -0.25 12.1505
4 15 7.02 -0.25 12.06 7.02 -0.25 12.735 4.11975 -0.25 12.735 3.951 -0.25 12.06
0 // Inside of "C"
4 0 4.00041 -0.25 12.7844 4.00041 -0.25 14.0356 3.951 -0.25 13.9163 3.951 -0.25 12.9038
4 0 4.11975 -0.25 12.735 4.11975 -0.25 14.085 4.00041 -0.25 14.0356 4.00041 -0.25 12.7844
4 0 7.02 -0.25 12.735 7.02 -0.25 14.085 4.11975 -0.25 14.085 4.11975 -0.25 12.735
0 // Letter "E"
4 15 8.79975 -0.25 14.085 11.7 -0.25 14.085 11.7 -0.25 14.76 8.631 -0.25 14.76
4 15 8.68041 -0.25 14.0356 8.79975 -0.25 14.085 8.631 -0.25 14.76 8.2935 -0.25 14.6695
4 15 8.68041 -0.25 14.0356 8.2935 -0.25 14.6695 8.04645 -0.25 14.4225 8.631 -0.25 13.9163
3 15 8.631 -0.25 13.9163 8.04645 -0.25 14.4225 7.956 -0.25 14.085
4 15 8.19 -0.25 13.41 8.68041 -0.25 13.7969 8.631 -0.25 13.9163 7.956 -0.25 14.085
3 15 8.79975 -0.25 13.7475 8.68041 -0.25 13.7969 8.19 -0.25 13.41
3 15 8.19 -0.25 13.41 11.7 -0.25 13.7475 8.79975 -0.25 13.7475
3 15 8.19 -0.25 13.41 7.956 -0.25 14.085 7.956 -0.25 12.735
4 15 8.79975 -0.25 13.0725 11.7 -0.25 13.0725 11.7 -0.25 13.7475 8.19 -0.25 13.41
3 15 8.19 -0.25 13.41 8.68041 -0.25 13.0231 8.79975 -0.25 13.0725
4 15 8.631 -0.25 12.9038 8.68041 -0.25 13.0231 8.19 -0.25 13.41 7.956 -0.25 12.735
3 15 8.631 -0.25 12.9038 7.956 -0.25 12.735 8.04645 -0.25 12.3975
4 15 8.631 -0.25 12.9038 8.04645 -0.25 12.3975 8.2935 -0.25 12.1505 8.68041 -0.25 12.7844
4 15 8.631 -0.25 12.06 8.79975 -0.25 12.735 8.68041 -0.25 12.7844 8.2935 -0.25 12.1505
4 15 11.7 -0.25 12.06 11.7 -0.25 12.735 8.79975 -0.25 12.735 8.631 -0.25 12.06
0 // Inside of "E"
4 0 8.68041 -0.25 14.0356 8.631 -0.25 13.9163 8.79975 -0.25 13.9163 8.79975 -0.25 14.085
3 0 11.7 -0.25 14.085 8.79975 -0.25 14.085 8.79975 -0.25 13.9163
4 0 8.79975 -0.25 13.7475 11.7 -0.25 13.7475 11.7 -0.25 14.085 8.79975 -0.25 13.9163
4 0 8.68041 -0.25 13.7969 8.79975 -0.25 13.7475 8.79975 -0.25 13.9163 8.631 -0.25 13.9163
4 0 8.68041 -0.25 13.0231 8.631 -0.25 12.9038 8.79975 -0.25 12.9038 8.79975 -0.25 13.0725
3 0 8.79975 -0.25 13.0725 8.79975 -0.25 12.9038 11.7 -0.25 13.0725
4 0 8.79975 -0.25 12.735 11.7 -0.25 12.735 11.7 -0.25 13.0725 8.79975 -0.25 12.9038
4 0 8.68041 -0.25 12.7844 8.79975 -0.25 12.735 8.79975 -0.25 12.9038 8.631 -0.25 12.9038
