0 Minifig Torso Female Outline with White Tank Top with "APERTURE" over Bright Light Blue Tank Top Pattern
0 Name: 973px5.dat
0 Author: Evert-Jan Boer [ejboer]
0 !LDRAW_ORG Part UPDATE 2022-03
0 !LICENSE Redistributable under CCAL version 2.0 : see CAreadme.txt

0 BFC CERTIFY CCW

0 !KEYWORDS Bricklink 973pb2149, Portal, Chell, Set 71203

0 !HISTORY 2022-05-07 [PTadmin] Official Update 2022-03

1 16 0 0 0 1 0 0 0 1 0 0 0 1 s\973s01.dat
1 0 0 -4 0 4.243 0 -4.243 0 -8 0 -4.243 0 -4.243 1-4cyli.dat
0 // Front
4 0 -16.9 31.1 -10 -17.6 30.85 -10 -18 31.5 -10 -17.15 31.5 -10
4 0 -14.6 25.05 -10 -13.75 24.85 -10 -13.7 23.95 -10 -14.55 24.3 -10
4 0 -14.55 24.3 -10 -13.7 23.95 -10 -13.75 22.95 -10 -14.6 23.25 -10
4 0 -13.75 22.95 -10 -14 21.9 -10 -14.9 22 -10 -14.6 23.25 -10
4 0 -14 21.9 -10 -14.4 20.9 -10 -15.45 20.65 -10 -14.9 22 -10
4 0 -14.4 20.9 -10 -14.8 19.7 -10 -15.95 19.2 -10 -15.45 20.65 -10
3 0 -15.25 18.5 -10 -15.95 19.2 -10 -14.8 19.7 -10
4 0 -12.55 27.4 -10 -12.4 28.2 -10 -9.55 28.55 -10 -10.15 27.75 -10
4 0 -10.15 27.75 -10 -9.55 28.55 -10 -6.5 28.75 -10 -7.4 28 -10
4 0 -7.4 28 -10 -6.5 28.75 -10 -3.25 28.9 -10 -4.45 28.15 -10
4 0 0 28.95 -10 -1.7 28.25 -10 -4.45 28.15 -10 -3.25 28.9 -10
4 0 -14.655 9.5773 -10 -14.4 10.45 -10 -13.6 9.85 -10 -14.35 9.3 -10
4 0 -14.35 9.3 -10 -13.6 9.85 -10 -12.7 8.6 -10 -13.75 8.5 -10
4 0 -12.15 7.3 -10 -13.15 7.5 -10 -13.75 8.5 -10 -12.7 8.6 -10
4 0 -11.7 5.8 -10 -12.75 6.2 -10 -13.15 7.5 -10 -12.15 7.3 -10
4 0 -12.75 6.2 -10 -11.7 5.8 -10 -11.25 4.05 -10 -12.45 4.55 -10
4 0 -10.95 2.1 -10 -12.3 2.85 -10 -12.45 4.55 -10 -11.25 4.05 -10
4 0 -10.85 1 -10 -12.25 1.6 -10 -12.3 2.85 -10 -10.95 2.1 -10
4 0 -9.7 1 -10 -9.5 2.1 -10 -8.55 2.55 -10 -8.85 1 -10
4 0 -8.75 4.35 -10 -8.15 3.9 -10 -8.55 2.55 -10 -9.2 3.15 -10
3 0 -9.5 2.1 -10 -9.2 3.15 -10 -8.55 2.55 -10
4 0 -8 5.75 -10 -7.7 4.8 -10 -8.15 3.9 -10 -8.75 4.35 -10
4 0 -6.95 6.95 -10 -7 5.75 -10 -7.7 4.8 -10 -8 5.75 -10
4 0 -7 5.75 -10 -6.95 6.95 -10 -5.5 7.9 -10 -5.95 6.7 -10
4 0 -5.95 6.7 -10 -5.5 7.9 -10 -4.05 8.6 -10 -4.75 7.45 -10
4 0 -1.35 9.05 -10 -3.15 8 -10 -3.85 7.9 -10 -2.65 8.95 -10
4 0 -4.75 7.45 -10 -4.05 8.6 -10 -2.65 8.95 -10 -3.85 7.9 -10
4 0 -2.2 7.95 -10 -3.15 8 -10 -1.35 9.05 -10 -1.85 8.2 -10
4 0 0 8.45 -10 -.65 8.4 -10 -1.35 9.05 -10 0 9.1 -10
3 0 -1.85 8.2 -10 -1.35 9.05 -10 -.65 8.4 -10
4 0 -7.5 1 -10 -7.35 1.75 -10 -6 2.3 -10 -6.25 1 -10
4 0 -7.35 1.75 -10 -6.85 3.3 -10 -5.6 3.65 -10 -6 2.3 -10
4 0 -6.85 3.3 -10 -6.1 4.65 -10 -5.15 4.65 -10 -5.6 3.65 -10
4 0 -4.4 5.75 -10 -5.15 4.65 -10 -6.1 4.65 -10 -5.25 5.8 -10
4 0 -3.5 6.75 -10 -4.4 5.75 -10 -5.25 5.8 -10 -4.3 6.85 -10
4 0 -3.15 8 -10 -2.7 7.5 -10 -3.5 6.75 -10 -3.6 7.55 -10
3 0 -3.5 6.75 -10 -4.3 6.85 -10 -3.6 7.55 -10
3 0 -2.7 7.5 -10 -3.15 8 -10 -2.2 7.95 -10
4 71 -9.85 2.5 -10 -9.5 2.1 -10 -9.7 1 -10 -10.1 1 -10
4 71 -9.5 2.1 -10 -9.85 2.5 -10 -9.5 3.8 -10 -9.2 3.15 -10
4 71 -9.2 3.15 -10 -9.5 3.8 -10 -9.1 5.05 -10 -8.75 4.35 -10
4 71 -8 5.75 -10 -8.75 4.35 -10 -9.1 5.05 -10 -8.65 5.95 -10
4 71 -8.65 5.95 -10 -7.95 6.85 -10 -6.95 6.95 -10 -8 5.75 -10
4 71 -5.5 7.9 -10 -6.95 6.95 -10 -7.2 7.6 -10 -6.5 8.15 -10
3 71 -7.95 6.85 -10 -7.2 7.6 -10 -6.95 6.95 -10
4 71 -4.05 8.6 -10 -5.5 7.9 -10 -6.5 8.15 -10 -5.45 8.75 -10
4 71 -3.2 9.5 -10 -4.05 8.6 -10 -5.45 8.75 -10 -4.25 9.2 -10
4 71 -2.1 9.7 -10 -2.65 8.95 -10 -4.05 8.6 -10 -3.2 9.5 -10
4 71 -1.05 9.85 -10 -1.35 9.05 -10 -2.65 8.95 -10 -2.1 9.7 -10
4 71 -1.35 9.05 -10 -1.05 9.85 -10 0 9.9 -10 0 9.1 -10
3 16 -12 0 -10 -12 1 -10 -10.85 1 -10
3 16 -12 0 -10 -10.85 1 -10 -10.1 1 -10
3 16 -12 0 -10 -10.1 1 -10 -9.7 1 -10
3 16 -12 0 -10 -9.7 1 -10 -8.85 1 -10
4 16 12 0 -10 -12 0 -10 -8.85 1 -10 -7.5 1 -10
4 212 -8.55 2.55 -10 -7.35 1.75 -10 -7.5 1 -10 -8.85 1 -10
4 212 -6.85 3.3 -10 -7.35 1.75 -10 -8.55 2.55 -10 -8.15 3.9 -10
4 212 -6.1 4.65 -10 -6.85 3.3 -10 -8.15 3.9 -10 -7.7 4.8 -10
4 212 -5.95 6.7 -10 -5.25 5.8 -10 -6.1 4.65 -10 -7 5.75 -10
3 212 -6.1 4.65 -10 -7.7 4.8 -10 -7 5.75 -10
4 212 -3.85 7.9 -10 -3.6 7.55 -10 -4.3 6.85 -10 -4.75 7.45 -10
4 212 -5.25 5.8 -10 -5.95 6.7 -10 -4.75 7.45 -10 -4.3 6.85 -10
3 212 -3.6 7.55 -10 -3.85 7.9 -10 -3.15 8 -10
4 78 -12.55 1.225 -10 -13.35 2 -10 -12.3 2.85 -10 -12.25 1.6 -10
4 78 -12.3 2.85 -10 -13.35 2 -10 -12.75 6.2 -10 -12.45 4.55 -10
4 78 -12.75 6.2 -10 -13.35 2 -10 -13.75 8.5 -10 -13.15 7.5 -10
4 78 -13.75 8.5 -10 -13.35 2 -10 -14.655 9.5773 -10 -14.35 9.3 -10
3 0 -14.655 9.5773 -10 -14.8353 10.6241 -10 -14.4 10.45 -10
4 0 -12.55 1.225 -10 -12.25 1.6 -10 -10.85 1 -10 -12 1 -10
4 0 -15.8524 16.5298 -10 -16.2002 18.5495 -10 -15.95 19.2 -10 -15.6 17.35 -10
3 0 -15.6 17.35 -10 -15.95 19.2 -10 -15.25 18.5 -10
4 71 -14.6 25.05 -10 -14.55 24.3 -10 -14.6 23.25 -10 -18 29 -10
4 71 -14.6 23.25 -10 -14.9 22 -10 -15.45 20.65 -10 -18 29 -10
4 71 -16.2002 18.5495 -10 -18 29 -10 -15.45 20.65 -10 -15.95 19.2 -10
3 212 -6.5 28.75 -10 0 31.5 -10 -3.25 28.9 -10
3 212 -3.25 28.9 -10 0 31.5 -10 0 28.95 -10
4 16 -16.2002 18.5495 -10 -14.345 2 -10 -19 29 -10 -18 29 -10
3 16 -14.345 2 -10 -16.2002 18.5495 -10 -15.8524 16.5298 -10
4 16 -14.345 2 -10 -13.35 2 -10 -12.55 1.225 -10 -12 0 -10
3 16 -12 0 -10 -12.55 1.225 -10 -12 1 -10
3 16 -13.35 2 -10 -14.345 2 -10 -14.655 9.5773 -10
3 16 -14.345 2 -10 -14.8353 10.6241 -10 -14.655 9.5773 -10
3 16 -14.345 2 -10 -15.8524 16.5298 -10 -14.8353 10.6241 -10
4 71 -14.05 16 -10 -14 14.55 -10 -14.55 13.15 -10 -14.55 14.6 -10
4 71 -13.25 17.2 -10 -13.2 15.85 -10 -14 14.55 -10 -14.05 16 -10
4 71 -11.9 18.3 -10 -12.3 16.85 -10 -13.2 15.85 -10 -13.25 17.2 -10
4 71 -10.35 18.9 -10 -11 17.55 -10 -12.3 16.85 -10 -11.9 18.3 -10
4 71 -9.15 19 -10 -9.85 18 -10 -11 17.55 -10 -10.35 18.9 -10
4 71 -7.65 18.9 -10 -8.45 18.1 -10 -9.85 18 -10 -9.15 19 -10
4 71 -5.95 18.4 -10 -6.9 17.9 -10 -8.45 18.1 -10 -7.65 18.9 -10
4 71 -6.9 17.9 -10 -5.95 18.4 -10 -4.65 17.8 -10 -5.25 17.4 -10
4 71 -5.25 17.4 -10 -4.65 17.8 -10 -3.55 17.2 -10 -4 16.95 -10
3 71 -2.75 16.35 -10 -4 16.95 -10 -3.55 17.2 -10
4 16 -14.55 14.6 -10 -14.55 13.15 -10 -14.8353 10.6241 -10 -15.8524 16.5298 -10
4 16 -15.6 17.35 -10 -13.25 17.2 -10 -14.05 16 -10 -15.8524 16.5298 -10
3 16 -14.55 14.6 -10 -15.8524 16.5298 -10 -14.05 16 -10
4 16 -15.25 18.5 -10 -11.9 18.3 -10 -13.25 17.2 -10 -15.6 17.35 -10
4 16 -14.8 19.7 -10 -10.35 18.9 -10 -11.9 18.3 -10 -15.25 18.5 -10
4 16 -12.15 7.3 -10 -12.7 8.6 -10 -6.5 8.15 -10 -7.2 7.6 -10
4 16 -11.7 5.8 -10 -12.15 7.3 -10 -7.2 7.6 -10 -7.95 6.85 -10
4 16 -11.25 4.05 -10 -11.7 5.8 -10 -7.95 6.85 -10 -8.65 5.95 -10
4 16 -11.25 4.05 -10 -8.65 5.95 -10 -9.1 5.05 -10 -10.95 2.1 -10
4 16 -9.5 3.8 -10 -10.85 1 -10 -10.95 2.1 -10 -9.1 5.05 -10
3 16 -10.85 1 -10 -9.5 3.8 -10 -9.85 2.5 -10
3 16 -10.1 1 -10 -10.85 1 -10 -9.85 2.5 -10
4 78 -6.25 1 -10 -6 2.3 -10 -5.6 3.65 -10 0 1 -10
3 78 0 1 -10 -5.6 3.65 -10 -5.15 4.65 -10
4 78 -5.15 4.65 -10 -4.4 5.75 -10 -3.5 6.75 -10 0 1 -10
4 78 -3.5 6.75 -10 -2.7 7.5 -10 -2.2 7.95 -10 0 1 -10
4 78 .65 8.4 -10 0 1 -10 -.65 8.4 -10 0 8.45 -10
4 78 -2.2 7.95 -10 -1.85 8.2 -10 -.65 8.4 -10 0 1 -10
3 16 12 0 -10 -6.25 1 -10 0 1 -10
3 16 12 0 -10 -7.5 1 -10 -6.25 1 -10
4 0 18 31.5 -10 17.6 30.85 -10 16.9 31.1 -10 17.15 31.5 -10
4 0 14.6 25.05 -10 14.55 24.3 -10 13.7 23.95 -10 13.75 24.85 -10
4 0 13.75 22.95 -10 13.7 23.95 -10 14.55 24.3 -10 14.6 23.25 -10
4 0 13.75 22.95 -10 14.6 23.25 -10 14.9 22 -10 14 21.9 -10
4 0 14 21.9 -10 14.9 22 -10 15.45 20.65 -10 14.4 20.9 -10
4 0 15.95 19.2 -10 14.8 19.7 -10 14.4 20.9 -10 15.45 20.65 -10
3 0 15.25 18.5 -10 14.8 19.7 -10 15.95 19.2 -10
4 0 12.55 27.4 -10 10.15 27.75 -10 9.55 28.55 -10 12.4 28.2 -10
4 0 10.15 27.75 -10 7.4 28 -10 6.5 28.75 -10 9.55 28.55 -10
4 0 7.4 28 -10 4.45 28.15 -10 3.25 28.9 -10 6.5 28.75 -10
4 0 4.45 28.15 -10 1.7 28.25 -10 0 28.95 -10 3.25 28.9 -10
4 0 12.7 8.6 -10 13.6 9.85 -10 14.35 9.3 -10 13.75 8.5 -10
4 0 12.15 7.3 -10 12.7 8.6 -10 13.75 8.5 -10 13.15 7.5 -10
4 0 11.7 5.8 -10 12.15 7.3 -10 13.15 7.5 -10 12.75 6.2 -10
4 0 11.25 4.05 -10 11.7 5.8 -10 12.75 6.2 -10 12.45 4.55 -10
4 0 12.25 1.6 -10 10.95 2.1 -10 11.25 4.05 -10 12.3 2.85 -10
3 0 12.3 2.85 -10 11.25 4.05 -10 12.45 4.55 -10
4 0 12 1 -10 10.85 1 -10 10.95 2.1 -10 12.25 1.6 -10
3 0 12 1 -10 12.25 1.6 -10 12.55 1.225 -10
4 0 9.7 1 -10 8.85 1 -10 8.55 2.55 -10 9.5 2.1 -10
4 0 8.75 4.35 -10 9.2 3.15 -10 8.55 2.55 -10 8.15 3.9 -10
3 0 9.5 2.1 -10 8.55 2.55 -10 9.2 3.15 -10
4 0 6.95 6.95 -10 8 5.75 -10 7.7 4.8 -10 7 5.75 -10
4 0 8.15 3.9 -10 7.7 4.8 -10 8 5.75 -10 8.75 4.35 -10
4 0 5.5 7.9 -10 6.95 6.95 -10 7 5.75 -10 5.95 6.7 -10
4 0 4.05 8.6 -10 5.5 7.9 -10 5.95 6.7 -10 4.75 7.45 -10
4 0 2.65 8.95 -10 4.05 8.6 -10 4.75 7.45 -10 3.85 7.9 -10
4 0 1.35 9.05 -10 2.65 8.95 -10 3.85 7.9 -10 3.15 8 -10
4 0 0 8.45 -10 0 9.1 -10 1.35 9.05 -10 .65 8.4 -10
3 0 1.85 8.2 -10 .65 8.4 -10 1.35 9.05 -10
4 0 6 2.3 -10 7.35 1.75 -10 7.5 1 -10 6.25 1 -10
4 0 6.1 4.65 -10 6.85 3.3 -10 6 2.3 -10 5.6 3.65 -10
3 0 7.35 1.75 -10 6 2.3 -10 6.85 3.3 -10
4 0 5.25 5.8 -10 6.1 4.65 -10 5.6 3.65 -10 5.15 4.65 -10
4 0 4.3 6.85 -10 5.25 5.8 -10 5.15 4.65 -10 4.4 5.75 -10
4 0 3.6 7.55 -10 4.3 6.85 -10 4.4 5.75 -10 3.5 6.75 -10
4 0 3.15 8 -10 3.6 7.55 -10 3.5 6.75 -10 2.7 7.5 -10
3 0 2.7 7.5 -10 2.2 7.95 -10 3.15 8 -10
4 0 1.35 9.05 -10 3.15 8 -10 2.2 7.95 -10 1.85 8.2 -10
4 71 9.7 1 -10 9.5 2.1 -10 9.85 2.5 -10 10.1 1 -10
4 71 9.5 2.1 -10 9.2 3.15 -10 9.5 3.8 -10 9.85 2.5 -10
4 71 9.2 3.15 -10 8.75 4.35 -10 9.1 5.05 -10 9.5 3.8 -10
4 71 8 5.75 -10 8.65 5.95 -10 9.1 5.05 -10 8.75 4.35 -10
4 71 6.95 6.95 -10 7.95 6.85 -10 8.65 5.95 -10 8 5.75 -10
4 71 5.5 7.9 -10 6.5 8.15 -10 7.2 7.6 -10 6.95 6.95 -10
3 71 7.95 6.85 -10 6.95 6.95 -10 7.2 7.6 -10
4 71 4.05 8.6 -10 5.45 8.75 -10 6.5 8.15 -10 5.5 7.9 -10
4 71 3.2 9.5 -10 4.25 9.2 -10 5.45 8.75 -10 4.05 8.6 -10
4 71 2.1 9.7 -10 3.2 9.5 -10 4.05 8.6 -10 2.65 8.95 -10
4 71 1.05 9.85 -10 2.1 9.7 -10 2.65 8.95 -10 1.35 9.05 -10
4 71 0 9.9 -10 1.05 9.85 -10 1.35 9.05 -10 0 9.1 -10
4 212 7.5 1 -10 7.35 1.75 -10 8.55 2.55 -10 8.85 1 -10
4 212 6.85 3.3 -10 8.15 3.9 -10 8.55 2.55 -10 7.35 1.75 -10
4 212 6.1 4.65 -10 7.7 4.8 -10 8.15 3.9 -10 6.85 3.3 -10
4 212 5.25 5.8 -10 7 5.75 -10 7.7 4.8 -10 6.1 4.65 -10
4 212 7 5.75 -10 5.25 5.8 -10 4.3 6.85 -10 5.95 6.7 -10
3 212 5.95 6.7 -10 3.6 7.55 -10 3.15 8 -10
3 212 5.95 6.7 -10 4.3 6.85 -10 3.6 7.55 -10
4 212 5.95 6.7 -10 3.15 8 -10 3.85 7.9 -10 4.75 7.45 -10
4 78 12.3 2.85 -10 12.45 4.55 -10 12.75 6.2 -10 13.35 2 -10
4 78 12.75 6.2 -10 13.15 7.5 -10 13.75 8.5 -10 13.35 2 -10
4 78 13.75 8.5 -10 14.35 9.3 -10 14.655 9.5773 -10 13.35 2 -10
4 78 12.55 1.225 -10 12.25 1.6 -10 12.3 2.85 -10 13.35 2 -10
4 0 13.6 9.85 -10 14.4 10.45 -10 14.655 9.5773 -10 14.35 9.3 -10
3 0 14.655 9.5773 -10 14.4 10.45 -10 14.8353 10.6241 -10
4 0 15.25 18.5 -10 15.95 19.2 -10 16.2002 18.5495 -10 15.6 17.35 -10
3 0 15.8524 16.5298 -10 15.6 17.35 -10 16.2002 18.5495 -10
4 71 15.45 20.65 -10 18 29 -10 16.2002 18.5495 -10 15.95 19.2 -10
4 212 16.9 31.1 -10 9.55 28.55 -10 0 31.5 -10 17.15 31.5 -10
3 212 9.55 28.55 -10 6.5 28.75 -10 0 31.5 -10
3 212 6.5 28.75 -10 3.25 28.9 -10 0 31.5 -10
3 212 3.25 28.9 -10 0 28.95 -10 0 31.5 -10
4 71 13.25 17.2 -10 14.05 16 -10 14.55 14.6 -10 14.55 13.15 -10
3 71 14.55 13.15 -10 14 14.55 -10 13.25 17.2 -10
4 71 13.25 17.2 -10 14 14.55 -10 13.2 15.85 -10 11.9 18.3 -10
3 71 13.2 15.85 -10 12.3 16.85 -10 11.9 18.3 -10
4 71 9.85 18 -10 10.35 18.9 -10 11.9 18.3 -10 11 17.55 -10
3 71 12.3 16.85 -10 11 17.55 -10 11.9 18.3 -10
4 71 10.35 18.9 -10 9.85 18 -10 8.45 18.1 -10 9.15 19 -10
4 71 9.15 19 -10 8.45 18.1 -10 6.9 17.9 -10 7.65 18.9 -10
4 71 7.65 18.9 -10 6.9 17.9 -10 5.25 17.4 -10 5.95 18.4 -10
4 71 5.95 18.4 -10 5.25 17.4 -10 4 16.95 -10 4.65 17.8 -10
4 71 4.65 17.8 -10 4 16.95 -10 2.75 16.35 -10 3.55 17.2 -10
4 16 14.55 14.6 -10 15.8524 16.5298 -10 14.8353 10.6241 -10 14.55 13.15 -10
4 16 15.6 17.35 -10 15.8524 16.5298 -10 14.05 16 -10 13.25 17.2 -10
3 16 14.55 14.6 -10 14.05 16 -10 15.8524 16.5298 -10
4 16 13.25 17.2 -10 11.9 18.3 -10 15.25 18.5 -10 15.6 17.35 -10
4 16 11.9 18.3 -10 10.35 18.9 -10 14.8 19.7 -10 15.25 18.5 -10
4 16 12.15 7.3 -10 7.2 7.6 -10 6.5 8.15 -10 12.7 8.6 -10
4 16 11.7 5.8 -10 7.95 6.85 -10 7.2 7.6 -10 12.15 7.3 -10
4 16 11.25 4.05 -10 8.65 5.95 -10 7.95 6.85 -10 11.7 5.8 -10
4 16 9.1 5.05 -10 8.65 5.95 -10 11.25 4.05 -10 10.95 2.1 -10
4 16 9.5 3.8 -10 9.1 5.05 -10 10.95 2.1 -10 10.85 1 -10
3 16 10.85 1 -10 9.85 2.5 -10 9.5 3.8 -10
3 16 10.85 1 -10 10.1 1 -10 9.85 2.5 -10
4 78 6.25 1 -10 0 1 -10 5.6 3.65 -10 6 2.3 -10
4 78 4.4 5.75 -10 5.15 4.65 -10 5.6 3.65 -10 0 1 -10
4 78 2.7 7.5 -10 3.5 6.75 -10 4.4 5.75 -10 0 1 -10
4 78 1.85 8.2 -10 2.2 7.95 -10 2.7 7.5 -10 0 1 -10
3 78 0 1 -10 .65 8.4 -10 1.85 8.2 -10
3 16 12 0 -10 0 1 -10 6.25 1 -10
3 16 12 0 -10 6.25 1 -10 7.5 1 -10
3 16 12 0 -10 7.5 1 -10 8.85 1 -10
3 16 12 0 -10 8.85 1 -10 9.7 1 -10
3 16 12 0 -10 9.7 1 -10 10.1 1 -10
3 16 12 0 -10 10.1 1 -10 10.85 1 -10
3 16 12 0 -10 10.85 1 -10 12 1 -10
3 16 12 0 -10 12 1 -10 12.55 1.225 -10
4 16 13.35 2 -10 14.345 2 -10 12 0 -10 12.55 1.225 -10
4 16 14.345 2 -10 13.35 2 -10 14.655 9.5773 -10 19 29 -10
3 16 14.655 9.5773 -10 14.8353 10.6241 -10 19 29 -10
4 16 18 31.5 -10 19 32 -10 19 29 -10 18 29 -10
3 16 16.2002 18.5495 -10 18 29 -10 19 29 -10
3 16 15.8524 16.5298 -10 16.2002 18.5495 -10 19 29 -10
3 16 14.8353 10.6241 -10 15.8524 16.5298 -10 19 29 -10
4 71 -10.85 23.7 -10 -12.25 22.9 -10 -12.8 23.1 -10 -11.95 24 -10
3 71 -13.15 22.2 -10 -12.8 23.1 -10 -12.25 22.9 -10
4 71 -9.1 24.3 -10 -10.85 23.7 -10 -11.95 24 -10 -10.3 24.7 -10
4 71 -10.3 24.7 -10 -8.3 25.25 -10 -7.4 24.8 -10 -9.1 24.3 -10
4 71 -8.3 25.25 -10 -6.55 25.5 -10 -5.8 25.2 -10 -7.4 24.8 -10
3 71 -5.8 25.2 -10 -6.55 25.5 -10 -4.45 25.45 -10
4 71 -2.95 27.15 -10 -4.3 26.65 -10 -6.45 26.6 -10 -5.35 26.95 -10
4 71 -4.3 26.65 -10 -2.95 27.15 -10 0 27.2 -10 -1.45 26.5 -10
4 71 -1.45 26.5 -10 0 27.2 -10 3.35 27.15 -10 1.85 26.35 -10
4 71 1.85 26.35 -10 3.35 27.15 -10 5.95 26.75 -10 4.75 26.05 -10
4 71 4.75 26.05 -10 5.95 26.75 -10 7.55 26.3 -10 7 25.75 -10
4 71 7 25.75 -10 7.55 26.3 -10 8.4 25.8 -10 8.1 25.55 -10
3 71 8.95 25.3 -10 8.1 25.55 -10 8.4 25.8 -10
4 16 -14.8 19.7 -10 -14 21.9 -10 -13.15 22.2 -10 -10.35 18.9 -10
3 16 -14.8 19.7 -10 -14.4 20.9 -10 -14 21.9 -10
4 16 -12.8 23.1 -10 -13.15 22.2 -10 -14 21.9 -10 -13.75 22.95 -10
4 16 -11.95 24 -10 -12.8 23.1 -10 -13.75 22.95 -10 -13.7 23.95 -10
4 16 -10.15 27.75 -10 -10.3 24.7 -10 -11.95 24 -10 -13.7 23.95 -10
3 16 -13.7 23.95 -10 -13.75 24.85 -10 -10.15 27.75 -10
4 16 -10.3 24.7 -10 -10.15 27.75 -10 -7.4 28 -10 -8.3 25.25 -10
4 16 -6.55 25.5 -10 -8.3 25.25 -10 -7.4 28 -10 -6.45 26.6 -10
4 16 -6.45 26.6 -10 -4.3 26.65 -10 -4.45 25.45 -10 -6.55 25.5 -10
4 16 4.65 17.8 -10 -4.45 25.45 -10 -4.3 26.65 -10 4.75 26.05 -10
3 16 4.75 26.05 -10 -4.3 26.65 -10 -1.45 26.5 -10
3 16 4.75 26.05 -10 -1.45 26.5 -10 1.85 26.35 -10
4 16 -4.45 28.15 -10 -5.35 26.95 -10 -6.45 26.6 -10 -7.4 28 -10
4 16 -5.35 26.95 -10 -4.45 28.15 -10 -1.7 28.25 -10 -2.95 27.15 -10
4 16 -2.95 27.15 -10 -1.7 28.25 -10 1.7 28.25 -10 0 27.2 -10
4 16 0 27.2 -10 1.7 28.25 -10 4.45 28.15 -10 3.35 27.15 -10
4 16 7.55 26.3 -10 5.95 26.75 -10 4.45 28.15 -10 7.4 28 -10
3 16 5.95 26.75 -10 3.35 27.15 -10 4.45 28.15 -10
4 16 8.4 25.8 -10 7.55 26.3 -10 7.4 28 -10 10.15 27.75 -10
3 16 10.35 18.9 -10 13.7 23.95 -10 13.75 22.95 -10
4 16 10.35 18.9 -10 14 21.9 -10 14.4 20.9 -10 14.8 19.7 -10
3 16 10.35 18.9 -10 13.75 22.95 -10 14 21.9 -10
4 16 -9.15 19 -10 -10.35 18.9 -10 -12.25 22.9 -10 -10.85 23.7 -10
3 16 -10.35 18.9 -10 -13.15 22.2 -10 -12.25 22.9 -10
4 16 -5.8 25.2 -10 -7.65 18.9 -10 -9.1 24.3 -10 -7.4 24.8 -10
4 16 -10.85 23.7 -10 -9.1 24.3 -10 -7.65 18.9 -10 -9.15 19 -10
4 16 -4.45 25.45 -10 -5.95 18.4 -10 -7.65 18.9 -10 -5.8 25.2 -10
3 16 -4.65 17.8 -10 -5.95 18.4 -10 -4.45 25.45 -10
4 16 4.65 17.8 -10 -3.55 17.2 -10 -4.65 17.8 -10 -4.45 25.45 -10
4 16 -2.75 16.35 -10 -3.55 17.2 -10 4.65 17.8 -10 3.55 17.2 -10
4 16 5.95 18.4 -10 4.75 26.05 -10 7 25.75 -10 7.65 18.9 -10
3 16 4.65 17.8 -10 4.75 26.05 -10 5.95 18.4 -10
4 16 8.1 25.55 -10 9.15 19 -10 7.65 18.9 -10 7 25.75 -10
4 16 8.95 25.3 -10 10.35 18.9 -10 9.15 19 -10 8.1 25.55 -10
4 0 -12.48 12.8 -10 -12.4199 13.4106 -10 -12.2417 13.9978 -10 -11.0034 12.4639 -10
4 0 -12.48 12.8 -10 -11.0034 12.4639 -10 -10.9077 12.1484 -10 -12.4199 12.1894 -10
3 0 -10.7523 11.8578 -10 -12.4199 12.1894 -10 -10.9077 12.1484 -10
3 0 -10.5432 11.603 -10 -12.4199 12.1894 -10 -10.7523 11.8578 -10
3 0 -11.0889 10.1975 -10 -10.2885 11.3939 -10 -9.9978 11.2385 -10
4 0 -11.0889 10.1975 -10 -11.9525 11.0611 -10 -12.2417 11.6022 -10 -10.2885 11.3939 -10
3 0 -11.0889 10.1975 -10 -11.5632 10.5868 -10 -11.9525 11.0611 -10
3 0 -11.0889 10.1975 -10 -9.9978 11.2385 -10 -9.6824 11.1428 -10
3 0 -11.0889 10.1975 -10 -9.6824 11.1428 -10 -9.3543 11.1105 -10
4 0 -10.7523 13.726 -10 -10.9077 13.4353 -10 -11.9525 14.5389 -10 -11.5632 15.0132 -10
3 0 -11.0034 13.1199 -10 -11.9525 14.5389 -10 -10.9077 13.4353 -10
3 0 -11.0357 12.7919 -10 -11.9525 14.5389 -10 -11.0034 13.1199 -10
4 0 -11.0889 15.4025 -10 -10.5478 15.6917 -10 -10.7523 13.726 -10 -11.5632 15.0132 -10
3 0 -10.5432 13.9808 -10 -9.9606 15.8699 -10 -10.2885 14.1899 -10
4 0 -9.9606 15.8699 -10 -9.35 15.93 -10 -9.9978 14.3453 -10 -10.2885 14.1899 -10
3 0 -9.6824 14.441 -10 -8.7394 15.8699 -10 -8.1522 15.6917 -10
4 0 -9.35 15.93 -10 -8.7394 15.8699 -10 -9.6824 14.441 -10 -9.9978 14.3453 -10
4 0 -8.7109 14.3453 -10 -9.0263 14.441 -10 -7.6111 15.4025 -10 -7.1368 15.0132 -10
3 0 -9.0263 14.441 -10 -9.3543 14.4733 -10 -7.6111 15.4025 -10
4 0 -8.4202 14.1899 -10 -8.7109 14.3453 -10 -7.1368 15.0132 -10 -6.7475 14.5389 -10
3 0 -6.4583 13.9978 -10 -8.4202 14.1899 -10 -6.7475 14.5389 -10
4 0 -9.35 9.67 -10 -9.9606 9.7301 -10 -10.5478 9.9083 -10 -9.0263 11.1428 -10
4 0 -9.35 9.67 -10 -9.0263 11.1428 -10 -8.7109 11.2385 -10 -8.7394 9.7301 -10
3 0 -8.7394 9.7301 -10 -8.7109 11.2385 -10 -8.4202 11.3939 -10
3 0 -8.7394 9.7301 -10 -8.4202 11.3939 -10 -8.1654 11.603 -10
3 0 -8.1522 9.9083 -10 -7.9563 11.8578 -10 -7.6111 10.1975 -10
4 0 -6.7475 11.0611 -10 -7.1368 10.5868 -10 -7.8009 12.1484 -10 -7.7053 12.4639 -10
4 0 -7.9563 11.8578 -10 -7.8009 12.1484 -10 -7.1368 10.5868 -10 -7.6111 10.1975 -10
3 0 -6.7475 11.0611 -10 -7.7053 12.4639 -10 -7.673 12.7919 -10
4 0 -6.1593 12.9 -10 -6.6547 12.9 -10 -6.9105 13.45 -10 -6.1209 13.45 -10
4 0 -7.75 13.75 -10 -7.05 13.75 -10 -6.9105 13.45 -10 -6.55 11.6 -10
3 0 -6.55 11.6 -10 -6.9105 13.45 -10 -6.6547 12.9 -10
3 0 -6.55 11.6 -10 -6.6547 12.9 -10 -6.2239 11.9739 -10
4 0 -6.1209 13.45 -10 -6.1 13.75 -10 -5.4 13.75 -10 -5.7 11.6 -10
3 0 -5.7 11.6 -10 -6.1593 12.9 -10 -6.1209 13.45 -10
3 0 -5.7 11.6 -10 -6.2239 11.9739 -10 -6.1593 12.9 -10
3 0 -5.7 11.6 -10 -6.55 11.6 -10 -6.2239 11.9739 -10
4 0 -3.25 12.15 -10 -2.75 11.85 -10 -2.95 11.65 -10 -3.4 12.1 -10
4 0 -3.7 11.6 -10 -3.4 12.1 -10 -2.95 11.65 -10 -3.2 11.6 -10
4 0 -3.2 12.35 -10 -2.65 12.2 -10 -2.75 11.85 -10 -3.25 12.15 -10
4 0 -3.3 12.5 -10 -2.75 12.6 -10 -2.65 12.2 -10 -3.2 12.35 -10
4 0 -3.3 13 -10 -2.95 12.85 -10 -2.75 12.6 -10 -3.3 12.5 -10
4 0 -4.3 11.6 -10 -3.8047 12.1 -10 -3.4 12.1 -10 -3.7 11.6 -10
4 0 -.2 11.6 -10 -1.15 11.6 -10 -1.2547 12.1 -10 -.3047 12.1 -10
4 0 -.4721 12.9 -10 -.3674 12.4 -10 -1.3174 12.4 -10 -1.4221 12.9 -10
4 0 -1.4954 13.25 -10 -1.6 13.75 -10 -.65 13.75 -10 -.5454 13.25 -10
4 0 -1.75 11.6 -10 -2.2 13.75 -10 -1.6 13.75 -10 -1.4954 13.25 -10
3 0 -1.75 11.6 -10 -1.4954 13.25 -10 -1.4221 12.9 -10
3 0 -1.75 11.6 -10 -1.4221 12.9 -10 -1.3174 12.4 -10
3 0 -1.75 11.6 -10 -1.3174 12.4 -10 -1.2547 12.1 -10
3 0 -1.15 11.6 -10 -1.75 11.6 -10 -1.2547 12.1 -10
4 0 1.55 11.6 -10 1.05 11.6 -10 .9454 12.1 -10 1.35 12.1 -10
4 0 2 11.85 -10 1.8 11.65 -10 1.55 11.6 -10 1.35 12.1 -10
4 0 2.1 12.2 -10 2 11.85 -10 1.35 12.1 -10 1.5 12.15 -10
4 0 1.5 12.15 -10 1.55 12.35 -10 2 12.6 -10 2.1 12.2 -10
4 0 1.55 12.35 -10 1.45 12.5 -10 1.7 12.85 -10 2 12.6 -10
4 0 1.15 12.5 -10 1.25 13 -10 1.7 12.85 -10 1.45 12.5 -10
3 0 1.05 11.6 -10 .45 11.6 -10 .9454 12.1 -10
4 0 0 13.75 -10 .6 13.75 -10 .757 13 -10 .45 11.6 -10
4 0 1.8 13 -10 1.7 12.85 -10 1.25 13.75 -10 1.85 13.75 -10
3 0 1.7 12.85 -10 1.25 13 -10 1.25 13.75 -10
4 0 4.75 11.6 -10 2.7 11.6 -10 3.386 12.0946 -10 3.9764 12.0946 -10
3 0 2.7 11.6 -10 2.7 11.9 -10 3.386 12.0946 -10
3 0 4.75 11.6 -10 3.9764 12.0946 -10 4.75 11.9 -10
4 0 3 13.75 -10 3.6 13.75 -10 3.9764 12.0946 -10 3.386 12.0946 -10
4 0 5.15 13.65 -10 5.45 13.75 -10 5.95 13.4 -10 5.65 13.35 -10
4 0 5.45 13.75 -10 6.55 13.75 -10 6.25 13.35 -10 5.95 13.4 -10
4 0 6.3559 13.2441 -10 6.25 13.35 -10 6.55 13.75 -10 6.85 13.6 -10
4 0 5.3 11.6 -10 4.9861 13.1 -10 5.5737 13.1592 -10 5.9 11.6 -10
4 0 6.7 11.6 -10 6.3559 13.2441 -10 6.904 13.492 -10 7.3 11.6 -10
4 0 5 13.4 -10 5.15 13.65 -10 5.5737 13.1592 -10 4.9861 13.1 -10
3 0 5.5737 13.1592 -10 5.15 13.65 -10 5.65 13.35 -10
3 0 6.3559 13.2441 -10 6.85 13.6 -10 6.904 13.492 -10
4 0 9.2 11.6 -10 9 12.1 -10 9.65 11.85 -10 9.45 11.65 -10
3 0 9.65 11.85 -10 9 12.1 -10 9.15 12.15 -10
4 0 9.65 11.85 -10 9.15 12.15 -10 9.2 12.35 -10 9.75 12.2 -10
4 0 9.1 12.5 -10 9.65 12.6 -10 9.75 12.2 -10 9.2 12.35 -10
4 0 8.9 13 -10 9.35 12.85 -10 9.65 12.6 -10 9.1 12.5 -10
3 0 9.1 12.5 -10 8.8 12.5 -10 8.9 13 -10
4 0 8.5954 12.1 -10 9 12.1 -10 9.2 11.6 -10 8.7 11.6 -10
3 0 8.7 11.6 -10 8.1 11.6 -10 8.5954 12.1 -10
4 0 9.45 13 -10 9.35 12.85 -10 8.9 13.75 -10 9.5 13.75 -10
3 0 9.35 12.85 -10 8.9 13 -10 8.9 13.75 -10
4 0 11.0954 12.1 -10 12.0454 12.1 -10 12.15 11.6 -10 11.2 11.6 -10
4 0 11.0326 12.4 -10 10.9279 12.9 -10 11.8779 12.9 -10 11.9826 12.4 -10
4 0 10.8547 13.25 -10 10.75 13.75 -10 11.7 13.75 -10 11.8047 13.25 -10
4 0 10.6 11.6 -10 10.15 13.75 -10 10.75 13.75 -10 10.8547 13.25 -10
3 0 10.6 11.6 -10 10.8547 13.25 -10 10.9279 12.9 -10
3 0 10.6 11.6 -10 10.9279 12.9 -10 11.0326 12.4 -10
3 0 10.6 11.6 -10 11.0326 12.4 -10 11.0954 12.1 -10
3 0 11.2 11.6 -10 10.6 11.6 -10 11.0954 12.1 -10
4 16 -12.2417 11.6022 -10 -14.4 10.45 -10 -14.55 13.15 -10 -12.4199 12.1894 -10
3 16 -14.4 10.45 -10 -14.8353 10.6241 -10 -14.55 13.15 -10
4 16 -14.4 10.45 -10 -12.2417 11.6022 -10 -11.9525 11.0611 -10 -13.6 9.85 -10
4 16 -13.6 9.85 -10 -11.9525 11.0611 -10 -11.5632 10.5868 -10 -12.7 8.6 -10
3 16 -12.7 8.6 -10 -11.5632 10.5868 -10 -11.0889 10.1975 -10
4 16 -9.3543 11.1105 -10 -9.0263 11.1428 -10 -10.5478 9.9083 -10 -12.7 8.6 -10
3 16 -12.7 8.6 -10 -11.0889 10.1975 -10 -9.3543 11.1105 -10
4 16 -12.7 8.6 -10 -10.5478 9.9083 -10 -9.9606 9.7301 -10 -6.5 8.15 -10
3 16 -6.5 8.15 -10 -9.9606 9.7301 -10 -9.35 9.67 -10
4 16 -5.45 8.75 -10 -6.5 8.15 -10 -9.35 9.67 -10 -8.7394 9.7301 -10
4 16 -4.25 9.2 -10 -5.45 8.75 -10 -8.7394 9.7301 -10 -8.1522 9.9083 -10
3 16 -4.25 9.2 -10 -8.1522 9.9083 -10 -7.6111 10.1975 -10
4 16 -7.1368 10.5868 -10 -5.7 11.6 -10 -4.25 9.2 -10 -7.6111 10.1975 -10
3 16 -7.1368 10.5868 -10 -6.7475 11.0611 -10 -5.7 11.6 -10
4 16 -5.7 11.6 -10 -4.3 11.6 -10 -3.2 9.5 -10 -4.25 9.2 -10
4 16 -3.7 11.6 -10 -2.1 9.7 -10 -3.2 9.5 -10 -4.3 11.6 -10
3 16 -2.1 9.7 -10 -3.7 11.6 -10 -3.2 11.6 -10
4 16 -1.05 9.85 -10 -2.1 9.7 -10 -2.95 11.65 -10 -1.75 11.6 -10
3 16 -2.1 9.7 -10 -3.2 11.6 -10 -2.95 11.65 -10
3 16 -1.05 9.85 -10 -1.75 11.6 -10 -1.15 11.6 -10
4 16 0 9.9 -10 -1.05 9.85 -10 -1.15 11.6 -10 -.2 11.6 -10
4 16 -.2 11.6 -10 .45 11.6 -10 1.05 9.85 -10 0 9.9 -10
4 16 1.05 9.85 -10 .45 11.6 -10 1.05 11.6 -10 2.1 9.7 -10
3 16 2.1 9.7 -10 1.05 11.6 -10 1.55 11.6 -10
4 16 1.55 11.6 -10 1.8 11.65 -10 2.7 11.6 -10 2.1 9.7 -10
4 16 4.75 11.6 -10 5.3 11.6 -10 3.2 9.5 -10 2.1 9.7 -10
3 16 2.1 9.7 -10 2.7 11.6 -10 4.75 11.6 -10
4 16 -5.4 13.75 -10 -4.75 13.75 -10 -4.3 11.6 -10 -5.7 11.6 -10
4 16 -3.2 12.35 -10 -3.4 12.1 -10 -3.6 12.5 -10 -3.3 12.5 -10
3 16 -3.4 12.1 -10 -3.2 12.35 -10 -3.25 12.15 -10
3 16 -6.2239 11.9739 -10 -6.6547 12.9 -10 -6.1593 12.9 -10
4 16 -7.05 13.75 -10 -6.1 13.75 -10 -6.1209 13.45 -10 -6.9105 13.45 -10
3 16 -6.1 13.75 -10 -7.05 13.75 -10 -6.4583 13.9978 -10
4 16 -2.75 16.35 -10 -5.4 13.75 -10 -6.4583 13.9978 -10 -4 16.95 -10
3 16 -5.4 13.75 -10 -6.1 13.75 -10 -6.4583 13.9978 -10
3 16 -4.75 13.75 -10 -5.4 13.75 -10 -2.75 16.35 -10
3 16 -4.15 13.75 -10 -4.75 13.75 -10 -2.75 16.35 -10
4 16 -2.2 13.75 -10 -3.3 13 -10 -3.993 13 -10 -2.75 16.35 -10
3 16 -3.993 13 -10 -4.15 13.75 -10 -2.75 16.35 -10
3 16 -2.95 12.85 -10 -3.3 13 -10 -2.2 13.75 -10
4 16 -1.75 11.6 -10 -2.75 12.6 -10 -2.95 12.85 -10 -2.2 13.75 -10
3 16 -1.75 11.6 -10 -2.95 11.65 -10 -2.75 11.85 -10
3 16 -1.75 11.6 -10 -2.75 11.85 -10 -2.65 12.2 -10
3 16 -1.75 11.6 -10 -2.65 12.2 -10 -2.75 12.6 -10
4 16 -1.3174 12.4 -10 -.3674 12.4 -10 -.3047 12.1 -10 -1.2547 12.1 -10
4 16 -.4721 12.9 -10 -1.4221 12.9 -10 -1.4954 13.25 -10 -.5454 13.25 -10
4 16 -.5454 13.25 -10 0 13.75 -10 .45 11.6 -10 -.4721 12.9 -10
3 16 .45 11.6 -10 -.3674 12.4 -10 -.4721 12.9 -10
3 16 .45 11.6 -10 -.3047 12.1 -10 -.3674 12.4 -10
3 16 .45 11.6 -10 -.2 11.6 -10 -.3047 12.1 -10
3 16 -1.6 13.75 -10 -2.2 13.75 -10 -2.75 16.35 -10
3 16 -.65 13.75 -10 -1.6 13.75 -10 2.75 16.35 -10
4 16 3.55 17.2 -10 2.75 16.35 -10 -1.6 13.75 -10 -2.75 16.35 -10
3 16 .6 13.75 -10 0 13.75 -10 2.75 16.35 -10
4 16 .757 13 -10 .6 13.75 -10 2.75 16.35 -10 1.25 13.75 -10
3 16 1.85 13.75 -10 1.25 13.75 -10 2.75 16.35 -10
3 16 3 13.75 -10 1.85 13.75 -10 2.75 16.35 -10
3 16 3.6 13.75 -10 3 13.75 -10 2.75 16.35 -10
3 16 1.25 13 -10 .757 13 -10 1.25 13.75 -10
4 16 1.55 12.35 -10 1.35 12.1 -10 1.15 12.5 -10 1.45 12.5 -10
3 16 1.35 12.1 -10 1.55 12.35 -10 1.5 12.15 -10
4 16 2.7 11.6 -10 1.8 11.65 -10 2 11.85 -10 2.7 11.9 -10
4 16 3.386 12.0946 -10 2.7 11.9 -10 2 11.85 -10 2.1 12.2 -10
4 16 3.386 12.0946 -10 2.1 12.2 -10 2 12.6 -10 3 13.75 -10
4 16 1.85 13.75 -10 3 13.75 -10 2 12.6 -10 1.8 13 -10
3 16 2 12.6 -10 1.7 12.85 -10 1.8 13 -10
3 16 -6.7475 11.0611 -10 -6.55 11.6 -10 -5.7 11.6 -10
4 16 -6.55 11.6 -10 -6.7475 11.0611 -10 -7.673 12.7919 -10 -7.75 13.75 -10
4 16 -10.2885 11.3939 -10 -12.2417 11.6022 -10 -12.4199 12.1894 -10 -10.5432 11.603 -10
4 16 -7.9563 11.8578 -10 -8.1522 9.9083 -10 -8.7394 9.7301 -10 -8.1654 11.603 -10
4 16 -11.0034 12.4639 -10 -12.2417 13.9978 -10 -11.9525 14.5389 -10 -11.0357 12.7919 -10
4 16 -9.9606 15.8699 -10 -10.5432 13.9808 -10 -10.7523 13.726 -10 -10.5478 15.6917 -10
4 16 -9.6824 14.441 -10 -8.1522 15.6917 -10 -7.6111 15.4025 -10 -9.3543 14.4733 -10
4 16 -6.4583 13.9978 -10 -7.05 13.75 -10 -7.75 13.75 -10 -8.4202 14.1899 -10
4 16 -14 14.55 -10 -12.48 12.8 -10 -12.4199 12.1894 -10 -14.55 13.15 -10
4 16 -13.2 15.85 -10 -12.4199 13.4106 -10 -12.48 12.8 -10 -14 14.55 -10
4 16 -12.2417 13.9978 -10 -12.4199 13.4106 -10 -13.2 15.85 -10 -12.3 16.85 -10
4 16 -9.85 18 -10 -11.5632 15.0132 -10 -11.9525 14.5389 -10 -11 17.55 -10
4 16 -12.2417 13.9978 -10 -12.3 16.85 -10 -11 17.55 -10 -11.9525 14.5389 -10
3 16 -11.5632 15.0132 -10 -9.85 18 -10 -11.0889 15.4025 -10
4 16 -8.45 18.1 -10 -10.5478 15.6917 -10 -11.0889 15.4025 -10 -9.85 18 -10
4 16 -6.9 17.9 -10 -9.9606 15.8699 -10 -10.5478 15.6917 -10 -8.45 18.1 -10
4 16 -5.25 17.4 -10 -9.35 15.93 -10 -9.9606 15.8699 -10 -6.9 17.9 -10
4 16 -4 16.95 -10 -8.7394 15.8699 -10 -9.35 15.93 -10 -5.25 17.4 -10
3 16 -8.1522 15.6917 -10 -8.7394 15.8699 -10 -4 16.95 -10
3 16 -7.6111 15.4025 -10 -8.1522 15.6917 -10 -4 16.95 -10
3 16 -7.1368 15.0132 -10 -7.6111 15.4025 -10 -4 16.95 -10
3 16 -6.7475 14.5389 -10 -7.1368 15.0132 -10 -4 16.95 -10
3 16 -6.4583 13.9978 -10 -6.7475 14.5389 -10 -4 16.95 -10
4 16 -11.0357 12.7919 -10 -10.5432 11.603 -10 -10.7523 11.8578 -10 -10.9077 12.1484 -10
4 16 -8.7109 11.2385 -10 -9.9978 11.2385 -10 -10.2885 11.3939 -10 -10 13 -10
4 16 -11.0357 12.7919 -10 -10 13 -10 -10.2885 11.3939 -10 -10.5432 11.603 -10
4 16 -8.7109 11.2385 -10 -9.3543 11.1105 -10 -9.6824 11.1428 -10 -9.9978 11.2385 -10
3 16 -9.3543 11.1105 -10 -8.7109 11.2385 -10 -9.0263 11.1428 -10
4 16 -8.1654 11.603 -10 -8.4202 11.3939 -10 -8.7109 11.2385 -10 -10 13 -10
4 16 -7.8009 12.1484 -10 -7.9563 11.8578 -10 -8.1654 11.603 -10 -10 13 -10
3 16 -7.8009 12.1484 -10 -10 13 -10 -7.7053 12.4639 -10
4 16 -8.7109 14.3453 -10 -8.4202 14.1899 -10 -7.75 13.75 -10 -10 13 -10
4 16 -7.7053 12.4639 -10 -10 13 -10 -7.75 13.75 -10 -7.673 12.7919 -10
4 16 -9.3543 14.4733 -10 -9.0263 14.441 -10 -8.7109 14.3453 -10 -10 13 -10
4 16 -9.9978 14.3453 -10 -9.6824 14.441 -10 -9.3543 14.4733 -10 -10 13 -10
4 16 -9.9978 14.3453 -10 -10 13 -10 -10.5432 13.9808 -10 -10.2885 14.1899 -10
4 16 -10.5432 13.9808 -10 -10 13 -10 -10.9077 13.4353 -10 -10.7523 13.726 -10
4 16 -10.9077 13.4353 -10 -10 13 -10 -11.0357 12.7919 -10 -11.0034 13.1199 -10
3 16 -10.9077 12.1484 -10 -11.0034 12.4639 -10 -11.0357 12.7919 -10
4 16 4.75 11.9 -10 3.9764 12.0946 -10 5 13.4 -10 4.9861 13.1 -10
4 16 4.75 11.6 -10 4.75 11.9 -10 4.9861 13.1 -10 5.3 11.6 -10
4 16 6.25 13.35 -10 5.5737 13.1592 -10 5.65 13.35 -10 5.95 13.4 -10
4 16 5.9 11.6 -10 5.5737 13.1592 -10 6.25 13.35 -10 6.3559 13.2441 -10
4 16 6.5 8.15 -10 5.45 8.75 -10 5.9 11.6 -10 6.7 11.6 -10
3 16 6.7 11.6 -10 5.9 11.6 -10 6.3559 13.2441 -10
4 16 4.25 9.2 -10 3.2 9.5 -10 5.3 11.6 -10 5.9 11.6 -10
3 16 5.45 8.75 -10 4.25 9.2 -10 5.9 11.6 -10
3 16 6.5 8.15 -10 6.7 11.6 -10 7.3 11.6 -10
3 16 6.5 8.15 -10 7.3 11.6 -10 8.1 11.6 -10
3 16 6.5 8.15 -10 8.1 11.6 -10 8.7 11.6 -10
3 16 6.5 8.15 -10 8.7 11.6 -10 9.2 11.6 -10
4 16 12.7 8.6 -10 6.5 8.15 -10 9.45 11.65 -10 10.6 11.6 -10
3 16 6.5 8.15 -10 9.2 11.6 -10 9.45 11.65 -10
3 16 12.7 8.6 -10 10.6 11.6 -10 11.2 11.6 -10
4 16 11.2 11.6 -10 12.15 11.6 -10 13.6 9.85 -10 12.7 8.6 -10
4 16 12.0454 12.1 -10 14.55 13.15 -10 13.6 9.85 -10 12.15 11.6 -10
3 16 13.6 9.85 -10 14.55 13.15 -10 14.4 10.45 -10
3 16 14.4 10.45 -10 14.55 13.15 -10 14.8353 10.6241 -10
3 16 11.8047 13.25 -10 11.7 13.75 -10 14 14.55 -10
4 16 14 14.55 -10 14.55 13.15 -10 11.8779 12.9 -10 11.8047 13.25 -10
4 16 10.8547 13.25 -10 11.8047 13.25 -10 11.8779 12.9 -10 10.9279 12.9 -10
3 16 11.9826 12.4 -10 11.8779 12.9 -10 14.55 13.15 -10
4 16 14.55 13.15 -10 12.0454 12.1 -10 11.0954 12.1 -10 11.9826 12.4 -10
3 16 11.0954 12.1 -10 11.0326 12.4 -10 11.9826 12.4 -10
4 16 8.25 13.75 -10 8.9 13.75 -10 8.9 13 -10 8.407 13 -10
4 16 9.15 12.15 -10 8.8 12.5 -10 9.1 12.5 -10 9.2 12.35 -10
4 16 6.9 17.9 -10 7.65 13.75 -10 6.904 13.492 -10 6.85 13.6 -10
4 16 6.904 13.492 -10 7.65 13.75 -10 8.1 11.6 -10 7.3 11.6 -10
4 16 9.5 13.75 -10 10.15 13.75 -10 9.65 12.6 -10 9.45 13 -10
3 16 9.65 12.6 -10 9.35 12.85 -10 9.45 13 -10
3 16 10.6 11.6 -10 9.45 11.65 -10 9.65 11.85 -10
3 16 10.6 11.6 -10 9.65 11.85 -10 9.75 12.2 -10
4 16 9.75 12.2 -10 9.65 12.6 -10 10.15 13.75 -10 10.6 11.6 -10
4 16 4 16.95 -10 5.15 13.65 -10 3.6 13.75 -10 2.75 16.35 -10
4 16 3.9764 12.0946 -10 3.6 13.75 -10 5.15 13.65 -10 5 13.4 -10
4 16 5.25 17.4 -10 5.45 13.75 -10 5.15 13.65 -10 4 16.95 -10
4 16 6.9 17.9 -10 6.55 13.75 -10 5.45 13.75 -10 5.25 17.4 -10
3 16 6.85 13.6 -10 6.55 13.75 -10 6.9 17.9 -10
4 16 8.25 13.75 -10 7.65 13.75 -10 6.9 17.9 -10 8.45 18.1 -10
4 16 8.9 13.75 -10 8.25 13.75 -10 8.45 18.1 -10 9.85 18 -10
4 16 11 17.55 -10 9.5 13.75 -10 8.9 13.75 -10 9.85 18 -10
4 16 12.3 16.85 -10 10.15 13.75 -10 9.5 13.75 -10 11 17.55 -10
4 16 14 14.55 -10 10.75 13.75 -10 10.15 13.75 -10 12.3 16.85 -10
3 16 11.7 13.75 -10 10.75 13.75 -10 14 14.55 -10
3 16 14 14.55 -10 12.3 16.85 -10 13.2 15.85 -10
3 16 0 31.5 -10 -17.15 31.5 -10 19 32 -10
4 16 -19 32 -10 19 32 -10 -17.15 31.5 -10 -18 31.5 -10
3 16 17.15 31.5 -10 0 31.5 -10 19 32 -10
3 16 18 31.5 -10 17.15 31.5 -10 19 32 -10
3 0 1.7 28.25 -10 -1.7 28.25 -10 0 28.95 -10
3 0 -4.3 11.6 -10 -3.8884 12.5 -10 -3.8047 12.1 -10
3 0 -4.3 11.6 -10 -3.993 13 -10 -3.8884 12.5 -10
4 0 -4.75 13.75 -10 -4.15 13.75 -10 -3.993 13 -10 -4.3 11.6 -10
4 0 -3.3 12.5 -10 -3.6 12.5 -10 -3.993 13 -10 -3.3 13 -10
3 0 -3.6 12.5 -10 -3.8884 12.5 -10 -3.993 13 -10
4 16 -3.8047 12.1 -10 -3.8884 12.5 -10 -3.6 12.5 -10 -3.4 12.1 -10
3 0 .45 11.6 -10 .8616 12.5 -10 .9454 12.1 -10
3 0 .45 11.6 -10 .757 13 -10 .8616 12.5 -10
4 0 .8616 12.5 -10 .757 13 -10 1.25 13 -10 1.15 12.5 -10
4 16 .9454 12.1 -10 .8616 12.5 -10 1.15 12.5 -10 1.35 12.1 -10
3 0 8.1 11.6 -10 8.5116 12.5 -10 8.5954 12.1 -10
3 0 8.1 11.6 -10 8.407 13 -10 8.5116 12.5 -10
4 0 8.407 13 -10 8.1 11.6 -10 7.65 13.75 -10 8.25 13.75 -10
4 0 8.8 12.5 -10 8.5116 12.5 -10 8.407 13 -10 8.9 13 -10
4 16 9.15 12.15 -10 8.5954 12.1 -10 8.5116 12.5 -10 8.8 12.5 -10
3 16 9 12.1 -10 8.5954 12.1 -10 9.15 12.15 -10
4 16 -18 31.5 -10 -18 29 -10 -19 29 -10 -19 32 -10
3 212 -16.9 31.1 -10 -17.15 31.5 -10 0 31.5 -10
4 0 -14.85 25.95 -10 -15.25 26.75 -10 -14.3776 27.0827 -10 -14.2 26.65 -10
4 0 -15.25 26.75 -10 -15.45 27.25 -10 -15.45 27.5 -10 -14.3776 27.0827 -10
4 0 -15.45 27.5 -10 -15.25 27.7 -10 -14.484 27.852 -10 -14.3776 27.0827 -10
4 0 -14.85 25.95 -10 -14 26 -10 -13.75 24.85 -10 -14.6 25.05 -10
3 0 -14.85 25.95 -10 -14.2 26.65 -10 -14 26 -10
4 0 -14.3776 27.0827 -10 -14.484 27.852 -10 -12.4 28.2 -10 -12.55 27.4 -10
4 0 -17.6 30.85 -10 -16.9 31.1 -10 -16.2 30.1 -10 -16.8 29.8 -10
4 0 -16.8 29.8 -10 -16.2 30.1 -10 -15.2 28.8 -10 -15.9 28.6 -10
4 0 -15.9 28.6 -10 -15.2 28.8 -10 -14.484 27.852 -10 -15.25 27.7 -10
4 0 14.85 25.95 -10 14.2 26.65 -10 14.3776 27.0827 -10 15.25 26.75 -10
4 0 15.25 26.75 -10 14.3776 27.0827 -10 15.45 27.5 -10 15.45 27.25 -10
4 0 14.484 27.852 -10 15.25 27.7 -10 15.45 27.5 -10 14.3776 27.0827 -10
4 0 14.85 25.95 -10 14.6 25.05 -10 13.75 24.85 -10 14 26 -10
3 0 14.85 25.95 -10 14 26 -10 14.2 26.65 -10
4 0 12.4 28.2 -10 14.484 27.852 -10 14.3776 27.0827 -10 12.55 27.4 -10
4 0 15.9 28.6 -10 15.25 27.7 -10 14.484 27.852 -10 15.2 28.8 -10
4 0 16.2 30.1 -10 16.9 31.1 -10 17.6 30.85 -10 16.8 29.8 -10
4 212 -15.2 28.8 -10 -16.2 30.1 -10 -16.9 31.1 -10 0 31.5 -10
4 212 -6.5 28.75 -10 -9.55 28.55 -10 -15.2 28.8 -10 0 31.5 -10
3 212 -14.484 27.852 -10 -15.2 28.8 -10 -12.4 28.2 -10
3 212 -12.4 28.2 -10 -15.2 28.8 -10 -9.55 28.55 -10
4 212 15.2 28.8 -10 9.55 28.55 -10 16.9 31.1 -10 16.2 30.1 -10
4 16 -14 26 -10 -12.55 27.4 -10 -10.15 27.75 -10 -13.75 24.85 -10
3 16 -14.2 26.65 -10 -14.3776 27.0827 -10 -12.55 27.4 -10
3 16 -14 26 -10 -14.2 26.65 -10 -12.55 27.4 -10
4 16 8.4 25.8 -10 10.15 27.75 -10 12.55 27.4 -10 8.95 25.3 -10
4 16 13.75 24.85 -10 8.95 25.3 -10 12.55 27.4 -10 14 26 -10
4 16 13.7 23.95 -10 10.35 18.9 -10 8.95 25.3 -10 13.75 24.85 -10
3 16 14.2 26.65 -10 12.55 27.4 -10 14.3776 27.0827 -10
3 16 14 26 -10 12.55 27.4 -10 14.2 26.65 -10
4 0 16.8 29.8 -10 15.9 28.6 -10 15.2 28.8 -10 16.2 30.1 -10
3 212 12.4 28.2 -10 9.55 28.55 -10 15.2 28.8 -10
3 212 14.484 27.852 -10 12.4 28.2 -10 15.2 28.8 -10
4 16 -.5454 13.25 -10 -.65 13.75 -10 2.75 16.35 -10 0 13.75 -10
3 71 -18 29 -10 -18 31.5 -10 -17.6 30.85 -10
4 71 -15.9 28.6 -10 -18 29 -10 -17.6 30.85 -10 -16.8 29.8 -10
3 71 -15.45 27.5 -10 -15.9 28.6 -10 -15.25 27.7 -10
4 71 -15.9 28.6 -10 -15.45 27.5 -10 -15.45 27.25 -10 -18 29 -10
4 71 -14.6 25.05 -10 -18 29 -10 -15.25 26.75 -10 -14.85 25.95 -10
3 71 -15.25 26.75 -10 -18 29 -10 -15.45 27.25 -10
4 71 14.6 23.25 -10 18 29 -10 15.45 20.65 -10 14.9 22 -10
4 71 14.6 25.05 -10 18 29 -10 14.6 23.25 -10 14.55 24.3 -10
4 71 15.25 26.75 -10 18 29 -10 14.6 25.05 -10 14.85 25.95 -10
4 71 18 29 -10 15.45 27.5 -10 15.25 27.7 -10 15.9 28.6 -10
3 71 15.45 27.25 -10 15.45 27.5 -10 18 29 -10
3 71 15.25 26.75 -10 15.45 27.25 -10 18 29 -10
4 71 15.9 28.6 -10 16.8 29.8 -10 17.6 30.85 -10 18 29 -10
3 71 18 29 -10 17.6 30.85 -10 18 31.5 -10

0 // Back
4 0 16.8 30.95 10 17.6 30.9 10 18 31.5 10 17.15 31.5 10
4 0 16.3 30.1 10 16.95 29.85 10 17.6 30.9 10 16.8 30.95 10
4 0 15.6 29.05 10 16.35 28.95 10 16.95 29.85 10 16.3 30.1 10
4 0 16.35 28.95 10 15.6 29.05 10 14.85 27.9 10 15.75 28 10
4 0 14.1776 26.1827 10 14 25.75 10 14.65 25.05 10 14.9 25.75 10
4 0 13.7 23.95 10 14.55 24.3 10 14.65 25.05 10 13.75 24.85 10
3 0 13.75 24.85 10 14.65 25.05 10 14 25.75 10
4 0 13.75 22.95 10 14.6 23.25 10 14.55 24.3 10 13.7 23.95 10
4 0 13.75 22.95 10 14 21.9 10 14.9 22 10 14.6 23.25 10
4 0 14 21.9 10 14.4 20.9 10 15.45 20.65 10 14.9 22 10
4 0 14.4 20.9 10 14.8 19.7 10 15.95 19.2 10 15.45 20.65 10
3 0 15.25 18.5 10 15.95 19.2 10 14.8 19.7 10
4 0 9.55 27.55 10 10.15 26.75 10 12.6 26.45 10 12.4 27.2 10
4 0 6.5 27.75 10 7.4 27 10 10.15 26.75 10 9.55 27.55 10
4 0 3.25 27.9 10 4.45 27.15 10 7.4 27 10 6.5 27.75 10
3 0 4.45 27.15 10 3.25 27.9 10 1.7 27.25 10
4 0 -1.7 27.25 10 1.7 27.25 10 3.25 27.9 10 0 27.95 10
4 0 13.6 9.85 10 14.35 9.3 10 14.655 9.5773 10 14.4 10.45 10
4 0 14.35 9.3 10 13.6 9.85 10 12.8 8.5 10 13.75 8.5 10
4 0 13.75 8.5 10 12.8 8.5 10 12.15 7.3 10 13.15 7.5 10
4 0 13.15 7.5 10 12.15 7.3 10 11.7 5.8 10 12.75 6.2 10
4 0 12.75 6.2 10 11.7 5.8 10 11.25 4.05 10 12.45 4.55 10
3 0 12.3 2.85 10 12.45 4.55 10 11.25 4.05 10
4 0 12 1 10 12.25 1.6 10 10.95 2.1 10 10.85 1 10
4 0 11.25 4.05 10 10.95 2.1 10 12.25 1.6 10 12.3 2.85 10
3 0 12 1 10 12.7 1.325 10 12.25 1.6 10
4 78 12.3 2.85 10 13.35 2 10 12.75 6.2 10 12.45 4.55 10
4 78 13.15 7.5 10 12.75 6.2 10 14.655 9.5773 10 13.75 8.5 10
3 78 13.35 2 10 14.655 9.5773 10 12.75 6.2 10
3 78 13.75 8.5 10 14.655 9.5773 10 14.35 9.3 10
4 78 12.3 2.85 10 12.25 1.6 10 12.7 1.325 10 13.35 2 10
3 0 14.655 9.5773 10 14.8353 10.6241 10 14.4 10.45 10
4 0 15.25 18.5 10 15.8524 16.5298 10 16.2002 18.5495 10 15.95 19.2 10
3 0 15.8524 16.5298 10 15.25 18.5 10 15.6 17.35 10
3 71 16.35 28.95 10 18 29 10 16.95 29.85 10
4 71 14.55 24.3 10 14.6 23.25 10 14.9 22 10 15.45 20.65 10
4 71 16.2002 18.5495 10 18 29 10 15.45 20.65 10 15.95 19.2 10
4 212 9.55 27.55 10 12.4 27.2 10 14.85 27.9 10 15.6 29.05 10
3 212 9.55 27.55 10 0 31.5 10 6.5 27.75 10
3 212 6.5 27.75 10 0 31.5 10 3.25 27.9 10
3 212 3.25 27.9 10 0 31.5 10 0 27.95 10
4 0 -18 31.5 10 -17.6 30.9 10 -16.8 30.95 10 -17.15 31.5 10
4 0 -16.3 30.1 10 -16.8 30.95 10 -17.6 30.9 10 -16.95 29.85 10
4 0 -13.75 24.85 10 -14.55 24.3 10 -14.6 23.25 10 -13.7 23.95 10
4 0 -14.9 22 10 -14 21.9 10 -13.75 22.95 10 -14.6 23.25 10
3 0 -13.75 22.95 10 -13.7 23.95 10 -14.6 23.25 10
4 0 -14 21.9 10 -14.9 22 10 -15.45 20.65 10 -14.4 20.9 10
3 0 -15.25 18.5 10 -14.8 19.7 10 -15.95 19.2 10
4 0 -14.4 20.9 10 -15.45 20.65 10 -15.95 19.2 10 -14.8 19.7 10
4 0 -9.55 27.55 10 -12.4 27.2 10 -12.6 26.45 10 -10.15 26.75 10
4 0 -6.5 27.75 10 -9.55 27.55 10 -10.15 26.75 10 -7.4 27 10
4 0 -3.25 27.9 10 -6.5 27.75 10 -7.4 27 10 -4.45 27.15 10
4 0 0 27.95 10 -3.25 27.9 10 -4.45 27.15 10 -1.7 27.25 10
4 0 -14.35 9.3 10 -13.75 8.5 10 -12.8 8.5 10 -13.6 9.85 10
4 0 -13.75 8.5 10 -13.15 7.5 10 -12.15 7.3 10 -12.8 8.5 10
4 0 -13.15 7.5 10 -12.75 6.2 10 -11.7 5.8 10 -12.15 7.3 10
4 0 -11.25 4.05 10 -11.7 5.8 10 -12.75 6.2 10 -12.45 4.55 10
4 0 -12.45 4.55 10 -12.3 2.85 10 -10.95 2.1 10 -11.25 4.05 10
4 0 -12.3 2.85 10 -12.25 1.6 10 -10.85 1 10 -10.95 2.1 10
4 0 -12.7 1.325 10 -12 1 10 -10.85 1 10 -12.25 1.6 10
4 78 -12.75 6.2 10 -13.35 2 10 -12.3 2.85 10 -12.45 4.55 10
4 78 -13.75 8.5 10 -14.655 9.5773 10 -13.35 2 10 -12.75 6.2 10
3 78 -12.75 6.2 10 -13.15 7.5 10 -13.75 8.5 10
4 78 -12.3 2.85 10 -13.35 2 10 -12.7 1.325 10 -12.25 1.6 10
3 78 -13.75 8.5 10 -14.35 9.3 10 -14.655 9.5773 10
4 0 -13.6 9.85 10 -14.4 10.45 10 -14.655 9.5773 10 -14.35 9.3 10
3 0 -14.655 9.5773 10 -14.4 10.45 10 -14.8353 10.6241 10
4 0 -15.95 19.2 10 -16.2002 18.5495 10 -15.8524 16.5298 10 -15.6 17.35 10
3 0 -15.6 17.35 10 -15.25 18.5 10 -15.95 19.2 10
3 71 -15.45 20.65 10 -14.9 22 10 -14.6 23.25 10
3 71 -16.2002 18.5495 10 -15.95 19.2 10 -18 29 10
4 71 -15.25 26.4 10 -18 29 10 -15.95 19.2 10 -15.45 20.65 10
3 212 -6.5 27.75 10 -3.25 27.9 10 0 31.5 10
3 212 -3.25 27.9 10 0 27.95 10 0 31.5 10
4 0 14.1776 26.1827 10 14.284 26.952 10 12.4 27.2 10 12.6 26.45 10
4 71 9.7 25 10 11.7 24.6 10 12.1 25 10 10.9 25.5 10
3 71 12.9 24.3 10 12.1 25 10 11.7 24.6 10
4 71 7.4 25.2 10 9.7 25 10 10.9 25.5 10 8.9 26 10
4 71 4.8 25.4 10 7.4 25.2 10 8.9 26 10 6.4 26.2 10
4 71 2.1 25.5 10 4.8 25.4 10 6.4 26.2 10 3.2 26.2 10
4 71 -.2 25.5 10 2.1 25.5 10 3.2 26.2 10 .7 26.1 10
4 71 .7 26.1 10 -1.2 25.9 10 -2.9 25.5 10 -.2 25.5 10
4 71 .05 24.65 10 -.75 24.8 10 -1.9 24.8 10 -1 24.45 10
4 71 -1 24.45 10 -1.9 24.8 10 -3.55 24.6 10 -2.35 24.15 10
4 71 -2.35 24.15 10 -3.55 24.6 10 -5.3 24.2 10 -4.25 23.65 10
4 71 -6.9 23.7 10 -6.05 23 10 -4.25 23.65 10 -5.3 24.2 10
4 71 -6.9 23.7 10 -7.8 23.15 10 -7.55 22.35 10 -6.05 23 10
4 71 -7.8 23.15 10 -8.45 22.6 10 -8.35 21.95 10 -7.55 22.35 10
4 71 -8.45 22.6 10 -8.85 22 10 -8.95 21.5 10 -8.35 21.95 10
4 71 13.95 14.1 10 11.85 14.4 10 10.8 13.75 10 12.35 13.9 10
3 71 10.8 13.75 10 11.85 14.4 10 9.85 14.45 10
4 71 7.15 13.95 10 7.9 13.25 10 8.8 13.5 10 8 14.2 10
4 71 10.8 13.75 10 9.85 14.45 10 8 14.2 10 8.8 13.5 10
4 71 7.35 12.95 10 7.9 13.25 10 7.15 13.95 10 6.6 13.55 10
4 71 6.9 12.3 10 7.35 12.95 10 6.6 13.55 10 6.15 13 10
4 71 6.15 13 10 5.65 11.8 10 6.4 10.85 10 6.9 12.3 10
4 71 5.65 11.8 10 5.2 10.5 10 5.85 9.1 10 6.4 10.85 10
4 71 5.2 10.5 10 5 9.1 10 5.5 7.55 10 5.85 9.1 10
4 71 5 9.1 10 4.9 7.45 10 5.4 6.9 10 5.5 7.55 10
4 71 4.9 7.45 10 5 6.85 10 5.25 6.35 10 5.4 6.9 10
4 71 -10.8 13.75 10 -11.85 14.4 10 -13.95 14.1 10 -12.35 13.9 10
4 71 -8.8 13.5 10 -9.85 14.45 10 -11.85 14.4 10 -10.8 13.75 10
4 71 -7.9 13.25 10 -8 14.2 10 -9.85 14.45 10 -8.8 13.5 10
4 71 -6.6 13.55 10 -7.15 13.95 10 -8 14.2 10 -7.9 13.25 10
4 71 -6.15 13 10 -6.6 13.55 10 -7.9 13.25 10 -7.35 12.95 10
4 71 -5.65 11.8 10 -6.15 13 10 -7.35 12.95 10 -6.9 12.3 10
4 71 -5.2 10.5 10 -5.65 11.8 10 -6.9 12.3 10 -6.4 10.85 10
4 71 -6.4 10.85 10 -5.85 9.1 10 -5 9.1 10 -5.2 10.5 10
4 71 -4.9 7.45 10 -5 9.1 10 -5.85 9.1 10 -5.5 7.55 10
4 71 -5 6.85 10 -4.9 7.45 10 -5.5 7.55 10 -5.4 6.9 10
3 71 -5.25 6.35 10 -5 6.85 10 -5.4 6.9 10
4 0 8.2 1 10 7.45 1.9 10 6.45 1.85 10 7.4 1 10
4 0 5.15 2.6 10 6.45 1.85 10 7.45 1.9 10 6.05 2.95 10
4 0 6.05 2.95 10 4.5 3.6 10 3.5 3.2 10 5.15 2.6 10
4 0 1.7 3.5 10 3.5 3.2 10 4.5 3.6 10 2.6 4.1 10
3 0 1.7 3.5 10 2.6 4.1 10 .95 4.3 10
4 0 -1.7 3.5 10 0 3.6 10 0 4.35 10 -.95 4.3 10
4 0 1.7 3.5 10 .95 4.3 10 0 4.35 10 0 3.6 10
4 78 6.45 1.85 10 5.15 2.6 10 1.7 3.5 10 7.4 1 10
4 78 0 3.6 10 0 1 10 7.4 1 10 1.7 3.5 10
3 78 5.15 2.6 10 3.5 3.2 10 1.7 3.5 10
4 78 -3.5 3.2 10 0 1 10 0 3.6 10 -1.7 3.5 10
3 16 12 0 10 12 1 10 10.85 1 10
4 16 10.85 1 10 8.4 2.05 10 9.25 1 10 12 0 10
3 16 12 0 10 8.2 1 10 7.4 1 10
4 0 -6.45 1.85 10 -7.45 1.9 10 -8.2 1 10 -7.4 1 10
4 0 -7.45 1.9 10 -6.45 1.85 10 -5.15 2.6 10 -6.05 2.95 10
4 0 -3.5 3.2 10 -4.5 3.6 10 -6.05 2.95 10 -5.15 2.6 10
4 0 -4.5 3.6 10 -3.5 3.2 10 -1.7 3.5 10 -2.6 4.1 10
3 0 -1.7 3.5 10 -.95 4.3 10 -2.6 4.1 10
4 78 -7.4 1 10 0 1 10 -5.15 2.6 10 -6.45 1.85 10
3 78 0 1 10 -3.5 3.2 10 -5.15 2.6 10
4 16 14.345 2 10 12.7 1.325 10 12 1 10 12 0 10
3 16 12.7 1.325 10 14.345 2 10 13.35 2 10
4 16 14.655 9.5773 10 13.35 2 10 14.345 2 10 19 29 10
3 16 14.655 9.5773 10 19 29 10 14.8353 10.6241 10
3 16 16.2002 18.5495 10 19 29 10 18 29 10
3 16 15.8524 16.5298 10 19 29 10 16.2002 18.5495 10
4 16 15.8524 16.5298 10 14.4 10.45 10 14.8353 10.6241 10 19 29 10
3 16 -12 0 10 0 1 10 -7.4 1 10
4 16 7.4 1 10 0 1 10 -12 0 10 12 0 10
3 16 -12 0 10 -7.4 1 10 -8.2 1 10
3 16 -12 0 10 -9.25 1 10 -10.85 1 10
4 16 -10.95 2.1 10 -10.85 1 10 -9.25 1 10 -8.4 2.05 10
3 16 -12 0 10 -10.85 1 10 -12 1 10
4 16 -14.345 2 10 -12 0 10 -12 1 10 -12.7 1.325 10
3 16 -12.7 1.325 10 -13.35 2 10 -14.345 2 10
4 16 -14.655 9.5773 10 -19 29 10 -14.345 2 10 -13.35 2 10
3 16 -14.655 9.5773 10 -14.8353 10.6241 10 -19 29 10
3 16 -16.2002 18.5495 10 -18 29 10 -19 29 10
3 16 -15.8524 16.5298 10 -16.2002 18.5495 10 -19 29 10
4 16 -15.8524 16.5298 10 -19 29 10 -14.8353 10.6241 10 -14.4 10.45 10
4 16 -11.85 14.4 10 -15.6 17.35 10 -15.8524 16.5298 10 -13.95 14.1 10
4 16 -8.95 21.5 10 -14.8 19.7 10 -15.25 18.5 10 -15.6 17.35 10
4 16 -9.85 14.45 10 -8.95 21.5 10 -15.6 17.35 10 -11.85 14.4 10
4 16 -14.8 19.7 10 -8.95 21.5 10 -14 21.9 10 -14.4 20.9 10
4 16 -14 21.9 10 -8.95 21.5 10 -8.85 22 10 -13.75 22.95 10
4 16 -13.75 22.95 10 -8.85 22 10 -8.45 22.6 10 -13.7 23.95 10
3 16 -8.45 22.6 10 -13.75 24.85 10 -13.7 23.95 10
4 16 -4.45 27.15 10 -2.9 25.5 10 -1.2 25.9 10 -1.7 27.25 10
4 16 -4.45 27.15 10 -7.4 27 10 -5.3 24.2 10 -2.9 25.5 10
3 16 -5.3 24.2 10 -3.55 24.6 10 -2.9 25.5 10
3 16 -6.9 23.7 10 -5.3 24.2 10 -7.4 27 10
4 16 -7.4 27 10 -10.15 26.75 10 -7.8 23.15 10 -6.9 23.7 10
3 16 -8.45 22.6 10 -7.8 23.15 10 -10.15 26.75 10
4 16 12.9 24.3 10 13.7 23.95 10 12.6 26.45 10 12.1 25 10
3 16 13.7 23.95 10 13.75 24.85 10 12.6 26.45 10
3 16 13.75 24.85 10 14 25.75 10 12.6 26.45 10
3 16 14 25.75 10 14.1776 26.1827 10 12.6 26.45 10
4 16 12.1 25 10 12.6 26.45 10 10.15 26.75 10 10.9 25.5 10
4 16 10.9 25.5 10 10.15 26.75 10 7.4 27 10 8.9 26 10
4 16 3.2 26.2 10 6.4 26.2 10 7.4 27 10 4.45 27.15 10
3 16 8.9 26 10 7.4 27 10 6.4 26.2 10
4 16 -.2 25.5 10 -2.9 25.5 10 -1.9 24.8 10 -.75 24.8 10
3 16 -3.55 24.6 10 -1.9 24.8 10 -2.9 25.5 10
4 16 -.75 24.8 10 .05 24.65 10 2.1 25.5 10 -.2 25.5 10
3 16 .05 24.65 10 4.8 25.4 10 2.1 25.5 10
4 16 7.15 13.95 10 8 14.2 10 7.4 25.2 10 4.8 25.4 10
4 16 7.4 25.2 10 8 14.2 10 11.7 24.6 10 9.7 25 10
4 16 11.7 24.6 10 8 14.2 10 13.7 23.95 10 12.9 24.3 10
4 16 13.7 23.95 10 8 14.2 10 9.85 14.45 10 13.75 22.95 10
3 16 9.85 14.45 10 14 21.9 10 13.75 22.95 10
4 16 14.8 19.7 10 14.4 20.9 10 14 21.9 10 9.85 14.45 10
4 16 15.25 18.5 10 14.8 19.7 10 9.85 14.45 10 11.85 14.4 10
4 16 15.6 17.35 10 15.25 18.5 10 11.85 14.4 10 13.95 14.1 10
4 16 13.95 14.1 10 14.4 10.45 10 15.8524 16.5298 10 15.6 17.35 10
4 16 13.95 14.1 10 12.35 13.9 10 13.6 9.85 10 14.4 10.45 10
4 16 7.35 12.95 10 12.35 13.9 10 10.8 13.75 10 8.8 13.5 10
4 16 5.85 9.1 10 13.6 9.85 10 12.35 13.9 10 7.35 12.95 10
3 16 7.35 12.95 10 8.8 13.5 10 7.9 13.25 10
4 16 5.85 9.1 10 7.35 12.95 10 6.9 12.3 10 6.4 10.85 10
4 16 12.8 8.5 10 13.6 9.85 10 5.85 9.1 10 5.5 7.55 10
4 16 12.8 8.5 10 5.5 7.55 10 5.4 6.9 10 12.15 7.3 10
4 16 12.15 7.3 10 5.4 6.9 10 5.25 6.35 10 11.7 5.8 10
4 16 5.25 6.35 10 6.05 3.7 10 11.25 4.05 10 11.7 5.8 10
4 16 6.05 3.7 10 7.25 3 10 10.95 2.1 10 11.25 4.05 10
4 16 7.25 3 10 8.4 2.05 10 10.85 1 10 10.95 2.1 10
4 16 4.6 4.25 10 6.05 3.7 10 5.25 6.35 10 5 6.85 10
3 16 3 4.65 10 -5 9.1 10 1.45 4.85 10
4 16 -5.2 10.5 10 -5 9.1 10 3 4.65 10 4.9 7.45 10
4 16 5 6.85 10 4.9 7.45 10 3 4.65 10 4.6 4.25 10
3 16 1.45 4.85 10 -5 9.1 10 0 4.95 10
4 16 -5 9.1 10 -4.9 7.45 10 -1.45 4.85 10 0 4.95 10
4 16 -4.9 7.45 10 -5 6.85 10 -3 4.65 10 -1.45 4.85 10
4 16 -5 6.85 10 -5.25 6.35 10 -4.6 4.25 10 -3 4.65 10
4 16 -12.15 7.3 10 -11.7 5.8 10 -4.6 4.25 10 -5.25 6.35 10
4 16 -11.25 4.05 10 -6.05 3.7 10 -4.6 4.25 10 -11.7 5.8 10
3 16 -5.25 6.35 10 -5.4 6.9 10 -12.15 7.3 10
4 16 -6.05 3.7 10 -11.25 4.05 10 -10.95 2.1 10 -7.25 3 10
3 16 -8.4 2.05 10 -7.25 3 10 -10.95 2.1 10
4 16 -5.85 9.1 10 -6.4 10.85 10 -5.4 6.9 10 -5.5 7.55 10
4 16 -12.8 8.5 10 -12.15 7.3 10 -5.4 6.9 10 -6.4 10.85 10
4 16 -7.35 12.95 10 -7.9 13.25 10 -13.6 9.85 10 -6.9 12.3 10
4 16 -6.4 10.85 10 -6.9 12.3 10 -13.6 9.85 10 -12.8 8.5 10
4 16 -8.8 13.5 10 -12.35 13.9 10 -13.6 9.85 10 -7.9 13.25 10
3 16 -8.8 13.5 10 -10.8 13.75 10 -12.35 13.9 10
4 16 -13.95 14.1 10 -15.8524 16.5298 10 -14.4 10.45 10 -13.6 9.85 10
3 16 -13.6 9.85 10 -12.35 13.9 10 -13.95 14.1 10
4 16 -8.35 21.95 10 7.15 13.95 10 -1 24.45 10 -2.35 24.15 10
4 16 4.8 25.4 10 .05 24.65 10 -1 24.45 10 7.15 13.95 10
4 16 -8.35 21.95 10 -2.35 24.15 10 -4.25 23.65 10 -6.05 23 10
3 16 -8.35 21.95 10 -6.05 23 10 -7.55 22.35 10
4 16 -8 14.2 10 -8.35 21.95 10 -8.95 21.5 10 -9.85 14.45 10
4 16 -8 14.2 10 6.6 13.55 10 7.15 13.95 10 -8.35 21.95 10
4 16 6.15 13 10 -7.15 13.95 10 -6.6 13.55 10 5.65 11.8 10
4 16 -7.15 13.95 10 6.15 13 10 6.6 13.55 10 -8 14.2 10
4 16 -6.6 13.55 10 -6.15 13 10 5 9.1 10 5.2 10.5 10
4 16 4.9 7.45 10 5 9.1 10 -6.15 13 10 -5.65 11.8 10
3 16 5.2 10.5 10 5.65 11.8 10 -6.6 13.55 10
3 16 4.9 7.45 10 -5.65 11.8 10 -5.2 10.5 10
4 16 -1.2 25.9 10 .7 26.1 10 1.7 27.25 10 -1.7 27.25 10
4 16 4.45 27.15 10 1.7 27.25 10 .7 26.1 10 3.2 26.2 10
3 16 17.15 31.5 10 18 31.5 10 19 32 10
3 16 -18 31.5 10 -17.15 31.5 10 -19 32 10
4 16 19 32 10 -19 32 10 -17.15 31.5 10 0 31.5 10
3 16 0 31.5 10 17.15 31.5 10 19 32 10
4 71 18 29 10 18 31.5 10 17.6 30.9 10 16.95 29.85 10
4 16 19 29 10 19 32 10 18 31.5 10 18 29 10
4 71 -17.6 30.9 10 -18 31.5 10 -18 29 10 -16.95 29.85 10
4 16 -19 29 10 -18 29 10 -18 31.5 10 -19 32 10
4 212 9.55 27.55 10 16.8 30.95 10 17.15 31.5 10 0 31.5 10
4 212 15.6 29.05 10 16.3 30.1 10 16.8 30.95 10 9.55 27.55 10
4 212 -6.5 27.75 10 0 31.5 10 -16.8 30.95 10 -9.55 27.55 10
4 212 -15.6 29.05 10 -9.55 27.55 10 -16.8 30.95 10 -16.3 30.1 10
3 212 -16.8 30.95 10 0 31.5 10 -17.15 31.5 10
3 16 12 0 10 9.25 1 10 8.2 1 10
3 16 -12 0 10 -8.2 1 10 -9.25 1 10
4 71 7.45 1.9 10 8.2 1 10 9.25 1 10 8.4 2.05 10
4 71 6.05 2.95 10 7.45 1.9 10 8.4 2.05 10 7.25 3 10
4 71 4.5 3.6 10 6.05 2.95 10 7.25 3 10 6.05 3.7 10
4 71 6.05 3.7 10 4.6 4.25 10 2.6 4.1 10 4.5 3.6 10
4 71 1.45 4.85 10 2.6 4.1 10 4.6 4.25 10 3 4.65 10
4 71 2.6 4.1 10 1.45 4.85 10 0 4.95 10 .95 4.3 10
4 71 .95 4.3 10 0 4.95 10 -1.45 4.85 10 0 4.35 10
3 71 -.95 4.3 10 0 4.35 10 -1.45 4.85 10
4 71 -.95 4.3 10 -1.45 4.85 10 -3 4.65 10 -2.6 4.1 10
4 71 -2.6 4.1 10 -3 4.65 10 -4.6 4.25 10 -4.5 3.6 10
4 71 -4.6 4.25 10 -6.05 3.7 10 -6.05 2.95 10 -4.5 3.6 10
4 71 -6.05 3.7 10 -7.25 3 10 -7.45 1.9 10 -6.05 2.95 10
4 71 -7.25 3 10 -8.4 2.05 10 -8.2 1 10 -7.45 1.9 10
3 71 -9.25 1 10 -8.2 1 10 -8.4 2.05 10
4 0 15.05 26.8 10 15.75 28 10 14.85 27.9 10 14.284 26.952 10
4 0 15.25 26.65 10 14.1776 26.1827 10 14.9 25.75 10 15.25 26.4 10
4 0 15.25 26.65 10 15.05 26.8 10 14.284 26.952 10 14.1776 26.1827 10
4 71 14.9 25.75 10 14.65 25.05 10 14.55 24.3 10 15.45 20.65 10
4 71 16.35 28.95 10 15.75 28 10 15.25 26.65 10 18 29 10
3 71 15.25 26.65 10 15.75 28 10 15.05 26.8 10
3 71 15.25 26.4 10 18 29 10 15.25 26.65 10
4 71 14.9 25.75 10 15.45 20.65 10 18 29 10 15.25 26.4 10
4 0 -14.65 25.05 10 -14 25.75 10 -14.1776 26.1827 10 -14.9 25.75 10
4 0 -14.55 24.3 10 -13.75 24.85 10 -14 25.75 10 -14.65 25.05 10
4 0 -15.05 26.8 10 -14.284 26.952 10 -14.85 27.9 10 -15.75 28 10
4 0 -15.25 26.65 10 -15.25 26.4 10 -14.9 25.75 10 -14.1776 26.1827 10
4 0 -14.284 26.952 10 -15.05 26.8 10 -15.25 26.65 10 -14.1776 26.1827 10
4 0 -12.4 27.2 10 -14.284 26.952 10 -14.1776 26.1827 10 -12.6 26.45 10
4 0 -16.35 28.95 10 -15.75 28 10 -14.85 27.9 10 -15.6 29.05 10
3 212 -14.284 26.952 10 -12.4 27.2 10 -14.85 27.9 10
4 212 -9.55 27.55 10 -15.6 29.05 10 -14.85 27.9 10 -12.4 27.2 10
3 212 14.284 26.952 10 14.85 27.9 10 12.4 27.2 10
4 16 -8.45 22.6 10 -10.15 26.75 10 -12.6 26.45 10 -13.75 24.85 10
3 16 -13.75 24.85 10 -12.6 26.45 10 -14 25.75 10
3 16 -14 25.75 10 -12.6 26.45 10 -14.1776 26.1827 10
4 71 -14.6 23.25 10 -14.55 24.3 10 -14.65 25.05 10 -15.45 20.65 10
4 71 -14.65 25.05 10 -14.9 25.75 10 -15.25 26.4 10 -15.45 20.65 10
3 71 -15.25 26.4 10 -15.25 26.65 10 -18 29 10
4 71 -15.05 26.8 10 -15.75 28 10 -18 29 10 -15.25 26.65 10
4 71 -16.95 29.85 10 -18 29 10 -15.75 28 10 -16.35 28.95 10
4 0 -15.6 29.05 10 -16.3 30.1 10 -16.95 29.85 10 -16.35 28.95 10
