{
    "parameters": {
        "version": "1.0"
    },
    "responses": {
        "200": {
            "body": [
                {
                    "id": "00000000-0000-0000-0000-000000000000",
                    "state": "Succeeded",
                    "entityId": "00000000-0000-0000-0000-000000000000",
                    "role": "CommunityAdmin",
                    "documents": [
                        "driverLicense.jpg"
                    ],
                    "accreditationState": "Rejected"
                }
            ]
        }
    }
}