# Blender MTL File: 'moon.blend'
# Material Count: 3

newmtl Material.001
Ns 323.999994
Ka 1.000000 1.000000 1.000000
Kd 0.013514 0.000000 0.673848
Ks 0.500000 0.500000 0.500000
Ke 0.000000 0.000000 0.000000
Ni 1.000000
d 1.000000
illum 2

newmtl Material.002
Ns 323.999994
Ka 1.000000 1.000000 1.000000
Kd 0.291517 0.000000 0.723043
Ks 0.500000 0.500000 0.500000
Ke 0.000000 0.000000 0.000000
Ni 1.000000
d 1.000000
illum 2

newmtl Material.003
Ns 225.000000
Ka 1.000000 1.000000 1.000000
Kd 0.000000 0.860330 1.000000
Ks 0.500000 0.500000 0.500000
Ke 0.000000 0.000000 0.000000
Ni 1.450000
d 1.000000
illum 2
