<svg width="11692" height="19525" viewBox="0 0 11692 19525" fill="none" xmlns="http://www.w3.org/2000/svg">
<style>
        @keyframes float {
        0% {
            transform: translateY(0);
        }
        50% {
            transform: translateY(200px);
        }
        100%{
            transform: translateY(0);
        }
    }

    #all{
        animation: float infinite ease-in-out 12s;
        transform-origin: center center;
    }
</style>
<g id="all">
<path d="M4030.16 6973.78C3843.86 6605.34 3186.94 6309.46 2506.8 6072.97C2296.34 6112.55 2295.88 6257.19 2012.95 6579.45C1730.02 6901.72 1633.38 7612.22 1789.95 8151.18C1946.51 8690.15 2970.45 9072.3 3156.75 9111.88C3343.04 9151.47 4030.16 8848.49 4427.38 8315.61C4824.59 7782.74 4216.46 7342.23 4030.16 6973.78Z" fill="#1D04BF" fill-opacity="0.05"/>
</g>
<path d="M3665.46 1668.37C3822.49 2182.47 2985.78 3704.97 1086.57 3172.09C906.468 3241.79 473.044 3289.83 180.171 2924.43C-185.919 2467.68 40.7969 2143.9 546.262 830.485C1051.73 -482.927 1312.82 126.074 2219.22 240.261C3125.62 354.449 3508.43 1154.27 3665.46 1668.37Z" fill="#1D04BF" fill-opacity="0.05"/>
<path d="M5826.23 6973.78C5268.73 4494.13 6401.39 4846.85 7324.97 3172.09C7388.78 3140.29 7603.54 2989.09 7952.16 2638.71C8387.94 2200.74 9259.03 2220.02 10740.1 3076.68C12221.2 3933.34 11594 5817.69 11350.1 7569.08C11106.2 9320.46 9834.18 10195.9 7847.63 10462.3C5861.08 10728.8 6383.73 9453.43 5826.23 6973.78Z" fill="#1D04BF" fill-opacity="0.05"/>
<path d="M5355.61 11433.2C3630.62 10386.2 4427.38 12042.2 1469.85 15411.5C1086.42 15919.2 521.732 17258.1 1330.48 18552.4C2341.41 20170.3 4170.93 19428.4 5947.95 18762C7724.98 18095.7 8143.57 16115.9 8405.13 14593.4C8666.69 13070.9 7080.6 12480.2 5355.61 11433.2Z" fill="#1D04BF" fill-opacity="0.05"/>

</svg>
