

<svg width="974" height="758" viewBox="0 0 974 758" fill="none" xmlns="http://www.w3.org/2000/svg">
<style>
    @keyframes float {
        0% {
            transform: translateY(0);
        }
        50% {
            transform: translateY(50px);
        }
        100%{
            transform: translateY(0);
        }
    }

    #Circles{
        animation: float infinite ease-in-out 12s;
        transform-origin: center center;
        transform-box: fill-box;
    }
    #Squares{
        animation: float infinite ease-in-out 10s;
        transform-origin: center center;
        transform-box: fill-box;
    }
    #Triangles{
        animation: float infinite ease-in-out 14s;
        transform-origin: center center; 
        transform-box: fill-box;
    }
</style>
<g id="undraw_creative_experiment_8dk3 1" clip-path="url(#clip0)">
<path id="Vector" d="M512 27H264V299H512V27Z" fill="#F2F2F2"/>
<path id="Vector_2" d="M537 1H289V273H537V1Z" stroke="#3F3D56" stroke-width="2" stroke-miterlimit="10"/>
<path id="Vector_3" d="M315.371 242.314H302V255.686H315.371V242.314Z" fill="#1D04BF"/>
<path id="Vector_4" d="M334.686 242.314H321.314V255.686H334.686V242.314Z" fill="#3F3D56"/>
<path id="Vector_5" d="M354 242.314H340.629V255.686H354V242.314Z" fill="#575A89"/>
<path id="Vector_6" d="M504 248.122H452V250.23H504V248.122Z" fill="#3F3D56"/>
<path id="Vector_7" d="M504 254.446H452V256.554H504V254.446Z" fill="#3F3D56"/>
<path id="Vector_8" d="M504 260.77H452V262.878H504V260.77Z" fill="#3F3D56"/>
<path id="Vector_9" d="M413 49V71C426.054 71 438.814 74.8708 449.668 82.123C460.521 89.3752 468.981 99.683 473.976 111.743C478.971 123.803 480.279 137.073 477.732 149.876C475.185 162.679 468.899 174.439 459.669 183.669L475.225 199.225C487.532 186.918 495.914 171.238 499.309 154.168C502.705 137.098 500.962 119.404 494.301 103.324C487.641 87.244 476.362 73.5002 461.89 63.8307C447.419 54.1611 430.405 49 413 49V49Z" fill="#3F3D56"/>
<path id="Vector_10" d="M475.225 199.225L459.669 183.669C448.385 194.955 433.393 201.769 417.47 202.849C401.548 203.928 385.773 199.2 373.069 189.541L359.753 207.061C376.695 219.938 397.728 226.239 418.959 224.798C440.189 223.357 460.179 214.272 475.225 199.225V199.225Z" fill="#575A89"/>
<path id="Vector_11" d="M347 137C347 119.496 353.954 102.708 366.331 90.331C378.708 77.9536 395.496 71 413 71V49C394.578 48.9998 376.621 54.7809 361.659 65.5285C346.697 76.276 335.486 91.448 329.605 108.906C323.724 126.364 323.47 145.227 328.879 162.837C334.287 180.447 345.086 195.915 359.753 207.061L373.069 189.541C364.961 183.391 358.388 175.447 353.865 166.331C349.343 157.216 346.993 147.176 347 137V137Z" fill="#1D04BF"/>
<path id="Vector_12" d="M578.122 576.9C571.54 576.9 565.022 575.604 558.941 573.085C552.86 570.566 547.335 566.874 542.68 562.22C538.026 557.566 534.334 552.04 531.815 545.959C529.296 539.878 528 533.36 528 526.778V468.4C528 351.592 622.692 256.9 739.5 256.9H739.5C856.308 256.9 951 351.592 951 468.4V514.294C951 522.516 949.381 530.657 946.234 538.253C943.088 545.848 938.477 552.75 932.663 558.563C926.85 564.377 919.948 568.989 912.352 572.135C904.756 575.281 896.615 576.9 888.394 576.9" fill="#F2F2F2"/>
<path id="Vector_13" d="M909.394 639.9V637.9C925.727 637.882 941.386 631.385 952.935 619.836C964.485 608.286 970.981 592.627 971 576.294V456.4C971 340.33 876.57 245.9 760.5 245.9C644.43 245.9 550 340.33 550 456.4V588.778C550.015 601.802 555.195 614.288 564.404 623.497C573.613 632.706 586.099 637.886 599.122 637.9V639.9C585.568 639.885 572.574 634.494 562.99 624.91C553.406 615.326 548.015 602.332 548 588.778V456.4C548 339.228 643.327 243.9 760.5 243.9C877.673 243.9 973 339.228 973 456.4V576.294C972.981 593.158 966.273 609.325 954.349 621.249C942.425 633.174 926.257 639.881 909.394 639.9V639.9Z" fill="#3F3D56"/>
<path id="Vector_14" d="M974 562.9H547V738.9H974V562.9Z" fill="#3F3D56"/>
<g id="Squares">
<path id="Vector_15" d="M825.751 381.995L784.999 410.966L813.97 451.717L854.722 422.746L825.751 381.995Z" fill="#1D04BF"/>
<path id="Vector_16" d="M829.03 371.075L788.279 400.046L817.25 440.797L858.001 411.826L829.03 371.075Z" stroke="#3F3D56" stroke-width="2" stroke-miterlimit="10"/>
</g>
<g id="Circles">
<path id="Vector_17" d="M750 362.9C761.598 362.9 771 353.498 771 341.9C771 330.302 761.598 320.9 750 320.9C738.402 320.9 729 330.302 729 341.9C729 353.498 738.402 362.9 750 362.9Z" fill="#1D04BF"/>
<path id="Vector_18" d="M744 359.9C755.598 359.9 765 350.498 765 338.9C765 327.302 755.598 317.9 744 317.9C732.402 317.9 723 327.302 723 338.9C723 350.498 732.402 359.9 744 359.9Z" stroke="#3F3D56" stroke-width="2" stroke-miterlimit="10"/>
</g>
<g id="Triangles">
<path id="Vector_19" d="M687.934 425.82L713.068 440.287L738.201 454.754L713.105 469.287L688.01 483.82L687.972 454.82L687.934 425.82Z" fill="#1D04BF"/>
<path id="Vector_20" d="M683.895 436.803L709.028 451.271L734.162 465.738L709.066 480.271L683.97 494.803L683.932 465.803L683.895 436.803Z" stroke="#3F3D56" stroke-width="2" stroke-miterlimit="10"/>
</g>
<path id="Vector_21" d="M585.435 378.724C589.246 365.109 596.286 352.616 605.959 342.305C615.631 331.994 627.649 324.169 640.993 319.497C644.623 318.249 643.063 312.451 639.398 313.711C625.063 318.681 612.143 327.044 601.74 338.086C591.336 349.129 583.757 362.524 579.649 377.129C578.62 380.856 584.407 382.447 585.435 378.724V378.724Z" fill="white"/>
<path id="Vector_22" d="M574.055 411.491C577.916 411.491 577.922 405.491 574.055 405.491C570.194 405.491 570.188 411.491 574.055 411.491Z" fill="white"/>
<path id="Vector_23" d="M324.852 349.53L231.442 319.89L195.148 434.27L288.558 463.91L324.852 349.53Z" fill="#F2F2F2"/>
<path id="Vector_24" d="M281.816 357.796L245.139 346.158L244.495 348.187L281.172 359.825L281.816 357.796Z" fill="#3F3D56"/>
<path id="Vector_25" d="M297.327 366.841L243.95 349.904L243.306 351.933L296.684 368.87L297.327 366.841Z" fill="#3F3D56"/>
<path id="Vector_26" d="M277.755 370.594L241.078 358.956L240.434 360.985L277.111 372.623L277.755 370.594Z" fill="#3F3D56"/>
<path id="Vector_27" d="M273.001 385.577L236.323 373.939L235.68 375.968L272.357 387.606L273.001 385.577Z" fill="#3F3D56"/>
<path id="Vector_28" d="M293.266 379.639L239.889 362.702L239.245 364.731L292.623 381.668L293.266 379.639Z" fill="#3F3D56"/>
<path id="Vector_29" d="M292.078 383.385L238.701 366.448L238.057 368.477L291.434 385.414L292.078 383.385Z" fill="#3F3D56"/>
<path id="Vector_30" d="M290.889 387.13L237.512 370.193L236.868 372.222L290.245 389.159L290.889 387.13Z" fill="#3F3D56"/>
<path id="Vector_31" d="M252.648 389.083L233.451 382.991L231.767 388.298L250.964 394.389L252.648 389.083Z" fill="#1D04BF"/>
<path id="Vector_32" d="M131 757.15C203.349 757.15 262 749.539 262 740.15C262 730.761 203.349 723.15 131 723.15C58.6507 723.15 0 730.761 0 740.15C0 749.539 58.6507 757.15 131 757.15Z" fill="#3F3D56"/>
<path id="Vector_33" d="M69.1231 269.526L64.7716 279.861L69.6671 346.766C69.6671 346.766 66.9474 350.573 69.6671 353.293C72.3868 356.013 71.8428 357.101 71.8428 357.101C71.8428 357.101 67.4913 357.101 69.6671 360.364C71.8428 363.628 71.8428 365.26 71.8428 365.26L70.7549 368.523C70.7549 368.523 72.9307 371.243 72.9307 373.419C72.9307 375.595 87.0732 442.499 87.0732 442.499L100.672 415.846L93.0565 309.778L69.1231 269.526Z" fill="#1D04BF"/>
<path id="Vector_34" d="M208.758 439.662C208.758 439.662 238.457 438.463 247.926 448.939C257.395 459.415 210.724 451.836 208.084 448.885C205.445 445.933 208.758 439.662 208.758 439.662Z" fill="#FFB9B9"/>
<path id="Vector_35" d="M62.0519 703.591L56.0686 723.172C56.0686 723.172 47.3656 742.21 59.3322 744.93C71.2989 747.65 82.7217 737.315 82.7217 737.315V724.26L87.0732 703.591H62.0519Z" fill="#2F2E41"/>
<path id="Vector_36" d="M159.961 703.591C159.961 703.591 157.241 740.578 163.225 742.754C169.208 744.93 190.422 745.474 190.966 742.754C191.51 740.035 198.037 737.315 193.142 733.507C188.246 729.7 184.982 707.398 184.982 707.398L159.961 703.591Z" fill="#2F2E41"/>
<path id="Vector_37" d="M105.023 353.293V369.611C105.023 369.611 87.0732 407.143 80.5459 466.433C74.0186 525.722 51.7171 706.31 57.1565 709.574C62.5959 712.838 121.341 715.013 122.973 710.662C124.605 706.31 126.237 579.028 126.237 579.028L146.363 489.278C146.363 489.278 150.17 521.371 153.434 526.81C156.698 532.249 147.994 709.03 153.434 711.75C158.873 714.469 232.305 719.365 231.217 710.662C230.129 701.959 205.652 465.889 205.652 465.889C205.652 465.889 193.142 354.381 189.334 353.293C185.527 352.205 150.714 351.117 145.275 352.205C139.835 353.293 105.023 353.293 105.023 353.293Z" fill="#2F2E41"/>
<path id="Vector_38" d="M146.363 218.396C163.486 218.396 177.367 204.515 177.367 187.391C177.367 170.268 163.486 156.387 146.363 156.387C129.239 156.387 115.358 170.268 115.358 187.391C115.358 204.515 129.239 218.396 146.363 218.396Z" fill="#FFB9B9"/>
<path id="Vector_39" d="M152.89 213.5C152.89 213.5 137.116 237.978 140.923 244.505C144.731 251.032 100.672 237.978 100.672 237.978C100.672 237.978 127.325 205.341 126.781 201.534C126.237 197.726 152.89 213.5 152.89 213.5Z" fill="#FFB9B9"/>
<path id="Vector_40" d="M185.526 249.944C185.526 249.944 156.698 240.697 152.89 236.89C150.447 234.395 148.261 231.661 146.363 228.731C146.363 228.731 111.55 223.835 110.463 223.835C109.375 223.835 101.216 233.626 99.0399 235.802C96.8642 237.978 69.1232 252.664 69.1232 256.472C69.1232 260.279 64.7717 279.861 64.7717 279.861C64.7717 279.861 74.5626 299.987 80.5459 304.338C86.5293 308.69 88.1611 307.602 88.705 314.673C89.249 321.744 96.8642 333.167 96.8642 333.167C96.8642 333.167 101.76 345.678 100.672 349.485C99.5838 353.293 94.6884 356.557 106.111 355.469C117.534 354.381 174.104 357.645 174.104 351.661C174.104 345.678 163.225 288.564 163.225 288.564L185.526 249.944Z" fill="#1D04BF"/>
<path id="Vector_41" d="M175.191 251.032L185.526 249.944C185.526 249.944 189.334 252.12 189.878 273.334C190.422 294.547 190.422 345.678 194.229 350.029C198.037 354.381 213.811 421.829 213.811 421.829C213.811 421.829 218.163 422.917 218.163 426.725C218.163 430.532 223.058 433.796 220.882 438.148C218.707 442.499 223.058 441.411 220.339 444.131C217.619 446.851 204.564 452.29 204.02 449.026C203.476 445.763 205.652 445.219 203.476 444.131C201.301 443.043 201.301 442.499 200.757 438.692C200.213 434.884 195.317 431.076 195.861 429.445C196.405 427.813 171.928 380.49 171.928 378.858C171.928 377.226 170.296 371.243 168.12 370.155C165.945 369.067 162.681 367.979 164.313 365.26C165.945 362.54 159.961 280.949 159.961 280.949L175.191 251.032Z" fill="#1D04BF"/>
<path id="Vector_42" d="M172.581 167.729C163.074 157.408 148.143 151.93 134.451 155C120.758 158.07 109.228 170.226 108.158 184.218C107.939 187.08 108.121 190.003 107.38 192.776C106.135 197.441 102.428 201.138 101.122 205.786C100.247 208.898 100.506 212.25 99.5784 215.348C97.8645 221.072 92.5595 224.804 88.5162 229.203C86.8788 230.815 85.6628 232.805 84.9751 234.998C84.6196 236.942 84.5294 238.926 84.7072 240.894C84.8776 251.506 80.9326 261.77 73.6996 269.536C77.9526 266.377 82.5474 263.705 87.3975 261.573C84.9935 269.228 87.1913 278.286 93.2401 283.559C99.2889 288.831 108.977 289.65 115.517 285.001C119.403 282.24 121.926 278.001 124.336 273.888L133.462 258.317C135.113 255.501 136.836 252.603 139.474 250.679C141.57 249.15 144.116 248.337 146.226 246.827C151.548 243.019 152.977 235.566 151.986 229.097C150.995 222.628 148.086 216.622 146.418 210.294C145.098 205.289 144.684 199.553 147.653 195.313C151.593 189.685 159.692 188.967 165.046 184.662C167.062 183.041 167.963 181.069 169.407 179.04C170.74 177.167 171.079 177.838 173.145 177.753C178.816 177.517 174.683 170.01 172.581 167.729Z" fill="#2F2E41"/>
<path id="Vector_43" d="M145.5 204.15C146.881 204.15 148 201.464 148 198.15C148 194.837 146.881 192.15 145.5 192.15C144.119 192.15 143 194.837 143 198.15C143 201.464 144.119 204.15 145.5 204.15Z" fill="#FFB9B9"/>
<path id="Vector_44" d="M421 630.9C438.673 630.9 453 616.574 453 598.9C453 581.227 438.673 566.9 421 566.9C403.327 566.9 389 581.227 389 598.9C389 616.574 403.327 630.9 421 630.9Z" fill="#F2F2F2"/>
<path id="Vector_45" d="M101 80.9004C118.673 80.9004 133 66.5735 133 48.9004C133 31.2273 118.673 16.9004 101 16.9004C83.3269 16.9004 69 31.2273 69 48.9004C69 66.5735 83.3269 80.9004 101 80.9004Z" fill="#F2F2F2"/>
<path id="Vector_46" d="M771 155.9C788.673 155.9 803 141.574 803 123.9C803 106.227 788.673 91.9004 771 91.9004C753.327 91.9004 739 106.227 739 123.9C739 141.574 753.327 155.9 771 155.9Z" fill="#F2F2F2"/>
</g>
<defs>
<clipPath id="clip0">
<rect width="974" height="757.15" fill="white"/>
</clipPath>
</defs>
</svg>
