<?xml version="1.0" encoding="UTF-8" standalone="no"?>
<svg
   xmlns:dc="http://purl.org/dc/elements/1.1/"
   xmlns:cc="http://creativecommons.org/ns#"
   xmlns:rdf="http://www.w3.org/1999/02/22-rdf-syntax-ns#"
   xmlns:svg="http://www.w3.org/2000/svg"
   xmlns="http://www.w3.org/2000/svg"
   xmlns:sodipodi="http://sodipodi.sourceforge.net/DTD/sodipodi-0.dtd"
   xmlns:inkscape="http://www.inkscape.org/namespaces/inkscape"
   width="131.16748"
   height="173.03305"
   version="1.1"
   id="svg329"
   sodipodi:docname="leaf.svg"
   inkscape:version="1.0.2 (394de47547, 2021-03-26)">
  <metadata
     id="metadata333">
    <rdf:RDF>
      <cc:Work
         rdf:about="">
        <dc:format>image/svg+xml</dc:format>
        <dc:type
           rdf:resource="http://purl.org/dc/dcmitype/StillImage" />
        <dc:title>Activities</dc:title>
      </cc:Work>
    </rdf:RDF>
  </metadata>
  <sodipodi:namedview
     pagecolor="#ffffff"
     bordercolor="#666666"
     borderopacity="1"
     objecttolerance="10"
     gridtolerance="10"
     guidetolerance="10"
     inkscape:pageopacity="0"
     inkscape:pageshadow="2"
     inkscape:window-width="1920"
     inkscape:window-height="1016"
     id="namedview331"
     showgrid="false"
     inkscape:zoom="1.052954"
     inkscape:cx="65.583738"
     inkscape:cy="86.516545"
     inkscape:window-x="1920"
     inkscape:window-y="27"
     inkscape:window-maximized="1"
     inkscape:current-layer="svg329" />
  <defs
     id="defs319">
    <style
       id="style315">.cls-1, .cls-13 {
        fill: none;
      }

      .cls-2 {
        fill: #ff4779;
      }

      .cls-3 {
        fill: #ffd0e0;
      }

      .cls-4 {
        fill: #50da77;
      }

      .cls-5 {
        fill: #e3fb73;
      }

      .cls-6 {
        fill: #4dafff;
      }

      .cls-7 {
        fill: #86c3ff;
      }

      .cls-8 {
        fill: #e4f669;
      }

      .cls-9 {
        fill: #ffd861;
      }

      .cls-10 {
        fill: #fff;
      }

      .cls-11 {
        clip-path: url(#clip-path);
      }

      .cls-12 {
        fill: #fcc636;
      }

      .cls-13 {
        stroke: #fe5a50;
        stroke-miterlimit: 10;
        stroke-width: 12px;
      }

      .cls-14 {
        fill: #fe5a51;
      }</style>
    <clipPath
       transform="translate(-624.8 -219.04)"
       id="clip-path">
      <rect
         id="svg_1"
         transform="rotate(47.5,670.14,-810)"
         height="164.78"
         width="174.02"
         y="-535.89001"
         x="1838.63"
         class="cls-1" />
    </clipPath>
  </defs>
  <title
     id="title321">Activities</title>
  <g
     id="g327"
     transform="translate(-315.47125,-305.23846)">
    <title
       id="title323">Layer 1</title>
    <g
       id="Déco">
      <path
         id="svg_10"
         d="m 376.79108,305.23846 h 23 l -6,38 c 0,0 31,-7 45,13 14,20 5,58 5,58 0,0 -3,-26 -28,-21 -25,5 -18,29 -14,35 4,6 29,8 29,8 0,0 -20,25 -49,34 -29,9 -46,8 -46,8 a 87.68,87.68 0 0 0 0,-26 c -4.05,-26.62 -18.05,-32.91 -20,-57 -0.54,-6.71 -1.57,-22.19 8.34,-35.27 8,-10.53 19.05,-14.25 23.66,-15.73 16.42,-5.26 30.7,-0.92 36,1 z"
         class="cls-8" />
    </g>
  </g>
</svg>
