<?xml version="1.0" encoding="UTF-8" standalone="no"?>
<svg
   xmlns:dc="http://purl.org/dc/elements/1.1/"
   xmlns:cc="http://creativecommons.org/ns#"
   xmlns:rdf="http://www.w3.org/1999/02/22-rdf-syntax-ns#"
   xmlns:svg="http://www.w3.org/2000/svg"
   xmlns="http://www.w3.org/2000/svg"
   xmlns:sodipodi="http://sodipodi.sourceforge.net/DTD/sodipodi-0.dtd"
   xmlns:inkscape="http://www.inkscape.org/namespaces/inkscape"
   width="106"
   height="183.98393"
   version="1.1"
   id="svg3299"
   sodipodi:docname="fish.svg"
   inkscape:version="1.0.2 (394de47547, 2021-03-26)">
  <metadata
     id="metadata3303">
    <rdf:RDF>
      <cc:Work
         rdf:about="">
        <dc:format>image/svg+xml</dc:format>
        <dc:type
           rdf:resource="http://purl.org/dc/dcmitype/StillImage" />
        <dc:title>Activities</dc:title>
      </cc:Work>
    </rdf:RDF>
  </metadata>
  <sodipodi:namedview
     pagecolor="#ffffff"
     bordercolor="#666666"
     borderopacity="1"
     objecttolerance="10"
     gridtolerance="10"
     guidetolerance="10"
     inkscape:pageopacity="0"
     inkscape:pageshadow="2"
     inkscape:window-width="1920"
     inkscape:window-height="1080"
     id="namedview3301"
     showgrid="false"
     inkscape:zoom="1.1346377"
     inkscape:cx="52.999993"
     inkscape:cy="91.991987"
     inkscape:window-x="0"
     inkscape:window-y="0"
     inkscape:window-maximized="1"
     inkscape:current-layer="svg3299" />
  <defs
     id="defs3288">
    <style
       id="style3284">.cls-1, .cls-13 {
        fill: none;
      }

      .cls-2 {
        fill: #ff4779;
      }

      .cls-3 {
        fill: #ffd0e0;
      }

      .cls-4 {
        fill: #50da77;
      }

      .cls-5 {
        fill: #e3fb73;
      }

      .cls-6 {
        fill: #4dafff;
      }

      .cls-7 {
        fill: #86c3ff;
      }

      .cls-8 {
        fill: #e4f669;
      }

      .cls-9 {
        fill: #ffd861;
      }

      .cls-10 {
        fill: #fff;
      }

      .cls-11 {
        clip-path: url(#clip-path);
      }

      .cls-12 {
        fill: #fcc636;
      }

      .cls-13 {
        stroke: #fe5a50;
        stroke-miterlimit: 10;
        stroke-width: 12px;
      }

      .cls-14 {
        fill: #fe5a51;
      }</style>
    <clipPath
       transform="translate(-624.8 -219.04)"
       id="clip-path">
      <rect
         id="svg_1"
         transform="rotate(47.5,670.14,-810)"
         height="164.78"
         width="174.02"
         y="-535.89001"
         x="1838.63"
         class="cls-1" />
    </clipPath>
  </defs>
  <title
     id="title3290">Activities</title>
  <g
     id="g3297"
     transform="translate(-328.055,-299.76302)">
    <title
       id="title3292">Layer 1</title>
    <g
       id="svg_20">
      <path
         id="svg_8"
         d="m 380.555,361.24695 c 0,0 -52.5,-42.5 -52.5,0 0,42.5 27.5,85 27.5,85 l 62.5,-7.5 c 0,0 25,-32.5 12.5,-77.5 -12.5,-45 -50,0 -50,0 z"
         class="cls-6" />
      <path
         id="svg_9"
         d="m 383.055,306.24695 c 0,0 -32.5,-17.5 -32.5,5 a 38.4,38.4 0 0 0 17.5,32.5 c 0,0 -42.5,27.5 -35,77.5 7.5,50 37.5,62.5 45,62.5 7.5,0 55,-5 52.5,-67.5 -2.5,-62.5 -37.5,-70 -37.5,-70 0,0 25,-20 20,-35 -5,-15 -30,-5 -30,-5 z"
         class="cls-7" />
    </g>
  </g>
</svg>
